
##TITLE=AC1366_2140_7184965_qDGOeVsAB1
##JCAMPDX= 6.0         $$ Bruker NMR JCAMP-DX V2.0
##DATA TYPE= NMR SPECTRUM
##DATA CLASS= NTUPLES
##ORIGIN= BRUKER
##OWNER= Administrator
$$ 1.72 TOPSPIN		Version 2.1
$$ 2012-12-07 17:27:25.953 -0500  Administrator@X
$$ Compression mode = diff/dup
##.OBSERVE FREQUENCY= 400.02188249412
##.OBSERVE NUCLEUS= ^1H
##.ACQUISITION MODE= SIMULTANEOUS (DQD)
##.ACQUISITION SCHEME= undefined
##.AVERAGES= 8
##.DIGITISER RES= 22
##SPECTROMETER/DATA SYSTEM= spect
##.PULSE SEQUENCE= zg30
##.SOLVENT NAME= COFFEE_meoh
##.SHIFT REFERENCE= INTERNAL, COFFEE_meoh, 1, 14.98509
##AUDIT TRAIL= $$ (NUMBER, WHEN, WHO, WHERE, PROCESS, VERSION, WHAT)
$$ ##TITLE= Audit trail, TOPSPIN		Version 2.1
$$ ##JCAMPDX= 5.01
$$ ##ORIGIN= Bruker BioSpin GmbH
$$ ##OWNER= Administrator
$$ $$ E:\/data/COFFEE/nmr/AC1366_2140_7184965_qDGOeVsAB1/20/pdata/1/auditp.txt
$$ ##AUDIT TRAIL=  $$ (NUMBER, WHEN, WHO, WHERE, PROCESS, VERSION, WHAT)
(   1,<2012-12-07 17:27:20.804 -0500>,<Administrator>,<X>,<go>,<TOPSPIN 2.1>,
      <created by zg
	started at 2012-12-07 17:26:17.462 -0500,
	POWCHK enabled, PULCHK disabled,
       configuration hash MD5:
       86 BA 57 50 F2 9D 5C 9B 26 00 A9 28 5F 66 2E 89
       data hash MD5: 64K
       2F AD E6 DB D0 1B 9D 7F 70 9E 2C 08 0D FE F8 C5>)
(   2,<2012-12-07 17:27:22.782 -0500>,<Administrator>,<X>,<proc1d>,<TOPSPIN 2.1>,
      <Start of raw data processing
       efp LB = 0 FT_mod = 6 PKNL = 1 PHC0 = 0 PHC1 = 0 SI = 32K 
       data hash MD5: 32K
       EB 9F 71 E0 58 1A FC 3B 2F 1F 33 F3 EE 0E C2 75>)
(   3,<2012-12-07 17:27:23.081 -0500>,<Administrator>,<X>,<proc1d>,<TOPSPIN 2.1>,
      <pk PHC0 = 95.00977 PHC1 = 0 
       data hash MD5: 32K
       80 80 0A 6A AB 2B A2 C3 99 6D 9A 5C B6 95 11 09>)
(   4,<2012-12-07 17:27:23.240 -0500>,<Administrator>,<X>,<proc1d>,<TOPSPIN 2.1>,
      <abs ABSG = 1 
       data hash MD5: 32K
       26 FB E4 E0 23 3A 75 08 63 7B 46 02 08 9B D9 B8>)
(   5,<2012-12-07 17:27:23.329 -0500>,<Administrator>,<X>,<proc1d>,<TOPSPIN 2.1>,
      <abs ABSG = 2 
       data hash MD5: 32K
       2E 8A 72 29 16 AA E2 6C DA 93 93 11 25 30 D2 8B>)
(   6,<2012-12-07 17:27:23.419 -0500>,<Administrator>,<X>,<proc1d>,<TOPSPIN 2.1>,
      <abs ABSG = 3 
       data hash MD5: 32K
       5F 97 1A 75 BB 12 2D DF 6F 72 37 F6 0B 94 BF AE>)
(   7,<2012-12-07 17:27:23.518 -0500>,<Administrator>,<X>,<proc1d>,<TOPSPIN 2.1>,
      <abs ABSG = 4 
       data hash MD5: 32K
       2E CA 38 F6 29 BA 7B 3B 24 A4 22 EA 36 FC 53 87>)
(   8,<2012-12-07 17:27:23.597 -0500>,<Administrator>,<X>,<proc1d>,<TOPSPIN 2.1>,
      <abs ABSG = 5 
       data hash MD5: 32K
       40 4E 7D 52 D4 77 6B 51 99 61 01 29 B4 27 1E E8>)
$$ ##END=
$$ 
$$ $$ hash MD5
$$ $$ B3 6A ED B1 69 77 22 E2 50 97 BB 8E 56 E2 36 C1
##$RELAX= 
##$RELAX= 
##$RELAX= 
##$RELAX= 
##$RELAX= 
##$RELAX= 
##$RELAX= 
$$ Bruker specific parameters
$$ --------------------------
##$DU= <E:\>
##$EXPNO= 20
##$NAME= <AC1366_2140_7184965_qDGOeVsAB1>
##$PROCNO= 1
$$ [...]
150 150 150 150 150 150 150 150
##$TP07= 0
##$TPNAME0= <>
##$TPNAME1= <>
##$TPNAME2= <>
##$TPNAME3= <>
##$TPNAME4= <>
##$TPNAME5= <>
##$TPNAME6= <>
##$TPNAME7= <>
##$TPOAL= (0..7)
0.5 0.5 0.5 0.5 0.5 0.5 0.5 0.5
##$TPOFFS= (0..7)
0 0 0 0 0 0 0 0
##$TUNHIN= 0
##$TUNHOUT= 0
##$TUNXOUT= 0
##$USERA1= <user>
##$USERA2= <user>
##$USERA3= <user>
##$USERA4= <user>
##$USERA5= <user>
##$V9= 5
##$VALIST= <valist>
##$VCLIST= <CCCCCCCCCCCCCCC>
##$VD= 0
##$VDLIST= <DDDDDDDDDDDDDDD>
##$VPLIST= <PPPPPPPPPPPPPPP>
##$VTLIST= <TTTTTTTTTTTTTTT>
##$WBST= 1024
##$WBSW= 4
##$XGAIN= (0..3)
0 0 0 0
##$XL= 0
##$YL= 0
##$YMAX_a= 662366
##$YMIN_a= -563130
##$ZGOPTNS= <>
##$ZL1= 120
##$ZL2= 120
##$ZL3= 120
##$ZL4= 120
##$ABSF1= 14.98509
##$ABSF2= -5.573092
##$ABSG= 5
##$ABSL= 3
##$ALPHA= 0
##$AQORDER= 0
##$ASSFAC= 0
##$ASSFACI= 0
##$ASSFACX= 0
##$ASSWID= 0
##$AUNMP= <proc_prof1d_extract_pilot.lims>
##$AXLEFT= 0
##$AXNAME= <>
##$AXNUC= <1H>
##$AXRIGHT= 0
##$AXTYPE= 0
##$AXUNIT= <>
##$AZFE= 0.1
##$AZFW= 0.1
##$BCFW= 0
##$BC_mod= 0
##$BYTORDP= 0
##$COROFFS= 0
##$CY= 15
##$DATMOD= 1
##$DC= 0
##$DFILT= <>
##$DTYPP= 0
##$F1P= 0
##$F2P= 0
##$FCOR= 0.5
##$FTSIZE= 32768
##$FT_mod= 6
##$GAMMA= 0
##$GB= 0
##$INTBC= 1
##$INTSCL= 1
##$ISEN= 128
##$LB= 0
##$LEV0= 0
##$LPBIN= 0
##$MAXI= 10000
##$MC2= 0
##$MEAN= 0
##$ME_mod= 0
##$MI= 0
##$NCOEF= 0
##$NC_proc= -8
##$NLEV= 6
##$NOISF1= 0
##$NOISF2= 0
##$NSP= 0
##$NTH_PI= 0
##$NZP= 0
##$OFFSET= 14.98509
##$PC= 1
##$PHC0= 95.00977
##$PHC1= 0
##$PH_mod= 1
##$PKNL= yes
##$PPARMOD= 0
##$PPDIAG= 0
##$PPIPTYP= 0
##$PPMPNUM= 2147483647
##$PPRESOL= 1
##$PSCAL= 4
##$PSIGN= 0
##$PYNMP= <proc.py>
##$REVERSE= no
##$SF= 400.02
##$SI= 32768
##$SIGF1= 0
##$SIGF2= 0
##$SINO= 400
##$SIOLD= 32768
##$SPECTYP= <>
##$SREGLST= <1H.CDCl3>
##$SSB= 0
##$STSI= 32768
##$STSR= 0
##$SW_p= 8223.68421052631
##$SYMM= 0
##$S_DEV= 0
##$TDeff= 65536
##$TDoff= 0
##$TI= <>
##$TILT= no
##$TM1= 0
##$TM2= 0
##$TOPLEV= 0
##$USERP1= <user>
##$USERP2= <user>
##$USERP3= <user>
##$USERP4= <user>
##$USERP5= <user>
##$WDW= 1
##$XDIM= 32768
##$YMAX_p= 473236326
##$YMIN_p= -972858
##$CURPLOT= <Network HP LaserJet P1505>
##$CURPRIN= <$Network HP LaserJet P1505>
##$DFORMAT= <normdp>
##$LAYOUT= <+/1D_H.xwp>
##$LFORMAT= <normlp>
##$PFORMAT= <normpl>
##$SURQMSG= 1
$$ End of Bruker specific parameters
$$ ---------------------------------
##NTUPLES= NMR SPECTRUM
##VAR_NAME=  FREQUENCY,     SPECTRUM/REAL,   SPECTRUM/IMAG
##SYMBOL=    X,             R,               I
##VAR_TYPE=  INDEPENDENT,   DEPENDENT,       DEPENDENT
##VAR_FORM=  AFFN,          ASDF,            ASDF
##VAR_DIM=   32768,         32768,           32768
##UNITS=     HZ,            ARBITRARY UNITS, ARBITRARY UNITS
##FACTOR=    0.250966925370066, 1,           1
##FIRST=     8223.43324360094, -152035,      -262262
##LAST=      0,             -93636,          -201839
##MIN=       0,             -972858,         0
##MAX=       8223.43324360094, 473236326,    0
$$ Real data points
##PAGE= N=1
##DATA TABLE= (X++(R..R)), XYDATA
$$ [...]
19536i7363G971a5447k25917d8703p9910k32915B30007b91563d3466n4962C57211
19524e60j20495j42295A08239b03346A39266c11351a27301M819G3876J3415B443
19512b46889A34375c56526B42633b45021A38899g4110D68445a45247L0972c9622
19501e3700k67335J35197c2048j25198A2817b17297c2034C80539f7051j92314
19491b59365g7722k47864A16606N8608a46214A95141K9324c66429H4090i2329
19480a5144G7289c95720A00578L7064b46015J2949i1684D3103E209R5003K2244
19469A22456a70748B5862a07808G8070A3841K580K15008b32591k23944A44643
19458h3548j36393g5973K5481A23420c03648C11275J3821a60595j42526J48818
$$ plain form
19536 -97363 7971 -15447 -241364 -48703 -128613 -361528 230007 -291563 -43466 -98428 357211
19524 -560 -121055 -263350 108239 -203346 139266 -311351 -127301 -122482 73876 87291 2443
19512 -246889 134375 -356526 242633 -245021 138899 -74110 468445 -145247 -114275 -39622
19501 -53700 -321035 -185838 -32048 -157246 12817 -217297 -32034 380539 -67051 -259365
19491 -259365 -77722 -325586 116606 175214 -146214 195141 224465 -366429 84090 -92329
19480 -15144 77289 -395720 100578 137642 -246015 -233066 -91684 43103 5209 100212 122456
19469 122456 -170748 25862 -107808 78070 13841 16421 231429 -232591 -456535 144643
19458 -83548 -219941 -75973 -50492 123420 -303648 311275 325096 -160595 -303121 -154303
19448a54303J0434A33313F2088b48654j81384G2946K39028I9242b42528e0531
19437i6782k25118R5105m15664a6102j35258j52685P5978A55968K32177d19688
19426a34316C3748J39343K6048b0466A19271N7202a18466E1412b26714R304A69493
19414B14700F5388N0849B4637J42863b1444C1465b45167Q6453L1443g970j11962
19403a19932A93722n3131h7040q2271d4456j2962A85125f13870A83023d0105E2553
19391B07270F6382c53060b17l5675r790q1195L186j42190C4894c2498B1392a49800
19378D9818b12737j4677O6999D42699d5955b0602j73599R0155M2936j11578A88300
19366c0619l91320a66603j00775d2672m41564b28394E3687b39165J16721C0556
$$ plain form
19448 -154303 -143869 133313 62088 -248654 -430038 72946 311974 99242 -242528 -50531
19437 -96782 -321900 -226795 -642459 -16102 -151360 -304045 -228067 155968 388145 -419688
19426 -134316 33748 173091 199139 -20466 119271 176473 -118466 51412 -226714 -217410 169493
19414 214700 65388 116237 24637 167500 -21444 31465 -245167 -158714 -127271 -7970 -119932
19403 -119932 193722 140591 -87040 -169311 -44456 -57418 185125 -613870 183023 -40105 52553
19391 207270 66382 -353060 -217 -35892 -45682 -126877 -123691 -265881 34894 -32498 21392 -149800
19378 49818 -212737 -227414 -160415 442699 -45955 -20602 -194201 -104046 -61110 -172688 188300
19366 -30619 -421939 -166603 -267378 -42672 -484236 -228394 53687 -239165 -122444 30556
19355c17318H0105N1048l915C6692e7863A22366A3523Q6876C708d48198C795b42938
19342c45279a47911c1169A44003h7216A61453k9715a589C39903a43832A6654c92202
19330a46000E4299a56533C03397b99946h2036A69823a10801b2509D785c72561
19319c23666a31203A59516h9511A35649K5631P5664e8060j74332C68926a27173
19308b50136m5411f6956J2508j39691R1798I9923a82099B38056d93250E9595b95564
19296a25139E6771i8941j6226k0608l0552M7963h779I1461a35108j12072P1546
19285a75634A69017b18175C3741Q017d33191N4625E6453b83429H500M41688B23719
19273F8157a85890E7171b20356F4634a73740P1360B71710E1058K8978a89504F6011
$$ plain form
19355 -317318 80105 131153 127238 36692 -57863 122366 13523 100399 3708 -448198 3795 -242938
19342 -345279 -147911 -31169 144003 -87216 161453 131738 -1589 339903 -143832 16654 -392202
19330 -146000 54299 -156533 303397 -299946 -82036 169823 -110801 -22509 4785 -372561
19319 -323666 -131203 159516 -89511 135649 161280 236944 -58060 -232392 368926 -127173
19308 -250136 -295547 -66956 -54448 -194139 -102341 99923 -182099 238056 -493250 59595 -295564
19296 -125139 56771 -98941 -115167 -135775 -166327 -118364 -8779 91461 -135108 -247180 -175634
19285 -175634 169017 -218175 33741 41758 -433191 -378566 56453 -283429 8500 450188 223719
19273 68157 -185890 57171 -220356 64634 -173740 -102380 271710 51058 80036 -189504 66011
19261d9389k55636C239c7924p8221G00a19414B42964a98037D9653b41074j62756
19250d03830H5454a62670B244b63516j2804m0793e272A39556P2476p1504D588
19238b28412f2069k68799g8720I0313N338b58522j3348J19990l4601k5741i2715
19226A71778J221f2056j5526A14218b43209B5349c14641F1748h199B82928a6712
19214b95534R6814n6139C53661C6770c29026N7116A00519a21696B4612J9714a57907
19202C34639a25960N287A60772J2789l3001a67336B0057a8762k50478a06719d314
19190a35131k73031C64317a12856C17556E6264L9924g9973K1420A42543a93916
19179c79470C6451a29235j6611C2540a64372B6147J02486K96003a83965D9357
$$ plain form
19261 -49389 -305025 3239 -37924 -116145 700 -119414 242964 -198037 49653 -241074 -403830
19250 -403830 85454 -162670 2244 -263516 -276320 -317113 -5272 139556 212032 140528 4588
19238 -228412 -62069 -330868 -78720 90313 95651 -258522 -271870 -151880 -186481 -212222 -92715
19226 171778 172999 -62056 -77582 114218 -243209 25349 -314641 61748 -8199 282928 -16712
19214 -295534 -198720 -254859 353661 36770 -329026 -271910 100519 -121696 24612 44326 -157907
19202 334639 -125960 -120673 160772 173561 140560 -167336 20057 -18762 -269240 -106719 -4314
19190 -135131 -408162 364317 -112856 317556 56264 96188 -79973 -58553 142543 -193916
19179 -379470 36451 -129235 -145846 32540 -164372 26147 128633 424636 -183965 49357
19168g9230H4602B3715g6040j03689j32100a43904N9157J4025j11716N5328k25726
19157c52836J55955f022k89067J06324A52020a28336D4629J13953a65811N3843
19147a11968D1191L3763g0279A14008b47288A2719K87335a27107p9208C5011K99729
19136C34740c60045H6221g3529j22254A5869M4981d52016g9443o8566A04304a10329
19124d2746q0513j72419a20190j01158a07997k3897A31860B0844K80455A41803
19113b09528A67249b31866i336A51426a36508e8264g503j69793d7257k32375a02468
19101A77172b6558j11584j94902E4779a45670j4855O2605J3263J8987D6334c8735
19089i7730B26974a4043A50788a61883G5025k2889P1279k7773Q1466o3168b27695
$$ plain form
19168 -79230 84602 23715 -76040 -179729 -311829 -143904 -84747 -70722 -182438 -127110 -352836
19157 -352836 -196881 -6022 -295089 -188765 152020 -128336 44629 158582 -165811 -111968
19147 -111968 41191 74954 -70279 114008 -247288 12719 300054 -127107 -206315 35011 334740
19136 334740 -360045 86221 -73529 -195783 15869 60850 -452016 -79443 -148009 104304 -110329
19124 -42746 -123259 -295678 -120190 -221348 -107997 -131894 131860 20844 301299 141803
19113 -209528 167249 -231866 -9336 151426 -136508 -58264 -7503 -177296 -47257 -279632 -102468
19101 177172 -26558 -138142 -333044 54779 -145670 -160525 -97920 -84657 -65670 46334 -38735
19089 -97730 226974 -14043 150788 -161883 75025 52136 123415 95642 177108 113940 -227695
19077H5609c93179o3376K24683B07342a26812A09439b22125R2997D58682k13891
19067B44791F7912K0253b84134a3496A77070C6990a30731B23669b69866J1918
19057b57948f0669C58038b7157j79749j23198R3894f3882k48890P5165A16815
19046e1637B721K4958d4063B2768b29033Q3089j00417E2390f9099J3113A88040
19034F9900a05372B39972g119j65328c2320j04916j1778A05978a73528d4475A37783
19022I6920d81035F8556b07523i2537B0715i0556B16201a79939b8450J0783k23857
19011b41524r8759a04638C41641m3946c55562B13918b3960k06538k32792b4373
19000b05573B37875b52019A71497A4030i5378j0412A13112h0131a4585n216j87530
$$ plain form
19077 85609 -393179 -456555 -231872 207342 -126812 109439 -222125 -129128 458682 244791
19067 244791 67912 88165 -284134 -13496 177070 36990 -130731 223669 -269866 -257948
19057 -257948 -60669 358038 -27157 -206906 -330104 -236210 -63882 -312772 -237607 116815
19046 -51637 2721 27679 -44063 22768 -229033 -145944 -246361 52390 -69099 -55986 188040
19034 69900 -105372 239972 -7119 -172447 -32320 -137236 -149014 105978 -173528 -44475 137783
19022 96920 -481035 68556 -207523 -92537 20715 -90556 216201 -179939 -28450 -17667 -241524
19011 -241524 -340283 -104638 341641 297695 -355562 213918 -23960 -230498 -463290 -24373
19000 -205573 237875 -252019 171497 14030 -95378 -105790 113112 -80131 -14585 -19801 -207331
18989b07331K7453J0420j45008A1597J79621n8888C5791a50439P4197j35058B3495
18977A18a33605N2848p6895f4283A42974b65925B67743I3567i2329l91388K40910
18966b42807A15639c5880k93178R6301r5497A02685P0643b81903E2580a53227
18955e9720G312f5428A4929L8322a3126A06984a64409H2920B2043b4990l18502
18944c43492J01651c5396l0186j9644k2150A34970i3406B72621Q6448b9128l2355
18933f1483r8592b3874j0877A35796J15352b41710B08384b11162l2675c0516B6891
18921A03358a05000j64720I31a59009L3554K0910H6819R2642b53580J05094H5391
18909b4980G6628i1923E195c34696B60621H1155e0428J2838j42479M247j8842
$$ plain form
18989 -207331 -179878 -169458 -314466 11597 191218 132330 35791 -150439 -76242 -211300 23495
18977 118 -133605 -80757 -157652 -64283 142974 -265925 267743 93567 -92329 -483717 -242807
18966 -242807 115639 -35880 -329058 -232757 -328254 102685 173328 -281903 52580 -153227
18955 -59720 7312 -65428 14929 53251 -13126 106984 -164409 82920 22043 -24990 -343492
18944 -343492 -241841 -35396 -65582 -85226 -107376 134970 -93406 272621 359069 -29128 -61483
18933 -61483 -160075 -23874 -34751 135796 251148 -241710 208384 -211162 -243837 -30516 26891
18921 103358 -105000 -269720 931 -159009 -125455 -104545 86819 179461 -253580 -148486 85391
18909 -24980 76628 -91923 5195 -334696 260621 81155 -50428 -37590 -180069 -175822 -194664
18898a94664P037A21655m4099a51213E2843b4427C6225a25047C73582b02460A11203
18886i0052C03127b04691A38248C3865f0781C1543J33482a01578m852a5318o0914
18875g6232j50854J13072M5120L0669j25177J4699C5652L448J53178a25090j3597
18864a38687o1165F5135J55830H6591f119A51694a13971n4476N9165k78861a44532
18852a48074j70222E4575K80967I3638k0451c47127A98940c2482q9938j31603
18842b54023N0777L3139A47815f3134j60875D09041g5204L7239A00064h6235n5292
18831a41527f0479j66152e3366j1975H7250a94503e9675B9696h6425j90894a4630
18819D39422j83251a08269C0490K69989F9406b06351p0009h2628j06625B85582
$$ plain form
18898 -194664 -187627 121655 77556 -151213 52843 -24427 36225 -125047 373582 -202460 111203
18886 -90052 303127 -204691 138248 33865 -60781 31543 165025 -101578 -106430 -15318 -76232
18875 -76232 -227086 -114014 -68894 -38225 -163402 -148703 35652 39100 192278 -125090 -138687
18864 -138687 -199852 65135 220965 86591 -6119 151694 -113971 -168447 -109282 -388143 -144532
18852 -148074 -318296 54575 335542 93638 73187 -347127 198940 -32482 -122420 -254023
18842 -254023 -203246 -170107 147815 -63134 -224009 409041 -75204 -37965 100064 -86235 -141527
18831 -141527 -60479 -226631 -53366 -65341 87250 -194503 -59675 29696 -86425 -277319 -14630
18819 439422 256171 -108269 30490 300479 69406 -206351 -276360 -82628 -189253 285582
18808A17088a85528F2559P7914b49225a22369E090i6568p90c8909B25092i3219
18796e30395B10256b17k50394A25117b37784b693G8082c0579m1220A48265a48647
18784a4246l42584C9808R0515K6298a81007A72177a61815B30698Q3589C392g4801
18772e42597b28940O4290K2609A8813a38153A07972d00266B73142I7524R6076
18762A93600a77379e8381k50626Q1482a02503j66118A04912i9665r7922A65472
18751a77931A69944a11986a4299E9620c05098f892l66832i1748c1347B05671A5043
18739a89844k09967L2270A15188g0033D3547K54624b23321A6763J34219g7461
18728B05844B3910a46203k27638d7635j13089j3806j709A85616L1155a12994B06630
$$ plain form
18808 117088 -185528 62559 140473 -249225 -122369 5090 -96568 -97358 -38909 225092 -93219
18796 -530395 210256 -217 -250611 125117 -237784 -2693 78082 -30579 -71799 148265 -148647
18784 -14246 -356830 39808 130323 156621 -181007 172177 -161815 230698 314287 3392 -74801
18772 -542597 -228940 -164650 -142041 18813 -138153 107972 -400266 273142 97524 193600
18762 193600 -177379 -58381 -309007 -227525 -102503 -268621 104912 -99665 -197587 165472
18751 -177931 169944 -111986 -14299 59620 -305098 -6892 -373724 -91748 -31347 205671 15043
18739 -189844 -399811 -367541 115188 -70033 43547 298171 -223321 16763 150982 -77461
18728 205844 23910 -146203 -373841 -47635 -160724 -174530 -176239 185616 216771 -112994 206630
18716F1976c72267b157I5424B167J2363a5505F3316M18341B16596a55116b7546
18704a47652l1064B97678b36625k29224B4452R0841J28664I4458e333B0321a50987
18692D2447f6179j606p0938B31507o2723J01875c71783C68583h6285C5486K4429
18681E9915a33561A38560d761F1099J24569D6141A9931J39761b62583A00868a91500
18669E4631e9266k78468N1724b8494o559k83337D5354P9373J61161a06484D37119
18657d3122m8734k42214a61456d2137j92802N3939e7924K1279A19290h9925j4134
18646a04059d7039r3196B81231c48839a66592A79809G2718f2630k30528J24588
18636a68570A96824e5211B8626f1047A30975c17019H4997b68325g255A70684i2879
$$ plain form
18716 61976 -372267 -2157 95424 2167 14530 -15505 63316 481657 216596 -155116 -27546
18704 -147652 -178716 297678 -236625 -465849 24452 115293 243957 94458 -5333 20321 -150987
18692 42447 -66179 -67785 -138723 231507 168784 270659 -371783 368583 -86285 35486 59915
18681 59915 -133561 138560 -4761 61099 185668 46141 19931 159692 -262583 100868 -191500
18669 54631 -59266 -337734 -286010 -28494 -35053 -318390 45354 124727 285888 -106484 437119
18657 -43122 -91856 -334070 -161456 -42137 -234939 -181000 -57924 -36645 119290 -89925 -104059
18646 -104059 -47039 -140235 281231 -348839 -166592 179809 72718 -62630 -293158 -168570
18636 -168570 196824 -55211 28626 -61047 130975 -317019 84997 -268325 -7255 170684 -92879
18624E4260K14836a19591A50613l7322L3574c86309A37538i1421d0181b955A6960
18612g8235C28853a18387j24648a03409B4114a97306j35506B39331b06119A78193
18601a82815A36758a17056m4921A14036a93028f3595A87266d75941e7461k51093
18591c08554b2490j71044A9122h8297j68898i0147o4548E6210a31522A30240L2187
18580A62427a33749G9902A1537c1288O762k4457J2767l3735c994C4510a55851
18568g2343B97715F4074c26821L8722B59358r6372h5800D0800J84758o4831Q060
18557A68787k8980k6757L00721A72328e5843F4669e5064a7498A69245a53145B7807
18545h0407j77682i7763I4329Q7867G0532b82941Q3615I7027a9330E2105g5292
$$ plain form
18624 54260 269096 -119591 150613 113291 146865 -386309 137538 -91421 -40181 -2955 16960
18612 -78235 328853 -118387 -243035 -103409 24114 -197306 -332812 239331 -206119 178193
18601 -182815 136758 -117056 -161977 114036 -193028 -63595 187266 -475941 -57461 -308554
18591 -308554 -22490 -193534 19122 -88297 -257195 -90147 -154695 56210 -131522 130240 162427
18580 162427 -133749 79902 11537 -31288 -24526 -48983 -36216 -69951 -3994 34510 -155851
18568 -72343 297715 64074 -326821 -288099 259358 162986 -85800 40800 225558 160727 168787
18557 168787 139807 113050 413771 172328 -55843 64669 -55064 -17498 169245 -153145 27807
18545 -80407 -258089 -97763 94329 182196 70532 -282941 -199326 97027 -19330 52105 -75292
18533D7758K77678a42467d7551j24100A63069N723b7565A03226a95647p3314A56461
18521B1624b57279B08509g5864k98143h1607B09242f4126j47J2346l13855B3480
18509a51577k82683A4526a34569b602l20194B00615a56164d6674j5984D21377
18498G0581B4595a59950g9164B01171j1288i6282M4859B88660i2901j49605h4893
18486i0405j40164A6413J86753a3222j01683L1406o9139a1993A49951i0409j49206
18475b39615i9307B00567E1733a35192A00759C9252a78709A255e3582j90046a13196
18463a19843A14308K5881b85056d1663F925J30793j9305c9684p643A25357K4312
18452A49669D6786L0986d15746K01066k18609a05230B4191a67059L2169c6656
$$ plain form
18533 47758 325436 -142467 -47551 -171651 163069 168792 -27565 103226 -195647 -268961 156461
18521 21624 -257279 208509 -75864 -374007 -81607 209242 -64126 -64273 -51927 -365782 23480
18509 -151577 -434260 14526 -134569 -2602 -322796 200615 -156164 -46674 -62658 421377
18498 70581 24595 -159950 -79164 201171 189883 -96282 -51423 288660 -92901 -242506 -84893
18486 -90405 -230569 16413 203166 -13222 -114905 -83499 -152638 -11993 149951 -90409 -239615
18475 -239615 -99307 200567 51733 -135192 100759 39252 -178709 1255 -53582 -243628 -113196
18463 -119843 114308 140189 -285056 -41663 6925 137718 118413 -39684 -47327 125357 149669
18452 149669 46786 77772 -415746 -214680 -433289 -105230 24191 -167059 -134890 -36656
18441b76924k2356H1760k8857h8384m1331A2785a20808L2585m7271k41883a35603
18429A52907b06444C79123A0064Q0378a07042A82429a119D4852c4323A30304b48593
18417b2629A21723c95058b1920j99192Q8125B61745a50082O6365A13278N6508
18407A69786b58027N4092A79037J92748D452a43059k1122C4993i0179j27675H932
18395c6413k89465I856Q433J49140h856j02857n0365L2487A16865n140K1502b03764
18382c29442k6495a09775M2090b863l32721G951a01013d3159I8134a2813k16566
18371b29379A37193i9672F2335a03139G8740B550J05709K6238j4403n3130j845
18360F5119b39497M8581A12202J77358a16779G3172f6101m5058e028A22046b64298
$$ plain form
18441 -276924 -299280 81760 52903 -88384 -129715 12785 -120808 -88223 -135494 -377377 -135603
18429 152907 -206444 379123 10064 90442 -107042 182429 -1119 44852 -34323 130304 -248593
18417 -22629 121723 -395058 -21920 -221112 -132987 261745 -150082 -83717 113278 169786
18407 169786 -258027 -203935 179037 371785 4452 -143059 -164181 34993 -90179 -217854 8932
18395 -36413 -325878 9856 18289 167429 -8856 -111713 -162078 -129591 116865 111725 133227 -203764
18382 -329442 -355937 -109775 -67685 -2863 -335584 7951 -101013 -43159 98134 -12813 -229379
18371 -229379 137193 -99672 62335 -103139 78740 2550 108259 134497 120094 66964 65119
18360 65119 -239497 -190916 112202 289560 -116779 73172 -66101 -111159 -5028 122046 -264298
18348b9656J083A60561C2861h8319k48629N8366j52081a67803D523i4860L6434
18337e8426k27874A09743c2820B46155b12429l00346A67493F5296A584a61735
18326B52045M3333a95971B91016c79802A45720e2939j35815j30767a11899A77262
18315C5521K86737b1199r1850o0354A2213Q0794g6432j91790A02286a60222k9674
18304a89896j26405C123J80874D2038L6188J89512A03030J86156j22609p4671
18294I1906b99685i1061A20252a84397M205k77453G1880k800a22090B41077b83552
18282I9108d09049B19794d11324g5959G8438b68413h8841o4570M3273F9855d00575
18270e7993b765j16606i159k62156B87993D5841L9175a03535m2087O2071E7576
$$ plain form
18348 -29656 -28573 160561 32861 -88319 -336948 -278582 -430663 -167803 4523 -94860 -58426
18337 -58426 -286300 109743 -32820 246155 -212429 -512775 167493 65296 1584 -161735
18326 252045 295378 -195971 291016 -379802 145720 -52939 -188754 -319521 -111899 177262
18315 35521 322258 -21199 -113049 -173403 12213 93007 -76432 -268222 102286 -160222 -189896
18304 -189896 -316301 3123 183997 42038 78226 267738 103030 289186 166577 91906
18294 91906 -299685 -91061 120252 -184397 -180192 -457645 71880 69080 -122090 241077 -283552
18282 99108 -409049 219794 -411324 -75959 78438 -268413 -88841 -153411 -110138 69855 -400575
18270 -57993 -2765 -119371 -9159 -271315 287993 45841 85016 -103535 -145622 -83551 57576
18258A48665j8182M5395M2831J27522a11402A07671b06529G0511a43201a1411
18247c2141A89224b80260c6012R835I7855a09760B56239b4575C61409G3359f53742
18235b4614C1062d8740j81337j3127i4606c5932j51793k31176A88557d776q586
18224a3362k38636D5291p910J66561a16111G6158B5844f1900A0625a84160f280
18212C2903e4782K588B33389a52376a7864j65722B44047b11422R9499k90415c2223
18200i0142r8719A37468c13679h9372B57580A02455J4054f9976j26075C31923
18189b34441a13048K187l9661g313j11257E1811N0435M7100J39480c02341J1890
18178b90451i6232A83423f7060A74487N7031M6530c6282j73203J00912e4237K5977
$$ plain form
18258 148665 130483 175878 218709 346231 -111402 107671 -206529 70511 -143201 -11411
18247 -32141 189224 -280260 -36012 -26177 97855 -109760 256239 -24575 361409 73359 -653742
18235 -24614 31062 -48740 -230077 -243204 -94606 -35932 -187725 -418901 188557 -4776 -13362
18224 -13362 -251998 45291 37381 203942 -116111 76158 25844 -61900 10625 -184160 -6280
18212 32903 -54782 -52194 233389 -152376 -17864 -183586 244047 -211422 -111923 -402338 -32223
18200 -90142 -188861 137468 -313679 -89372 257580 102455 116509 -69976 -196051 331923
18189 -234441 -113048 -110861 -150522 -7313 -118570 51811 102246 149346 288826 -302341 -290451
18178 -290451 -96232 183423 -67060 174487 231518 278048 -36282 -209485 -108573 -54237 -28260
18167b8260k12083B1188O5221a11070k73879B90289b04335a7575L484l9590E0432
18155a01358o3679p1862e563C20496a31814l61635C1840J31253a68924A3909R3013
18144A06922a54291m4009C3523J16893J97040G6974C486M8087g6171n1196b9010
18132b14814e6380j5141D48969a63105P5409K7712G6440b2276G0395a36577j30049
18121b66626a01681j75810g2888K5264H887J58357d91250a36826j37678i6968
18110A70189a43575J4202k83520a72322l7332j7570A41911J67624G2436b26319
18099c46941h9640l05613A10603C1050M0247N0821K91240j33628I0164h1835j7612
18088i9447J7997A34833a29774L4864B13733b5375k56171f9072E0300Q0492a64275
$$ plain form
18167 -28260 -240343 21188 86409 -111070 -384949 290289 -204335 -17575 -14091 -53681 50432
18155 -101358 -165037 -236899 -5563 320496 -131814 -493449 31840 163093 -168924 13909 106922
18144 106922 -154291 -198300 33523 150416 347456 76974 3486 51573 -76171 -127367 -29010
18132 -214814 -56380 -71521 448969 -163105 -87696 -59984 76440 -22276 70395 -136577 -266626
18121 -266626 -101681 -277491 -72888 -47624 8887 167244 -491250 -136826 -274504 -96968
18110 170189 -143575 -129373 -412893 -172322 -209654 -227224 141911 309535 72436 -226319
18099 -346941 -89640 -395253 110603 31050 71297 122118 413358 279730 90164 -81835 -99447
18088 -99447 -81450 134833 -129774 -94910 213733 -25375 -281546 -69072 50300 130792 -164275
18076b26568A63407o7051K59377a47646C17013I7257N2302a21982G270K10078
18066B17348e1571q2351K7605c6284a1003k66544J35469B2308J59015A2167d9698
18054A84437c0564n5064R308F9567a23141K9215B76794i9556j54104i5284a408
18042a11187q8281g3125D46768a53629g0215B5845c627j0425A55635a97227H6628
18030a94380C9942c13275b0424l2572j07244A65518D3890a66064C42782C2282
18019b17212K9651E5587r56J75510f8313p9831k09565h5167A14923b87905h4413
18007D03346A53531a04727E8032K81710D1453J00056b18772b1869l08396B9958
17996A2840J82071b44806C22876A17007E0456P297J77401a47540B69405c22290
$$ plain form
18076 -226568 163407 96356 355733 -147646 317013 97257 149559 -121982 7270 217348
18066 217348 -51571 -133922 -106317 -36284 -11003 -277547 -142078 22308 181323 12167 -49698
18054 184437 -30564 -85628 -76320 69567 -123141 -93926 276794 -99556 -253660 -95284 -1408
18042 -111187 -199468 -73125 446768 -153629 -70215 25845 -3627 -14052 155635 -197227 86628
18030 -194380 39942 -313275 -20424 -52996 -160240 165518 43890 -166064 342782 32282
18019 -217212 -187561 55587 54631 230141 -68313 -148144 -357709 -85167 114923 -287905 -84413
18007 403346 153531 -104727 58032 339742 41453 141509 -218772 -21869 -330265 29958
17996 12840 194911 -244806 322876 117007 50456 57753 235154 -147540 269405 -322290
17985i5904q9092a7258k38319A33653Q955k9521B5910e1631B4100a14133L9888
17974g4245p8665J8247j40948A92437E1719a53044k1552A71671c54408A20769
17963E1206m204b65321i2033C80765i7102p2225M1615A14558d3683B24992b346
17951c4061k17085A08183C3667f4198N80a7051G5195c46756J71632j46113a22205
17939a15608I0217a79800A05314h9032k0699G541a43150l1125M163B20773p7558
17928A43215a11199A33915l5649P2258E8882b23961A29433J66457j38867a51636
17917a15577a6060n1097A60412a51840A16247n3108J70235a12673j45994B73177
17906A12084h9423A4473c49809A38927a15992n3499H4650j4050e8833k20873N945
$$ plain form
17985 -95904 -184996 -17258 -255577 133653 142608 113087 25910 -51631 24100 -114133 -74245
17974 -74245 -152910 -134663 -275611 192437 51719 -153044 -174596 171671 -354408 120769
17963 51206 47002 -265321 -92033 380765 -97102 -169327 -127712 114558 -43683 224992 -2346
17951 -34061 -251146 108183 33667 -64198 -63618 -17051 75195 -346756 -175124 -321237 -122205
17939 -115608 90217 -179800 105314 -89032 -109731 7541 -143150 -174275 -170112 220773 143215
17928 143215 -111199 133915 98266 170524 58882 -223961 129433 295890 157023 -151636
17917 -115577 -16060 -67157 160412 -151840 116247 63139 233374 -112673 -258667 273177
17906 112084 -89423 14473 -349809 138927 -115992 -169491 84650 70600 -58833 -279706 -273761
17895b73761b6168j2669A14555k2876e4715B04612H9726N210R8960a5083n3348
17884f8431k2883B82672a38245A90663a85594I8543J4C0911d884n0366q6195j40273
17872b81718A25986a29887e8262A74482M8854a89674h4654G4256g9502I5723K63775
17861C59498c3754k66007C13037b20095a5921E9305e7885C78057A36259c5220
17850a72013K4926H2706c12668a46387a4204k09692a604A50978a551l07421E7350
17838C2823K14515c01285C80716b2639B31434n6876a4750A2920J35181D5619P575
17827E3194b1454j44130A72262f068M78j29921G2468R6305g2179j68116G0318
17815A67028c26803A0446a24669h839I8667a79176a0188G2669a36153E3471J1013
$$ plain form
17895 -273761 -26168 -38837 114555 91679 -54715 204612 89726 94936 193896 -15083 -68431
17884 -68431 -91314 282672 -138245 190663 -185594 98543 98557 30911 -4884 -55250 -141445 -281718
17872 -281718 125986 -129887 -58262 174482 223336 -189674 -84654 74256 -79502 95723 359498
17861 359498 -33754 -299761 313037 -220095 -15921 59305 -57885 378057 136259 -35220
17850 -172013 -147087 82706 -312668 -146387 -14204 -223896 -1604 150978 -1551 -308972 57350
17838 32823 247338 -301285 380716 -22639 231434 174558 -14750 12920 148101 45619 53194
17827 53194 -21454 -165584 172262 -6068 -5590 -135511 72468 168773 -72179 -240295 70318
17815 167028 -326803 10446 -124669 -8839 98667 -179176 -10188 72669 -136153 53471 64484
17804F4484K94409I3876b11357c3653q9649k84039a70566C25716b3079B59137
17793A51111E8550L56380A68348K99575A21945A2515P4470a4262A06112k5028
17783H1084a44428A17025b4784A48795b18613B9187M242R1022a54210r7300B3477
17771A7833K54479i5180B11692P9604a11689c3269k9802A5853Q2612a71933c0669
17759A58817h09B56248m243m7081a21049B44805j3884A758N0617a0968A31196
17747C8948O4582c20475E18970a03515l5297c2079B4067J71918L2045F2477L51653
17736D14130G6601J19387j0691f1575b0257G8677k9552K00453B9329J05577A837
17724a3238E5516g6371G889a68551h1714C860J04358c71780b2074j62043F3045
$$ plain form
17804 64484 358893 93876 -211357 -33653 -123302 -407341 -170566 325716 -23079 259137
17793 151111 58550 414930 168348 467923 121945 12515 86985 -14262 106112 81084
17783 81084 -144428 117025 -24784 148795 -218613 29187 33429 124451 -154210 -251510 23477
17771 17833 272312 -95180 211692 291296 -111689 -33269 -63071 15853 98465 -171933 -30669
17759 158817 -809 256248 252005 204924 -121049 244805 230921 1758 52375 -10968 131196
17747 38948 103530 -320475 518970 -103515 -138812 -32079 24067 195985 228030 62477 414130
17736 414130 76601 195988 185297 -61575 -20257 78677 49125 249578 29329 134906 1837
17724 -13238 55516 -76371 7889 -168551 -81714 3860 108218 -371780 -22074 -184117 63045
17712a65167r8423B43046c99888H0634B4638h6615C5365h4748A36732D1124A2339
17700F3045a52899k53904J66620a4897l869B16160d13215A28875c6061a688A0140
17688B10906M9939c17693i5752r4733a2587r8543A18575c68987D2593L67404e7619
17676a49607j135A21299j2216a84357B28985a43505m6558A38205c02676q4762
17666c87438C43552j52560o5977E0758R3161Q8545J33098A53759c38783c0630
17655F3353K66588F523O1907B9939a50029e0190A62397a98532P248G9924J25765
17644B05689E4611a5327p4079B69658j26073J30099e4656A16778J74607j19102
17634A72283J34651a02809m0706p4392f364j06425B83070j22390J50444a43905
$$ plain form
17712 -165167 -263590 243046 -399888 80634 24638 -86615 35365 -84748 136732 41124 12339
17700 63045 -152899 -406803 -240183 -14897 -18766 216160 -413215 128875 -36061 -1688 10140
17688 210906 260845 -317693 -95752 -190485 -12587 -111130 118575 -368987 42593 409997 -57619
17676 -149607 -150742 121299 109083 -184357 228985 -143505 -190063 138205 -302676 -387438
17666 -387438 343552 190992 125015 50758 143919 232464 365562 153759 -338783 -30630
17655 63353 329941 6523 68430 29939 -150029 -50190 162397 -198532 -191284 79924 205689
17644 205689 54611 -15327 -89406 269658 143585 273684 -54656 116778 291385 172283
17634 172283 306934 -102809 -143515 -217907 -6364 -112789 283070 160680 311124 -143905
17623f7163A29744e0817A84514A4873c92429A15637m6122R2491d1768A88316a2521
17611a47250F0126a21544f0760A5189a80850G8282L2702K727a49036E5417e026
17599a02601J5424k27527n535A55044C15a44007F1614B5214d6696C54427A4754
17587G6177a41231C9292J27327J66270P5159D2436h2096k38501A5815C102a02407
17575A01804J3504f2939K0975j49730A22179b52781A48602K45582E2582K98010
17565C50592j02122a36536M3123b1011j30794A99140c80999B20033h0896n6387
17555a37283N4873Q766A87621P5053C080K80155p4001J44935a86051e9795j81534
17544b41329A79477m1925a63893E0833A069O173J5566b58359b6568A03659b4402
$$ plain form
17623 -67163 129744 -50817 184514 14873 -392429 115637 69515 162006 -41768 188316 -12521
17611 -147250 60126 -121544 -60760 15189 -180850 78282 110984 113711 -149036 55417 -5026
17599 -102601 -87177 -314704 -320239 155044 315 -144007 61614 25214 -46696 354427 14754
17587 76177 -141231 39292 166619 332889 408048 42436 -82096 -320597 15815 3102 -102407
17575 101804 115308 -62939 -41964 -191694 122179 -252781 148602 394184 52582 350592
17565 350592 248470 -136536 -93413 -21011 -151805 199140 -380999 220033 -80896 -137283
17555 -137283 -82410 -73644 187621 262674 3080 283235 209234 354169 -186051 -59795 -241329
17544 -241329 179477 137552 -163893 50833 1069 7242 22808 -258359 -26568 103659 -24402
17532G4133K42224A48875K8441m8574l9762J83032a42638A68445J87369A49748
17521C30746f4806n167A99551g5806A92572Q8142b03744m4131A04002k1170J18200
17510B01032i5104c1548H7948J11232a81938D28604A35624d3386j12613D07466
17499B5928i5782J6030G0704N4427m1462C9825J0490K1255c5214j8316H0432K37215
17487C17647A06824K27601I4318M6194c1747j9752J3831D03646a4843a806A64352
17475d9680r8673C0388b00579H9346J04306p0627R0240I7118L5823b4196E85003
17463I9468J86090A03368N7873m2817N480J99163c26823A27541N7396p1831R0692
17452B03798J65489k2814h765j81218B37679L22368k68534I7034R5095J78990
$$ plain form
17532 74133 316357 148875 177316 128742 88980 272012 -142638 168445 355814 149748
17521 330746 -64806 -69973 199551 -75806 192572 280714 -203744 -247875 104002 82832 201032
17510 201032 -95104 -31548 87948 199180 -181938 428604 135624 -43386 -155999 407466
17499 25928 -95782 -79752 70704 125131 83669 39825 50315 71570 -35214 -53530 80432 317647
17487 317647 106824 334425 94318 140512 -31747 -51499 -37668 403646 -14843 -1806 164352
17475 -49680 -148353 30388 -200579 89346 193652 123025 213265 97118 132941 -24196 585003
17463 99468 285558 103368 161241 118424 123904 323067 -326823 127541 184937 113106 203798
17452 203798 369287 346473 -8765 -189983 237679 560047 291513 97034 192129 371119
17442C71119A39579Q7840R5911A51654m97O08269A90915J23333J7016A37327L59878
17431D97205M2873k34834J01993j48149B4778L23034l698j46671K75009A38911
17420B09611A2407L88335a69855B97458F2214J26527Q8972A07282K16827A27114
17409B04400p6487n3750A2248L09902A00669h9357B40832a2028A61305E3532K01663
17398B55195F9539l2119a03307G0531f9377A44364F1183P1550h0621D2252K78142
17387C20394a27668C01907E1833L6232Q5400l0733Q8668E2877J50257p6370P5051
17376B01815c835C00805M0289A24373L3628P5180m5136o9583M74769A72297K1643
17365A93940J5469P8537j40043C5479K11729L298A13815K33613j13707n9765P4257
$$ plain form
17442 371119 139579 227419 323330 151654 151157 759426 190915 314248 331264 137327 497205
17431 497205 540078 305244 407237 259088 24778 347812 344114 197443 472452 138911
17420 209611 12407 400742 -169855 297458 62214 188741 277713 107282 324109 127114
17409 204400 127913 74163 12248 322150 100669 -89357 240832 -12028 161305 53532 255195
17398 255195 69539 37420 -103307 70531 -69377 144364 61183 132733 -80621 42252 320394
17387 320394 -127668 301907 51833 88065 173465 142732 231400 52877 203134 126764 201815
17376 201815 -3835 300805 341094 124373 158001 233181 188045 118462 593231 172297 193940
17365 193940 209409 287946 147903 35479 247208 250506 113815 347428 233721 173956 248213
17354B48213e1023B68684I0954f4932B07003g824G113J78387h835C22711o7816
17343B54895k8640l497a28324k2665e8325A2085J65160a4244C1369K54640g2028
17331B76104A02597c2684A42774A5111J41195C4495b54737C7185a1996A82264
17320H1173K61877F735K93645m2955R1137A17525J05616H0592M7730K85076A43272
17308B26158J33594m673Q0697j85141N5705q9130p9906a18858C24223I6737c1301
17296C79412j04160m6890j09291q844J03588C2056i5153C01788l8703c7084B61833
17284b02754B20394b18061F7602K37194M831a63673C28029j63252Q2365n6770
17274A90372k8393K2993m7130b4426A49391J51958a71316r793A85821b7226k31354
$$ plain form
17354 248213 -51023 268684 90954 -64932 207003 -7824 7113 185500 -8835 322711 254895
17343 254895 226255 222758 -128324 -150989 -58325 12085 177245 -14244 31369 286009 -72028
17331 276104 102597 -32684 142774 15111 156306 34495 -254737 37185 -11996 182264
17320 81173 343050 6735 300380 257425 348562 117525 223141 80592 128322 413398 143272
17308 226158 359752 355079 435776 250635 306340 217210 137304 -118858 324223 96737 -31301
17296 379412 275252 228362 119071 110227 213815 32056 -95153 301788 263085 -37084 261833
17284 -202754 220394 -218061 67602 304796 309627 -163673 328029 164777 247142 190372
17274 190372 161979 184972 137842 -24426 149391 301349 -171316 -181109 185821 -27226 -258580
17263b58580B6780M10535a64050A47229L34580A39356Q097J95516q2355m7882
17253B12732o6151m2806J44286l4759l9774a2363B37572M7697j13208b7114D15950
17241A22784g6703K3557A39025M5163A1865J60352L13544g0217k9486M9354C34380
17229E30318j16338F7188K07256J3082l3897J94464c22814C8000J95376K00490
17219D33866O1739Q034j76753E334L85313m7908h3325D69440p2634j87503G0089
17207g4962B19430a8830C11090K7186J85455I5158K12519b1416d33A78132a49806
17195A64587J48195e6296Q159B65871E6562K80131Q671J92151B54584K4703K12293
17184D91580A63346K40502j04434M36342A62520N9038J00619J28006j11404A57785
$$ plain form
17263 -258580 26780 437315 -164050 147229 481809 139356 147453 342969 260614 212732
17253 212732 146581 103775 248061 213302 173528 -12363 237572 285269 172061 -27114 415950
17241 122784 -76703 -53146 139025 184188 11865 172217 485761 -70217 -99703 -50349 334380
17229 530318 413980 67188 274444 287526 253629 448093 -322814 38000 233376 433866
17219 433866 495605 503639 326886 5334 390647 342739 -83325 469440 396806 209303 70089
17207 -74962 219430 -18830 311090 338276 523731 95158 307677 -21416 -433 178132 -149806
17195 164587 312782 -56296 -48137 265871 56562 336693 345364 537515 254584 279287 491580
17184 491580 163346 403848 299414 735756 162520 221558 322177 450183 338779 157785
17173D10790j68299q9270N6728M851N7072J20568J96738k22637q8003J82589I7741
17161A83019o9241P8551J99897j24389n8509J82633j1402j9524A50054k64m0285
17150A09505L64917B20119r098P6255m7344I0276J20750L49750k54456F2513K99864
17139C62377p5666C2665L64335A11612j2746J05209o214J23217M345J8890n5296
17128B89017O7674E606M15718j91912J48730j20700A19247J73335J83882j23901
17118C52563N3997j92519L13710l7701J4844L08392j81079P4492a4065A48815
17107E07177f5923D74611A37691j5188L2704L06838m7306n7888L7191j65562N23722
17096G52202l10262m1484j60726K55257L4376k23592o3477p9233m0574M47912
$$ plain form
17173 410790 242491 153221 209949 214800 271872 392440 589178 366541 278538 461127 97741
17161 183019 113778 192329 392226 267837 209328 391961 380559 361035 150054 149790 109505
17150 109505 474422 220119 211021 287276 239932 90276 211026 560776 306320 62513 362377
17139 362377 286711 32665 397000 111612 98866 204075 197861 321078 325423 344313 289017
17128 289017 356691 5606 421324 229412 378142 257442 119247 292582 476464 352563
17118 352563 406560 214041 527751 490050 504894 813286 632207 706699 -14065 148815
17107 507177 -65923 474611 137691 122503 155207 462045 414739 356851 394042 228480 752202
17096 752202 441940 400456 239730 494987 529363 305771 242294 163061 122487 570399
17086E70399m7056r7798r4492K93927k01604n1521j80221L97239j90727k3067
17076C75079L39791A44153L33135j84536J63842j75418J81008l5633M7760j1262
17066D63049p3570J42332m4382B30116J8978N8224L37310C15516J29277J2312
17056D57105A65183R2756K79736k43515M272M8907I6397L24121R1558J19676n7441
17045E74311o8560M46291r8665C75055j47566L85352k37812J64036j99484N55843
17035H95424j97967J10035P6711l00285k18645N5947M06380r4490j93525A26455
17024F58348r0360j6082R8984K0321j98709J36867J42395J89478m18205j38430
17014C84607K15769q2434M36446l12501N3722p6174K16234k19752R6351J05655
$$ plain form
17086 570399 523343 425545 331053 624980 423376 371855 191634 588873 398146 375079
17076 375079 714870 144153 477288 292752 456594 281176 462184 426551 474311 463049
17066 463049 389479 531811 487429 230116 249094 307318 644628 315516 444793 457105
17056 457105 165183 257939 537675 294160 298432 347339 96397 420518 512076 631752 574311
17045 574311 505751 952042 853377 375055 227489 612841 375029 539065 339581 895424
17035 895424 697457 807492 884203 583918 365273 421220 827600 733110 539585 126455
17024 658348 567988 551906 650890 671211 472502 609369 751764 941242 523037 384607
17014 384607 600376 517942 954388 641887 695609 619435 835669 615917 712268 817923
17004H17923k63990L67245j20089j71022K05195k47267n9472K35101j7416j78062
16994E68146K38732k59510J15683K41270j40658j44646K4698K301k2308N8358
16984F82066K38640k70487J40688k22495L26595k07363k19879M07355L4295j76800
16974G32615J09450N1765j85039p3991K50334L8344j80470L01359k16806p9074
16964G48487j29017L21629n4752k2595J26936k84326J17369J59953j42886J67692
16954A008490n7032K5147m2772J04591J67161j49490j67810l27006M16958M54854
16944A433091G06445N72106m51673K42448J99752k21663j78654K58681J27113
16935A254555l13375K64152E73384K86377L9989M16895K58769m19591m8558K11730
$$ plain form
17004 817923 553933 921178 801089 630067 835262 587995 528523 763624 746208 568146
16994 568146 806878 547368 663051 904321 763663 619017 643715 646016 623708 682066
16984 682066 920706 650219 790907 568412 895007 687644 467765 875120 909415 732615
16974 732615 842065 893830 708791 634800 885134 923478 743008 1044367 827561 748487
16964 748487 619470 941099 886347 863752 990688 706362 823731 983684 840798 1008490
16954 1008490 951458 976605 933833 1038424 1205585 1056095 888285 561279 978237 1433091
16944 1433091 706445 1278551 826878 1069326 1269078 1047415 868761 1127442 1254555
16935 1254555 941180 1205332 573384 859761 899750 1316645 1575414 1155823 1107265 1318995
16925A318995k09613r3571M97802l97637K49168K064j04775q6840K66365p7509
16915A364449J66452j40931J26749j4170k79137J46282K05541j49393K89671m84417
16905A231096N15232m5120j71492l15915M22366j80368R4218N5668L43222m16642
16895A532265J6824N09091K1927j82809q6525P560K9285l1578J22658N8631K33312
16884B230641j99894P3284n4774N8610j6618k41537m0263L65689J04078k91706
16874A987510J27008K33964j36108L36060o8613J33542j41657j05488l6761N77649
16864B907106k62083O7626N6888K99081n64102M13554P5101k41392K96304K9872
16854C077955k0149j71602K74110o166Q9605J34503o5163J1627K6426P4153l0067
$$ plain form
16925 1318995 1109382 1015811 1513613 1115976 1365144 1367208 1262433 1175593 1441958 1364449
16915 1364449 1530901 1389970 1516719 1502549 1223412 1369694 1575235 1425842 1715513 1231096
16905 1231096 1746328 1701208 1529716 1213801 1636167 1455799 1550017 1605685 1948907 1532265
16895 1532265 1549089 2058180 2080107 1897298 1810773 1818333 1847618 1816040 1938698 1997329 2230641
16884 2230641 2030747 2104031 2049257 2107867 2091249 1849712 1809449 2175138 2279216 1987510
16874 1987510 2114518 2348482 2212374 2548434 2479821 2613363 2471706 2366218 2329457 2907106
16864 2907106 2645023 2712649 2769537 3068618 2504516 2918070 2993171 2751779 3048083 3077955
16854 3077955 3057806 2886204 3160314 3154148 3243753 3378256 3313093 3324720 3351146 3425299 3395232
16843C395232J40362M4181k16402L49919L0845K31016P4681o418k29818J15087
16833C928685K17515K40955R0303l23492J96298q0502j57420N37902n5849K06141
16823D800536n644l74266P24289J87703l76727M42928m1797Q6482M8458O1363
16813E553325M46002J13095J3887J66166J24244J7880J49249L23287L8321K98326
16803G243782k11181M92318J32429m8854M71086L89876n28414N15208L75763p1746
16793H760267N16695L00450k90455N59374K81120J97278O53212M2923M18703K50911
16783A1690478Q9379M76461O10141L00222M98877M93416M81050J64909L31003
16774A5135936R68536M15811Q7887J149634L50757Q40829N07698P55636Q87725
$$ plain form
16843 3395232 3535594 3579775 3363373 3713292 3744137 3975153 4049834 4043416 3813598 3928685
16833 3928685 4146200 4387155 4477458 4153966 4350264 4269762 4112342 4650244 4594395 4800536
16823 4800536 4794892 4420626 5144915 5332618 4955891 5398819 5357022 5443504 5491962 5553325
16813 5553325 5999327 6112422 6126309 6292475 6416719 6434599 6583848 6907135 6945456 7243782
16803 7243782 7032601 7524919 7657348 7608494 8079580 8469456 7941042 8456250 8832013 8760267
16793 8760267 9276962 9577412 9286957 9846331 10127451 10324729 10977941 11020864 11439567 11690478
16783 11690478 11779857 12256318 12866459 13166681 13665558 14158974 14640024 14804933 15135936
16774 15135936 16104472 16520283 16608170 17757804 18108561 18949390 19457088 20212724 21100449
16765B1100449N60142P22721N16696J225958J065665R97299R27437J240418J348112
16756B9704897J033408J394227J704169J123595K081308J645584K001206J971746
16748D2660140J988329K096559K692457K900208K641008L189966L003183L514161
16740F4686011L654123M179863M876492M072221N352582N330023N496791O238020
16732A03886126O097537P436739O612219Q144204P584902P943502P660465Q394421
16724A63760115P549755P835330P107683N682585M989755M078756K567417J371527
16716B04942923l53910j562125l177997m424935n369947o666066p039175p725945
16708A68622823p662574q398823q068239q068586p879667p653421p087776o572047
$$ plain form
16765 21100449 21660591 22383312 22900008 24125966 25191631 26188930 27116367 28356785 29704897
16756 29704897 30738305 32132532 33836701 34960296 37041604 38687188 40688394 42660140
16748 42660140 44648469 46745028 49437485 52337693 54978701 58168667 61171850 64686011
16740 64686011 68340134 72519997 77396489 81468710 86821292 92151315 97648106 103886126
16732 103886126 109983663 117420402 124032621 132176825 139761727 147705229 155365694 163760115
16724 163760115 171309870 179145200 186252883 191935468 196925223 201003979 203571396 204942923
16716 204942923 204589013 203026888 199848891 195423956 190054009 183387943 176348768 168622823
16708 168622823 160960249 152561426 144493187 136424601 128544934 120891513 113803737 107231690
16700A07231690o829784n824421n802910n304612n077274m608372m393109l887429
16692F5503779l568348l424774l101920k882622k790417k815542k052396k616757
16684D2251003j946001j771969k093530j935561r19261k273160r23047j642858
16676B8745616j020615j290082r27637j009093q78193j155013p49992r34268o35207
16667B0145516o25055j087623j60122j347892k72242n35351p19417l22271p52930
16658A4322613j18757k25487o17973p25462l00922j83073k67983n30833k49451
16649A1102672n46912j36804l69660l73700k4550n49903J21340k89150l70229
16640H563104J1246o6865q12416L42674n47681J65740m06594N2536o36744J32006
$$ plain form
16700 107231690 100401906 94577485 88774575 83469963 78392689 73784317 69391208 65503779
16692 65503779 61935431 58510657 55408737 52526115 49735698 46920156 44867760 42251003
16684 42251003 40305002 38533033 36439503 34503942 33584681 31311521 30388474 28745616
16676 28745616 27725001 26434919 25507282 24498189 23619996 22464983 21714991 20780723 20145516
16667 20145516 19520461 18432838 18272716 16924824 16652582 16117231 15397814 15075543 14322613
16658 14322613 14203856 13978369 13360396 12634934 12334012 12150939 11882956 11352123 11102672
16649 11102672 10555760 10418956 10049296 9675596 9651046 9101143 9222483 8933333 8563104
16640 8563104 8574350 8507485 7695069 8037743 7490062 7655802 7249208 7301744 6665000 6797006
16630F797006Q2221m86985o7488j51269j31586K49494p20933K36017n42624M84176
16620E748029M9859k67894l57371K3416j01632k75282r0428O448k65056J28814
16610D598903k41516K04671m46628l45226L54341k98889m11019J88497N68680
16601D171814n36616k13718M29341m86118J1412K7098m09619K16863M0989j30589
16591C120857k30679Q3260j08423r4999J26590j32631r2796J75252k25357K9412
16581B650486M04096o34911O3427m4218K09175M9531p04515O22301m61133K10195
16571B364434l67295o3302J52349J69557k55962J66830M5088l263k37651M7822
16561B018607l6680k68285K75488j41808J75827l62365K88287l24530N22360J6319
$$ plain form
16630 6797006 6879227 6392242 6324754 6173485 6041899 6291393 5570460 5806477 5263853 5748029
16620 5748029 5797888 5529994 5172623 5196039 5094407 4819125 4728697 4735145 4470089 4598903
16610 4598903 4357387 4562058 4115430 3770204 4124545 3825656 3414637 3603134 4171814
16601 4171814 3635198 3421480 3850821 3364703 3376115 3403213 2993594 3210457 3251446 3120857
16591 3120857 2890178 2973438 2865015 2770016 2896606 2763975 2671179 2846431 2621074 2650486
16581 2650486 3054582 2419671 2483098 2438880 2648055 2697586 1993071 2615372 2154239 2364434
16571 2364434 1997139 1933837 2086186 2255743 1999781 2166611 2211699 2208436 1970785 2018607
16561 2018607 1981927 1713642 1989130 1847322 2023149 1660784 1949071 1624541 2146901 2163220
16551B163220m63332j19163p4370j86200L89761j8354j82658n2802R740M45657
16541A911499q61715N70846j49819P954Q3735k18762p7641n3233K11361k0409
16531A403816J62213j50657j8385J59827m47475P6182O8118k74246N16605R330
16521A505328P005r1440m75046J78058k23694J04836r8016J00567P7829j9073
16511A066354J6619K06909k43233K0503j82729N31373n25298K06107m2125k95045
16501G59435M7058L55990J38213k49213O885J8804o481J3824l30064L85001k16993
16490I22459L79420j0836l72411J20892m1433j59070k0144M00667m33088j07209
16480F79247k9896J07203J25163J1311k4620j17170J64038r8192m5166K4251m9864
$$ plain form
16551 2163220 1699888 1580725 1506355 1320155 1709916 1691562 1508904 1456102 1465842 1911499
16541 1911499 1049784 1620630 1470811 1478765 1562500 1343738 1266097 1212864 1424225 1403816
16531 1403816 1566029 1415372 1396987 1556814 1109339 1185521 1253639 979393 1495998 1505328
16521 1505328 1512333 1420893 945847 1123905 900211 1005047 907031 1007598 1085427 1066354
16511 1066354 1082973 1289882 1046649 1067152 884423 1415796 890498 1096605 1054480 759435
16501 759435 806493 1162483 1300696 1051483 1058368 1077172 1070691 1084515 754451 1139452 922459
16490 922459 1301879 1291043 918632 1039524 998091 839021 818877 1219544 786456 679247
16480 679247 649351 756554 881717 893028 868408 751238 915276 817084 771918 796169 746305
16469G46305P3836j46439k29135K3643L64193o3619J61689k6005k64315J32142
16459G72295j73149K35904j23338o6264J63690j99961K53396D27787L94776j07887
16449G14676J43405J02322k37497N9602j09369j30029k64014K66802B45388M12853
16439F58241K6313k2034R6308k06647m0741j35535K66215K03752j68064A44405
16428E45535P6142l00856L8543L51179O35j03406k44421K77872Q3543j97484N8168
16417E85450j10003K26883M2393B81399r6262M55863k91579K40045k37590L70905
16407G22781j77148p7760O5717L097B0945M08207K10880k43861J36702j75737
16397C57136J60388j81059P2430j33711J84060A67983K64810l2912L28574A72963
$$ plain form
16469 746305 820141 673702 444567 468210 832403 768784 930473 904468 640153 772295
16459 772295 599146 835050 711712 645448 809138 609177 862573 427787 822563 714676
16449 714676 858081 960403 722906 782508 673139 543110 279096 545898 245388 658241
16439 658241 684554 662520 758828 552181 511440 375905 642120 845872 677808 144405
16428 545535 621677 320821 359364 710543 711178 607772 363351 641223 724766 527282 585450
16417 585450 475447 702330 744723 281399 185137 641000 349421 589466 351876 722781
16407 722781 545633 467873 533590 536687 20945 429152 640032 396171 532873 357136
16397 357136 517524 336465 408895 275184 459244 167983 432793 399881 728455 172963
16386E17474j42707l8446C5927L32589j04996L5415J25883L48761B79210L4612
16376C13822L21572B78727O3618J44605l4011k04876n3495M47999B37885K87834
16366E25719k9217B27269n9409M47817A86560K15802A82328K95834A63763J25300
16356B89063K07013B09356J92059J45281A90574M9381K27488J19556B63168J23641
16346C86809M3750J35112A72200L03449Q8831q9653m2458j90593K42759B38299
16335E6452N02806m281q8130j29181O9721j10958J49728m7945L13938B31987g573
16323D35134b0521H6484Q6629K45737q3708G6392J64515J80104K9341O242j33321
16312C23273p318g541A68442L13734j04841A76142J43667A758K26945E8185L04940
$$ plain form
16386 517474 374767 336321 35927 368516 263520 298935 424818 773579 279210 313822
16376 313822 635394 278727 342345 486950 452939 248063 194568 642567 237885 525719
16366 525719 496502 227269 167860 615677 186560 402362 182328 478162 163763 289063
16356 289063 496076 209356 401415 546696 190574 239955 467443 586999 263168 386809
16346 386809 430559 565671 172200 475649 564480 474827 432369 241776 484535 238299
16335 56452 559258 554977 466847 337666 407387 296429 446157 398212 712150 231987 -7573
16323 435134 -20521 86484 173113 418850 335142 76392 240907 421011 450352 456594 323273
16312 323273 315955 -7541 168442 482176 377335 176142 319809 1758 228703 58185 363125
16301C63125A48676P0882q6498L68555j53755d0485D02961A98236K36655G2868
16290B55146E4729a06993B93495A31607B0009J69090K05112c6657B60223b8232
16279B39844L2235c20596D15044I9234J46447M0457j37006Q071K28282r6612A11989
16267D24796k5100A00039B9311J65791b7524A34079K40552D0598P8748K4905K88325
16256D32576j25228n2538Q5400A15589b0436A30769j782b2208A79606m7472J61199
16245B93333J25282j96139J21156r574j30624a00243f638A07376b2256B73989
16234i7840p3073b7224C7258g2961A22908J29209M7945A10186K45815j26595c1800
16222A96470I555O3098K53416A28616L2775a92071D98533A45709K45616d9401
$$ plain form
16301 363125 148676 219558 133060 501615 347860 -40485 402961 198236 434891 72868
16290 255146 54729 -106993 293495 131607 20009 189099 394211 -36657 260223 -28232
16279 239844 272079 -320596 415044 99234 245681 286138 149132 157203 385485 288873 111989
16267 424796 399696 100039 29311 195102 -27524 134079 374631 40598 119346 144251 432576
16256 432576 307348 254810 340210 115589 -20436 130769 128987 -22208 179606 132134 293333
16245 293333 418615 222476 343632 334058 203434 -100243 -6638 107376 -22256 273989
16234 -97840 -170913 -27224 37258 -72961 122908 252117 300062 110186 356001 229406 -31800
16222 196470 9555 72653 326069 128616 161391 -192071 498533 145709 391325 -49401
16211a14507A57008Q5881A1981O2153J98552m8106c0096n836E7202L87342e5599
16199B65796i0554A13061L2151n5884J37474e0699A88882C5086R5830a10727B06388
16187g3315C93358j48396a54367A36287J40484A13446b5223A06980Q0929l2008
16177A55901P6502o9695j8077C1896R9773J93873E9882K02080n6033q2425b5416
16165E9633M0880R1322A9975J88994n2875B3573a22643J4011A49268c4827F2259
16153B39428B5775K9851P9156l5262J99320A07668a62948e2066R967l37916C15874
16141b35117P0145A12558J79954f5421p50A54023F5175M2193C5823Q0079A8241
16129a67043A39163h1052C76390e7153G9293J33266G9995B9641g6731A38078A2727
$$ plain form
16211 -114507 157008 242889 11981 74134 272686 224580 -30096 -35932 57202 444544 -55599
16199 265796 -90554 113061 145212 89328 226802 -50699 188882 35086 130916 -110727 206388
16187 -73315 393358 244962 -154367 136287 276771 113446 -25223 106980 187909 155901
16177 155901 232403 162708 144631 31896 131669 325542 59882 261962 205929 123504 -25416
16165 59633 100513 191835 19975 208969 156094 23573 -122643 -108632 149268 -34827 62259
16153 239428 25775 55626 134782 99520 298840 107668 -162948 -52066 -42099 -380015 315874
16141 -235117 -164972 112558 292512 -65421 -66171 154023 65175 107368 35823 115902 18241
16129 -167043 139163 -81052 376390 -57153 79293 212559 79995 29641 -76731 138078 12727
16117E8934M4935n264J92237K9068E3878L2177k7398L56288r9905e8943F6981
16105c49122A86086k2444a3240A75095n8105B3295K49338n8554J21729d9002D58329
16093C64383j77082h6755D9290a93107J4402j63209A32811L29659A58703p4405
16083H4298a2624o086j20832A49427M2420Q4380H2447J35495m7558a28596A88492
16071d77875c2337j5472k00776d8207n6219k76932H0242i3189A71871b38021A42434
16059a09550q9339k45003a74771O003A29503P5960r4238g6080j68920b921A12730
16047e8695j0063k73015J35803B18977H3827a23402A03079J03389f4569B368N2713
16036E5081b31336d4894D6309L5445a11290D15919a24707n5497g946r3295d1810
$$ plain form
16117 58934 103869 98605 290842 319910 53878 86055 58657 414945 315040 -58943 66981
16105 -349122 186086 163642 -13240 175095 116990 23295 272633 214079 335808 -49002 458329
16093 364383 187301 -86755 49290 -193107 -178705 -341914 132811 462470 158703 84298
16083 84298 -12624 -18710 -139542 149427 191847 276227 82447 217942 170384 -128596 188492
16071 -477875 -32337 -47809 -248585 -48207 -104426 -381358 80242 -93189 171871 -238021 142434
16059 -109550 -198889 -443892 -174771 -168768 129503 205463 111225 -76080 -245000 -2921 112730
16047 -58695 -68758 -341773 -205970 218977 83827 -123402 103079 206468 -64569 2368 55081
16036 55081 -231336 -44894 46309 81754 -111290 415919 -124707 -180204 -7946 -101241 -41810
16024a80026g8590p5702A01439c50504A64959a85627D25254b63274J03583B29127
16013B52057h7297J3610I8562B2468c24442c5964k6361A64368g0335C9544L1195
16002G0739K00746e3506E3312h3019n5483G9229O9448n942b35070B3853c6759
15990a49312A89939M1023g0636o121n11163b24446a4987A37858b10785B13635
15979G8959L2038J07507r4756f0668A53850b7433k13519B89704b23617A99267
15968A11769A2602a62381B2675f3008j50032B88782b50420A73086j7898A3689
15957b5637K968o5862A91531b16898h5835k64483H2161B3906g7658H8755a28608
15945C37407a12273F809a05720H0274d9756k73731P2833J13225I139a74720A39240
$$ plain form
16024 -180026 -78590 -154292 101439 -350504 164959 -185627 425254 -263274 -159691 229127
16013 252057 -87297 -73687 98562 22468 -324442 -35964 -62325 164368 -70335 39544 70739
16002 70739 271485 -53506 53312 -83019 -138502 79229 148677 142735 -235070 23853 -36759
15990 -149312 189939 230962 -70636 -76757 -587920 -224446 -14987 137858 -210785 213635
15979 78959 110997 218504 123748 -60668 153850 -27433 -240952 289704 -223617 199267
15968 111769 12602 -162381 22675 -63008 -213040 288782 -250420 173086 155188 13689
15957 -25637 -22669 -88531 191531 -216898 -85835 -350318 82161 23906 -77658 88755 -128608
15945 337407 -112273 6809 -105720 80274 -49756 -323487 -250654 -137429 9139 -174720 139240
15933A07889c65392a21480D257J17870a13164l1049d1897F1898b6342E1175k4816
15922B6359K04218q9624a67648A86928a68109A51770c75710C9833Q0147h0456
15911A5624A434a62861A84505i1879l32369b8833A05140c07301B0928K5882c12843
15899C36008B0535a34617B04412c2723I0782J24494c40095a65068A13934b64747
15888B76373a05401L9332B09404K02088a68691p0084N5055B9362O8707a66916
15877g1811j83613A16257K10992b83528A23039O3728b93818L3498H3788f6348
15866a50714H7105A7480N6696f4412E4353b34039A06363a50930A07614B1887M41
15855B2328a13803k9351j12233B885K7904K11531a45615a1887j46921A5124a44106
$$ plain form
15933 107889 -365392 -121480 4257 122127 -113164 -144213 -41897 61898 -26342 51175 26359
15922 26359 230577 140953 -167648 186928 -168109 151770 -375710 39833 119980 -80456
15911 15624 1434 -162861 184505 -91879 -424248 -28833 105140 -307301 20928 46810 -312843
15899 336008 20535 -134617 204412 -32723 90782 215276 -340095 -165068 113934 -264747
15888 276373 -105401 -66069 209404 411492 -168691 -238775 -183720 29362 98069 -166916
15877 -71811 -255424 116257 327249 -283528 123039 186767 -293818 -260320 83788 -66348
15866 -150714 87105 17480 74176 -64412 54353 -234039 106363 -150930 107614 21887 22328
15855 22328 -113803 -143154 -255387 2885 30789 242320 -145615 -11887 -158808 15124 -144106
15843a05272k74269C3219K20126A2876b69127d8156q083o4316E9003c9313B7587
15831B07784c08865A27815j2889L48766j97666c12535K7244H5859f0261e465r950
15820a5415m6519F1529e5049k87958H1043c17309B80495i5335K9801j91496A06135
15808d9318I3024a31796j34234K3121A10053b67570a01630C798O8153J48199c61868
15796B24429b04621d8919p3813B5166J29524d1427k2522A74197f6807A1637b86536
15784B36539b30431A2192b35996A65133b28169J10044J7929H2381b22283A35026
15773a74671D5966J47657B55i7622k9608F6817b975A68803f6122J8728A50545
15761e28344A52667a70540B4765J32689a15235M8930c416k23875n6068A08279
$$ plain form
15843 -105272 -379541 33219 253345 12876 -269127 -48156 -56239 -120555 59003 -39313 27587
15831 207784 -308865 127815 114926 463692 266026 -312535 -285291 85859 -60261 -5465 -15415
15820 -15415 -61934 61529 -55049 -343007 81043 -317309 280495 -95335 -65534 -257030 106135
15808 -49318 93024 -131796 -266030 -242909 110053 -267570 -101630 3798 71951 220150 -361868
15796 224429 -204621 -48919 -122732 25166 154690 -41427 -63949 174197 -66807 11637 -286536
15784 236539 -230431 12192 -235996 165133 -228169 -118125 -100196 82381 -222283 135026
15773 -174671 45966 193623 255 -97622 -127230 66817 -2975 168803 -66122 -47394 150545
15761 -528344 152667 -170540 24765 157454 -115235 -66305 -3416 -227291 -283359 108279
15750a55125r709F2916f6124B9794g7302E9371f5692B19867A9851c44874C0128
15738B7677a19468c4482B27066B4825a49424B79648l5317c3022B05260m7645a11179
15726D1503a27343l9873k38830c2369A13096a88641B80358a1656k10996C96872
15715C4778b23773C63090j37089b93392A28634a22005M9792k6666A74988B0074
15704a44098p3261M6862A15749a58609p4985f6185F8046C3003M3333a93589m7190
15693b40779g735B07656a34041K9408B83617a96770A36058e8508A34046J1417
15683A45463D39J61790a82023k08181A35796r442C0081a68935D7517c53590b9706
15671d7218j49330A56141M554g700j96649l9874H4674c58068I3389L14200b43555
$$ plain form
15750 -155125 -164834 62916 -66124 29794 -77302 59371 -65692 219867 19851 -344874 30128
15738 27677 -119468 -34482 227066 24825 -149424 279648 244331 -33022 205260 157615 -111179
15726 41503 -127343 -167216 -406046 -32369 113096 -188641 280358 -11656 -222652 396872
15715 34778 -223773 363090 226001 -293392 128634 -122005 -72213 -98879 174988 20074
15704 -144098 -217359 -170497 115749 -158609 -233594 -66185 68046 33003 76336 -193589 -240779
15693 -240779 -7735 207656 -134041 -104633 283617 -196770 136058 -58508 134046 145463
15683 145463 439 162229 -182023 -390204 135796 126354 30081 -168935 47517 -353590 -29706
15671 -47218 -196548 156141 160695 -7700 -204349 -244223 84674 -358068 93389 407589 -243555
15659b75120I1228K68679g6780q116a1396D1977J33868C4861K3285J05450i954
15647i6507n914J5998G7603a28868F550J48538o7226K05961a36627A80267r085
15636A71182J489a11047A91422f2163j32487b6835A43650i511j74048m50775a37019
15624A66561b47332J11520A99178o4181a11507j20636a13515A5784a51012e4214
15613b96917A27785a73148A671N6381b9193G4932a34270r4064N8085B22209f2226
15601G0694J16878E9414b38074Q0325a6258A4182b60064J9880e7465b6613A14639
15589b89396B6245a95808j5399b3971q2895E50b02771d089r1475n2975j70607
15578c19146a23313p5929h6282j46153e6449a1739H699b81j86948c0708j70592
$$ plain form
15659 -275120 91228 359907 -76780 -84896 -11396 41977 175845 34861 58146 163596 -9954
15647 -96507 -102421 -86423 77603 -128868 6550 155088 87862 293823 -136627 180267 171182
15636 171182 172671 -111047 191422 -62163 -194650 -26835 143650 -9511 -183559 -634334 -137019
15624 166561 -247332 -135812 199178 134997 -111507 -232143 -113515 15784 -151012 -54214
15613 -296917 127785 -173148 1671 58052 -29193 74932 -134270 -228334 -170249 222209 -62226
15601 70694 187572 59414 -238074 -157749 -16258 14182 -260064 -240184 -57465 -26613 114639
15589 -289396 26245 -195808 -211207 -23971 -106866 550 -202771 -4089 -95564 -148539 -319146
15578 -319146 -123313 -199242 -86282 -232435 -56449 -11739 8699 -281 -187229 -30708 -201300
15567b01300b7865j39404r7955N7849b7073j43067K5087k7931A82163a39588j8743
15556a58331J4990C4169j321K87242I0746c09919K8826a04515B57969i7524F6365
15544f6784q2538p6286E3780J30705D0816M4025b33699d3389A30199a06718r9797
15533b06515B37577c68420e2834l19671D4941J31245k4751p4146C5272J17599
15523A52871c72066C2612J24700a81399D08393H5739a74558d503A24241a7631
15512a96757I0388f3023A19359d1721g027B11153K7746n1069g6865E2409c7574
15500c489j00144J3866d4583A57874l3181a22068A05621a08280J069C22628b3748
15488a78427A76782C7688Q0787a04908C42306a15102r165C2079a23680B14368
$$ plain form
15567 -201300 -27865 -167269 -265224 -207375 -27073 -170140 -145053 -172984 182163 -139588 -158331
15556 -158331 -143341 34169 32848 320090 90746 -309919 -281093 -104515 257969 -97524 66365
15544 -66784 -149322 -225608 53780 184485 40816 84841 -233699 -43389 130199 -106718 -206515
15533 -206515 237577 -368420 -52834 -372505 44941 176186 151435 77289 35272 152871
15523 152871 -372066 32612 157312 -181399 408393 85739 -174558 -4503 124241 -17631
15512 -196757 90388 -63023 119359 -41721 -7027 211153 238899 187830 -76865 52409 -37574
15500 -3489 -103633 -89767 -44583 157874 124693 -122068 105621 -108280 -107211 322628 -23748
15488 -178427 176782 37688 118475 -104908 342306 -115102 -124267 32079 -123680 214368
15477a02806n7084I1539a76064A85991O1416J80144I9091K95841j10592A27342
15466I67c8203j28988A07663M0159K5484F9754e5646B07389B872K34629J05216
15455C42717J9977A22206K26860b43473I6064K02556g4444A91533J30616H3689
15444f44561d9564k39562b890C14798j46556E2786f7369B03595a70442N892B79873
15432C3462k695a12762h598j91041L0011A80440a4008A95712r5893g0247j4837
15421h5084A77117a84001A20579a93725A50350j732E4514b36918A1636b2470k25659
15410b48129A02835m7651k5981g055r9720j7818L5060F4557J77233c42106f669
15398b54206N9509A02108h7313K9162C11331A31224J25290l952J64116a74529
$$ plain form
15477 -102806 -159890 91539 -176064 185991 247407 427551 99091 394932 284340 127342
15466 967 -38203 -167191 107663 147822 173306 69754 -55646 207389 2872 237501 342717
15455 342717 362694 122206 349066 -243473 96064 298620 -74444 191533 322149 83689
15444 -644561 -49564 -289126 -2890 314798 168242 52786 -67369 203595 -170442 -164550 279873
15432 33462 30767 -112762 -8598 -199639 -169628 180440 -14008 195712 99819 -70247 -85084
15421 -85084 177117 -184001 120579 -193725 150350 148618 54514 -236918 11636 -22470 -248129
15410 -248129 102835 55184 29203 -7055 -106775 -124593 -89533 64557 241790 -342106 -6669
15398 -254206 -194697 102108 -87313 -58151 311331 131224 256514 252562 416678 -174529
15387a04882B39270E8874b6718A19884G245P2162l6570Q4872d7129A46642j006
15376A45636L45929b68872d7148B04466b80916c5723G2395C0689c1843B3276a03465
15364A25650K14659A39491b60370I2344b64434G3550a06780p6124b7458B88466
15353i849A91896F1160M0970L5561b17101g2268A18749B24Q5374N2275C275a0906
15340B42575b68695B3662f3735k671k7007q7156G4601a10887C8349P78K06126
15329B45253r0521b66500A62270C0979K0086K00257i3592B19831b03223j35591
15319c38814A04653P5288m5146L2581G7452a9903A07469J66375a69363m289a9026
15307A96141a09887G8197J89116l9521n3493j4649a11325B55569b27772G8872
$$ plain form
15387 -104882 239270 58874 -26718 119884 7245 79407 42837 127709 -47129 146642 145636
15376 145636 491565 -268872 -47148 204466 -280916 -35723 72395 30689 -31843 23276 -103465
15364 125650 340309 139491 -260370 92344 -264434 73550 -106780 -182904 -27458 288466
15353 -9849 191896 61160 102130 137691 -217101 -72268 118749 224 85598 137873 3275 -10906
15340 242575 -268695 23662 -63735 -66406 -93413 -180569 74601 -110887 38349 39127 245253
15329 245253 154732 -266500 162270 30979 51065 251322 -93592 219831 -203223 -338814
15319 -338814 104653 179941 134795 167376 77452 -19903 107469 273844 -169363 -173652 -19026
15307 196141 -109887 78197 267313 227792 174299 159650 -111325 255569 -227772 78872
15296E5711D418h1976B33377m9524J88895D9744a00879H1434L61798e7867j26745
15285a84612E5512P4463J62797a26451A19329i6298A71792b34565B85430A1906
15274A69335H0392J34665L2588b11050e1489A09575O2543d7636B34307J51243
15264C85550j38282C6292i9405L9921G8568M1868j4915b6084A58086K8325L63845
15253E50256d3316B61591B6533K37484M42147M63569J207249m81415K79888Q2956
15243B258411E72884M0665B84657h3047A82271n9103E5259Q7087a44771C54832
15232D5218K39384d5582B90185A8956J02247J33961d3378A69210e5512b4287r6169
15221a20456H6320J51410d25913d7279F9471N926P249J74523a75630m261C78169
$$ plain form
15296 55711 4418 -81976 233377 183853 372748 49744 -100879 81434 443232 -57867 -184612
15285 -184612 55512 129975 292772 -126451 119329 -96298 171792 -234565 285430 11906
15274 169335 80392 215057 247645 -211050 -51489 109575 172118 -47636 234307 385550
15264 385550 247268 36292 -99405 -59484 78568 120436 105521 -26084 158086 186411 550256
15253 550256 -43316 261591 26533 264017 706164 1169733 2376982 1895567 2175455 2258411
15243 2258411 572884 613549 284657 -83047 182271 123168 55259 142346 -144771 354832
15232 45218 284602 -45582 290185 18956 121203 255164 -43378 169210 -55512 -24287 -120456
15221 -120456 86320 237730 -425913 -47279 69471 75397 82646 257169 -175630 -179891 378169
15209D71370I3582a59032B05782j02628K16956j48734i1076F01006b6749j85832
15199b12581E6958a2709A93601F1495i7850l73982A05533J59463j27323J81123
15189C18796a70158L0505B52179E2761J50761b42863D05555i1993B46677I9793
15178B31797a50692D995c21396J01957F40005B8283R8638A5310O4975B2115b26552
15166A4956K18609J66778j30272r7643p9505J61328b3018K9C30126P0633c82366
15154A98260M8125a01372D59153A03581N8709M8254R5865a0568C55684C7553r072
15143B8481K15742E3565K20325I4434l9872a1597j38522N9233D9539J61914J68285
15132C79738h9203o3198B35545K74410B00393F0925p992L19643b46132C47809
$$ plain form
15209 471370 93582 -159032 205782 103154 320110 171376 -91076 601006 -26749 -212581
15199 -212581 56958 -12709 193601 61495 -97850 -471832 105533 264996 137673 318796
15189 318796 -170158 -139653 252179 52761 203522 -242863 405555 -91993 246677 99793
15178 231797 -150692 4995 -321396 -219439 640005 28283 126921 15310 80285 22115 -226552
15166 14956 233565 400343 270071 172428 92923 254251 -23018 -22989 330126 400759 -382366
15154 198260 246385 -101372 459153 103581 162290 210544 306409 -10568 355684 37553 28481
15143 28481 244223 53565 273890 94434 54562 -11597 -150119 -90886 49539 211453 379738
15132 379738 -89203 -152401 235545 509955 200393 60925 52933 372576 -246132 347809
15121C10264A42212k17O5623j7249C1982e11706a14845A52064L57467I6936B0018
15109B94716b09466F40021A01614J87976F9474K88354A17913K5164n2801a68891
15098F6056B7056N5647Q231J90617J18781F0696K78400E1684h1412C73070p892
15087C65178k426r7923H2324L46021a16578A13420j4967f612A67091C0732O5589
15076I6321K54522a72031B56468b7521E8246J57659o0953L9957L47252a70932
15065D85673k18682j10166l5918J57899A3919J9928J5137K0017k658J8899M3833
15054A29075J57996j28279k797d5534D88746m1550D9092N6018K58962o7539B056
15042A68720J00271J92595o2531e1357A74350m5818M3748L63929A04662L77N4604
$$ plain form
15121 310264 142212 141995 207618 190369 31982 -511706 -114845 152064 509531 96936 20018
15109 294716 -209466 640021 101614 289590 69474 357828 117913 143077 90276 -168891
15098 66056 27056 82703 90934 281551 400332 60696 339096 51684 -81412 373070 365178
15087 365178 362752 264829 82324 428345 -116578 113420 98453 -6612 167091 30732 96321
15076 96321 350843 -172031 256468 -27521 58246 215905 154952 194909 542161 -170932
15065 485673 266991 156825 120907 278806 13919 33847 48984 69001 66343 85242 129075
15054 129075 287071 158792 155995 -45534 488746 447196 49092 105110 364072 296533 2056
15042 168720 268991 461586 399055 -51357 174350 128532 172280 536209 104662 105039 159643
15031A59643K68608j02578F851K8795b95628D47260j71907e8024H8927M4005m337
15020A28595R7916J05003n7846i1438B1309K48897K06740B12557D0981J13751
15010A54732b14872C24520F5521L54572A72092D0272R7347e1056k7876B08681
14999A8389L30973j59864m329K6831E9261J20325l7631Q3393O9127A18132A9116
14987A99546K66921F5291M21746A46074A9417K25816J64230j06569A0470K38257
14977B48727J0278L31598q2897A71694J09913a65140F46775B31793K68412A78640
14966D97818B10014J97113r0996j41734M57247k72897L324L9659j73581j1071
14956B17078J70612o8135J09474O1483I9617K15651C9107J02924E8596K18854
$$ plain form
15031 159643 428251 325673 6851 35646 -295628 447260 275353 -58024 88927 132932 128595
15020 128595 226511 331514 273668 -91438 21309 270206 476946 212557 40981 154732
15010 154732 -214872 324520 65521 420093 172092 40272 137619 -51056 -78932 208681
14999 18389 349362 189498 185169 212000 59261 179586 141955 225348 294475 118132 19116
14987 199546 466467 65291 487037 146074 19417 245233 409463 302894 10470 248727
14977 248727 259005 590603 507706 171694 281607 -165140 646775 231793 500205 178640
14966 497818 210014 407127 316131 174397 631644 358747 362071 401730 228149 217078
14956 217078 387690 319555 429029 490512 99617 315268 39107 142031 58596 277450
14946B77450K16292A34130A8581J71908k1223J00241L31611F5765P5653M9446
14936A90864Q8776l0653J56499j77705K32718B20307J75399r9180p7704N62175
14926G80997g2127B67836o3400L52878q0334A51043Q7556K30429A91711M1824
14916B33535J02544l1857K71592F01L70231m8016d2129B78187J4688K45146m2504
14905D95517A15267l6142L21766R7081r025Q6292j11957L08189l80731J95781
14895E86521k29933o4966O4284A57904K97246B05643L82215j45318A29253N34533
14885F63786l04322r6165L41692C8421N09383H7097M26407M706J37764j55928
14875E00046J0172E1924K83521K95183B86665A9843M85632j22792n4135k5926
$$ plain form
14946 277450 493742 134130 18581 190489 169266 269507 601118 65765 141418 190864
14936 190864 279640 248987 405486 227781 460499 220307 395706 296526 218822 780997
14926 780997 -72127 267836 204436 557314 476980 151043 238599 469028 191711 233535
14916 233535 336079 304222 575814 601 370832 322816 -42129 278187 292875 538021 495517
14905 495517 115267 79125 400891 497972 488947 575239 463282 771471 390740 586521
14895 586521 356588 291622 355906 157904 455150 205643 587858 442540 129253 663786
14885 663786 359464 263299 604991 38421 547804 87097 513504 518210 655974 500046
14875 500046 510218 51924 335445 630628 286665 19843 505475 382683 328548 302622
14865C02622K17881J16689I6455L77112k2957A83120L62217o0437n0784j73168
14855B60948n7534O9501J9721J15765M0162j14218P1503J83324B89107L4337L07900
14844F31344p1201j5216B66542J41203r4158K08625R1674q0930k03678J75501
14834E04779A61253g0078C14238K05360K12563B59043L6713J2957J00185L03640
14824G12538k08816J44330L2671j49503A35774N38115l00695m5822M61210l02560
14814D86022Q9804j68934j13923K60082A87572K48631K33123J70421C63740N40117
14804I03857C66298J05267J85632K8114k38014M76417m14416Q5552j3212B19816
14793H20723l46925L87316j70582k1979j30517n6008K35336k77145m9101N2269
$$ plain form
14865 302622 520503 637192 96455 473567 450610 183120 545337 484900 434116 260948
14855 260948 203414 272915 292636 408401 448563 334345 405848 589172 289107 323444 631344
14844 631344 560143 544927 266542 407745 313587 522212 613886 532956 329278 504779
14834 504779 161253 -70078 314238 519598 732161 259043 295756 308713 408898 712538
14824 712538 503722 648052 680723 531220 135774 673889 373194 327372 788582 486022
14814 486022 575826 406892 292969 553051 187572 436203 669326 839747 363740 903857
14804 903857 366298 471565 657197 685311 447297 923714 509298 594850 581638 219816
14793 820723 473798 861114 690532 668553 538036 482028 717364 440219 391118 443387
14783D43387n9961K37444o6716j91975K21941j92354L15758j77053J97365Q5834
14773H13670r25k97979O1644J04364K35746m31374N0284j8264M7662J91785l74478
14762C82135L3779J50647j07283F2097M33822N2858m560J05605J38608r1194K1734
14751G18970P0081R8333k74749Q7267K25239J15273k49779p9593J91656J68490
14741A071188k35048m149j55806K17174k8954j81650o5684q009j58372Q7538j5243
14730E22985L45091q5708k17991L82692j82868J50603k71072K61227k35008J76751
14720H46702K22981J12627m15405k01745L77131j83459N3252L23975k7658l54674
14710G53727l33378K03746J49406J74475k06332M27746l98733K75404K3229j41763
$$ plain form
14783 443387 383426 620870 554154 362179 584120 391766 707524 530471 727836 813670
14773 813670 812745 514766 576410 680774 916520 485146 535430 517166 564828 756613 382135
14762 382135 415914 566561 459278 62097 495919 548777 544217 649822 788430 697236 718970
14751 718970 789051 887384 612635 699902 925141 1040414 790635 711042 902698 1071188
14741 1071188 836140 831991 676185 893359 864405 682755 617071 609062 450690 538228 522985
14730 522985 868076 782368 564377 947069 764201 914804 643732 904959 669951 846702
14720 846702 1069683 1182310 766905 565160 942291 758832 812084 1136059 1108401 753727
14710 753727 420349 624095 773501 947976 741644 1169390 770657 1046061 1069290 927527
14700I27527J65180l00944L06100l07075j5128J56255J06981p2266P4774j1906
14690A029498Q8665j21572k44254J8328L79337j87058R9407J25384j76514Q5312
14680A096533j68978J06070J0966J54450k0316k16116J40257Q9730Q171M5189
14670A245956l60487K41788n0360r1402L61576l15462p0417K14670J2414J64879
14660A353155o3304j24724J63011j48422J57005j51644N5247J0590L0132k8221
14650A252825R4722j79108j4592l37750M75122j22606j06157J03673j825N13937
14640A678241m04214j02050O74613n65223o1646L3751L8978J51423j00719l5782
14630A307372k01033J72351J60580J9811j43163K5778M28243j38256J70763m03408
$$ plain form
14700 927527 1092707 791763 1097863 790788 775660 931915 1038896 966630 1041404 1029498
14690 1029498 1118163 996591 752337 770665 1150002 962944 1062351 1187735 1011221 1096533
14680 1096533 927555 1033625 1044591 1199041 1178725 962609 1102866 1192596 1200767 1245956
14670 1245956 885469 1127257 1076897 985495 1347071 1031609 961192 1175862 1188276 1353155
14660 1353155 1289851 1165127 1328138 1179716 1336721 1185077 1240324 1250914 1281046 1252825
14650 1252825 1347547 1168439 1153847 816097 1291219 1168613 1062456 1166129 1164304 1678241
14640 1678241 1274027 1171977 1846590 1281367 1219721 1253472 1292450 1443873 1343154 1307372
14630 1307372 1106339 1278690 1439270 1459081 1315918 1341696 1769939 1631683 1802446 1399038
14620A399038J41956K88569n11310J19154K8675r2044N16530l19133R1389J09812
14610A772636P104K07323j65689k08269L09610k32750J06501r3883J34771m49309
14600A388045M53593j15378K56015n93876M33412N20233q62484K03647L90685
14591B073892k40999j4609m7242M408K84020J03347j93798K35160m68497M44381
14581B180063p2998n047O5189k5634j68768M32082j01417k96325L10797j26632
14571B191310N4849Q9766j01620K03391j26421L91608m14162K47093P1614M2163
14561B649591J42417j42371L34832K93021k80415L57247K58256L17376l21521
14552C608433R35555O53369J362035J712443M543708Q955515J3116666O434486
$$ plain form
14620 1399038 1540994 1829563 1318253 1437407 1466082 1374038 1890568 1571435 1662824 1772636
14610 1772636 1779740 1987063 1821374 1613105 1922715 1689965 1796466 1702583 1837354 1388045
14600 1388045 1841638 1726260 1982275 1388399 1821811 2342044 1479560 1683207 2073892
14591 2073892 1832893 1818284 1771042 1775450 2059470 2162817 1969019 2204179 1735682 2180063
14581 2180063 2107065 2102018 2167207 2141573 1972805 2404887 2303470 2007145 2317942 2191310
14571 2191310 2246159 2335925 2234305 2437696 2311275 2702883 2288721 2535814 2607428 2649591
14561 2649591 2792008 2649637 2984469 3277490 2997075 3354322 3612578 3929954 3608433
14552 3608433 4543988 5197357 6559392 8271835 12815543 21771058 34887724 41322210
14544D1322210j8314637r077143m702090m102772j470314q37489m95717M1579
14536B363627n225J90762k08997m62070L70737j34322M24823o3579j87094N8986
14526B347648L33258j53942o3929j54961K75945O402L2185j91257K21000j08075
14516B544274m467L05312J91476k54464m4654l3788J06280J43884J38014m7292
14506C044575P1315j63410N9823J52565J9051J72296m0117j28523J56282k51748
14496C092109M91260K1569k46973J20043J58299L64297m34040n1384P5306J82705
14486C773191l3134m2995L58895k30109L90135M4289k20555O2682K27682L4825
14476D364906n5472k90247K75970N30456l09468K29289k36728j98132M51398k82916
$$ plain form
14544 41322210 23007573 13930430 9228340 5125568 3655254 2817765 2322048 2363627
14536 2363627 2358402 2549164 2340167 1878097 2248834 2114512 2539335 2475756 2288662 2347648
14526 2347648 2680906 2526964 2463035 2308074 2584019 2590421 2622606 2431349 2652349 2544274
14516 2544274 2539807 2845119 3036595 2782131 2737477 2703689 2809969 2953853 3091867 3044575
14506 3044575 3115890 2952480 3012303 3164868 3183919 3356215 3316098 3187575 3343857 3092109
14496 3092109 3583369 3604938 3357965 3478008 3636307 4000604 3566564 3515180 3590486 3773191
14486 3773191 3740057 3697062 4055957 3825848 4215983 4260272 4039717 4102399 4330081 4364906
14476 4364906 4309434 4019187 4295157 4825613 4516145 4745434 4508706 4310574 4761972 4479056
14466D479056K09926m4126K33732o3240K39621k28672K77239p7798J92826l09810
14456D908754L68211J38110Q7269M3961P2075P2502q5579L54373j06400J47051
14446F000327j14621K93074j30212L65038k9937l44858M74750k44283J63224J67725
14436F600227Q4490J16981M50394R035k04024n7812N16341q1519J13607p4250
14426G473470M23165R9274l95411L96309j10639R8695M51030o3192M25375J80437
14416H978513J42506O3698K8114j97367O73053j63644K34581n6814K34411L06795
14406A0243846J78186J70260j90883M36926J90052J2827K32181N29326l10438
14397A1492283R8120K42399O1088N80606Q1630L93748L39990k11330M66843l2650
$$ plain form
14466 4479056 4688982 4644856 4878588 4815348 5054969 4826297 5103536 5025738 5218564 4908754
14456 4908754 5276965 5415075 5502344 5546305 5618380 5690882 5605303 5959676 5853276 6000327
14446 6000327 5885706 6178780 6048568 6413606 6383669 6038811 6513561 6269278 6432502 6600227
14436 6600227 6684717 6801698 7252092 7261127 7057103 6999291 7515632 7434113 7547720 7473470
14426 7473470 7896635 7995909 7600498 7996807 7886168 7984863 8435893 8372701 8798076 8978513
14416 8978513 9121019 9184717 9212831 9015464 9688517 9524873 9759454 9702640 9937051 10243846
14406 10243846 10422032 10592292 10401409 10838335 11028387 11041214 11273395 11802721 11492283
14397 11492283 11590403 11832802 11893890 12474496 12556126 12949874 13289864 13078534 13545377 13512727
14387A3512727M61221J69022p7615M80635J22536O85214j59967M72179M26206
14378A6092158J96404M44559j19299N19159L53292K15465J81316O67358J90547
14369A8740959M97190M34243M58170N92653O7169P45490J14314O54449O80343
14360B2984980L07963L33375Q39162J38906Q27546O33426M34195R88574J99331
14351B7687458P63625R96620M49193Q11065O54330J384049N25599P08459Q28512
14342C4808910Q19762J175218J027654J076996J137809J259186J133998J209802
14334D3649335J291508J179634J422293J398092J612873J515607J621439J966004
14326E5656785J623427K239441J377287K424856K139532K469698J668210L069835
$$ plain form
14387 13512727 13973948 14142970 14065355 14545990 14668526 15353740 15193773 15665952 16092158
14378 16092158 16288562 16733121 16613822 17132981 17486273 17701738 17883054 18550412 18740959
14369 18740959 19238149 19672392 20130562 20723215 20790384 21535874 21650188 22304637 22984980
14360 22984980 23292943 23626318 24465480 24604386 25431932 26065358 26499553 27488127 27687458
14351 27687458 28451083 29447703 29896896 30707961 31362291 32746340 33271939 33980398 34808910
14342 34808910 35628672 36803890 37831544 38908540 40046349 41305535 42439533 43649335
14334 43649335 44940843 46120477 47542770 48940862 50553735 52069342 53690781 55656785
14326 55656785 57280212 59519653 60896940 63321796 65461328 67931026 69599236 72669071
14318G2669071K490120L113449K970371K600273L763484L146052L295767M140551
14310I8189138L767668M347906M133248N041946N178580N488893N659999N534979
14302A37342357O204087P032679P100586P530437P747098Q437418R127218R424865
14294A99946745R827442J0602923J1069635J1517630J2354789J2677036J3381892
14287B81378092J3790463J4431531J4755255J4991634J5162622J5376429J4761041
14280C84647067J5323205J4367116J3633688J2270642J1444628R356510P421795
14273D68464651M224436N47239j312941l061516k467406n575615o103707p080897
14265D47634244q867593j1160465j2409931j3669158j4803648j5927409j5721856
$$ plain form
14318 72669071 75159191 78272640 81243011 83843284 87606768 90752820 94048587 98189138
14310 98189138 101956806 106304712 110437960 115479906 120658486 126147379 131807378 137342357
14302 137342357 143546444 150579123 157679709 165210146 172957244 181394662 190521880 199946745
14294 199946745 209774187 220377110 231446745 242964375 255319164 267996200 281378092
14287 281378092 295168555 309600086 324355341 339346975 354509597 369886026 384647067
14280 384647067 399970272 414337388 427971076 440241718 451686346 461042856 468464651
14273 468464651 472689087 473236326 471923385 468861869 466394463 460818848 454715141 447634244
14265 447634244 438766651 427606186 415196255 401527097 386723449 370796040 355074184
14258C55074184j5789304j5731270j5320961j4655736j4137023j2490758j2654272
14251B54294860j2784239j1822355j1319723j0711725j0266976r315850q661821
14244A79412171q363960p911379p624627p155154o475465o492832n557449n601841
14236A24229464n124484n360109m826037m296703m147142l501774l974810l671116
14228H9327289l419476l229842l384755k970118k690201k714544k255569k088906
14220F6573878k316204k240932k275845j735227j800146j788108j299566j261125
14212E1856725j837587j748962j464850j333592j143973q04286j033362j538630
14204D0951483j458455r27878r54363p68863p85269j339851j027759l59198j153311
$$ plain form
14258 355074184 339284880 323553610 308232649 293576913 279439890 266949132 254294860
14251 254294860 241510621 229688266 218368543 207656818 197389842 188073992 179412171
14244 179412171 171048211 163136832 155512205 148357051 141881586 135388754 129831305 124229464
14236 124229464 119104980 113744871 108918834 104622131 100474989 96973215 92998405 89327289
14228 89327289 85907813 82677971 79293216 76323098 73632897 70918353 68662784 66573878
14220 66573878 64257674 62016742 59740897 58005670 56205524 54417416 53117850 51856725
14212 51856725 50019138 48270176 46805326 45471734 44327761 43523475 42490113 40951483
14204 40951483 39493028 38565150 37610787 36841924 36056655 34716804 33689045 33329847 32176536
14195C2176536q40560n00138p49082j188450m07894n05386q28838o27623p16294
14186B5812271l46789n89937o67675m27491m52935n74571m88200l41511o56358
14177B1266804m84179j98181l67501q40371j6446l91129m20156m57783l92488
14168A7698570K17489n18285n64611m696n44101n08291q3702j93164o85647j38146
14158A4675416n9394m06106k34937N5682n24445o8647j85663l25804K4886j43297
14148A2807691p72194L3687m35017n4670q9652o3288J34578n74888m01527O8770
14138A0653490l67695k7267l0251k61433j98412m6239K3142n35724M35378o52645
14128H992344L04208n48506j28355L30524j01712m88035J40889j10016k77624
$$ plain form
14195 32176536 31335976 30835838 30086756 28898306 28490412 27985026 27156188 26528565 25812271
14186 25812271 25465482 24875545 24207870 23780379 23327444 22752873 22264673 21923162 21266804
14177 21266804 20782625 20584444 20216943 19376572 19360126 18968997 18548841 18091058 17698570
14168 17698570 17916059 17397774 16833163 16828467 16284366 15776075 15692373 15499209 14813562 14675416
14158 14675416 14616022 14209916 13974979 14030661 13506216 13437569 13251906 12926102 12950988 12807691
14148 12807691 12035497 12069184 11634167 11579497 11489845 11426557 11561135 10986247 10584720 10653490
14138 10653490 10285795 10258528 10228277 9966844 9768432 9722193 9745335 9209611 9644989 8992344
14128 8992344 9296552 8748046 8619691 8950215 8848503 8360468 8501357 8391341 8113717
14119H113717J06284n21299L5535L78622n94239J37464k65975j80872M96660m03665
14109G302232k66764l49292J90187k23027N0550K98685n32411K29449l8802l99930
14099F260877j03893J23496l64513L13770m16530K32821k31433n5603m9598L62087
14089F071481l97100L3103J1086l55367Q2750K2952l75631K93051k34613k94838
14079D856874J9513N28187p40939K54007K6782N7912m71558K86168k0899k87850
14069D508197m4698N3856K36967l02252m19183N75912n07164Q4829Q6522j13200
14059D159786q5264Q9337j89499n9282K55828m63693J18623J89569k34795K6283
14049C806893j88115q8762Q3851O5756l128k27096q7673K40045j84441J66792
$$ plain form
14119 8113717 8220001 7698702 7734237 8112859 7518620 7656084 7390109 7209237 7705897 7302232
14109 7302232 7035468 6686176 6876363 6653336 6703886 7002571 6470160 6699609 6660807 6260877
14099 6260877 6156984 6280480 5915967 6229737 5813207 6046028 5814595 5758992 5709394 6071481
14089 6071481 5674381 5707484 5718570 5363203 5445953 5468905 5093274 5386325 5151712 4856874
14079 4856874 4876387 5404574 4663635 4917642 4944424 5002336 4530778 4816946 4796047 4508197
14069 4508197 4463499 4517355 4754322 4452070 4032887 4608799 4101635 4186464 4272986 4159786
14059 4159786 4074522 4163859 3974360 3915078 4170906 3707213 3825836 4015405 3780610 3806893
14049 3806893 3618778 3530016 3613867 3679623 3676495 3449399 3361726 3601771 3417330 3584122
14039C584122l9131J01039j81925m5871q1378l0455m6055n5841j03587L35063
14029C435981k82316q2595M36573k20992j01581m5847L7694J80380k99555j79376
14019B878366N0775J80381m83593J24838J86627l53602K07991J88099j58159l41078
14009B480645N5932j28703j11229K16177P7375k25800L08730m02782j1981M94179
13999B752543j45553j3681m92587M45172q65l2686L0106j51842P76117K80783
13989C447507R40694L401609P127444J4049090J2306986j4589204j1926592m596881
13981A0160653l131896j448606p70351p72895l58022j2523p18731j50761K96473
13972C093341o4906m24662J67437j35401J33617m8068r4144l23605K00678K0333
$$ plain form
14039 3584122 3544991 3646030 3464105 3418234 3336856 3306401 3260346 3204505 3100918 3435981
14029 3435981 3153665 3071070 3507643 3286651 3185070 3139223 3176917 3357297 3057742 2878366
14019 2878366 2929141 3109522 2625929 2750767 2937394 2583792 2791783 2979882 2821723 2480645
14009 2480645 2536577 2407874 2296645 2512822 2590197 2364397 2673127 2270345 2258364 2752543
13999 2752543 2606990 2593309 2100722 2545894 2545029 2512343 2542449 2390607 3166724 3447507
13989 3447507 4388201 7789810 14917254 28966344 41273330 26684126 14757534 10160653
13981 10160653 7028757 5580151 4809800 4036905 3678883 3666360 2947629 2796868 3093341
13972 3093341 3028435 2603773 2771210 2635809 2769426 2721358 2627214 2303609 2504287 2524620
13962B524620R77k16415K52898r5019o0025K209l5290l33186M6733j84117J41623
13951B045008Q3674l18747K24770l3296L22669o41864N01016l80077J81599l22276
13941A662476M79974l4222j55803l3274l8829K6936p7347l35037J28390J47645
13931A770909j71091J02297J81510m3033j44188L3759N0804o31015N20026K8501
13921A698479o2077j99976J3643K53018J64519k43834j32271m9971J43391j09759
13911A475162j70841K15392P4390j52595L73186m16267j47841N51072k11227k9416
13901A561015j21405p5217N7309J19369O9241m3343k72074o7268K25863N9143
13891A512633n86197N87175m768k91326l31301J34997L85601j17744j17966K1298
$$ plain form
13962 2524620 2525597 2309182 2562080 2467061 2407036 2409245 2373955 2040769 2087502 1903385 2045008
13951 2045008 2128682 1809935 2034705 2001409 2324078 1682214 2183230 1803153 1984752 1662476
13941 1662476 2142450 2108228 1952425 1919151 1880322 1907258 1829911 1494874 1623264 1770909
13931 1770909 1599818 1702115 1883625 1840592 1696404 1730163 1780967 1149952 1669978 1698479
13921 1698479 1636402 1436426 1450069 1703087 1867606 1623772 1491501 1441530 1584921 1475162
13911 1475162 1304321 1519713 1594103 1441508 1814694 1398427 1250586 1801658 1590431 1561015
13901 1561015 1439610 1364393 1421702 1541071 1610312 1566969 1294895 1227627 1453490 1512633
13891 1512633 926436 1513611 1508843 1217517 886216 1021213 1406814 1289070 1171104 1192402
13881A192402j01248n1131O98556o00853K53523k59163l65141M60296Q2028r7349
13871A211920L19490j00919J2691m69092K9139K61802J29953j47042O9030P1630
13861A388602m42240K33322j20271L6228J28676K46394n43047O1669K57059k05584
13851A040808L5827J9008L1361j63215M67739m99229M21667k66736J75699j97685
13841A065244J35084j06749j08634O0893J74M120j67050L43964m01385L07366
13831A133027j29233K39686k82283K73780j75774o2208j95923k43753M20115J46659
13821A124093k45883O5315k82213L27213Q2714k61140N4892j30619J15249m3178
13811H06443m3070R9940k2343J59899K14506n40091K87373j89337j689L85648
$$ plain form
13881 1192402 1091154 1040023 1738579 1137726 1391249 1132086 766945 1227241 1309269 1211920
13871 1211920 1531410 1430491 1443182 974090 1003229 1265031 1394984 1247942 1316972 1388602
13861 1388602 946362 1179684 1059413 1095641 1224317 1470711 927664 989333 1246392 1040808
13851 1040808 1076635 1095643 1127004 963789 1431528 932299 1353966 1087230 1262929 1065244
13841 1065244 1200328 1093579 984945 1045838 1046012 1050132 883082 1227046 825661 1133027
13831 1133027 1003794 1243480 961197 1234977 1059203 996995 801072 557319 977434 1124093
13821 1124093 878210 943525 661312 988525 1071239 810099 864991 734372 849621 806443
13811 806443 763373 863313 840970 1000869 1215375 675284 962657 773320 771631 1157279
13801A157279l51174K59063L22015E15180N91156m12128j13860K07431M4911K57701
13791A090391m19340P851m3297L03681k34036j42160R561J5996M63365l80418
13781F71594k1572M85008E51855K75556l28092N67797j16974k62456j37360L65238
13771I15564r4230j674q9964r0040R6423k79624O28396n37670R9848J03067J82438
13760I32534j22897j89184P2080J76544k69976K85441K63227k69762j97002C27479
13749C52298L31636n7501Q3710O0287O1756m8279j98607l6861L27507k15634k08003
13738D52309M87583k37293M6983k42425L07342j39711J84134k66098B23909M10550
13728F34459P4539J16880j51657o1222p0398B08784M27603Q9955j25667m529n901
$$ plain form
13801 1157279 806105 1065168 1387183 515180 1106336 694208 580348 787779 832690 1090391
13791 1090391 671051 678902 635605 939286 705250 563090 572651 588647 1052012 671594
13781 671594 650022 1135030 551855 827411 499319 1067116 950142 687686 550326 915564
13771 915564 821334 819660 729696 639656 736079 456455 1084851 547181 647029 750096 932534
13760 932534 809637 620453 692533 869077 599101 884542 1147769 878007 681005 327479
13749 352298 683934 626433 710143 770430 832186 783907 585300 548439 875946 660312 452309
13738 452309 939892 702599 749582 507157 814499 674788 858922 592824 223909 634459
13728 634459 708998 825878 674221 612999 542601 208784 636387 726342 600675 596146 590245
13717E90245K9848k67771M81166D07254L67529l43078J41267m2900k5852j97074
13707C07146K65071o18k54028N71855j55190k66731o1672J09242j88865J40405
13697D66615N16365C62437J68432l6493R3250k12307J47407r7188L28002j21004
13687F32536k59641J68122J77557O2084k29713j48653O8219J92005m0605A68388
13676F26887j02982j28566m3783K11026j8066B21672M40529B11103K24834j08063
13666C27874N1813M16206j58975o2809j02617n8023r4287K49622k70964J98117
13656D95957J8981r0966L8864K7484P046k36147K82340J02506B47224K53556m8769
13645D52011P3828J14408B79445L23604j43261j35316J00744K02003j96112K37562
$$ plain form
13717 590245 620093 352322 833488 407254 774783 431705 572972 530072 504220 307146
13707 307146 572217 571599 317571 889426 734236 467505 405833 515075 326210 466615
13697 466615 982980 362437 530869 494376 587626 375319 522726 425538 753540 632536
13687 632536 372895 541017 718574 780658 550945 402292 470511 662516 621911 168388
13676 626887 523905 395339 351556 562582 544516 221672 662201 211103 435937 327874
13666 327874 379687 795893 636918 574109 471492 413469 319182 568804 297840 495957
13656 495957 514938 423972 462836 490320 497366 261219 543559 646065 247224 500780 452011
13645 452011 525839 640247 279445 603049 459788 324472 425216 627219 431107 668669
13635F68669k69611p3373L88428j21513E3278L14064K72217C13532K44352L9480
13625E97364k33963K5929R8310j28525Q6026j18571K20563j15391J32099j95560
13615C68281n8307A01586M81379J12123O0720k01122A98031K57293l2602H6700
13604G01230k18153J78468k97406N8499K76600k94786R1705k12157L8869J11695
13594D34564j18113R9581K87808l41179p7855R9441J11595Q7802k13525k7965
13584C42154P033P0059Q7712A29349K60308k5133A69460K85500j15160p7982C0371
13572I5246L5192Q4312J7115Q6713j40013q5022M63258J65309k86337o8174j30224
13561B37375O9606A50212J57008e626C26413A12204K4564J17116P5357r1076K2234
$$ plain form
13635 668669 399058 325685 714113 592600 53278 367342 639559 313532 557884 597364
13625 597364 363401 389330 487640 359115 445141 326570 547133 431742 563841 368281
13615 368281 309974 101586 582965 695088 755808 554686 198031 455324 422722 86700
13604 701230 483077 661545 364139 422638 699238 404452 496157 284000 322869 434564
13594 434564 316451 416032 703840 362661 284806 384247 495842 583644 370119 342154
13584 342154 349187 419246 506958 129349 389657 364524 169460 454960 339800 261818 30371
13572 95246 130438 214750 231865 318578 178565 93543 556801 722110 435773 367599 237375
13561 237375 306981 150212 307220 -5626 326413 112204 136768 253884 329241 238165 260399
13550B60399M6024K3506P5603j37407n005j14056J27824O3607j03978m7198o2355
13539A26964J80181R144P2567J21088A20277R6353N496L17472k01832r3389K73157
13528E17534A86989K35609B6871J76770J53912B1221K70349l3193J67469A90560
13517D54274h5641B84887A30068N15473B36449L7796q1243K40224A18004J08296
13507B26300J16436B3144N2750M47449j69799A8421K44009A11140J48899r1258
13497A68781N33155A41711J39522j3736n497Q0843k5194H5986J22650J55279O9010
13486D32925G8089J51567L0597J05689h1767F3189L04607o2019A22542L04251
13476D26793A38745Q2313Q5358A03848K86237a4014A19945N64708C1264N26529
$$ plain form
13550 260399 306423 329929 405532 268125 263120 149064 276888 340495 236517 189319 126964
13539 126964 307145 316289 388856 509944 120277 216630 222126 539598 337766 244377 517534
13528 517534 186989 422598 26871 203641 357553 21221 291570 258377 425846 190560
13517 454274 -85641 284887 130068 645541 236449 274245 193002 433226 118004 226300
13507 226300 342736 23144 75894 523343 353544 18421 262430 111140 260039 168781
13497 168781 701936 141711 281233 267497 262000 342843 317649 85986 208636 363915 432925
13486 432925 78089 229656 260253 365942 -81767 63189 367796 305777 122542 426793
13476 426793 138745 221058 306416 103848 390085 -14014 119945 684653 31264 557793
13466E57793k36026A23186O6526J01767J60428A94888L03528q6358F9420O7739
13456A37159J11096K54680b30688C76358R3449J4102H6234A223M81694j20110
13446C62807j13150l8133n9255L0860J76566B1681L12553j64070L93184k37303
13436C26045n5911j24198J77222A24404j859O3428l646K5056J19627J18233b38443
13424C43572j06752m298K35648j32242J91235B23169O5122R3510L989b37095C08425
13412C14680H7824O2451M9168l1381k8896J3250p0592L7717J38307a08171A85168
13400A51381Q3811J00535m4883j5570a51483B30311J9397J6981O3381q7281j05695
13389A37094i9533j3720C18756L2980q0960A17048M5203L09162O1890B06735d9074
$$ plain form
13466 557793 321767 123186 189712 291479 451907 194888 498416 412058 69420 137159
13456 137159 248255 502935 -230688 376358 469807 483909 86234 1223 482917 362807
13446 362807 249657 211524 152269 183129 359695 21681 334234 170164 563348 326045
13436 326045 270134 145936 323158 124404 122545 185973 182327 207383 327010 445243 -238443
13424 343572 236820 232522 468170 335928 527163 223169 288291 381801 385790 -237095 308425
13412 314680 87824 150275 199443 168062 139166 152416 81824 119541 257848 -108171 185168
13400 151381 235192 335727 290844 275274 -151483 230311 249708 266689 330070 242789 137094
13389 137094 -99533 -113253 318756 351736 270776 117048 162251 471413 533303 206735 -49074
13377D28347m7198p3426n2603J67854b096A22479b9413B91649k6673j10548K22690
13366C77118C0021L18285A28043K54791o762A61687f7320D33806j68413j23422
13356A41971J51596o173H2261J98457b13411D59165r0496O0950K3315j97372K25761
13345D81323j3316A4228c7740E15427e8236B48243n631J44700A74748K34388r1200
13334C17936H1034N2268C2699J30199L0716l5343m7328K08997g937C50025A17235
13322C3835A286L7180L14198k3077j22570K669j3084o6443E3538P5612A8035K57187
13310B75222K42563j78724r8026E7818g6899E16811k37940H5359L32804K388A73598
13298a9530F8411K9589J9387P9377b70068D74086j86379i1324A34355LA2826K03446
$$ plain form
13377 428347 381149 307723 255120 422974 -2096 122479 -29413 291649 264976 154428 377118
13366 377118 30021 348306 128043 382834 376072 161687 -67320 433806 265393 141971
13356 141971 293567 287394 82261 280718 -213411 459165 368669 429619 452934 255562 481323
13345 481323 468007 14228 -37740 515427 -58236 248243 242612 387312 174748 409136 317936
13334 317936 81034 133302 32699 162898 193614 158271 110943 319940 -7937 350025 117235
13322 33835 1286 38466 352664 329587 207017 209686 196602 130159 53538 129150 18035 275222
13310 275222 517785 339061 241035 57818 -76899 516811 278871 85359 418163 420551 173598
13298 -19530 68411 98000 117387 196764 -270068 474086 287707 -91324 134355 134358 12826 216272
13286B16272d6757A31801b64366C83119G6032J79140a18706H3934J37945M5618
13276B67497b6802A63868j6594J00069j08326F7569K3756j5335M22104A14926
13265B10193b18804J06142D0775b9202A28140L65120C8211J3206h3867q261I3235
13253A80848H9347K01889j27189K6811C2806J88075J62225A5148K92786f3280
13242H7687a01906I7309B5526g65A50983N1098q2007b6337B73743e446j46017
13231a51463A3830l26J51553p7587L04582l1700A55384a88352A37092L0104L7625
13220B04821a33119l0724C8382K8576a59676d7055C55665h1047B132L24249b8415
13208a93332C14502j9517a37967F9005J36445K3187I0463g4597H1221k3653N5488
$$ plain form
13286 216272 -46757 131801 -264366 383119 76032 255172 -118706 83934 221879 267497
13276 267497 -26802 163868 147274 247343 139017 67569 91325 75990 498094 114926
13265 210193 -218804 -112662 40775 -29202 128140 493260 38211 51417 -83867 -92128 93235
13253 180848 89347 291236 164047 190858 32806 220881 383106 15148 307934 -63280
13242 87687 -101906 97309 25526 -765 150983 202081 120074 -26337 273743 -5446 -151463
13231 -151463 13830 13504 165057 87470 392052 360352 155384 -188352 137092 167196 204821
13220 204821 -133119 -163843 38382 66958 -159676 -47055 355665 -81047 2132 326381 -28415
13208 -193332 314502 294985 -137967 69005 205450 228637 90463 -74597 81221 57568 113056
13197A13056M4086J2260D0362g390B63689m6911M55273I0382A3229R6919e5927
13185I4046K60842j53183c9386A08328a44637d450o3584n5169o9507B47978G5444
13173A77388b5721A38988L31606c6026B03622a09772j8427E1618J97036g1928
13162B81207J36923A86978A4597P1259a22662C5202K8919L04733g2539A73200
13151D36462B05112a49542A55531b54030A05110B7030P580q006l453e6789B26287
13139C9849J16112f0656B31370n3284B0682O7418J20029J3012d04206a64106B83137
13127A41904a17752C7887Q6180P0162M7830c0950H950L17014A55703E4153j2916
13116D1237i9895A11704K95347A14228A6535b05427B52428h1319A67916B2656
$$ plain form
13197 113056 157142 169402 40362 -7390 263689 216778 672051 90382 13229 110148 -55927
13185 94046 354888 201705 -39386 108328 -144637 -4450 -68034 -123203 -192710 247978 75444
13173 177388 -25721 138988 470594 -36026 203622 -109772 -128199 51618 248654 -71928
13162 281207 418130 186978 14597 85856 -122662 35202 64121 368854 -72539 173200
13151 436462 205112 -149542 155531 -254030 105110 27030 34610 26604 23151 -56789 226287
13139 39849 155961 -60656 231370 178086 20682 88100 208129 221141 -404206 -164106 283137
13127 141904 -117752 37887 124067 194229 242059 -30950 8950 325964 155703 54153 41237
13116 41237 -99895 111704 407051 114228 16535 -205427 252428 -81319 167916 22656
13105A689R8033I175J88386j2268e7507C26364g9902j83594A81870J6912a16658
13093e326j05304B12672Q0826f8804A25262L67109A00283J78034q8941K53976
13083D43352j94140B6948e6227j03856C35015A58212o67L6262I1051g4720j77216
13072b51936J05520D44777j36183m9176a19257C64087q6414J2614B0325P419J68742
13061A96486L4723a9668C09893D0444a18529I9915J13968b33638C1244a47209
13050G827e3561q4600E0974K46200m8972A08236r128a23119D07054a47212C59210
13038a33180A44208B658K72076q9211I2515J94485i0308A41783a59136A53969
13027B48578E1274J07882R4722H4732K8264a79971e3238A97946J7503H5260a50965
$$ plain form
13105 1689 99722 9175 197561 185293 -57507 326364 -79902 -263496 181870 198782 -116658
13093 -5326 -110630 212672 293498 -68804 125262 492371 100283 278317 189376 443352
13083 443352 249212 26948 -56227 -160083 335015 158212 157545 193807 91051 -74720 -251936
13072 -251936 -146416 444777 308594 259418 -119257 364087 277673 290287 20325 27744 196486
13061 196486 231209 -19668 309893 40444 -118529 99915 213883 -233638 31244 -147209
13050 7827 -53561 -138161 50974 297174 248202 108236 99108 -123119 407054 -147212 359210
13038 -133180 144208 2658 274734 185523 92515 287000 -90308 141783 -159136 153969
13027 248578 51274 159156 253878 84732 112996 -179971 -53238 197946 215449 85260 -150965
13015D22161F8141a61703A96767F1532B071J79152O217P1192C3013L17596j65976
13004A84633A3217a0774A60014a4894B96943J7717H0664J72832A03768N6279M9579
12993B09626C9708a81721B77383a96815B23353r626b08556A34236d455H4384Q859
12982I3243b43114f5042H2108B3840J28284N6979A6813a23523A77421b56310D3668
12970d3734j54781R6715A32563C9604a77195k05342R3953d2961j67343D57022
12959E502K75455a00348A48721a82941a2075A86252a22134A46809a08290M9519
12949e8771C37865G2416a51516b4196A27870J38752C8806b1227j99624C23705
12938c9812C28137A17546a1911A10530j2887M1298l7347D4119d6961m4462H0880
$$ plain form
13015 422161 68141 -161703 196767 61532 2071 181223 187440 258632 33013 350609 184633
13004 184633 13217 -10774 160014 -14894 296943 314660 80664 253496 103768 160047 209626
12993 209626 39708 -181721 277383 -196815 223353 213727 -208556 134236 -4455 84384 93243
12982 93243 -243114 -65042 82108 23840 152124 209103 16813 -123523 177421 -256310 43668
12970 -43734 -198515 -101800 132563 39604 -177195 -382537 -288584 -42961 -210304 457022
12959 5502 280957 -100348 148721 -182941 -12075 186252 -122134 146809 -108290 -58771
12949 -58771 337865 72416 -151516 -24196 127870 266622 38806 -21227 -220851 323705
12938 -39812 328137 117546 -11911 110530 97643 138941 101594 44119 -46961 -91423 80880
12926A30130N1816m8733J8580p4091e8815A45837a55980B3581Q0828B3607b24652
12914D07708E8509K3241d3156F8851b74334G3197J02928q208c14473C9327L19259
12903C58586a72880Q4770a9744A88027G7941R0771b52004g51j42863q6858D4015
12891A32395c086j37351A09516b2914A53034a35178j10394P2817A64702j0076
12881A54626p7176L25702j99593a18345C64380A78006D7298d66626d737k20679
12871b25416a8403Q798j44453H3861J6427R1592a08417F7036e9650B53375a37781
12859a42485C03326C560i0871H829a20784n3118P3036D1977J00074b6437B76150
12847h4773j21636A99555K2999b07215C67686D5208L19637I3906a59537I7293
$$ plain form
12926 130130 181946 133213 151793 77702 -58815 145837 -155980 23581 104409 23607 -224652
12914 407708 58509 81750 -43156 68851 -274334 73197 176125 167917 -314473 39327 358586
12903 358586 -172880 -88110 -19744 188027 77941 168712 -252004 -751 -143614 -230472 44015
12891 132395 -3086 -140437 109516 -22914 153034 -135178 -245572 -172755 164702 154626
12881 154626 77450 403152 203559 -118345 364380 178006 47298 -466626 -4737 -225416
12871 -225416 -18403 -9605 -154058 83861 100288 191880 -108417 67036 -59650 253375 -137781
12859 -142485 303326 3560 -90871 8829 -120784 -173902 -100866 41977 142051 -26437 276150
12847 -84773 -206409 199555 222554 -207215 367686 45208 364845 93906 -159537 97293
12836B44931e9043A07475J3812L4664J77133h3304A72377f9271j7864C1105a92808
12824a80274D17269a00424H4927B5475a25707N9242o569k87163J60520A65961
12813a91097C3362J22511j9338i1428D824N4234a36220c4974c627D9824a20509
12801A93175B3075a43640j84879B05812i8262b3569H0469N9295R4670D6938O6700
12790A13638K9958k6416n1260A3259J05489e5557C16493a69379B41547G4789A5241
12778A8701J91751A7504K49379b36230j42445K9386f3357D04187M2215E6985a74086
12766c9186A20721g4756A70754B1025J78961q6608a65556A55606B342O9111Q8764
12755A60217C9816c36780J31483H6220R346J04954a32283A40020a44656B1585
$$ plain form
12836 244931 -59043 107475 121287 155951 333084 -83304 172377 -69271 -87135 31105 -192808
12824 -180274 417269 -100424 84927 25475 -125707 -66465 -73034 -360197 -199677 165961
12813 -191097 33362 155873 136535 -91428 4824 59058 -136220 -34974 -3627 49824 -120509
12801 193175 23075 -143640 -328519 205812 -98262 -23569 80469 139764 234434 46938 113638
12790 113638 143596 117180 65920 13259 118748 -55557 316493 -169379 241547 74789 15241
12778 18701 210452 17504 266883 -236230 -378675 -349289 -63357 404187 446402 56985 -174086
12766 -39186 120721 -74756 170754 21025 199986 113378 -165556 155606 2342 71453 160217
12755 160217 39816 -336780 -205297 86220 95566 200520 -132283 140020 -144656 21585
12744A68309q972a07858B7017a69310a023A75394b25300b454D5159b70878J14971
12733a55907b491A3814L2654B0815a41547C01541a76326B52456b81492a18832
12722A54370a56711j8619A50324a00026D9969h5880a7854H2870i4861j24700P1140
12711a48421O4470D571d6231A49990a4906j47425H6675L78600A80581H3658L05790
12700C89448b66346F0247J63782g1337D09399A95584a10090B29783d7156j18260
12690a65416A13462O7648d49825A77889o8883j106j4787b24547j366J8717I423
12678g154A71774a31407a968A38750a00939A87739a79228A23472D1662a41442
12667B26200F1371i4354A74552k7454e7934F6475a36577A88188h9782C01279c6836
$$ plain form
12744 168309 159337 -107858 27017 -169310 -1023 175394 -225300 -2454 45159 -270878 -155907
12733 -155907 -2491 13814 46468 20815 -141547 301541 -176326 252456 -281492 -118832
12722 154370 -156711 -175330 150324 -100026 49969 -85880 -17854 82870 -94861 -219561 -148421
12711 -148421 -83951 4571 -46231 149990 -14906 -162331 86675 465275 180581 83658 389448
12700 389448 -266346 60247 224029 -71337 409399 195584 -110090 229783 -47156 -165416
12690 -165416 113462 181110 -449825 177889 109006 107900 93113 -224547 -225913 -207196 9423
12678 -7154 171774 -131407 -1968 138750 -100939 187739 -179228 123472 41662 -141442
12667 226200 61371 -94354 174552 147098 -57934 66475 -136577 188188 -89782 301279 -36836
12655C85658A80677J90272A40937i9518F5676k8083A7582K81547a30668B39309
12644a34834j4712D5828J84619A05842C5441f771I5992K08632E8693J38683J01229
12633B98605e1124C17383A30924J10017L67102A11921A0903R7805m7734Q5862
12623A46836J02356j23975i2563E9387K23976H4768l9606J85818j1414c1609j20546
12612a52155J5475A2786J84765D4931d73447B83500c567j70911B52479a62053
12601B08603a37496A08608b2092B52337E2283K18221F297K00649p9456B7608g1884
12589a18981A78798m5612F0223K6512N4359N7013n0480J6399a91462A07787A6266
12577d7538k00323C35313A07456J24003g5969H4313b0613o1484D4572J50861K2466
$$ plain form
12655 385658 180677 370949 140937 -99518 65676 37593 17582 299129 -130668 239309
12644 -134834 -149546 45828 230447 105842 35441 -6771 95992 304624 58693 197376 298605
12633 298605 -51124 317383 130924 240941 608043 111921 10903 108708 60974 146836
12623 146836 249192 125217 -92563 59387 283363 84768 45162 230980 219566 -31609 -152155
12612 -152155 -136680 12786 197551 44931 -473447 283500 -3567 -174478 252479 -162053
12601 208603 -137496 108608 -22092 252337 52283 270504 6297 206946 127490 27608 -71884
12589 -118981 178798 133186 60223 86735 141094 198107 147627 164026 -191462 107787 16266
12577 -47538 -247861 335313 107456 231459 -75969 84313 -20613 -82097 44572 195433 217899
12566B17899J85883c6593D76135b96352M4486E4515Q6646b78892A0746P1689J480
12555H3915K29908A9825c09626C52102f8768E6358P8921C117J08257K71458c3832
12543A8277J09043c32823i2236A05931D4538J01259d81336B43329b8115m5212
12533g3327a0830r9235E6628A4545i0578E9126J09909C4973b12806H1749f212
12521E1482j3229O3449c49589A16139O1814g5270A10651m6753B244K56591c5304
12509f3083a5931D6643J47463E5902J77254b1203D4086K2839b3822D4524b2219
12497a15718J1663J5918b0094j16114B35673d7067p239o5398j3120L1645A68365
12485b52252B51168h6867A21890c57084G3841m7b15294A27735a02841a0361j46988
$$ plain form
12566 217899 403782 -36593 476135 -296352 -251866 54515 141161 -278892 10746 82435 83915
12555 83915 313823 19825 -309626 352102 -68768 56358 135279 3117 111374 382832 -33832
12543 18277 127320 -332823 -92236 105931 44538 145797 -481336 243329 -28115 -73327
12533 -73327 -10830 -110065 56628 14545 -90578 59126 169035 34973 -212806 81749 -6212
12521 51482 38253 101702 -349589 116139 177953 -75270 110651 63898 2244 258835 -35304
12509 -63083 -15931 46643 194106 55902 233156 -21203 44086 66925 -23822 44524 -22219
12497 -115718 -104055 -88137 -20094 -136208 235673 -47067 -54306 -119704 -132824 -101179 168365
12485 -252252 251168 -86867 121890 -357084 73841 73794 -215294 127735 -102841 -10361 -157349
12474a57349F5253N1625k6018J92740B3239J10198K5569a68470A03402a39477
12463B1105a54809j59293c6258A8474M19084b75828A39673b36453G9491A7024
12452d0785k1489j76672J09354B42515d3777l96645b7543E3445B3066c08895B39295
12440A9438b66488J02236D7469L18158c0215C65636A5877c03299B58349a53001
12429A37967g9894c5699l4648A48924a46163A07910a75712a624A32693e2253A65996
12417A45646a22071A73362J89390a0159E18898A14892a0911j65972A78301q4531
12407I3770b36960I5527a33039k76003B48294a00782A07544K58528d4511F7417
12396g3092b4327q2094F3144d3115B99570b01605d615B91729G5944i4220A32367
$$ plain form
12474 -157349 65253 116878 90860 283600 23239 133437 159006 -168470 103402 -139477
12463 21105 -154809 -314102 -36258 18474 437558 -275828 139673 -236453 79491 17024
12452 -40785 -62274 -238946 -129592 242515 -43777 -440422 -27543 53445 23066 -308895 239295
12440 19438 -266488 -164252 47469 365627 -30215 365636 15877 -303299 258349 -153001
12429 137967 -79894 -35699 -70347 148924 -146163 107910 -175712 -1624 132693 -52253 165996
12417 145646 -122071 173362 362752 -10159 518898 114892 -10911 -176883 178301 93770
12407 93770 -236960 95527 -133039 -409042 248294 -100782 107544 366072 -44511 67417
12396 -73092 -24327 -106421 63144 -43115 299570 -201605 -4615 291729 75944 -94220 132367
12384a28364J9805j77204h1252h971D0130P2848b19399A34638c14600B5252b4188
12372B19743J5505b03168R5129r4961B0502H423K31930c4223j64697E8445r533
12361D8912c04081Q5846B09542b11323j62628a7247n615k6516A58756b47208A29351
12349B30033D6859A6966a12521B10864a93607d7000C0900c8544E6240j6821J22912
12338A62331a30207B98239a29097F6716J88849c3791A09486l5165a83656Q6959
12328i6697A4985c28185j30041a70356g8224C29170G3588J71k5100J5043L01551
12317C65253a3732l21647B48123b81661A21663m891f9046G5528b67344A84861
12306C82654a99270A75495O0221a56891K2163A97883b38701A2550i7484M2885
$$ plain form
12384 -128364 -108559 -285763 -81252 -8971 40130 112978 -219399 134638 -314600 25252 -24188
12372 219743 235248 -203168 -108039 -203000 20502 8423 240353 -34223 -198920 58445 48912
12361 48912 -304081 -218235 209542 -211323 -373951 -17247 -22862 -49378 158756 -247208 129351
12349 230033 46859 16966 -112521 210864 -193607 -47000 30900 -38544 56240 39419 162331
12338 162331 -130207 298239 -129097 66716 255565 -33791 109486 74321 -183656 -96697
12328 -96697 14985 -328185 -458226 -170356 -78224 329170 73588 73759 48659 63702 365253
12317 365253 -13732 -335379 248123 -281661 121663 116772 -69046 75528 -267344 184861
12306 382654 -199270 175495 235716 -156891 -134728 197883 -238701 12550 -97484 -54599
12296e4599K1641p9357k00225O6050A31951J43916a24341B3986b21892P5380K0650
12285a25862A39949c98309a44752B9029J44625j9753k5282J27040A05847J93864
12275B99711o2588E7452e6402C02223A17895J97679j32458O2628A15969B6341
12264a63123b6135A3972a38136f8318j45207A14462J54619j14778L0570b31282
12253g4329A50756M3480e771A2104a81624B76001j02166b69129B21083K08526
12243D29609K863A55528a07085G3326a63415D2697a35850B34739E606N8545a1973
12231d0636A39589K569K85959H3882P7304f4297B26537G6604J4078Q4136f8796
12219I2096K67293H3277a26300B38346J02767D9862P9344b6679j23673A92300
$$ plain form
12296 -54599 -32958 -112315 -312540 -246490 131951 275867 -124341 23986 -221892 -146512 -125862
12285 -125862 139949 -398309 -144752 29029 173654 153901 128619 255659 105847 299711
12275 299711 237123 57452 -56402 302223 117895 315574 183116 245744 115969 26341
12264 -163123 -26135 13972 -138136 -68318 -213525 114462 269081 154303 184873 -231282
12253 -74329 150756 194236 -5771 12104 -181624 276001 173835 -269129 221083 429609
12243 429609 432472 155528 -107085 73326 -163415 42697 -135850 234739 5606 64151 -11973
12231 -40636 139589 142158 428117 83882 161186 -64297 226537 76604 90682 174818 -68796
12219 92096 359389 83277 -126300 238346 341113 49862 129206 -26679 -150352 192300
12208A93957g7061B57172j2554a08199B00605F5267M0218E1662J64619n0139g767
12196H9608J47335j11070J64988K99849A15029A0695j374a71836A02820C4660
12185G6056O4814g5144A80703a82038F3222d9277p3618M3427j56298H7533f2771
12173A17297h3288k25034D2560N9970K13305H5735a0866F2049m464B5231N6308
12162H1539K10133f4110B07589c0384F6329I616L82283a46597A70199l3832h9768
12150d8052F5926a53991l7784A89514I1301m4322j3741J03861A2579K53451D6451
12138A61814J27419o831o4079a86460C09750A27679d0441C9885J91477j06909
12128A24453a57707k4476D63b23884G3437L4782K26499b62690B55789j12689m2776
$$ plain form
12208 193957 -77061 257172 244618 -108199 200605 65267 105485 51662 216281 166142 -7767
12196 89608 236943 125873 290861 590710 115029 10695 9321 -171836 102820 34660
12185 76056 140870 -75144 180703 -182038 63222 -49277 -122895 -79468 -235766 87533 -62771
12173 117297 -83288 -308322 42560 102530 315835 85735 -10866 62049 57585 25231 81539
12162 81539 291672 -64110 207589 -30384 66329 9616 391899 -146597 170199 136367 -89768
12150 -48052 65926 -153991 -191775 189514 91301 46979 33238 137099 12579 266030 46451
12138 161814 289233 282402 218323 -186460 309750 127679 -40441 39885 231362 124453
12128 124453 -157707 -182183 463 -223884 73437 108219 334718 -262690 255789 143100 100324
12117A00324a87289A45703C1405c391r1012A08975J22654c3828B00988k668a95648
12105b65782C695c80565H1974d8705A41176c1411o1475A22467n0765K09373M1914
12094C22989A28736c3979n3165j49783a430I6980i1805B05016J42545c31349G7103
12082a52360N8642A22235m9353b17951J887F5926a36461K9522o9898A8432Q0868
12071I9300K2331J8568b37959e2208j3163B26285a40219c6299k81951I2727A3806
12059I995M3982e7422C56416L05244L7418k72854A32454b57319A08046f9321A09587
12047C41288a57811j7031g7344D8386J20378b43865J08141C18435f9539r6723
12037a66262A1779a40465N5359j32061d5799F5048a25014j49123A28085a15128
$$ plain form
12117 100324 -187289 145703 31405 -3391 -94403 108975 231629 -33828 200988 198320 -195648
12105 -265782 3695 -380565 81974 -48705 141176 -31411 -92886 122467 71702 281075 322989
12094 322989 128736 -33979 -87144 -236927 -1430 96980 -91805 205016 347561 -331349 77103
12082 -152360 -93718 122235 72882 -217951 -216064 65926 -136461 -106939 -176837 18432 99300
12071 99300 121631 140199 -237959 -52208 -65371 226285 -140219 -36299 -318250 92727 13806
12059 9995 53977 -57422 356416 661660 699078 426224 132454 -257319 108046 -69321 109587
12047 341288 -157811 -174842 -77344 48386 168764 -243865 -135724 318435 -69539 -166262
12037 -166262 11779 -140465 -85106 -217167 -45799 65048 -125014 -274137 128085 -115128
12026A47341e3261j08946F131M5911a57643C1369b9936B55359a29953c3350B38011
12014C31603a60862c4302H8772a14602A57509D9118a63536A80847e9183m0790
12004i9973m328b7765D8946B2961d88047B80237a12518D28738c98869f9013A75494
11992a32324M633A3116a02263A5512c2067A62437e1725G8492A3135i2395b1776
11980A29488J5561a30737l0303a996j86410h2177C02823I5663b53329D6181a9103
11968E1494i8547c0807C3963c12777Q1102B11097e8890r5410a2934k63226H2296
11956b29750a12518p8722A00517K51782a11893K9691k28414B58685h8832M2051
11946d6781R671J279G0008i8724B68857G1279a18827q8301P7302L5542C5567g7510
$$ plain form
12026 147341 -53261 -162207 6131 52042 -157643 31369 -29936 255359 -129953 -33350 238011
12014 331603 -160862 -34302 88772 -114602 157509 49118 -163536 180847 -59183 -99973
12004 -99973 -104301 -27765 48946 22961 -488047 280237 -112518 428738 -398869 -69013 175494
11992 -132324 -127691 13116 -102263 15512 -32067 162437 -51725 78492 13135 -92395 -21776
11980 129488 145049 -130737 -161040 -1996 -188406 -82177 302823 95663 -253329 46181 -19103
11968 51494 -98547 -30807 33963 -312777 -231675 211097 -58890 -154300 -12934 -276160 82296
11956 -229750 -112518 -191240 100517 352299 -111893 -82202 -310616 258685 -88832 -46781
11946 -46781 -37110 -35831 70008 -98724 268857 71279 -118827 -207128 -129826 -94284 35567 -77510
11933b28941A04822a60277B07013b01825B37234I0591M7514a07641a8671A22125
11922f0433H9128j3700a3942f910k17880I290b22396g7962r145A5866a48532e7636
11909d8948j88633D93466B9411J3894R5184C3487A0776R6439n1934J00306L870
11898A59457g36p4934I7544k8267L286j3455c94392d9454o6204C8936J68134H2885
11885a86916A81930F6747m682J96041b960j66479N79A23803a62615k45918A13930
11873B18897r7409a2112j1283G2401B0641N5214c73979M9288B04771a75654A42466
11861b35506I3909b30643K35i7940a8738k61849f9618C02629A1152e6281j942
11850e8223j50003B11829d9543k86117j0298a22341m9585d7806J5533A06853K2693
$$ plain form
11933 -228941 104822 -160277 207013 -201825 237234 90591 138105 -107641 -18671 122125
11922 -60433 89128 75428 -13942 -6910 -224790 9290 -222396 -77962 -87107 15866 -148532 -57636
11909 -48948 -237581 493466 29411 43305 138489 33487 10776 107215 55281 155587 159457
11898 159457 -736 -75670 97544 69277 72563 59108 -394392 -49454 -115658 38936 207070 82885
11885 -186916 181930 66747 62065 258106 -2960 -169439 -168860 123803 -162615 -408533 113930
11873 218897 121488 -12112 -23395 72401 20641 75855 -373979 -324691 204771 -175654 142466
11861 -235506 93909 -230643 -230408 -97940 -18738 -280587 -69618 302629 11152 -56281 -58223
11850 -58223 -208226 211829 -49543 -335660 -345958 -122341 -171926 -47806 -32273 106853 129546
11839A29546d3989k34932j46553D6896c58180d9766k43586G2580c53282M4233
11829c09049A11559d522l5432n7988B77817d09726c676E4660M15734F8012J10465
11818A78477h8164k26685J45553m1177f4983A20023a89126L7245l04796A07453
11807h0612B33688c45995D4457J24142l7791C2509h7219G0876c27922C17261b71979
11795D03091a82771l8116c4280A86289J21711F0313a42037D8578E384a27199B05144
11783a4999q4685n9761g4012n3918B45437b32962N138C03017g8623G9119a51523
11771i7095F3518a2804p9012B45188A3690K09827j06122a94240B7735a8179j44516
11760a62695I8031l1019j4934Q4352A3810a68446A6040c0985D9892A8654c33194
$$ plain form
11839 129546 -43989 -278921 -425474 46896 -358180 -49766 -293352 72580 -353282 -309049
11829 -309049 111559 -4522 -39954 -97942 277817 -409726 -3676 54660 470394 68012 178477
11818 178477 -88164 -314849 -169296 -210473 -64983 120023 -189126 -151881 -456677 107453
11807 -80612 233688 -345995 44457 168599 130808 32509 -87219 70876 -327922 317261 -271979
11795 403091 -182771 -220887 -34280 186289 308000 60313 -142037 48578 5384 -127199 205144
11783 -14999 -99684 -159445 -74012 -127930 245437 -232962 -227824 303017 -78623 79119 -151523
11771 -97095 63518 -12804 -91816 245188 13690 223517 117395 -194240 27735 -18179 -162695
11760 -162695 98031 67012 52078 136430 13810 -168446 16040 -30985 49892 18654 -333194
11748B30999b07134m6554a25409G2124b10297F8658J32064a33965R882A510J48945
11737A50455c04160d5763A06112H201L97123j08944E6993N9026C5778b2790j04495
11726a27285a3092l07264a41542A7225d15243K6885Q7063M4327d3998j83521A79444
11714b00085A14677O9757a17770N5826J9113k00465m8520G4300e3060B40771i6384
11702F0187i1961d1854p2988L1297D9829G997d383k00717O7220A87120J72165
11691C59285b54514j00687a16522E3724K885J32686R3542l6810a9541B74095n7850
11680B16245b53436D0347Q9208f1787M618A54219c01989J26410O8408k18463g8089
11668b29507A55605a0370A15161a7097j69930I9447m1140M0779J65474B7983c06842
$$ plain form
11748 230999 -207134 -253688 -125409 72124 -210297 68658 200722 -133965 -124083 1510 150455
11737 150455 -304160 -45763 106112 8201 405324 296380 56993 116019 35778 -22790 -127285
11726 -127285 -13092 -320356 -141542 17225 -415243 -388358 -301295 -256968 -43998 -227519 179444
11714 -200085 114677 184434 -117770 -61944 -42831 -243296 -291816 74300 -53060 240771 -96384
11702 60187 -91961 -41854 -114842 -83545 49829 7997 -4383 -205100 -137880 187120 359285
11691 359285 -254514 -355201 -116522 53724 56609 189295 282837 246027 -19541 274095 216245
11680 216245 -253436 40347 129555 -61787 -57169 154219 -301989 -175579 -107171 -325634 -78089
11668 -229507 155605 -10370 115161 -17097 -187027 99447 58307 99086 264560 27983 -306842
11656a58235p2795i9316j4986j66415A26668K6462J78149b50475f0962i190l37972
11645c47162i8528j39144P3623g2854G1922K3243d1953P985A08905J748J27076
11634B37729a77029B00607b46364M9714C2017J28043d12309a07918a100j68953
11624a70053G0792k3735K3152b59250J28440A89453a55262A19644b42489a08342
11613a37529A8760a6698A8713a58834B52583c63988a57884A56401a98836C10704
11602A55379g340j69239B7795Q5432Q974Q377K03729c46554A61355p7643b08912
11590a34491m2335j31833c2513A65756d3835A0931e8570A60536c56652D6342a56875
11578B101h8419k44891a54274J5496D71128g8527A98213i728A39169c92756a56280
$$ plain form
11656 -158235 -231030 -99316 -114302 -280717 126668 153130 331279 -250475 -60962 -9190 -347162
11645 -347162 -98528 -237672 -164049 -72854 71922 95165 -41953 -33968 108905 110653 237729
11634 237729 -177029 200607 -246364 -196650 32017 160060 -412309 -107918 -1100 -170053
11624 -170053 70792 47057 70209 -259250 -130810 189453 -155262 119644 -242489 -108342
11613 -137529 18760 -16698 18713 -158834 252583 -363988 -157884 156401 -198836 310704
11602 155379 -7340 -176579 27795 113227 122201 130578 334307 -346554 161355 83712 -208912
11590 -134491 -176826 -308659 -32513 165756 -43835 10931 -58570 160536 -356652 46342 -156875
11578 2101 -88419 -333310 -154274 -138778 471128 -78527 198213 -9728 139169 -392756 -156280
11566A26123d22200K08872D6637A9035J96457f4712j67466a11022B70461b67010
11555a92502i1174B16269C7279a6231k84365K1296j68414K18826B63221h7798
11544f8924J08r7384H3959a84896C10052H5430a05418p1783c8812D30707A96558
11532a02318I4489l9024B2103J35670A7698a15375E5407c4325A53376a63525C79642
11520b0685q1139F9311d9301a193k23524A61952d3433c69B76390n5311j03115
11509A17964L2749a1629B16236P8253l8967p6172R0170d80A31518a4147C72686
11497A46777D5249g7997J0847F756L21810j1360j10466K08755F4961g7416B6826
11485g4607A69570q1950b4906B64488E4733b37731j39A31647a80558D5356J42961
$$ plain form
11566 126123 -422200 -213328 46637 19035 215492 -64712 -232178 -111022 270461 -267010
11555 -192502 -91174 216269 37279 -16231 -300596 -279300 -447714 -228888 263221 -87798
11544 -68924 -68816 -166200 83959 -184896 310052 85430 -105418 -177201 -38812 430707 196558
11532 -102318 94489 55465 22103 157773 17698 -115375 55407 -34325 153376 -163525 379642
11520 -20685 -101824 69311 -49301 -1193 -224717 161952 -43433 -369 276390 221079 117964
11509 117964 150713 -11629 216236 294489 255522 179350 269520 -480 131518 -14147 372686
11497 146777 45249 -77997 -67150 6756 328566 317206 206740 415495 64961 -77416 26826
11485 -74607 169570 87620 -24906 264488 54733 -237731 -237870 131647 -180558 45356 188317
11474A88317o8549J37093K5466E6112Q6442e6172F8524a17230D8572N00955k72780
11463B76747a07728G9010P891c8253D3871f7601E452M48904A34501c80417A08836
11451e2488A20135b3049l7090l2445D1252b5592B31445f9728j66454A11350J62676
11440B74026m37a92159j96619e9630C6914J30255B1602O6411a2695j37460c2683
11428I3518e4799B01519g8011A27474a53342o1208B12867a31199j7121j88949
11418c37269b1165j10677A38333a39222M8728A5505L0273J10421J7653a19248
11407C3499J00721b83816m6760a26571A1405A399c26749B48223g6081D39183H5685
11395D03895c27796D70610j47942a16932l3278B86112I6418g2141D4622J27813
$$ plain form
11474 188317 119768 256861 282327 56112 142554 -56172 68524 -117230 48572 549527 276747
11463 276747 -107728 79010 86901 -38253 43871 -67601 5452 454356 134501 -380417 108836
11451 -52488 120135 -23049 -60139 -92584 41252 -25592 231445 -69728 -236182 111350 274026
11440 274026 273589 -192159 -388778 -59630 36914 167169 21602 88013 -12695 -150155 -32683
11428 93518 -54799 201519 -78011 127474 -153342 -214550 212867 -131199 -148320 -337269
11418 -337269 -21165 -131842 138333 -139222 -90494 15505 45778 156199 173852 -119248
11407 33499 134220 -283816 -330576 -126571 11405 1399 -326749 248223 -76081 439183 85685
11395 403895 -327796 470610 322668 -116932 -150210 286112 96418 -72141 44622 172435
11385A72435i3061G6024a44195F5477C2471J68197r1101b41157L1522d7043a9950
11373A41330a05709M9851A01194j5306C1614i6208h610A64593G0204d7409j01145
11362a48554k6010E7789M8350b0807j38852P1594a723A72696M2182F0119a46782
11350c38661a34161p8219E0117Q8814b28580A35613b839j20969m9713A77852C18
11338a51901n1301h8528k4603j09519P9418D4475K49395o6564h9208n51324A45200
11326h1433k2446j72690A38594m2006c2343F452g6787j69469e4239j05527a2896
11314h5918j6502C3400J09444d8330B12466I7338N6679i9894E5989a22929q6908
11303b09837A20035N4421I11M09360d0409j82922A42379o33l193a55371B95396
$$ plain form
11385 172435 -93061 76024 -144195 65477 32471 200668 109567 -241157 -209635 -47043 -19950
11373 141330 -105709 -55858 101194 85888 31614 -96208 -8610 164593 70204 -47409 -148554
11362 -148554 -174564 57789 106139 -20807 -159659 -88065 -1723 172696 214878 60119 -146782
11350 -338661 -134161 -212380 50117 138931 -228580 135613 -2839 -123808 -173521 177852 318
11338 -151901 -203202 -88528 -113131 -222650 -143232 44475 293870 227306 -89208 -640532 145200
11326 -81433 -103879 -276569 138594 96588 -32343 6452 -76787 -246256 -54239 -159766 -12896
11314 -85918 -102420 33400 142844 -48330 212466 97338 154017 -99894 55989 -122929 -209837
11303 -209837 120035 174456 911 410271 -40409 -223331 142379 141746 138553 -155371 295396
11291b25402f7563A0652K5778a5129l39281D5364J68000f1168K9849A46923N1423
11280A98346g202A42407f60j66253I5280a81042A72625p9162a36224q4113j34945
11269c55282J38098M5230D36195d48475a61826b5962r410l11219J07357E2952
11258B39241e8697G2748f735A2303i3664j70328A90689a58658J7816f9007C10096
11246E2634k2487a1979j39862L5400o4092P4447j2474e0800A71404b344A4110
11234A10873a9209A73157b42123e7505A92783k7920P9637h5141A66814B5533a46131
11222B24865f8832j06423j30567a2591o0440a0252A9182b43604j2035D4992i9319
11210b64746j41029A51159a9597m6898m8988G6854g0493r8141G3742h0354A95255
$$ plain form
11291 -225402 -67563 10652 36430 -15129 -354410 45364 213364 -61168 -31319 146923 198346
11280 198346 -7202 142407 -660 -166913 95280 -181042 172625 93463 -136224 -220337 -355282
11269 -355282 -217184 -171954 436195 -448475 -161826 -25962 -35372 -346591 -239234 52952
11258 239241 -58697 72748 -6735 12303 -93664 -263992 190689 -158658 -140842 -69007 310096
11246 52634 30147 -11979 -151841 -116441 -180533 -106086 -118560 -50800 171404 -2344 14110
11234 110873 -19209 173157 -242123 -57505 192783 164863 244500 -85141 166814 25533 -146131
11222 224865 -68832 -175255 -305822 -12591 -73031 -10252 19182 -243604 -255639 44992 -99319
11210 -264746 -405775 151159 -19597 -66495 -115483 76854 -70493 -168634 73742 -80354 195255
11198C9107a20873e3260F197a63160J1084d7539B9379b99629J36594B32399i261
11186g7479l67663J53930B00779L0625a51413H6420K07307f614n7922j3475l24364
11175d02375a01009k4381D16992H8611J30733a89285c2878j63817G2843b1316
11164C16458b8266B12983a84025g6867A19558b13856D1941g9382k317j9181r0185
11153a91065A21151f2832r0710C2031J52985b9552A29707f2702b8320d777A49256
11141d5407B684O439b28986A53291b41463J09802B82774b38545B52591a77467
11130G7640O1778a41769I7384a52726b2953l4059p5850O6284B6404L0219k3363
11119C3260J11867I478J11889P848N460c78889B07656l7399a55419A0741a83870
$$ plain form
11198 39107 -120873 -53260 6197 -163160 -152076 -47539 29379 -299629 -163035 232399 -9261
11186 -77479 -445142 -291212 200779 231404 -151413 86420 293727 -6614 -64536 -78011 -402375
11175 -402375 -101009 -125390 416992 88611 219344 -189285 -32878 -196695 72843 -21316
11164 316458 -28266 212983 -184025 -76867 119558 -213856 41941 -79382 -81699 -100880 -191065
11153 -191065 121151 -62832 -153542 32031 185016 -29552 129707 -62702 -28320 -4777 149256
11141 -45407 2684 9123 -228986 153291 -241463 -131661 282774 -238545 252591 -177467
11130 77640 139418 -141769 97384 -152726 -22953 -57012 -132862 -66578 26404 56623 33260
11119 33260 145127 9478 121367 129215 134675 -378889 207656 170257 -155419 10741 -183870
11107D9641g5436F08202j65458A49916L19315B5885c8124D5000j389J6428M97734
11096E57773k61491A45272J35022b819B16143b668A87340n1710K89912a00842
11085I7165J93520Q1321D8985a84382c0426B82085l5266a4902l054I7698L19085
11074D16783A86557L10686B12895G1176L03826j74659M63005D5546K52424j41997
11064A55973J31698K186K751J46589J66791O378j37900l8330o1841j0410L81287
11053G45172C57873J15029o2927K49515K04520l23693k2643L21173D02272N5235
11043D57507L63965k95297l3857K80829j37847j3822k00998N0592J42236M05889
11033A019197m88592R5974j53027K76482q6198J00404o4924j02961j3989k38190
$$ plain form
11107 49641 -75436 608202 442744 149916 469231 25885 -38124 45000 43611 60039 557773
11096 557773 296282 145272 280294 -2819 216143 -2668 187340 135630 425542 -100842
11085 97165 290685 372006 48985 -184382 -30426 282085 246819 -14902 -17956 97698 416783
11074 416783 186557 497243 212895 71176 375002 200343 663348 45546 297970 155973
11064 155973 287671 289857 292608 439197 605988 612366 474466 436136 374295 363885 745172
11053 745172 357873 472902 409975 659490 864010 540317 517674 838847 402272 457507
11043 457507 821472 526175 492318 773147 635300 621478 420480 471072 613308 1019197
11033 1019197 530605 626579 473552 750034 663836 764240 699316 596355 582366 344176
11023C44176M51492k41587M1570k69560L31290K16465l33391B42747L58662P511
11013F08920M1082l21006K36513j89041L91798M4406l7361j83940Q7857j00871
11003E78357q8906K79082L9802k72614J50473P0701k26891B41918M83666k68551
10993D57033L1198K50005n9557R6945l16834M52829r4018L0832J69413j17989
10983H99857J21135k56730L69212k31113M06069k60659K87977J13802M49979M04004
10973B303533m5044M14498n7326J60812r7660l92165Q609m88691o46365k22707
10963I37494L01708r6097k03573j73235p3633M89178m00230N717O7304C45391
10952C37792m9857M1130j58378M04983e3793D13601k05190r6381R0129a03515
$$ plain form
11023 344176 795668 554081 595651 326091 657381 873846 540455 242747 601409 608920
11013 608920 650002 328996 565509 376468 768266 812672 775311 591371 679228 578357
11003 578357 489451 768533 808335 535721 686194 756895 530004 241918 725584 457033
10993 457033 488231 738236 678679 775624 458790 911619 817601 848433 1017846 899857
10983 899857 1020992 764262 1133474 902361 1308430 1047771 1335748 1449550 1899529 2303533
10973 2303533 2258489 2672987 2615661 2776473 2678813 2286648 2295257 1806566 1160201 937494
10963 937494 1239202 1143105 939532 766297 692664 1181842 781612 787329 854633 345391
10952 337792 287935 329065 170687 575670 -53793 413601 208411 112030 202159 -103515
10941C44228I7967M24612j31944A61961O8340E9679L76999E4475a78186A2176
10930I6273a21929A97914i7199G5074e275k80670I5841b10414i3050k4921A81014
10918I9160O2612J4351g2446q4196d3945r8568A9649a74536N5110K993j32254
10907b48687b5693l0840C53952i7159b979k50256B19629n8071a9635I9914k3305
10896G6609e31331b51487A20667c0686j85745G3157B9992d3542l4982n6747A21670
10884c44277a0903l07295B79732c518m5656A71942K32808b67803o4575A68652
10873a2871D95214b49853R8011A83245f1751a8910E0844i7302j5178o7968E5119
10861a78202A68736C7639K8524K8197P058l0065L7675J4877K05229r9320i1388
$$ plain form
10941 344228 97967 522579 390635 161961 230301 59679 436678 54475 -178186 12176
10930 96273 -121929 197914 -97199 75074 -5275 -285945 95841 -210414 -93050 -117971 181014
10918 99160 161772 176123 -72446 -156642 -43945 -142513 19649 -174536 -119426 -116433 -248687
10907 -248687 -25693 -56533 353952 -97159 -2979 -253235 219629 161558 -19635 99914 76609
10896 76609 -531331 -251487 120667 -30686 -216431 73157 29992 -43542 -78524 -135271 121670
10884 -344277 -10903 -318198 279732 -3518 -49174 171942 404750 -267803 -332378 168652
10873 -12871 495214 -249853 -151842 183245 -61751 -18910 50844 -97302 -112480 -180448 55119
10861 -178202 168736 37639 66163 94360 101418 71353 109028 123905 329134 229814 -91388
10849A61194c51165O3935E2839h3545m9781A39447P1583q7830m0898J66056a32050
10837b32632e5318k1592A07608d16241A801K98101H5526i4988q7013I4529C7347
10825A99644b0133l6441r2655j66061J44904e0430C9404a8748j76155A20683d6071
10813H8820b98612c9387k1248j29578k08192a60462b9752r9996k54634d7269A36824
10801a26359e7459J1113A15878K8668b79843f5359A14640R3381p3564J41379b36221
10789d54575B4417a22995k02013h8272K0876K5904A43570h9494k84677B79260
10778c45770C05928j21084R095b140k81405A42861M5285m8466K33362G9583K61096
10767C40679a14997j86247M1005K9515M8953B87378F6754b78444P0895H4995b45709
$$ plain form
10849 161194 -351165 -287230 52839 -83545 -133326 139447 211030 123200 82302 248358 -132050
10837 -232632 -55318 -76910 107608 -416241 1801 299902 85526 -94988 -182001 94529 37347
10825 199644 -20133 -56574 -149229 -315290 -170386 -50430 39404 -18748 -194903 120683 -46071
10813 88820 -298612 -39387 -60635 -190213 -398405 -160462 -29752 -129748 -384382 -47269 136824
10801 -126359 -57459 -46346 115878 144546 -279843 -65359 114640 208021 134457 275836 -236221
10789 -454575 24417 -122995 -325008 -88272 -67396 -41492 143570 -89494 -374171 279260
10778 -345770 305928 184844 193939 -2140 -283545 142861 188146 139680 373042 79583 340679
10767 340679 -114997 -301244 -260239 -230724 -181771 287378 66754 -278444 -207549 84995 -245709
10755E5302L25485h4945G2394L9551a22842A94414A3745K97493a97591B78080
10744a92224b2922A84123C0479a46701I0366c41266F2193b05058j3940d9094j38630
10733a87724g0569k516L5060p7225j15232A03582b92228f1541b136G7014a36474
10721h2036n6679O4968A94334l0687b45407J17968J3635q1520d9268q9018A35666
10709A83806D4648Q9970b3797B404a02208L0020j92684g314B22757f1600k29132
10698b90732J3650f6951H4051g8702J9689n2412j15233H8272a45566K5186k7911
10687a48291i513k73642A02994c6196j78924G691J16740i1172l27124a07748M8210
10676e9538j4787j55300k32501a19967J4493G143L7464e4775p1217B26799E6516
$$ plain form
10755 55302 380787 -84945 72394 111945 -122842 194414 13745 311238 -197591 278080
10744 -192224 -22922 184123 30479 -146701 90366 -341266 62193 -205058 -218998 -49094 -187724
10733 -187724 -70569 -73085 -38025 -115250 -230482 103582 -292228 -61541 -2136 77014 -136474
10721 -82036 -138715 -73747 194334 163647 -245407 -127439 -113804 -195324 -49268 -138286 135666
10709 183806 44648 134618 -23797 2404 -102208 -72188 -264872 -7314 222757 -61600 -290732
10698 -290732 -277082 -66951 84051 -78702 -59013 -111425 -226658 88272 -145566 -120380 -148291
10687 -148291 -9513 -283155 102994 -36196 -215120 7691 124431 -91172 -418296 -107748 -59538
10676 -59538 -74325 -229625 -462126 -119967 -105474 7143 44607 -54775 -125992 226799 56516
10664a97843M0040c5550k35911L3593j13874a24436b5663o3422E4197J33086l9672
10653A47611L4866a18400A38563a40668B62619c61393Q6740g1400c4524A78878
10642D7782c00486K5172j09596b456m83591B4000a60066p7717C83662D1081J6090
10631E7171K2039a71424l2520q5603b9570q8435A36169l9716F014J38981b18137
10619c0421j83771j92187H3923b87658n4561M2482A41393b41087g6254A71961
10608b17988k340A7359a46529C51015G981M5732d07055J74656e034A29277k7143
10597A02134J2519K07125g7291P567j00575k06181J804M8698B8313J315Q6769
10586A16397d8098C8760a5695o3817B80026c09870a24492B1123a7860l63081c3812
$$ plain form
10664 -197843 -157803 -35550 -271461 -237868 -351742 -124436 -25663 -89085 54197 187283 147611
10653 147611 182477 -118400 138563 -140668 262619 -361393 -274653 -71400 -34524 178878
10642 47782 -300486 -275314 -384910 -2456 -486047 24000 -160066 -237783 383662 41081 57171
10631 57171 79210 -171424 -203944 -289547 -29570 -118005 136169 96453 6014 144995 -218137
10619 -30421 -214192 -406379 83923 -287658 -342219 -299737 141393 -241087 -76254 171961
10608 -217988 -220328 17359 -146529 351015 7981 53713 -407055 -232399 -5034 129277 102134
10597 102134 114653 321778 -77291 -69724 -170299 -376480 -374676 -325978 28313 29628 116397
10586 116397 -48098 38760 -15695 -79512 280026 -309870 -124492 21123 -17860 -380941 -33812
10574C1555a648o6760o2530J9292A02684a27283j201A59394J75309a69515c8922
10562a13616B39192b2999n4984k139j24417P5306O79A62069e8298j55008B7735
10550a94527c0315B94827l3382a35958l2441I3185N5401l1069a53056A05084m1987
10539F3097c2802D1885f3849F4931K9144L8808a26705j41163F4181b249E8609
10527A86745A9246O5827b94317h3031E49a16873j59216A80182a26091j21681C725
10515F2445h2009j7966j01086A06849M862I889O869b5860l25465a61810k37680
10504c99490G3934J41437c1575j6628A18227a16346j48685b3498M536j09426d7562
10492h6672L4595m180A16709P5639N0631n4737g0834d261j08200l43146B78859
$$ plain form
10574 31555 -1648 -68408 -130938 -111646 102684 -127283 -128484 159394 334703 -169515 -38922
10562 -113616 239192 -22999 -77983 -80122 -204539 -129233 -128554 162069 -58298 -213306 27735
10550 -194527 -30315 294827 261445 -135958 -168399 93185 148586 117517 -153056 105084 63097
10539 63097 -32802 41885 -63849 64931 94075 132883 -126705 -267868 64181 -2249 58609
10527 186745 19246 85073 -294317 -83031 549 -116873 -276089 180182 -126091 -247772 3725
10515 62445 -82009 -99975 -201061 106849 111711 9889 16758 -25860 -351325 -161810 -399490
10504 -399490 73934 215371 -31575 -48203 118227 -116346 -265031 -23498 -18962 -128388 -47562
10492 -86672 -52077 -56257 116709 192348 242979 188242 -70834 -4261 -112461 -455607 278859
10480B47008b83908O4512D4569J82846b47631j45804c6062k5425D6680e374n3235
10469e8609B6572K4177a4996G4282b4276C75501g8622p6311A11223i1724b4452
10457B58901a84869L6084q8949D23272b3649A14326j7278j3094a34312B46912
10446C0315K13968r2751a82441L342A23680d43990e2913j31763c4758p173k7730
10435f9661a8712r0101j80281A58894L3150E8843b08997r1912A93218A2726P8058
10424I0784p039l3130J72701j7122a50870F935J39118i1177m69197D0260R736
10413D9996A8953a64033r1018M8878I9195l0951a66349O4266A42306O2799b35872
10401d11491J72101d0556C16108A50083N3327E9452J00379p4661Q1576h0218L5321
$$ plain form
10480 247008 -283908 -219396 44569 227415 -247631 -393435 -36062 -61487 46680 -5374 -58609
10469 -58609 26572 50749 -14996 74282 -24276 375501 -78622 -154933 111223 -91724 -24452
10457 258901 -184869 -148785 -237734 423272 -23649 114326 97048 83954 -134312 246912
10446 30315 244283 151532 -182441 -179099 123680 -443990 -52913 -184676 -34758 -41931 -69661
10435 -69661 -18712 -108813 -289094 158894 192044 58843 -208997 -300909 193218 12726 90784
10424 90784 83745 50615 223316 206194 -150870 6935 146053 -91177 -560374 40260 49996
10413 49996 18953 -164033 -255051 -206173 99195 68244 -166349 -102083 142306 205105 -235872
10401 -411491 -239390 -40556 316108 150083 203410 59452 159831 85170 166746 -80218 -44897
10390d4897C93024I7761N4193o5329J38433c2575j52908A74480c31789D75665
10379C17964p9265B3755d7502B11331J12465a0172B96393K4081j22909K39652
10369D37217K9671P7462j71782m396A08719J39614j7354q0911O7149E0540K04506
10358B55046g2609B99150e192j07115B42089L48484A77168K49446l0513A61489
10347A5386L26166A01359K37164i9007D01143j38443b33446B04573E4229J03195
10337A57424K03249a75254A47156n1340J78969j12749a22989E9459L10360j67083
10327B02736c3185A08250N7224a12853C02216c2726A04941K22769G4984c89625
10316A1587Q0612K4250b42460g7157j01915b8279D6922a58445A02234b82362B51699
$$ plain form
10390 -44897 393024 97761 151954 86625 225058 -32575 -185483 174480 -331789 475665
10379 317964 238699 23755 -47502 211331 323796 -10172 296393 320474 197565 437217
10369 437217 466888 544350 372568 368172 108719 248333 230979 150068 217217 50540 255046
10358 255046 -72609 299150 -5192 -112307 242089 590573 177168 426614 396101 161489
10347 15386 341552 101359 338523 -99007 401143 262700 -233446 204573 54229 157424
10337 157424 360673 -175254 147156 95816 274785 162036 -122989 59459 369819 202736
10327 202736 -33185 108250 165474 -112853 302216 -32726 104941 327710 74984 -389625
10316 11587 92199 116449 -242460 -77157 -179072 -28279 46922 -158445 102234 -282362 251699
10304b72017d7492H4454K95964B4712J8704K35767K3946K228A44178j3457P1769
10293B02490b4171I970b11601a04807P126E6027J24289q1960b08241B57818p8543
10282A79275J7761a37761L7409A93357A1934a72533B05787a68984B22522F9224
10271a52853B17202G642a65423L3555A4181J52746b70487e6161B49857R3871A28951
10259I9268D9290b7883C69413A18139E1886a30214A44180n6824i222D4357L7128
10248H1485a37378E8571f5842j44014C2704b45495F7054b48740A97186p6201b70502
10236b11141G1978a90793J0843B109P3426f4062e784j16690b5538k10181A43027
10224a6980j42769f0117j42541O164A7951d4613a7615j41774j39387I5275a88084
$$ plain form
10304 -272017 -47492 84454 380418 24712 43416 279183 303129 305357 144178 130721 202490
10293 202490 -24171 9970 -211601 -104807 -97681 56027 180316 98356 -208241 257818 179275
10282 179275 197036 -137761 -100352 193357 11934 -172533 205787 -168984 222522 69224
10271 -152853 217202 7642 -165423 -131868 14181 166927 -270487 -56161 249857 343728 128951
10259 99268 49290 -27883 369413 118139 51886 -130214 144180 87356 -9222 44357 81485
10248 81485 -137378 58571 -65842 -209856 32704 -245495 67054 -248740 197186 120985 -270502
10236 -211141 71978 -190793 -179950 2109 75535 -64062 -5784 -122474 -25538 -235719 143027
10224 -16980 -159749 -60117 -202658 -196494 17951 -44613 -17615 -159389 -298776 95275 -188084
10212a66830K9000A48936j7284E7691Q3866j2323L6737c7673A47591a58241m7436
10201b05677M7249B19784m7369d3511C1899h5000k57442d7517j60391k7157H9980
10189a84979O7935b0346B6172a22142q2905j92662a07012b662n168n7223l9497
10178a04550J0075F9872K1739a8467k05639f3461H012O2934f726l6484l63808
10167d07018A8002J43526E7633a88295d2912l62999a40184M4427C967a70100f4587
10155i9000A60516a4364l12653a11300e1117n0571o612n1783E9665h6014o3382
10144a49396r0521b8820k53655p6363G1761a94850K1244M9648A08135K18059b38155
10132A76512E8157L02102b54101r4910g3415k27957b7141j0076D5779K8681J08882
$$ plain form
10212 -166830 -137830 148936 131652 57691 141557 129234 165971 -37673 147591 -158241 -205677
10201 -205677 -158428 219784 172415 -43511 31899 -85000 -342442 -47517 -207908 -235065 89980
10189 -184979 -117044 -20346 26172 -122142 -205047 -397709 -107012 -2662 -7830 -65053 -104550
10178 -104550 -94475 69872 91611 -18467 -224106 -63461 8012 70946 -6726 -43210 -407018
10167 -407018 18002 161528 57633 -188295 -42912 -405911 -140184 -95757 3967 -170100 -64587
10155 -99000 160516 -14364 -327017 -111300 -51117 -101688 -108300 -160083 59665 -86014 -149396
10144 -149396 -239917 -28820 -282475 -358838 71761 -194850 -173606 -123958 108135 326194 -238155
10132 176512 58157 360259 -254101 -349011 -73415 -301372 -27141 -37217 45779 74460 183342
10121A83342h3498j43107P313j84974c1054C1568K21549l1477b57495A42765a92187
10109a12438k16180I2058d1712k00373C4161g7744A42154c8922B6781a14858C0535
10097G3788b15774b2234D0501J62134J776b47316R1059g6001A1765h0583A2120
10085a95292A99588e21777B50435j03708e6473g335A47052b6106F74J87283a18160
10073d6550j94247D3009a5729C3517L2740b67660D0718e14j34325L6256I7693
10061A24381b70312P9485j21626a40098I1780d59068B4144J15658C8764d4052
10050a41910l8109A38363A1766f6845k83226B19081a14771o2786N2771k60340
10040c85126A28052c09492G4648A3601b3424n0029l8896M6365j34614K3794m1078
$$ plain form
10121 183342 -83498 -226605 -219292 -404266 -31054 31568 253117 221640 -257495 142765 -192187
10109 -112438 -328618 92058 -41712 -242085 34161 -77744 142154 -38922 26781 -114858 30535
10097 73788 -215774 -22234 40501 202635 204411 -247316 -156257 -76001 11765 -80583 12120
10085 -195292 199588 -521777 250435 146727 -56473 -7335 147052 -26106 674 187957 -118160
10073 -46550 -240797 43009 -15729 33517 66257 -267660 40718 -514 -134839 -98583 97693
10061 124381 -270312 -190827 -312453 -140098 91780 -459068 24144 139802 38764 -44052
10050 -141910 -180019 138363 11766 -66845 -350071 219081 -114771 -177557 -124786 -385126
10040 -385126 128052 -309492 74648 13601 -23424 -73453 -112349 -65984 -200598 -176804 -217882
10029b17882n4886B89336A02350c5712j8533k61771e2874j45848m3384i4610A06165
10017g2181B8931i7483B34118a35124r3735I4938c7395a6865A62106b58008H4437
10005A11747j7925a03417j9499M0775k76413f6884a1715A37281a66504b8152j84917
9994b13069Q1609N5195m258C2103a03878B71854b38342e0729E506a2950H9000
9982e8671E4935a40809I1058g5375b8975j10995a4045k24467o449M4852a2461
9970b46697R9300b0871i812I534K07670H4097k8856N8662b63708j0182B1876i5022
9957i8829r3279c0125n53246H3195b14940D5388H521L2452b18904n0104F4626
9945c65315a13353m1426j50303J43476F1206i9312k2243j33553A25156a89315
$$ plain form
10029 -217882 -272768 289336 102350 -35712 -54245 -316016 -52874 -198722 -242106 -94610 106165
10017 -72181 28931 -97483 234118 -135124 -228859 94938 -37395 -16865 162106 -258008 84437
10005 111747 93822 -103417 -122916 -82141 -358554 -66884 -11715 137281 -166504 -28152 -213069
9994 -213069 -131460 -76265 -80523 32103 -103878 271854 -238342 -50729 5506 -12950 89000
9982 -58671 54935 -140809 91058 -75375 -28975 -139970 -14045 -238512 -244961 -200109 -12461
9970 -246697 -147397 -20871 -9812 9534 217204 84097 55241 113903 -263708 -273890 21876 -95022
9957 -98829 -192108 -30125 -583371 83195 -214940 45388 8521 40973 -218904 -269008 64626
9945 -365315 -113353 -154779 -305082 -161606 61206 -99312 -121555 -255108 125156 -189315
9934B21792c3605j96588f4478j88566k89826K54242C2848O144c31521a6559K302
9923a4257l6363B49663a74573j46074A68085a73294q8575A26958J63022b45449
9912A10649c64394J39651j51599C0131O3347N2931F4034k8083J41129a40545m1572
9901a82117d4602m4714r364j69334f7153j35914A57460g4446j9250m6669i478
9889A42578c04704a6194k10204P6243A1221O9166c42303f9100B1090J2840a86567
9877d3057a322j46046I727g4112h773j28337b6112r4227A92219a59023A18339
9865e1191C5266d9740p4585B67683a9031j85363P8300L5268o3290D4296c5406
9853b47553R7628F878M063K1811a10434A86981B334a57045A73609a73991n6065
$$ plain form
9934 221792 -33605 -230193 -64478 -253044 -542870 -288628 32848 38992 -331521 -16559 -14257
9923 -14257 -50620 249663 -174573 -320647 168085 -173294 -261869 126958 289980 -245449
9912 110649 -364394 -224743 -376342 30131 93478 146409 64034 35951 177080 -140545 -182117
9901 -182117 -44602 -89316 -98680 -268014 -67153 -203067 157460 -74446 -93696 -140365 -9478
9889 142578 -304704 -16194 -226398 -150155 11221 80387 -342303 -69100 21090 33930 -186567
9877 -43057 -1322 -147368 9727 -74112 -8773 -137110 -26112 -120339 192219 -159023 118339
9865 -51191 35266 -49740 -124325 267683 -19031 -204394 -126094 -90826 -154116 44296 -35406
9853 -247553 -149925 6878 10941 32752 -110434 186981 2334 -157045 173609 -173991 -230056
9842b30056C9155b60058Q8661B60532g6947l43588B05J31773h498l51931a50758
9830a29212O2071l07251J34374A50110j382E3582c18900L9777A35261g6365J121
9819g5244j01339B3434R8605E0203g4118H8758a75633k84651J17546E9027a54255
9807d9514A99373a49047O2283o3509N0528J2186B36150a03796N1588k98104A19880
9795d8439D4855i1358A05602a4686C0670a01449r2114M0592P4415B23686n6690
9784A66996d06007h19D4055b02352l8977b4818C39334a16845c5284A05263a62702
9772b38120j4653h0362m0148B49867Q6302j51811f9633a1279k39957A95210C2964
9760H3235J49616a53057L0353K6072B21384J8562a19410j14211j2480I3545c29956
$$ plain form
9842 -230056 39155 -260058 -171397 260532 -76947 -420535 205 131978 -8498 -360429 -150758
9830 -129212 -67141 -374392 -240018 150110 148728 53582 -318900 -279123 135261 -76365 -75244
9819 -75244 -176583 23434 122039 50203 -74118 88758 -175633 -460284 -342738 59027 -154255
9807 -49514 199373 -149047 -86764 -150273 -99745 -87559 236150 -103796 -52208 -350312 119880
9795 -48439 44855 -91358 105602 -14686 30670 -101449 -193563 -152971 -78556 223686 166996
9784 166996 -406007 -819 44055 -202352 -241329 -24818 339334 -116845 -35284 105263 -162702
9772 -238120 -252773 -80362 -120510 249867 336169 184358 -69633 -11279 -251236 195210 32964
9760 83235 232851 -153057 -122704 -96632 221384 239946 -119410 -233621 -246101 93545 -329956
9748b18697A71826b39892H2226a95564e8144A45400C2462c1797D3320O9770a07460
9736c8300B23587b3546k384j43632n5600D7759N5804M5135a08260o8741Q0556
9725i6445J4900j40216A48581d62920b20425g7899D8351J92978c7075B57689F7998
9713E18293e671A63013d66562K30663j10593C18426a20388r1291L8060B65842
9702A22612a23859J0266n665m1676M5803p2754g1326q1291A63996a10260A50597
9690c8526F9422i1603k19150c0994m0358A30507e5793j19885D9663a12871A8572
9678b1895j12961r5546C965b73530B46290a49756i021k12244I1640a7333A79609
9666a64164n2231Q3907b0584F8642g4777B10526c0696B17611a48613B00138a5775
$$ plain form
9748 -218697 171826 -239892 82226 -195564 -58144 145400 32462 -31797 43320 113090 -107460
9736 -38300 223587 -23546 -25930 -169562 -225162 47759 103563 148698 -108260 -177001 -96445
9725 -96445 -81545 -221761 148581 -462920 -220425 -77899 48351 241329 -37075 257689 67998
9713 518293 -5671 163013 -466562 -235899 -346492 318426 -120388 -211679 -173619 265842
9702 122612 -123859 -113593 -119258 -160934 -115131 -187885 -71326 -152617 163996 -110260 150597
9690 -38526 69422 -91603 -310753 -30994 -71352 130507 -55793 -175678 49663 -112871 18572
9678 -21895 -134856 -230402 3965 -273530 246290 -149756 -9021 -221265 91640 -17333 179609
9666 -164164 -216395 -132488 -20584 68642 -74777 210526 -30696 217611 -148613 200138 -15775
9654b88531J33651L5517C57336b63039R6780I8774a04056N1515B02771a0532l1265
9643d1797A11033e3451J2058m2793B94551c78046f0742j10810I8733a1733q7332
9632i9065p3678N6322b0517k94171f4970k58730J24751j26772D11709b3994A19364
9620a38440n0732l4774A70028c9277B17022B0058b27348d1126D7104J05379o8964
9609H3519i0287j02631r8517e0401B05959b71600B70078H6246a61350n8473c075
9597A40833b86968d1341r8435B4513e4100i632l2764J0218C13K41016a39414c3667
9584C8868g1626k92328c5818A2101J9275c79364A31530b75125m8880a45839A74142
9572a21862d9110k4989m15318a30860j14759e2269q1649k7423M3594c4349j44075
$$ plain form
9654 -288531 -154880 -119363 357336 -263039 -166259 98774 -104056 -52541 202771 -10532 -41797
9643 -41797 111033 -53451 -41393 -84186 294551 -378046 -60742 -171552 98733 -11733 -99065
9632 -99065 -172743 -116421 -20517 -314688 -64970 -323700 -198949 -325721 411709 -23994 119364
9620 -138440 -189172 -223946 170028 -39277 217022 20058 -227348 -41126 47104 152483 83519
9609 83519 -90287 -192918 -291435 -50401 205959 -271600 270078 86246 -161350 -219823 -3075
9597 140833 -286968 -41341 -139776 24513 -54100 -9632 -42396 -32178 313 241329 -139414 -33667
9584 38868 -71626 -363954 -35818 12101 31376 -379364 131530 -275125 -324005 -145839 174142
9572 -121862 -49110 -74099 -489417 -130860 -245619 -52269 -133918 -161341 -117747 -34349 -178424
9561a78424P9685G4469M7282b44242A37130J96479I8973B2684M6994B5058J1689
9550C6747g938A60468b74777g132p1499G1942b90399d7787F9130b34308m0559
9539b74867m7457B31936G3475a8078j49163D9274j522a13275g984A83198q3874
9528I9324d22826a15415G4788f3190j3842k53154H8022c76366C3663i629D2639
9516c03889G0347a65975j04251A38398c75519B03157b23768D7420A6787c8687
9505d3803j23176A46727a46583d5743D2153a22823F2420a44604A995L5635G989
9493I8490e8031m8237A38541h3622n5449B18394b31789I6673K2254a40980f0341
9481A43023c1885A60328h24091L49215A66429H728K20811e6772k52449R5282C92702
$$ plain form
9561 -178424 -98739 74469 121751 -244242 137130 333609 98973 22684 69678 25058 36747
9550 36747 -7938 160468 -274777 -7132 -78631 71942 -290399 -47787 69130 -234308 -274867
9539 -274867 -322324 231936 73475 -18078 -167241 49274 47752 -113275 -7984 183198 99324
9528 99324 -422826 -115415 74788 -63190 -77032 -330186 88022 -376366 33663 -9629 42639
9516 -303889 70347 -165975 -270226 138398 -375519 203157 -223768 47420 16787 -38687
9505 -43803 -166979 146727 -146583 -45743 42153 -122823 62420 -144604 1995 37630 7989
9493 98490 -58031 -106268 138541 -83622 -139071 218394 -231789 96673 118927 -140980 -60341
9481 143023 -31885 160328 -824091 -474876 166429 8728 229539 -56772 -309221 -213939 392702
9469A21726P9214b72055A81944G5095K6712P9232b165k1564n1629n572K4934K7476
9457b8520l2257A22221b26354A00004a32241o9051n2662a06145D28659A01420
9446a17971K3692m5721K1564A23437g6538k57435A0876b18406j30135R8697r5440
9435c45284a40954K7262B73429a66468k09572a05657l6455A41169L3477m1308
9425A33338i2383A56465D5055c34734a243q0286J2190F7353c2113q616n0422H2060
9412B7315L22019c08839A39060b70197B25725i3614B69244d8992q472k38808B21889
9400b06229j2453G517N39517A12914m797a92630C40779a63657k5313d3774q290
9389e2064k43522C03480a31140j01728I8987M3083i182j86108A30703b9289A21267
$$ plain form
9469 121726 200940 -272055 181944 75095 101807 181039 -2165 -23729 -75358 -80930 -55996 -28520
9457 -28520 -60777 122221 -226354 100004 -132241 -201292 -253954 -106145 428659 101420
9446 -117971 -94279 -140000 -118436 123437 -76538 -333973 10876 -218406 -348541 -249844 -345284
9435 -345284 -140954 -113692 273429 -166468 -376040 -105657 -142112 141169 174646 133338
9425 133338 -92383 156465 45055 -334734 -1243 -81529 -69339 67353 -32113 -40729 -91151 82060
9412 27315 349334 -308839 139060 -270197 225725 -93614 269244 -48992 -57464 -296272 221889
9400 -206229 -218682 7517 547034 112914 108117 -192630 340779 -163657 -188970 -43774 -52064
9389 -52064 -295586 303480 -131140 -232868 98987 142070 -9182 -195290 130703 -29289 121267
9377a07038H5074a46571B32437o6052e472j37280j34285i2188M403A52805D4222
9365B36385b7152A3237J08283e6937l51839Q4901F9276b21543c7626C9620b66581
9353A156g1815K9594j09257C3573f3250k87952e0440n6035j1835j48557D9683
9341a87411q2765a05460k10268A56667m9067e36527a73376A30819N6467b43242
9330b85711a20466j3880A04392m1668e4400p1821G9007c37973a30763B70920d59200
9318a94300K7755A35191K16833F3383N216a42392L6600K3093A39349c34897D7638
9306a31971J7769A1382b28225M9571P1697k20609A02301a81403g1862j00353a5274
9294f9882k3523A64584a2405k18649h4864E7563R4200b33044a14218F9712a39013
$$ plain form
9377 -107038 85074 -146571 232437 166385 -5472 -142752 -277037 -92188 -87785 152805 44222
9365 236385 -27152 13237 121520 -56937 -408776 -323875 69276 -221543 -37626 39620 -266581
9353 1156 -71815 -42221 -151478 33573 -63250 -351202 -50440 -106475 -118310 -266867 49683
9341 -187411 -270176 -105460 -315728 156667 107600 -536527 -173376 130819 187286 -243242
9330 -285711 -120466 -134346 104392 62724 -54400 -126221 79007 -337973 -130763 270920 -459200
9318 -194300 -166545 135191 352024 63383 68599 -142392 -105792 -82699 139349 -334897 47638
9306 -131971 -114202 11382 -228225 -178654 -106957 -327566 102301 -181403 -71862 -172215 -15274
9294 -69882 -93405 164584 -12405 -231054 -84864 57563 151763 -233044 -114218 69712 -139013
9282c42254a56292e1510I4016A7863P6718c0593J4770B1417a07083A46943M7491
9271A94434E2941K6592a84047j21175B90797b07855R7673I9108J49822b50283
9260D5570b02391D7067a61596A65883d3621C233a30162D5801a05034j60233A81170
9248B6474b17685j7946b0077D59021a30446m9082d3234n0156k00024a22375e775
9236b10526i8091k20192J01721J07188g140C50681E3884b7421j69672g3310j4095
9225h7405H0473a21134a7672A57002f1986j988B80990e6206E0940J7004A1085
9213B41219p9054P9901a44508b9221F816K754g1899B1355a24370j46501J12337
9202a58534O675j65690j01278e1283l3684A37533a36100A00679a31485A89393
$$ plain form
9282 -342254 -156292 -51510 94016 17863 94581 -30593 -15823 21417 -107083 146943 194434
9271 194434 52941 79533 -184047 -305222 290797 -207855 -110182 99108 248930 -250283
9260 45570 -202391 47067 -161596 165883 -43621 3233 -130162 45801 -105034 -265267 181170
9248 26474 -217685 -235631 -20077 459021 -130446 -179528 -43234 -93390 -293414 -122375 -5775
9236 -210526 -98091 -318283 -216562 -109374 -7140 350681 53884 -27421 -197093 -73310 -87405
9225 -87405 80473 -121134 -17672 157002 -61986 -63974 280990 -56206 50940 67944 11085
9213 241219 162165 242066 -144508 -29221 6816 9570 -71899 21355 -124370 -270871 -158534
9202 -158534 -151859 -317549 -418827 -51283 -84967 137533 -136100 100679 -131485 189393
9191a88331e381A6541c01871d7062A62098d09001J34568h6425B21378b51428e9960
9179a92771C9634c73961g9500A4461h4084L0381G7826b48691B65755b25915F3216
9167a45398b9981m7958B39257c64909a00094h336n2224A28249a29380P347B23834
9155B65000c75609J35642d6501C80370a3358j86710O3142L4855C68347a75963
9144b49671B20822P177m7828c64415C48279e75137G0701a86682Q3611j54210L8391
9133b18890b8829j21541j00110D5946c17747Q9928A35573d62050A00847J93846
9123B94693a28453k02954B15892N412a7446A8839R0594N7423f4833n1293j42140
9112b58266j53886H0404l454L0772O2758b53140A8578e1504r241A23254c43887
$$ plain form
9191 -188331 -5381 16541 -301871 -47062 162098 -409001 -274433 -86425 221378 -251428 -59960
9179 -192771 39634 -373961 -79500 14461 -84084 -53703 77826 -248691 265755 -225915 63216
9167 -145398 -29981 -77939 239257 -364909 -100094 -8336 -60560 128249 -129380 -122033 223834
9155 265000 -375609 -239967 -46501 380370 -13358 -200068 -136926 -102071 368347 -175963
9144 -249671 220822 227999 180171 -364415 348279 -575137 70701 -186682 -103071 -257281 -218890
9133 -218890 -28829 -150370 -250480 45946 -317747 -227819 135573 -462050 100847 294693
9123 294693 -128453 -331407 215892 221304 -17446 18839 109433 166856 -64833 -116126 -258266
9112 -258266 -412152 80404 76950 107722 170480 -253140 18578 -51504 -60745 123254 -343887
9100b58061r996I1141L5404b83940C15937d074A36834a05472c4999A77809C6823
9088A13426i3375j12276A18848a88220A39936a73002g0472l05575e7091D09936
9077B25641c8359j3672I8788b7421l0520n4972D4481j0230b76238d1857D6084
9065a40519j83701a41903L5768G3387a36285p4269D1481i9675G577J65093l5600
9054A37070J5827A5407O7150I908M0875e2150a8803q7581K5378o6910c2635C64397
9041b26461A0670b132j39969j56569n6826B17278a72085f8199k31515a01474j5362
9030a16836A68646b72636H7975a53100N7879A34392a10414D7747b46345A02036
9019a6539B0040M9981j1760a55424L4726d5144A56534b6031F3079a6615j29733
$$ plain form
9100 -258061 -268057 91141 126545 -283940 315937 -4074 136834 -105472 -34999 177809 36823
9088 113426 -93375 -205651 118848 -188220 139936 -173002 -70472 -376047 -57091 409936
9077 225641 -38359 -52031 98788 -27421 -57941 -112913 44481 34251 -276238 -41857 46084
9065 -140519 -324220 -141903 -106135 73387 -136285 -210554 41481 -99675 7577 172670 137070
9054 137070 152897 15407 82557 9908 50783 -52150 -18803 -106384 -81006 -147916 -32635 364397
9041 -226461 10670 -2132 -142101 -298670 -355496 217278 -172085 -68199 -299714 -101474 -116836
9030 -116836 168646 -272636 87975 -153100 -95221 134392 -110414 47747 -246345 102036
9019 -16539 20040 70021 58261 -155424 -120698 -45144 156534 -26031 63079 -16615 -146348
9008a46348b5487b183D6265J41432m8117L3979k5000e1212A7793R1037E2162e75
8995a34381i092B04938a35953j4643M1090A3047K8724I84b44382j75434A57262
8983b33157d127l33997A01227a35818c1324h871k38441C0657A5004a89967P7565
8972a12402j27946c5700m83r8237l6437e9437J1154j20301F1825J69099D3794
8960b09901A02423g3796F6188i2222A30730c50021R3169D1400O3507d1322j00239
8949a41561M1920L5518H0586J37816a84592P1851p064N3594A05224a23390M6564
8938g6826G9433b36187d7030E41426j11687j46581b51521O8003H6972e0001j9017
8927f9018B71730a53864D11326P05277K138952M969191k425872B046235F62358
$$ plain form
9008 -146348 -25487 -2183 46265 187697 139580 173559 148559 -51212 17793 108830 52162 -575
8995 -134381 -9092 204938 -135953 -150596 -109506 13047 41771 984 -244382 -419816 157262
8983 -233157 -4127 -338124 101227 -135818 -31324 -8871 -247312 30657 15004 -189967 -112402
8972 -112402 -240348 -35700 -36183 -134420 -170857 -59437 -48283 -168584 61825 230924 43794
8960 -209901 102423 -73796 66188 -92222 130730 -350021 -256852 41400 104907 -41322 -141561
8949 -141561 -99641 -64123 80586 218402 -184592 -112741 -119805 -66211 105224 -123390 -76826
8938 -76826 79433 -236187 -47030 541426 429739 283158 -251521 -183518 86972 -50001 -69018
8927 -69018 271730 -153864 411326 1116603 3255555 8224746 5798874 2046235 662358
8917C70528r8638A01470c5495C33114A18592E3502P1106a99593D59049j66974
8907B92075q1950g3654A2778O13K32060a47086I6704b00940A54720a75773A70871
8895c148k92766E3228P837J7557B6292a61261M8170F2573a64722c8468J2792r8449
8883a24125D0986O4210p896D6454a50327M7864B66087j22697k9595j9600d9194
8871h79E8263a63582k0809B7467h1251l53768a45246J8908G473i9251k08131A37703
8858a0998k34876A72343b21782A60332o227F6254g4074a3555m9022A59599k9587
$$ plain form
8917 370528 271890 101470 -35495 333114 118592 53502 124608 -199593 459049 292075
8907 292075 210125 -73654 12778 13391 245451 -147086 96704 -200940 154720 -175773 170871
8895 -3148 -295914 53228 61065 78622 26292 -161261 -113091 62573 -164722 -38468 -25676 -124125
8883 -124125 40986 105196 97300 46454 -150327 -102463 266087 143390 113795 94195 -49194
8871 -879 58263 -163582 -184391 27467 -81251 -435019 -145246 -126338 7473 -99251 -307382 137703
8858 -10998 -245874 172343 -221782 160332 154105 66254 -74074 -13555 -62577 159599 130012
$$ [...]
##END NTUPLES=NMR SPECTRUM
##END=
