
##TITLE=AC1366_2140_7184965_qDGOeVsAB1
##JCAMPDX= 6.0         $$ Bruker NMR JCAMP-DX V2.0
##DATA TYPE= NMR SPECTRUM
##DATA CLASS= NTUPLES
##ORIGIN= BRUKER
##OWNER= Administrator
$$ 1.72 TOPSPIN		Version 2.1
$$ 2012-12-07 17:40:32.140 -0500  Administrator@X
$$ Compression mode = diff/dup
##.OBSERVE FREQUENCY= 400.02188249412
##.OBSERVE NUCLEUS= ^1H
##.ACQUISITION MODE= SIMULTANEOUS (DQD)
##.ACQUISITION SCHEME= undefined
##.AVERAGES= 64
##.DIGITISER RES= 22
##SPECTROMETER/DATA SYSTEM= spect
##.PULSE SEQUENCE= noesygpps1d.comp
##.SOLVENT NAME= COFFEE_meoh
##.SHIFT REFERENCE= INTERNAL, COFFEE_meoh, 1, 14.9608
##AUDIT TRAIL= $$ (NUMBER, WHEN, WHO, WHERE, PROCESS, VERSION, WHAT)
$$ ##TITLE= Audit trail, TOPSPIN		Version 2.1
$$ ##JCAMPDX= 5.01
$$ ##ORIGIN= Bruker BioSpin GmbH
$$ ##OWNER= Administrator
$$ $$ E:\/data/COFFEE/nmr/AC1366_2140_7184965_qDGOeVsAB1/22/pdata/1/auditp.txt
$$ ##AUDIT TRAIL=  $$ (NUMBER, WHEN, WHO, WHERE, PROCESS, VERSION, WHAT)
(   1,<2012-12-07 17:40:25.922 -0500>,<Administrator>,<X>,<go>,<TOPSPIN 2.1>,
      <created by zg
	started at 2012-12-07 17:28:55.795 -0500,
	POWCHK enabled, PULCHK disabled,
       configuration hash MD5:
       86 BA 57 50 F2 9D 5C 9B 26 00 A9 28 5F 66 2E 89
       data hash MD5: 64K
       73 6F 7B 10 B8 C5 78 C8 8D 01 78 8B 5F BD 30 DE>)
(   2,<2012-12-07 17:40:29.062 -0500>,<Administrator>,<X>,<proc1d>,<TOPSPIN 2.1>,
      <Start of raw data processing
       efp LB = 0.3 FT_mod = 6 PKNL = 1 PHC0 = 0 PHC1 = 0 SI = 128K 
       data hash MD5: 128K
       3F 80 E8 0C F4 B5 59 D1 C7 E4 FB 5E F8 E2 EC CC>)
(   3,<2012-12-07 17:40:30.344 -0500>,<Administrator>,<X>,<proc1d>,<TOPSPIN 2.1>,
      <pk PHC0 = -82.74902 PHC1 = 0 
       data hash MD5: 128K
       7C 2A E7 DE 85 9D 9A 8D 68 97 C1 E8 60 4F F0 7E>)
(   4,<2012-12-07 17:40:31.187 -0500>,<Administrator>,<X>,<proc1d>,<TOPSPIN 2.1>,
      <abs ABSG = 1 
       data hash MD5: 128K
       46 3E 97 43 0B DE BD 5B 07 80 42 78 18 3D B4 2E>)
(   5,<2012-12-07 17:40:31.359 -0500>,<Administrator>,<X>,<proc1d>,<TOPSPIN 2.1>,
      <abs ABSG = 2 
       data hash MD5: 128K
       83 66 72 96 A7 34 D1 7D 44 51 1B AE EB 38 78 5A>)
(   6,<2012-12-07 17:40:31.515 -0500>,<Administrator>,<X>,<proc1d>,<TOPSPIN 2.1>,
      <abs ABSG = 3 
       data hash MD5: 128K
       92 EF B8 45 75 C9 DC D6 90 F4 15 A4 FF 7D 40 60>)
(   7,<2012-12-07 17:40:31.687 -0500>,<Administrator>,<X>,<proc1d>,<TOPSPIN 2.1>,
      <abs ABSG = 4 
       data hash MD5: 128K
       8A 4D 96 CB 86 46 39 A6 6F ED C8 8C C7 E3 7D 36>)
(   8,<2012-12-07 17:40:31.859 -0500>,<Administrator>,<X>,<proc1d>,<TOPSPIN 2.1>,
      <abs ABSG = 5 
       data hash MD5: 128K
       AD EB 60 95 DB 0E F0 FF DE B9 51 E9 60 A5 9C 39>)
$$ ##END=
$$ 
$$ $$ hash MD5
$$ $$ 57 5C 84 EA DB 49 4A CA 17 93 FE 1E 86 B6 C9 AA
##$RELAX= 
##$RELAX= 
##$RELAX= 
##$RELAX= 
##$RELAX= 
##$RELAX= 
##$RELAX= 
##$RELAX= 
$$ Bruker specific parameters
$$ --------------------------
##$DU= <E:\>
##$EXPNO= 22
$$ [...]
150 150 150 150 150 150 150 150
##$TP07= 0
##$TPNAME0= <>
##$TPNAME1= <>
##$TPNAME2= <>
##$TPNAME3= <>
##$TPNAME4= <>
##$TPNAME5= <>
##$TPNAME6= <>
##$TPNAME7= <>
##$TPOAL= (0..7)
0.5 0.5 0.5 0.5 0.5 0.5 0.5 0.5
##$TPOFFS= (0..7)
0 0 0 0 0 0 0 0
##$TUNHIN= 0
##$TUNHOUT= 0
##$TUNXOUT= 0
##$USERA1= <user>
##$USERA2= <user>
##$USERA3= <user>
##$USERA4= <user>
##$USERA5= <user>
##$V9= 5
##$VALIST= <valist>
##$VCLIST= <CCCCCCCCCCCCCCC>
##$VD= 0
##$VDLIST= <DDDDDDDDDDDDDDD>
##$VPLIST= <PPPPPPPPPPPPPPP>
##$VTLIST= <TTTTTTTTTTTTTTT>
##$WBST= 1024
##$WBSW= 4
##$XGAIN= (0..3)
0 0 0 0
##$XL= 0
##$YL= 0
##$YMAX_a= 5967134
##$YMIN_a= -11170554
##$ZGOPTNS= <>
##$ZL1= 120
##$ZL2= 120
##$ZL3= 120
##$ZL4= 120
##$ABSF1= 14.9608
##$ABSF2= -5.597382
##$ABSG= 5
##$ABSL= 3
##$ALPHA= 0
##$AQORDER= 0
##$ASSFAC= 0
##$ASSFACI= 0
##$ASSFACX= 0
##$ASSWID= 0
##$AUNMP= <proc_prof1d_extract.lims>
##$AXLEFT= 0
##$AXNAME= <>
##$AXNUC= <1H>
##$AXRIGHT= 0
##$AXTYPE= 0
##$AXUNIT= <>
##$AZFE= 0.1
##$AZFW= 0.1
##$BCFW= 0
##$BC_mod= 0
##$BYTORDP= 0
##$COROFFS= 0
##$CY= 15
##$DATMOD= 1
##$DC= 0
##$DFILT= <>
##$DTYPP= 0
##$F1P= 0
##$F2P= 0
##$FCOR= 0.5
##$FTSIZE= 131072
##$FT_mod= 6
##$GAMMA= 0
##$GB= 0
##$INTBC= 1
##$INTSCL= 1
##$ISEN= 128
##$LB= 0.3
##$LEV0= 0
##$LPBIN= 0
##$MAXI= 10000
##$MC2= 0
##$MEAN= 0
##$ME_mod= 0
##$MI= 0
##$NCOEF= 0
##$NC_proc= -2
##$NLEV= 6
##$NOISF1= 0
##$NOISF2= 0
##$NSP= 0
##$NTH_PI= 0
##$NZP= 0
##$OFFSET= 14.9608
##$PC= 1
##$PHC0= -82.74902
##$PHC1= 0
##$PH_mod= 1
##$PKNL= yes
##$PPARMOD= 0
##$PPDIAG= 0
##$PPIPTYP= 0
##$PPMPNUM= 2147483647
##$PPRESOL= 1
##$PSCAL= 4
##$PSIGN= 0
##$PYNMP= <proc.py>
##$REVERSE= no
##$SF= 400.020009716141
##$SI= 131072
##$SIGF1= 0
##$SIGF2= 0
##$SINO= 400
##$SIOLD= 131072
##$SPECTYP= <>
##$SREGLST= <1H.CDCl3>
##$SSB= 0
##$STSI= 131072
##$STSR= 0
##$SW_p= 8223.68421052631
##$SYMM= 0
##$S_DEV= 0
##$TDeff= 65536
##$TDoff= 0
##$TI= <>
##$TILT= no
##$TM1= 0
##$TM2= 0
##$TOPLEV= 0
##$USERP1= <user>
##$USERP2= <user>
##$USERP3= <user>
##$USERP4= <user>
##$USERP5= <user>
##$WDW= 1
##$XDIM= 131072
##$YMAX_p= 364850029
##$YMIN_p= -12363
##$CURPLOT= <Network HP LaserJet P1505>
##$CURPRIN= <$Network HP LaserJet P1505>
##$DFORMAT= <normdp>
##$LAYOUT= <+/1D_H.xwp>
##$LFORMAT= <normlp>
##$PFORMAT= <normpl>
##$SURQMSG= 1
$$ End of Bruker specific parameters
$$ ---------------------------------
##NTUPLES= NMR SPECTRUM
##VAR_NAME=  FREQUENCY,     SPECTRUM/REAL,   SPECTRUM/IMAG
##SYMBOL=    X,             R,               I
##VAR_TYPE=  INDEPENDENT,   DEPENDENT,       DEPENDENT
##VAR_FORM=  AFFN,          ASDF,            ASDF
##VAR_DIM=   131072,        131072,          131072
##UNITS=     HZ,            ARBITRARY UNITS, ARBITRARY UNITS
##FACTOR=    0.0627417313425164, 1,          1
##FIRST=     8223.62146879497, 362,          -51962
##LAST=      0,             2525,            -51320
##MIN=       0,             -12363,          0
##MAX=       8223.62146879497, 364850029,    0
$$ Real data points
##PAGE= N=1
##DATA TABLE= (X++(R..R)), XYDATA
$$ [...]
67870 97024 98318 99373 99873 99522 98363 96890 95649 94870 94712 95586 97695 100312 102049 102070 100709 98766
67854 98766 96639 94392 92221 90397 88937 87690 86626 85742 84855 83845 82971 82538 82298 81640 80436 79330
67838 79330 79025 79578 80562 81658 82874 84300 85857 87223 87939 87819 87360 87550 89011 91372 93701 95521
67822 95521 97198 99331 101924 104334 106010 107119 108248 109500 110162 109544 108013 106833 106850 107618 107920 106922
67806 106922 104672 101765 98841 96213 93734 91021 87974 84982 82464 80465 78933 78142 78349 79152 79693
67791 79693 79668 79666 80304 81348 81973 81643 80478 78880 77164 75568 74375 73849 74034 74575 74850 74459 73675 73243
67773 73243 73665 74799 76189 77614 79154 80921 82882 84880 86618 87779 88369 88899 89988 91745 93657
67758 93657 95159 96196 97199 98512 99978 101128 101818 102475 103491 104481 104509 103175 101150 99428 98351 97614
67742 97614 96960 96461 96199 96039 95752 95174 94320 93513 93217 93406 93277 91962 89434 86337 83063 79616 76346
67725 76346 74071 73132 72838 72314 71486 70823 70465 70131 69681 69228 68769 68200 67702 67628 67932 68083 67740 67176 66788
67706 66788 66472 65755 64522 63334 62934 63473 64360 64878 64902 64854 65014 65140 64885 64287 63625 63037 62642 62808 63793
67687 63793 65078 65617 64914 63526 62303 61512 60958 60594 60553 60727 60778 60606 60560 61028 62023 63166 64043 64575 65157
67668 65157 66274 67820 68932 68723 67237 65410 64108 63467 63264 63593 64826 67000 69519 71563 72701
67653 72701 73058 73010 72844 72688 72638 72776 73023 73096 72756 72132 71662 71716 72273 72978 73418 73331 72668 71574 70335 69280
67633 69280 68668 68583 68886 69306 69698 70179 70923 71880 72835 73741 74771 75951 76934 77330 77197 77026 77251 77873 78520
67614 78520 78784 78500 77831 77077 76415 75841 75351 75003 74760 74454 74054 73758 73596 73133 71958 70423 69471 69616
67596 69616 70401 70992 71019 70640 70048 69224 68063 66525 64730 63018 61801 61223 61075 61148 61443 61875 62036 61642
67578 61642 61039 60887 61309 61759 61801 61715 62147 63344 64913 66200 66776 66661 66204 65744 65324 64787 64124 63612 63541
67559 63541 63851 64132 63960 63247 62279 61399 60642 59779 58736 57816 57342 57236 57152 56952 56817 56956 57424 58208 59221
67540 59221 60167 60669 60607 60228 59882 59789 59992 60326 60481 60346 60259 60626 61318 61826 62004 62203 62574 62760 62540 62314
67520 62314 62548 63093 63472 63536 63390 62907 61884 60605 59712 59428 59352 59095 58727 58412 57962 57013 55563 54123
67502 54123 53335 53428 54078 54876 55962 57880 60589 62891 63377 61889 59588 57568 55938 54440 53409 53562
67486 53562 54980 56734 57612 57061 55542 54184 54054 55445 57698 59782 61177 62146 63138 64044 64248 63378
67470 63378 61783 60121 58697 57516 56792 56902 57708 58408 58415 58058 58068 58655 59528 60556 61830 63091 63721 63484
67452 63484 62840 62334 61993 61521 60785 59912 59151 58792 59060 59894 60975 62017 62843 63243 63116 62848 63103 64026
67434 64026 64946 65128 64563 63805 63293 63088 63041 62920 62560 62078 61790 61755 61711 61618 61898 62793 63832 64376 64396 64264
67414 64264 64043 63554 62978 62736 62785 62633 62100 61501 60947 60041 58560 56946 55781 55101 54532 53817 52906 51800
67396 51800 50642 49819 49692 50316 51544 53186 54875 56125 56852 57557 58612 59576 59721 59107 58562 58537 58585 58200
67378 58200 57688 57747 58447 59128 59229 58861 58538 58659 59326 60339 61180 61247 60420 59337 58856 59208 59811 59995 59676
67359 59676 59241 58896 58415 57545 56448 55591 55330 55739 56733 58131 59536 60433 60630 60518 60656 61072 61197 60553
67341 60553 59364 58350 58007 58233 58585 58747 58778 59046 59888 61281 62882 64476 66227 68325 70458 71979
67325 71979 72604 72705 72798 72990 73027 72635 71674 70204 68645 67696 67785 68583 69216 68945 67584 65515 63541 62585
67307 62585 63123 64802 66738 68208 68983 69216 69272 69535 70042 70351 70142 69888 70490 72161 74080 75304 75610
67290 75610 75267 74498 73575 73010 73051 73199 72787 71980 71647 72226 73238 74015 74387 74448 74141 73440 72612 71981 71666
67271 71666 71812 72719 74331 75855 76415 75954 75077 74148 73128 72244 72104 72931 74226 75482 76689 77844 78526
67254 78526 78500 78300 78566 79133 79431 79504 79849 80353 80343 79823 79771 80781 82195 83080 83434 83768 84123 84274 84553 85527
67234 85527 86925 87744 87508 86730 85992 85291 84601 84411 85150 86443 87483 87944 88127 88398 88857 89523 90408 91363
67216 91363 92129 92620 92980 93260 93186 92425 91087 89866 89527 90163 91039 91333 90957 90524 90562 91042 91608 91945 91860
67197 91860 91394 90984 91199 92068 93012 93665 94396 95644 97099 98018 98138 97766 97152 96407 95971 96413 97587 98604
67179 98604 98951 99149 99906 101097 102013 102295 102114 101728 101381 101452 102076 102664 102390 101315 100510 100847 102053 103198
67161 103198 103749 103839 103805 103895 104300 105067 105961 106677 107246 108032 109261 110651 111626 111823 111367 110641 109849 108870 107669
67142 107669 106687 106549 107298 108260 108848 109245 109992 111177 112464 113755 115248 116767 117617 117415 116670 116189 116219
67125 116219 116557 117232 118460 119956 120915 120975 120868 121685 123628 125768 127071 127410 127504 128021 128909 129567 129563 129088
67107 129088 128697 128685 128785 128537 127928 127526 127941 129194 130711 131907 132609 132914 132836 132318 131542 130996 131161 132197
67089 132197 133925 136004 138051 139740 140931 141750 142512 143481 144645 145753 146695 147779 149402 151346 152727
67074 152727 152949 152479 152256 152513 152688 152495 152505 153465 155509 158279 161339 164187 166354 167921 169573 171644
67058 171644 173498 174419 174743 175372 176358 176848 176467 175939 176099 177049 178658 181103 184337 187526 189846 191605
67042 191605 193905 197158 200456 202523 202971 202535 202339 203039 204512 206262 208051 210010 212171 214225 216003
67027 216003 217828 220020 222267 223918 224865 225668 226799 228234 229865 231918 234685 238081 241657 244906 247480
67012 247480 249385 251121 253401 256538 260226 264009 267741 271505 275334 279217 283092 286595 289146 290715
66998 290715 292294 295125 299436 304341 308975 313229 317305 321154 324746 328491 332813 337498 341882 345717
66984 345717 349408 353393 357701 362237 367108 372340 377495 381949 385620 389229 393758 399636 406370 412910
66970 412910 418491 423279 428201 434068 440890 448028 454940 461663 468688 476461 485034 494062 503136 512146
66956 512146 521295 530749 540346 549662 558321 566265 573902 582016 591249 601459 611883 622162 632955
66943 632955 645070 658165 670950 682778 694383 706742 719800 732891 746015 759919 774955
66932 774955 790559 806121 821792 838093 855142 872772 891128 910536 930744 950818 970075
66921 970075 988859 1008197 1028880 1051074 1074607 1099270 1124855 1151178 1178148 1205623 1233249
66910 1233249 1260671 1288028 1316005 1345279 1376093 1408459 1442455 1478002 1514521 1551283 1588172
66899 1588172 1625792 1664697 1704747 1745338 1786080 1827028 1868435 1910537 1953531 1997518 2042331
66888 2042331 2087577 2132986 2178675 2224940 2271803 2318870 2365679 2412059 2458017 2503430 2548104
66877 2548104 2592119 2635745 2678779 2720250 2759166 2795491 2830056 2863427 2895243 2924779 2951815
66866 2951815 2976501 2998535 3017010 3031389 3042292 3050897 3057585 3061644 3062412 3060187 3055549 3048117 3036771
66853 3036771 3021118 3002056 2980610 2956894 2930688 2902317 2872170 2839742 2804177 2765753 2725939
66842 2725939 2685757 2644884 2602700 2559450 2515745 2471449 2425834 2378677 2330671 2282742 2235402
66831 2235402 2188697 2142386 2096085 2049554 2002922 1956552 1910760 1865829 1822153 1780052 1739470
66820 1739470 1700029 1661352 1623203 1585506 1548466 1512517 1477832 1443977 1410413 1377298 1345425
66809 1345425 1315285 1286504 1258264 1229971 1201430 1172760 1144389 1116967 1090933 1066272 1042769
66798 1042769 1020357 998935 977986 956731 934829 912764 891436 871412 852594 834451 816464
66787 816464 798506 781021 764783 750234 736967 724016 710709 697060 683321 669572 655997
66776 655997 643160 631439 620263 608505 595817 583127 571652 561800 553221 545434 537960 530181
66764 530181 521673 512688 503925 495756 487930 480005 471812 463465 455201 447250 439738 432599 425716 419112
66750 419112 412930 407200 401750 396321 390742 385045 379425 374034 368814 363661 358719 354244 350206 346359
66736 346359 342795 339927 337622 334826 330571 325128 319628 314699 310004 305104 300179 295752 292113 289227
66722 289227 286884 284739 282402 279647 276468 272949 269253 265632 262183 258679 254969 251424 248608 246492
66708 246492 244429 241933 239049 235895 232389 228693 225465 223248 221876 220798 219691 218428 216702 214201
66694 214201 211144 208296 206328 205314 204840 204407 203675 202482 200777 198618 196221 193913 191854 189869 187717
66679 187717 185516 183601 181942 180024 177531 174857 172682 171165 169866 168379 166790 165446 164517 163874 163320
66664 163320 162803 162391 162100 161817 161408 160780 159804 158359 156576 154883 153559 152404 151112 149813 148838 148028
66648 148028 146781 144896 142910 141423 140495 139881 139402 138791 137620 135843 134132 133204 132966 132783 132422 132237
66632 132237 132441 132683 132483 131732 130591 129244 127932 127047 126938 127612 128668 129454 129308 127899 125548 123171
66616 123171 121640 121004 120398 118948 116813 115097 114555 114637 114148 112710 111120 110264 110189 110397 110579 110754 110991
66599 110991 111331 111709 111768 111127 110104 109672 110223 110838 110423 109210 108333 108110 107736 106746 105803 105580 105675 105256 104253
66580 104253 103221 102369 101417 100247 99052 97902 96711 95697 95346 95810 96738 97800 98940 99950 100292 99693
66564 99693 98647 97957 97968 98515 99371 100322 100930 100706 99647 98293 97166 96390 95852 95457 95138 94885 94806 94906
66546 94906 94798 94010 92688 91590 91160 91062 90859 90696 90821 90864 90255 89163 88405 88417 88870 89298 89549 89576 89315
66527 89315 88932 88760 88831 88822 88499 87848 86819 85497 84556 84803 86043 87055 87065 86643 86689 87119 87152 86453 85320
66508 85320 84016 82588 81261 80440 80297 80733 81619 82759 83772 84365 84600 84562 84021 82846 81509 80671 80413
66491 80413 80378 80499 80972 81529 81399 80254 78728 77770 77729 78285 79039 79939 81079 82149 82315 81039 79043 77904
66473 77904 78403 79763 80877 81632 82432 83074 83124 83037 83775 85307 86565 87005 87268 88022 89098 90070 90829 91191
66455 91191 90801 89875 89238 89102 88681 87703 87421 89120 92154 94490 94899 93728 91849 89952 88802 89021 90219
66438 90219 91162 91221 91075 91592 92566 93054 92608 91640 90763 90301 90368 90955 91739 92134 91868 91359 91253 91555 91544 90690
66418 90690 89365 88360 87918 87645 87247 86883 86753 86815 86999 87242 87208 86520 85554 85401 86579 88205 88982 88694
66400 88694 88183 88084 88247 88223 87749 86774 85602 84971 85396 86348 86680 86065 85439 85756 86805 87632 87710 87204 86401
66381 86401 85461 84691 84502 84900 85365 85496 85538 85990 86736 87003 86337 85329 85006 85593 86337 86613 86690 87117 87728
66362 87728 87775 86854 85281 83620 82328 81862 82535 84005 85296 85708 85544 85673 86508 87646 88441 88640 88393
66345 88393 87873 87093 86124 85309 85066 85433 85975 86255 86254 86158 85887 85138 83910 82713 82114 82247 82806 83338 83465
66326 83465 83038 82285 81714 81688 82040 82165 81500 80000 78241 77106 77209 78483 80286 81924 83028 83503 83342
66309 83342 82628 81645 80806 80352 80137 79792 79152 78459 78101 78179 78496 78967 79818 81252 83046 84699 85923 86793
66291 86793 87463 87927 88141 88195 88276 88485 88759 88910 88763 88313 87732 87243 87012 87139 87570 87977 87919 87329 86696 86496
66271 86496 86589 86434 85850 85197 84764 84336 83611 82802 82506 82947 83527 83339 82161 80901 80839 82307 84270 85317
66253 85317 84952 83732 82373 81185 80374 80351 81353 82950 84250 84624 84128 83299 82711 82709 83368 84512 85776
66236 85776 86797 87494 88150 89035 89935 90292 89981 89658 90085 91292 92758 94211 95734 97138 97809 97408 96334
66219 96334 95259 94497 94099 94165 94737 95553 96282 96924 97681 98480 98880 98471 97238 95560 93975 92916 92517 92636
66201 92636 93060 93599 94049 94308 94557 95031 95487 95248 94080 92788 92567 93841 95938 97785 98622 98251 97078
66184 97078 95984 95805 96656 97859 98581 98489 97883 97401 97590 98532 99797 100843 101449 101736 101908 102167 102713 103553
66166 103553 104357 104741 104713 104590 104553 104559 104674 105132 105974 106925 107692 108138 108131 107568 106694 106044 105882 106023 106361 107141 108336
66145 108336 109181 108920 107894 107314 107912 109292 110691 111863 112943 113859 114333 114314 114026 113647 113226 112930 113016 113468
66127 113468 113908 114009 113841 113630 113409 113179 113254 114029 115330 116393 116707 116601 116718 117180 117662 118119 118921 120255
66109 120255 121852 123435 125004 126506 127660 128434 129344 130821 132485 133493 133468 132719 131653 130446 129295
66094 129295 128491 128127 128019 128055 128271 128508 128382 127850 127489 127951 129269 130899 132275 133159 133670 134188 135066 136223
66076 136223 137130 137362 137013 136489 136092 135962 136096 136203 135871 135219 135040 135757 136573 136324 135099 134154 134083 133855 132173
66057 132173 129200 126366 124789 124535 125217 126623 128570 130573 131962 132305 131720 130832 130288 130125 129761 128833
66041 128833 127860 127717 128589 129916 131380 133318 135901 138398 139772 139810 139205 138627 138222 138038 138390 139482 140972
66024 140972 142311 143415 144661 146245 147866 149142 150095 151068 152321 153850 155453 156841 157766 158239 158546
66009 158546 158888 159106 158979 158765 159175 160665 162844 164679 165309 164778 164071 164403 166288 169260 172500 175556
65993 175556 178296 180422 181577 182026 182760 184590 187292 189818 191232 191387 190934 190848 191750 193436 195099 196081
65977 196081 196237 195625 194250 192301 190244 188382 186607 184889 183630 183098 182764 181812 180142 178380 176933
65962 176933 175675 174576 174018 174226 174852 175425 175860 176251 176460 176267 175780 175465 175843 177237 179598 182492 185445
65945 185445 188385 191512 194763 197797 200662 203936 207856 211753 214931 217835 221633 226570 231389 234621
65931 234621 236030 236470 236685 236760 236634 236645 237300 238707 240505 242302 244005 245674 247231 248431 249067 249145 248950
65914 248950 248981 249673 251018 252589 254059 255523 257103 258476 259250 259707 260594 262042 263223 263411 262973 262847
65898 262847 263323 263864 264018 263961 264035 264139 263801 262677 260836 258724 256878 255492 254124 251944 248392 243617
65882 243617 238262 232972 228185 224168 220978 218325 215718 212978 210486 208753 207776 207069 206349 205809 205572
65867 205572 205288 204681 204232 204740 206259 207988 209225 209876 209917 209030 207166 204975 203189 201882 200780 199945
65851 199945 199610 199639 199744 200100 201112 202582 203800 204637 205896 208197 210930 212848 213502 213679 214396 215792
65835 215792 217116 217564 216914 215442 213557 211703 210368 209772 209563 209198 208674 208482 208787 209298 210216 212590 216963
65818 216963 222176 226423 229268 231691 234261 236423 237845 239309 241518 243826 245018 244879 244141 243177 241710
65803 241710 239822 238406 238269 239254 240487 241156 240808 239246 236585 233415 230604 228743 227709 226913 225971 225036
65787 225036 224341 223666 222657 221638 221593 223106 225744 228812 232302 236665 241942 247711 253795 260465 267899
65772 267899 275873 284064 292230 299942 306497 311337 314352 315631 315134 312761 308625 303186 297205 291498
65758 291498 286510 282111 278075 274728 272814 272761 274474 277924 283432 291104 300467 311093 323309 337858
65744 337858 355015 374443 395788 418946 443733 469700 496309 522857 548049 570022 587192
65733 587192 599047 605981 608465 606569 600189 589457 574809 556745 535676 512066 486715 460771
65721 460771 435348 411105 388221 366721 346713 328314 311503 296151 282162 269539 258358
65710 258358 248628 240058 231982 223789 215645 208571 203513 200314 197925 195661 193884 193212 193359 193184 191874
65695 191874 189692 187504 185883 184886 184385 184266 184369 184543 184825 185398 186359 187631 189126 190840 192857 195373
65679 195373 198659 202758 207297 211922 216996 223490 231977 242012 252785 264164 276797 291412 308458
65666 308458 328332 351334 377151 404736 433136 462298 492659 523931 554589 582776 607575
65655 607575 629191 647984 663657 675550 683496 688096 690208 690518 689643 688298 687097 686326 686083 686415
65641 686415 687095 687512 687059 685455 682355 676847 667860 655080 639037 620229 598584 573904 546444
65628 546444 516947 486452 456163 427054 399327 372668 347232 323976 303733 286371 271260
65617 271260 258106 246835 237020 228084 219921 212748 206457 200686 195429 190994 187335 184025 180958 178524
65603 178524 176934 175871 174899 173766 172242 170285 168501 167817 168359 169265 169936 170861 172659 174841 176236 176439
65587 176439 176223 176660 178314 181111 184548 188124 191967 196807 202932 209535 215753 222170 230464 241570
65573 241570 254946 269849 286574 305974 328283 352904 379061 406219 434029 462168 490099
65562 490099 516737 540484 559834 573973 582831 586761 586239 581529 572423 558491 539764 517018 491363
65549 491363 463840 435536 407648 381066 356044 332565 310802 290957 272916 256491 241908
65538 241908 229656 219819 211872 205153 199295 194210 189895 186332 183417 180945 178756 176792 174889 172715
65524 172715 170133 167471 165072 162694 159771 156266 152894 150365 148720 147469 146099 144375 142488 141057
65510 141057 140650 141083 141482 141246 140704 140589 141155 142114 143236 144567 146129 147747 149162 150122 150456 150317 150283
65493 150283 150836 151735 152222 151935 151384 151412 152421 154252 156571 159212 162235 165779 169834 174113 178198 181757
65477 181757 184522 186216 186806 186783 186846 187174 187253 186484 184692 182023 178742 175275 172068 169173 166332 163675
65461 163675 161884 161271 161104 160371 158923 157349 156024 154977 154482 154940 156045 156809 156728 156338 156349 156781 157361
65444 157361 158239 159747 161660 163181 163667 163150 162307 162073 163011 164766 166334 167092 167402 167990 169021 170109
65428 170109 170935 171459 171704 171716 171653 171590 171379 170966 170660 170707 170876 170894 171109 172150 174010 176032 177853 179774 182073
65409 182073 184483 186588 188292 189611 190355 190319 189577 188329 186663 184709 182844 181524 181002 181302 182262 183446
65393 183446 184231 184268 183810 183461 183617 184247 185131 186218 187722 189867 192464 194858 196388 196872 196521 195558 194190
65376 194190 192811 191762 190838 189403 187216 184915 183527 183638 185020 186862 188303 189064 189685 190963 193135
65361 193135 195807 198671 201904 205794 210299 215133 220025 224832 229675 235019 241269 248208 255152 261695
65347 261695 267885 273669 278680 282693 285740 287614 287905 286757 284916 282641 279323 274676 269571 264957
65333 264957 260618 255837 250700 245700 240453 234090 226850 220095 214586 209852 205559 202446 201244 201492
65319 201492 202083 202428 202431 201817 200305 198260 196541 195603 195070 194166 192371 189746 186816 184056 181416 178528
65303 178528 175414 172560 170134 167586 164407 160953 158092 156257 155282 155036 155658 157117 158901 160381 161333
65288 161333 161994 162645 163168 163047 161922 160129 158477 157487 157149 157413 158443 160026 161234 161314 160815 161195 163204
65271 163204 166091 168563 170158 171379 172769 174276 175545 176542 177612 178903 179989 180344 180215 180645 182414
65256 182414 185149 187793 189731 191166 192549 194131 196061 198423 200986 203271 205055 206444 207232 206652 204208
65241 204208 200494 196607 192851 188599 183497 178210 173690 170189 167447 165478 164570 164583 164841 164872 164860 165148
65225 165148 165640 165936 165817 165332 164646 164040 163835 163973 163857 162990 161693 160702 160081 159040 157052 154718 153203
65208 153203 153080 154039 155445 156754 157503 157414 156692 155948 155696 156024 156791 157813 158715 158870 157850 155973 154135
65191 154135 153004 152486 152023 151253 150250 149312 148769 149004 150298 152450 154737 156524 157889 159428 161406 163309
65175 163309 164346 164220 163274 162006 160675 159429 158513 158087 157837 157032 155151 152360 149305 146583 144593 143621
65159 143621 143605 143804 143274 141966 140992 141390 142921 144475 145407 145987 146658 147491 148430 149494 150521 151144 151420
65142 151420 152137 154152 157479 161296 164832 168043 171413 175240 179241 182928 186294 189887 194120 198840
65128 198840 203801 209248 215441 221795 227211 231409 235316 239904 245165 250534 255795 261045 266161 270852
65114 270852 275120 279228 283257 286977 290082 292298 293343 292987 291089 287469 281969 274769 266402 257356
65100 257356 247967 238802 230613 223592 217163 210915 205290 200836 197251 193802 190331 187167 184370 181840
65086 181840 179899 178847 178075 176602 174589 173326 173421 173902 173541 172298 170883 169582 168141 166363 164256
65071 164256 161953 159993 159215 159802 160754 160941 160486 160490 161605 163468 165466 167357 169064 170402 171294 171944 172625
65054 172625 173480 174545 175687 176482 176548 176103 175982 176829 178365 179576 179572 178260 176285 174419 173012 171975 171124
65037 171124 170407 169872 169694 170249 171778 173780 175052 174685 172889 170614 168620 167187 166399 166099 165611 164100
65021 164100 161449 158421 155827 153803 152112 150801 150252 150698 151945 153539 155048 156216 157021 157716 158786
65006 158786 160707 163583 167009 170435 173749 177311 181345 185561 189519 193144 196559 199664 202275 204579
64992 204579 206981 209451 211435 212524 212925 213153 213581 214382 215581 217006 218468 220172 222623 225903 229340
64977 229340 232230 234654 237174 239761 241433 241178 239045 236161 233628 231502 228950 225405 221354 217844
64963 217844 215342 213382 211287 208884 206423 204171 202328 201135 200795 201307 202436 203750 204696 204923 204623
64948 204623 204264 203891 203032 201452 199601 197975 196380 194334 191929 189783 188174 186752 185158 183516 182141
64933 182141 181118 180387 180076 180561 182132 184522 186753 187724 187241 186253 185751 185617 184967 183431 181461 179396
64917 179396 176970 174111 171578 170275 170220 170690 171235 172048 173368 174944 176249 177048 177671 178821 181056 184296
64901 184296 187775 190598 192431 193767 195591 198723 203283 208725 214511 220703 227674 235326 242967 250094
64887 250094 256942 264119 272090 281185 291581 302785 313544 322926 331305 339626 347709 353950 356841
64874 356841 356247 352936 347506 340264 331827 323192 315171 308055 301856 296562 292145 288550 285809 283992
64860 283992 282857 281673 279641 276600 273159 269962 266891 263211 258472 252975 247239 241358 235168 228779
64846 228779 222601 216970 212082 208126 205023 202178 199036 195924 193717 192488 191155 188857 186149 184244
64832 184244 183402 182742 181541 180096 179219 179376 180463 182002 183333 183919 183765 183418 183429 183920 184757 185941 187671
64815 187671 190096 193177 196733 200490 204063 207001 208977 210068 210836 211952 213626 215529 217390 219473
64801 219473 222179 225370 228439 231006 233125 234775 235603 235380 234317 232683 230510 228051 226102 225356 225576
64786 225576 225979 226346 227166 228612 230051 230890 231424 232359 233793 235195 236259 237227 238321 239286 239789 240014 240582
64769 240582 241852 243461 244610 244841 244555 244731 246111 248735 252279 256619 261787 267556 273471 279393 285663
64754 285663 292603 300105 307925 316037 324396 332624 340364 347914 356056 365207 374996 384666 393447 400386
64740 400386 404359 404773 402095 397304 390847 382514 372322 361100 350018 339866 330991 323623 317876
64727 317876 313558 310330 308072 306775 306067 305260 304063 302969 302698 303453 304964 307020 309611 312696 316285
64712 316285 320693 326307 332982 340074 347171 354402 361801 368774 374439 378177 379508 377821 372807 365059
64698 365059 355790 345903 335625 324963 314078 303142 292216 281488 271432 262573 255221 249378
64686 249378 244767 240920 237439 234171 231052 227990 225155 223117 222267 222183 222115 222053 222768 224652 227137 229498
64670 229498 231677 233937 236225 238380 240668 243523 246828 249912 252247 253870 255177 256478 257634 257969
64656 257969 256761 254126 251243 249411 248942 249157 249235 248859 248309 248237 249173 250913 252638 253928 255319 257502
64640 257502 260340 263234 266152 269530 273308 276813 279685 282270 285041 288262 292329 297692 304190 311048
64626 311048 317755 324322 330458 335266 338190 339586 339772 338166 334068 327876 320728 313286 305642 298200
64612 298200 291700 286298 281342 276256 271086 266099 261513 257802 255595 254850 254564 253693 251999 249700 246788
64597 246788 243277 239836 237484 236584 236596 236882 237363 238236 239469 240898 242647 245121 248551 252730 257290 262152
64581 262152 267658 274316 282480 292275 303670 316494 330337 344625 358867 372799 386229 398889
64569 398889 410554 421164 430527 437930 442415 443608 442066 438520 432992 424969 414395 402095 389123
64556 389123 376040 363042 350514 339042 328915 319887 311560 303874 297142 291641 287279 283744 281038
64543 281038 279687 280209 282315 284954 287283 289387 291874 294957 298224 301088 303069 303711 302678 300036 296148
64528 296148 291195 285158 278398 271923 266748 263053 260150 257192 253789 250121 246670 243819 241551 239509
64514 239509 237379 235147 232966 230942 229184 227889 227201 226988 226916 226801 226804 227230 228116 229044 229463 229328 229316 230237
64496 230237 232298 235170 238726 243281 248917 254932 260289 264518 267989 271415 275296 279624 283856 287304
64482 287304 289917 292638 296632 302136 308317 314258 319676 324554 328424 330493 330383 328503 325620 322270
64468 322270 318619 314754 310972 307850 306037 305877 307128 309076 311088 313103 315504 318443 321432 323679
64454 323679 324799 325065 324968 324643 323761 321878 318897 315249 311676 308796 306860 305921 306084 307461 309931 313085
64438 313085 316447 319705 322897 326528 331422 338177 346818 357139 369266 383585 400200 418907 439797
64425 439797 463450 490443 521022 555476 594378 638131 686683 740082 799006 864258 935828
64414 935828 1012785 1093827 1177302 1260714 1340948 1415455 1483081 1543589 1596576 1640977 1675374
64403 1675374 1698362 1708683 1705475 1688904 1660650 1623352 1579051 1528021 1469289 1402327 1328042
64392 1328042 1248287 1165095 1080745 998053 919781 847544 781502 721134 666153 616807 573569
64381 573569 536556 505128 478124 454579 434029 416149 400579 387327 376757 368656 361760 354903
64369 354903 348367 343262 339706 336436 332294 327210 321497 314950 307172 298231 288518 278377 268295 259111
64355 259111 251540 245594 240744 236505 232758 229779 228082 227889 228595 229202 229453 230074 231596 233531 235053
64340 235053 235903 236011 234846 232080 228637 226116 224999 224169 222369 219557 216645 214446 213203 212748 212732 212907
64324 212907 213386 214495 216312 218526 220802 223053 225297 227571 230068 233055 236525 240248 244297 249146
64310 249146 254888 260602 264913 267166 267747 267297 265932 263352 259471 254667 249509 244407 239540 234958 230561
64295 230561 226096 221375 216616 212408 209247 207183 205995 205472 205292 204776 203213 200661 198199 197096 197606
64280 197606 198716 199199 198833 198467 198898 200048 201443 203140 205584 208617 211353 213337 215229 217904 221330
64265 221330 224909 228471 232160 235576 237938 239150 239942 240806 241541 242066 242853 244058 244901 244546 243184 241642
64249 241642 240260 238757 236901 234659 231826 228227 224296 220910 218520 216924 215937 215780 216607 218086 219703
64234 219703 221228 222679 224134 225852 228419 232454 238054 244585 251100 257064 262776 268958 275919 283329
64220 283329 290935 299096 308167 317704 326929 335868 345227 354965 363693 369885 373168 374114 373314 371162 368071
64205 368071 364221 359252 352767 344979 336462 327450 317970 308457 299603 291543 283763 275853 267907 260128
64191 260128 252683 246107 241251 238486 237334 237183 237926 239635 241999 244598 247408 250617 254083 257390 260291
64176 260291 262695 264271 264508 263206 260610 257029 252675 247913 243357 239441 236019 232477 228254 223259
64162 223259 217911 212783 208174 204003 200127 196617 193641 191201 189170 187537 186461 186097 186453 187296 188183
64147 188183 188778 189376 190884 193974 198299 202795 206644 209704 212167 214249 216198 218144 219752 220391 219849
64132 219849 218590 217101 215287 212798 209799 207026 205087 203925 203051 202110 201126 200238 199401 198527 197862 197955
64116 197955 199104 201051 203491 206582 210569 215023 219036 222249 225200 228479 232050 235619 239193 242778
64102 242778 245885 247880 248726 248955 249002 248985 249132 249965 251917 254994 258860 263085 267250 270984 273941 275636
64086 275636 275446 273028 268745 263468 257942 252468 247098 241823 236602 231499 226873 223185 220574 218806
64072 218806 217619 216889 216467 216262 216519 217604 219289 220666 221129 221173 221817 223404 225361 226991 228022 228387
64056 228387 228022 227144 226358 226163 226498 227025 227643 228388 228929 228615 227187 225142 223208 221631 220163 218617 217132
64039 217132 216001 215476 215779 217013 218936 221035 222943 224633 226068 226853 226543 225292 223927 223278 223542 224371
64023 224371 225426 226704 228352 230408 232829 235747 239450 243927 248482 252039 253975 254561 254507 254223 253668
64008 253668 252771 251666 250481 249135 247514 245700 243898 242172 240398 238474 236494 234738 233497 232897 232782
63993 232782 232807 232716 232584 232715 233261 234007 234713 235643 237451 240361 243640 246242 248017 249959 253089 257268 261318
63976 261318 264245 266253 268651 272848 279223 286773 293960 300010 305285 310320 314879 318375 320949 323588
63962 323588 327066 331280 335846 340941 347199 354966 364048 374103 385022 396929 410130 425146 442659
63949 442659 463268 487366 515287 547482 584508 626840 674766 728432 787956 853437 924861
63938 924861 1002060 1084792 1172768 1265480 1361957 1460753 1560144 1658298 1753309 1843207 1926014
63927 1926014 1999755 2062478 2112451 2148562 2170559 2178793 2173600 2154831 2121971 2074824 2014191 1941978
63915 1941978 1860678 1772789 1680591 1586143 1491219 1397230 1305307 1216411 1131329 1050714 975299
63904 975299 905960 843379 787652 738365 694934 656669 622694 592226 565056 541416 521252
63893 521252 503853 488347 474419 462416 452834 445704 440312 435580 431039 427414 425871 426590 428478
63880 428478 430466 432617 435664 439898 445021 450798 457294 464642 473128 483465 496426 512043 529615
63867 529615 548607 569202 591847 616671 643520 672226 702600 734477 768071 804107 843210
63856 843210 885132 928679 972397 1015318 1057289 1098677 1139695 1179819 1217868 1252582 1282982
63845 1282982 1308320 1328080 1342314 1351654 1356714 1357472 1353349 1343802 1328768 1308663 1284042 1255119
63833 1255119 1221635 1183571 1142059 1099181 1056523 1014191 971521 928436 885685 844111 804246
63822 804246 766507 731180 698161 667162 638274 611882 588018 566192 545918 526934 508900
63811 508900 491396 474369 458064 442330 426585 410777 395810 382567 370931 360227 350157
63800 350157 340787 331996 323612 315871 309097 303097 297474 292343 288014 284147 280030 275782 272376 270170
63786 270170 268203 265439 262078 259074 256758 254554 251823 248560 245367 243069 242087 241843 241081 239203 237016
63771 237016 235698 235269 234673 233277 231584 230389 229805 229449 229119 228908 228850 228814 228703 228511 228169 227474 226234 224531
63753 224531 222880 222032 222425 223738 225100 225765 225556 224752 223739 222838 222290 222223 222653 223538 224819 226403 228132
63736 228132 229809 231295 232645 234141 236100 238555 241231 243903 246679 249834 253459 257462 261850 266800
63722 266800 272445 278687 285236 291761 298024 303984 309733 315278 320357 324524 327340 328520 328019 326073
63708 326073 323054 319253 314913 310450 306393 302972 299962 297050 294164 291431 289119 287689 287419 287745 287547
63693 287547 286527 285803 286506 288202 289470 289783 289888 290412 291168 292066 293684 296319 299182 301245 302441 303463
63677 303463 304677 305907 307063 308347 309831 311361 312997 315170 318252 322143 326357 330408 334107 337608
63663 337608 341179 344866 348387 351307 353270 354175 354253 353801 352566 349623 344369 337574 330844 325005 319658
63648 319658 314448 309914 306628 304184 301800 299443 297669 296662 296142 295991 296317 297020 297952 299429 301943
63633 301943 305385 309107 312737 316407 320255 324318 328883 334243 340033 345436 350268 355277 361247 368353
63619 368353 376525 385776 395903 406536 417877 430808 445858 462566 480327 499335 520128 542644
63607 542644 566377 591107 616768 642816 668439 693309 717427 740164 760085 775884 787017
63596 787017 793405 795191 793151 788782 783406 777328 770195 761968 753132 744011 734255 723161 710238 695416
63582 695416 678926 661289 643424 626516 611519 598683 587582 577647 568688 560947 554796 550436
63570 550436 547786 546530 546302 546962 548750 552087 557129 563497 570484 577597 584920 592903 601770 611224 620846
63555 620846 630680 641236 652967 666009 680513 696944 715787 737143 760907 787265 816749 849823
63543 849823 886593 926663 968500 1008531 1041431 1062383 1069839 1066125 1055348 1040863 1024644 1008290
63531 1008290 993507 981268 971126 961949 953097 944388 935128 923939 909773 892618 872968 851134
63519 851134 827497 802988 778661 754879 731455 708569 687014 667374 649442 632687 616943
63508 616943 602352 588896 576315 564473 553518 543740 535351 528319 522272 516654 511174 506019 501453
63495 501453 497278 492924 488104 483169 478766 475231 472314 469377 465885 461912 458169 455398 453704 452701
63481 452701 452330 453168 455676 459414 463447 467480 472108 477762 483800 489019 492912 495974 498684 500600 500727
63466 500727 498602 494665 489586 483590 476597 468748 460531 452504 445190 439114 434490 430792 427081 423084
63452 423084 419612 417534 416547 415507 413925 412618 412771 414856 418717 424200 431270 439814 449871 461909
63438 461909 476450 493473 512660 534267 559222 588210 621009 656885 694970 733630 769617
63427 769617 798689 817646 825948 825468 819000 809140 798258 788857 783349 783260 788736 798979 813136 830732
63413 830732 851417 874584 899319 924499 948759 970476 988067 1000436 1007205 1008652 1005569 999129
63401 999129 990617 980997 970597 959109 945956 930768 913661 895126 875621 855220 833605 810426
63389 810426 785753 760309 735278 711824 690730 672424 657073 644427 633686 623969 615107 607738
63377 607738 602365 598560 595477 593054 592252 593889 597587 602210 607227 613259 621148 630775 641130 651546
63363 651546 662550 675238 690034 706446 724074 743328 764833 788445 813414 839331 866348
63352 866348 894389 922746 950673 977726 1003075 1024963 1041605 1052496 1058262 1059382 1055822 1048033
63340 1048033 1037535 1026018 1014236 1002081 989335 975889 961455 945580 927886 908107 886109
63329 886109 862218 837384 812784 789385 768116 750057 735929 725489 717900 712690 710036 710315
63317 710315 713695 719625 725880 728229 722357 706840 683983 657642 630855 605570 583274 564711
63305 564711 549274 535641 523018 511357 500657 490742 481590 473231 465302 457211 448770 440211 431667
63292 431667 423158 415054 407966 402051 396876 392072 387674 383700 379883 376087 372607 369763 367420 365101
63278 365101 362483 359613 356744 353996 351147 347886 344406 341518 339849 339134 338664 338192 337766 336853 334396
63263 334396 330006 324534 319278 315110 312372 310919 309912 308311 306044 304198 303608 303777 303641 302856 301670
63248 301670 299994 297497 294457 291748 289897 288709 287823 287085 286307 285214 283844 282634 281979 281939 282446 283437
63232 283437 284648 285587 285898 285625 285070 284500 284067 283856 283969 284536 285562 286723 287551 287913 288109 288321 288366 288270
63214 288270 288649 289998 291843 293196 293744 293984 294295 294546 294751 295340 296466 297586 298204 298651 299710 301650
63198 301650 303969 306002 307560 309058 311136 314007 317121 319704 321677 323791 326798 330927 336273 343168
63184 343168 351671 360994 369968 378047 385536 392942 400473 408146 415930 423681 431130 438109 444636 450784
63170 450784 456602 462226 467851 473457 478617 482703 485295 486375 486117 484570 481608 477157 471360 464442
63156 464442 456530 447756 438446 429006 419658 410468 401628 393466 386080 379148 372195 364993 357700 350747
63142 350747 344545 339183 334433 330203 326818 324497 322713 320558 317822 315251 313624 313021 313122 313689 314475
63127 314475 315196 315994 317440 319636 321788 323241 324482 326420 329044 331640 334114 337131 340858 344536 347634
63112 347634 350672 354422 358892 363531 368046 372536 377173 382183 387897 394538 402149 410877 420862 431581
63098 431581 441809 450769 458971 467423 476395 485567 495039 505321 516218 526530 535098 541646 546352
63085 546352 549157 549898 548756 546130 542155 536627 529401 520713 511163 501405 491730 481925 471725 461411
63071 461411 451699 443029 435222 427955 421198 415048 409423 404226 399555 395519 392066 389259 387447 386765
63057 386765 386636 386253 385548 385242 385834 386963 387992 388920 390365 392766 395914 399348 402998 407194 412083 417216
63041 417216 421911 425930 429599 433277 437007 440803 444931 449575 454409 458882 462836 466494 469909 472835
63027 472835 475218 477386 479588 481685 483471 484977 486205 486825 486508 485414 484044 482712 481445 480291 479435
63012 479435 478983 478960 479640 481643 485478 491055 497727 504790 511902 519153 526891 535543 545489 556905 569587
62997 569587 582887 595974 608285 619840 631137 642680 654492 666003 676499 685828 694623 703700
62985 703700 713259 722796 731695 739568 746002 750337 752006 750949 747435 741601 733435 723169 711357 698479
62971 698479 684594 669465 652977 635445 617595 600256 583978 568987 555470 543636 533309
62960 533309 523693 513991 504288 495447 488047 481773 476005 470516 465210 459582 453104 446150 439849 434742
62946 434742 430085 424819 418852 412847 407048 401025 394609 388410 383167 379064 375997 374033 373122 372676 371930
62931 371930 370612 368882 366829 364444 361899 359309 356394 352959 349638 347393 346231 345136 343550 342143
62917 342143 341662 341694 341290 340426 340103 341100 343158 345394 347081 348033 348596 349325 350531 352232 354583 357912 362054
62900 362054 366144 369619 373075 377515 383060 389134 395713 403457 412451 421672 430078 437606 444695 451333
62886 451333 457080 461661 465031 466987 467201 465639 462733 459083 455016 450400 444896 438562 432153 426555
62872 426555 421915 417571 412860 407655 402116 396391 390754 385645 381269 377371 373637 370047 366678 363463
62858 363463 360408 357756 355640 353742 351660 349441 347536 346321 345902 346218 347021 347790 347973 347410 346435 345635
62842 345635 345552 346410 347888 349209 349724 349496 349251 349736 351126 353005 354846 356468 357995 359425 360527 361297
62826 361297 362188 363529 364923 365730 366068 366729 368070 369575 370664 371252 371264 370338 368573 366951 366286 366103 365326
62809 365326 363811 362400 361457 360201 357735 354197 350489 347253 344449 341824 339463 337795 337066 336904 336578
62794 336578 335780 334935 334537 334430 333985 332838 331141 329253 327534 326341 325840 325803 325818 325749 325844 326573 328495 331975
62776 331975 336620 341239 344864 347766 351006 355093 359555 363763 367489 370513 372334 372713 372185 371649 371592
62761 371592 371824 371806 371114 369831 368587 367962 367753 367083 365356 362816 360066 357380 354708 352060 349511 346963
62745 346963 344183 341136 338091 335377 333057 330869 328477 325868 323387 321353 319762 318510 317630 317006 316144
62730 316144 314713 313199 312452 312560 312742 312507 312331 312956 314495 316566 318859 321236 323596 326052 328918 332208
62714 332208 335433 338278 341145 344704 349162 354377 360407 367426 375281 383628 392484 402222 413097 425177
62700 425177 438647 453724 470223 487577 505416 523857 543219 563721 585417 608037 630828
62689 630828 652931 674021 694283 713574 730920 745032 755202 761469 764084 763055 758258 749769
62677 749769 737924 723046 705293 684962 662853 640091 617512 595480 574308 554457 536057
62666 536057 518589 501447 484664 468802 454344 441517 430421 420827 412016 403377 395111 387839
62654 387839 381572 375686 369937 364779 360429 356337 352011 347843 344607 342436 340850 339517 338461 337620
62640 337620 336723 335683 334793 334467 334962 336274 338067 339724 340732 341030 340850 340333 339521 338637 338059 338000 338378
62623 338378 338958 339430 339412 338669 337438 336382 336093 336603 337284 337247 336046 334145 332510 331600 331031 330407 330065 330478
62605 330478 331195 331121 329870 328211 326984 326205 325548 325159 325490 326637 328307 330171 331817 332665 332487 331957 332094
62588 332094 333175 334610 335866 336921 337727 337936 337589 337528 338518 340181 341374 341551 341189 340807 340176 338839 337002
62571 337002 335372 334215 333029 331299 329267 327714 327067 326905 326346 324859 322673 320480 318825 317808 317310
62556 317310 317316 317874 318810 319633 319831 319165 317700 315711 313609 311763 310211 308684 307120 306022 306018 307053 308353
62539 308353 309290 310065 311338 313380 315794 317933 319332 319838 319643 319322 319587 320770 322576 324457 326214 328155
62523 328155 330669 333808 337401 341477 346394 352452 359543 367276 375357 383736 392500 401835 412044 423324
62509 423324 435524 448324 461675 475784 490583 505490 519769 532818 544045 552933 559517 564389
62497 564389 567760 568891 567024 562687 557361 551866 545797 538733 531329 524779 519641 515679 512596 510452
62483 510452 509476 509881 511851 515418 520307 526055 532306 538995 546333 554574 563562 572362 579604 584383 586646
62468 586646 586639 584408 580091 574329 567774 560261 550937 539244 525503 510584 495323 480250 465528
62455 465528 451050 436803 423128 410436 398776 388040 378500 370647 364437 359203 354534 350820 348582
62442 348582 347548 346788 345607 343991 342264 340666 339337 338449 338156 338403 338825 338892 338287 337182 336090 335425
62426 335425 335299 335618 336160 336555 336536 336344 336564 337393 338331 338841 339037 339369 339895 340368 340987 342444 345007 347936
62408 347936 350132 351128 351193 350694 349779 348725 348180 348784 350597 353070 355575 357840 359924 361928 363902 365939
62392 365939 368143 370482 372855 375353 378290 381826 385682 389482 393327 397748 403070 408994 414957 420766
62378 420766 426758 433463 441230 450093 459845 470237 481267 493304 506800 521848 538067 554990
62366 554990 572466 590643 609688 629766 651346 675310 702432 732793 765955 801868 841290
62355 841290 884986 932624 982807 1034140 1085848 1137160 1186543 1231893 1271324 1303565 1327939
62344 1327939 1344378 1353342 1355277 1350227 1338310 1320339 1297395 1269803 1237286 1200343 1160810 1120643
62332 1120643 1080709 1041202 1002687 966054 931728 899675 870062 843224 819031 796855 776196
62321 776196 756839 738360 720102 701752 683462 665302 647147 629244 612327 596818 582345
62310 582345 568309 554588 541497 529495 519104 510608 503484 496642 489620 483104 477894 473865 470441
62297 470441 467600 465713 464681 463976 463392 463141 463310 463809 464734 466191 467803 469060 470162 471941 474913 478937
62281 478937 483827 489521 495470 500625 504520 507900 511884 516837 522386 528091 533655 538773 543453 548492
62267 548492 555211 564528 576423 590326 605968 623840 644894 669740 698198 729710 764127 801851
62255 801851 843270 888318 936555 987293 1039499 1091842 1143010 1191672 1236037 1273835 1303104
62244 1303104 1322911 1333210 1334343 1326978 1312267 1291497 1265480 1234439 1198459 1157834 1113149 1065499
62232 1065499 1016701 968851 923244 879851 838266 799108 763956 733636 706991 681966 657742
62221 657742 635169 615118 597198 580494 564830 550643 538055 526841 517002 508570 500920 493133
62209 493133 485118 477710 471551 466502 462267 458814 455883 452818 449355 446087 443729 442349 441735 442010 443378
62194 443378 445621 448408 451912 456610 462631 469685 477557 486300 495996 506632 518178 530643 544041
62181 544041 558303 573008 587280 600342 612212 623449 634201 644074 653079 662013 671569 681738
62169 681738 692578 704938 719841 737731 758945 784241 813890 846666 880779 915635 951607
62158 951607 988007 1022348 1051924 1075437 1092800 1104143 1109528 1109120 1103116 1091674 1075174 1054260
62146 1054260 1029464 1001035 969289 934841 898446 860985 823797 788593 756599 727864 701613
62135 701613 677190 654603 634353 616933 602390 590233 579802 570733 563053 556928 552528 550113
62123 550113 550036 552550 557671 565194 574783 586215 599668 615619 634251 655090 677355 700284 722775
62110 722775 743016 759121 770235 776696 779270 778708 776017 772471 768944 765289 760426 752845 741263
62097 741263 725387 706286 685773 665348 645961 628521 614000 602835 594779 589580 587383 588196
62085 588196 591431 596463 603438 613069 625672 640727 657439 675533 695405 717557 741944 767972
62073 767972 795069 823040 851735 880670 909336 937804 966578 995859 1025285 1054403 1083092
62062 1083092 1111413 1139347 1166753 1193309 1218442 1241434 1261554 1277852 1289085 1294397 1294136 1289539
62050 1289539 1281479 1269894 1254476 1235372 1212966 1187395 1158639 1126930 1092856 1057276 1021186
62039 1021186 985432 950393 916139 882928 851303 821682 794176 768786 745452 723948 704156
62028 704156 686427 671140 657893 645702 634177 623853 615136 607513 600146 592702 585170 577412 569366
62015 569366 561274 553268 545116 536853 529201 522745 517033 511186 505229 500258 497336 496761 498242 501208
62001 501208 504972 509175 514256 521077 529894 539933 549951 558936 566257 571580 574873 576375 576441 575433
61987 575433 573666 571277 568176 564200 559265 553277 546140 537988 529321 520720 512625 505476 499710 495272
61973 495272 491412 487404 483362 479944 477357 475118 472826 470726 469351 468887 469074 469577 470300 471377 472881
61958 472881 474557 475988 477195 478904 482015 486797 492751 499197 505831 512879 520997 531017 543455 558044
61944 558044 573860 590144 607124 626009 647987 673162 700587 729494 760195 793459 829192
61933 829192 866190 903162 939414 974537 1008119 1040053 1070489 1099054 1124644 1146391 1164388
61922 1164388 1178890 1189282 1194464 1194013 1188368 1178207 1164365 1148236 1131516 1115464 1100903 1088899
61910 1088899 1080810 1077571 1079344 1085869 1096679 1110927 1127585 1145972 1165730 1186166 1205966 1223589
61898 1223589 1237576 1246530 1249385 1245917 1236645 1222123 1202690 1178989 1152222 1123561 1093566 1062412
61886 1062412 1030423 998160 966192 934992 904969 876480 849822 825177 802374 780813 759908
61875 759908 739648 720558 703159 687665 674126 662538 652853 645096 639313 635182 631976 629450 628557
61862 628557 630601 635694 642718 650968 661159 674584 691937 713265 738459 767288 799407 834938
61850 834938 874735 919572 969168 1022383 1078150 1135798 1194555 1253189 1310212 1364216 1413947
61839 1413947 1458184 1495602 1524776 1544581 1554724 1555855 1549181 1536158 1518500 1498035 1476379 1454958
61827 1454958 1435426 1419577 1408618 1402910 1402666 1408449 1420432 1437354 1456666 1475683 1492354 1505113
61815 1505113 1512441 1512604 1503709 1484286 1454295 1415544 1370739 1321954 1270156 1216033 1160854 1106382
61803 1106382 1054126 1004839 958619 915444 875585 839447 807014 777681 750812 726357 704686
61792 704686 685932 669689 655240 641838 628833 615871 603068 590873 579672 569500 560056 550894
61780 550894 541747 532838 524756 517830 511704 505770 499966 494871 490941 487845 484673 480752 476252 472065
61766 472065 469043 467291 466261 465503 465115 465289 465700 465688 464949 463780 462601 461563 460586 459591 458645 458113 458581
61749 458581 460336 462935 465598 468079 470687 473378 475344 475936 475682 475889 477316 479655 482211 484635 486930
61734 486930 489218 491682 494401 497050 499087 500577 502514 505881 510443 514885 518197 520530 522682 525135
61720 525135 527854 530702 533638 536640 539773 543382 547975 553808 560660 568018 575339 582156 588104 592961
61706 592961 596625 599069 600317 600462 599691 598342 596919 595795 594832 593483 591546 589708 589066 590117 592365
61691 592365 594771 596319 596367 594979 593055 591674 591009 590144 588205 585453 582953 581386 580521 579800 578997 578196
61675 578196 577310 575908 573593 570566 567700 565846 565002 564351 563281 562135 561676 562049 562694 563240 564000 565349
61659 565349 567078 568726 570312 572269 574778 577623 580712 584261 588305 592513 596749 601396 606683 612069
61645 612069 616894 621492 626984 633929 641760 649714 657638 665492 672643 678268 682196 684815 686229 686040
61631 686040 683961 680253 675494 670166 664491 658428 651857 644962 638362 632682 628052 624260 621176 618714
61617 618714 616550 614365 612380 611270 611416 612450 613487 613557 611928 608503 604052 599712 596062 592755 589035
61602 589035 584412 578952 573236 568081 564055 561223 559431 558548 558165 557444 555853 553890 552430 551490 550271
61587 550271 548326 545880 542967 539153 534445 529695 525687 522428 519678 517367 515089 511952 507670 503142
61573 503142 499254 495625 491376 486659 482454 479094 476003 472868 470156 468269 466945 465774 464782 464198 464030
61558 464030 464033 463852 463198 462228 461721 462425 464220 466282 468098 469819 471659 473484 475126 476623 477921 478775
61542 478775 479149 479319 479409 479253 478899 478789 479096 479322 479014 478592 478964 480351 481895 482464 481586 479640 477324 475003
61524 475003 472431 469077 464723 459652 454214 448505 442630 437033 432179 427935 423617 418732 413485 408466
61510 408466 404052 400246 396942 394080 391564 389210 386923 384859 383305 382311 381472 380153 378002 375287 372702
61495 372702 370731 369209 367537 365399 363157 361436 360416 359696 358876 358021 357487 357408 357535 357552 357411 357378 357727
61478 357727 358389 358947 359094 359056 359317 359880 360058 359185 357342 355202 353361 352108 351679 352204 353288 354049 353956 353489
61460 353489 353611 354533 355329 355021 353858 353089 353459 354379 354855 354810 354931 355425 355700 355435 355271 355998 357500 359042
61442 359042 360333 361739 363593 365805 368198 370773 373559 376541 379795 383415 387201 390692 393607 396024
61428 396024 398089 399793 401191 402548 404119 405914 407790 409657 411528 413573 416219 419920 424618 429542
61414 429542 433836 437395 440835 444617 448361 451158 452454 452453 451654 450219 447957 444876 441493 438418 435756
61399 435756 433127 430298 427572 425410 423729 421823 419064 415665 412587 410675 409922 409622 409124 408335 407512
61384 407512 406727 405640 403821 401256 398457 396070 394416 393495 393276 393725 394554 395317 395887 396599 397715 399060
61368 399060 400361 401665 403032 404159 404758 405112 405778 406935 408528 410815 414057 417770 421095 424051 427649
61353 427649 432574 438458 444723 451368 458517 465962 473712 482334 492103 502395 512608 523153 534776
61340 534776 547281 559754 571743 583295 594007 603012 609987 615440 619902 623489 626306 628510 629717
61327 629717 629100 626458 622646 618583 614269 609192 603359 597433 592032 587182 582417 577232 571590 566106
61313 566106 561550 558037 554899 551582 548406 546112 544763 543541 541776 539879 538894 539245 540375 541714 543514
61298 543514 546344 550116 554230 558488 563063 567494 570546 571460 570669 568837 565917 561822 557405 553838 551258
61283 551258 548853 546174 543590 541503 539878 538677 538141 538480 539735 541990 545217 548954 552703 556759 562053
61268 562053 569090 577514 586776 596614 606630 616053 624355 631828 639268 647327 656292 666210 676926 688234
61254 688234 700166 713054 727237 742771 759246 775674 790727 803474 813817 821934 827611 830559
61242 830559 831017 829284 824843 816944 806170 794451 783147 771864 759695 746872 734522 723318
61230 723318 713195 704167 696643 690752 685880 681101 675918 670531 665577 661718 659332 658381 658388 658610 658501
61215 658501 658125 657903 657864 657520 656670 655842 655496 655264 654617 653969 654339 656062 658561 661271 663976 666322 667928
61198 667928 669208 671274 674751 679420 685198 692721 702578 714701 728851 745055 763140 782474 802604
61185 802604 823619 845488 867575 889231 910241 930321 948786 965307 980445 994866 1008518
61174 1008518 1021208 1033466 1046027 1058620 1069933 1078718 1084545 1087676 1088756 1088475 1087094 1084193 1079080
61161 1079080 1071352 1061022 1048423 1034146 1018660 1001812 983165 963071 942828 923415 904618
61150 904618 885917 867730 851104 836507 823640 812274 802678 795174 789690 785797 782909 780489 778192
61137 778192 775710 772443 767710 761449 754386 747348 740822 735291 731345 729106 728048 727809 728688 731013 734645
61122 734645 739605 746541 755898 767156 779702 794049 811295 831513 853529 876298 899856 924832
61110 924832 951643 980326 1010709 1042503 1075300 1108536 1141473 1173475 1204409 1234472 1263516
61099 1263516 1290915 1316237 1339488 1360458 1378401 1392765 1403633 1410913 1413653 1410815 1402481 1389756
61087 1389756 1373847 1355599 1335463 1313361 1288942 1262513 1235338 1208517 1182080 1155756 1130048
61076 1130048 1105793 1083054 1061335 1040655 1021611 1004492 989042 974928 961924 949796 938593
61065 938593 928828 920823 914132 908145 902955 899094 896718 895640 895827 897306 899951 903909 909788 917818
61051 917818 927285 937485 948724 961593 975785 990565 1006077 1023282 1042832 1064764 1089050 1115695
61039 1115695 1144568 1175762 1209744 1246635 1285973 1327831 1373313 1423036 1475988 1531003 1588496
61028 1588496 1649462 1713647 1780330 1850215 1924773 2003986 2086340 2170700 2256776 2344317 2433813
61017 2433813 2527796 2629654 2741369 2864144 3000851 3155685 3331435 3529231 3751238 4002210
61007 4002210 4289538 4624812 5025358 5511413 6101759 6814795 7673121 8702783 9927694
60998 9927694 11368047 13041315 14956106 17106128 19484434 22104923 24975555 28003017
60990 28003017 30913881 33314492 34891349 35592371 35629745 35323896 34953320 34715398 34735350
60981 34735350 35016550 35357240 35370359 34663996 33059485 30670045 27798757 24771832 21834330
60972 21834330 19132432 16733522 14648264 12853255 11313939 9997056 8870878 7904673
60964 7904673 7072827 6356880 5741757 5212162 4753498 4353725 4002973 3693061 3418286
60955 3418286 3174995 2959520 2767706 2596708 2445496 2312967 2196975 2095477 2006896 1928591
60945 1928591 1856493 1787166 1719325 1652991 1588425 1526369 1467922 1413316 1361664 1312310 1265396
60934 1265396 1220804 1177795 1136207 1096765 1059586 1023598 988173 954194 922664 893223 864919
60923 864919 837576 811559 786935 763789 742707 724155 707810 693108 679826 667590 655592
60912 655592 643610 632698 624012 617380 611778 606762 602598 599350 596631 594158 591919 589887 588090 586820
60898 586820 586380 586717 587474 588131 587984 586530 584198 582105 580702 579231 577014 574593 572836 571460 569370
60883 569370 566256 563000 560470 558658 557126 555784 554927 554762 555007 554923 553928 552274 550791 549730 548241 545379
60867 545379 541295 536916 532700 528281 523271 517926 512919 508794 505703 503454 501792 500710 500333 500404 500199
60852 500199 499195 497525 495523 493153 490416 488026 487127 488247 490829 493747 495983 496963 496731 495912 495200
60837 495200 494800 494558 494544 495133 496458 498075 499357 500159 501017 502758 505834 509950 514411 518853 523448 528315
60821 528315 533026 536963 539918 542023 543259 543481 542830 541759 540637 539641 538955 538591 537960 536119 532654 527943
60805 527943 522356 515675 507743 499257 491291 484083 476881 469052 460852 452929 445584 438778 432460 426454
60791 426454 420428 414485 409516 406323 404516 402909 400976 399171 397731 396099 393970 392042 390990 390281
60777 390281 388891 386841 385088 384065 383276 382386 381781 381842 382480 383723 386030 389583 393860 398467 403845 410533
60761 410533 418116 425551 432408 439119 446123 453407 461030 469444 478831 488454 497150 504478 511047 517632
60747 517632 524268 530425 535804 540510 544540 547632 549850 551780 553703 554960 554656 552774 549968 546458
60733 546458 541836 536009 529570 522991 516086 508694 501330 494616 488370 481786 474378 466366 458193 450058
60719 450058 442022 434341 427488 421726 416665 411481 405886 400718 397120 395139 393651 391811 390033 389266
60705 389266 389782 391092 392691 394402 396190 398132 400536 403806 408198 413857 420876 429033 437664 446118
60691 446118 454273 462363 470480 478494 486229 493367 499245 503193 505077 505256 504078 501761 498733 495600
60677 495600 492620 489472 485778 481612 477286 472836 468069 463107 458590 455170 452996 451829 451500 452006 453210
60662 453210 454855 456981 460043 464434 470118 476988 485283 495378 507399 521360 537402 555454 574941
60649 574941 595485 617750 642920 671311 702163 734903 769809 807015 845440 883142 918360
60638 918360 949885 976807 998339 1013663 1021752 1021718 1013603 998509 977754 952400 923843 894200
60626 894200 865389 838134 812349 788174 766028 745934 727481 710473 695208 682198 671881
60615 671881 664348 658926 654258 649286 644046 639114 634548 629798 624381 618066 610682 602376 593878 585759
60601 585759 577553 568335 558111 547800 537809 527566 516782 506264 496965 488796 481011 473311 466049
60588 466049 459592 453995 449165 444998 441448 438664 436874 435984 435624 435792 437060 439746 443239 446624 449756
60573 449756 453165 457115 461385 466102 472149 480367 490631 502018 513767 525816 538557 552362 567305
60560 567305 582990 598439 612318 623536 631666 636712 638570 637007 632250 625381 617972 611407 606660
60547 606660 604430 605157 608843 615134 623609 633901 645611 658371 671951 686013 699651 711469 720260
60534 720260 725442 726755 723950 717165 707468 696613 686105 676719 668853 662954 659255 657351 656473 656314
60520 656314 657288 659761 663339 667235 671203 675620 680601 685614 690368 695699 703074 713226 725676 739526
60506 739526 754225 769462 784882 800428 816910 835964 859346 888241 923016 963378 1008756
60495 1008756 1058605 1112266 1168514 1225339 1280246 1330613 1373692 1406535 1426386 1431341 1420724
60484 1420724 1395051 1355948 1306008 1248247 1185416 1119859 1054049 990798 932491 880107 833226
60473 833226 791008 752969 718924 688678 662008 638699 618284 599906 582740 566581 551838
60462 551838 538903 527653 517558 508149 499327 491281 484139 477827 472336 467958 464875 462459 459492
60449 459492 455425 451084 447729 445647 444113 442493 440743 438955 437086 435247 433686 432305 430747 429174
60435 429174 428371 428764 429789 430524 430468 429401 427132 424031 421331 420116 420093 420041 419413 418882 419209 420157 420770 420416
60417 420416 419359 418490 418615 419750 421052 421585 421187 420456 419962 419742 419571 419392 419288 419218 419013 418621 418270 418335
60399 418335 418971 419933 420868 421754 422873 424300 425678 426672 427439 428446 430005 432158 434832 437832 440804 443453
60383 443453 445757 447834 449722 451413 452898 454125 455212 456833 459843 464195 468699 472402 475801 480000
60369 480000 485039 490022 494756 500181 506847 513867 520010 525192 530200 535271 539702 542781 544502 545234
60355 545234 545124 544076 542136 539659 537103 534754 532695 530988 529803 529270 529261 529431 529585 530035 531589 535058
60339 535058 540502 546915 552841 557452 560870 563477 565298 566301 566854 567384 567731 567377 566248 564811 563293
60324 563293 561255 558117 553878 549199 544963 541807 539874 538904 538643 539079 540255 542143 544922 549130 555109
60309 555109 562512 570826 580325 592102 607149 625704 647341 671369 697366 725704 757019 790317
60297 790317 821909 847379 864761 874847 878270 873611 859139 835447 805548 772999 740795 711336
60285 711336 686068 664990 647202 632051 619304 608476 598806 589921 581907 574634 567632 560764 554560
60272 554560 549598 545914 543165 541054 539420 538127 537025 535933 534749 533765 533750 535301 538058 540876 542856
60257 542856 543957 544573 544870 544717 543963 542570 540616 538284 535764 533064 530073 526851 523683 520789 518197
60242 518197 515981 514421 513715 513698 513996 514353 514640 514672 514310 513789 513745 514781 516982 519890 522917 525809 528765
60225 528765 532116 535824 539333 541963 543501 544296 544787 545096 545184 545202 545378 545659 545792 545850 546298 547335 548487
60208 548487 549169 549453 549903 550799 551949 553234 554856 556942 559243 561382 563170 564563 565560 566286 566904 567304
60192 567304 567158 566454 565765 565736 566445 567399 568037 568117 567747 567159 566378 565128 563306 561484 560525 560533 560589 559795 558232
60173 558232 556617 555414 554759 554947 556297 558501 560559 561556 561336 560465 559766 559843 560672 561605 561983 561820 561763 562445
60155 562445 564059 566388 568945 571186 572940 574642 576834 579479 582192 585050 588644 593152 597944 602434
60141 602434 606946 612288 618788 626183 634280 643270 653389 664644 676782 689151 700664 710367 718148
60128 718148 724382 728664 729389 725105 716175 704735 693118 682628 673607 666036 659756 654467 649950 646230
60114 646230 643370 641162 639216 637347 635698 634463 633521 632418 630777 628777 627078 626030 625059 623177 620202
60099 620202 617073 614791 613476 612800 612909 614273 616761 619587 622352 625617 630181 636164 643076 650502 658413
60084 658413 666948 676211 686188 696639 707027 716642 724753 730597 733392 732601 728283 721194 712458 703054
60070 703054 693484 683920 674620 665998 658205 650843 643364 635637 627955 620572 613529 606839 600547 594666
60056 594666 589289 584656 580719 576791 572111 566765 561561 556927 552465 547737 542934 538501 534626 531440
60042 531440 529288 528315 528091 528076 528179 528498 528792 528741 528560 528836 529730 530802 531697 532658 534179 536315 538467 539801
60024 539801 539843 538686 536624 533707 529785 524893 519264 512951 505818 497982 489988 482437 475724 470121 465620
60009 465620 461652 457492 453145 449266 446024 442842 439630 437411 436992 437714 438433 439154 440602 442606 444151
59994 444151 445019 446125 448041 450278 452377 454684 457471 460194 462312 464254 466852 470243 473883 477248
59980 477248 479975 481707 482517 483288 485009 487734 490615 492822 493946 493705 491946 489086 486087 483721 482087
59965 482087 480929 480098 479588 479352 479350 479616 480125 480617 480728 480299 479527 478783 478257 477833 477337 476820 476452 476135 475494
59946 475494 474387 473212 472484 472242 472183 472311 473049 474550 476153 476813 476074 474469 472978 472134 471654 470869 469511
59929 469511 468039 467099 466696 466170 465075 463765 462831 462214 461450 460701 460817 462053 463392 463767 463584 464247 466356
59912 466356 469155 471834 474511 477614 480971 484097 486857 489308 491191 492221 492684 493232 494183 495475 497201
59897 497201 499619 502641 505813 508887 512002 515258 518513 521664 524740 527662 530329 533052 536470 540775
59883 540775 545386 549636 553488 557345 561431 565638 569751 573585 577048 580356 583961 587906 591350 593138
59869 593138 592911 591422 589691 588038 585983 582939 578934 574766 571511 569721 568998 568429 567555 566844 567144 568758
59853 568758 571195 573852 576722 580403 585583 592664 601674 612256 623775 635784 648412 661986 676057
59840 676057 689027 698995 704956 707156 706627 704625 702363 700852 700744 702164 704407 705769 704155 698434
59826 698434 689267 678382 667115 655835 644517 633298 622361 611687 601153 590699 580298 569979
59814 569979 560005 550862 542894 536076 530220 525273 521235 517863 514642 511245 507985 505650 504678 504560 504270
59799 504270 503305 501921 500292 497972 494643 490999 488203 486552 485221 483387 481076 478755 476593 474420
59785 474420 472136 469889 468013 466904 466707 466987 466911 465922 464121 461998 460009 458468 457499 456900 456298 455627
59769 455627 455214 455255 455486 455619 455818 456400 457218 457707 457539 456941 456340 456002 456101 456920 458723 461410 464379 466818
59751 466818 468224 468718 468915 469450 470567 472091 473728 475374 477141 479125 481232 483299 485291 487273 489155
59736 489155 490692 491796 492703 493793 495320 497330 499596 501588 502776 503136 503115 502943 502285 500849 499016 497500
59720 497500 496557 495943 495400 494710 493455 491314 488709 486650 485753 485772 486149 486599 487018 487218 487102 486871 486821 487062
59702 487062 487557 488237 488957 489497 489796 490108 490814 492085 493672 495024 495730 495957 496303 497038 497721 497792 497272 496545
59684 496545 495729 494788 494084 494141 494893 495728 496384 497187 498314 499444 500376 501408 502682 503597 503315 501632 499071
59667 499071 496325 493818 491572 489311 486840 484415 482462 480980 479627 478433 477852 477943 478075 477744 477225 477104
59651 477104 477669 479092 481649 485210 488936 492048 494642 497223 499699 501372 501726 500732 498613 495824 493150
59636 493150 491238 490033 489041 488032 487114 486275 485413 484784 484900 485917 487507 489375 491496 493791 496001 497958
59620 497958 499663 501017 501863 502368 502933 503504 503368 501948 499589 497238 495509 494328 493427 492823 492688 492921
59604 492921 493148 493186 493386 494285 495902 497520 498373 498493 498719 499781 501460 502778 503011 502387 501753 501666 502034 502569
59586 502569 503230 504045 504782 505129 505000 504366 502953 500507 497330 494117 491304 488856 486649 484514 481905 478125
59570 478125 473148 467862 463276 459812 457408 455873 454913 454280 454119 454740 455862 456582 456475 456240 456820 458250
59554 458250 459873 461334 462824 464514 466285 468003 469685 471383 473149 475117 477484 480494 484466 489586
59540 489586 495704 502651 510739 520424 531515 543581 557273 573919 592765 609460 618819 619233 613591
59527 613591 606122 599338 593923 590071 588009 587765 589274 592708 598369 606306 616138 627098 638164 648294
59513 648294 656666 662816 666700 668717 669387 668794 666532 662394 656717 649818 641487 631605 620873 610337
59499 610337 600306 590354 580267 570408 561195 552799 545375 539109 533931 529610 526109 523458 521348 519372
59485 519372 517619 516552 516294 516493 516856 517348 517879 518333 518926 520074 521914 524435 527957 532793 538403 543562
59469 543562 547536 550504 552737 554096 554593 554808 555332 556299 557752 559972 563077 566794 571063 576462 583621
59454 583621 592512 602765 614436 628032 643837 661481 680162 699151 718164 737226 756050 773659
59442 773659 788842 800791 808869 811985 809020 800044 786602 770645 753644 736775 721030 706656
59430 706656 693034 679660 666942 655716 646419 639114 633856 630555 628766 628092 628652 630943 635523 642977
59416 642977 653758 667781 684530 703665 725125 748680 774140 801917 831884 860873 882734
59405 882734 892541 890553 881189 868787 855553 842727 831472 822280 815113 810630 809523 809620 805147 790666
59391 790666 765643 734356 701834 670888 642494 617210 595467 577210 561988 549247 538364
59380 538364 528785 520476 513963 509557 506600 503720 499919 495303 490809 487356 485257 484242 483857 483738 483644
59365 483644 483430 483150 483148 483863 485422 487399 489068 490058 490806 492284 495127 499070 503360 507666 512406 518223
59349 518223 525434 534142 544534 556777 570753 586264 603465 622761 644141 666885 690001 712714
59337 712714 734477 754835 773515 790364 804913 816232 823615 827247 827845 825669 820331 811635 800153
59324 800153 786817 772216 756482 739644 721942 703985 686646 670498 655253 640106 624877
59313 624877 610520 598308 588715 581272 575187 569818 564901 560810 558436 558373 560231 563077 566533 571046
59299 571046 577170 585018 594627 606484 621266 639026 658897 679850 701605 724216 746265 763852
59287 763852 772406 769976 758504 741851 723294 704987 688584 675114 664544 656369 650551 647292
59275 647292 646276 646986 649545 654321 660882 668354 676759 686880 698628 710709 722341 734265 747409
59262 747409 761395 775023 787422 797939 805553 809436 809804 807389 802278 794017 782728 769324 754608
59249 754608 738861 722422 706139 690994 677627 666304 656983 649343 643066 638219 635112 633705 633478
59236 633478 633990 635364 638082 642451 648402 655672 664009 673108 682480 691573 700149 708347 716047 722237
59222 722237 725447 725054 721805 716822 710431 702387 692917 682878 672873 662784 652399 641968 631715
59209 631715 621220 609902 598124 587171 577882 569756 561829 554110 547487 542321 537872 533360 528931
59196 528931 525161 522097 519423 517214 515794 514984 514193 513348 513154 514239 516510 519462 522636 525646 528199
59181 528199 530355 532499 534895 537540 540487 543900 547718 551748 556251 561906 568852 576164 582700 588305
59167 588305 593964 601009 610310 621824 634502 646846 657991 668245 678524 689359 700540 711344
59155 711344 720899 728497 733895 737320 739116 739423 738126 734918 729471 721903 713074 704095 695484 687117
59141 687117 678911 671050 663464 655673 647465 639350 632098 626053 621019 616443 611680 606560 601806 598484
59127 598484 596926 596702 597602 599919 603571 607824 612381 618017 625593 635032 645810 657831 671082 684959
59113 684959 698743 712473 726635 741236 755821 770089 783773 796118 806307 814507 821885 829476
59101 829476 837402 845102 851858 857098 860677 862978 864455 865107 864660 863138 860971 858608 856284 854016 851660
59086 851660 849141 846730 844734 842725 839606 834812 828936 822684 815720 807221 797129 786125 774607
59073 774607 762469 749768 736971 724613 713280 703739 696442 691000 686662 683078 679992 676603 672180
59060 672180 667178 662806 659452 656449 653444 650928 649068 646970 643714 639492 635143 631030 626880 622376
59046 622376 617486 612504 608134 605220 603970 603632 603247 602581 602106 602270 603038 604048 605033 606128 607750 610093
59030 610093 612881 615895 619603 624798 631559 639102 646791 654839 663779 673679 684257 695446 707395
59017 707395 720001 732784 745208 756918 767688 777319 785620 792408 797487 800694 802043 801904 801038
59004 801038 800262 799962 800088 800734 802483 805878 810776 816554 822872 829824 837292 844576 850859 855774 859347
58989 859347 861582 862390 861882 860569 859049 857319 854450 849196 841046 830594 818874 806610 794224 782160
58975 782160 770876 760733 752123 745483 740902 737925 736038 735214 735812 738200 742697 749433 757876 766798
58961 766798 775246 783387 792026 801508 811468 821320 830453 838096 843621 846910 848031 846654 842278 834962
58947 834962 825416 814492 802969 791585 780752 770356 760371 751525 744814 740443 737704 735762 733962
58934 733962 731495 727509 721710 714403 705910 696390 686212 676026 666445 657966 650941 645133 639553 633427
58920 633427 627172 621756 617277 613031 608868 605532 603494 602341 601633 601638 602850 605336 608818 612907 617112
58905 617112 621247 625983 632346 640481 649598 659313 670201 682607 695694 708298 720200 731957 743887
58892 743887 755842 767783 780073 793324 808281 825701 845994 869009 894261 921275 949650
58881 949650 978939 1008397 1036645 1061801 1082459 1098415 1109994 1116837 1118099 1113733 1104696 1091646
58869 1091646 1074374 1052922 1028542 1002954 977154 951510 926561 903145 881915 863100 846503
58858 846503 831455 817028 802558 787799 772555 756609 740191 724019 708596 693871 679864
58847 679864 667128 656222 646988 638697 630692 622791 615353 609045 604152 600005 595527 590437 585361 580730
58833 580730 576309 572087 568783 566851 565618 564035 561913 559758 557763 555615 553147 550575 548109 545821
58819 545821 543937 542895 543023 544283 546334 548811 551556 554617 557863 560759 562792 564049 564982 565739 566138
58804 566138 566254 566370 566294 565363 563338 560768 558273 556027 554118 552802 552037 551244 549910 548131 546456 545612
58788 545612 546439 549400 553877 558503 562530 566397 570801 575788 581009 586205 591130 595569 599801 604421
58774 604421 609353 613595 616272 617370 617179 615768 613407 610734 607939 604517 600437 596860 594980 594669 594967
58759 594967 595397 596043 596810 597441 598048 598971 600329 602221 605038 609017 613747 618673 623808 629462 635582 641849
58743 641849 648098 654252 660225 666301 673111 680684 688147 694997 702077 710471 719882 729028 737347 745310
58729 745310 753279 761073 768710 776663 785083 793475 801418 809107 816884 824625 831773 837780 842446 846145
58715 846145 849773 854308 860259 867467 875289 882983 890211 897293 904689 912108 918448 922696 924527 924001
58701 924001 921161 916067 908679 898533 885143 868912 851003 832068 811902 790686 769699 750129
58689 750129 731917 714527 698212 683719 671286 660703 651934 644832 638525 631871 624388 616234 607654
58676 607654 599048 591250 585010 580345 576781 573916 571445 569186 567627 567817 570080 573389 576720 580411
58662 580411 585408 591725 598572 605477 612293 618405 623023 626166 628530 630487 631964 633086 634156 635096
58648 635096 635610 635737 635674 635323 634638 634054 633869 633572 632584 631257 630274 629401 627877 625827 624311 624027 624793 626222
58630 626222 628076 630010 631774 633630 635889 638144 639597 639935 639241 637421 634650 632145 631474 633124 636492
58615 636492 641123 647026 653968 661478 669624 678930 689473 700782 712539 724537 735991 745690 752895
58602 752895 757501 759630 759884 759733 760511 761955 762606 761569 759004 755033 749373 742282 734861 728066 722145
58587 722145 717191 713552 711565 711501 713762 718429 724707 731636 739242 748142 758114 768011 777093 785488 793273
58572 793273 800118 806028 811474 816603 821170 825468 830477 836881 844718 854115 865482 878750 893225
58559 893225 908448 924465 941065 957589 973703 989453 1004209 1016389 1024774 1029585 1031872 1032250
58547 1032250 1030534 1026262 1019284 1010025 999213 987258 974219 960604 947579 935781 924455 912535
58535 912535 899990 887265 874073 859988 845843 833216 822633 813496 805553 799116 793956 789395
58523 789395 785652 783740 783923 785467 788009 791802 796476 801006 805183 809715 814514 818327 820645 822598
58509 822598 825270 828322 831029 833583 836637 840493 845391 851663 858942 866108 872695 879517 887284 895440
58495 895440 902994 909651 915358 919433 920954 919588 915520 909017 900547 890864 880584 869965 859285
58482 859285 849010 839560 831408 825235 821298 818852 817114 816591 818316 821908 825763 829190 832903 837096
58468 837096 840603 842547 843362 843438 842029 838450 833290 827618 821848 816221 811496 808222 805953 803899 801865
58453 801865 800066 798659 797914 798181 799204 800188 800877 801843 803395 805071 806589 808336 810384 811911 812206 811578
58437 811578 810837 810556 811206 813180 816259 819778 823586 828117 833276 838203 842435 846499 851144 856836 864068
58422 864068 873052 882957 892658 902476 913988 927724 942224 955652 967081 975874 981285 983375 983203
58409 983203 981541 978461 974569 971302 969413 968196 966729 964814 962407 959429 956535 954858 954619 955246 956920
58394 956920 960356 964843 968395 970382 972090 974050 974818 973317 970382 966849 962061 955633 948967 943492
58380 943492 938899 934506 930996 929297 929014 929396 930686 933185 936151 938973 942366 947145 952832 958649 964829
58365 964829 971781 979123 986692 995366 1005619 1016355 1026371 1036013 1046255 1057167 1068323 1079734
58353 1079734 1091344 1102600 1113367 1124124 1134509 1143028 1149049 1153667 1157814 1161159 1163780 1167174 1172417
58340 1172417 1178950 1186266 1195045 1205470 1216280 1226789 1237995 1250399 1262820 1274841 1288209 1303905
58328 1303905 1319950 1334265 1347865 1362912 1379239 1395087 1409881 1423963 1436829 1447847 1457745
58317 1457745 1467520 1476919 1485641 1494733 1505063 1515867 1526486 1537968 1551160 1565012 1578690 1593563
58305 1593563 1610929 1629585 1647989 1667066 1688350 1710998 1733308 1755774 1779979 1805636 1831253
58294 1831253 1856550 1881884 1906536 1929962 1953429 1978093 2002825 2026267 2049534 2074412 2100433
58283 2100433 2126286 2152609 2180732 2210182 2240004 2271057 2304378 2338959 2373823 2410549 2450794
58272 2450794 2493120 2535342 2578286 2624079 2672400 2721691 2772470 2826130 2882009 2938953 2998197
58261 2998197 3061408 3127593 3195279 3265831 3341077 3419546 3498881 3580084 3665399 3753885 3843193
58250 3843193 3933904 4027927 4124443 4221848 4321955 4427751 4538753 4653120 4772499 4900027
58240 4900027 5035350 5176560 5325300 5484854 5655002 5833882 6023063 6225531 6440757
58231 6440757 6667424 6908823 7169528 7448914 7744351 8058625 8397391 8761488 9149107
58222 9149107 9563723 10012272 10497205 11018244 11580500 12192879 12860136 13584948 14376312
58213 14376312 15247365 16207023 17263351 18433538 19740923 21204850 22845173 24695670
58205 24695670 26802264 29211532 31975885 35170546 38893810 43255500 48384230 54446698
58197 54446698 61642272 70177896 80265166 92136643 106033841 122162894 140659758
58190 140659758 161562185 184758543 209970888 236847002 265010380 293746286 321341125
58183 321341125 344729174 360173810 364850029 358227825 342207821 320039220 294997895
58176 294997895 269684909 245947604 224886574 206692350 190615852 175421380 160146006
58169 160146006 144588772 129195887 114587481 101201153 89235392 78730705 69619161
58162 69619161 61751508 54953238 49073621 43983139 39554677 35675328 32266066 29271133
58154 29271133 26636666 24313359 22267695 20471840 18887667 17474341 16205651 15066732
58146 15066732 14039029 13101368 12241906 11456822 10739625 10081774 9480686 8936869 8444902
58137 8444902 7995821 7585912 7214829 6877576 6566711 6280112 6018158 5774990 5540699
58128 5540699 5311130 5088498 4873948 4666797 4469728 4287192 4118830 3960609 3811612
58119 3811612 3673706 3545634 3423807 3308313 3202025 3104179 3010587 2919886 2834041 2753024
58109 2753024 2674436 2598296 2526954 2460152 2395016 2330907 2269746 2211679 2154966 2099967 2048650
58098 2048650 2000237 1951749 1902899 1856195 1812249 1769226 1726948 1687299 1650331 1613975 1577901
58087 1577901 1543897 1512199 1481133 1450579 1422239 1396277 1371121 1346672 1324293 1303554 1282381
58076 1282381 1260510 1239462 1219189 1198122 1176503 1156153 1136937 1116961 1096408 1077571 1060820
58065 1060820 1044059 1026622 1010311 996000 982508 969461 958066 948348 938581 928080 917743 907353
58053 907353 895313 881582 867935 854771 840644 825592 811893 800639 790367 780010 770487 762404
58041 762404 754774 747012 739857 733408 726524 718999 712056 705966 699396 691899 684740 678491 671979 664391
58027 664391 656218 647485 637327 626125 615725 606672 597425 587312 577992 570833 564902 558790 552575
58014 552575 546729 540774 534289 527914 522298 517273 512804 509445 507220 505347 503612 502623 502300 501601 500222
57999 500222 499047 498535 498247 498318 499660 502144 504312 505502 506614 508216 509578 510262 511037 512458 513998 515265
57983 515265 516751 518773 520960 523195 525634 527484 527344 525237 522807 521107 519690 518153 516776 515239
57969 515239 512557 508948 505917 503797 501029 496741 492300 489254 487229 484937 481943 478489 474691 470788
57955 470788 467176 463588 459230 454176 449461 445509 441797 438332 435929 434590 433186 431286 429806 429334
57941 429334 429391 429847 431441 434257 437328 440450 444707 450451 456428 461842 467688 475003 483127 490666 496941
57926 496941 501775 505103 507569 510193 512785 513979 513366 512074 510690 508275 504176 499081 493452 486619
57912 486619 478354 469672 461082 451807 441775 432610 425324 418661 411145 403298 396394 390385 384511 378655
57898 378655 372742 366023 358419 351412 346232 342206 338160 334226 330928 327738 324084 320770 318882 318217
57884 318217 318150 319019 321213 323865 325977 327988 330715 333544 335193 335666 336056 336951 338199 339545 340420 339902
57868 339902 338089 336599 336510 336798 336116 335011 334788 335203 335131 334793 335406 337035 338567 339631 340965 343019 345587
57851 345587 348650 352370 356492 360874 366098 372318 378058 381650 383490 385378 387888 389855 390257 389174
57837 389174 386962 383917 380726 377960 375063 371050 366176 361747 358299 355178 351917 348877 346396 344343
57823 344343 342633 341284 339986 338538 337668 338440 340892 344129 347671 351690 356019 359970 363271 366371 369696
57808 369696 373244 376700 379166 379076 375382 368800 361126 353526 346250 339515 333415 327203 319994 312305 305743
57793 305743 301028 297362 293895 290725 288132 285853 283561 281298 279056 276529 273665 271018 269262 268696
57779 268696 269200 270331 271551 272819 274820 278129 282311 286384 289953 293372 297023 300975 305064 308762
57765 308762 311365 312944 314625 317200 319935 321608 322193 322433 322257 320961 318751 316743 315353 313833 311590
57750 311590 308902 306158 303406 300828 298679 296514 293366 289031 284373 280210 276645 273626 271208 269043
57736 269043 266478 263550 261158 259913 259465 259204 258913 258450 257509 256143 254970 254506 254661 255049 255334 255187 254504
57719 254504 253850 254131 255515 257127 257999 257969 257522 257190 257282 257814 258512 259111 259639 260238 260953 262042 264148 267587
57701 267587 271735 275846 280258 286048 293570 302070 310721 319271 327631 335521 342510 347758 349855 347761
57687 347761 342048 334499 326449 318241 310249 303398 298403 295303 294059 294928 298092 303747 312863 327073
57673 327073 347342 373391 404775 441731 484385 531797 582659 636644 694053 753415 809223
57662 809223 852231 872878 865917 833002 781414 720289 657349 597516 542984 494201 451334 414956
57650 414956 385134 360408 338614 318735 301209 286435 273868 262711 252740 244085 236806 230924
57638 230924 226402 222841 219654 216603 213774 211066 208272 205673 203868 202945 202408 201923 201470 200776 199418
57623 199418 197717 196677 196684 196878 196122 194111 191331 188552 186571 185788 185648 184988 183291 181212 179689 178979
57607 178979 178682 178259 177366 176150 175297 175330 175853 176016 175642 175215 174807 173898 172377 170808 169459 167932 166106
57590 166106 164559 163512 162106 159390 155540 151543 148065 145054 142136 139038 135886 133346 132021 131575
57576 131575 130918 129422 127482 125720 124210 122681 120877 118485 115330 111952 109429 108348 108387 108983 109744
57561 109744 110117 109511 108067 106567 105298 103821 102171 101290 101701 102633 103129 103321 103879 104917 106130 107386
57545 107386 108437 108662 107917 107141 107292 108166 109082 110260 112506 115726 118728 120543 121255 121509 121832 122474 123421
57528 123421 124513 125873 128023 131223 134879 138060 140450 142369 144139 145896 147861 150219 152716 154822
57514 154822 156333 157517 158649 159556 159534 157699 153758 148649 144012 140700 138037 134726 130071 124160 117496
57499 117496 111044 106115 103445 102429 101690 100288 98164 95803 93927 93197 93767 95309 97718 101362 106282
57484 106282 111682 116773 121634 126643 131606 136166 140647 145531 150362 154108 156561 158516 160542 162393
57470 162393 163747 164715 165400 165667 165729 166370 168164 170818 173567 175906 177722 179066 180101 181114 182277 183474
57454 183474 184435 184944 184943 184624 184413 184661 185257 185695 185508 184521 182829 180821 179174 178449 178577 178975 179253 179572
57436 179572 180181 180831 180928 180253 179303 178763 178749 178773 178413 177689 176676 175206 173369 171948 171741 172518 173263 173415
57418 173415 173215 172818 171861 170254 168657 167666 167067 166392 165749 165519 165638 165736 165710 165665 165530 165194 164798 164449 163913
57399 163913 163050 162296 162261 163003 164087 165102 165743 165689 164901 163843 163006 162432 162066 162197 162996 163963 164476 164642
57381 164642 165016 165701 166367 166940 167599 168163 168200 167762 167436 167664 168512 170007 172030 173902 174767 174552 174009 173771
57363 173771 173905 174448 175665 177509 179371 180697 181482 182006 182522 183399 185129 187823 190958 193845 196108 197684
57347 197684 198679 199436 200386 201569 202589 203210 203697 204352 204992 205245 205188 205366 206200 207561 208980 210141 211096
57330 211096 212059 213062 213876 214229 213961 213012 211495 209865 208716 208132 207489 206191 204423 202882 201882 201042
57314 201042 199788 197855 195396 192926 191144 190452 190588 190904 190959 190685 190107 189184 187875 186169 184181 182404
57298 182404 181608 182122 183373 184479 185168 185735 186330 186807 187248 188063 189472 191275 193206 195125 196805 198000
57282 198000 198856 199876 201263 202594 203424 203979 205001 207029 210053 213818 218221 223267 228729 234079 238958
57267 238958 243624 248627 253987 259042 263257 266862 270466 274337 278382 282544 286806 290905 294445 297289
57253 297289 299610 301645 303601 305677 307923 310237 312639 315409 318804 322832 327374 332142 336426 339453
57239 339453 341328 343093 345480 348105 350341 352321 354500 356893 359582 363310 368471 373885 377891 380598
57225 380598 383817 388550 393731 397868 400975 404211 408316 413062 417864 422395 426791 431543 437024 443055
57211 443055 449214 455524 462371 469723 476983 483771 490362 497186 504314 511604 518884 525972 532939 540370
57197 540370 548825 557998 567093 576082 585845 596849 608541 620425 632976 646836 661671 676500
57185 676500 690875 705160 719930 735549 752127 769443 787036 804750 823048 842529 863294
57174 863294 885051 907620 931026 955228 980063 1005348 1030883 1056435 1081862 1107114 1132044
57163 1132044 1156366 1179846 1202350 1223716 1243847 1262984 1281606 1300015 1318276 1336502 1354749
57152 1354749 1372683 1389890 1406639 1423760 1441481 1458918 1475114 1490226 1505256 1520859 1536796
57141 1536796 1552412 1567322 1581677 1595955 1610510 1625291 1640028 1654638 1669335 1684530 1700858
57130 1700858 1719058 1739424 1761531 1784911 1809784 1836530 1864680 1893250 1922139 1952424 1985156
57119 1985156 2020633 2059115 2101371 2148024 2199027 2254383 2314938 2381974 2456508 2539551 2632825
57108 2632825 2738681 2859467 2997337 3154558 3333785 3538262 3772122 4040645 4350349
57099 4350349 4709083 5125830 5609858 6169726 6812905 7545446 8370653 9287440 10289978
57090 10289978 11368455 12509381 13695363 14905736 16117917 17308263 18452790 19528482
57082 19528482 20513057 21381498 22104266 22654365 23019917 23208176 23233853 23103344 22811771
57073 22811771 22354250 21737492 20981121 20111360 19154886 18135878 17075195 15990993 14900156
57064 14900156 13818833 12761350 11739119 10761042 9834677 8966645 8162061 7423564 6750510
57055 6750510 6139050 5583525 5078258 4618183 4198378 3813992 3461200 3137918 2843291
57046 2843291 2576506 2336129 2120250 1927017 1754917 1602493 1467854 1348754 1243306
57037 1243306 1150302 1068666 996885 933369 877191 828188 786448 751922 724424 703894 690799
57026 690799 686216 691361 707224 734862 775370 828790 894028 971525 1064740 1174428 1288760
57015 1288760 1381778 1426383 1410998 1343906 1243611 1127646 1008877 896444 795757 707989
57005 707989 631736 565598 508821 460394 418772 382556 350920 323555 300481 281645 266413
56994 266413 253729 242826 233457 225503 218946 214186 211719 211319 212204 214111 217502 222613 229033 236302
56980 236302 244008 250970 255285 255821 253083 248225 241936 234774 227721 221560 216094 210667 205219 200368
56966 200368 196799 195044 195481 198050 202218 207694 214901 224346 235743 248142 260678 272707 283383
56953 283383 291508 295823 295336 289637 279186 265298 249789 234643 221652 211648 203963 197203 190864
56940 190864 185853 183324 183609 186469 191805 199611 209655 221641 235455 250996 267960 285798 303328
56927 303328 318209 327507 329298 323525 311236 293752 272940 251415 231418 213610 197478 182681
56915 182681 169504 158251 148834 140922 134091 127891 122107 116919 112592 109157 106560 104864 104022 103705
56901 103705 103583 103590 103785 104310 105562 107998 111535 115643 120353 126676 135603 147066 160233 174370 188996
56886 188996 203664 218178 232694 247023 259948 269622 274554 274104 268605 259527 249095 239123 230325
56873 230325 222953 217619 215012 215338 218745 225918 237546 253449 272907 295686 322074 352047 385068
56860 385068 420681 458655 498344 537968 574221 602379 617618 617509 603550 580042 551690 522438
56848 522438 495531 473106 455528 442138 433006 429387 432436 442315 458737 481699 511315 547492
56836 547492 589968 638243 691327 747984 807019 866301 921023 963726 987030 986916 964001 922715
56824 922715 869522 811019 752431 697224 647624 604979 569693 541564 520665 507594 502688 505417
56812 505417 514895 530629 552466 580103 612966 650256 690691 732085 771000 802595 821160 822040
56800 822040 804089 770451 726721 678292 629062 581599 537646 498475 465140 438349 417857
56789 417857 402357 390515 382132 378024 378847 384401 394002 407071 423148 441575 461254 480405 496269
56776 496269 505328 504460 492464 470690 442186 410197 377324 345529 316174 289764 266023 244614
56764 244614 225629 209123 194521 180997 168336 156962 147092 138355 130306 122908 116376 110879 106486
56751 106486 103004 99807 96266 92568 89638 87950 86796 85122 82744 80239 77904 75472 72869 70613
56737 70613 69197 68453 67886 67337 66898 66307 65026 63061 61239 60283 59914 59340 58439 57834 57781 57688 57060 56355
56719 56355 56336 56901 57157 56566 55563 55035 55526 56907 58468 59396 59421 59043 58918 59191 59620 60037 60334 60252 59715
56700 59715 59200 59239 59639 59768 59553 59557 60010 60422 60356 59971 59524 58881 57896 56959 56771 57743 59802 62540 65387
56681 65387 67922 70294 73153 77032 81993 87903 94698 102197 110009 117923 126174 135065 144420 153640
56667 153640 162192 169944 177129 184042 190702 196743 201691 205323 207723 209132 209918 210408 210518 209760 208035
56652 208035 206053 204500 203111 201314 199555 198957 199570 199966 198982 196986 194893 192737 190025 186981 184547
56637 184547 183295 182979 183094 183353 183661 184098 184922 186288 187951 189471 190626 191411 191788 191682 191158 190409 189613
56620 189613 188896 188238 187348 185857 183767 181503 179416 177502 175696 174077 172635 171138 169464 167764 166103
56605 166103 164236 161926 159218 156253 153143 150180 147763 145909 144218 142462 140838 139424 137935 136269
56591 136269 134816 133896 133397 133296 133917 135136 135961 135616 134742 134772 136282 138516 140388 141465 142082 142973 144637
56574 144637 146715 148257 148963 149690 151199 152884 153562 153214 153016 153783 155327 157469 160705 165465 171367 177695
56558 177695 184193 191025 198223 205510 212469 218683 223882 228136 231787 235134 238240 241014 243286 244876
56544 244876 245782 246269 246645 247018 247408 247873 248263 248064 246869 244851 242448 239741 236492 232677 228528 224158
56528 224158 219520 214741 210086 205598 201126 196704 192610 188998 185734 182572 179311 175879 172545 169864
56514 169864 168063 166647 164994 163179 161750 160767 159660 158131 156688 155988 156013 156191 156227 156521 157679 159680
56498 159680 161706 162929 163364 163678 164298 165128 166062 167076 167661 166984 165103 163346 162862 163336 163786 163999 164313
56481 164313 164445 163636 161831 159784 158052 156759 156300 157232 159238 161074 161955 162383 163356 165194 167332 168795
56465 168795 168830 167601 166314 166080 166661 166989 166923 167608 169817 172826 175359 177028 178295 179535 180765 181954
56449 181954 183106 184095 184761 185096 185192 185165 185114 185000 184594 183839 183159 183013 183217 183185 182818 182617 182884 183385 183867 184336
56429 184336 184692 184669 184358 184274 184671 185273 185828 186447 187160 187606 187488 186978 186460 186127 185973 185884 185702 185511 185775 186759
56409 186759 187920 188417 188265 188376 189414 191207 193283 195313 196930 197815 198139 198340 198355 197705 196400 195037
56393 195037 193902 192821 192037 192264 193495 194648 194856 194410 194003 193858 194050 194827 195981 196644 196389 195896 195930
56376 195930 196315 196546 196689 196940 196954 196503 196309 197309 199400 201741 203994 206465 209233 211971 214518 216905
56360 216905 218834 219834 220017 220151 220838 221972 223020 223579 223600 223261 222650 221653 220440 219887 220864 222982 224748
56343 224748 225382 225756 227062 229281 231630 233890 236359 238897 241000 242755 244849 247553 250308 252482 254049
56328 254049 255381 256691 257817 258432 258465 258386 258927 260472 262921 266059 269566 272684 274577 275324 275840 276454
56312 276454 276276 274611 272379 271299 271973 273454 274544 274870 274794 274785 274990 275204 275319 275807 277324 279757 282199
56295 282199 284078 285661 287142 288019 287921 287414 287318 287761 288487 289529 290860 291913 292268 292435 293201 294522 295800
56278 295800 296995 298646 300925 303379 305591 307530 309307 310995 312618 314034 315044 315859 317145 319311
56264 319311 322090 325019 327901 330654 333392 336864 341885 347891 353005 356216 358634 361822 365880 370154
56250 370154 374920 380970 388052 395051 401526 407925 414425 420677 426687 433025 440021 447418 454807 461900
56236 461900 468482 474586 480484 486144 491097 495169 498681 501457 502472 501260 498872 496586 494438 491917
56222 491917 489217 486665 483720 479931 476261 474044 473041 471926 470296 468768 467358 465346 462740 460479
56208 460479 459015 457888 456802 456065 455850 455977 456441 457338 458365 459220 460185 461444 462319 462306 462421 464131 467189
56191 467189 469911 471498 472794 474769 477510 480758 484294 487728 490900 494404 498749 503249 506813 509513
56177 509513 512230 515155 517963 521027 524939 529116 532472 535298 538871 543329 547559 551103 554519 557877
56163 557877 560651 563187 566574 570922 575486 580556 587298 595422 602985 609102 615110 622417 630870 639972
56149 639972 650103 661692 674492 688430 703975 721140 739362 758898 781168 807258 837294
56138 837294 871547 910763 955021 1003738 1057279 1117194 1184462 1258857 1340248 1428781 1523061
56127 1523061 1619523 1714070 1803101 1883020 1950973 2007118 2054704 2097172 2136248 2172707 2206638
56116 2206638 2236033 2257152 2267604 2267904 2259547 2243564 2221776 2197158 2171083 2141266 2103735 2055927
56104 2055927 1997300 1928726 1852717 1773153 1693536 1616160 1543358 1477931 1421378 1372930 1331212
56093 1331212 1295657 1265633 1239719 1216941 1197587 1181967 1169533 1159822 1152983 1148731 1146110 1144769
56081 1144769 1145057 1146517 1148043 1149946 1153861 1160015 1166637 1172771 1179467 1187364 1195495 1203701 1213854 1227137
56067 1227137 1242131 1257194 1272783 1289850 1307880 1326205 1345537 1366424 1387739 1408404 1429206
56056 1429206 1451378 1474679 1498298 1522374 1547332 1572960 1599062 1625576 1651256 1674127 1694271
56045 1694271 1714298 1736034 1758696 1781247 1804270 1828300 1852627 1877141 1903234 1931561 1961139
56034 1961139 1991811 2025184 2061783 2099865 2138477 2179095 2222753 2268264 2314812 2363470 2414501
56023 2414501 2466146 2517835 2571567 2628265 2685981 2743773 2804044 2868764 2936684 3006672 3080463
56012 3080463 3159485 3242330 3328052 3418646 3515454 3616461 3719972 3827554 3940589 4057606
56002 4057606 4178012 4304679 4439666 4581317 4728833 4885526 5053871 5231619 5416667
55993 5416667 5611571 5819261 6038757 6269355 6514421 6776478 7053288 7343709 7652649
55984 7652649 7985273 8341387 8720976 9130028 9574951 10056500 10575447 11139011 11755334
55975 11755334 12427333 13159000 13962187 14850214 15831024 16914397 18119876 19470341 20985646
55966 20985646 22691991 24630825 26850649 29400374 32343206 35770357 39792808 44533110
55958 44533110 50140443 56803171 64731164 74135712 85238313 98276521 113467196 130953555
55950 130953555 150772046 172820289 196833715 222442647 249248480 276624909 303117137
55943 303117137 325948543 341446701 346497461 340047682 323505123 299875869 272479217
55936 272479217 244081067 216611624 191203928 168354327 148144165 130445076 115031745
55929 115031745 101628158 89954979 79773897 70890024 63130554 56343313 50406633
55922 50406633 45218559 40678186 36689905 33178373 30084280 27350307 24923727 22767117
55914 22767117 20853212 19152291 17634521 16279673 15073320 13996716 13029778 12160147
55906 12160147 11379865 10676410 10035859 9451614 8921246 8437443 7990321 7576137 7195718
55897 7195718 6846343 6522488 6222487 5947208 5693791 5457402 5237672 5037207 4855300
55888 4855300 4688995 4538709 4406966 4293118 4194827 4113300 4051609 4009208 3983101 3972753
55878 3972753 3978616 3997036 4021404 4046579 4066960 4071739 4047959 3988702 3894926 3771039 3623307
55867 3623307 3461099 3294164 3128170 2965948 2811579 2669119 2538603 2417610 2305933
55858 2305933 2204850 2113082 2027807 1948770 1877281 1812081 1750390 1692275 1639761 1592231 1546746
55847 1546746 1502478 1460903 1422096 1384719 1349244 1317279 1287988 1258926 1230183 1204031 1180735
55836 1180735 1158393 1136724 1117205 1099472 1081285 1062318 1044507 1028394 1012474 996453 981886
55825 981886 969124 956713 944174 932458 921248 908739 894582 880402 867021 853704 840395
55814 840395 828127 816985 806135 796072 788380 783134 778920 775432 773540 772819 771586 769492 767615
55801 767615 766016 763852 761839 761768 763412 764693 765210 766799 770168 773789 776797 780329 785145 790270 794741
55786 794741 798455 800639 799753 795675 789777 782091 770536 753801 733108 710383 686533 662289 638936
55773 638936 617332 597631 580412 566605 556136 548257 543192 541435 541237 539099 533414 525786 518282
55760 518282 511334 504868 499318 494557 489417 483171 476186 468712 460479 451756 443185 434298 423914 412325
55746 412325 401330 391807 383048 374832 368157 363362 359370 355444 352065 349479 347055 344569 342465 340399
55732 340399 337268 333143 329405 326518 323484 319968 316934 314502 311201 306288 300984 296434 292150 287401
55718 287401 282586 278226 274128 270456 268264 268113 269451 271934 275858 280657 284686 287330 289751 292726
55704 292726 295314 296599 297150 297730 297897 296764 293861 288586 280458 270698 261897 255111 248916 242227 236228
55689 236228 232224 229415 226349 223155 220710 218914 217366 216660 217393 218822 220024 221491 224022 226768 227943
55674 227943 227054 225076 222737 219785 215731 210483 204545 199193 195831 194465 193411 191157 187879 184663
55660 184663 182212 180978 181535 183855 186940 189982 193158 196679 200024 202923 206125 210257 214723 218586
55646 218586 221763 224548 226873 228840 231051 233509 235093 235063 234192 233384 232091 229235 224953 220306 215855
55631 215855 211576 207605 204054 200596 197088 194075 191945 190226 188565 187620 188074 189452 190840 192115 193564
55616 193564 194994 196197 197637 199622 201432 202174 201876 200765 198239 193766 188217 183075 178732 174724 171163
55601 171163 168687 167215 165950 164522 163203 162043 160730 159244 157903 156878 156212 156083 156416 156609 156258
55586 156258 155799 155858 156520 157834 160384 164463 169279 173913 178613 184207 190774 197955 206155 216308 228576
55571 228576 242300 257087 273022 289879 306913 323277 337874 349034 355301 356537 353541 346706
55559 346706 335886 321448 304654 286915 269299 252659 237565 224027 211853 201210 192402 185264
55547 185264 179320 174396 170520 167363 164282 160881 157169 153358 149814 146871 144295 141339 137731 134193
55533 134193 131503 129523 127696 125982 124646 123593 122651 122190 122728 124175 125981 127728 129061 129533 129241
55518 129241 129128 129856 130754 130689 129682 128770 128491 128358 127790 126748 125364 123623 121549 119334 117206 115365
55502 115365 113829 112212 110118 108017 107080 107682 108699 108904 108424 108101 108041 107765 107289 107043 106909 106261 104967
55485 104967 103570 102580 102102 102073 102278 102366 102323 102616 103436 104246 104608 104928 105676 106450 106585 106236 105979 105737 105000
55466 105000 103787 102544 101371 100181 99316 99177 99553 100099 101016 102403 103392 102994 101466 99801 98252 96541
55450 96541 95171 95141 96361 97688 98590 99582 100850 101725 101842 101709 101667 101303 100368 99400 98913 98700 98402 98177
55432 98177 98407 99225 100600 102352 103894 104585 104564 104692 105441 106414 107158 107823 108651 109400 109709 109676 109836 110766 112864
55413 112864 116009 119276 121375 121711 120814 119671 118829 118211 117516 116599 115569 114532 113284 111500 109314 107301
55397 107301 105706 104183 102600 101534 101388 101548 101130 100154 99239 98545 97834 97328 97550 98374 99079 99388 99722
55380 99722 100405 101238 101873 102058 101588 100627 99939 100159 100946 101510 101835 102587 103871 104856 104783 103732 102377 101482
55362 101482 101532 102281 102766 102303 101322 100643 100306 99874 99481 99582 99831 99366 98240 97541 97901 98788 99483 99897 100202
55343 100202 100421 100663 101082 101390 101048 100038 98908 98065 97691 98182 99686 101243 101481 100437 99718 100398 101659
55326 101659 101948 100758 98780 96993 96139 96596 98160 100167 102004 103288 103609 102708 101056 99706 99328 99730
55310 99730 100335 100662 100414 99691 99124 99201 99503 99254 98555 98252 98548 98580 97559 95622 93449 91734 91131 91918
55292 91918 93494 94878 95840 96922 98363 99811 101139 102618 104144 105197 105799 106538 107385 107418 106144 104223
55276 104223 102470 100962 99578 98600 98218 98131 98168 98663 99783 101030 101885 102405 102787 102882 102575 102149 101927 101947
55258 101947 102211 102754 103328 103573 103612 103840 104076 103707 102800 102193 102248 102369 102085 101758 101843 102244 102748 103269 103338 102247
55238 102247 100143 98129 96900 96126 95515 95407 95793 95873 95341 95078 95740 96625 96930 97238 98564 100534 101748
55221 101748 101670 101121 101014 101445 101955 102042 101446 100396 99467 98938 98608 98427 98759 99668 100606 101250 101948 102786 102951
55202 102951 101791 99964 98757 98647 99213 100016 100833 101341 101263 100735 100116 99668 99686 100425 101572 102351 102568 102856
55184 102856 103522 103985 103895 103912 104582 105254 105067 104294 103729 103331 102624 101980 102315 103695 105237 106282 106881 107304
55166 107304 107874 108996 110615 111875 112122 111973 112538 113897 115229 116143 116902 117563 117907 118181 118897 119808 119991
55149 119991 119044 117417 115518 113342 111112 109483 108852 109013 109623 110415 110949 110856 110461 110493 111034 111316 110784 109807
55131 109807 109131 109048 109301 109434 109139 108516 108046 108055 108324 108496 108639 108972 109233 108897 107927 106829 106060 105847 106385
55112 106385 107592 108761 109122 108811 108748 109495 110721 111792 112353 112297 111728 111083 110883 111192 111629 111917 112071 112133
55094 112133 112135 112298 112847 113593 114120 114418 114921 115876 116986 117752 117916 117571 117100 116981 117419 118222 119136 120033 120579
55075 120579 120133 118491 116443 115063 114539 114189 113499 112635 111913 111275 110414 109191 107877 107062 107098 107520 107358
55058 107358 106267 104959 104216 104003 103985 104362 105469 106929 107998 108558 109129 110057 111385 113315 116060 119165
55042 119165 121630 122809 122839 122302 121910 122271 123383 124439 124662 124218 123816 123630 123258 122564 121888 121466 121237 121195
55024 121195 121338 121361 120946 120328 120043 120228 120682 121404 122418 123217 123085 121997 120681 119887 120060 121404 123530
55007 123530 125219 125414 124424 123431 122922 122376 121437 120470 119877 119698 120007 120835 121540 121111 119415 117513 116485
54990 116485 116484 117096 117911 118553 118813 119034 119778 120991 122041 122667 123188 123696 123835 123626 123708 124366 125016 125061 124646
54971 124646 124188 123696 122999 122184 121447 120896 120731 121197 122185 123314 124570 126272 128282 129874 130652 130960 131114
54954 131114 130869 129996 128804 127689 126803 126497 127393 129417 131373 132147 131946 131759 131945 131990 131464 130575 129890 129938
54936 129938 130971 132703 134341 135176 135154 134736 134415 134522 135216 136424 137954 139868 142426 145516 148501 150959
54920 150959 153309 156392 160675 166140 172639 179893 187291 194151 200301 206093 211708 216531 219355 219315 216677
54905 216677 212635 208251 203666 198440 192449 186156 180192 174997 170767 167320 164060 160428 156434 152528
54891 152528 149084 146332 144582 143966 144064 144286 144583 145295 146378 147401 148251 149205 150320 151518 153355 156861
54875 156861 162243 168441 174404 180229 186597 193530 200288 206250 211386 215936 219810 222290 222393 219833
54861 219833 215562 211015 206810 202615 198155 193681 189345 184832 179938 174955 170197 165622 161188 157095
54847 157095 153334 149488 145425 141872 139861 139735 140842 141967 142014 140631 138367 136029 133851 131621 129466
54832 129466 127920 127127 126658 126279 126308 126935 127733 128202 128393 128649 129068 129460 129606 129438 129267 129724 131013 132300
54814 132300 132467 131530 130645 130716 131680 133159 134910 136410 136937 136473 135813 135390 134747 133486 131988 130746 129781
54797 129781 129137 129142 129647 129788 129084 128078 127356 126799 126423 127034 129121 131765 133619 134457 134890 135121 134988 134796
54779 134796 135085 135742 136222 136477 136896 137584 138464 139885 142313 145547 149020 152675 156802 161215 165524 170180
54763 170180 176291 184173 192799 200915 208122 214693 220889 226681 231706 235200 236266 234478 230168 224151
54749 224151 217286 210115 202743 195172 187904 181887 177588 174433 171556 168810 166652 165303 164488 163821 163033
54734 163033 161950 160604 159213 157864 156489 155384 155219 156179 157603 158994 160820 163689 167213 170576 173845
54719 173845 177794 182564 187460 192092 196860 202028 206962 210584 212206 211841 210046 207493 204363 200207
54705 200207 194781 188842 183583 179380 175605 171665 167639 163894 160606 157803 155444 153318 151276 149621
54691 149621 148826 148780 148702 147948 146572 144973 143369 141893 140879 140705 141292 142011 142303 142373 142991 144450 145990
54674 145990 146686 146689 146955 147758 148298 148052 147655 147939 148705 149099 148699 147592 145824 143497 141158 139409 138318
54657 138318 137698 137629 138156 138796 139015 138946 139042 139237 139103 138622 138127 137684 137174 136847 137161 138153 139439 140645 141345
54638 141345 141033 139880 139118 139782 141256 141997 141572 140987 141001 141115 140534 139274 137955 137143 137150 137948 139071 140061
54620 140061 141125 142796 144909 146557 147205 147184 146905 146246 145114 144028 143632 143930 144366 144533 144526 144693 145170 145708
54602 145708 145987 146069 146302 146644 146499 145553 144353 143650 143523 143621 143835 144141 144216 143972 144163 145572 147773 149547
54584 149547 150397 150844 151322 151709 151964 152311 152613 152389 151601 150736 149983 149098 148252 148166 149140 150612 151947 153074
54566 153074 154138 155153 156206 157427 158628 159540 160440 161790 163168 163402 162055 160039 158450 157506 156941
54551 156941 156687 156678 156614 156405 156443 157093 158342 160089 162227 164190 165141 165008 164780 165388 166741 168146 169179 169836
54533 169836 170325 171049 172351 174058 175647 176976 178313 179566 180218 180232 180291 180808 181384 181590 181603 181668 181617 181401
54515 181401 181429 181906 182369 182346 181917 181205 179983 178306 176919 176403 176402 176293 176103 176119 176061 175386 174156 172912 171846
54496 171846 170760 169741 169334 169960 171474 173251 174609 175330 175907 177022 178659 180109 180925 181417 182055 182973
54480 182973 184300 186359 189107 191883 194093 195718 196885 197548 197965 198855 200498 202166 202984 202897 202361 201647
54464 201647 201046 201227 202652 204938 207334 209463 211077 211609 210758 209189 207953 207406 207264 207403 207879 208357
54448 208357 208266 207528 206605 205860 205356 205101 205037 204868 204378 203783 203347 202821 201704 199966 198095 196584 195676 195426
54430 195426 195637 195866 195780 195357 194612 193597 192845 193138 194339 195082 194348 192843 191992 191995 191849 191064 190341 190420 191124
54411 191124 191741 191772 191119 190069 189258 189260 190057 191145 192072 192568 192372 191453 190292 189482 189093 188894 189039 189950 191564
54392 191564 193263 194626 195690 196418 196458 195648 194426 193542 193561 194635 196421 198196 199332 199752 199791 199730 199657 199610
54374 199610 199577 199431 199134 198834 198566 198105 197458 197158 197655 198648 199477 199932 200142 199946 198975 197341 195686 194542
54356 194542 194080 194379 195403 196729 197756 198231 198163 197395 195776 193679 191798 190360 189020 187552 186122 184753
54340 184753 183059 180721 177944 175311 173427 172731 173282 174593 175871 176487 176183 175002 173349 171965 171446
54325 171446 171807 172685 173798 174914 175649 175751 175403 174882 174103 172962 171924 171682 172327 173326 174277 175158 175891
54308 175891 176221 176123 175893 175777 175874 176365 177402 178777 180063 181088 181932 182576 182920 182996 182765 181852 180053 177974
54290 177974 176573 176069 175810 175208 174270 173193 172012 170798 169780 169126 168839 168849 168954 168846 168508 168335 168487
54273 168487 168500 168078 167815 168359 169228 169377 168705 167987 167522 166973 166577 167224 168938 170428 170642 169881 168917 168021
54255 168021 167434 167783 169085 170124 169750 168377 167390 167428 168070 168822 169549 170076 170212 170213 170652 171694 172855 173496
54237 173496 173244 172113 170583 169433 169104 169261 169270 169016 168871 168983 168961 168316 166932 165141 163523 162579 162398 162622
54219 162622 162842 162909 162790 162315 161342 160055 158888 158142 157782 157527 157077 156331 155493 154914 154820 155264 156251 157678
54201 157678 159224 160591 161816 163038 163940 163882 162698 161018 159658 159010 159061 159548 159972 159916 159657 159985 161123
54184 161123 162239 162428 161805 161133 160728 160264 159483 158511 157531 156675 156227 156429 156968 157174 156934 156978 157881 159096
54166 159096 159480 158733 157825 157887 159058 160663 162187 163586 164802 165583 165941 166311 166981 167710 168146 168307 168307 168016
54148 168016 167401 166928 167092 167718 168156 168085 167707 167309 167036 166952 166921 166650 166205 166198 166970 167924 168338 168462 168977 169671
54128 169671 169705 169102 168854 169384 170000 170191 170405 171058 171714 171880 171755 171612 171168 170302 169703 170039 170957 171651 171976
54109 171976 172325 172776 173063 173092 172878 172277 171301 170406 169909 169494 168773 167930 167173 166090 164338 162635 162148 162992
54091 162992 164136 164725 164767 164595 164392 164305 164404 164449 164272 164332 165287 166980 168517 169430 170124 171023 171911 172361 172371 172280
54071 172280 172450 173174 174504 175929 176571 175948 174363 172520 171045 170357 170553 171204 171594 171354 170689 170010 169677
54054 169677 170094 171535 173627 175379 176050 175848 175668 176324 178076 180531 182819 184195 184747 185329 186639 188552
54038 188552 190509 192258 193962 195836 198057 200868 204390 208317 212082 215457 218768 222526 226939 231839
54024 231839 236818 241299 244701 246834 248176 249536 251337 253300 254895 255917 256523 256881 257018 256902 256419
54009 256419 255284 253272 250597 247799 245193 242674 240121 237647 235252 232598 229463 226269 223786 222338
53995 222338 221542 220769 219634 218114 216454 215039 214190 213979 214244 214707 215035 214877 214025 212587 210966 209645
53979 209645 208907 208632 208369 207793 207090 206764 207101 207997 209245 210725 212389 214408 217317 221517 226578 231593
53963 231593 236478 242327 250118 259558 269735 280453 292243 305376 319630 334969 351543 368655
53951 368655 384140 395190 399773 397446 389272 377227 363368 349232 335799 323764 313492 304837
53939 304837 297374 290941 285736 281843 278968 276714 274929 273689 273127 273300 273956 274413 273980 272687 271400
53924 271400 271016 271661 272862 274327 276212 278631 281204 283350 285018 286889 289745 293660 297970 302008 305767
53909 305767 309743 314223 318826 322829 325948 328679 331748 335275 338673 341347 343086 343690 342739 340230 337101
53894 337101 334495 332581 330664 328380 326103 324130 322149 319752 316846 313308 308807 303365 297623 292258
53880 292258 287520 283549 280493 277981 275112 271475 267671 264355 261402 258573 256278 254765 253118 250158
53866 250158 246143 242604 240523 239565 239082 238961 239235 239642 239852 239655 238841 237413 235990 235273 234963 233874 231437
53849 231437 228490 226299 225321 225231 225636 226263 226764 226794 226174 224835 222878 220830 219445 218955 218782 218222 217221
53832 217221 216229 215559 215135 214734 214237 213735 213473 213558 213702 213536 213241 213493 214600 215982 216810 216947 216972 217391 218190
53813 218190 219126 220112 221114 221812 221712 220774 219785 219745 220844 222394 223905 225827 228849 232821 236964 240994
53797 240994 245371 250343 255389 259926 264145 268790 274336 280681 287450 294307 300994 307386 313607 320051
53783 320051 327203 335335 344349 353916 363806 373912 383930 393177 400728 405496 406246 402140 393655 382519
53769 382519 370330 357572 344349 331445 319826 309470 299721 290693 283287 277710 273008 268470 264494
53756 264494 261514 258864 255513 251487 247795 245124 243264 241659 240017 238331 236683 235119 233629 232318
53742 232318 231584 231792 232571 232851 231974 230554 229850 230526 232329 234763 237498 240041 241544 241347 239676 237613
53726 237613 236269 236013 236484 237191 237873 238349 238437 238361 238887 240529 242786 244735 246358 248678 252410 257030 261466
53709 261466 265274 268820 272615 276843 281307 285560 289227 292328 295070 297238 298216 297875 297052 296751 297068
53694 297068 297232 296553 295033 293183 291533 290267 289144 287898 286777 286441 287108 288033 288179 287287 286018 285162
53678 285162 284963 285184 285498 285746 285902 285947 285772 285225 284265 283078 282094 281820 282421 283307 283461 282471 281038 280160
53660 280160 280086 280454 281082 281860 282092 280858 278282 275624 273826 272624 271385 270111 269151 268567 268341 268727 269759
53643 269759 270803 271149 270796 270238 269828 269761 270289 271409 272642 273618 274497 275384 275784 275357 274800 275127 276279 277301
53625 277301 277812 278447 279717 281229 282380 283281 284629 287032 290581 294744 298540 301243 303128 305240 308268
53610 308268 311883 315283 318078 320467 322819 325294 327796 330197 332596 335237 338094 340716 342717 344186
53596 344186 345331 346008 346054 345796 345648 345307 344128 342410 341540 342426 344338 345761 346029 345579 344924 344040 342827
53579 342827 341610 340833 340465 339926 338639 336567 334218 332210 330878 330206 329991 329999 330097 330316 330742 331284 331692 331896
53561 331896 332174 332847 333902 335096 336353 337886 339965 342700 345941 349245 352045 354069 355615 357312 359629
53546 359629 362643 366092 369505 372498 375196 378231 382142 386821 391732 396550 401407 406716 412982 420542
53532 420542 429140 437925 446232 454322 463031 472822 483533 494902 506831 519184 531843 545108 559585
53519 559585 575485 592390 609933 628388 648310 669776 692295 715436 739363 764642 791441
53508 791441 818913 845604 870655 894389 917419 939478 959797 978559 997203 1016922 1037420
53497 1037420 1057680 1077481 1097504 1118134 1138933 1159460 1179905 1200424 1220230 1238064 1253644
53486 1253644 1268158 1283007 1298367 1313331 1327193 1340057 1352234 1363664 1374178 1383906 1393042 1401462
53474 1401462 1408825 1414803 1418950 1420749 1420123 1417622 1413615 1407614 1398916 1387695 1374854 1360933 1345820
53461 1345820 1329414 1311820 1292854 1272159 1250074 1227643 1205347 1182476 1158226 1132935 1107653
53450 1107653 1082915 1058620 1034846 1012027 990307 969290 948659 928662 909799 892263 875923
53439 875923 860751 847042 835139 825008 816290 808850 803051 799245 797172 796302 796724 799188 804093 810976
53425 810976 819300 829278 841444 855733 871484 888262 906235 925811 947269 970654 995677 1021786
53413 1021786 1048731 1076943 1106963 1138554 1170924 1203901 1238315 1274972 1313705 1353805 1395090
53402 1395090 1438134 1483605 1531775 1582541 1635474 1689786 1744605 1799502 1854556 1909812 1964951
53391 1964951 2019772 2074731 2130467 2186638 2241588 2293589 2342278 2388548 2433051 2475319 2514567
53380 2514567 2550871 2585022 2617283 2646836 2672575 2694023 2711264 2724319 2733031 2737419 2737710 2733859
53368 2733859 2725220 2710770 2689529 2660775 2624219 2580272 2530164 2475572 2417983 2358316 2297056
53357 2297056 2234609 2171437 2107934 2044308 1980790 1917971 1856791 1797961 1741385 1686257 1631741
53346 1631741 1577519 1523812 1471112 1419968 1370762 1323523 1278069 1234365 1192588 1152837 1115072
53335 1115072 1079505 1046669 1016839 989666 964757 942353 922938 906360 891878 878973 867521
53324 867521 857210 847589 838933 832333 828466 826768 826299 826905 828961 832393 836702 841817 848180 855966
53310 855966 864822 874533 885429 897935 912105 927772 944867 963363 983164 1004159 1026245 1049261
53298 1049261 1073160 1098234 1124875 1153052 1182285 1212145 1242368 1272459 1301730 1330027 1357940
53287 1357940 1385847 1413084 1438497 1461586 1482603 1501739 1518846 1533941 1547394 1559389 1569667
53276 1569667 1577928 1584004 1587414 1587338 1583596 1577243 1569549 1560557 1549310 1535355 1519225 1501261 1480760
53263 1480760 1456811 1429474 1399632 1368091 1335336 1301791 1267636 1232580 1196488 1160171 1124947
53252 1124947 1091414 1059224 1028016 997883 968759 940089 911494 883233 855643 828495 801292
53241 801292 773846 746243 718562 691002 664042 638227 613955 591633 571607 553729 537355
53230 537355 522047 507927 495147 483501 472848 463350 454841 446561 438112 430153 423446 417607 411643
53217 411643 405391 399579 394641 390314 386296 382501 378637 374403 370149 366455 362916 358287 352238 346148
53203 346148 341587 338644 336295 333870 331452 329181 326878 324298 321285 317734 313835 310275 307758 306226
53189 306226 304816 302714 299880 296882 294217 291947 289916 288097 286591 285392 284377 283508 282778 281918 280530
53174 280530 278717 277175 276340 275763 274743 273241 271664 270041 268115 266117 264681 263938 263350 262616 262113 262191
53158 262191 262578 262824 262915 263132 263612 264265 264836 264970 264513 263848 263525 263514 263338 263045 263404 264775 266397 267258 267274
53139 267274 267080 266998 266803 266305 265608 264789 263765 262607 261681 261296 261300 261143 260389 259133 257816 256579 255060 253056
53121 253056 251083 249870 249445 249225 248862 248434 247830 246682 245053 243592 242766 242462 242472 242725 242816 242064 240460
53104 240460 238931 238161 237698 236759 235365 234076 233058 232131 231425 231295 231708 232243 232602 232713 232587 232489 232942 234038
53086 234038 235028 235173 234803 234877 235623 236270 236136 235388 234654 234354 234484 234659 234249 232884 230943 229296 228497 228406
53068 228406 228502 228298 227563 226472 225568 225238 225266 225076 224358 223269 222226 221743 222209 223389 224270 223837 222046 219771
53050 219771 217949 217019 216938 217287 217462 217249 217201 218075 219899 221881 223207 223566 223091 222155 221260 220711 220435 220351
53032 220351 220729 221732 222760 222855 221826 220551 220011 220385 221106 221490 221274 220822 220794 221319 221626 220838 219062 217243
53014 217243 216091 215637 215748 216390 217241 217636 217223 216361 215703 215681 216411 217621 218614 218800 218450 218436 219028 219465 219000
52995 219000 217908 217050 216833 217035 217355 217675 217839 217641 217076 216401 215925 215811 215994 216154 215940 215382 214956 215069
52977 215069 215481 215471 214598 213229 212221 212055 212386 212594 212692 213344 214892 216757 218127 218875 219388 219835 220179 220687
52959 220687 221674 222774 223177 222733 222111 221680 220926 219355 217328 215533 214147 213028 212298 212087 211982 211372 210224
52942 210224 209045 208140 207373 206590 205852 205219 204688 204343 204266 204272 203997 203335 202547 201975 201820 202154 202876 203684 204332
52923 204332 204907 205591 206135 205906 204585 202615 200789 199588 199027 198963 199263 199730 200105 200280 200419 200776 201408 202113
52905 202113 202634 202830 202679 202236 201691 201329 201348 201752 202478 203505 204720 205885 206968 208361 210452 212985 215218
52888 215218 216781 218080 219698 221675 223498 224591 224673 223904 222837 222044 221573 221009 220165 219389 218929 218356 217101
52871 217101 215337 213797 212816 212082 211413 211138 211477 212024 212278 212388 212940 214156 215757 217491 219343 221174
52855 221174 222598 223386 223671 223599 223020 221745 219886 217762 215733 214290 213968 214720 215584 215420 213958 211741
52839 211741 209199 206356 203436 201076 199611 198604 197462 196207 195339 195242 196053 197786 200144 202394 203893
52824 203893 204731 205584 206958 208728 210292 211025 210801 210313 210627 212148 214278 216262 218034 219925 222054 224561
52808 224561 228027 232874 238524 243884 248610 253080 257102 259431 258877 255332 249558 242574 235531 229485
52794 229485 224818 221147 218056 215501 213356 211177 208844 206910 205836 205268 204573 203747 203180 202796 202106 201111
52778 201111 200559 201136 202755 204742 206469 207702 208556 209287 210015 210610 210823 210510 209729 208728 207889 207483 207391
52761 207391 207232 206848 206490 206366 206249 205755 204929 204290 204288 204830 205362 205376 204880 204339 204101 203985 203608 202995 202527 202369
52741 202369 202335 202392 202755 203368 203778 203826 204034 204846 205881 206494 206884 208021 210386 213220 215203 215649 214926 213913
52723 213913 213245 212973 212809 212488 211854 210805 209452 208268 207684 207457 206849 205583 204212 203321 202814 202286 201695
52706 201695 201159 200491 199508 198584 198273 198485 198653 198689 199142 200292 201695 202824 203637 204171 204101 203189 201900 201035
52688 201035 200775 200494 199637 198482 197889 198448 200015 201961 203668 204744 205025 204622 203996 203689 203858 204109 204002
52671 204002 203627 203550 204203 205460 206808 207900 208850 209957 211170 211961 211962 211576 211673 212659 214199 215902 217752
52654 217752 219574 220618 220298 219125 218324 218596 219775 221563 223836 226033 226981 225915 223370 220604 218385
52639 218385 216711 215428 214594 214224 214218 214655 215751 217333 218702 219374 219786 220916 223234 226335 229621 232955
52623 232955 236415 239609 241688 242096 241093 239327 237055 234033 230228 226411 223809 223087 223785 224797 225376
52608 225376 225504 225404 224956 223840 222092 220258 218927 218252 218017 218089 218650 219930 221767 223591 224997 226210
52592 226210 227713 229384 230372 230123 229246 228919 229529 230308 230373 229711 228967 228591 228498 228420 228283 228253 228524 229113 229818
52573 229818 230389 230689 230662 230194 229185 227754 226235 224912 223830 222854 221838 220795 219997 219815 220332 221150 221728
52556 221728 221862 221748 221676 221810 222115 222326 222143 221680 221514 221982 222679 222977 222848 222707 222661 222495 222341 222727 223864
52537 223864 225413 227065 228770 230251 230900 230506 229675 229206 229344 229771 230001 229612 228494 227045 225779 224724
52521 224724 223607 222648 222469 223105 223874 224542 225808 228140 230859 233007 234495 235707 236524 236647 236520 237071
52505 237071 238595 240608 242716 244984 247417 249679 251388 252399 252831 253050 253422 253866 253981 253856 254190 255130
52489 255130 255672 254960 253641 253007 253234 253531 253715 254353 255286 255369 254098 252456 251639 251779 252435 253502 254931
52472 254931 256227 257014 257716 258901 260269 260926 260578 259819 259265 258965 258794 258962 259818 261285 262779 263719 264045
52455 264045 264106 264084 263718 262659 260878 258523 255654 252378 249071 246054 243229 240388 237779 235894 234765
52440 234765 233969 233355 233253 233839 234741 235423 235649 235460 235089 234930 235149 235227 234418 232884 231838 232164 233342 234156
52422 234156 234160 233922 233982 234154 234009 233700 233946 235213 237090 238693 239678 240564 241957 243727 245376 246977 249257
52405 249257 252750 257289 262394 267772 273370 279277 285569 291824 296754 298845 297622 294038 289534 285077
52391 285077 281097 277730 274769 271747 268468 265270 262614 260689 259580 259471 260348 261712 262865 263408 263415 263277
52375 263277 263447 264040 264662 264879 264898 265422 266760 268529 270281 271975 273628 274976 275729 275815 275240 274188 273328
52358 273328 273321 273765 273360 271665 270003 269877 271027 271930 271864 271454 271280 271014 270278 269498 269367 269894 270479 270728 270801
52339 270801 271157 272231 274283 277208 280470 283398 285689 287590 289561 291804 294252 297006 300560 305343
52325 305343 311117 317012 322235 326569 330322 334065 338412 343611 349133 353943 357411 359809 361761 363489
52311 363489 364774 365452 365658 365699 365839 366192 366713 367379 368347 369761 371455 373177 375062 377395 379880 381742
52295 381742 382802 383818 385322 386632 386679 385498 384185 383542 383394 383272 383171 383438 384294 385639 387101 388203
52279 388203 388738 389052 389776 391264 393398 395891 398587 401508 404776 408395 411966 414852 416877 418676 420967
52264 420967 423686 426311 428941 432429 437203 442466 446932 450087 452393 454412 456226 457794 459508 462000
52250 462000 465458 469425 473427 477478 481658 485458 488085 489495 490588 492088 493724 494880 495704 497006
52236 497006 499199 501904 504557 506935 508981 510573 511761 513032 515064 518203 522198 526422 530354 533955
52222 533955 537587 541544 545750 549954 554072 558185 562307 566336 570217 574119 578440 583564 589350 594911
52208 594911 599283 602506 605724 609916 614814 619354 622948 625861 628532 631026 633277 635474 638011 641079
52194 641079 644387 647294 649358 650840 652428 654389 656258 657543 658407 659380 660632 661868 662716 662834 661861
52179 661861 659753 657108 654783 653136 651806 650068 647235 643033 637990 633270 629708 627162 625138 623682
52165 623682 623074 622995 622786 622428 622475 623010 623466 623665 624209 625501 627069 628327 629415 630771 632244 633127 632862
52148 632862 631408 629280 627496 627068 628090 629607 630762 631749 633170 634853 635951 636033 635412 634334 632540
52133 632540 629880 626956 624788 623988 624400 625361 626192 626601 626849 627510 628977 631180 633865 637119 641544 647786
52117 647786 655823 664736 673355 681121 688200 694806 700694 705438 708962 711534 713419 714804 715955 717058
52103 717058 717931 718254 718168 718321 719106 720243 721501 723663 728163 735556 744670 753617 761468 768601 775516 781807
52087 781807 786467 788859 789072 787550 784769 781262 777619 774327 771776 770351 770339 771650 773870 776621 779631
52072 779631 782401 784135 784317 783206 781538 779884 778510 777707 777762 778462 778988 778550 776976 774532 771426 767830
52056 767830 764242 761293 759046 756853 754145 751178 748708 747127 746167 745271 743922 741717 738598 735132 732164
52041 732164 729993 728143 726165 724462 724052 725564 728636 732317 736008 740028 745233 751971 759515 766717
52027 766717 773144 779187 785107 790489 794964 799007 803549 808916 814498 819431 823338 826474 829359 832262
52013 832262 834961 837142 839093 841676 845323 849309 852315 853478 852512 849142 843137 835003 826036 817257
51999 817257 808443 798417 786208 771804 755908 739166 721819 704143 687000 671533 658182 646345
51987 646345 635243 624821 615461 607157 599538 592585 586785 582413 579014 575701 571766 566982 561539 555709
51973 555709 549467 542564 535093 527689 520891 514629 508821 504168 501638 501261 502167 503883 506870 511477 517100
51958 517100 522863 528690 535148 542424 549915 556711 562158 565980 568105 568415 566662 562776 557272 551171
51944 551171 545424 540596 537033 535032 534743 536167 539380 544523 551573 560380 570879 582769 594971 605958
51930 605958 614865 621814 626911 629491 628755 624664 617710 608252 596725 584134 571538 559082 546246
51917 546246 533134 520853 510372 501558 493681 486503 480409 475664 472028 469173 467186 466383 466736 467728
51903 467728 468942 470678 473698 478370 484372 491385 499674 509608 520753 531881 541854 550078 556002 558641
51889 558641 557010 550992 541611 530546 519475 509607 501407 494631 488829 484018 480804 479808 481125 484467
51875 484467 489721 497034 506375 517281 529231 542027 555552 569236 582095 593353 602857 610795
51863 610795 617130 621417 623080 621841 618023 612652 607306 603737 603345 606670 613322 622598 634342 648916
51849 648916 666028 683604 698173 706466 706718 698880 684296 665366 644862 624817 605849 587662
51837 587662 570171 554021 540052 528451 518533 509426 500969 493873 488877 485868 484055 482940 482787
51824 482787 483971 486133 488238 489357 489182 487876 485664 482718 479310 475968 473434 472386 473123 475476 479029
51809 479029 483443 488552 494130 499646 504307 507441 508770 508276 505921 501708 495984 489431 482700 476201
51795 476201 470248 465113 460815 457119 453885 451148 448710 446014 442732 439275 436382 434392 433168 432532
51781 432532 432460 432982 434162 435892 437504 437931 436708 434527 432386 430586 429119 428537 429485 431574 433778 436056
51765 436056 439593 445125 451959 459141 466764 475442 485055 494614 502932 508855 511335 510092 506031 500402
51751 500402 493602 485339 475822 466201 457763 451168 446528 443721 442364 441815 441566 441663 442636 445025 449048
51736 449048 454729 462164 471522 482726 495386 509083 523364 537187 548860 557226 562837 567279 571346
51723 571346 574629 576996 579446 582727 585679 585844 581693 573826 564235 554983 547496 542317 539074 536721
51709 536721 534017 529982 524267 517389 510439 504305 499306 495683 494192 495752 500434 506940 513075 516851
51695 516851 517538 516058 514291 513766 514941 517596 521521 526520 532035 537079 540559 541614 539945 536067 531117
51680 531117 526150 521654 517766 514663 512543 511499 511668 513331 516649 521455 527501 534656 542663 550918
51666 550918 558801 566179 573409 580910 588693 596020 601487 603746 602332 597539 589564 578341 564421 549442
51652 549442 535278 523112 513598 507358 504704 505202 508041 512562 517942 522723 525316 524869 521081 513521
51638 513521 501950 487413 472246 458582 447086 437197 428167 419725 412122 405822 400999 397203 393635
51625 393635 389862 386167 383176 381206 379988 378993 377950 376936 375934 374558 372612 370722 369869 370222 371014
51610 371014 371651 372320 373268 374218 374947 375767 376790 377267 376436 374692 373206 372655 372961 374072 376210 379439 383638
51593 383638 388902 395498 403460 412633 422868 433659 443833 452228 458565 463184 466281 468125 469708
51580 469708 472242 476066 480874 486999 495574 507302 521937 539162 559112 581658 605864 630617
51568 630617 655296 679619 703473 727192 751333 775707 799157 820854 841589 863484 888909
51557 888909 919982 958538 1005622 1060742 1121776 1185542 1248330 1306195 1355382 1393039 1417883
51546 1417883 1430219 1430943 1420187 1397190 1361823 1315927 1262522 1203901 1141219 1075900 1010395 947173
51534 947173 887617 832393 782316 738205 700119 667250 638537 613171 590682 570867 553656
51523 553656 539039 527132 518081 511495 506120 500647 494909 489709 485339 480952 475759 470221 465517 462216
51509 462216 459940 458030 455965 453309 449832 445753 441514 437238 432625 427423 421787 416122 410665 405368
51495 405368 400188 395439 391678 389212 387918 387578 388046 388887 389363 389259 389351 390443 392213 393712 394711 395641
51479 395641 396295 395766 393921 391926 390778 390214 389593 388996 388669 388066 386405 383825 381170 378902 376974 375504
51463 375504 374761 374534 374244 373762 373504 373705 374095 374361 374483 374574 374858 375859 378130 381653 385917 390662 396132
51446 396132 402520 409663 417565 426736 437558 449688 462654 476821 492998 510809 527966 541644
51434 541644 550487 555046 556658 556500 555625 554977 554692 553629 550015 542626 531344 517094 501723 487559
51420 487559 476271 467948 461551 456268 452084 449199 447472 446574 446349 446860 448258 450602 453583 456585 459289
51405 459289 462033 465115 468004 469920 471107 472814 475850 479794 483825 487696 491604 495621 499651 503564
51391 503564 507162 510381 513812 518549 525242 533623 543293 554647 568727 586396 607977 633650 664023
51378 664023 700304 743712 794471 851580 913903 981174 1053323 1129068 1205854 1280952 1351684
51367 1351684 1414643 1466076 1503576 1526648 1535257 1528798 1507063 1471312 1423576 1365634 1299444 1227991
51355 1227991 1154712 1082258 1012346 946406 885660 830729 781686 738322 700032 665863 635113
51344 635113 607556 582769 559852 538307 518620 501330 486041 472003 459150 447841 438019 429425
51332 429425 422247 416682 412135 407661 403051 398746 394836 390910 386840 382993 379695 377008 374949 373426
51318 373426 372163 371196 371154 372449 374455 376178 377419 378580 379629 380160 380286 380570 381105 381584 382251 383826
51302 383826 386356 389023 391350 393774 396707 399773 402379 404439 406044 406885 406366 404065 399873 394075 387527
51287 387527 381408 376516 372899 370180 367925 365725 363356 361068 359468 359019 359757 361357 363209 364556 364999
51272 364999 364876 364889 365431 366575 368470 371254 374654 378078 381116 383728 386201 389263 393844 400103 406943
51257 406943 413025 418001 422146 425158 426193 424928 421675 416600 409818 402342 395802 390896 386923 383209
51243 383209 380128 378200 376942 375310 372926 370378 368501 367645 367461 367171 366251 364856 363410 361994 360640
51228 360640 359858 360103 360802 360822 360026 359470 359892 360930 362129 363690 365702 367576 368942 370351 372299 374138
51212 374138 374852 374496 374098 374401 375413 376966 378973 381185 383300 385318 387463 389819 392374 395201 398215
51197 398215 401043 403560 406364 410086 414287 417585 419008 418902 418377 418160 418079 417530 416303 414947 414275 414546
51181 414546 415285 415960 416523 417235 418280 419766 421775 424041 425780 426196 425235 423643 422281 421441 420773 419772
51165 419772 418364 417022 416303 416362 417020 418042 419077 419515 418866 417257 415169 412750 409847 406630 403590 400800
51149 400800 397758 394176 390414 386948 383901 381369 379634 378680 377922 376791 375248 373441 371343 369143 367568
51134 367568 367201 367636 367842 367327 366625 366690 368012 370304 372864 375273 377761 380719 383994 387062 389790 392441
51118 392441 394871 396402 396845 397006 397721 398925 400149 401481 403323 405515 407346 408387 408883 409439 410708
51103 410708 413204 416937 421222 425100 427892 429221 428885 427110 424674 422328 420180 417891 415266 412337
51089 412337 409132 405753 402487 399460 396401 393178 390317 388495 387643 387091 386508 386215 386469 386904 386912 386376 385959
51072 385959 386754 389456 393608 397790 400908 403305 406316 410759 416105 421171 425314 428860 432543 436723
51058 436723 441165 445480 449576 453499 456959 459398 460546 460679 460326 460157 461142 464197 469316 475457 481659
51043 481659 488026 495322 503915 513394 522916 531662 539262 546106 552985 560142 566902 572360 575959 577231
51029 577231 575649 571210 564643 556568 546972 536041 524796 514120 503708 492931 482354 473303 466190
51016 466190 460400 455821 453235 452910 453853 455054 456646 459270 462952 467261 472177 478145 485409 493695 502381
51001 502381 510720 518099 524415 530155 535928 542019 548411 554949 561287 566911 571477 575087 578156 581073
50987 581073 584017 586996 590094 593802 598924 605853 614071 622719 631672 641567 652693 664269 675015
50974 675015 684012 690822 695193 697062 696645 694103 689213 681660 671624 659830 647032 633661 620010
50961 620010 606516 593746 582211 572353 564603 559235 556058 554485 554136 555329 558755 564651 572550 581832
50947 581832 592251 603852 616821 631664 649177 669731 692734 717236 743059 770773 800232
50936 800232 829271 854129 871421 879973 881089 877276 870752 862882 854419 845690 836628 827056 816975
50923 816975 806261 794215 780153 764614 749284 735302 722193 708888 695230 681853 669106
50912 669106 656882 645298 634803 625625 617660 610833 605113 600284 596151 592759 589943 586951 583189
50899 583189 579119 575769 573481 571803 570436 569425 568487 567064 565278 563980 563603 563615 563395 562934 562376 561463
50883 561463 559857 557518 554537 551166 548248 546879 547150 547791 547588 546648 545774 545163 544461 543748 543596 544195 545067
50866 545067 545672 545794 545372 544484 543630 543605 544843 547123 549997 553291 557050 561238 565740 570610 576088 582252
50850 582252 588724 594902 600579 606187 612301 619062 626337 634291 643417 653919 665396 677229 689021
50837 689021 700627 712134 724044 737125 751743 767514 783847 800676 818446 837508 857909
50826 857909 879734 903410 929491 958228 989379 1022425 1056861 1092196 1127807 1163031 1197471
50815 1197471 1230864 1262375 1290334 1313157 1330407 1342557 1349887 1352230 1349818 1343653 1334717 1323379
50803 1323379 1309925 1295145 1279876 1264379 1248788 1234006 1221544 1212412 1206603 1203744 1203860 1207345
50791 1207345 1214454 1225029 1238642 1254944 1273902 1295681 1320118 1346299 1372672 1397569 1419595
50780 1419595 1437816 1451976 1462621 1470727 1476984 1481412 1483689 1483581 1480915 1475363 1466563 1454388 1438729
50767 1438729 1419040 1394562 1365314 1332549 1297915 1262351 1226145 1189743 1153896 1119061 1085291
50756 1085291 1052828 1022192 993514 966372 940639 916956 895959 877457 860789 845647 832177
50745 832177 820686 811674 805700 802647 801463 801199 801987 804444 808518 813623 819589 826695 834945 844071
50731 844071 854076 864994 876219 886956 897302 908045 919434 931005 942608 954633 967015
50720 967015 979056 990551 1002170 1014297 1026321 1037550 1047980 1057611 1065785 1071915 1076361 1079974
50708 1079974 1083331 1086953 1091769 1098648 1107820 1119287 1133322 1150059 1169070 1189955 1212799 1237281
50696 1237281 1261841 1284725 1305767 1326236 1346900 1366977 1385181 1401188 1415856 1430436 1445830
50685 1445830 1462343 1479915 1498556 1518455 1539624 1561737 1584576 1608390 1633604 1660464 1689314
50674 1689314 1721011 1756609 1796825 1842131 1893101 1950055 2012231 2077575 2143358 2206985 2266624
50663 2266624 2321580 2372008 2418011 2459152 2495130 2526635 2555030 2581233 2605241 2626605 2644856
50652 2644856 2659426 2669554 2674553 2674162 2668796 2659652 2648451 2636848 2626007 2616766 2609969 2606474 2606960
50639 2606960 2611826 2620988 2633679 2648805 2665672 2683977 2702853 2720459 2735025 2746063 2754193 2760041
50627 2760041 2763678 2764792 2763074 2758772 2753044 2746837 2738389 2722265 2692268 2646054 2587016 2522146 2458659
50614 2458659 2402010 2355268 2319170 2292880 2275111 2264602 2259717 2258154 2257357 2255080 2249589 2239665 2224489
50601 2224489 2203336 2175490 2140691 2099511 2052982 2002037 1947684 1891400 1834712 1778518 1723317
50590 1723317 1669901 1619087 1570942 1525113 1482010 1442856 1408399 1378427 1352761 1331792 1315565
50579 1315565 1303168 1293755 1287619 1285581 1287801 1293884 1303708 1317289 1333983 1352595 1372277 1392657
50567 1392657 1413056 1432316 1449596 1464834 1478214 1489727 1499653 1509078 1519477 1531946 1547215 1566224
50555 1566224 1590192 1620054 1656232 1698990 1748532 1804365 1864858 1927863 1991794 2055855 2119338
50544 2119338 2181141 2240152 2295900 2348802 2400002 2450980 2502980 2556667 2612487 2671254 2733907
50533 2733907 2800583 2870489 2943004 3018462 3097543 3180385 3266803 3356996 3451345 3549628 3650951
50522 3650951 3754310 3858621 3962168 4062481 4156803 4242353 4316286 4375972 4419439 4445235
50512 4445235 4452022 4438820 4405703 4353794 4284562 4199620 4101243 3992579 3877247 3759150 3642623
50501 3642623 3532019 3430760 3341179 3265348 3205369 3162384 3135811 3124040 3125442 3138121 3158971
50490 3158971 3183749 3208202 3228636 3241347 3242137 3227037 3193698 3142111 3074175 2992781 2901177 2802649
50478 2802649 2700211 2596315 2492898 2391589 2293584 2199325 2108796 2022349 1940871 1864800
50468 1864800 1793397 1725537 1660973 1600258 1543705 1491074 1442240 1397355 1356235 1318258 1283172
50457 1283172 1251459 1223516 1198949 1177036 1157511 1140487 1125810 1112918 1101296 1090846 1081739
50446 1081739 1073939 1066905 1059957 1053159 1047570 1044255 1043201 1043672 1045426 1048850 1053999 1060352 1067794 1077088
50432 1077088 1088992 1103547 1120583 1140270 1162634 1187119 1213185 1240902 1270482 1301716 1334496
50421 1334496 1369391 1406972 1446981 1488966 1533426 1581413 1633136 1687868 1745282 1805962 1870302
50410 1870302 1937661 2007021 2077892 2150048 2222709 2294438 2363775 2429750 2491954 2550244 2604115
50399 2604115 2652182 2692409 2722963 2742536 2749849 2743409 2722369 2687481 2640743 2584090 2518861 2446606
50387 2446606 2369967 2292397 2217144 2146661 2082661 2026108 1977114 1935362 1901005 1874844 1857218
50376 1857218 1847023 1842266 1841392 1843324 1846232 1847144 1843341 1833618 1817703 1794900 1764212 1725726 1681192
50363 1681192 1633005 1582983 1532183 1481314 1430929 1381474 1333476 1287619 1244415 1203888 1165744
50352 1165744 1129775 1096012 1064591 1035666 1009420 985942 965011 946094 928714 912839 898813
50341 898813 886799 876363 866695 857219 847877 838871 830285 821952 813512 804539 794816 784561 774245
50328 774245 764106 754069 744226 735126 727363 721060 715979 711921 708770 706288 704258 702810 702344 703203
50314 703203 705639 709995 716484 724751 734043 743912 754433 765607 776952 787932 798512 808946 819146
50301 819146 828628 836982 844161 850301 855533 860065 864286 868619 873263 878041 882478 886096 888663 890114
50287 890114 890203 888493 884898 880139 875429 871771 869720 869633 871759 875984 881787 888599 896009 903587 910831
50272 910831 917379 922913 926657 927369 924284 917889 909461 900037 890129 880100 870210 860438 850878 842317
50258 842317 835795 831503 828676 826644 825373 824782 824266 823357 822277 821412 820777 820502 821264 823546 826906 830655
50242 830655 834834 839722 844767 849040 852613 856456 860782 864463 866314 866133 864175 860555 855730 850742
50228 850742 846180 841320 834968 826877 817800 808529 799573 791514 784878 779535 774770 770098 765644 761708
50214 761708 758397 755829 754361 754328 755757 758441 762184 766891 772531 779187 787093 796605 808099 821883
50200 821883 838212 857417 879915 906014 935754 969202 1006892 1049709 1098115 1151617 1208955
50189 1208955 1268492 1328202 1385609 1438316 1484834 1524850 1558828 1587510 1611784 1632694 1651246
50178 1651246 1667968 1682551 1693928 1700775 1701849 1695756 1680704 1655092 1618714 1573242 1521414 1465924
50166 1465924 1409143 1353372 1300718 1252605 1209666 1172219 1140636 1115132 1095308 1080132 1068547
50155 1068547 1060119 1054881 1052334 1050769 1047985 1042767 1035411 1026759 1017120 1006364 994663 982587 970536
50142 970536 958433 945991 932958 919078 904244 888998 874744 863083 854739 849138 845070 841768
50130 841768 839406 838643 839766 842166 844585 845963 846246 846275 846675 846987 846231 844220 841754 839458 837196 834967
50114 834967 833576 833700 834870 836288 838232 841574 846144 850700 854653 858710 863581 869124 875180 882207
50100 882207 890422 899188 908024 917482 928216 939743 951046 961980 973280 985580 999276 1015069
50088 1015069 1033674 1054996 1078478 1104323 1133692 1167633 1206499 1250539 1300373 1356541 1419125
50077 1419125 1488133 1563927 1646863 1736508 1831311 1928942 2026917 2122918 2214569 2299275 2374987
50066 2374987 2441536 2500861 2555497 2607036 2656030 2702447 2745167 2781234 2806548 2817493 2811647
50055 2811647 2787426 2744192 2683018 2606638 2518382 2421497 2319374 2215445 2112300 2011285
50045 2011285 1913213 1819115 1730164 1647436 1572056 1505073 1446758 1396313 1352621 1314992 1282977
50034 1282977 1255799 1232450 1212213 1194770 1179869 1167136 1156210 1146932 1139423 1133839 1129830 1126274
50022 1126274 1121902 1116306 1109962 1103136 1095185 1085231 1073150 1059587 1045234 1030483 1015606 1000770
50010 1000770 985818 970350 954189 937600 920998 904599 888518 873136 859206 847518 838493
49999 838493 832178 828535 827621 829441 833851 840693 849865 861084 873715 886906 899780 911389 920833
49986 920833 927710 932379 935499 937467 938451 938667 938173 936497 932956 927408 920427 912803 905188 898131 892059
49971 892059 887183 883790 882534 884024 888099 894001 901424 911011 923702 939967 959930 983980 1013005
49958 1013005 1048110 1090165 1139372 1195232 1257034 1324319 1396560 1472455 1549836 1626277 1699586
49947 1699586 1767939 1830200 1886240 1936571 1981607 2021659 2057382 2089283 2116394 2136004 2145121
49936 2145121 2141651 2123958 2090158 2038937 1970977 1889028 1796718 1697829 1596476 1496940 1402653
49925 1402653 1315382 1235560 1163271 1098808 1042429 993771 951699 914878 882583 854856 831883
49914 831883 813314 798194 785403 774200 764572 757089 752164 749395 747922 747486 748836 752912 759871
49901 759871 769059 779641 791117 803550 817548 833700 851751 870440 888281 904196 917276 926511
49889 926511 931377 932575 931644 929696 926731 922056 915063 905547 893489 878703 860788 839615 815848
49876 815848 790714 765177 739751 715221 692944 673914 657892 644010 631946 621901 613630 606433
49864 606433 600209 595819 593963 594236 595737 598236 602217 608012 615411 624168 634419 646382 659907 674580
49850 674580 690222 707091 725527 745353 765560 784492 800422 812273 820020 824428 826347 826289 824608
49837 824608 821673 817453 811099 801456 788271 772702 756470 740704 725684 711376 697923 685745
49825 685745 675378 667177 661105 656919 654634 654578 656868 661123 666934 674342 683612 694760 707584 721961
49811 721961 737706 754318 771247 788212 804791 819811 831830 840388 846313 850600 853485 854761
49799 854761 854343 851923 846516 837161 824115 808785 792441 775467 758016 740750 724434 709144
49787 709144 694469 680480 668025 657917 650106 643841 638417 633589 629387 625823 622826 620382 618605
49774 618605 617594 617230 617322 618128 620533 625251 631883 639230 646717 655086 665371 677592 690880 704511
49760 704511 718156 731200 742470 750905 756296 759346 761287 763229 765281 766058 763442 756098 744204
49747 744204 728882 711444 693130 674950 657398 640670 625370 612568 602812 595422 589169 583459
49735 583459 578528 574724 572032 570243 569219 568969 569649 571450 574276 577578 580641 583081 585207 588108 593224
49720 593224 601230 611209 621389 631029 641121 652930 666470 680966 696140 711941 727200 739720
49708 739720 748126 752947 755590 756888 757013 756061 753942 750020 743598 734792 724492 713543 702411 691632
49694 691632 681955 673794 666849 660543 654626 649193 644422 640569 637994 636833 636804 637684 639850 643835 649340
49679 649340 655281 661069 667332 674947 683781 692991 702374 712687 724503 737235 749514 760248 769183
49666 769183 776791 783855 790848 797420 802492 805074 805021 803100 800523 798316 796740 794970 791396 784405 773058
49651 773058 757348 738189 717180 696005 675877 657554 641660 628534 617769 608371 599634 591664
49639 591664 584886 579351 574666 570387 566366 562918 560597 559465 558581 556681 553496 549910 546729 543838
49625 543838 540865 538026 535757 533966 532272 530706 529582 528784 527749 526166 524321 522723 521696 521260 521144
49610 521144 521016 520927 521363 522590 524205 525697 527267 529588 532824 536358 539461 541782 543180 543582 543291 543062
49594 543062 543472 544296 544769 544518 544102 544428 545595 546581 546354 545111 544042 543882 544314 544876 545743 547122 548429
49577 548429 548850 548513 548430 549303 550944 552951 555445 558992 564075 570761 578644 587096 595778 604872 614636
49562 614636 624869 634981 644416 652703 659280 663689 665851 665916 663974 660233 655214 649361 642668 635233
49548 635233 627957 622057 617841 614555 611524 608934 607332 606862 607114 607330 606628 604486 601221 597691 594443
49533 594443 591514 589045 587494 587021 587226 587813 589113 591584 595222 599893 605884 613489 622203 630896 638948
49518 638948 646798 655207 664276 673461 682341 690991 699530 707642 714867 721280 727470 733777 739858 745212
49504 745212 749717 753272 755171 754324 750104 742653 732518 720492 707745 695510 684361 674116 664617
49491 664617 656245 649421 643929 639101 634623 630907 628636 628020 628503 629170 629442 629304 628893 628180 627278 626721
49475 626721 626985 627776 628304 628269 628200 628723 629917 631544 633534 635934 638633 641343 643770 645690 647054 648121
49459 648121 649318 650843 652462 653692 654055 653217 651218 648589 645939 643323 640244 636360 631877 627179 622413
49444 622413 617650 613166 609222 605702 602252 598736 595371 592472 590206 588572 587525 587125 587611 589223 591927
49429 591927 595416 599558 604758 611740 620882 631900 644235 657637 672127 687508 703461 720407
49417 720407 739529 760743 780467 792617 792951 782481 766344 749741 735341 723811 715345 710175
49405 710175 708284 709304 712763 718403 726348 736847 749634 763769 778375 793244 808362 823229
49393 823229 837294 850767 864181 877206 888642 897635 904168 908314 909883 909080 906724 903321 898537
49380 898537 892021 884215 875862 867184 858151 849317 841874 836877 834580 834359 835126 836087 837297 839329 842417
49365 842417 846208 850308 854469 858206 860824 862066 862217 861359 859170 855747 851862 847831 842766 835708 827086
49350 827086 818323 810269 802770 795605 789058 783457 778757 774759 771350 768346 765395 762185 758590 754542
49336 754542 749928 744641 738717 732439 726271 720440 714562 707976 700618 693205 686402 680209 674427 669307
49322 669307 665227 661968 658914 655863 653186 651140 649475 647870 646500 645948 646586 648137 649883 651368 652823
49307 652823 654747 657103 659251 660721 661724 662726 663851 664922 665876 666912 668406 670819 674440 679080
49293 679080 684233 689615 695228 700899 706267 711446 717147 723756 730712 737197 743017 748364 753100 756873
49279 756873 759732 762081 764093 765674 766972 768568 771154 775197 780713 787150 793766 800427 807848 816754
49265 816754 827044 838050 849261 860475 871598 882727 894115 905619 916521 926395 935819 945753
49253 945753 956702 969028 983459 1000199 1017858 1034427 1049341 1063331 1075942 1084416 1085857 1079879
49241 1079879 1068540 1054268 1038580 1022358 1006382 991336 977684 965568 954604 943941 932859
49230 932859 921413 910353 900449 891995 884867 878857 873993 870617 869118 869517 871352 873952 876662 878804
49216 878804 879767 879416 878315 877300 876810 876763 877135 878416 881306 886012 891988 898451 904971 911416 917568 923159
49200 923159 928338 933722 939862 946882 954703 963152 971593 978860 984019 987082 988677 989218 988824 987816 986704
49185 986704 985601 984110 982013 979720 977805 976300 974674 972475 969898 967815 967325 969225 973807 981059
49171 981059 990967 1003586 1019020 1037420 1058789 1082460 1106537 1127859 1142692 1148080 1143332 1130612
49159 1130612 1113846 1096745 1081659 1069839 1061902 1057643 1055978 1055687 1056065 1056638 1056725 1055861 1054320 1052628
49145 1052628 1050712 1048161 1045139 1042279 1039661 1036606 1032707 1028422 1024374 1020623 1017031 1013956 1012092 1011784
49131 1011784 1012927 1015435 1019435 1024894 1031251 1037598 1043250 1048165 1052834 1057841 1063546 1070149 1077766 1086307
49117 1086307 1095405 1104726 1114387 1124914 1136817 1150379 1165880 1183872 1205006 1229517 1256983 1286906
49105 1286906 1319693 1356716 1398810 1444497 1489935 1530991 1565703 1595345 1623329 1652163 1679978
49094 1679978 1699809 1703782 1689446 1662049 1630166 1599172 1568829 1536048 1498871 1458225 1417124
49083 1417124 1378743 1344873 1315867 1291799 1273103 1259781 1250648 1244113 1239439 1236687 1235748 1236114 1237273
49070 1237273 1238557 1238880 1237576 1235460 1234202 1234516 1235670 1236853 1238213 1240276 1243066 1246207 1249454 1252794
49056 1252794 1256398 1260694 1266232 1273316 1281956 1292123 1303659 1316008 1328527 1341043 1353706 1366368
49044 1366368 1378629 1390383 1401757 1412551 1422497 1432135 1442687 1454795 1468013 1481856 1496804 1513875
49032 1513875 1533541 1555413 1578720 1602875 1627750 1653480 1679771 1705466 1729026 1749343 1765738
49021 1765738 1777571 1784699 1788301 1790430 1792500 1794758 1797312 1800884 1806293 1813836 1823509 1835277 1848838
49008 1848838 1863682 1879648 1896940 1915361 1934125 1952636 1970758 1988031 2003386 2016198 2026986
48997 2026986 2036454 2044362 2050062 2053841 2057006 2060634 2064703 2068392 2070942 2072203 2072563 2072342 2071433 2069761 2067867
48982 2067867 2066378 2064899 2062149 2057432 2051378 2045003 2038788 2033057 2028475 2025451 2023509 2021800 2019925 2017828
48968 2017828 2015332 2012330 2009137 2006167 2003608 2001705 2000946 2001456 2002643 2003969 2005706 2008454 2012304 2017067
48954 2017067 2022953 2030380 2039325 2049418 2060519 2072713 2085989 2100453 2116664 2135202 2156021 2178670
48942 2178670 2202976 2229078 2256982 2286503 2317488 2349700 2382794 2416851 2452604 2490585 2530301
48931 2530301 2570815 2611839 2653637 2696090 2738624 2780928 2823088 2865099 2907054 2949863 2994990
48920 2994990 3043201 3094061 3146754 3200793 3255665 3310299 3363258 3413268 3459542 3502012 3541395
48909 3541395 3578712 3614617 3649440 3683737 3718184 3752783 3786875 3820249 3853594 3887260 3920084
48898 3920084 3950328 3977708 4003648 4029210 4053422 4074245 4090801 4103906 4114453 4122107 4126031 4126261
48886 4126261 4123642 4118654 4111047 4100625 4087653 4072320 4054431 4033998 4011622 3987847 3962404 3934428
48874 3934428 3903130 3867982 3828572 3784688 3736427 3684065 3628081 3569431 3509375 3448777 3387950
48863 3387950 3327426 3268340 3211672 3157591 3106047 3057495 3012419 2970541 2931294 2894822 2861775
48852 2861775 2832169 2805231 2780428 2758017 2738443 2721732 2707656 2696023 2686639 2679354 2674308 2671848
48840 2671848 2672094 2674849 2679878 2686924 2695341 2704125 2712587 2720889 2729870 2740465 2753238 2768192 2784890
48827 2784890 2802863 2821973 2842411 2864438 2888180 2913534 2940163 2967721 2996140 3025524 3055819
48816 3055819 3086911 3118992 3152240 3185949 3218633 3249531 3279561 3310281 3342246 3374910 3407736
48805 3407736 3440647 3473552 3506113 3538087 3569488 3600502 3631632 3663807 3697894 3734095 3772020
48794 3772020 3811153 3850944 3890801 3930415 3969733 4008115 4043983 4075948 4103969 4128759 4150405
48783 4150405 4168399 4182563 4192900 4198613 4198423 4191953 4179811 4162185 4138495 4108744 4074212 4036240
48771 4036240 3995163 3951016 3904459 3856232 3806209 3753778 3698852 3641968 3583653 3524190 3463803
48760 3463803 3402636 3340760 3278553 3216852 3156464 3097765 3041038 2986870 2935866 2888258 2844067
48749 2844067 2803319 2765786 2730861 2698131 2667752 2639872 2613910 2588896 2564344 2540342 2516986
48738 2516986 2494288 2472639 2452852 2435581 2420986 2409025 2399744 2393119 2388750 2385817 2383278 2380114
48726 2380114 2375528 2368946 2359938 2348366 2334793 2320570 2307228 2295759 2286503 2279519 2274817 2272273 2271623
48713 2271623 2272617 2275085 2278856 2283806 2289958 2297361 2305819 2314899 2324298 2334108 2344664 2356205 2368706
48700 2368706 2381960 2395754 2410106 2425395 2442129 2460399 2479694 2499540 2520295 2542971 2568159
48689 2568159 2595492 2624317 2654410 2685524 2716553 2745916 2772766 2797247 2819481 2839003 2855530
48678 2855530 2869705 2882585 2894746 2906257 2917129 2927267 2936158 2942993 2946974 2947237 2942883 2933606 2920147
$$ [...]
##END NTUPLES=NMR SPECTRUM
##END=
