
##TITLE=AC1370_2394_7221551_PFWnt8R9C4
##JCAMPDX= 6.0         $$ Bruker NMR JCAMP-DX V2.0
##DATA TYPE= NMR SPECTRUM
##DATA CLASS= NTUPLES
##ORIGIN= BRUKER
##OWNER= Administrator
$$ 1.72 TOPSPIN		Version 2.1
$$ 2012-12-13 23:47:13.268 -0500  Administrator@X
$$ Compression mode = diff/dup
##.OBSERVE FREQUENCY= 400.02188249412
##.OBSERVE NUCLEUS= ^1H
##.ACQUISITION MODE= SIMULTANEOUS (DQD)
##.ACQUISITION SCHEME= undefined
##.AVERAGES= 64
##.DIGITISER RES= 22
##SPECTROMETER/DATA SYSTEM= spect
##.PULSE SEQUENCE= noesygpps1d.comp
##.SOLVENT NAME= COFFEE_meoh
##.SHIFT REFERENCE= INTERNAL, COFFEE_meoh, 1, 14.96051
##AUDIT TRAIL= $$ (NUMBER, WHEN, WHO, WHERE, PROCESS, VERSION, WHAT)
$$ ##TITLE= Audit trail, TOPSPIN		Version 2.1
$$ ##JCAMPDX= 5.01
$$ ##ORIGIN= Bruker BioSpin GmbH
$$ ##OWNER= Administrator
$$ $$ E:\/data/COFFEE/nmr/AC1370_2394_7221551_PFWnt8R9C4/22/pdata/1/auditp.txt
$$ ##AUDIT TRAIL=  $$ (NUMBER, WHEN, WHO, WHERE, PROCESS, VERSION, WHAT)
(   1,<2012-12-13 23:47:07.362 -0500>,<Administrator>,<X>,<go>,<TOPSPIN 2.1>,
      <created by zg
	started at 2012-12-13 23:35:37.315 -0500,
	POWCHK enabled, PULCHK disabled,
       configuration hash MD5:
       86 BA 57 50 F2 9D 5C 9B 26 00 A9 28 5F 66 2E 89
       data hash MD5: 64K
       9A 2E 8A C5 A4 E5 4C 43 62 2E 8B B6 DA 33 FE 80>)
(   2,<2012-12-13 23:47:10.424 -0500>,<Administrator>,<X>,<proc1d>,<TOPSPIN 2.1>,
      <Start of raw data processing
       efp LB = 0.3 FT_mod = 6 PKNL = 1 PHC0 = 0 PHC1 = 0 SI = 128K 
       data hash MD5: 128K
       E0 93 0C 48 96 87 21 31 23 DD D1 EF D7 F4 90 3A>)
(   3,<2012-12-13 23:47:11.487 -0500>,<Administrator>,<X>,<proc1d>,<TOPSPIN 2.1>,
      <pk PHC0 = -78.59619 PHC1 = 0 
       data hash MD5: 128K
       04 29 BE 61 52 53 AC A4 23 65 3A 1D C6 28 42 B4>)
(   4,<2012-12-13 23:47:12.174 -0500>,<Administrator>,<X>,<proc1d>,<TOPSPIN 2.1>,
      <abs ABSG = 1 
       data hash MD5: 128K
       EF A4 7C C5 85 C9 7E 3D 57 1D E2 C8 88 1B 04 1B>)
(   5,<2012-12-13 23:47:12.362 -0500>,<Administrator>,<X>,<proc1d>,<TOPSPIN 2.1>,
      <abs ABSG = 2 
       data hash MD5: 128K
       99 81 A8 B1 5A D4 04 66 A4 AF 29 D6 FE 79 0F F7>)
(   6,<2012-12-13 23:47:12.533 -0500>,<Administrator>,<X>,<proc1d>,<TOPSPIN 2.1>,
      <abs ABSG = 3 
       data hash MD5: 128K
       B6 35 3F C5 1E 2E CE AD AA 46 6F A0 E8 2A 72 1F>)
(   7,<2012-12-13 23:47:12.721 -0500>,<Administrator>,<X>,<proc1d>,<TOPSPIN 2.1>,
      <abs ABSG = 4 
       data hash MD5: 128K
       61 13 D9 EA 5C 21 2D 74 58 C0 48 D0 7E 98 2E 02>)
(   8,<2012-12-13 23:47:12.908 -0500>,<Administrator>,<X>,<proc1d>,<TOPSPIN 2.1>,
      <abs ABSG = 5 
       data hash MD5: 128K
       99 D7 B7 CC CD 25 57 31 2E 60 9F 2B AC DF E0 FA>)
$$ ##END=
$$ 
$$ $$ hash MD5
$$ $$ 78 9D 12 96 78 10 46 2C C0 72 E3 E1 B4 6B EA D6
##$RELAX= 
##$RELAX= 
##$RELAX= 
##$RELAX= 
##$RELAX= 
##$RELAX= 
##$RELAX= 
##$RELAX= 
##$RELAX= 
$$ Bruker specific parameters
$$ --------------------------
##$DU= <E:\>
##$EXPNO= 22
$$ [...]
##$TP07= 0
##$TPNAME0= <>
##$TPNAME1= <>
##$TPNAME2= <>
##$TPNAME3= <>
##$TPNAME4= <>
##$TPNAME5= <>
##$TPNAME6= <>
##$TPNAME7= <>
##$TPOAL= (0..7)
0.5 0.5 0.5 0.5 0.5 0.5 0.5 0.5
##$TPOFFS= (0..7)
0 0 0 0 0 0 0 0
##$TUNHIN= 0
##$TUNHOUT= 0
##$TUNXOUT= 0
##$USERA1= <user>
##$USERA2= <user>
##$USERA3= <user>
##$USERA4= <user>
##$USERA5= <user>
##$V9= 5
##$VALIST= <valist>
##$VCLIST= <CCCCCCCCCCCCCCC>
##$VD= 0
##$VDLIST= <DDDDDDDDDDDDDDD>
##$VPLIST= <PPPPPPPPPPPPPPP>
##$VTLIST= <TTTTTTTTTTTTTTT>
##$WBST= 1024
##$WBSW= 4
##$XGAIN= (0..3)
0 0 0 0
##$XL= 0
##$YL= 0
##$YMAX_a= 5835773
##$YMIN_a= -11467642
##$ZGOPTNS= <>
##$ZL1= 120
##$ZL2= 120
##$ZL3= 120
##$ZL4= 120
##$ABSF1= 14.96051
##$ABSF2= -5.597672
##$ABSG= 5
##$ABSL= 3
##$ALPHA= 0
##$AQORDER= 0
##$ASSFAC= 0
##$ASSFACI= 0
##$ASSFACX= 0
##$ASSWID= 0
##$AUNMP= <proc_prof1d_extract.lims>
##$AXLEFT= 0
##$AXNAME= <>
##$AXNUC= <1H>
##$AXRIGHT= 0
##$AXTYPE= 0
##$AXUNIT= <>
##$AZFE= 0.1
##$AZFW= 0.1
##$BCFW= 0
##$BC_mod= 0
##$BYTORDP= 0
##$COROFFS= 0
##$CY= 15
##$DATMOD= 1
##$DC= 0
##$DFILT= <>
##$DTYPP= 0
##$F1P= 0
##$F2P= 0
##$FCOR= 0.5
##$FTSIZE= 131072
##$FT_mod= 6
##$GAMMA= 0
##$GB= 0
##$INTBC= 1
##$INTSCL= 1
##$ISEN= 128
##$LB= 0.3
##$LEV0= 0
##$LPBIN= 0
##$MAXI= 10000
##$MC2= 0
##$MEAN= 0
##$ME_mod= 0
##$MI= 0
##$NCOEF= 0
##$NC_proc= -2
##$NLEV= 6
##$NOISF1= 0
##$NOISF2= 0
##$NSP= 0
##$NTH_PI= 0
##$NZP= 0
##$OFFSET= 14.96051
##$PC= 1
##$PHC0= -78.59619
##$PHC1= 0
##$PH_mod= 1
##$PKNL= yes
##$PPARMOD= 0
##$PPDIAG= 0
##$PPIPTYP= 0
##$PPMPNUM= 2147483647
##$PPRESOL= 1
##$PSCAL= 4
##$PSIGN= 0
##$PYNMP= <proc.py>
##$REVERSE= no
##$SF= 400.020009832802
##$SI= 131072
##$SIGF1= 0
##$SIGF2= 0
##$SINO= 400
##$SIOLD= 131072
##$SPECTYP= <>
##$SREGLST= <1H.CDCl3>
##$SSB= 0
##$STSI= 131072
##$STSR= 0
##$SW_p= 8223.68421052631
##$SYMM= 0
##$S_DEV= 0
##$TDeff= 65536
##$TDoff= 0
##$TI= <>
##$TILT= no
##$TM1= 0
##$TM2= 0
##$TOPLEV= 0
##$USERP1= <user>
##$USERP2= <user>
##$USERP3= <user>
##$USERP4= <user>
##$USERP5= <user>
##$WDW= 1
##$XDIM= 131072
##$YMAX_p= 379284779
##$YMIN_p= -11575
##$CURPLOT= <Network HP LaserJet P1505>
##$CURPRIN= <$Network HP LaserJet P1505>
##$DFORMAT= <normdp>
##$LAYOUT= <+/1D_H.xwp>
##$LFORMAT= <normlp>
##$PFORMAT= <normpl>
##$SURQMSG= 1
$$ End of Bruker specific parameters
$$ ---------------------------------
##NTUPLES= NMR SPECTRUM
##VAR_NAME=  FREQUENCY,     SPECTRUM/REAL,   SPECTRUM/IMAG
##SYMBOL=    X,             R,               I
##VAR_TYPE=  INDEPENDENT,   DEPENDENT,       DEPENDENT
##VAR_FORM=  AFFN,          ASDF,            ASDF
##VAR_DIM=   131072,        131072,          131072
##UNITS=     HZ,            ARBITRARY UNITS, ARBITRARY UNITS
##FACTOR=    0.0627417313425164, 1,          1
##FIRST=     8223.62146879497, -1448,        -54322
##LAST=      0,             -97,             -55066
##MIN=       0,             -11575,          0
##MAX=       8223.62146879497, 379284779,    0
$$ Real data points
##PAGE= N=1
##DATA TABLE= (X++(R..R)), XYDATA
$$ [...]
67923 77800 78368 78895 79656 80881 82398 83760 84660 85066 84984 84254 82702 80469 78084 76160 75017 74579 74604
67906 74604 74973 75742 76929 78429 80242 82675 86055 90094 93674 95487 95034 93049 90943 89736 89390
67891 89390 89096 88155 86507 84502 82406 80340 78405 76592 74709 72774 71304 70710 70450 69473 67696 66369
67875 66369 66589 67985 69387 70332 71189 72107 72622 72343 71386 70016 68375 66644 65034 63530 62028 60794
67859 60794 60334 60714 61407 61934 62207 62216 61863 61296 60894 60709 60410 60016 60123 60994 61957 62249 62082 62243 62920 63583
67839 63583 63915 64198 64735 65512 66594 68321 70793 73575 76269 79101 82523 86334 89621 91753 93143
67824 93143 94805 97218 99917 102250 104133 105693 106407 105268 102004 97654 93519 89906 86338 82681 79373
67809 79373 76601 73961 71211 68791 67175 66021 64475 62209 59781 57988 57147 57040 57313 57808 58595 59719
67793 59719 60826 61183 60309 58599 57040 56224 55870 55447 54922 54629 54599 54484 54149 53906 54052 54473 54918 55439
67775 55439 56288 57465 58606 59345 59668 59880 60295 60930 61495 61731 61725 61805 62134 62605 63052 63297 63049 62154 61110
67756 61110 60878 61829 63235 64158 64526 64877 65309 65376 64984 64748 65226 66185 66867 66719 65755 64451 63382 62727
67738 62727 62096 61072 59868 59108 58991 59091 59022 58843 58694 58499 58242 58061 57815 57045 55718 54581 54257 54282
67720 54282 53575 51743 49446 47563 46452 46039 46130 46438 46623 46563 46478 46635 47082 47748 48668 49863 51054 51744
67702 51744 51748 51458 51322 51159 50406 49101 48106 48011 48240 47842 46868 46316 46771 47785 48642 49081 49069 48583 47966 47904
67682 47904 48625 49532 50033 50276 50643 50986 50931 50602 50452 50538 50488 50097 49488 48744 47825 46920 46549 47171 48768 50761
67662 50761 52322 53049 53410 54182 55364 56083 55818 55128 54796 54800 54727 54693 55120 55867 56334 56286 55897 55151 53885 52450
67642 52450 51611 51704 52378 53203 54047 54895 55790 56923 58252 59163 59139 58723 59048 60349 61674 62247 62383 62779
67624 62779 63519 64145 64197 63387 61788 60180 59665 60511 61725 62123 61455 60265 59137 58518 58821 60051 61475
67607 61475 62110 61552 60165 58619 57390 56486 55489 54032 52340 51025 50300 49809 49349 49177 49378 49485 49162
67590 49162 48778 48860 49360 49980 50791 51915 52865 52901 51982 50835 50094 49822 49780 49719 49455 49121 49335 50590 52413
67571 52413 53580 53345 52124 50876 50153 49883 49781 49782 50232 51664 54143 56815 58412 58317 56925 54968 52867
67554 52867 50876 49421 48872 49122 49750 50526 51422 52203 52464 52229 52172 52855 53922 54446 54099 53485 53166 52841
67536 52841 51905 50502 49363 48764 48283 47689 47367 47556 47806 47696 47596 48064 48747 48634 47421 46024 45525 46063
67518 46063 46952 47474 47292 46424 45233 44359 44280 44828 45296 45150 44526 43991 43882 44012 44001 43751 43517 43608 44121 44899
67498 44899 45696 46420 47288 48548 49943 50694 50304 49192 48157 47372 46416 45244 44436 44317 44423 44213 43821
67481 43821 43673 43787 43931 44165 44677 45291 45626 45622 45452 45141 44722 44638 45386 46788 48065 48681 48696 48355 47855 47496
67461 47496 47546 47869 48190 48846 50599 53445 56147 57410 57128 56158 55249 54670 54558 54981 55645 56012 55878 55573
67443 55573 55520 55751 55864 55344 54009 52289 51024 50733 51134 51556 51763 52076 52653 52993 52395 50779 48860 47517
67425 47517 47116 47379 47773 47994 48180 48707 49733 50948 51844 52298 52748 53687 54986 55886 55684 54334 52346
67408 52346 50260 48397 47013 46418 46762 47753 48773 49359 49539 49591 49514 48940 47669 46107 44936 44430 44350 44488
67390 44488 44964 45863 46883 47560 47747 47673 47672 47984 48669 49508 50125 50411 50749 51593 52840 53878 54264 54162 54048
67371 54048 54142 54275 54224 54009 53811 53652 53339 52782 52225 51939 51826 51661 51661 52388 53926 55587 56713 57409 58113
67352 58113 58783 59009 58784 58632 58897 59313 59344 58692 57450 55999 54799 54037 53507 53016 52758 53003 53570 54038
67334 54038 54376 54866 55466 55861 56231 57298 59189 60824 61029 59969 58940 58842 59408 59907 60069 60081 60036 59808
67316 59808 59381 58989 58822 58741 58447 57908 57472 57483 57913 58431 58730 58679 58331 57999 58217 59264 60742 61875 62311
67297 62311 62411 62716 63392 64310 65413 66743 68166 69281 69661 69142 67881 66161 64170 62053 60145 58916
67281 58916 58523 58635 58914 59466 60494 61722 62671 63383 64268 65220 65527 64962 64363 64701 65979 67456 68593
67264 68593 69282 69446 69049 68406 67960 67719 67318 66620 65908 65468 65387 65745 66526 67222 67015 65668 63908 62649
67246 62649 62085 61808 61599 61681 62278 63281 64418 65453 66156 66386 66370 66671 67619 68867 69780 70225 70689 71609
67228 71609 72806 73741 74070 73807 73178 72591 72553 73247 74130 74337 73612 72573 71902 71535 70923 69924 69088 68970 69429
67209 69429 69824 69879 70135 71370 73606 75901 77255 77540 77353 77123 76749 76178 75894 76496 77897 79239 79632
67192 79632 78892 77572 76403 75772 75663 75963 76650 77670 78833 80017 81363 83001 84664 85858 86370 86262
67176 86262 85350 83256 80270 77704 76885 77809 79164 79645 78987 77819 76931 76812 77499 78581 79450 79818 80035
67159 80035 80782 82398 84574 86651 88141 88927 89111 88895 88575 88419 88419 88335 88087 87956 88217 88735 89173 89454 89748
67140 89748 90079 90310 90483 90843 91463 92151 92823 93614 94547 95357 95791 95825 95542 95121 95021 95756 97301 99049 100485
67121 100485 101580 102416 102966 103437 104271 105418 106203 106392 106861 108504 110937 113067 114560 115793 116589 116214
67105 116214 114800 113632 113461 113429 112391 110662 109610 109943 111199 112767 114530 116437 118168 119540 120749
67090 120749 121856 122416 122087 121389 121408 122684 124704 126590 127955 128900 129504 129751 129860 130251 131037 131884 132517
67073 132517 133062 133681 134205 134469 134758 135511 136711 138026 139477 141429 143806 145780 146570 146339 146081 146728 148487
67056 148487 150856 153070 154562 155196 155214 155048 155173 155886 157069 158287 159351 160605 162411 164524 166367 167827
67040 167827 169320 171108 172993 174762 176488 178249 179977 181723 183622 185496 187009 188413 190526 193573
67026 193573 196636 198764 200175 201750 203749 205844 208129 211145 214792 218100 220454 222435 225041 228487
67012 228487 232195 235640 238770 241741 244627 247467 250386 253576 257132 260839 264178 266758 268786 270947
66998 270947 273725 277022 280399 283541 286436 289389 292866 297056 301528 305630 309275 312988 317078 321240
66984 321240 325265 329635 334955 341064 347171 352727 357721 362400 367206 372792 379383 386099 391579 395499
66970 395499 398956 403138 408183 413661 419604 426452 434251 442499 450763 459038 467474 476090 484856 493802
66956 493802 502943 512192 521390 530409 539325 548533 558455 569061 579905 590769 601995 613952 626485
66943 626485 639201 651970 664724 677159 689270 701968 716341 732201 748118 763148 777917
66932 777917 793629 810627 828402 846494 864778 883151 901624 920588 940452 961029 981751
66921 981751 1002481 1023649 1045529 1067832 1090172 1112621 1135631 1159636 1184825 1211126 1238268
66910 1238268 1266008 1294345 1323380 1352961 1382687 1412265 1441624 1470700 1499465 1528311 1557962
66899 1557962 1588694 1619904 1650835 1681533 1712609 1744105 1775141 1804912 1833583 1861861 1889979
66888 1889979 1917585 1944473 1970878 1996892 2022118 2046178 2069224 2091488 2112613 2131957 2149467
66877 2149467 2165628 2180405 2192823 2201996 2208168 2212298 2214876 2215659 2214424 2211359 2206589 2199791 2190571
66864 2190571 2178927 2165106 2149256 2131576 2112656 2093226 2073428 2052610 2030050 2005744 1980256
66853 1980256 1953958 1926730 1898482 1869569 1840390 1810752 1780032 1748003 1715246 1682632 1650633
66842 1650633 1619185 1587976 1556692 1525220 1493773 1462720 1432150 1401831 1371750 1342457 1314553
66831 1314553 1287911 1261697 1235194 1208443 1182066 1156661 1132351 1108754 1085354 1061979 1038923
66820 1038923 1016539 994803 973423 952297 931637 911582 891874 872088 852193 832779 814655
66809 814655 798181 783044 768716 754949 741665 728484 714733 699990 684482 668900 654015
66798 654015 640358 627892 615950 603849 591675 580067 569205 558534 547678 537031 527067 517618
66786 517618 508279 499009 489779 480210 470315 461181 453970 448358 442884 436768 430503 424564 418543 411965
66772 411965 405154 398734 392771 386884 380841 374676 368499 362511 356953 351821 346908 342211 337882 333650
66758 333650 328822 323218 317666 313143 309703 306546 302854 298335 293323 288666 285171 282790 280551 277597
66744 277597 273975 270210 266529 262845 259127 255288 251083 246595 242531 239514 237290 235143 232837 230588
66730 230588 228309 225563 222278 218887 215691 212616 209678 207197 205335 203816 202280 200619 198875 197106
66716 197106 195453 194027 192605 190695 188037 184846 181543 178459 175796 173580 171546 169367 167081 165062
66702 165062 163551 162423 161463 160544 159475 158062 156458 155135 154303 153626 152732 151710 150853 150176 149513 148866
66686 148866 148227 147177 145134 142119 138943 136465 134887 133876 133089 132274 131105 129363 127444 126288 126465
66671 126465 127418 127884 127137 125619 124282 123576 123240 122898 122509 122117 121446 120004 117665 114966 112694 111146
66655 111146 109902 108371 106479 104724 103621 103191 103035 102804 102610 102957 104155 105754 106771 106702 106134 105985
66639 105985 106238 105947 104578 102886 102119 102616 103555 103911 103363 102349 101554 101378 101722 102143 102227 101789 100815 99443
66621 99443 98027 96971 96365 95970 95601 95327 95189 95004 94601 94021 93361 92680 92151 91980 91997 91699 90913 90060 89511
66602 89511 89074 88434 87639 86720 85313 83307 81484 80699 80620 80127 78935 77981 77996 78526 78772 78787 79293 80623
66584 80623 82306 83527 83720 82947 81934 81547 81962 82512 82486 81836 80908 79785 78372 76917 75954 75579 75182
66567 75182 74181 72823 71918 71788 71855 71420 70534 69773 69422 69379 69740 70790 72204 72997 72713 72157 72330 73092
66549 73092 73506 73149 72273 70967 69181 67661 67774 69900 72701 74485 74837 74485 74090 73767 73492 73292 73029
66532 73029 72427 71434 70321 69362 68539 67635 66551 65479 64695 64166 63644 63224 63438 64460 65551 65872 65641
66515 65641 65835 66823 68015 68851 69340 69468 68947 67972 67428 67747 68133 67574 66153 64757 63832 63103 62268 61369
66497 61369 60607 60254 60665 61864 63237 64047 64130 63768 63123 62288 61670 61760 62484 63201 63344 62834 61946 61135 60876
66478 60876 61331 62195 63087 63911 64593 64793 64269 63304 62342 61511 60929 61085 62193 63393 63425 62108 60460 59362
66460 59362 58903 58999 59686 60502 60508 59543 58754 59192 60434 61299 61509 61750 62292 62477 61753 60510 59552 59250 59595
66441 59595 60688 62624 64961 66765 67340 66702 65299 63492 61536 59854 58929 58867 59257 59626 59879 60172 60529
66424 60529 60767 60768 60677 60788 61260 61935 62542 63151 64260 66075 67799 68142 66711 64451 62492 61090 60062
66407 60062 59608 60008 60839 61322 61336 61320 61209 60286 58296 56031 54484 53854 53661 53378 52725 51779 51083 51249 52242
66388 52242 53435 54554 56037 58085 59891 60353 59310 57643 56422 56347 57672 60066 62563 64122 64331
66373 64331 63457 61991 60460 59374 58918 58785 58712 59008 60084 61637 62834 63287 63268 62901 61839 60061 58428
66356 58428 57932 58597 59555 60049 60005 59649 59011 58065 57137 56843 57421 58259 58427 57790 57333 58091 59907 61649 62536
66337 62536 62744 62619 61930 60324 58174 56409 55603 55604 55983 56379 56445 55923 55032 54456 54688 55557 56483 57000 56914
66318 56914 56274 55487 55194 55678 56501 57041 57283 57690 58375 58877 58861 58634 58725 59274 60076 60914 61552 61660 61111 60259
66298 60259 59564 59034 58308 57269 56289 55833 56037 56652 57241 57475 57487 57817 58771 59922 60544 60499 60339 60517 60899
66279 60899 61117 60998 60507 59646 58651 57987 57887 58071 58138 58009 57840 57728 57725 57888 58081 57925 57234 56350 55765 55608
66259 55608 55801 56520 58009 59971 61557 62177 62084 61998 62320 62850 63133 62914 62221 61177 59922 58799 58417 59203
66241 59203 60873 62576 63710 64326 64675 64705 64319 63817 63632 63728 63647 63213 62849 63112 64128 65539 66855 67766
66223 67766 68180 68016 67075 65324 63290 61849 61457 61838 62588 63693 65118 66311 66671 66247 65519 64753 64142
66206 64142 64234 65362 66733 67021 66017 64812 64121 63362 61920 60413 59885 60268 60525 60055 59229 58706 58844
66189 58844 59731 61212 62852 64260 65428 66481 67255 67478 67123 66194 64464 61941 59317 57351 56013 54888
66173 54888 54232 54784 56505 58386 59650 60432 61036 61328 61221 61043 60918 60423 59409 58661 59071 60514 62122
66156 62122 63367 64287 64870 64834 64038 62660 61022 59522 58627 58568 59193 60366 62187 64450 66222 66661 66111
66139 66111 65788 66386 67546 68640 69424 69825 69689 69053 68323 67933 68086 68823 69958 70968 71369 71312 71363 71637
66121 71637 71636 71029 70064 69075 68165 67619 67965 69264 70860 72249 73625 75085 75933 75538 74488 74043 74589 75424
66103 75424 76014 76631 77631 78800 79696 80127 80037 79410 78573 78135 78330 78678 78608 78151 77743 77651 77884 78432 79146
66084 79146 79529 79089 77944 76757 75994 75503 74937 74314 73919 73811 73770 73759 74105 75006 76058 76606 76569 76550 77046
66065 77046 77832 78312 78215 77662 76778 75598 74319 73320 72859 72979 73619 74553 75219 74964 73664 71941 70686 70451
66047 70451 71240 72623 73968 74822 75231 75560 75899 75847 75027 73734 72859 73134 74445 75881 76479 76053 75303 75116
66029 75116 75806 77111 78671 80235 81553 82501 83395 84795 86781 88688 89785 90023 89929 89935 90110 90413 90893
66012 90893 91531 92096 92345 92398 92814 94132 96230 98236 99251 99163 98643 98474 99101 100694 103244 106432 109699
65995 109699 112679 115426 118147 120921 123718 126444 128851 130680 132079 133595 135502 137323 138249 137935 136721
65980 136721 135245 133961 132774 131015 128044 124128 120378 117531 115091 112126 108607 105390 103019 101254
65966 101254 99794 98755 98167 97580 96652 95721 95362 95560 95766 95618 95222 94795 94489 94604 95521 97173 98926
65949 98926 100289 101605 103706 106926 110756 114445 117589 120003 121444 121900 121980 122543 123822 125211 126069 126477
65933 126477 127056 128233 129882 131534 132773 133499 134005 134763 136049 137796 139781 141807 143653 145096 146152
65918 146152 147166 148471 150064 151806 153884 156743 160465 164357 167436 169392 170918 172796 174748 175639
65904 175639 175067 174186 174387 175519 176225 175879 175186 174744 174122 172878 171527 170697 170035 168869 167325 165843 164019
65887 164019 161089 157317 153776 150800 147772 144451 141348 138522 135180 130999 126881 123726 121281 118876
65873 118876 116604 115003 114080 113429 112966 112916 113320 114125 115429 117128 118680 119690 120360 120755 120150 117914 114764
65856 114764 112237 110979 110355 109710 109228 109348 110053 110980 111789 112239 112329 112464 113108 114192 115281 116285 117524
65839 117524 119079 120638 121994 123147 123854 123808 123506 124241 126775 130496 134244 137496 140348 142873 145075
65824 145075 147229 149699 152531 155552 158672 161795 164673 167152 169294 170920 171387 170335 168471 167054
65810 167054 166635 166697 166423 165397 163657 161543 159578 158112 157025 156021 155166 154795 154936 155245 155539 156024 156861
65793 156861 157811 158405 158306 157587 156935 157455 159841 163707 168132 172826 178292 184844 192098 199662 207709 216476
65777 216476 225621 234542 242986 250889 257775 262754 265054 264302 260459 253840 245107 235001 224166 213330
65763 213330 203315 194515 186631 179328 172945 168199 165389 164367 165083 167616 171722 176969 183382 191422
65749 191422 201239 212502 225030 239001 254224 269744 284580 298445 311313 322628 331445 337302
65737 337302 340573 342012 342113 340682 336747 329194 317920 304271 289973 275689 260963 245488 229931
65724 229931 215384 202415 190823 180142 170146 160995 153016 146391 141020 136693 133223 130321 127551
65711 127551 124665 121872 119564 117896 116920 116912 118028 119658 120652 120408 119328 118090 116922 115885 115290 115262
65695 115262 115205 114362 112863 111670 111457 112061 113131 114718 116862 119079 120782 122087 123784 126501 130219
65680 130219 134560 139192 143928 148776 154090 160432 168130 177109 187278 198797 211779 225982 241137
65667 241137 257405 275058 293728 312347 329903 345916 360166 372399 382553 390880 397482 402013
65655 402013 404223 404625 404224 403627 402773 401463 399788 398088 396872 396801 398294 400900 403323 404214 402766 398637
65639 398637 391794 382598 371612 358979 344250 327176 308390 289038 270010 251900 235304 220467
65627 220467 206713 192990 179243 166751 156810 149476 143867 139268 135487 132379 129604 126905 124220
65614 124220 121429 118367 115176 112382 110476 109614 109823 111167 113408 115735 117285 117971 118403 118868 118779 117480
65598 117480 115418 114023 114281 115699 116883 116950 116164 115336 115030 115470 116838 119217 122269 125355 128170 131110
65582 131110 134851 139671 145361 151682 158698 166681 175930 186687 199064 212936 228026 244095 260903
65569 260903 277983 294672 310461 325069 338046 348550 355761 359355 359412 356065 349545 340335 328877
65556 328877 315161 299066 281187 262926 245552 229388 214096 199546 186160 174538 164974 157326
65544 157326 151216 146269 142218 138860 136087 134036 132998 132931 133220 133253 133111 133319 133956 134517 134685 134660 134510
65527 134510 133812 132338 130573 129011 127361 125074 122333 119787 117486 114862 111802 108995 107044 105892
65513 105892 105346 105460 106044 106415 106197 105947 106447 107741 109387 111251 113302 114889 115140 114214 113345 113314 113494
65496 113494 112850 111341 109800 108859 108699 109653 112184 116023 119993 123171 125919 129294 133583 137825 140855
65481 140855 142449 143318 144183 145112 145682 145628 145185 144794 144433 143420 141045 137426 133533 130261 127631 125033
65465 125033 122114 119170 116721 114955 113726 112860 112278 111844 111330 110603 109815 109250 108989 108765 108233 107336 106321
65448 106321 105431 104726 104271 104320 105089 106434 107966 109538 111385 113721 116338 118745 120636 122132 123640 125549
65432 125549 127952 130548 132845 134580 135820 136554 136347 134745 132064 129426 127742 126818 125740 124042 122188
65417 122188 120869 120177 119708 119290 119217 119745 120605 121223 121345 121278 121485 122042 122571 122710 122581 122756 123726 125437 127380
65398 127380 129078 130447 131704 133049 134509 136050 137703 139468 141141 142382 143072 143436 143658 143443 142286
65383 142286 140240 138084 136482 135266 133867 132262 131019 130503 130548 130999 131996 133511 135049 136257 137504
65368 137504 139394 141872 144270 146170 147834 149757 152208 155217 158624 162049 165160 168231 172189 177859
65354 177859 185261 193748 202607 211324 219439 226522 232377 237090 240761 243252 244304 243857 242111 239208
65340 239208 235021 229500 223161 216845 210811 204389 196909 188760 181098 174572 168820 163254 157887 153159
65326 153159 149307 146216 143665 141426 139325 137438 136134 135711 136061 136774 137393 137395 136241 133822 130855 128513
65310 128513 127521 127660 128065 127877 126710 124757 122554 120623 119317 118874 119415 120793 122689 124932 127523 130257
65294 130257 132654 134500 136163 138027 139834 140971 141226 140832 139880 138220 135967 133739 132203 131596 131620 131543
65278 131543 130572 128589 126502 125397 125380 125755 126242 127224 128641 129537 129247 128342 127715 127286 126435 125306 124712
65261 124712 124851 125053 124927 124932 125473 126163 126443 126454 126771 127592 128682 129846 131000 131817 131768 130609 128637 126453
65243 126453 124581 123238 122277 121427 120697 120409 120629 120794 120282 119309 118826 119414 120604 121543 121999 122405 123023 123511
65225 123511 123366 122501 121202 119770 118421 117387 116834 116595 116202 115281 113889 112430 111341 110800 110588 110224
65209 110224 109447 108620 108461 109226 110370 111192 111549 111657 111485 110859 110145 110232 111561 113529 115135 115976 116347 116649
65191 116649 117053 117608 118268 118816 119092 119335 119992 121143 122390 123411 124373 125596 127029 128314 129259 129957 130441
65174 130441 130517 130088 129467 129126 129147 129098 128542 127593 126852 126879 127786 129316 131174 133184 135196 136948 138154 138779
65156 138779 139126 139498 139778 139567 138844 138334 138989 141142 144330 147855 151335 154771 158335 162131 166075 170055
65140 170055 174360 179713 186527 194213 201612 208087 213801 218987 223542 227486 231169 234682 237532 239290
65126 239290 240088 240138 239287 237627 236016 235181 234557 232828 229541 225492 221576 218027 214854 212163 209726 206881
65110 206881 203184 198747 193752 188165 182188 176390 171082 166002 160934 156163 152047 148627 145949 144158
65096 144158 142896 141266 138995 137037 136314 136417 136318 135931 135979 136567 136953 136725 136218 135580 134395 132602 130965
65079 130965 130123 129778 129323 128792 128675 129144 129902 130530 130641 130035 129087 128650 129120 129850 129921 129290 128712 128716 129185 129801
65059 129801 130361 130626 130465 130280 130794 132128 133436 133785 133160 132300 131704 131180 130373 129389 128642 128217 127652 126482
65041 126482 124879 123544 122886 122530 121830 120744 119881 119718 120083 120558 121034 121524 121576 120428 117964 115209 113512
65024 113512 113272 113732 114006 113992 114160 114731 115427 115955 116411 117084 118011 118893 119359 119283 118902 118727 119254 120612 122501
65005 122501 124539 126637 128968 131608 134331 136787 138798 140401 141699 142747 143567 144232 144866 145567 146299
64990 146299 146855 146966 146522 145714 145013 145057 146432 149253 152761 155593 156879 157165 157852 159526 161181 161384 159942
64973 159942 157965 156450 155319 153871 151695 148935 146076 143672 141950 140464 138463 135847 133480 132263
64959 132263 132212 132748 133520 134431 135147 135222 134688 133992 133375 132806 132502 132848 133538 133383 131436 128078 124720 122579
64941 122579 121899 122044 122109 121653 121054 121021 121630 122217 122368 122550 123344 124422 124851 124285 123293 122553 122291 122593 123654
64922 123654 125320 126743 126993 125985 124540 123556 123308 123553 124028 124654 125369 126038 126675 127617 129234 131432 133676
64905 133676 135589 137309 139091 140880 142604 144764 148188 153085 158724 164259 169551 174898 180256 185165
64891 185165 189384 193201 197050 201122 205480 210207 215177 219859 223711 226767 229560 232336 234523 235210
64877 235210 234129 231952 229499 226756 222929 217557 211377 205835 201807 199056 196915 195114 193732 192746
64863 192746 191966 191254 190399 188976 186751 184138 181672 179040 175241 169997 164424 159882 156574 153765 150967
64848 150967 148362 146239 144671 143666 143104 142418 140906 138556 136211 134711 134113 133816 133248 132287 131283 130784
64832 130784 131053 131816 132552 133013 133246 133281 133156 133158 133592 134253 134547 134287 134006 134329 135344 136721 138195 139837
64814 139837 142129 145797 151120 157317 163090 167968 172666 177893 183388 188499 193180 197807 202267 205913
64800 205913 208324 209628 210020 209381 207477 204306 200244 195981 192189 189077 186336 183637 181047 178814 176972
64785 176972 175329 173651 171689 169348 167061 165669 165597 166357 167122 167560 167886 168478 169765 172072 175142 178158
64769 178158 180694 183290 186578 190322 193983 197817 202516 208002 213518 218831 224330 229841 234434 237805
64755 237805 240946 244976 249972 255352 260721 265787 270148 273777 277253 280841 283765 284947 284184 282004
64741 282004 278728 274332 268969 262899 255999 248047 239570 231789 225556 220777 216983 213983 211818 210403
64727 210403 209499 208786 207899 206650 205341 204506 204176 203722 202738 201905 202530 205235 209415 214106 219029 224436
64711 224436 230124 235141 238656 240756 242007 242442 241454 238679 234581 229950 225137 219937 214050 207482 200637
64696 200637 194135 188411 183388 178746 174485 170950 168247 166023 164086 162795 162471 162702 162749 162520 162648 163562
64680 163562 164937 166244 167508 169265 171915 175381 179397 183892 188959 194467 199912 204828 209282 213771
64666 213771 218617 223615 228241 231904 233943 233726 231077 226530 220990 215273 210002 205585 201997 198782
64652 198782 195659 193035 191636 191658 192560 193649 194609 195531 196697 198392 200699 203473 206641 210526 215622
64637 215622 221976 228969 235791 242152 248544 255784 264201 273264 282104 290273 297588 303327 306215 305655
64623 305655 302489 298035 292726 286241 278641 270561 262342 253737 244624 235444 226789 219023 212389 206932
64609 206932 202258 197949 194311 191972 190580 188742 185788 182851 181487 181785 182536 182873 182868 182800 182757 183063 184306
64592 184306 186665 189599 192354 194438 195684 196376 197369 199519 202805 206454 210123 214525 220660 228829 238617
64577 238617 249365 260267 270388 279200 287051 294673 302190 308845 313764 316708 318042 318115 316816 313705
64563 313705 308514 301492 293274 284468 275484 266645 258248 250472 243360 236855 230669 224248 217263 210249
64549 210249 204385 200447 198209 196943 196090 195257 194077 192587 191499 191549 192687 194288 195986 197809 199565
64534 199565 200670 200692 199650 197695 194892 191510 188138 185263 182931 180946 179230 177900 177152 177090 177459 177668
64518 177668 177346 176823 176668 176884 177072 177329 178224 179736 181023 181673 182481 184327 186817 188791 189905 190997
64502 190997 193004 196195 200389 205341 210867 216992 223949 231598 238994 245048 249523 252852 255115 255906
64488 255906 255235 253773 251929 249329 245641 241450 237932 235939 235626 236548 237712 237878 236303 233244 229612
64473 229612 226266 223640 221692 219994 218140 216275 215008 214655 214862 215126 215406 216059 217503 220069 223745
64458 223745 227798 231089 233111 234377 235423 235883 235073 233205 231376 230440 230413 230956 231932 233397 235453 238262
64442 238262 241954 246456 251558 257156 263365 270515 279169 289825 302340 315917 330030 345191 362406
64429 362406 382122 404257 429098 457622 490889 529621 574418 625861 684305 750057 823869
64418 823869 906616 998122 1096461 1198544 1300973 1400308 1493293 1577616 1652431 1717655 1772677
64407 1772677 1815888 1845346 1859639 1858144 1840887 1808496 1762335 1704445 1636855 1560665 1475900
64396 1475900 1382573 1282039 1177302 1072224 970592 875510 788916 711409 642801 582925
64386 582925 531658 488313 451621 420494 394357 372593 354233 338539 325370 314555 305301 296743
64374 296743 288807 281988 276419 271703 267483 263646 259948 255922 251293 246173 240780 235261 229750 224338
64360 224338 218974 213757 209223 205910 203671 201899 200560 200363 201678 203798 205759 207443 209302 211363
64346 211363 213241 215059 217480 220537 223041 223666 222226 219443 215836 211536 207044 203334 200832 198831
64332 198831 196406 193666 191611 190890 191161 191738 192440 193564 195255 197176 198745 199605 199892 200127 200770 201876
64316 201876 203215 204637 206108 207406 208188 208522 209060 210242 211398 211053 208293 203613 198303 193243 188533
64301 188533 184073 180014 176504 173348 170292 167535 165561 164401 163377 161755 159503 157252 155727 155358
64287 155358 156217 157971 159994 161865 163769 166181 169184 172345 175243 177818 180243 182855 186286 191250
64273 191250 197872 205399 212755 219199 224366 228046 230273 231409 231815 231524 230530 229279 228502 228563 229213 229988
64257 229988 230599 230871 230560 229422 227415 224726 221555 217814 213141 207359 200867 194365 188204 182357 177089
64242 177089 173153 170975 170055 169613 169477 169787 170168 169990 169366 169061 169306 169488 169330 169563 170860 172695 173949
64225 173949 174245 174032 173651 173131 172778 173118 174050 174664 174212 172849 171219 169716 168446 167532 167037 166743 166305
64208 166305 165585 164710 163879 163251 162906 162800 162826 162999 163404 163959 164458 164922 165665 166886 168553 170829 174231 178963
64190 178963 184491 190270 196676 204638 214394 225132 235882 246167 255623 263530 269144 272191 272726 270739
64176 270739 266214 259437 251004 241625 232069 223047 214881 207377 200248 193541 187447 181879 176608 171782
64162 171782 167929 165352 163742 162599 161848 161772 162346 162937 162936 162597 162879 164310 166408 168526 170917 174360 178869
64145 178869 183508 187567 191198 194584 197234 198676 199315 199853 200175 199523 197651 195162 192679 190284 187868
64130 187868 185543 183549 182034 181017 180323 179669 179111 179231 180409 182135 183661 185268 188150 192914 198830
64115 198830 204810 210527 216305 222463 229163 236445 243998 251168 257512 263023 267606 270760 272171 272288
64101 272288 271989 271949 272599 274250 276851 279935 283183 286750 290649 294172 296367 296779 295277 291591 285681
64086 285681 278300 270448 262347 253639 244511 235857 228234 221403 215159 209931 206200 203825 202341 201512
64072 201512 201165 200846 200173 199407 199239 200026 201496 203188 204966 207028 209545 212206 214157 214604 213757 212937
64056 212937 213410 215113 216885 218054 219416 222377 227281 233028 238378 243257 248538 254759 261523 268127
64042 268127 274387 280566 286754 292653 297890 302280 305681 307765 308098 306506 303397 299640 295994 292624
64028 292624 289304 286043 283320 281622 280983 281092 281658 282564 283860 285736 288227 290793 292492 292796 291946 290280
64012 290280 287620 283807 279464 275551 272267 269065 265769 262965 261085 259701 258091 256136 254282 252932
63998 252932 252229 252175 252579 253049 253394 253991 255470 258052 261398 265102 269058 273340 277937 282767 287865 293404
63982 293404 299437 305747 312154 318959 326831 335995 345766 355190 364031 372797 381896 391292 401059 411715
63968 411715 423680 436732 450351 464362 479014 494720 512080 531975 555195 581963 612032
63957 612032 645189 681580 721886 767564 820724 883202 955733 1038371 1131595 1236525 1354095
63946 1354095 1484674 1628609 1786276 1957018 2138475 2327610 2522148 2720446 2920237
63937 2920237 3118203 3310581 3493225 3660965 3808071 3930239 4025732 4093973 4133543 4142430
63927 4142430 4119977 4067503 3986775 3878879 3745186 3588914 3415020 3228766 3034837 2837525
63917 2837525 2640849 2448059 2261300 2082094 1912148 1753532 1607971 1476003 1356938
63908 1356938 1249780 1154066 1069665 995934 931593 875588 827582 787240 753324 723991 697892
63897 697892 674600 654065 636165 620813 608061 597749 589236 581770 575101 569612 565807 563793 563358
63884 563358 564554 567951 574108 582886 593645 606072 620394 636769 655027 675261 698036 723482
63872 723482 750631 778306 806352 835320 865125 894783 923443 950902 976957 1000902 1021975
63861 1021975 1039820 1054354 1065602 1073758 1078860 1080250 1076911 1068674 1056541 1041557 1023890 1003396
63849 1003396 980479 955784 929417 901087 870817 838913 805392 770074 733289 696052 659439
63838 659439 624169 590814 559925 531665 505601 481159 458264 437345 418654 401673 385425
63827 385425 369451 354354 341133 329998 320132 310598 301090 291754 282791 274593 267879 263106 259792
63814 259792 256749 253024 248452 243486 238809 235042 232418 230664 229314 228194 227431 227063 226784 226076 224542
63799 224542 222232 219731 217743 216438 215324 213908 212234 210624 209175 207829 206693 205881 205125 203946 202236
63784 202236 200374 198828 197866 197517 197440 196945 195637 194056 193193 193264 193454 193132 192785 193324 194746 196049 196415
63767 196415 195953 195197 194290 193008 191400 189957 189084 188652 188274 187912 188007 188924 190398 191552 191438 189694 186911
63750 186911 184422 183478 184411 186571 189044 191305 193206 194702 195863 197011 198567 200692 203229 205968 208873
63735 208873 212014 215340 218511 221095 223100 225228 228360 232710 237690 242670 247581 252667 258045 263696
63721 263696 269544 275169 279749 282781 284746 286537 288188 288578 286613 282461 277479 273051 269604 266626
63707 266626 263469 260009 256507 253053 249568 246360 244193 243452 243553 243597 243423 243620 244667 246554 249156 252418
63691 252418 256008 259280 261854 263997 266324 269291 273054 277505 282201 286419 289560 291569 292941 294302
63677 294302 295888 297314 298009 298060 298466 300251 303366 306795 309763 312508 315684 319276 322374 323957 323694
63662 323694 321989 319375 316065 312093 307650 302888 297473 290856 283247 275915 270091 265842 262370 259101
63648 259101 256007 253166 250755 249381 249698 251494 253719 255613 257344 259365 261728 264368 267597 271841
63634 271841 277034 282584 287858 292557 296863 301376 306754 313211 320520 328507 337346 347290 358393 370620
63620 370620 384003 398577 414398 431594 450154 469748 490246 512384 537273 565002 594275
63609 594275 623751 653121 682352 710380 735323 755807 771446 782057 787139 786457 780790 771822
63597 771822 761346 750654 740498 731285 723033 715022 705791 693848 678524 660000 638740 615310
63585 615310 590709 566236 542835 521001 501363 484666 470851 458876 448025 438789 431855 426845
63573 426845 422948 420362 420041 422121 425624 429839 435034 441501 448821 456650 465568 476496 489635 504458
63559 504458 520485 537565 555674 574943 595824 618750 643668 670226 698483 729101 762772
63548 762772 799668 839409 881064 922642 960568 990161 1007369 1010647 1001588 983985 962205 939869
63536 939869 919192 901018 885474 872737 863028 855785 849217 841016 829444 813589 793016 767782
63524 767782 738666 706837 673241 638704 604545 572334 542816 515670 490587 468030 448495
63513 448495 431586 416472 402910 391183 381208 372409 364457 357508 351563 346178 341042 336406 332644
63500 332644 329725 327371 325436 323826 322336 320885 319727 319074 318677 318154 317591 317463 318036 319256 321139 323737
63484 323737 326714 329610 332675 336797 342212 347913 352929 357687 363237 369385 374560 377577 378644 378368
63470 378368 376660 373178 368185 362266 355551 347915 339758 331948 325064 319225 314610 311582 310168 309826
63456 309826 309912 310137 310536 311264 312508 314383 316906 320184 324558 330313 337404 345775 355865 368342 383372
63441 383372 400604 419994 442250 468281 498521 532872 570839 611300 652147 690283 722042
63430 722042 744121 755065 756390 751908 745544 739794 736190 736449 742390 754854 773331 796769 824312
63417 824312 855074 887522 919471 948727 973663 993134 1006026 1011333 1009015 1000660 988813 975499
63405 975499 961666 947913 934972 922961 910701 896479 879339 859136 835629 808378 777622
63394 777622 744580 710622 676660 643599 612762 585249 561114 539624 520270 503208 488816
63383 488816 477209 468200 461439 456524 453160 451329 451206 452954 456677 462489 470381 480006 490849 502728
63369 502728 515962 530892 547372 564968 583642 604034 626938 652580 680487 710027 740964
63358 740964 773421 807395 842325 877029 909941 939419 963949 982261 993444 997177 994009 985454
63346 985454 973627 960542 947515 935021 923008 911289 899579 887201 872862 855046 832829
63335 832829 806392 776749 745117 712687 680820 651056 624627 601995 582973 567277 554921
63324 554921 546211 541540 541146 544740 551021 557385 560299 556436 544080 523977 498988 472681 447824
63311 447824 425773 406893 391201 378532 368382 360040 353029 347199 342242 337369 331870 325953 320651
63298 320651 316712 313845 311245 308547 305925 303442 300756 297584 294131 290884 288167 285946 283924 281785
63284 281785 279547 277714 276848 276861 276982 276574 275745 274973 274379 273713 272856 272030 271542 271601 272287 273415 274494 275147
63266 275147 275583 276383 277815 279726 282044 284978 288559 292427 296320 300407 304884 309518 313974 318361 323070
63251 323070 328212 333642 339504 346356 354655 364365 375175 386901 399599 413448 428608 445104 462818
63238 462818 481689 501825 523294 545869 569137 592740 616280 639136 660778 681286 701252
63227 701252 721087 740762 760354 780442 801641 823891 846519 868871 890612 911342 930145
63216 930145 945679 956737 962678 963279 958275 947330 930613 909077 883796 855211 823599 790213
63204 790213 757225 726229 697352 670258 645508 624235 606831 592663 581122 572310 566654 564414
63192 564414 565763 570772 578963 589202 600443 612431 625448 639600 654654 670414 686931 704269
63180 704269 722255 740496 758580 776331 793940 811695 829404 846130 860674 872339 881109 887109
63168 887109 890021 889033 883290 872420 856764 837130 814262 788543 760206 729724 697901 665645
63156 665645 633869 603555 575567 550200 527076 505735 486299 469307 454929 442599 431510
63145 431510 421276 412033 404126 397849 393244 389800 386484 382417 377674 373209 369968 368206 367565 367485 367461
63130 367461 367218 366819 366485 366248 366014 365979 366611 368025 369750 371401 373239 375699 378672 381750 384921 388434
63114 388434 392010 394882 396791 398386 400401 402820 405201 407399 409569 411644 413268 414299 415135 416436
63100 416436 418551 421100 423140 423967 423851 423828 424651 426200 427916 429445 430632 431349 431786 432567 434039 435697
63084 435697 436927 438241 440966 445558 450952 455946 460593 465702 471551 477890 484962 493587 504043 515577
63070 515577 527368 539495 552571 566841 582128 598485 616380 636299 658597 683767 712376
63059 712376 744491 779450 816530 855689 897462 942171 989455 1038510 1088642 1139552 1191245
63048 1191245 1243694 1296539 1349148 1401031 1452171 1502914 1553623 1604558 1656010 1708273 1761316
63037 1761316 1814490 1866549 1915897 1960793 1999491 2030332 2051789 2062481 2061234 2047269 2020403
63026 2020403 1981187 1930946 1871663 1805660 1735245 1662571 1589750 1518878 1451828 1390031 1334523
63015 1334523 1286078 1245118 1211458 1184405 1163340 1148238 1139471 1137102 1140578 1149226 1162812 1181328
63003 1181328 1204239 1230278 1258129 1287075 1316846 1347087 1377373 1407653 1438292 1469411 1500412
62992 1500412 1530340 1558676 1585472 1610635 1633148 1651091 1662481 1666121 1661690 1649083 1627852 1597426
62980 1597426 1557965 1510805 1457860 1400559 1339562 1275589 1210305 1146051 1084666 1026789 972400
62969 972400 921720 875357 833786 797031 764817 736687 711893 689515 668886 649864 632622
62958 632622 617254 603526 590828 578413 565948 553836 542716 532623 522962 513354 504024 495152
62946 495152 486347 477225 468132 459735 452052 444443 436528 428623 421222 414450 408119 401890 395380 388506
62932 388506 381951 376828 373603 371576 369689 367583 365577 363845 362070 359938 357597 355401 353366 351205
62918 351205 348909 347029 346077 345813 345470 344733 344044 343700 343182 341855 340016 338555 337654 336591 334960 333423
62902 333423 332873 333300 333980 334429 334687 334843 334744 334309 333888 334132 335493 337727 339948 341382 342089 342745 343757
62885 343757 344997 346404 348197 350154 351327 351160 350549 350961 352607 354287 355162 355863 357359 359316 360328
62870 360328 359609 357860 356378 355774 355710 355573 355074 354344 353734 353569 353947 354724 355720 356880 358132 359189 359750
62853 359750 359930 360284 361270 362886 364923 367304 369945 372494 374589 376250 377651 378605 378728 378157 377659 377829
62837 377829 378577 379557 380744 382274 383999 385589 386934 388157 389353 390558 391865 393348 394979 396847 399300
62822 399300 402545 406230 409748 412932 416095 419343 422315 424773 427133 430062 433704 437639 441618 445954
62808 445954 451020 456603 462189 467852 474488 482916 493019 504110 515998 529262 544458 561456 579785
62795 579785 599349 620553 643843 669396 697277 727812 761803 800320 844161 893527 948367
62784 948367 1008942 1075676 1148394 1226132 1307908 1393374 1482259 1573284 1663934 1751290 1832856
62773 1832856 1906618 1970587 2022528 2060144 2081573 2085820 2072961 2044099 2001091 1946009 1880671
62762 1880671 1806777 1726490 1642399 1556615 1470275 1384430 1300961 1221811 1147565 1077733 1012436
62751 1012436 952733 898964 849870 804074 761646 723441 689544 659226 632034 608021 587093
62740 587093 568873 553089 539483 527468 516452 506372 497510 490036 484135 480078 477519 475248 472495
62727 472495 470108 469457 470489 472009 473682 476448 480891 486548 493232 501735 512499 524604 536988 550032
62713 550032 565104 583018 603697 627000 653192 682768 716290 754165 796237 841871 890779
62702 890779 943420 1000283 1061243 1125948 1194176 1265128 1336750 1406498 1472558 1533772 1588663
62691 1588663 1635245 1671647 1696344 1707990 1705810 1690210 1662441 1623668 1574894 1517698 1454270
62680 1454270 1386521 1315726 1243263 1171030 1100774 1033470 969699 910269 855883 806481 761393
62669 761393 720165 682858 649558 619919 593307 569187 547300 527692 510673 496483 484721
62658 484721 474243 463981 453894 444837 437385 431126 425270 419538 414078 408872 403806 399150 395297
62645 395297 392037 388752 385478 383033 381816 381211 380661 380649 381875 383954 385803 387024 387965 388457 387569 385013
62629 385013 382092 380616 381164 382758 383997 384257 384016 384318 385869 388517 391723 395471 400346 406610 413632
62614 413632 420556 427231 434121 441576 449710 458817 469340 481320 494367 508446 524371 543211 565361
62601 565361 590462 618069 648140 680982 717000 756449 799042 843622 888396 931611 971962
62590 971962 1008481 1040363 1066950 1087526 1100968 1105958 1101857 1089174 1068923 1041816 1008470 970201
62578 970201 929000 886632 844092 801945 760828 721493 684632 650703 619706 591138 564528
62567 564528 539961 517803 497976 480069 464087 450507 439384 429999 421656 414293 408010 402500
62555 402500 397369 392599 388282 384282 380533 377283 374601 372033 369273 366830 365531 365631 366899 369160
62541 369160 372059 374672 376211 377061 378364 380618 383404 386461 390176 394858 400355 406655 414102 422660
62527 422660 431686 440969 451468 464501 480653 499899 522240 547511 574994 604028 634882 668354
62515 668354 704526 742544 781586 821266 860836 898605 932649 961775 985409 1002882 1013416
62504 1013416 1016771 1013439 1004108 989250 969359 945233 917848 888211 857631 827819 800248 775399
62492 775399 753011 733108 716445 703881 695706 691719 691548 694687 700574 709084 720725 735924 754249
62479 754249 774638 796280 818865 842115 865421 887818 907870 923645 933400 936563 933770 925902
62467 925902 913345 896067 873910 846721 814778 779434 742916 707107 672631 639260 606857
62456 606857 575645 545965 518283 493299 471606 453202 437625 424551 413943 405618 398955 393207
62444 393207 387932 383053 378647 374869 372020 370449 370256 371171 372849 375110 377642 379512 379613 377937 375953
62429 375953 375059 374819 373426 370014 365773 362502 360646 359233 357235 354358 350761 346719 342676 339200 336609
62414 336609 334792 333352 331848 329956 327646 325213 323018 321293 320222 320007 320627 321676 322626 323113 322901
62399 322901 321880 320378 319109 318412 317856 317131 317068 318992 323009 327668 331546 334540 337330 340320 343676
62384 343676 347829 353065 358793 364015 368644 373716 380137 387733 395833 404330 413720 424337 436022 448528
62370 448528 461871 476184 491518 508010 526164 546706 570046 595932 623790 653520 685932
62359 685932 722310 763543 809679 860156 914111 970285 1026830 1081505 1132138 1176941 1214548
62348 1214548 1243976 1264541 1275786 1277633 1270763 1256599 1236590 1211486 1181533 1147196 1109293 1068413
62336 1068413 1024747 978813 932093 886649 844175 805488 770692 739570 711940 687806 667094
62325 667094 649160 632853 617246 602105 587446 572918 558010 542757 527808 513734 500536
62314 500536 487803 475171 462619 450489 439222 428961 419505 410727 402810 395854 389561 383624 378225
62301 378225 373746 370183 367290 365134 363957 363581 363495 363576 364174 365423 367025 368875 371313 374473 377840 380865
62285 380865 383667 386819 390710 395407 400852 406849 412999 418873 424200 428893 433210 437884 443693 450703
62271 450703 458373 466548 475868 486994 500017 515031 532703 553658 577698 604297 633632 666603
62259 666603 703949 745879 792337 843049 897324 954222 1012746 1071381 1127644 1178704 1222423
62248 1222423 1257390 1282282 1296102 1299157 1292990 1279039 1257863 1229824 1195810 1156862 1113641 1066708
62236 1066708 1016986 965505 913011 860257 808530 759489 714485 674125 638300 606443 577950
62225 577950 552565 530273 510812 493648 478527 465655 455051 446047 437769 429881 422567 416009
62213 416009 410183 404989 400256 395798 391744 388539 386282 384325 382020 379636 377981 377268 376992 376949 377719
62198 377719 379895 383413 387969 393614 400477 408276 416566 425310 434803 445128 456051 467353 478899
62185 478899 490496 502099 514130 527099 540757 553991 565713 575534 583422 589263 593320 596927
62173 596927 602104 610295 621774 636396 654540 677062 704507 736664 772892 812640 855556 901058
62161 901058 947805 993677 1036435 1074460 1106780 1132493 1150611 1160748 1163715 1161035 1153780 1141986
62149 1141986 1125038 1102359 1073814 1039976 1002243 962410 921829 881101 840715 801786 765835
62138 765835 733925 706222 682317 661632 643505 627343 613012 600958 591672 585077 580518 577288
62126 577288 575018 573676 573446 574544 576932 580128 583519 586935 590758 595335 600402 605188 608947 611314
62112 611314 612267 611966 610613 608356 605320 601709 597759 593556 589098 584681 580959 578431 577064 576770 578084
62097 578084 581843 588115 595833 603725 611357 619151 627682 637232 647789 659117 670739 682120 693026
62084 693026 703809 715249 728048 742339 757795 774292 792320 812502 834830 858689 883551
62073 883551 909223 935423 961599 987365 1012720 1037638 1061858 1085321 1108423 1131486 1154381
62062 1154381 1176973 1199491 1221863 1242883 1260615 1273531 1280954 1282709 1279022 1270691 1258697 1243513
62050 1243513 1225142 1203659 1179152 1151233 1119366 1083811 1045652 1005799 964721 923365 883458
62039 883458 846267 811600 778625 747238 717961 690935 665814 642539 621539 603173 587531
62028 587531 574720 564745 557012 550495 544526 539026 533876 528591 522766 516335 509160 500858 491456 481841
62014 481841 473096 465562 458963 453281 449066 446845 446699 448488 452213 457896 465257 473671 482467 491282
62000 491282 500164 509347 518778 527820 535408 540531 542616 541700 538413 533714 528370 522517 515790 507834
61986 507834 498630 488410 477454 466079 454743 444116 434951 427715 422172 417436 412643 407532 402265
61973 402265 396924 391564 386567 382391 378905 375561 372436 370503 370424 371541 372617 373229 373826 374669 375497 376236
61957 376236 377313 379068 381431 384503 388956 395429 403758 413118 422870 433114 444548 457892 473313
61944 473313 490403 508841 529037 551855 577788 606692 638210 671845 706568 740916 773837
61933 773837 805067 834545 861915 886819 909225 929112 946238 960453 971757 979722 983426 982457
61921 982457 977444 969159 957689 943265 927380 912136 898757 887682 879955 877389 881135 890892 905813
61908 905813 925397 949114 975741 1003536 1030741 1055721 1077058 1093788 1105188 1110264 1108006 1098447
61896 1098447 1082923 1062903 1039010 1011528 981399 950098 918718 887679 857218 827761 799821
61885 799821 773816 749983 728234 708104 689018 670586 652626 635084 618075 601879 586775
61874 586775 572973 560787 550653 542830 537136 533094 530299 528713 528748 530979 535607 542278 550707 561395
61860 561395 575351 593136 614606 639548 667962 699611 733949 770962 811587 856763 906187
61849 906187 958406 1011960 1066021 1119935 1172555 1222229 1267399 1307058 1340430 1366188 1382388
61838 1382388 1387702 1382642 1369237 1349715 1326015 1300272 1274807 1251441 1231607 1217264 1210645 1212555
61826 1212555 1221769 1236643 1256444 1280328 1305903 1329996 1350350 1365518 1373528 1372018 1359737 1336922
61814 1336922 1304249 1262482 1213333 1159526 1103458 1046432 989455 933975 881292 831833 785544
61803 785544 742617 703445 668211 636917 609556 585961 565699 548318 533462 520593 508983
61792 508983 498155 488060 478659 469713 461203 453556 447106 441563 436299 430982 425736 420974 417256 415005
61778 415005 413950 412999 411018 407768 403973 400581 398073 396330 394990 393993 393842 395234 398381 402836 408004
61763 408004 413581 419386 425096 430404 435322 440173 445267 450630 455911 460606 464543 468124 471839 475562
61749 475562 478623 480568 481430 481230 479693 476764 473002 469134 465454 461940 458703 456008 454035 452867 452525
61734 452525 452786 453232 453792 455009 457420 460836 464591 468313 471977 475327 477804 479226 480126 481275 483150
61719 483150 486015 490156 495685 502241 509166 515879 521869 526430 528821 528899 527365 525141 522536 519169 514642
61704 514642 509074 502961 496758 490676 484680 478602 472451 466693 461950 458267 454984 451521 447955 444552
61690 444552 441163 437614 434286 431591 429038 425635 421293 417096 414016 412051 410762 409831 408729 406686
61676 406686 403701 400988 399619 399074 397859 395342 392279 389699 388009 387197 387187 387702 388255 388550 388745 389197
61660 389197 390135 391518 393032 394270 395147 396078 397556 399696 402415 405795 409889 414366 418793 423196 427907
61645 427907 432980 438176 443463 448994 454592 459751 464205 468041 471160 473130 473664 472728 470052 465168 458268
61630 458268 450489 442935 435787 428808 422320 417106 413509 411140 409424 408006 406778 405957 406197 408200 411994
61615 411994 416746 421270 424509 425653 424321 420898 416392 411580 406351 400091 392615 384507 376535 368997
61601 368997 361772 354825 348441 342927 338241 334034 330051 326422 323484 321308 319458 317282 314490 311355
61587 311355 308308 305423 302447 299234 295906 292564 289060 285286 281584 278637 276880 276022 275227 273790 271687
61572 271687 269374 267079 264527 261565 258778 256998 256286 255897 255271 254462 253468 251896 249782 248090 247643 247946
61556 247946 247881 247328 247223 248023 249073 249687 250020 250491 251035 251431 251848 252497 253140 253483 253801 254636 256059 257719
61538 257719 259518 261705 264280 266837 269126 271411 274016 276718 278810 279717 279425 278282 276564 274319 271622
61523 271622 268708 265661 262145 257791 252835 248049 243973 240569 237741 235795 235122 235687 237088 238827 240283
61508 240283 240761 240049 238793 237877 237462 236992 236094 235071 234470 234522 235095 235897 236581 236861 236732 236484 236434 236692 237183
61489 237183 237783 238424 239087 239704 240069 239951 239410 238869 238752 239182 240140 241707 243860 246101 247627 247926 247051
61472 247051 245459 243803 242797 242825 243539 244122 244105 243746 243570 243725 243928 243818 243253 242403 241702 241580 242081 242872
61454 242872 243728 244865 246592 248759 250804 252402 253815 255452 257233 258668 259519 260083 260671 261172 261460 262065
61438 262065 263886 267176 271229 275283 279342 283844 288868 293976 298558 302063 304248 305583 307062 309096
61424 309096 310909 311641 311809 312845 315259 318126 320608 323093 326312 329993 333044 334770 335365 335393 335271 335037
61408 335037 334196 331898 327730 322337 316959 312389 308587 305193 302004 298973 296038 293120 290189 287302
61394 287302 284693 282729 281635 281260 281171 280941 280294 279169 277783 276487 275466 274681 274177 274151 274592 275209 275940
61377 275940 277203 279238 281476 283093 284076 285289 287416 290278 293201 295752 297996 300381 303411 307203
61363 307203 311265 314946 318112 321141 324360 327824 331653 336112 341213 346688 352595 359617 368387 378697
61349 378697 389705 400776 411854 423029 434013 444182 453066 460817 468099 475388 482381 488355 493146
61336 493146 497488 502060 506486 509601 510693 510126 508662 506458 502971 497711 490855 483126 475292 467892
61322 467892 461214 455267 449786 444595 440100 437122 435948 435752 435281 434079 432688 431755 431345 431263 431630 432859
61306 432859 435251 438907 443895 450228 457589 465154 471751 476342 478482 478331 476155 472005 466122 459429
61292 459429 453104 447553 442288 437004 432299 428952 426847 425118 423303 421875 421581 422504 423919 424978 425511
61277 425511 426225 428093 431560 436430 442383 449261 456783 464443 471984 479665 487752 496032 504160 512200
61263 512200 520415 528784 537237 546219 556443 568118 580909 594578 609035 623675 637311 649052
61251 649052 658872 667146 674048 679611 683828 686368 686650 684531 680567 675175 668023 658732 647845 636464
61237 636464 625095 613533 601815 590578 580327 570902 561955 553527 545904 539237 533540 528788 524780
61224 524780 521191 517998 515564 513989 512670 510849 508405 505714 502959 500168 497877 497085 498265 500794
61210 500794 503612 506046 507768 508499 508348 508190 508951 510505 511884 512792 514345 518001 524240 532729 543353
61195 543353 556343 571536 588183 605713 624089 643078 661613 678367 692823 705355 716318
61184 716318 725568 733016 739251 745260 751577 757982 763981 769333 773976 777649 779802 779940 777983 774326
61170 774326 769642 764575 759477 754299 748741 742516 735400 727083 717162 705422 692099 677808 663308
61157 663308 649282 636133 623840 612166 601211 591591 583852 577806 572737 568227 564457 561655 559554
61144 559554 557406 554184 548673 539878 527884 514175 500704 488599 477978 468844 461615 456600 453322
61131 453322 450794 448429 446476 445578 446155 448305 452091 457599 464717 473119 482677 493748 506731 521391
61117 521391 536959 553087 570396 589757 611141 633485 655673 677348 698791 720337 742120
61106 742120 764113 786014 806973 825696 841100 853015 862177 869320 874198 875567 872244 864127 852136
61093 852136 837446 821000 803485 785219 765924 745106 722897 700228 677895 655811 633558
61082 633558 611412 590285 570741 552564 535387 519262 504385 490640 477749 465679 454595
61071 454595 444528 435332 426952 419528 413206 407972 403610 399759 396078 392497 389302 386842 385224 384410
61057 384410 384529 385840 388325 391445 394534 397489 400984 405810 411978 418711 425467 432753 441567 452198
61043 452198 464084 476830 490701 505870 521835 538111 554990 572896 591297 609084 625990
61032 625990 642840 660349 678417 696846 715986 736215 757284 778818 801277 826151 855410
61021 855410 890962 934276 986250 1047636 1119772 1204656 1304441 1421658 1560141 1724381 1916143
61010 1916143 2130598 2354822 2568779 2748098 2870011 2922764 2913234 2865464 2809767 2770416
61000 2770416 2759105 2773793 2799220 2809471 2775666 2677719 2513467 2299111 2061178 1825647
60990 1825647 1610345 1423263 1265335 1134182 1026367 938256 866502 808334 761346 723149
60980 723149 691586 665177 642946 623819 606520 590108 574321 559266 545063 531807 519553
60969 519553 508110 497091 486295 475891 466088 456880 448227 440268 433113 426633 420688 415425 411077
60956 411077 407596 404781 402677 401451 400852 400258 399463 399078 399870 401908 404715 408036 411993 416484 420852
60941 420852 424370 426799 428329 429150 429250 428471 426584 423410 419036 413827 408119 402059 395849 389921 384543
60926 384543 379355 373667 367338 361091 355797 351648 348209 345193 342935 342031 342626 344147 345734 346873 347672
60911 347672 348695 350613 353848 358265 363193 367930 372326 376758 381502 386371 391050 395525 399970 404358
60897 404358 408417 411874 414559 416342 417156 417070 416192 414531 412033 408590 403991 398074 391192 384264 378045
60882 378045 372443 366821 360889 354997 349703 345390 342254 340236 338938 337930 337211 337120 337784 338945 340359
60867 340359 342071 344205 346737 349551 352536 355648 359034 363062 367997 373702 379871 386358 392930 398903
60853 398903 403625 407356 411154 415785 421115 426591 431835 436673 441066 445141 448911 451941 453821 454950
60839 454950 456112 457113 456650 453915 449597 444854 440059 435145 430461 426383 422551 418390 414045 409974
60825 409974 405914 401204 395980 391095 386819 382600 378295 374675 372329 370881 369800 369250 369460 369834 369555
60810 369555 368886 369085 370945 374004 377346 380660 384234 388308 392895 398095 404167 411231 419196 428029 437811
60795 437811 448327 458940 469269 479851 491724 505330 520191 535746 552113 569853 589246
60784 589246 610060 631879 654549 678418 704138 731985 761320 791018 820433 849608 878533
60773 878533 906703 933480 958337 980508 999011 1013421 1024093 1031192 1034001 1031719 1024466 1012922
60761 1012922 997430 978170 955877 931495 905268 877006 847191 817068 787546 758739 730707
60750 730707 703960 678970 655775 634350 614905 597473 581533 566320 551369 536647 522413
60739 522413 508987 496400 484190 471771 459051 446483 434614 423818 414311 406047 398732 392302
60727 392302 387217 383809 381486 379261 377035 375756 376130 377687 379316 380343 380944 381804 383393 385328 386591
60712 386591 386720 386496 386880 387540 387210 385319 382338 378581 373793 368153 362605 357649 352702 347198 341534
60697 341534 336286 331221 325856 320408 315465 311099 307032 303316 300209 297677 295620 294301 293944 294130 294160
60682 294160 293816 293251 292440 291317 290167 289223 288090 286296 284280 283121 283198 283795 284108 284077 284050 284165 284387 284765
60664 284765 285372 286212 287343 288864 290592 291978 292660 293023 293971 296091 299153 302580 306212 310324 314988
60649 314988 319952 325349 331881 339680 347454 353653 358304 362679 367181 370731 372519 373186 373593 373489 372361
60634 372361 370754 369610 368768 367225 364624 361544 358419 355120 351519 347646 343314 338343 333198 328726
60620 328726 325269 322630 320724 319532 318537 317045 315075 313160 311306 309088 306756 305137 304187 302717 300102
60605 300102 297326 295659 294987 294267 293091 292008 291565 291691 291938 291855 291276 290566 290362 290698 290721 289765 288421 287980
60587 287980 288912 290418 291453 291691 291494 291458 292207 294214 297500 301614 306080 310750 315675 320876 326436 332641
60571 332641 339690 347258 354633 361409 367766 373831 378938 381949 382318 380561 377614 374090 370285 366489
60557 366489 362986 360040 358191 358253 360544 364325 368507 372880 378220 385204 393656 402897 412370 421770 430852
60542 430852 439271 446445 451542 453848 453257 450281 445717 440453 435351 430867 426816 422911 419464 417103
60528 417103 415827 414891 413738 412535 411571 410684 409583 408448 407821 408101 409358 411414 413897 416443 419070
60513 419070 422267 426545 432066 438783 446740 456165 467472 481319 498458 519324 543790 571302 601034
60500 601034 631939 662987 693473 722827 749911 772675 788719 796231 794524 783944 765416 739957
60488 739957 708597 672801 634710 596670 560551 527662 498947 474682 454093 435953 419753
60477 419753 405897 394670 385530 377564 370184 363206 356723 351120 346771 343453 340379 336967 333237 329451
60463 329451 325831 322706 320280 318088 315385 312364 310228 309566 309384 308406 306693 305164 304046 302735 300970
60448 300970 299189 297740 296534 295535 294901 294543 294136 293693 293591 293900 294169 294070 293768 293471 292989 291968 290288
60431 290288 288104 285808 284049 283429 283976 285077 286078 286790 287404 288178 289287 290691 292031 292861 293112 293177
60415 293177 293507 294272 295402 296689 297855 298789 299750 300988 302146 302477 301864 301182 301309 302083 302608 302406 301792
60398 301792 301338 301477 302654 305178 308624 311828 313989 315559 317605 320430 323353 325857 328297 331159 334157
60383 334157 336642 338590 340550 342704 344623 346119 347727 350042 352937 355801 358207 360012 361039 361094 360317
60368 360317 359210 358327 358078 358664 359943 361422 362648 363619 364634 365781 366851 367776 368926 370783 373468
60353 373468 376724 380302 384182 388329 392367 395755 398280 400153 401429 401630 400268 397578 394333 390932
60339 390932 387133 382786 378423 374880 372592 371461 371099 370992 370673 370022 369284 368651 368033 367288 366399 365243
60323 365243 363528 361245 358956 357436 357170 358311 360804 364364 368614 373510 379327 386064 393288 400867
60309 400867 409422 419613 431322 443967 457188 470611 483194 493512 500663 504404 504536 500801 493450
60296 493450 483369 471559 458838 446010 433789 422477 412138 403139 396083 391154 387937 385907
60284 385907 384630 383490 381876 379889 378386 377975 378289 378463 377966 376686 374602 371833 368856 366280 364341
60269 364341 362779 361181 359319 357218 354956 352417 349339 345764 342326 339822 338528 338213 338706 339986 341676
60254 341676 343019 343623 343842 344107 344268 344002 343543 343491 344006 344659 345095 345407 345755 346053 346217 346438 346897 347392 347575
60235 347575 347542 347907 349174 351222 353498 355488 356899 357633 357945 358523 360054 362623 365740 368900 371876 374575
60219 374575 377005 379389 381890 384236 386176 388375 392067 397470 403223 408015 412164 416891 422529 428359
60205 428359 433811 438850 443283 446784 449743 453165 457407 461765 465635 469318 473251 477129 480325 482683
60191 482683 484379 485427 485824 485860 485782 485410 484497 483225 481884 480308 478066 475088 471670 467991 464082 460231
60175 460231 456959 454498 452549 450685 448812 447081 445490 443731 441548 439183 437267 436122 435385 434601 433966
60160 433966 434009 434622 435048 434951 434917 435591 436847 438177 439388 440418 440935 440812 440818 442111 444978 448556 451883 454788
60142 454788 457698 461040 465135 470319 476784 484171 491499 497659 502142 505353 508091 510660 512608 513394
60128 513394 513106 512343 511547 510722 509750 508734 507955 507584 507550 507655 507851 508283 508947 509447 509354 508784 508285 508128 508101
60109 508101 508107 508503 509533 510814 511745 512077 511738 510406 507841 504522 501431 499191 497768 496948 496648 496715 496836
60092 496836 496842 496900 497292 498199 499671 501573 503513 505117 506471 508077 510265 512824 515325 517653 520140 523138
60076 523138 526441 529125 530140 529257 527313 525272 523083 519725 514386 507338 499633 492149 485025 477831
60062 477831 470189 462310 454964 448851 443995 439824 435754 431632 427737 424560 422460 421278 420345 419150
60048 419150 417996 417755 418935 421283 424271 427610 431114 434430 437263 439759 442409 445547 449052 452513
60034 452513 455553 458011 459914 461299 462070 462001 460868 458519 454899 450153 444684 438942 433082 426959 420494
60019 420494 413883 407382 401053 394921 389212 384184 379763 375646 371828 368711 366498 364665 362375 359440
60005 359440 356587 354713 354059 354254 354872 355717 356741 358050 359901 362349 364810 366308 366417 365826 365788 367052
59989 367052 369418 372180 374798 377238 379889 383246 387513 392315 396807 400248 402631 404657 406917 409152
59975 409152 410589 411009 411085 411507 412186 412647 412829 412989 413083 412842 412358 412067 412198 412768 413971 415843 417516 417699
59957 417699 416196 414269 413144 412887 413080 413771 415021 416136 416231 415264 413879 412529 411390 410766 410761 410741 409890
59940 409890 408217 406353 404466 402126 399234 396311 393777 391595 389754 388448 387644 387012 386464 386232 386311 386438
59924 386438 386729 387689 389369 391166 392728 394480 396921 399985 403460 407456 411981 416541 420688 424533 428278
59909 428278 431643 434378 437002 440326 444373 448379 451854 455092 458558 462176 465401 467693 468845 468980
59895 468980 468334 466973 464880 462366 460109 458540 457426 456383 455597 455622 456602 458125 459868 461960 464672
59880 464672 468104 472279 477207 482609 487805 492109 495354 497923 500249 502264 503378 503101 501643 499671
59866 499671 497429 494531 490892 487399 484969 483127 480323 475878 470998 467429 465537 464187 462200 459341
59852 459341 456002 452537 449177 446170 443607 441187 438435 435200 431786 428575 425663 422930 420330 417969
59838 417969 415953 414295 413007 412117 411588 411357 411563 412578 414679 417719 421240 424773 427881 430099 431217
59823 431217 431658 432163 432874 433030 431925 429992 428408 427600 426681 424691 422006 419944 419100 418681 417672 416134
59807 416134 414941 414574 414698 414804 414709 414295 413299 411690 409970 408756 408111 407510 406369 404394 401535 397942
59791 397942 394027 390386 387507 385569 384413 383577 382484 380857 379031 377592 376626 375549 373842 371774 370150
59776 370150 369414 369347 369684 370674 372699 375476 378048 379735 380838 382120 383773 385278 386347 387619 390097
59761 390097 394066 398827 403456 407493 410915 413799 416307 418858 422017 426143 431169 436675 442104 446984
59747 446984 451154 454776 458086 461156 463975 466655 469327 471828 473716 474712 474983 474949 474946 475170 475694 476339 476691
59730 476691 476520 476094 475808 475607 475109 474259 473446 472924 472555 472382 472938 474498 476334 477335 477359 477370 478126 479266
59712 479266 480009 480244 480435 480803 481256 482043 483825 486857 490607 494503 498613 503100 507366 510405 512138 513773
59696 513773 516565 520531 524614 527818 529874 531019 531556 531639 531280 530511 529582 528789 528040 526819 524921 522881
59680 522881 521314 520021 518307 516063 513904 512120 510145 507363 503943 500498 497254 494006 490635 487269
59666 487269 484007 480861 477893 475257 473149 471819 471406 471653 472056 472523 473570 475621 478461 481726 485533
59651 485533 490143 495200 499847 503552 506321 508252 509324 509608 509150 507662 504800 500807 496384 491874 487091
59636 487091 481975 476831 471766 466582 461566 457724 455628 454439 452730 450065 447168 444657 442301 439611
59622 439611 436571 433469 430411 427331 424253 421185 417902 414217 410521 407707 406402 406356 406741 406958 407023 407298
59606 407298 408047 409239 410562 411594 412114 412303 412465 412558 412238 411456 410655 410213 409991 409717 409597 410114 411318 412652
59588 412652 413527 413845 413921 414055 414185 413864 412687 410783 408657 406399 403432 399402 394975 391216 388379 385872
59572 385872 383313 380982 379168 377702 376356 375147 374011 372573 370593 368340 366373 365205 365284 366857 369593
59557 369593 372642 375350 377657 379638 381099 381996 382950 384897 388267 392774 397951 403626 409954 417221 425637
59542 425637 435338 446577 459854 475609 493712 513220 532372 548520 558546 560448 555003 545447
59530 545447 535211 526208 519206 514811 513294 514027 516043 519066 523353 528604 533755 537954 541171 543578
59516 543578 544776 543978 540780 535513 528847 521217 512719 503470 493897 484511 475478 466621 457816 449157
59502 449157 440844 433281 427209 423127 420550 418429 416564 415836 416622 417738 417764 416919 416654 417575 418784 419392
59486 419392 419782 421008 423464 426560 429444 431795 434153 437587 442816 449546 456804 463862 470545 476773
59472 476773 482212 486487 489395 490859 490956 490059 488642 486929 485006 483266 482390 482835 484642 487783 492356
59457 492356 498395 505791 514405 523946 533790 543401 552970 563048 573434 583036 591178 598387 605298 611212
59443 611212 614411 613760 609383 601897 591732 579524 566637 554681 544553 536116 528751 521898 515125
59430 515125 508094 500916 494426 489703 487168 486473 487416 490594 496722 505598 516335 528575 542887 559802
59416 559802 578939 599426 620833 643359 667150 691435 713910 730743 737825 732979 717468 695388
59404 695388 671628 650205 633704 623317 618976 619678 623779 628885 631607 628127 615802 594704 567810
59391 567810 539567 513751 491966 473779 458241 445288 435623 429396 425480 422338 419378 417061 415814
59378 415814 415283 414784 414130 413649 413626 414086 415092 416839 419311 422111 424826 427428 430138 433050 436071 439157
59362 439157 442319 445394 448079 450387 453005 456976 462882 470382 478697 487579 497607 509379 522598
59349 522598 536386 550479 565627 582531 600787 619255 637222 654657 671405 686744 699956
59338 699956 710917 719835 726674 731106 732894 732053 728744 723249 715975 707171 696697 684411 670946
59325 670946 657738 645946 635439 625235 614914 605199 596958 590085 583791 577750 572300 567477 562471
59312 562471 556448 549511 542410 535551 528779 522060 515849 510569 506044 501709 497295 493111 489708 487360
59298 487360 485948 485240 485145 485539 485956 485744 484698 483341 482430 482278 482721 483574 484853 486612 488757 491092 493426
59281 493426 495711 498248 501662 506461 512575 519515 527018 535362 545027 556153 568420 581342 594550
59268 594550 607721 620337 631756 641683 650356 657915 663650 666303 665327 661511 656121 649724 642077 632833
59254 632833 622009 610000 597570 585671 574879 565043 555803 547269 539820 533453 527904 523362 520478
59241 520478 519490 519870 521043 523065 526257 530451 534922 538978 542406 545412 548141 550202 550726 549149 545934
59226 545934 542151 538309 533882 528138 521066 513279 505279 497188 489014 480870 472914 465326 458297 451907
59212 451907 446050 440671 436008 432372 429697 427534 425577 424020 423221 423146 423345 423453 423508 423763 424434 425786
59196 425786 428179 431702 435845 439844 443375 446695 450224 454303 459252 465087 471076 476063 479579 482325
59182 482325 485411 489467 494600 500562 506571 511562 515270 518760 523275 528861 534719 540573 546887 553875
59168 553875 561102 568187 575233 582410 589688 597088 604609 611716 617424 621141 622998 623200 621613 618258
59154 618258 613755 608828 603625 597782 590970 583170 574691 566094 557927 550366 543243 536450 530065 524013
59140 524013 517964 511739 505590 499953 495081 490955 487368 484114 481358 479733 479691 480817 482205 483550 485434
59125 485434 488480 492670 497639 503167 509250 516089 524203 534157 545962 558977 572451 585856 598815
59112 598815 611264 623765 637024 650917 664513 677138 688805 699492 708844 716958 724629 732197
59100 732197 738832 743574 746500 748150 748415 746907 744031 740707 737145 732826 727726 722720 718560 715139
59086 715139 712011 709079 706390 703609 700023 694887 687691 678330 667237 655257 643271 631927 621501
59073 621501 611792 602219 592352 582416 573055 564657 557067 549924 543022 536356 530064 524373 519376 514810
59059 514810 510226 505462 500849 496949 494079 492067 490322 488217 485526 482538 479714 477328 475512 474424
59045 474424 474149 474415 474647 474402 473769 473311 473663 475074 477290 479803 482249 484631 487295 490696 495071 500245
59029 500245 505824 511615 517704 524153 530962 538495 547518 558497 571167 585125 600411 616995 634058
59016 634058 650558 666238 681217 694643 704718 710277 711584 709400 704141 696427 687698 679568 672903
59003 672903 667906 664719 663479 664040 666044 669090 672712 676468 680133 683437 685763 686679 686709 686699 686365 684381
58987 684381 680229 674918 669364 663068 655137 645725 635627 625223 614827 605464 598195 593024 589380
58974 589380 587357 587499 589625 592792 596365 600351 604816 609672 614979 620800 626926 633285 640308 648202
58960 648202 656272 663749 670864 678130 684777 689042 689983 688039 683835 677491 669290 659962 649952 639228
58946 639228 628106 617484 607926 599245 591283 584469 579142 574953 571314 567922 564426 560100 554385 547573
58932 547573 540619 534399 529295 525213 521797 518793 516305 514531 513328 512274 511133 509882 508429 506724
58918 506724 505107 504080 503676 503503 503420 503746 504742 506248 507948 509717 511761 514679 519258 525812 533808 542491
58902 542491 551629 561223 570862 580056 589001 598215 607440 615692 622488 628408 634389 641146 649344 659661
58888 659661 672373 687304 704219 722843 742590 762847 783327 803439 821565 835949 846288
58877 846288 853453 857594 857739 853521 846075 836619 825152 811275 795420 778528 761326 744711 730107
58864 730107 718359 708708 699761 691134 683252 675891 668053 659337 650492 642300 634561 626527 617825 608588
58850 608588 599106 589767 581162 573790 567558 561904 556564 551932 548385 545444 542135 538148 534037 530081
58836 530081 525615 520016 513787 507949 502726 497597 492416 487698 483882 481025 479159 478156 477280 475636
58822 475636 473215 470909 469554 469497 470867 473322 475650 476650 476553 476683 477680 479077 480617 482721 485307 487388
58806 487388 488426 489020 489752 490402 490909 491893 493401 494207 493430 491985 491370 491744 492218 492427 492654 492873 492792 492539
58788 492539 492386 492082 491446 491330 492978 496551 501164 506210 511763 517775 523835 529765 535647 541190 545796
58773 545796 549348 552186 554202 554674 553214 550313 546714 542708 538271 533490 528599 523807 519265 515073
58759 515073 511254 507841 504921 502576 500934 500346 501216 503492 506621 510121 513785 517191 519635 520966 521959
58744 521959 523359 525021 526541 528226 530711 533991 537568 541428 546173 552218 559410 567376 575758 584273
58730 584273 593003 602454 612817 623330 632857 640992 648084 654329 659335 662511 663500 662397 660005 657678
58716 657678 656448 656490 657735 660501 664939 670293 675552 680563 685677 690473 693799 695136 695027 693871 691042
58701 691042 685524 676993 666002 653502 640275 626509 611766 595743 579016 562780 547888 534521
58689 534521 522636 512195 503046 495105 488577 483479 479010 474083 468499 462997 458079 453543 449332 446098
58675 446098 444464 444217 444657 445350 446206 447197 448467 450526 453902 458666 464542 471346 478971 487033 494882
58660 494882 502161 509106 515972 522153 526239 527247 525617 522681 519322 515653 511873 508570 505904 503223
58646 503223 500080 497073 494991 493555 491822 489657 487959 487317 487115 486207 484129 481485 479414 478738 479382
58631 479382 480535 481471 482113 482732 483423 484112 484756 485196 485172 484883 485254 487085 490148 493617 497275 501781 507840
58614 507840 515485 524058 532488 539777 545763 551340 557446 563835 569180 572314 573058 572086 570447 569099 568342
58599 568342 567655 566364 564401 562119 559570 556457 552692 548666 545004 542335 541052 541004 541592 542520 544275
58584 544275 547678 553244 561111 571035 582074 592916 603000 612790 622440 630962 637509 642840 648497
58571 648497 654947 661513 667803 674166 680980 688604 697926 709880 724367 740626 758639 779192 802411
58558 802411 827182 852190 876660 899910 921089 939671 955469 967985 976468 980866 982011 980624
58546 980624 976780 970560 962516 953186 942706 931113 918507 904727 889346 872108 852975 831931
58534 831931 809429 786931 766165 747633 730615 714733 700730 689423 680649 673576 667531 662269
58522 662269 657978 655198 654243 654560 655130 655555 656263 657697 659913 662917 666573 670211 673128 675652 678891
58507 678891 683224 687781 691542 694146 695413 694966 692772 689414 685487 681254 677089 673521 670528 667433
58493 667433 663846 660117 656637 653304 650023 647165 645266 644653 645587 648290 652696 658596 666061 675231 685811
58478 685811 697347 709876 723565 737856 751808 765151 777988 789500 798093 802983 804606 803286
58466 803286 798731 791190 781987 772365 762803 753848 746541 741371 737786 735350 734528 735729 738478 742230
58452 742230 747183 753577 760792 767803 773886 778355 780357 779570 776545 771887 765733 758468 751137 744532
58438 744532 738632 733495 729916 728484 728644 729430 730513 731899 733296 734675 736929 741091 747211 754681 763307
58423 763307 773355 784744 796867 809106 821056 832359 842635 851450 858204 862345 863786 862784
58411 862784 859433 853857 846882 839758 832969 825937 818129 809835 801727 794435 788679 784957 782816 781208
58397 781208 779884 779647 781035 783642 786978 791039 795668 800300 804696 809018 812772 814712 814280 812269 809613
58382 809613 806421 802591 798436 794292 790453 787835 787635 789904 793477 797604 802444 807726 812530 817035
58368 817035 822889 830875 839608 847567 855145 863619 873331 884059 896064 909445 923330 936856 950196
58355 950196 963649 976576 988241 998800 1008446 1016452 1022085 1025676 1027936 1029135 1029859 1031527 1035034
58342 1035034 1039733 1044790 1050630 1058051 1066832 1076393 1087038 1099493 1113877 1129908 1147259 1164985
58330 1164985 1181642 1196803 1211392 1225808 1239013 1250211 1259880 1268158 1273950 1276943 1278909 1281470
58318 1281470 1284196 1286447 1289402 1294295 1300138 1305420 1310902 1318568 1328690 1340117 1352656 1366997 1382810
58305 1382810 1398961 1415281 1432428 1450440 1469026 1488656 1509760 1531393 1552249 1572371 1592375
58294 1592375 1611750 1629502 1645826 1661628 1677207 1692805 1709540 1728222 1748196 1768793 1790825
58283 1790825 1815034 1840404 1865804 1892068 1920550 1950903 1982260 2015236 2050637 2087515 2124768
58272 2124768 2163367 2204617 2247557 2290606 2334505 2381011 2429981 2480528 2533746 2591190 2651754
58261 2651754 2713230 2776083 2842472 2912294 2983471 3055509 3129461 3204728 3279153 3352107 3424637
58250 3424637 3497011 3569143 3642969 3721326 3804810 3892538 3985312 4085026 4191825 4305064 4426128
58239 4426128 4556784 4695715 4840505 4992323 5154785 5328890 5513237 5708630 5918091
58230 5918091 6142637 6381394 6635787 6909359 7203641 7518506 7856424 8221936 8617104
58221 8617104 9042006 9499653 9995977 10535439 11121495 11761183 12464378 13239038 14092435
58212 14092435 15036716 16088249 17262817 18578014 20060185 21743306 23663031 25860303
58204 25860303 28391459 31328163 34748169 38733032 43371435 48753762 54966904 62114470
58196 62114470 70355757 79924336 91109919 104227639 119595749 137519617 158281978
58189 158281978 182133360 209228399 239433387 272007311 305268625 336413275 361673637
58182 361673637 377004718 379284779 367567034 343610611 311246924 274954452 238534345
58175 238534345 204505947 174172032 147954310 125726186 107084476 91545836 78641168
58168 78641168 67935199 59036621 51616558 45408190 40187822 35767430 32000841 28778201
58160 28778201 26007828 23609228 21519410 19691784 18085419 16662507 15395157 14264797
58152 14264797 13253293 12341531 11516300 10770547 10095854 9481153 8918978 8406154 7937598
58143 7937598 7505510 7105285 6736363 6396422 6080083 5784085 5508663 5252961 5013799
58134 5013799 4789649 4581249 4387398 4204339 4030066 3865454 3710681 3564340 3426407
58125 3426407 3298151 3178572 3064578 2955233 2852225 2755817 2663978 2575997 2493216 2415504
58115 2415504 2340587 2267708 2198450 2133063 2069392 2006572 1946574 1890719 1837550 1785491 1735049
58104 1735049 1687067 1641166 1597159 1555824 1517102 1479461 1442094 1405926 1371669 1338772 1307076
58093 1307076 1277617 1250915 1226161 1202822 1181366 1161786 1143116 1125067 1108447 1093292 1078226
58082 1078226 1062334 1046206 1030470 1014686 998274 981209 963372 944473 924994 905994 887735
58071 887735 869713 851944 834828 817921 800563 783716 769257 757286 745972 734325 723194
58060 723194 713240 703888 694859 686768 679463 671536 662271 652513 642928 632976 622398 612173 603109 594871
58046 594871 587111 580238 574294 568403 562105 555994 550347 544433 537928 531712 526454 521583 516502 511640
58032 511640 507423 503246 498272 492344 485439 477259 468132 459306 451590 444477 437207 429706 421992 413807
58018 413807 405603 398744 393876 390031 386220 382838 380492 378432 375468 371834 368863 367075 365678 363851
58004 363851 361666 359684 358229 357187 356184 354979 353788 353039 352759 352488 351748 350290 348024 345272 342912
57989 342912 341568 340764 339689 338709 339198 341796 345757 350075 354224 357602 359395 359492 358752 357954 357128 356133
57973 356133 355062 353885 352497 351293 350811 350701 350081 349102 349010 350371 352412 354456 356720 359134 360761 361246
57957 361246 361731 363391 365951 368534 371036 373635 375721 376449 375943 375099 374559 374563 375360 377015 379154 381456
57941 381456 384044 387018 390161 393614 398156 404189 411061 418007 425201 433152 441505 449111 454900 458225
57927 458225 458839 457105 453726 448804 441706 432350 421886 411491 401164 390512 380073 370896 363251
57914 363251 356621 350687 345504 340976 336951 333661 331384 329876 328783 328400 329268 331125 332911 333762 333470
57899 333470 332130 329929 327299 324747 322492 320522 318881 317599 316537 315647 315143 315060 314960 314472 313804 313258
57883 313258 312486 310878 308533 306243 304456 302714 300201 296605 292359 288193 284419 280618 276169 271118
57869 271118 266286 262464 259860 258370 257887 258071 258314 258352 258628 259705 261623 264117 267137 270804 275120 280020
57853 280020 285467 291196 296629 301287 305102 308124 310200 311107 310759 309233 306884 304365 302050 299433 295772
57838 295772 291356 287402 284513 282044 279338 276795 275290 275319 277237 281482 287861 295186 302296 308846 314516
57823 314516 318231 319155 318032 316533 315447 314265 312318 309526 306090 302166 297875 293144 287631 281201
57809 281201 274343 267746 261709 256284 251617 247686 244111 240747 238045 236298 234937 233224 231289 229796
57795 229796 228898 228289 228015 228456 229583 230934 232320 234029 236405 239631 243728 248354 252922 257403 262575
57780 262575 268860 275377 280980 285842 291062 296921 302556 307272 311096 313877 314881 313705 310828 306837
57766 306837 301671 295034 287068 278308 269297 260444 251931 243584 235246 227387 220910 216087 212016 207456
57752 207456 202057 196629 192287 189454 187610 185964 184297 182922 181875 180627 178865 177098 175996 175449
57738 175449 174789 173723 172549 171639 171181 171243 171545 171380 170389 169351 169590 171536 174297 176586 177674 177636 177235
57721 177235 177514 178919 180764 181995 182388 182553 182952 183579 184493 185874 187377 188091 187481 185983 184521 183801
57705 183801 184129 185421 187180 188850 190379 192281 195098 198966 203494 207729 210419 210871 209545 207482 205211
57690 205211 202580 199469 196104 192804 189938 188117 187935 189534 192788 197656 203885 210748 217943 226630
57676 226630 238748 255272 275917 300561 330028 365229 406397 453501 506591 564929 625786
57665 625786 683975 732110 761787 766316 743980 699046 639518 573800 508707 448889 396777 352928
57653 352928 316817 287413 263427 243777 228123 216427 207830 200606 193540 186778 181022 176502 173100
57640 173100 170807 169424 168211 166430 164056 161606 159550 158147 157444 157035 156161 154463 152323 150142 147693
57625 147693 144603 141177 138241 136382 135658 135768 136098 135928 135077 134252 134345 135530 137280 139021 140374 141029
57609 141029 140887 140276 139646 139107 138461 137583 136473 135073 133347 131455 129650 128108 127084 126984 127947 129474
57593 129474 130786 131492 131703 131602 131195 130470 129600 128966 129016 129935 131352 132521 132935 132679 132125 131496 130825 130130
57575 130130 129487 129082 129195 129840 130481 130491 129953 129525 129398 128993 127969 126904 126430 126202 125418 124094 123097 122936
57557 122936 123133 122894 121988 120887 120327 120810 122250 124075 125808 127443 129055 130253 130440 129555 128187 126928
57541 126928 125922 125078 124379 123812 123255 122611 121967 121495 121271 121233 121246 121158 120829 120157 119163 118128 117596 118041 119435
57522 119435 121202 122655 123444 123595 123253 122463 121180 119598 118502 119009 121563 125307 128808 131353 133148
57507 133148 134416 134989 134917 134764 134966 135379 135848 136605 137615 138027 137072 135235 133830 133387 133192 132530 131803 131978
57489 131978 133225 134598 135142 135065 135532 137237 139487 140946 141109 140609 140215 140126 140347 141084 142288 143320 143582
57472 143582 143192 142612 141933 141037 140184 139850 140015 140156 139960 139644 139496 139484 139470 139559 140077 141232 142762 143923 144084
57453 144084 143474 143071 143556 144594 145384 145586 145398 145026 144538 144069 143771 143674 143905 144817 146464 148141 148971 148885
57435 148885 148533 148308 147976 147336 146729 146709 147506 148984 150836 152703 154320 155601 156520 156956 156834 156296 155582
57418 155582 154858 154361 154457 155225 156153 156670 156828 157065 157459 157661 157522 157277 157150 157232 157720 158788 160071 160753 160343
57399 160343 159112 157714 156730 156544 157184 158141 158774 159061 159561 160466 161138 160944 160269 160320 161959 164911 168077
57382 168077 170448 171833 172773 173874 175309 176938 178552 179724 179774 178401 176302 174642 173883 173527 173001 172225
57366 172225 171244 169916 168352 167161 166844 167192 167692 168333 169601 171714 174177 176206 177468 178327 179404 180996
57350 180996 183028 185488 188478 191628 193945 194814 194932 195536 196754 197498 197153 196566 196899 198135 199381 200194
57334 200194 200866 201561 201904 201522 200566 199491 198653 198182 197992 197775 197194 196222 195190 194402 193839 193328 192936 193016
57316 193016 193795 195022 196145 196769 196810 196279 195221 193995 193215 193150 193398 193490 193553 193968 194611 194994 195032 195114 195416
57297 195416 195737 196122 196975 198334 199640 200541 201406 202638 203979 204960 205676 206594 207835 209111 210189 210969
57281 210969 211238 210783 209716 208354 206811 204961 202712 200093 197218 194342 191838 189855 188210 186836 186082
57266 186082 186266 187116 188026 188734 189441 190479 192183 194816 198112 201052 202679 203210 203867 205561 208111 210764
57250 210764 213022 214865 216622 218821 221729 224819 227023 227801 227738 227855 228622 229854 231326 233061 235056
57235 235056 237063 238771 240128 241431 243100 245337 248047 251110 254664 258792 262928 265948 267171 267178 267345
57220 267345 268635 271088 274392 278455 283147 287776 291411 293819 295791 298349 301928 306564 312526 320183
57206 320183 329221 338551 347264 355312 363019 370376 377258 383986 391087 398590 406172 413961 422581 432186
57192 432186 442050 451482 460721 470447 480671 490673 500001 509043 518466 528394 538357 547903 557090 566422
57178 566422 576411 587218 598734 610884 623707 637101 650726 664392 678373 693024 708142 723088
57166 723088 737604 752103 766931 781734 795981 809906 824410 840023 856441 873212 890412
57155 890412 908322 926775 945203 963222 980816 998054 1015003 1031957 1049437 1067807 1087033
57144 1087033 1106826 1126827 1146661 1166092 1185225 1204424 1223961 1243878 1264145 1284707 1305359
57133 1305359 1325848 1346182 1366603 1387169 1407663 1427992 1448344 1468776 1489047 1509217 1530196
57122 1530196 1553409 1580059 1610930 1646490 1686689 1730837 1778283 1829195 1884280 1943730 2007041
57111 2007041 2074043 2145809 2224519 2312946 2414311 2532123 2669768 2830464 3017935 3237018
57101 3237018 3493519 3793986 4146030 4558563 5040874 5600953 6244317 6973927 7790842
57092 7790842 8695166 9686547 10763268 11920022 13146165 14425689 15737648 17055520
57084 17055520 18346638 19573470 20695550 21670055 22454063 23014135 23340696 23453505 23387855
57075 23387855 23169662 22800261 22262407 21538895 20627297 19543495 18317995 16990441 15604105
57066 15604105 14200954 12818661 11489651 10240303 9089486 8047745 7118245 6298595
57058 6298595 5582388 4960501 4422544 3958084 3557267 3211236 2912505 2654829 2432559
57049 2432559 2240327 2073444 1928177 1801354 1689954 1591417 1504036 1426587 1357531 1294895
57039 1294895 1236941 1182772 1132308 1085818 1043408 1004786 969461 937127 907759 881335 857663
57028 857663 836500 817545 800139 783317 766461 749737 733619 718156 703026 688148 673823
57017 673823 660288 647478 635261 623572 612224 600894 589448 578065 566905 555809 544462
57006 544462 532680 520430 507719 494649 481514 468673 456394 444890 434389 424993 416569 408986
56994 408986 402393 397010 392663 388858 385437 382840 381480 381220 381816 383581 386976 391588 396158 399756 402256
56979 402256 403292 401504 395599 385872 373991 361444 348863 336748 325936 317100 310338 305523 302551
56966 302551 301098 300702 301410 303877 308497 314980 323216 333990 348162 365319 383757 401562 417106
56953 417106 428595 433995 431950 422761 408344 391271 373694 356878 341508 328236 317749 310321
56941 310321 305578 302883 301821 302333 304778 309969 318707 330953 345838 362726 381788 402987 424845
56928 424845 444750 460205 469230 470044 461562 444659 422267 397706 373041 349134 326720 306877
56916 306877 290509 277755 268000 260391 254257 249119 244592 240565 237420 235651 235070 234701 233658 231852
56902 231852 229746 227869 226853 227276 228949 230783 232029 233216 235127 237331 238776 239622 241303 244633 249006
56887 249006 253804 259466 266445 273919 280244 284108 284553 280545 271550 258438 243116 227390 212691
56874 212691 200628 192893 190342 192634 198950 208793 222028 238623 258582 281972 308814 339114
56862 339114 373079 411193 453796 500372 549006 596288 637694 668306 683828 681924 663431 632447
56850 632447 594845 556173 520469 490225 466689 450127 440398 437613 442109 453901 472591 497925
56838 497925 530042 569199 615757 670487 733942 804900 879617 952647 1017636 1067032 1092518
56827 1092518 1087950 1053009 993944 920684 842988 768165 700548 642069 593380 554753 526120
56816 526120 506772 495689 492348 496847 509312 529621 557694 593460 636282 684668 736504 788905
56804 788905 837374 875526 896487 895316 870992 826928 769879 707530 646024 588973 538193 494697
56792 494697 458783 429914 407370 391077 381330 377705 378887 383914 393176 407697 427566 451468
56780 451468 477630 504506 530087 550927 562621 561732 547451 521666 487849 449829 410999 373893
56768 373893 340054 310169 284354 262425 244080 228960 216612 206547 198449 192150 187171 182476
56756 182476 177116 171175 165647 161222 157569 154048 150678 147987 146103 144503 142619 140325 137787 135198
56742 135198 132816 131102 130599 131516 133323 134838 135044 133993 132686 131873 131249 130123 128573 127444 127321 127982
56726 127982 128866 129692 130488 131417 132722 134575 136731 138551 139527 139666 139343 138986 138992 139593 140550 141169 140956 140235
56708 140235 139839 140152 140717 140910 140745 140780 141329 142080 142589 142837 143125 143631 144335 145197 146055 146430 145909 144804 144021
56689 144021 144058 144466 144481 143888 142998 142094 141275 140655 140342 140345 140729 141733 143450 145562 147627 149442 150852 151479
56671 151479 151098 150066 148963 147941 146919 146256 146526 147570 148439 148543 148361 148702 149676 150742 151470 151894 152276
56654 152276 152851 153707 154691 155516 156029 156346 156667 157110 157710 158374 158835 158980 159231 160183 161716 162884 162915 161971
56636 161971 160606 158950 156918 154940 153795 153688 154080 154558 155456 157288 159898 162433 164103 164771 164864 164921
56620 164921 165206 165674 166201 166746 167287 167721 167953 167979 167708 166878 165436 163967 163289 163510 163827 163514 162754 162140
56602 162140 161670 160790 159314 157702 156317 155021 153738 152914 152945 153508 153925 153961 153866 153843 153953 154331 154950 155265
56584 155265 154695 153464 152403 151886 151605 151461 151926 153159 154470 155238 155832 157010 158786 160495 161760 162771
56568 162771 163801 165066 166982 169976 174006 178730 184127 190461 197642 205133 212581 220039 227377 233914
56554 233914 238922 242217 244096 244937 245076 244830 244404 243872 243283 242630 241685 240156 238108 236016 234192 232335
56538 232335 229841 226515 222889 219832 217886 216845 215905 214296 211827 208888 205980 203324 200842 198409
56524 198409 196057 193942 192115 190408 188644 186843 185072 183232 181322 179825 179334 179747 180232 180114 179343
56509 179343 178067 176436 175071 174944 176219 177778 178527 178659 179005 179730 180452 181145 181907 182199 181400 179989 179092
56492 179092 178830 178199 176684 174985 173830 173100 172559 172558 173394 174630 175555 175859 175482 174359 172777 171515 171225
56475 171225 171975 173562 175692 177706 178848 179208 179760 180995 182190 182569 182554 183122 184354 185426 185812 185783 185758
56458 185758 185770 185667 185479 185429 185698 186189 186583 186788 187221 188275 189583 190342 190400 190434 190906 191508 191837 191924 191782 191150
56438 191150 190102 189272 188985 188746 188074 187236 186672 186335 186158 186495 187393 188074 187942 187599 187966 188861 189367 189275 189204
56419 189204 189449 189647 189578 189513 189690 190054 190531 191038 191307 191208 191093 191346 191750 191808 191429 190835 190125 189552 189812 191337
56399 191337 193624 196051 198969 202983 207433 210752 212330 212997 213547 213855 213722 213624 214180 215513 217420 219521
56383 219521 221099 221574 221354 221441 221964 221961 220933 219685 219099 218949 218692 218736 219993 222485 225168 226977 227510 226884
56365 226884 225558 224288 223715 223843 224160 224266 224215 224325 224861 225890 227216 228497 229495 230205 230743 231189 231516
56348 231516 231530 230968 229901 229000 229092 230334 232026 233275 233684 233511 233427 234081 235595 237465 239154 240662 242216
56331 242216 243664 244703 245640 247218 249599 252111 254263 256421 259122 262117 264567 265952 266409 266314 265883
56316 265883 265183 264357 263746 263756 264515 265628 266462 266715 266696 267132 268723 271631 275144 278009 279513 280273 281708
56299 281708 284677 288667 292209 294003 293930 293220 293388 294831 296687 298149 299290 300414 301393 302316 304049 307185
56283 307185 310935 314080 316657 319586 322956 325931 328378 331224 334976 339028 342808 346523 350394 354215
56269 354215 358142 362901 368654 374585 380263 386492 394161 403073 412676 423112 434672 446930 459464
56256 459464 472976 488701 506995 527395 549816 574795 602644 633164 666186 701677 739270
56245 739270 778348 818673 860411 903360 946561 988779 1029014 1066411 1099972 1128618 1151536
56234 1151536 1168394 1179109 1183347 1180431 1170174 1153704 1132990 1109389 1083064 1053875 1022264 988990
56222 988990 954572 919497 884620 850919 819090 789597 762667 737809 713786 689698 665994
56211 665994 644016 624656 607753 592571 578478 565230 552993 542129 532837 524965 518147 511948
56199 511948 505956 500102 494866 490764 487606 484718 481974 480023 479311 479428 479670 479744 479693 479708 480360 482338 485504
56182 485504 488716 491075 492920 495080 497588 499724 501081 502051 503413 505845 509625 514467 519770 525291
56168 525291 531329 538053 545037 551793 558417 565341 572762 580695 589387 599254 610526 623217 637327
56155 637327 652926 670151 689179 710105 732949 758098 786548 819352 857030 900108 950027
56144 950027 1008701 1077192 1155504 1243571 1341385 1447985 1561178 1678296 1796130 1909962
56134 1909962 2014068 2104264 2179631 2241874 2294136 2340556 2385041 2428828 2469475 2502672 2524362
56123 2524362 2531245 2521295 2495477 2458202 2414640 2367491 2316417 2259271 2192857 2113803 2020594 1915016
56111 1915016 1801169 1683758 1567823 1458678 1360385 1274437 1200816 1139592 1090441 1051454
56101 1051454 1019995 994601 974948 960333 949380 941042 934854 930363 927196 925453 925227 926075 927717
56088 927717 930721 935551 941379 946836 951591 956259 961134 965978 970751 975676 980839 986427 992966 1000658
56074 1000658 1008952 1017391 1026286 1035908 1045870 1056038 1067117 1079432 1092102 1104471 1117386 1131906
56062 1131906 1147697 1163879 1180503 1197877 1215472 1232980 1251518 1272156 1293993 1315134 1334875
56051 1334875 1353553 1371268 1388382 1406250 1425630 1445219 1463589 1481671 1501328 1522386 1543343
56040 1543343 1564330 1587056 1612212 1639158 1667778 1698444 1730479 1762824 1795966 1831084 1867730
56029 1867730 1904552 1941928 1981497 2023338 2066007 2109119 2153493 2198935 2244516 2290986 2340341
56018 2340341 2392858 2447053 2502627 2560847 2621898 2684543 2748880 2816779 2889065 2964637 3042885
56007 3042885 3124724 3210727 3300459 3394060 3492535 3596269 3705251 3820540 3943297 4072704
55997 4072704 4207365 4348367 4498250 4657442 4824808 5001278 5189605 5390785 5604258
55988 5604258 5831470 6075478 6337144 6615724 6913364 7234880 7582893 7957471 8360898
55979 8360898 8798336 9273422 9788148 10347794 10961140 11634932 12373376 13184336 14081183
55970 14081183 15077895 16188380 17432470 18837402 20432766 22251174 24336858 26748647
55962 26748647 29554170 32829337 36666995 41180817 46501400 52779993 60200967 68981548
55954 68981548 79353020 91547144 105800892 122362209 141484140 163410130 188321486
55947 188321486 216178138 246428016 277672973 307460105 332387409 348684250 353262012
55940 353262012 344871261 324710176 296023933 262901933 229016202 196932061 168061809
55933 168061809 142940847 121541776 103536626 88491817 75973335 65575651 56929968
55926 56929968 49719967 43686993 38616685 34328966 30680346 27561033 24881048 22562555
55918 22562555 20544044 18780407 17233353 15866589 14651270 13568398 12602368 11736940
55910 11736940 10958770 10258785 9627536 9053681 8528649 8048262 7608299 7202700 6827092
55901 6827092 6479566 6156719 5853256 5566683 5298243 5047979 4812960 4591478 4384735
55892 4384735 4192753 4012533 3841962 3681971 3533061 3393069 3260145 3134901 3017877
55883 3017877 2907689 2803292 2705457 2614445 2528616 2446754 2369410 2296663 2226853 2158694 2092367
55872 2092367 2027468 1962368 1896923 1833542 1774216 1718576 1666020 1617432 1573332 1532377 1493219
55861 1493219 1456086 1421158 1387148 1352918 1319057 1286588 1255509 1225727 1198014 1172850 1149528
55850 1149528 1127336 1106359 1086289 1065794 1043952 1021128 997751 973628 949185 925905 904641
55839 904641 884751 865619 847738 831562 816582 802271 788714 775679 762382 748763 735725
55828 735725 723571 711612 699881 689628 681370 673856 665750 656923 647398 636570 624428 612196
55816 612196 600771 589732 578679 568246 558868 549834 540578 531818 524535 518842 514610 512059 510944
55803 510944 510330 509980 510850 513462 516961 520550 524588 529366 534052 537827 540937 543701 545696 546920 548546
55788 548546 551315 554121 555264 554117 550597 544059 533982 521016 506311 490585 474747 460507 449223
55775 449223 440832 434847 431584 431403 433442 436064 437829 437249 432621 423396 411116 398084 385669 374630
55761 374630 365981 360225 356451 353394 350896 349295 348044 346091 343148 339497 335040 329601 323782 318434
55747 318434 313622 308944 304478 300603 297324 294637 292946 292225 291310 289053 285659 281945 277878 273024 267991
55732 267991 264121 261880 260591 259626 258858 258046 256705 254641 251890 248240 243506 238152 232993 228469 224755
55717 224755 222223 221128 221070 221468 222377 224278 227302 231083 234914 237689 238338 237027 235311 234429 234074 233489
55701 233489 232875 232677 232210 230255 226593 221844 216249 209818 203258 197441 192138 186594 181271 177734 176653
55686 176653 177027 177577 177946 178369 179115 180531 182838 185663 188395 191065 194149 197461 199991 201040 200863 200101
55670 200101 199132 198059 196746 194839 192218 189439 187247 185793 184857 184548 185083 186020 186527 186416 186272 186624
55654 186624 187603 189291 191632 194042 195850 197200 198888 201316 204181 207054 209597 211259 211508 210379 208245
55639 208245 205130 200932 196091 191290 186510 181176 175174 168969 162839 156870 151657 148005 145809 144173
55625 144173 142831 142485 143410 144653 145147 144896 144536 144251 143657 142400 140465 138102 135658 133213 130396 126943
55609 126943 123424 120819 119311 118041 116233 114029 112077 110838 110511 111116 112344 113637 114591 115065 114976 114407
55593 114407 113786 113466 113274 113068 113543 115578 118729 121338 122421 122663 123175 124143 125266 126864 129746 134251
55577 134251 140004 146503 153521 161083 169333 178290 187479 195859 202212 205615 205772 203251 199249 194659
55563 194659 189380 182986 175901 169217 163343 157609 151458 145259 139580 134296 129003 123880 119560 116385
55549 116385 114189 112613 111264 109729 107800 105608 103410 101414 99947 99537 100456 102211 103677 103858 102685
55534 102685 101158 100600 101536 103365 105188 106684 107886 108598 108654 108531 108953 109845 110316 109716 108178 106070 103595
55517 103595 101040 98740 96547 93925 90844 88048 86141 84887 83689 82350 81055 80006 79316 78922 78447
55502 78447 77564 76623 76440 77256 78381 79066 79165 78783 77899 76786 76248 76871 78374 80083 81742 83418 84953
55485 84953 86016 86557 86838 87101 87511 88284 89545 91056 92240 92514 91640 89919 88009 86378 84988 83684
55469 83684 82616 81869 80873 78878 76024 73354 71728 71251 71757 73119 74861 76207 76826 77023 77005 76564 75694
55452 75694 74835 74248 73800 73578 73937 74609 74751 74363 74696 76446 78369 78723 77478 76083 75489 75505 75841 76610
55434 76610 77720 78752 79661 80873 82469 83904 84715 85001 85033 84870 84536 84203 84014 83961 83977 83977 83884 83926 84717 86625
55414 86625 89138 91309 92763 93810 94556 94478 93069 90478 87346 84347 82048 80806 80450 80286 79756 79047
55398 79047 78800 79238 79841 79984 79718 79694 80352 81493 82739 84037 85339 86126 85880 85011 84610 85107 85710 85492
55380 85492 84454 83177 81961 80890 80298 80409 80685 80201 78760 77109 75988 75379 74816 74060 73266 72685 72372
55363 72372 72176 72010 72051 72486 73014 72969 72101 70959 70233 70002 69906 69810 69873 70129 70431 70751 71192 71723 72144 72289
55343 72289 72124 71763 71566 71982 73008 73968 74130 73398 72191 70899 69793 69150 68950 68602 67526 66029 65128
55326 65128 65474 66837 68677 70722 72824 74606 75591 75554 74652 73345 72221 71670 71585 71480 71009 70389 70248
55309 70248 71047 72522 73720 73770 72733 71546 71064 71348 71958 72590 73166 73604 73904 74315 75022 75719 75817 75134
55291 75134 74100 73254 72793 72690 73048 74083 75687 77132 77484 76500 74953 73809 73254 72881 72650 73016 74051
55274 74051 75137 75820 76391 77251 78239 79060 79868 80846 81556 81362 80309 79071 78127 77410 76639 75630 74480
55257 74480 73729 74070 75494 77006 77582 77139 76258 75418 74952 75239 76217 77113 77343 77348 77767 78151 77470 75726 74048
55238 74048 73196 72861 72543 72234 72053 72034 72478 73740 75468 76802 77503 78073 78502 77859 75664 72887 70999
55221 70999 70503 70921 71612 72087 72042 71726 71903 72882 73962 74343 74215 74311 74786 75223 75541 76089 76813 77040 76318
55202 76318 75045 74052 73858 74448 75474 76477 77091 77250 77197 77252 77540 77902 78036 77752 77108 76286 75429 74750 74676
55183 74676 75501 76823 77673 77406 76291 75066 74178 73635 73368 73364 73528 73686 73779 73894 74134 74552 75247 76348 77846
55164 77846 79448 80688 81341 81726 82447 83668 84798 85144 84716 84092 83615 83062 82131 80838 79388 78023 77136
55147 77136 77154 78058 79254 80139 80619 80950 81321 81786 82339 82815 82874 82328 81418 80585 80049 79797 79851 80332 81157 81882
55127 81882 81978 81329 80424 79948 80160 80757 81351 81889 82526 83355 84411 85684 86850 87277 86650 85427 84324 83524
55109 83524 82782 82115 81841 82025 82400 82874 83614 84629 85742 86954 88316 89399 89514 88629 87518 86850 86651
55092 86651 86767 87204 87756 87945 87746 87782 88396 89072 89249 89188 89427 89837 89887 89574 89387 89427 89220 88454 87401 86546
55072 86546 86133 86171 86535 87000 87353 87567 87767 88095 88598 89127 89278 88732 87762 87147 87307 87769 87682 86687 85140
55053 85140 83749 83169 83613 84612 85403 85752 86071 86596 86981 87015 87152 87767 88362 88234 87618 87401 87852 88447 88940
55034 88940 89778 91174 92447 92740 92026 91015 90250 89587 88516 86853 85106 84149 84402 85389 86238 86560 86646
55017 86646 86854 87071 86875 86100 85148 84748 85276 86306 87038 87239 87484 88310 89489 90432 90965 91260 91309 91026 90702
54998 90702 90757 91087 91204 91097 91309 91975 92361 91782 90620 90050 90874 92881 95223 97077 97995 97907 97030 95793
54980 95793 94698 94078 93981 94408 95618 97850 100627 102761 103443 103073 102603 102323 101880 101299 101217 101880 102627 102814
54962 102814 102790 103348 104410 104875 103976 102343 101383 101700 102447 102365 101226 99980 99607 100222 101339 102505 103367
54945 103367 103531 102936 102248 102328 103249 104204 104410 103792 102783 101852 101326 101319 101682 102242 103160 104710 106690 108395
54927 108395 109396 109989 110706 111666 112704 113912 115734 118582 122532 127302 132412 137531 142849 148922 155910
54912 155910 163002 168815 172322 173279 171919 168570 163612 157548 150905 144116 137630 132028 127774 124703
54898 124703 121916 118426 114046 109590 106160 104355 104107 104981 106350 107472 107851 107654 107581 108141 109149 110093
54882 110093 110910 112201 114586 118003 121789 125475 129199 133246 137513 141837 146613 152411 158814 164254
54868 164254 167432 168511 168495 167775 165863 162349 157496 151799 145508 138845 132375 126857 122772 120021 118054
54853 118054 116330 114716 113336 112011 110227 107860 105586 104146 103486 103021 102446 101731 100602 98871 97230
54838 97230 96869 97966 99231 99360 98472 97721 97884 98727 99456 99429 98619 97748 97755 98837 100128 100566 99908 98770
54820 98770 97919 97827 98691 100443 102645 104590 105629 105491 104387 102860 101361 99957 98603 97617 97550 98506 99930
54803 99930 101208 102162 102788 102933 102576 102184 102387 103328 104568 105558 106026 105993 105622 105007 104053 102674 101143 100102
54785 100102 100047 100969 102457 103965 104982 105341 105500 106139 107304 108315 108773 109266 110741 113473 117013 120851
54769 120851 124707 128459 132257 136572 141683 147229 152677 158020 163537 168986 173650 177184 179853 181803
54755 181803 182573 181567 178663 174223 168832 163202 157951 153174 148407 143225 137762 132539 128011 124451
54741 124451 122074 120952 120805 120965 120717 119755 118444 117500 117255 117290 117031 116611 116783 117949 119644 121082 121941
54724 121941 122511 123397 125298 128700 133484 138988 144724 150812 157397 163884 169139 172433 173793 173486 171621
54709 171621 168298 163781 158297 152010 145381 139255 134266 130326 127026 124280 122188 120435 118443 116237
54695 116237 114604 114036 113920 113251 111951 110961 111009 111757 112248 111839 110488 108504 106322 104441 103270 102951 103343
54678 103343 104060 104643 104930 105354 106534 108328 109610 109304 107483 105120 102961 101116 99606 98651 98248 97995
54662 97995 97701 97756 98458 99313 99571 99328 99481 100483 101717 102406 102659 103181 104198 105197 105699 105802 105862 105998 106095
54643 106095 106005 105586 104803 103993 103753 104327 105288 106074 106584 106908 106779 105894 104714 104271 104930 105868 106082 105545 104965
54624 104965 104744 104663 104470 104255 104209 104388 104760 105226 105566 105667 105824 106467 107449 107990 107594 106804 106690 107651 108968
54605 108968 109561 108971 107616 106340 105874 106516 108060 109895 111286 111720 111157 110072 109220 109154 109816 110669 111269
54588 111269 111668 112128 112602 112710 112197 111201 110051 109047 108448 108372 108553 108509 108172 108095 108770 110032 111438 112958
54570 112958 114712 116251 116803 116374 115922 116188 116865 117259 117283 117308 117413 117407 117403 117699 118092 117865 116705 115225 114348
54551 114348 114382 114909 115399 115700 116004 116554 117415 118446 119469 120439 121405 122343 123134 123729 124247 124853 125619 126546
54533 126546 127619 128711 129446 129376 128511 127596 127547 128496 129558 129815 129322 128855 128805 128796 128485 128217 128519 129244 129605
54514 129605 128991 127521 125888 124857 124762 125263 125667 125651 125514 125554 125489 124844 123770 122997 122976 123415 123689 123362 122296
54495 122296 120694 119222 118725 119511 121080 122715 124158 125499 126658 127296 127232 126719 126292 126427 127290 128664
54479 128664 130108 131337 132474 133837 135468 136978 137943 138397 138800 139495 140285 140680 140490 140051 139859 140188 141104
54462 141104 142600 144459 146138 147054 146979 146031 144479 142831 141920 142312 143477 143997 142963 140900 139025 137870
54446 137870 137056 136243 135660 135517 135376 134596 133244 132158 132063 132831 133704 133980 133380 131996 130228 128698 127951
54429 127951 128042 128573 129161 129766 130563 131654 133011 134505 135885 136878 137477 137927 138230 137889 136497 134536 133137
54412 133137 132888 133234 133257 132797 132459 132684 133224 133654 134034 134787 136035 137376 138376 139042 139659 140283 140661 140676
54394 140676 140584 140654 140737 140473 139890 139505 139671 139973 139546 138024 136012 134522 134047 134288 134678 134918 135014 135092 135361
54375 135361 136085 137312 138718 139940 141009 142195 143521 144709 145624 146415 147192 147937 148823 150120 151561 152230
54359 152230 151538 150013 148640 147701 146792 145842 145327 145315 144995 143662 141770 140410 139855 139160 137413 134970 133048
54342 133048 132270 132068 131700 131412 132075 133839 135750 136904 137437 138006 138710 139165 139429 140182 141834 143971 145919
54325 145919 147450 148650 149379 149230 147995 145935 143622 141594 140075 138886 137619 136029 134299 132918 132293
54310 132293 132433 132970 133468 133733 133846 133995 134389 135287 136760 138358 139279 139170 138532 138034 137634 136749 135218 133672
54292 133672 132852 132868 133201 133205 132629 131892 131818 132812 134291 135213 135150 134473 133614 132694 132023 132284 133712 135453 136277
54273 136277 135876 135118 135064 136027 137520 138795 139307 138878 137681 136188 135098 135020 135934 137072 137674 137922 138735
54256 138735 140498 142390 143277 143021 142545 142698 143358 143670 143036 141780 140836 140694 140766 140032 138289 136339 134959
54239 134959 134152 133628 133440 133647 133760 133176 132026 131017 130456 129936 129068 128051 127384 127371 128025 129101 130026 130132
54221 130132 129226 127832 126705 126247 126473 127283 128509 129817 130896 131782 132821 134159 135396 135898 135499 134768
54205 134768 134480 134823 135216 134891 133582 131733 130178 129619 130178 131323 132418 133334 134373 135596 136560 136915
54189 136915 136871 136823 136798 136628 136439 136497 136708 136688 136290 135646 134738 133356 131564 129783 128263 126815 125176 123335
54171 123335 121434 119696 118544 118275 118446 118113 117039 116168 116414 117402 118068 118178 118415 119063 119531 119469 119501 120250
54153 120250 121218 121356 120492 119538 119369 120091 121384 122909 124196 124731 124506 124149 124197 124522 124755 124961 125476 126336
54135 126336 127280 128192 129091 129768 129937 129741 129661 129860 130046 130048 130051 130107 129924 129431 129141 129556 130553 131695 132790 133697
54115 133697 133973 133346 132353 131827 131818 131684 131298 131380 132283 133152 132867 131484 130170 129823 130288 130839 130946 130443 129390
54096 129390 128097 127118 126937 127550 128426 128912 128743 128185 127669 127334 127018 126752 126980 128126 130063 132236 134152
54079 134152 135475 135846 135163 134129 133842 134518 135059 134400 132947 132058 132310 133008 133417 133642 133989 134226 134069 133850
54061 133850 134027 134296 133923 132802 131574 130740 130355 130548 131612 133382 135139 136436 137449 138279 138500 137917
54045 137917 137208 137228 138039 139243 140975 143760 147415 150856 153227 154772 156347 158411 160707 162656 163821
54030 163821 164179 164126 164181 164597 165317 166165 166937 167477 168024 169408 172362 176574 180867 184561 188258 192964 198787
54013 198787 204925 210635 215575 219256 220808 219635 215971 210527 203844 196321 188633 181635 175711 170545
53999 170545 165691 161172 157341 154411 152363 151160 150734 150793 150969 151151 151411 151586 151306 150568 149889 149677 149788
53982 149788 149919 150097 150353 150267 149351 147785 146205 144795 143200 141457 140385 140674 141989 143398 144438 145312
53966 145312 146162 146696 146657 146367 146555 147714 149683 151792 153410 154394 155054 155668 156132 156147 155700 155241 155366 156331
53948 156331 157848 159298 160239 160826 161738 163549 166198 169127 171938 174744 177883 181495 185488 189751 194174
53933 194174 198476 202211 204978 206583 207051 206633 205721 204524 202834 200391 197506 195017 193458 192527 191606
53918 191606 190529 189574 188906 188436 188113 187953 187784 187293 186315 184807 182675 180031 177555 176052 175534 175192 174447
53901 174447 173632 173436 174009 174828 175108 174239 172184 169685 167687 166371 165092 163365 161405 159544 157820 156505
53885 156505 156353 157661 159586 161056 161979 162915 163986 164854 165396 165604 165115 163766 162438 162343 163488 164794
53869 164794 165776 167079 169164 171545 173835 176590 180458 185182 190185 195697 202606 211508 222391 234991
53855 234991 248936 263757 279031 294173 307702 317144 320403 317278 309411 298923 287304 275243
53843 275243 262937 250570 238689 228000 218652 210120 202066 194934 189276 184869 181003 177367 174057
53830 174057 170974 167888 165052 163120 162301 162081 161861 161482 161001 160440 159918 159689 159806 160064 160459 161423 163261
53813 163261 165503 167142 167598 167290 167145 167634 168459 169176 169882 170991 172494 173828 174590 174973 175285 175409 175095
53796 175095 174578 174539 175475 177308 179540 181548 182855 183358 183267 182753 181816 180631 179716 179483 179787 180170 180306 179991
53778 179991 179073 177814 177004 177135 177639 177440 176204 174505 172909 171540 170495 169953 169665 169030 168035 167567 168356
53761 168356 169968 171298 171753 171539 171045 170430 169759 169080 168293 167285 166292 165889 166438 167644 168818 169574 170162
53744 170162 171023 172120 172968 173398 173950 175154 176607 177255 176689 175730 175530 176421 177862 179256 180482 181750
53728 181750 183231 184855 186367 187606 188787 190374 192528 194864 196909 198712 200745 203270 205998 208391
53714 208391 210152 211399 212492 213756 215253 216832 218417 220205 222453 225127 227926 230665 233428 236243
53700 236243 238832 240963 242924 245278 248111 250940 253507 256217 259405 262524 264768 266330 268242 270748
53686 270748 272602 272511 270699 268446 266531 264851 263340 262334 261915 261578 260825 259633 258155 256438 254706
53671 254706 253519 253272 253781 254600 255486 256321 256914 257204 257402 257589 257343 256181 254272 252326 250735 249219 247431
53654 247431 245681 244782 245248 246796 248618 250068 251045 251875 252953 254441 256088 257320 257665 257265 256772 256631
53638 256631 256653 256542 256575 257370 259081 261225 263334 265390 267610 270157 273137 276486 279769 282480 284661 286873
53622 286873 289446 292208 295076 298329 301969 305370 308105 310694 313960 317902 321851 325561 329481 333964
53608 333964 338790 343554 348017 351914 354954 357223 359191 361067 362472 362997 362773 362256 361755 361424 361460 361885
53592 361885 362265 362044 361158 360028 358975 357913 356691 355416 354242 353024 351455 349485 347360 345225 342927
53577 342927 340421 338221 337160 337608 339056 340585 341680 342499 343520 345124 347486 350610 354293 358161 361944
53562 361944 365719 369705 373697 376818 378070 377213 374934 372121 369181 366310 364047 363032 363143 363409 363095
53547 363095 362495 362395 363100 364493 366766 370446 375576 381446 387419 393577 400257 407267 414075 420654 427748
53532 427748 436184 446166 457243 468738 480200 491699 503825 517214 531936 547489 563497 580162
53520 580162 597842 616404 635393 654773 675118 696941 720167 744401 769447 795368 822215
53509 822215 849876 878015 905969 932973 958802 984043 1009433 1035071 1060603 1085959 1111381
53498 1111381 1136753 1161417 1184878 1207245 1228852 1249785 1270021 1289655 1308770 1327374 1345667
53487 1345667 1364008 1382359 1400185 1417307 1434438 1452260 1470190 1486743 1501089 1513601 1524796
53476 1524796 1534406 1541862 1547151 1550654 1552322 1551485 1547422 1539783 1528504 1513788 1496443 1477961 1459850
53463 1459850 1442667 1425798 1408197 1389161 1368402 1345740 1321182 1295288 1269043 1243203 1218003
53452 1218003 1193553 1170127 1147840 1126446 1105754 1085929 1067017 1048602 1030585 1014052 1000586
53441 1000586 990583 982857 976025 969673 963943 958788 954255 951074 950216 951962 955927 961886 970006 980159
53427 980159 991560 1003374 1015522 1028690 1043732 1061133 1080815 1102267 1124932 1148642 1173665
53416 1173665 1200309 1228528 1257994 1288451 1319970 1352940 1387865 1425092 1464652 1506344 1550039
53405 1550039 1595876 1644117 1694865 1747945 1803001 1859625 1917407 1975974 2035078 2094712 2155097
53394 2155097 2216471 2278729 2341198 2402855 2462862 2520850 2576631 2629726 2679465 2725611 2768710
53383 2768710 2809571 2848403 2884555 2917063 2945345 2969408 2989580 3006081 3018747 3027054 3030372 3028108
53371 3028108 3019468 3003152 2977548 2941535 2895357 2840972 2781591 2720430 2659220 2597712 2534849
53360 2534849 2470510 2405911 2342398 2280447 2220096 2161784 2106077 2052768 2000840 1949377 1898126
53349 1898126 1847149 1796411 1745923 1696034 1647370 1600576 1556106 1514083 1474363 1436983 1402500
53338 1402500 1371580 1344252 1319890 1297989 1278573 1261669 1246745 1232954 1219673 1206553 1193251
53327 1193251 1179509 1165484 1151751 1138892 1127180 1116644 1107341 1099447 1093001 1087635 1082780 1078336
53315 1078336 1074974 1073483 1073960 1075948 1079218 1083940 1090095 1097371 1105889 1116512 1129998 1146177 1164248
53302 1164248 1183578 1203888 1225079 1247340 1271162 1296787 1323800 1351634 1380220 1409744 1439989
53291 1439989 1470371 1500356 1529272 1556091 1580135 1601967 1622736 1642568 1660328 1675102 1687107
53280 1687107 1696798 1703866 1707633 1707937 1705040 1699094 1690243 1678939 1665567 1649842 1631037 1608708 1582966
53267 1582966 1554308 1523584 1491864 1459807 1427286 1393998 1360252 1326652 1293156 1259148 1224515
53256 1224515 1190124 1157070 1125794 1096032 1067209 1038742 1010351 982246 954738 927585 900171
53245 900171 872399 844919 818179 791824 765521 740035 716869 696921 679925 665120 651963
53234 651963 640130 629352 619499 610550 602283 594143 585586 576420 566675 556353 545468 534194 522708
53221 522708 510935 498711 486198 473953 462486 451908 442073 432907 424384 416307 408384 400560 393094
53208 393094 386218 379934 374176 368948 364051 358882 352825 345792 338142 330144 321862 313594 305969 299368
53194 299368 293523 288008 282958 279012 276509 274953 273296 270708 267120 263182 259690 257040 255204 254064
53180 254064 253560 253496 253543 253581 253789 254221 254514 254262 253445 252301 251013 249822 249148 249123 249114 248228 246352 244305 242877
53161 242877 242101 241564 241015 240465 239966 239542 239129 238507 237455 236069 234662 233319 231876 230425 229390 228856
53145 228856 228284 227229 226052 225437 225484 225744 226035 226660 227719 228646 228668 227604 226087 225056 225005 225653 226397 227092
53127 227092 228110 229521 230629 230719 230021 229427 229405 229689 229924 229985 229623 228499 226854 225527 224907 224339 223041
53110 223041 221190 219559 218397 217289 216011 214848 214049 213577 213529 214273 215864 217692 219015 219549 219318 218232
53094 218232 216193 213458 210564 208003 206260 205890 207064 209041 210597 211137 211056 210910 210723 210419 210473 211511
53078 211511 213365 215031 215707 215532 215201 215205 215547 215930 215970 215442 214520 213644 213017 212451 211870 211675 212272 213444 214573
53059 214573 215434 216341 217469 218444 218787 218523 218147 218144 218655 219437 219974 219814 219011 218115 217532 217044 216190 215015 214041
53040 214041 213451 212641 210843 208077 205270 203474 203065 203645 204464 204898 204640 203687 202236 200568 199010 197891
53024 197891 197458 197842 199057 200926 202894 204074 203897 202839 202225 203000 204816 206543 207507 207926 208245 208513
53008 208513 208513 208042 206892 204936 202579 200825 200487 201435 202892 204324 205725 207204 208685 210019 211022 211421
52992 211421 211171 210824 211146 212196 213198 213551 213572 213931 214670 215260 215473 215663 216160 216884 217723 218847 220259 221347
52974 221347 221433 220790 220585 221621 223470 225176 226423 227596 228932 230342 232016 234420 237323 239445 239677
52959 239677 238322 236607 235235 233964 232371 230342 227892 225148 222609 220816 219648 218507 217322 216724
52945 216724 216978 217379 217127 216240 215155 213933 212483 211154 210416 210114 209699 209050 208468 207924 207029 205843 205063
52928 205063 205100 205449 205344 204720 204170 204161 204629 205283 206008 206857 207797 208597 209063 209316 209654 210035 209899 208805 207107
52909 207107 205669 204880 204280 203206 201552 199755 198332 197600 197604 198113 198770 199403 200130 201085 202191 203285 204290
52892 204290 205104 205479 205254 204665 204253 204452 205336 206718 208308 209752 210629 210567 209426 207474 205381 203940 203633
52875 203633 204352 205475 206214 206069 205156 204181 203949 204793 206423 208289 210021 211563 213103 214901 216987 218859
52859 218859 219598 218538 215843 212372 209005 206140 203727 201530 199285 196839 194329 192196 190880 190430 190474
52844 190474 190602 190610 190361 189611 188251 186696 185672 185458 185566 185382 184943 184787 185209 186017 187022 188247 189462
52827 189462 189912 188989 187084 185390 184805 185254 186113 186986 187858 188677 189169 189104 188612 188097 187962 188456 189683 191595
52809 191595 193967 196488 198821 200514 200982 199938 197900 195927 194584 193314 191172 188086 185079 183232
52795 183232 182691 182765 182748 182441 182079 181967 182207 182638 182997 183123 183063 183061 183521 184859 187110 189706 191845 193136 193706
52776 193706 193699 192987 191581 190048 189216 189495 190614 191876 192499 191904 190098 187810 185996 185083 184798 184730 184800 185065
52758 185065 185348 185332 184948 184404 183840 183171 182444 182137 182836 184564 186615 188121 188720 188632 188286 188062 188304 189266
52740 189266 190940 193008 195031 196704 198051 199490 201553 204242 206739 208075 208185 207941 208022 208146 207688 206721
52724 206721 205929 205595 205169 203995 202171 200507 199724 199825 200157 200122 199756 199529 199524 199107 197710 195744 194305 194003
52706 194003 194446 194913 195101 195085 194983 194947 195198 195786 196573 197654 199449 201943 204162 204994 204448 203625 203382 203602
52688 203602 203817 203958 204145 204192 203817 203124 202479 202118 202208 203092 204862 206791 207783 207544 206837 206329 205727 204460
52670 204460 202815 201764 201785 202415 203058 203661 204400 205148 205714 206364 207604 209425 211169 212264 212767 212996 212897
52653 212897 212155 210867 209672 209096 209015 209013 209032 209327 209869 210230 210161 209948 209973 210193 210344 210461 210870 211717 212824 213993
52633 213993 215134 216088 216661 216942 217334 218106 219151 220294 221507 222565 222804 221684 219597 217729 217003 217324
52617 217324 217940 218313 218465 218569 218431 217551 215776 213761 212511 212402 212823 213009 212976 213400 214720 216712 218888
52600 218888 220879 222303 222687 221857 220241 218567 217347 216777 216925 217738 218958 220332 221809 223349 224629
52585 224629 225250 225280 225196 225190 224855 223851 222621 222055 222452 223184 223460 223122 222483 221694 220666 219566 218931 219044 219448
52566 219448 219409 218761 217995 217543 217372 217352 217616 218201 218624 218305 217406 216781 216944 217489 217760 217779 218103 218943 219787 219951
52546 219951 219179 217696 215972 214590 214069 214541 215633 216771 217597 218063 218310 218589 219156 220054 220990 221559 221583
52529 221583 221174 220500 219555 218137 216090 213651 211565 210603 210828 211536 212061 212391 212820 213323 213843 214921 217331
52512 217331 220909 224441 227067 229287 232122 235701 239237 242076 244042 244928 244460 242981 241428 240212 238646
52497 238646 235982 232650 229825 227937 226241 223916 221074 218445 216485 215208 214671 215214 217090 220018 223191
52482 223191 225769 227410 228397 229207 229968 230447 230588 230828 231601 232652 233219 233050 232911 233771 235629 237567 238932
52465 238932 240052 241572 243502 245342 246991 248962 251605 254518 256895 258165 258096 256649 254100 251102 248188
52450 248188 245279 242014 238519 235466 233360 232192 231789 232034 232514 232469 231539 230284 229506 229249 228890 228112 227318
52433 227318 227065 227551 228701 230328 231996 233060 233135 232461 231727 231588 232268 233353 234060 234172 234749 237378 242460
52416 242460 248742 254919 261227 268864 278210 288416 298572 308354 317210 323668 326127 324169 318705 311046
52402 311046 302257 293281 285084 278341 273116 269095 266068 264046 262860 261939 260749 259492 258968 259558 260551
52387 260551 260869 260354 259893 260206 261017 261757 262709 264858 268575 272970 276842 280000 283266 287243 291578 295713
52371 295713 299956 305223 311708 318433 324374 329524 334358 338660 341582 342749 342667 342018 341293 341268 342961 346510
52355 346510 350634 353927 356529 359914 365169 372078 379844 388091 396903 406408 416695 427943 440246
52342 440246 453399 467046 481065 495648 511029 527268 544381 562527 581872 602219 622950
52331 622950 643493 663763 684008 704376 724894 745660 766533 786626 804742 820626 835265
52320 835265 849490 862695 873434 880977 885635 887815 887578 885282 881926 878429 874800 870237 863916 855757
52306 855757 846756 838544 832161 827167 822341 817272 812749 809569 807613 806421 806026 806679 808217 810300 812963
52291 812963 816349 820166 824051 828494 834739 843670 855159 868550 883278 898851 914641 930065 944819
52278 944819 958851 972144 984546 995591 1004592 1011299 1016459 1021313 1026293 1030474 1032455 1031520 1027831
52265 1027831 1021949 1014517 1006147 997117 987223 976284 964735 953389 942595 932001 921266 910698
52253 910698 901030 892745 885777 879687 873916 867956 861471 854353 846668 838707 831080 824560 819575 815938
52239 815938 813256 811568 811266 812352 814088 815632 816881 818378 820403 822495 824091 825461 827646 831330
52225 831330 836015 840546 844362 847950 852008 856557 861181 865885 871229 877511 884244 890725 896886 903234
52211 903234 909979 916566 922181 926518 929860 932533 934524 935773 936648 937815 939527 941270 942355 942778 943145
52196 943145 943813 944516 944985 945547 946660 948159 949429 950287 951197 952456 953529 953452 951713 948586 944732 940684
52180 940684 936636 932503 928087 923242 917951 912401 907101 902856 900351 899598 899860 900266 900523 901064 902571
52165 902571 905387 909267 913643 918131 922751 927681 932915 938327 943965 950041 956579 963237 969573 975418
52151 975418 980977 986720 993179 1000740 1009506 1019379 1030209 1041858 1054212 1067309 1081242 1095720 1109879
52138 1109879 1122969 1135251 1147830 1161494 1176067 1190979 1206016 1221281 1236790 1252408 1267954
52127 1267954 1283134 1297697 1311945 1326675 1342169 1357498 1371325 1383152 1393242 1401518 1407353 1410521
52115 1410521 1411615 1411186 1409037 1404790 1398663 1391139 1382094 1370918 1357572 1343070 1328754 1315317 1302752
52102 1302752 1291065 1280805 1272846 1267804 1265702 1266156 1268771 1273324 1279574 1287033 1295007 1302970 1310876 1319070
52088 1319070 1327809 1336939 1346114 1355257 1364688 1374808 1385909 1398236 1411878 1426436 1441053 1455085
52076 1455085 1468525 1481487 1493471 1503577 1511362 1517100 1521106 1523219 1523039 1520328 1514964 1506779 1495735
52063 1495735 1482142 1466527 1449285 1430569 1410440 1389072 1366908 1344595 1322575 1300729 1278681
52052 1278681 1256495 1234774 1213966 1193864 1174043 1154544 1135800 1118064 1101248 1085277 1070350
52041 1070350 1056812 1044954 1034970 1026940 1020803 1016396 1013507 1011857 1011157 1011281 1012223 1013738 1015174 1015857
52027 1015857 1015515 1014089 1011310 1006847 1000899 994218 987349 980075 971795 962311 952101 941943 932386 923390
52013 923390 914236 903829 891343 876690 860383 843024 825086 807151 790051 774450 760212 746418
52001 746418 732229 717719 703664 690514 677868 665195 652838 641937 633331 626797 621456 616609
51989 616609 612048 607750 603612 599451 595084 590294 584776 578185 570320 561361 551876 542440 533173 523771
51975 523771 514009 504073 494387 485380 477501 471175 466501 463218 461222 460899 462578 465810 469672 473783
51961 473783 478531 484194 490290 496010 500861 504541 506592 506653 504891 501777 497535 492168 485993 479744 474193
51946 474193 469982 467752 467958 470430 474506 479816 486592 495068 504860 515194 525484 535428 544716 552884
51932 552884 559305 563123 563417 559808 552850 543598 532844 520982 508450 495864 483595 471496 459271
51919 459271 447024 435330 424768 415432 407026 399482 393349 389216 386731 384681 382354 380512 380525 382747
51905 382747 386261 390164 394522 399921 406660 414637 423591 433004 441930 449317 454524 457390 457994 456510
51891 456510 453253 448679 443421 438380 434587 432749 432993 435228 439670 446875 457294 470921 487352 506049
51877 506049 526513 548124 569655 588921 603216 610498 610390 604171 593908 581444 567789 553151
51865 553151 537509 521159 504647 488319 472360 457394 444638 435082 428679 424611 422200 421305 421966
51852 421966 423933 426542 428886 430202 430257 429258 427305 424241 420209 415931 412002 408152 403764 398931 394413
51837 394413 390640 387407 384615 382677 381917 382055 382576 383254 384054 384896 385764 386679 387310 387017 385603 383643 381703
51820 381703 379613 376973 374044 371550 369837 368821 368617 369528 371418 373735 376345 379775 384315 389306 393555
51805 393555 396075 396284 394047 389997 385427 381266 377358 373160 368913 365495 363177 361183 358695 355716
51791 355716 352647 349537 346250 343107 340794 339661 339505 340075 341367 343283 345313 346780 347288 346846 345736
51776 345736 344420 343437 343169 343715 345065 347337 350771 355526 361507 368275 375183 381877 388722 396384 404721
51761 404721 412376 417788 420397 420507 418231 413237 405619 396341 386588 377118 368498 361374 355990 351786
51747 351786 348086 344997 343109 342490 342663 343585 345965 350328 356390 363675 372238 382114 392407 401602 408830
51732 408830 414300 418525 421788 424626 428214 433499 439960 445660 448713 448545 445735 441037 434927 428037
51718 428037 421594 416961 414576 413383 411574 408032 403133 398198 394299 391697 390233 389925 391072 393943
51704 393943 398407 403731 408615 411702 412368 411126 409181 407626 407106 408031 410688 414952 420008 424543 427227
51689 427227 427074 423660 417314 409113 400452 392381 385238 378911 373368 368871 365711 363896 363255 363802 365870
51674 365870 369865 375986 384112 393735 403952 413864 423135 431931 440058 446423 449737 449605 446613 441586
51660 441586 435379 429254 424637 422101 421051 420725 420919 421274 420469 417072 411159 404382 398290 393155 388515
51645 388515 384208 380340 376619 372303 366904 360672 354291 348226 342429 336652 330995 326057 322506 320554
51631 320554 319893 319982 320226 320046 319077 317450 315724 314527 314279 315112 316758 318599 320130 321426 322945 324896
51615 324896 327118 329557 332368 335357 337761 338982 339309 339600 340452 341970 344148 346997 350371 354147 358682
51600 358682 364648 372110 379977 386649 391104 393130 392689 389548 383839 376728 370084 365352 362880 362323 363286
51585 363286 365418 368273 371632 375903 381801 389706 399783 412638 429105 449009 470672 492115 512501
51572 512501 532066 551115 569707 588037 606263 623812 639425 652260 662785 672686 684375 700499
51560 700499 723128 752781 788335 828050 870185 912267 950343 980056 998879 1007025 1006074 997080
51548 997080 980237 955818 924785 888457 848163 805467 762305 720401 680564 642913 607754
51537 607754 575869 547803 523254 501418 481683 463760 447419 432584 419600 409005 400880 394595
51525 394595 389260 384280 379543 375330 372042 369775 368130 366611 365150 363947 362839 361263 359001 356629
51511 356629 354982 354402 354710 355657 357048 358487 359324 358992 357368 354881 352329 350477 349607 349407 349345 349144 348892
51494 348892 348749 348585 347940 346437 344295 342238 340734 339467 337888 336114 334832 334273 333810 332746 331059
51479 331059 329090 327007 324998 323667 323616 324796 326748 329359 332804 336683 339821 341237 341012 339929 338531
51464 338531 336775 334490 331879 329524 328026 327617 328037 328768 329407 329826 330058 330172 330214 330213 330173 330215 330849 333029
51446 333029 337794 345682 356493 369597 384313 399721 414105 425146 431302 433077 432600 431906 431872 432528
51432 432528 433540 434015 432535 428178 421389 413405 404994 396217 387222 378704 371487 366062 362504 360487
51418 360487 359368 358634 358270 358454 359020 359640 360318 361131 361530 360658 358571 356501 355549 355582 355725 355479 354969 354509
51400 354509 354411 354991 356285 357886 359420 361184 364050 368863 375999 385223 395719 406587 417834 430768
51386 430768 447098 467642 492183 520388 552482 589026 630483 677081 728660 784249 841743
51375 841743 898166 950471 996435 1035049 1066128 1089451 1104228 1109255 1103398 1085983 1057142 1018083
51363 1018083 970910 918059 861916 804795 748715 694895 643865 596348 553638 516742 485507
51352 485507 459139 437181 419371 404818 392219 380999 371494 363867 357520 351869 347037 343259 340051
51339 340051 336544 332448 328281 324737 322158 320536 319666 319288 319189 319165 318894 318063 316799 315727 315382 315706 316279
51322 316279 316809 317149 317056 316319 315126 314020 313489 313724 314673 316057 317406 318298 318587 318180 316774 314165 310844
51305 310844 307933 306334 306187 307107 308597 310061 310862 310782 310230 309579 308438 306040 302427 298829 296704 296664
51289 296664 298431 301439 305102 308771 311971 314820 317909 321655 325923 330282 334373 337962 340891 343177
51275 343177 345081 346896 348715 350375 351522 351689 350601 348618 346728 345865 346239 347347 348437 348825 347975
51260 347975 345676 342222 338247 334327 330736 327503 324578 321960 319720 317824 315972 313889 311925 310956
51246 310956 311399 312599 313598 314259 315092 316094 316437 315413 313251 310799 308815 307669 307280 307098 306541 305720
51230 305720 305416 306074 307219 308116 308700 309397 310350 311333 312316 313631 315538 317977 320807 323942 327169 330080
51214 330080 332356 333989 335217 336284 337293 338179 338828 339245 339510 339573 339258 338548 337699 336931 336232 335608 335230
51197 335230 335083 334716 333670 332011 330121 328156 326112 324237 322889 322051 321473 321328 322198 324274 327053 329930
51181 329930 332694 335297 337640 339860 342300 344804 346465 346592 345607 344484 343539 342379 340905 339666 339125
51166 339125 339149 339478 340211 341477 342916 343850 343781 342542 340224 337219 334160 331508 329284 327443 326284 326137
51150 326137 326717 327240 327229 326850 326438 326100 325993 326514 327813 329372 330465 330980 331460 332398 333756 335150 336168
51133 336168 336548 336328 335855 335399 334855 334180 334050 335496 338639 342285 345129 347038 348787 350875 353148 355401
51117 355401 357732 360203 362581 364558 365941 366558 366350 365698 365323 365607 366195 366501 366440 366492 367117 368307 369644
51100 369644 370675 371264 371673 372281 373171 374080 374869 375942 377979 381246 385236 389047 392078 394346 396219 397972
51084 397972 399643 401158 402417 403195 403168 402171 400424 398417 396678 395650 395573 396260 397183 398065 399332 401662
51068 401662 405135 409146 413212 417572 422893 429697 438205 448394 459826 471411 481583 488908 492881
51055 492881 494574 496521 501416 510362 522322 535360 548190 560515 572321 583435 593649 602737
51043 602737 610152 615017 616682 615327 612006 608030 604007 599208 591952 580884 565937 548063 528314
51030 528314 507582 487099 468623 453787 443251 436491 432219 429113 426482 424413 423241 422976 423451
51017 423451 424886 427885 432740 439020 445952 452932 459580 465673 471279 476763 482497 488714 495709 503842
51003 503842 513189 523488 534619 546753 559762 572999 586214 600363 616737 635338 654724 673631
50991 673631 692146 711080 730722 750621 770150 788725 805542 819585 830089 836943 840709 842364
50979 842364 843002 843576 844862 847638 852807 861283 873822 890939 912899 939811 971866 1009432 1052664
50966 1052664 1101017 1153463 1209336 1268631 1331284 1396452 1462775 1529088 1594466 1657750 1717506
50955 1717506 1772519 1822016 1865434 1902362 1932818 1957251 1976142 1989815 1998729 2003666 2005423 2004484
50943 2004484 2001070 1995106 1985873 1972071 1952919 1929393 1904047 1879335 1856098 1833651 1811006 1787620
50931 1787620 1763067 1736494 1706817 1673441 1636474 1596232 1552769 1506071 1456526 1405021 1352633
50920 1352633 1300361 1249046 1199397 1152137 1108178 1068396 1033038 1001472 972877 947073 924419
50909 924419 905062 888671 874802 862982 852462 842451 832857 824318 817227 811167 805591 800592 796544
50896 796544 793330 790521 788072 786306 785253 784494 783681 782782 781854 780984 780530 781012 782664 785337 788889 793314
50880 793314 798473 804042 809840 815910 822247 828843 836131 844928 855675 868030 881471 896029 912057
50867 912057 929617 948593 969359 992846 1019741 1049906 1082889 1118874 1158896 1204109 1255169
50856 1255169 1312554 1377215 1450371 1532527 1623127 1721497 1827795 1942627 2066018 2197231
50846 2197231 2335302 2479118 2627013 2776978 2927277 3076114 3220444 3355865 3478075
50837 3478075 3583964 3671180 3737645 3782375 3806262 3811274 3799194 3771908 3732531 3685258 3634018
50826 3634018 3581951 3532068 3487490 3450665 3422829 3404203 3393958 3389655 3387394 3382967 3372651 3353012
50814 3353012 3320928 3274526 3213778 3139702 3053309 2955641 2848327 2733490 2613305 2490202
50804 2490202 2367261 2247821 2134659 2029898 1935448 1852833 1782527 1723961 1676425 1639606
50794 1639606 1613196 1596347 1587745 1586020 1589967 1598640 1611217 1626505 1642502 1656870 1668116 1676105
50782 1676105 1681305 1683852 1683572 1680510 1674926 1666860 1656152 1642883 1627355 1609490 1588552 1563680 1534567
50769 1534567 1501522 1465131 1426136 1385524 1344400 1303646 1263866 1225683 1189904 1157172 1127575
50758 1127575 1100779 1076602 1055320 1037342 1022701 1011033 1002020 995680 992173 991532 993773 999203 1008319
50745 1008319 1021240 1037451 1056292 1077684 1102213 1130582 1163279 1200801 1243834 1292918 1348048
50734 1348048 1408795 1474709 1545387 1620296 1698835 1780499 1864658 1950156 2035457 2119296 2200804
50723 2200804 2278788 2351233 2415815 2470651 2514208 2544696 2560106 2559082 2541709 2509690 2466207
50712 2466207 2415638 2362841 2312158 2266736 2228408 2197837 2174798 2158779 2149508 2146626 2148760 2153326
50700 2153326 2157554 2159400 2157158 2148554 2131001 2102907 2064372 2016555 1960886 1899214 1834313 1769596
50688 1769596 1708080 1651715 1601628 1558711 1523889 1498021 1481823 1475839 1480332 1495127 1519631 1553104
50676 1553104 1594927 1644616 1701596 1764963 1833313 1904639 1976371 2045648 2109843 2167070 2216434
50665 2216434 2257899 2291906 2319076 2340257 2356667 2369617 2379817 2387076 2390858 2391024 2387775 2381106
50653 2381106 2370873 2357510 2342149 2325816 2308956 2292173 2277035 2265588 2259189 2258237 2262863 2273291
50641 2273291 2289494 2310990 2337152 2367317 2400514 2435472 2471084 2506599 2541458 2575481 2609316
50630 2609316 2643818 2678139 2708321 2727834 2729335 2706446 2655851 2579717 2486399 2387506 2293187
50619 2293187 2209659 2140042 2085828 2046879 2021207 2006175 2000103 2002217 2011272 2024916 2040447 2055625
50607 2055625 2068514 2077039 2079028 2072556 2056116 2028760 1990445 1942203 1885732 1822825 1755325 1685425
50595 1685425 1615505 1547443 1482242 1420519 1363077 1310666 1263332 1220519 1181957 1148030 1119044
50584 1119044 1094495 1073491 1055688 1041378 1030737 1023423 1018988 1017214 1017887 1020563 1024760 1030147 1036410
50571 1036410 1043169 1050225 1057694 1065781 1074772 1085425 1098979 1116365 1137617 1162404 1190926 1223810
50559 1223810 1261308 1303215 1349555 1400723 1456634 1516189 1577808 1640043 1701365 1759872 1813958
50548 1813958 1863199 1908086 1948970 1985864 2019396 2051373 2084041 2119082 2157549 2200320 2247998
50537 2247998 2300447 2356871 2416554 2479371 2545738 2616418 2692343 2774132 2861636 2954284 3051927
50526 3051927 3154833 3262444 3372473 3481664 3587302 3687503 3780137 3862102 3929871 3980533
50516 3980533 4012168 4023682 4014645 3985215 3935966 3867749 3781750 3679740 3564410 3439703 3310763
50505 3310763 3183138 3061620 2949666 2849794 2764265 2695375 2645172 2614854 2604123 2611156 2633571
50494 2633571 2669465 2717007 2772757 2830882 2884489 2927537 2955166 2962960 2947170 2906168 2841221
50483 2841221 2755619 2653441 2539292 2418370 2295722 2175069 2058529 1947362 1842592 1744901
50473 1744901 1654397 1570838 1493963 1423384 1358402 1298311 1242988 1192853 1148095 1108225 1072675
50462 1072675 1041604 1015665 994932 978419 964745 952974 942710 933754 926061 919880 915614 913498
50450 913498 913449 915109 917886 921134 924515 928131 932185 936634 941287 946071 951003 956147 961862 968948 978236
50435 978236 990123 1004715 1022220 1042777 1066049 1091443 1118707 1147814 1178274 1209109 1239705
50424 1239705 1270186 1300698 1330882 1360639 1391120 1424354 1461819 1503797 1550108 1600958 1656701
50413 1656701 1717019 1780816 1847013 1915157 1984993 2055559 2125016 2191351 2252928 2308337 2356243
50402 2356243 2395837 2427091 2449859 2462691 2463027 2448807 2419662 2376575 2320935 2254285 2178672 2096836
50390 2096836 2012063 1927829 1847246 1772560 1705264 1646793 1598722 1561988 1536159 1519896 1512148
50379 1512148 1512614 1521087 1536582 1557200 1580587 1604407 1626332 1643746 1653739 1653777 1642558 1620101 1587136
50366 1587136 1544744 1494669 1439499 1382092 1324838 1269434 1216892 1167425 1120624 1076287 1034924
50355 1034924 997166 962865 931241 901821 874799 850582 829489 811895 798074 787633 779499
50344 779499 772766 767243 762990 759671 756699 753854 751398 749619 748475 747634 746671 745235 743203 740739 738203
50329 738203 735975 734344 733422 733121 733295 733945 735160 736896 739061 741886 745997 751870 759398 768180 778171
50314 778171 789837 803757 820318 839780 862308 887786 915657 944955 974341 1002052 1026085
50303 1026085 1044649 1056589 1061570 1060230 1054297 1046163 1037861 1030347 1023847 1018562 1014519 1010819 1005803
50290 1005803 998464 989400 980013 971075 962480 954083 946095 938739 932208 927223 925074 926714 932026 940100
50276 940100 949679 958854 964780 964596 957093 943437 926341 908621 892243 878106 866325 856766 849510
50263 849510 844915 843282 844485 847925 852909 859136 866712 875526 884715 893084 899993 905509 909764 912698
50249 912698 914539 915832 916575 915902 913143 908780 903745 898236 891948 885099 878304 871559 864342 856824 850148
50234 850148 845209 842000 840447 841105 844491 850437 858807 870421 886640 908307 935621 968698 1007589
50221 1007589 1051915 1101080 1154771 1212679 1273665 1335636 1396240 1453382 1505258 1550659 1589603
50210 1589603 1623353 1653588 1681639 1708377 1734183 1758381 1778692 1791562 1793291 1781075 1753320
50199 1753320 1709552 1650559 1578864 1498719 1415061 1332098 1252864 1179763 1114787 1058860 1011512
50188 1011512 971784 939173 913249 892739 875687 860339 845101 827770 806048 779531 750579
50177 750579 722523 697184 674565 654438 637318 623828 613814 606503 601270 597882 596191 595838 596404
50164 596404 597732 600061 603726 608701 614517 620716 627269 634433 642356 651000 660386 670534 681068 691143
50150 691143 700022 707605 714164 719648 723494 725256 725193 724059 722415 720411 718342 717211 718370 722547 729346
50135 729346 737829 747356 757706 768531 779141 788959 797933 806315 814211 821586 828639 835836 843525
50122 843525 851693 860248 869416 879830 892249 907188 924727 944695 967234 993214 1023960 1060488
50110 1060488 1103147 1152002 1207421 1270232 1341584 1422741 1514640 1617177 1728884 1847405 1970075
50099 1970075 2093839 2214963 2329590 2434989 2530409 2617031 2697436 2774767 2851296 2927031
50089 2927031 2999607 3065413 3120360 3159499 3176965 3167556 3128888 3062018 2970342 2858381 2731279
50078 2731279 2594284 2451907 2307633 2164641 2026446 1896333 1776283 1666885 1568345 1481165
50068 1481165 1405619 1340974 1285743 1238718 1199345 1166997 1140280 1117417 1097185 1079207 1063445
50057 1063445 1049752 1037880 1027575 1018537 1010497 1003376 997159 991546 986029 980357 974588 968537 961569
50044 961569 953244 943910 934284 924645 914784 904685 894865 885954 878182 871309 864846 858364 851768 845373
50030 845373 839655 834901 831108 828092 825578 823324 821337 819809 818720 817616 815983 813703 811013 808203
50016 808203 805577 803413 801575 799303 795866 791467 787114 783555 780639 777788 774752 771823 769622 768849
50002 768849 770059 773564 779683 789012 802183 819206 839175 860610 882055 902699 922935 944261
49990 944261 968149 994926 1024204 1056306 1092534 1133746 1179325 1228065 1279600 1334226 1391483
49979 1391483 1449498 1505743 1558051 1605064 1646309 1682237 1714016 1743135 1771047 1798918 1827204
49968 1827204 1855209 1880886 1900879 1910711 1905524 1881514 1837321 1774276 1695642 1605825 1510018 1413754
49956 1413754 1321963 1238084 1163974 1100472 1047845 1005664 972507 946227 924834 907151 892505
49945 892505 879906 867929 855514 842609 829806 817469 805351 792866 779447 764684 748266
49934 748266 729864 709174 686354 662474 639265 618191 599949 584868 573228 564772 558309 552537
49922 552537 547298 543512 541881 542118 543504 545640 548343 551222 553762 555740 557347 559030 561405 565187
49908 565187 570876 578393 587053 596013 604864 613931 623968 635468 648278 661863 675623 688639 699364
49895 699364 706245 708961 708706 706993 704324 700224 694232 686446 677149 666338 653866 639927 625171
49882 625171 610281 595503 580577 565168 549391 534042 520346 509319 501062 494702 489263 484657
49870 484657 481581 480372 480469 481257 482926 485842 489414 492480 494867 497817 502610 509395 517695 527425 538819
49855 538819 551784 565912 580826 595976 610299 622744 633106 641791 648770 653400 655388 655348 653978
49842 653978 651085 645867 638046 628334 617813 607189 596730 586632 577186 568592 560883 554171 548792
49829 548792 545014 542693 541503 541547 543373 547204 552428 558147 564067 570584 578138 586894 596932 608296
49815 608296 620738 633683 646535 658756 669601 678234 684352 688470 691336 693230 694024 693594 691820
49802 691820 688313 682677 675091 666308 656908 646793 635603 623408 610749 598140 585827 573979
49790 573979 562846 552647 543511 535639 529348 524730 521385 518643 516023 513332 510480 507473 504646 502616
49776 502616 501845 502360 503991 506751 510915 516820 524629 534061 544278 554303 563688 572557 580832 587801
49762 587801 592823 596208 598910 601438 603542 604904 605489 604961 602324 596637 587917 577051 565019 552544
49748 552544 540314 529070 519397 511620 505923 502277 500231 499014 498012 497080 496319 495694 494954 493873 492489
49733 492489 491110 490109 489664 489680 489993 490658 492006 494427 498097 502928 508804 515917 524819 535916 548760
49718 548760 561957 574031 584327 592841 599227 602514 602158 599150 595507 592565 590078 587125 583434 579392
49704 579392 575048 569797 563238 555915 548868 542672 537162 531868 526446 520890 515715 511874 510062 510017 510771
49689 510771 511680 512940 515102 518520 523366 529744 537420 545729 554143 562838 572384 583003 594419 606330
49675 606330 618620 631021 642817 653029 660842 665920 668511 669218 668505 666469 663339 660098 658216 658505
49661 658505 660397 662426 663206 661769 657289 649012 636719 621127 603702 586037 569361 554398 541383
49648 541383 530148 520344 511816 504771 499494 495983 494029 493507 494313 496005 497921 499784 501780 503790
49634 503790 504905 504116 501261 496920 491587 485497 479104 473091 467764 462938 458507 454674 451465 448532
49620 448532 445688 443167 441055 438954 436645 434696 433928 434446 435643 436989 438332 439626 440854 442234 444026
49605 444026 446014 447578 448393 448819 449515 450819 452565 454234 455276 455475 455038 454298 453485 452960 453364 455030
49589 455030 457252 458692 458700 457929 457531 458077 459362 460944 462561 464195 465928 467751 469546 471424 473961 477793
49573 477793 482974 489045 495712 502969 510542 517821 524633 531626 539478 548038 556559 564398 571142 576452
49559 576452 580252 582810 584150 583660 580838 576166 570737 565213 559766 554829 551097 548708 547194 546464 547141
49544 547141 549496 552565 554800 555366 554569 553367 552822 553724 556222 559785 563683 567540 571389 575448 579974
49529 579974 585244 591595 599532 609622 621926 635623 649522 662824 674843 684175 689179 689710 687637
49516 687637 685118 683014 681534 681605 684530 690674 699444 710410 723313 736876 748571 756000 757955 754042
49502 754042 744129 728721 709445 688574 668125 649404 632985 618904 607120 597877 591289 586578
49490 586578 582352 577940 573981 571375 570077 569248 568208 566854 565455 564483 564411 565306 566699 568099 569447
49475 569447 570908 572502 574188 576059 578139 580259 582387 584874 588122 592223 597083 602452 607644 611773
49461 611773 614740 617523 620904 624245 626113 625805 623561 619575 613677 606051 597504 588856 580560 572982
49447 572982 566448 560851 555760 551055 547054 543917 541442 539580 538672 538975 540354 542626 545833 550032 555183
49432 555183 561415 569070 578352 589242 601837 616404 633086 651949 673329 697661 724872 754283
49420 754283 784615 813033 834072 841169 830839 805593 772473 738880 709585 686322 668762 655720
49408 655720 646246 639980 636662 635784 637004 640436 645992 652900 660353 668275 676822 685472 693347 700218
49394 700218 706531 712514 717887 722369 725842 728136 729220 729557 729579 728844 726348 721755 715675 708724 701033
49379 701033 692898 685180 678626 673277 668940 665901 664750 665668 668174 671533 675380 680020 686002 693155
49365 693155 700198 705726 709442 711934 713420 713453 711902 709391 706432 702781 698128 692880 687795 683295 679585
49350 679585 677083 676113 676421 677517 679365 682285 686277 690853 695504 699926 703857 707073 709592 711559 712819
49335 712819 712874 711450 709025 706551 704609 702958 701112 699273 698315 698623 699396 699562 699207 699472 701093 703660
49319 703660 706370 708803 710745 711941 712519 713141 714268 715623 716787 717907 719309 720741 721576 721602 721158 720632
49303 720632 720240 720135 720329 720601 720856 721468 722951 725425 728716 732769 737614 743086 748901 754868 760712 766017
49287 766017 770768 775664 781352 787527 793246 797954 801642 804249 805650 806275 807058 808628 811003 814165 818386
49272 818386 823876 830640 838836 848775 860313 872541 884065 893238 898307 898178 893454 886309 879148 873827
49258 873827 872080 875684 885564 901284 921919 946814 974884 1003844 1031169 1055542 1076321 1091719
49246 1091719 1098789 1095930 1084731 1068683 1050451 1030906 1010405 989955 970801 953461 937752 923632
49234 923632 911634 902406 896188 892864 892276 894236 898337 904015 910857 918741 927712 937841 949175 961664
49220 961664 975009 988483 1000907 1011015 1018227 1023157 1027075 1030625 1033423 1035131 1036488 1038726 1042267
49207 1042267 1046736 1052230 1059797 1070383 1083900 1099610 1116876 1135073 1153264 1170642 1187191 1203397
49195 1203397 1219288 1234224 1247678 1259930 1271725 1283382 1294393 1304009 1312168 1319732 1327681 1336296
49183 1336296 1345473 1355773 1368578 1384906 1404398 1425893 1448833 1473812 1501949 1534160 1571017
49172 1571017 1612739 1658682 1706546 1752018 1789514 1813846 1822006 1814111 1793315 1765016 1735481 1709947
49160 1709947 1691072 1679010 1672932 1672267 1676545 1684748 1695477 1707622 1720505 1733466 1745763 1756886
49148 1756886 1766674 1775196 1782848 1790552 1799398 1809846 1821478 1833726 1846684 1860993 1876953 1893934
49136 1893934 1910819 1926983 1942716 1958585 1974633 1990451 2005900 2021221 2036277 2050190 2062195
49125 2062195 2072607 2082454 2092250 2101602 2110107 2118225 2127012 2137203 2148844 2161807 2176534 2194136
49113 2194136 2215775 2242111 2273641 2311622 2358406 2416537 2487304 2569687 2659934 2751972 2839193
49102 2839193 2917444 2987162 3052200 3115330 3173470 3216590 3232172 3213012 3162723 3093964 3020225
49091 3020225 2948025 2875887 2799554 2717493 2632427 2549624 2474626 2411507 2361659 2323712 2294936
49080 2294936 2272952 2256274 2243767 2234282 2226928 2221335 2217326 2214348 2211303 2207032 2201034 2193801 2186405
49067 2186405 2179690 2173862 2168759 2164264 2160299 2156521 2152311 2147277 2141783 2136799 2133026 2130171 2127271 2123773
49053 2123773 2120076 2116905 2114431 2112243 2109965 2107557 2105183 2103145 2101892 2101684 2102270 2103224 2104619 2106984 2110655
49038 2110655 2115613 2122073 2130772 2142375 2156926 2174009 2193010 2212848 2231797 2248119 2260922 2270247
49026 2270247 2276472 2279868 2280645 2279159 2276041 2272174 2268417 2265231 2262716 2261115 2261078 2263265 2267896 2274854 2283974
49011 2283974 2294953 2307159 2319877 2332737 2345656 2358419 2370564 2381686 2391683 2400739 2409157 2417110
48999 2417110 2424378 2430426 2434873 2437801 2439501 2440147 2439894 2439011 2437588 2435293 2431777 2427258 2422376 2417592 2413027
48984 2413027 2408756 2404800 2400920 2396929 2393259 2390746 2389672 2389402 2389058 2388223 2386900 2385224 2383462 2381856 2380184
48969 2380184 2377806 2374451 2370672 2367188 2364053 2360821 2357335 2353990 2351389 2350042 2350269 2352028 2354997 2359218
48955 2359218 2365592 2375323 2388870 2405784 2425531 2448067 2473518 2501707 2532184 2564515 2598433 2633921
48943 2633921 2671262 2710812 2752664 2796697 2842825 2890918 2940515 2991100 3042856 3096695 3153216
48932 3153216 3211847 3271247 3330343 3388798 3446818 3504849 3563255 3621873 3680009 3737267 3794280
48921 3794280 3852118 3910875 3969236 4025607 4079272 4130202 4178135 4222538 4263616 4302854 4342043
48910 4342043 4381761 4421097 4458894 4494894 4529526 4563002 4595120 4625748 4654927 4682523 4708322
48899 4708322 4732530 4755500 4776704 4794581 4807879 4816765 4822183 4824554 4823666 4819358 4811523 4799701 4783479
48886 4783479 4763266 4739949 4713703 4683877 4650128 4612905 4572487 4528316 4479751 4427065 4371172
48875 4371172 4312595 4251074 4186071 4117484 4046097 3973436 3900953 3829328 3758913 3690734 3626281
48864 3626281 3566067 3509193 3454901 3403953 3357843 3317048 3280817 3248442 3219958 3195640 3175408
48853 3175408 3158814 3145184 3133751 3124032 3116122 3110350 3106738 3105074 3105340 3107683 3112127 3118698 3127702
48840 3127702 3139362 3153229 3168397 3184325 3201066 3218706 3237002 3255613 3274378 3293282 3312423
48829 3312423 3331931 3351658 3371187 3390545 3410718 3432856 3457030 3482366 3508411 3535645 3564480
48818 3564480 3594428 3624623 3654722 3684937 3715561 3746805 3778833 3811619 3844919 3878629 3912955
48807 3912955 3948040 3983511 4018589 4052570 4085231 4116981 4148667 4181043 4214447 4249015 4284814
48796 4284814 4321193 4356216 4387598 4414434 4437526 4457851 4475387 4489726 4501111 4510231 4517264 4521585
48784 4521585 4522199 4518079 4508367 4492694 4471217 4444208 4411869 4374711 4333693 4289611 4242715 4193264
48772 4193264 4142030 4089699 4036095 3980626 3923353 3865073 3806397 3747321 3687697 3627766 3568252
48761 3568252 3510343 3455490 3404632 3357512 3313175 3271244 3232333 3197125 3165586 3137364 3112561
48750 3112561 3091572 3074188 3059242 3045286 3031541 3018132 3005590 2994287 2984354 2975879 2968948 2963518
48738 2963518 2959453 2956674 2955087 2954418 2954337 2954666 2955098 2954782 2952761 2949032 2944677 2940616 2936641 2932040 2926737
48723 2926737 2921278 2916035 2911044 2906506 2902816 2900080 2898031 2896458 2895366 2894798 2894937 2896338 2899473 2903977
48709 2903977 2908770 2913136 2917260 2921533 2925751 2929334 2932107 2934510 2937013 2939561 2941740 2943516 2945691 2949359
48695 2949359 2954831 2961370 2968185 2975305 2983047 2990899 2997593 3002298 3005234 3006987 3007777 3007631 3006925 3006460 3007120
48680 3007120 3009446 3013214 3017267 3020078 3020625 3018538 3013511 3005123 2993411 2979093 2962912 2945119 2925904
48667 2925904 2905826 2885360 2864337 2842439 2820066 2798153 2777130 2756483 2735257 2712368 2686399
48656 2686399 2655816 2619977 2579752 2536937 2493274 2450213 2409164 2371344 2337251 2306620 2278986
48645 2278986 2254018 2231230 2209654 2188037 2165371 2141214 2115700 2089348 2062789 2036579 2011315
48634 2011315 1987773 1966577 1947554 1929732 1912207 1894746 1877280 1859167 1839582 1818569 1797151
$$ [...]
##END NTUPLES=NMR SPECTRUM
##END=
