
##TITLE=AC1373_DOM12185_7518827_GN5DaabZ4F
##JCAMPDX= 6.0         $$ Bruker NMR JCAMP-DX V2.0
##DATA TYPE= NMR SPECTRUM
##DATA CLASS= NTUPLES
##ORIGIN= BRUKER
##OWNER= Administrator
$$ 1.72 TOPSPIN		Version 2.1
$$ 2013-02-20 01:19:03.240 -0500  Administrator@X
$$ Compression mode = diff/dup
##.OBSERVE FREQUENCY= 400.02188249412
##.OBSERVE NUCLEUS= ^1H
##.ACQUISITION MODE= SIMULTANEOUS (DQD)
##.ACQUISITION SCHEME= undefined
##.AVERAGES= 8
##.DIGITISER RES= 22
##SPECTROMETER/DATA SYSTEM= spect
##.PULSE SEQUENCE= zg30
##.SOLVENT NAME= COFFEE_meoh
##.SHIFT REFERENCE= INTERNAL, COFFEE_meoh, 1, 14.98509
##AUDIT TRAIL= $$ (NUMBER, WHEN, WHO, WHERE, PROCESS, VERSION, WHAT)
$$ ##TITLE= Audit trail, TOPSPIN		Version 2.1
$$ ##JCAMPDX= 5.01
$$ ##ORIGIN= Bruker BioSpin GmbH
$$ ##OWNER= Administrator
$$ $$ E:\/data/COFFEE/nmr/AC1373_DOM12185_7518827_GN5DaabZ4F/10/pdata/1/auditp.txt
$$ ##AUDIT TRAIL=  $$ (NUMBER, WHEN, WHO, WHERE, PROCESS, VERSION, WHAT)
(   1,<2013-02-20 01:18:54.709 -0500>,<Administrator>,<X>,<go>,<TOPSPIN 2.1>,
      <created by zg
	started at 2013-02-20 01:17:48.209 -0500,
	POWCHK enabled, PULCHK disabled,
       configuration hash MD5:
       86 BA 57 50 F2 9D 5C 9B 26 00 A9 28 5F 66 2E 89
       data hash MD5: 64K
       1C 1D CE 93 48 34 6F 57 97 69 D0 A1 6C EC FE 2D>)
(   2,<2013-02-20 01:18:57.850 -0500>,<Administrator>,<X>,<proc1d>,<TOPSPIN 2.1>,
      <Start of raw data processing
       efp LB = 0 FT_mod = 6 PKNL = 1 PHC0 = 0 PHC1 = 0 SI = 32K 
       data hash MD5: 32K
       79 77 97 AF 1A 6F 25 A9 3B 9F 9B E8 BC EE BA 7A>)
(   3,<2013-02-20 01:18:58.459 -0500>,<Administrator>,<X>,<proc1d>,<TOPSPIN 2.1>,
      <pk PHC0 = 69.65881 PHC1 = 0 
       data hash MD5: 32K
       9E 5D 48 91 12 70 C0 4A 18 72 89 6C AA 21 24 A2>)
(   4,<2013-02-20 01:18:58.678 -0500>,<Administrator>,<X>,<proc1d>,<TOPSPIN 2.1>,
      <abs ABSG = 1 
       data hash MD5: 32K
       20 24 7B 17 C9 1F DA 46 BC 7C 53 AA CC 8B 36 E5>)
(   5,<2013-02-20 01:18:58.834 -0500>,<Administrator>,<X>,<proc1d>,<TOPSPIN 2.1>,
      <abs ABSG = 2 
       data hash MD5: 32K
       FA BE DC D9 38 4B EC 57 4A A2 FC 18 EB EA 53 5D>)
(   6,<2013-02-20 01:18:58.975 -0500>,<Administrator>,<X>,<proc1d>,<TOPSPIN 2.1>,
      <abs ABSG = 3 
       data hash MD5: 32K
       CF 89 C7 1E C0 C3 1D 64 C6 D2 33 4F 50 2B 86 5A>)
(   7,<2013-02-20 01:18:59.131 -0500>,<Administrator>,<X>,<proc1d>,<TOPSPIN 2.1>,
      <abs ABSG = 4 
       data hash MD5: 32K
       FC 37 A8 C2 47 7A 0C 77 7F 00 7E 34 13 0E 93 22>)
(   8,<2013-02-20 01:18:59.303 -0500>,<Administrator>,<X>,<proc1d>,<TOPSPIN 2.1>,
      <abs ABSG = 5 
       data hash MD5: 32K
       CC 21 5C 4B BE 5C 24 45 BC 53 37 75 41 E8 01 DF>)
$$ ##END=
$$ 
$$ $$ hash MD5
$$ $$ 95 27 60 D9 EC 6B 9B DF 3B 58 F9 93 3B F4 EA 5F
##$RELAX= 
##$RELAX= 
##$RELAX= 
##$RELAX= 
##$RELAX= 
##$RELAX= 
##$RELAX= 
$$ Bruker specific parameters
$$ --------------------------
##$DU= <E:\>
##$EXPNO= 10
##$NAME= <AC1373_DOM12185_7518827_GN5DaabZ4F>
$$ [...]
##$TP= (0..7)
150 150 150 150 150 150 150 150
##$TP07= 0
##$TPNAME0= <>
##$TPNAME1= <>
##$TPNAME2= <>
##$TPNAME3= <>
##$TPNAME4= <>
##$TPNAME5= <>
##$TPNAME6= <>
##$TPNAME7= <>
##$TPOAL= (0..7)
0.5 0.5 0.5 0.5 0.5 0.5 0.5 0.5
##$TPOFFS= (0..7)
0 0 0 0 0 0 0 0
##$TUNHIN= 0
##$TUNHOUT= 0
##$TUNXOUT= 0
##$USERA1= <user>
##$USERA2= <user>
##$USERA3= <user>
##$USERA4= <user>
##$USERA5= <user>
##$V9= 5
##$VALIST= <valist>
##$VCLIST= <CCCCCCCCCCCCCCC>
##$VD= 0
##$VDLIST= <DDDDDDDDDDDDDDD>
##$VPLIST= <PPPPPPPPPPPPPPP>
##$VTLIST= <TTTTTTTTTTTTTTT>
##$WBST= 1024
##$WBSW= 4
##$XGAIN= (0..3)
0 0 0 0
##$XL= 0
##$YL= 0
##$YMAX_a= 554400
##$YMIN_a= -552665
##$ZGOPTNS= <>
##$ZL1= 120
##$ZL2= 120
##$ZL3= 120
##$ZL4= 120
##$ABSF1= 14.98509
##$ABSF2= -5.573092
##$ABSG= 5
##$ABSL= 3
##$ALPHA= 0
##$AQORDER= 0
##$ASSFAC= 0
##$ASSFACI= 0
##$ASSFACX= 0
##$ASSWID= 0
##$AUNMP= <proc_prof1d_extract_pilot.lims>
##$AXLEFT= 0
##$AXNAME= <>
##$AXNUC= <1H>
##$AXRIGHT= 0
##$AXTYPE= 0
##$AXUNIT= <>
##$AZFE= 0.1
##$AZFW= 0.1
##$BCFW= 0
##$BC_mod= 0
##$BYTORDP= 0
##$COROFFS= 0
##$CY= 15
##$DATMOD= 1
##$DC= 0
##$DFILT= <>
##$DTYPP= 0
##$F1P= 0
##$F2P= 0
##$FCOR= 0.5
##$FTSIZE= 32768
##$FT_mod= 6
##$GAMMA= 0
##$GB= 0
##$INTBC= 1
##$INTSCL= 1
##$ISEN= 128
##$LB= 0
##$LEV0= 0
##$LPBIN= 0
##$MAXI= 10000
##$MC2= 0
##$MEAN= 0
##$ME_mod= 0
##$MI= 0
##$NCOEF= 0
##$NC_proc= -8
##$NLEV= 6
##$NOISF1= 0
##$NOISF2= 0
##$NSP= 0
##$NTH_PI= 0
##$NZP= 0
##$OFFSET= 14.98509
##$PC= 1
##$PHC0= 69.65881
##$PHC1= 0
##$PH_mod= 1
##$PKNL= yes
##$PPARMOD= 0
##$PPDIAG= 0
##$PPIPTYP= 0
##$PPMPNUM= 2147483647
##$PPRESOL= 1
##$PSCAL= 4
##$PSIGN= 0
##$PYNMP= <proc.py>
##$REVERSE= no
##$SF= 400.02
##$SI= 32768
##$SIGF1= 0
##$SIGF2= 0
##$SINO= 400
##$SIOLD= 32768
##$SPECTYP= <>
##$SREGLST= <1H.CDCl3>
##$SSB= 0
##$STSI= 32768
##$STSR= 0
##$SW_p= 8223.68421052631
##$SYMM= 0
##$S_DEV= 0
##$TDeff= 65536
##$TDoff= 0
##$TI= <>
##$TILT= no
##$TM1= 0
##$TM2= 0
##$TOPLEV= 0
##$USERP1= <user>
##$USERP2= <user>
##$USERP3= <user>
##$USERP4= <user>
##$USERP5= <user>
##$WDW= 1
##$XDIM= 32768
##$YMAX_p= 457180420
##$YMIN_p= -727446
##$CURPLOT= <Network HP LaserJet P1505>
##$CURPRIN= <$Network HP LaserJet P1505>
##$DFORMAT= <normdp>
##$LAYOUT= <+/1D_H.xwp>
##$LFORMAT= <normlp>
##$PFORMAT= <normpl>
##$SURQMSG= 1
$$ End of Bruker specific parameters
$$ ---------------------------------
##NTUPLES= NMR SPECTRUM
##VAR_NAME=  FREQUENCY,     SPECTRUM/REAL,   SPECTRUM/IMAG
##SYMBOL=    X,             R,               I
##VAR_TYPE=  INDEPENDENT,   DEPENDENT,       DEPENDENT
##VAR_FORM=  AFFN,          ASDF,            ASDF
##VAR_DIM=   32768,         32768,           32768
##UNITS=     HZ,            ARBITRARY UNITS, ARBITRARY UNITS
##FACTOR=    0.250966925370066, 1,           1
##FIRST=     8223.43324360094, 87540,        18300
##LAST=      0,             -213166,         73123
##MIN=       0,             -727446,         0
##MAX=       8223.43324360094, 457180420,    0
$$ Real data points
##PAGE= N=1
##DATA TABLE= (X++(R..R)), XYDATA
$$ [...]
19515D5370L0800A095c21917B30472g9958l0680l4989j53748A61285l0380J01260
$$ 45370 76170 1095 -321917 230472 -79958 -110638 -145627 -299375 161285 130905 232165
19504B32165B3910a16269A78432i7151H9913J59440m6864I7562e0624G8397k9949
$$ 232165 23910 -116269 178432 -97151 89913 249353 202489 97562 -50624 78397 48448
19493D8448i6334C0351a99301j8912A55013b00489O4841g27m89050d163B50623
$$ 48448 -96334 30351 -199301 -218213 155013 -200489 -135648 -727 -489777 -4163 250623
19481H5141e6352o2348k0348A00525a0019F2063a53140k5043m5500A115a38342
$$ 85141 -56352 -118700 -139048 100525 -10019 62063 -153140 -178183 -223683 1115 -138342
19469a47770j38164h531l22901H6374N7880D3518a27442F3377A7919J14115f8760
$$ -147770 -285934 -8531 -331432 86374 144254 43518 -127442 63377 17919 132034 -68760
19457b37695p0716K9783l0422J06521b862A38538b22716k72148A99419D8037e38855
$$ -237695 -308411 -278628 -309050 -202529 -2862 138538 -222716 -494864 199419 48037 -538855
19445G6078a27337B0606a52498L5259j16595e3334j39106d4296q307b0455F8599
$$ 76078 -127337 20606 -152498 -117239 -233834 -53334 -192440 -44296 -52603 -20455 68599
19433i1484G5085c21328F2819a82110C32388c1907K425A3148h9246f17k38500
$$ -91484 75085 -321328 62819 -182110 332388 -31907 -29482 13148 -89246 -617 -239117
19422b39117H6108K58145a13512l31344E2644h913A44503c1200h80l8093j03770
$$ -239117 86108 344253 -113512 -444856 52644 -8913 144503 -31200 -880 -38973 -142743
19411a42743k864c8995k36643E1573b1973q5808M9636J7657k8246F9231e035B24464
$$ -142743 -145607 -38995 -275638 51573 -21973 -107781 -58145 -40488 -68734 69231 -5035 224464
19398h5876A24662h5822c6920k45859a40659A05136L03781H2980c39221B27456
$$ -85876 124662 -85822 -36920 -282779 -140659 105136 408917 82980 -339221 227456
19387e077j06261d6193a5015j2950E196J41605O1351d36059e4214F2776K513a50269
$$ -5077 -111338 -46193 -15015 -27965 5196 146801 208152 -436059 -54214 62776 65289 -150269
19374B34012c15710F9698a51681a4037A14317a66229l5621d9438a1186d530B75847
$$ 234012 -315710 69698 -151681 -14037 114317 -166229 -201850 -49438 -11186 -4530 275847
19362a8883A76054b72267Q1116k4836b1845m4810E3904K0264a02082C37414f0517
$$ -18883 176054 -272267 -191151 -215987 -21845 -66655 53904 74168 -102082 337414 -60517
19350A33791D4874a71791I1173i7470l8756j09243P4751N0547j13388C8449e73
$$ 133791 44874 -171791 91173 -97470 -136226 -245469 -170718 -120171 -233559 38449 -573
19338A88802F1107a38958M4621j16533B57865a30638j88155a42896j6609I1499
$$ 188802 61107 -138958 -94337 -210870 257865 -130638 -318793 -142896 -159505 91499
19327a91347B24326a58869C0555a9882p2484j85717D2964a56127L2228j16373
$$ -191347 224326 -158869 30555 -19882 -92366 -278083 42964 -156127 -123899 -240272
19317b40272O0659A48310a41517A99685a3923m9555j02276B1174f472j40380a8143
$$ -240272 -179613 148310 -141517 199685 -13923 -63478 -165754 21174 -6472 -146852 -18143
19305b13626m6895A1326J27990e26974a37924B25066f6401j1863B10535h144k77547
$$ -213626 -260521 11326 139316 -526974 -137924 225066 -66401 -78264 210535 -8144 -285691
19294b85691A29338J0756i5009k6620k12632E9883C209L4657a88233F1269B0477
$$ -285691 129338 140094 -95009 -121629 -334261 59883 3209 37866 -188233 61269 20477
19282a84458C4773g9627A38002Q599d64543F1664R3647b75666A36382c57524A38933
$$ -184458 34773 -79627 138002 146601 -464543 61664 155311 -275666 136382 -357524 138933
19270b58335A260c18680B79644r4732a54668p5412l6441F5458a6918A00409I747
$$ -258335 1260 -318680 279644 184912 -154668 -230080 -266521 65458 -16918 100409 9747
19258c33316a06303c9756A9178G207d9654j28978Q3435m7047K06F7893a13782
$$ -333316 -106303 -39756 19178 7207 -49654 -178632 -95197 -142244 -142038 67893 -113782
19246A20384e2915r5302K6630G5164b26548C5184b88293h6086m3208o5505R1245
$$ 120384 -52915 -148217 -121587 75164 -226548 35184 -288293 -86086 -129294 -194799 -103554
19235a03554A18582c45586N3334N7704m539A06303c50513C65956b60473k1743
$$ -103554 118582 -345586 -292252 -234548 -239087 106303 -350513 365956 -260473 -282216
19225b82216j9272D1153b5676k1090q9118k48835B41639a19759p5361R0047G9870
$$ -282216 -301488 41153 -25676 -46766 -135884 -384719 241639 -119759 -195120 -105073 79870
19213a72472A91574c61530F7720a79509K6015k3366g3084p861n5793k16249a21101
$$ -172472 191574 -361530 67720 -179509 -153494 -176860 -73084 -80945 -136738 -352987 -121101
19201C3559N2772h7030j65991A5639d2106H6944a37369A35733c57179I4497M3255
$$ 33559 86331 -87030 -253021 15639 -42106 86944 -137369 135733 -357179 94497 137752
19190A37752c30531o9306J35610a2904A09447a06036A18201d38864K13506E5558
$$ 137752 -330531 -399837 -264227 -12904 109447 -106036 118201 -438864 -225358 55558
19179b11232G0842a54605P2269A82984g4068A1867c3153B80702i1156l9075B56302
$$ -211232 70842 -154605 -82336 182984 -74068 11867 -33153 280702 -91156 -130231 256302
19167A9992J34206b9080I4046Q112a75220B18934q9327a0280C2733P6571a257
$$ 19992 154198 -29080 94046 102158 -175220 218934 129607 -10280 32733 109304 -1257
19155e11449g0976l56468p3409A02702d01025A34080J51465a84895A59523d5507
$$ -511449 -70976 -427444 -500853 102702 -401025 134080 285545 -184895 159523 -45507
19144a13585H8826a53736C0059a00834M9574k85709k0027d2085C211J27566M6535
$$ -113585 88826 -153736 30059 -100834 -51260 -336969 -356996 -42085 3211 130777 177312
19133A77312c32031g5077B20456C4061g1281C98257j49752A08421m259c2305j8854
$$ 177312 -332031 -75077 220456 34061 -71281 398257 248505 108421 104162 -32305 -51159
19122e1159E2539k5228R766a52750G1473d8973C2244b2944k15165O2034L1767
$$ -51159 52539 27311 37077 -152750 71473 -48973 32244 -22944 -238109 -176075 -144308
19111a44308F07b1460K477E4855b24899A9609d06705I3838K01977L8965h2163
$$ -144308 607 -21460 -18983 54855 -224899 19609 -406705 93838 295815 334780 -82163
19099h7663j47161f1841A9237c3857j50170A96405r2866b35564A85619G5030a61610
$$ -87663 -234824 -61841 19237 -33857 -184027 196405 103539 -235564 185619 75030 -161610
19087A04805g4363j25013A11191e0308j77865d8899H0067a87131C02775c7493
$$ 104805 -74363 -199376 111191 -50308 -228173 -48899 80067 -187131 302775 -37493
19076d353B11791b78892i661m8718r3387k8853J3884G0226d49581K23693R9825
$$ -4353 211791 -278892 -9661 -58379 -151766 -180619 -166735 70226 -449581 -225888 -126063
19065a26063J5021A44466a54381A60914a26797J7640k71191A27565c73188a24762
$$ -126063 -111042 144466 -154381 160914 -126797 -109157 -380348 127565 -373188 -124762
19054B92198D082d9252B3210D724J24209M6078a08724B19935h9345D7034a02983
$$ 292198 4082 -49252 23210 4724 128933 175011 -108724 219935 -89345 47034 -102983
19042b0185j3001I7823q514a74799A73947j7709b0684B1905P5426a69871N2400
$$ -20185 -33186 97823 89309 -174799 173947 156238 -20684 21905 97331 -169871 -117471
19031a17471C81228B2701M18881j35264A05101D3484a35670j08297A30939b16328
$$ -117471 381228 22701 441582 306318 105101 43484 -135670 -243967 130939 -216328
19020c28498a2137r769j43126J2335q5763C6406M5585C7542r666a05119j53644
$$ -328498 -12137 -21906 -165032 -152697 -238460 36406 81991 37542 27876 -105119 -258763
19009b58763H9429a32696j40824a01458B39679a9411A43585c34275A21284c05470
$$ -258763 89429 -132696 -273520 -101458 239679 -19411 143585 -334275 121284 -305470
18998I1213d07111a65042e3122G5084L8999d54953C9170J1501M751a07316A32208
$$ 91213 -407111 -165042 -53122 75084 114083 -454953 39170 50671 55422 -107316 132208
18986F8243b67968b4562r3330j62463A60806g5950B10140F8807h532l54690c37
$$ 68243 -267968 -24562 -117892 -280355 160806 -75950 210140 68807 -8532 -363222 -337
18974E9872O255a0978j45257b6322k10923a15416a434r5483j70739B71769I1304
$$ 59872 66127 -10978 -156235 -26322 -237245 -115416 -1434 -96917 -267656 271769 91304
18962A40025C8757a2201j29246i543k94627D4363b4326j62708E993b6739j39928
$$ 140025 38757 -12201 -141447 -9543 -304170 44363 -24326 -187034 5993 -26739 -166667
18951a66667n1636R2298B5096a73388e8264K6173A33869a37935o7155A826O4986
$$ -166667 -218303 -126005 25096 -173388 -58264 -32091 133869 -137935 -205090 1826 66812
18940F6812e3078C1125i6770k3095A82146d023j58421N4556F9664d04250A5351
$$ 66812 -53078 31125 -96770 -119865 182146 -4023 -162444 -107888 69664 -404250 15351
18928A51744a68059p9539b9168C7230K5718e48594A32473b62605b6575n5928B17532
$$ 151744 -168059 -247598 -29168 37230 62948 -548594 132473 -262605 -26575 -82503 217532
18916A29283b28849G936b42743m1495i5405E2005d41536A12223H477d2879j82652
$$ 129283 -228849 7936 -242743 -284238 -95405 52005 -441536 112223 8477 -42879 -225531
18905b25531N5692B14930d66095a35156a3849C02614c54775B21563o6636J30719
$$ -225531 -169839 214930 -466095 -135156 -13849 302614 -354775 221563 154927 285646
18895B85646b46897J15369N4163l19529E9315k8221c40676D8246i1072j27959
$$ 285646 -246897 -131528 -77365 -396894 59315 31094 -340676 48246 -91072 -219031
18885b19031E5829J65193a99226A33965L0238p8347d082m2503m8294A81946o8449
$$ -219031 55829 221022 -199226 133965 164203 85856 -4082 -46585 -94879 181946 113497
18874A13497b34065a8540k98350F6209M0691c31315G8892A2820J11728b42531
$$ 113497 -234065 -18540 -316890 66209 106900 -331315 78892 12820 124548 -242531
18863C9496b65026H8146f2539j35583a0723j09593r237E8650a33322a3183J603
$$ 39496 -265026 88146 -62539 -198122 -10723 -120316 -129553 58650 -133322 -13183 -11580
18852a1580j13886c5266B52412a98802D0623j0301a81391f2795D7485B810c45541
$$ -11580 -125466 -35266 252412 -198802 40623 30322 -181391 -62795 47485 2810 -345541
18840b00084m952M8516F4341d2003C243c10670J42593f7184I1281R2433a60811
$$ -200084 -205036 -156520 64341 -42003 3243 -310670 -168077 -67184 91281 183714 -160811
18828A63932d10030a03564A03412A2259a2070k64707J16613J0523A77670J03007
$$ 163932 -410030 -103564 103412 12259 -12070 -276777 -160164 -149641 177670 280677
18818B80677e8343O139A74112a23252D01558d4147C68500e5561E3875J71841J60200
$$ 280677 -58343 -52204 174112 -123252 401558 -44147 368500 -55561 53875 225716 385916
18807C85916a23531A22176J82549I3464a14165N2655j87826g0001A25848j0856
$$ 385916 -123531 122176 304725 93464 -114165 -61510 -249336 -70001 125848 114992
18797A14992a46515M3800e059l29403o1554a8562o3293H7159d4568q7655A01266
$$ 114992 -146515 -102715 -5059 -334462 -396016 -18562 -81855 87159 -44568 -132223 101266
18785b20088C01206h9038M1349A23054b65389g5234H9161b31596a1075q565j11442
$$ -220088 301206 -89038 -47689 123054 -265389 -75234 89161 -231596 -11075 -19640 -131082
18774a31082M1772B00803a83473P0065I6275B8727b80734a01445j6351b6060l38623
$$ -131082 -89310 200803 -183473 -113408 96275 28727 -280734 -101445 -117796 -26060 -364683
18763c64683A41912a86258B52389a12598K4411A5850Q5950l6546k6082d3204p3348
$$ -364683 141912 -186258 252389 -112598 -88187 15850 101800 65254 39172 -43204 -116552
18752a16552A22359g7918B70976m2161b42492A20353b58630F5664q575h8869j37856
$$ -116552 122359 -77918 270976 228815 -242492 120353 -258630 65664 57089 -88869 -226725
18741b26725c2816A64250F5225h0890H5283a73484I60L3805K3819K22458C5259
$$ -226725 -32816 164250 65225 -80890 85283 -173484 960 34765 58584 281042 35259
18729a1533j7212l7177b137c1k81009A8804H310B829J50831b47153c7752E3419
$$ -11533 -28745 -65922 -2137 -31 -281040 18804 8310 2829 153660 -247153 -37752 53419
18716b36194r2947C7503A3186b28058b6448j85788l5868j32355d0354H2489Q2558
$$ -236194 -329141 37503 13186 -228058 -26448 -212236 -248104 -380459 -40354 82489 165047
18705A65047E7242B083a7950j53362H5328P8903f1871p5835C16912A27127m6080
$$ 165047 57242 2083 -17950 -171312 85328 164231 -61871 -137706 316912 127127 81047
18694H1047a4949j78579a5535E0940e5225D2659G457L1710A1105a0187A16931
$$ 81047 -14949 -193528 -15535 50940 -55225 42659 7457 39167 11105 -10187 116931
18682B23154m4470A6990c5593j13900k89192B8316i3068o6337b7991n4942B57206
$$ 223154 178684 16990 -35593 -149493 -438685 28316 -93068 -159405 -27991 -82933 257206
18670B29490a90440A43272a92768p6967d5874l23383a3408A09557b21164f794
$$ 229490 -190440 143272 -192768 -269735 -45874 -369257 -13408 109557 -221164 -6794
18659a96119d5210B6415b4152j52476A69310p6702a40657D132c1131j41612j44298
$$ -196119 -45210 26415 -24152 -176628 169310 92608 -140657 4132 -31131 -172743 -317041
18648c17041Q6611B334f15608I5g7651l8728C14101b65975A87277c1116p2957
$$ -317041 -230430 2334 -615608 95 -77651 -116379 314101 -265975 187277 -31116 -104073
18637a04073J4606p8366b4152l97499b03590A03232g0795r0214P5857j2345B41787
$$ -104073 -89467 -167833 -24152 -421651 -203590 103232 -70795 -161009 -85152 -97497 241787
18625a7303k61007J19330j32846F1881R3698J24127b63135f6043A68889m6359
$$ -17303 -278310 -158980 -291826 61881 155579 279706 -263135 -66043 168889 122530
18615A22530g5295j59924k27600G7418N9065C0483c4910A75396a82313A80673
$$ 122530 -75295 -235219 -462819 77418 136483 30483 -34910 175396 -182313 180673
18604H7328b49963H1284a30856m9785A88163b0699j71945O1004A12505h8377j97335
$$ 87328 -249963 81284 -130856 -180641 188163 -20699 -192644 -131640 112505 -88377 -285712
18593b85712a39216D2151a44093f1061j29907c9755A40752g9012o1436k35876
$$ -285712 -139216 42151 -144093 -61061 -190968 -39755 140752 -79012 -140448 -376324
18583c76324A76349c3908f682l8836A19336c61872j8209D4278J23478F1291a79449
$$ -376324 176349 -33908 -6682 -45518 119336 -361872 -380081 44278 167756 61291 -179449
18571h6437H0025b9194G9687O0669h1093A85129b36172A09437c0581A47646b95715
$$ -86437 80025 -29194 79687 140356 -81093 185129 -236172 109437 -30581 147646 -295715
18559A05277D898b44874b8048C3108b90509J24919I9731D1241d38n9339j92369
$$ 105277 4898 -244874 -28048 33108 -290509 -165590 99731 41241 -438 -59777 -252146
18548b52146j71628F8559c36625A28559h494a784C45152H2095J7205b97511a33289
$$ -252146 -423774 68559 -336625 128559 -8494 -1784 345152 82095 99300 -297511 -133289
18536a4545A91037g0795A71572a10945j11447j44806A05027D7405b50960a14617
$$ -14545 191037 -70795 171572 -110945 -222392 -367198 105027 47405 -250960 -114617
18525a85089G4090Q3777G5082a82489A57037l0600A1045K21332c97019A36962
$$ -185089 74090 157867 75082 -182489 157037 126437 11045 232377 -397019 136962
18514A90713l7908F9145d4282A45729a03759M0827C3389i9943A20823J03376j8851
$$ 190713 152805 69145 -44282 145729 -103759 -62932 33389 -99943 120823 224199 205348
18503B05348r0307h6755A89624b3473j90838A2172J82735G5943g5390k64392J64241
$$ 205348 115041 -86755 189624 -23473 -214311 12172 194907 75943 -75390 -339782 -175541
18492a75541j36734D30259A4485J22224C2096j3279K10105a03257q1625C67356
$$ -175541 -312275 430259 14485 136709 32096 18817 228922 -103257 -184882 367356
18481b85141H8624M4317b12417A73695a16739c6498a5962j6523q3442d087k675
$$ -285141 88624 132941 -212417 173695 -116739 -36498 -15962 -32485 -115927 -4087 -6762
18470f762j23539M1508A5207b50688H9474d9392j66442Q0976A45901g3256F9357
$$ -6762 -130301 -88793 15207 -250688 89474 -49392 -215834 -134858 145901 -73256 69357
18458a70066d4747m5807k1354M4232l2305F4782a49433A00927Q5328i9512m8833
$$ -170066 -44747 -90554 -111908 -67676 -99981 64782 -149433 100927 186255 -99512 -148345
18447a48345B37702i5023A5398a17325p5666c6888j64641R4723F6219a36893e0612
$$ -148345 237702 -95023 15398 -117325 -192991 -36888 -201529 -106806 66219 -136893 -50612
18435i8004p0696A58254d9628l37556a51788A0004b21783e6346H8104g1635p5901
$$ -98004 -168700 158254 -49628 -387184 -151788 10004 -221783 -56346 88104 -71635 -147536
18424a47536B07128a54025j03670F0395b08102L2582J4929C12404j42853C0392
$$ -147536 207128 -154025 -257695 60395 -208102 -175520 -160591 312404 169551 30392
18413E8035L351a11517A37809e37256h4134C4393c8291l18470a8724A76064q5613
$$ 58035 61386 -111517 137809 -537256 -84134 34393 -38291 -356761 -18724 176064 90451
18402I0451f8625A08292K02090F5616R6836M9897q4363j4087J83866H302b17108
$$ 90451 -68625 108292 310382 65616 162452 212349 127986 113899 297765 8302 -217108
18390h6554C8610a29753f3976j0640k94013A7650b00833L0290j14155e7637j22082
$$ -86554 38610 -129753 -63976 -74616 -368629 17650 -200833 -170543 -284698 -57637 -179719
18379a79719F4176O98a61170H4176d07358b01613f7705k8471a7616l1453B92633
$$ -179719 64176 64874 -161170 84176 -407358 -201613 -67705 -96176 -17616 -49069 292633
18367I3553R5d3126j85472J05476l3366J7593A35181d7826B04848o8382P7744
$$ 93553 93648 -43126 -228598 -123122 -156488 -138895 135181 -47826 204848 136466 214210
18356B14210p8073i6137E2811d71859a29379A50847K3934a79053n6739g3571k7338
$$ 214210 136137 -96137 52811 -471859 -129379 150847 174781 -179053 -235792 -73571 -100909
18345a00909p8715B5326a21463N601j09609a5934F732J18503a76390k02849h732
$$ -100909 -179624 25326 -121463 -115862 -225471 -15934 6732 125235 -176390 -379239 -8732
18333a75258j1717f2460p0486j24797c2375j57258A5914J26694f8408r7331k1086
$$ -175258 -186975 -62460 -132946 -257743 -32375 -189633 15914 142608 -68408 -165739 -186825
18322a86825J2211d8402n730a8579j29524C34100A00311l7176b80694a12023B0407
$$ -186825 -174614 -48402 -54132 -18579 -148103 334100 100311 63135 -280694 -112023 20407
18310b75313f736j25080N2795G0565M4341J98533G0753f3365A76411f4009j25767
$$ -275313 -6736 -131816 -79021 70565 114906 313439 70753 -63365 176411 -64009 -189776
18299a89776J8339o0705C1265a7275D1645J68617a72138b6665r7801B22415a32376
$$ -189776 -171437 -232142 31265 -17275 41645 210262 -172138 -26665 -124466 222415 -132376
18287b0956A28833F1622b22357Q5571L1318b0668A13136c15172C50087a94354
$$ -20956 128833 61622 -222357 -136786 -105468 -20668 113136 -315172 350087 -194354
18276a36208A52919a37867J2066A23234C7965a29640l76140O2129b8151l10450
$$ -136208 152919 -137867 -125801 123234 37965 -129640 -505780 -443651 -28151 -338601
18266c38601C8453d43824a91857F2773L4958a77345K8334f0435A09104c81839
$$ -338601 38453 -443824 -191857 62773 97731 -177345 -149011 -60435 109104 -381839
18255A31262a64599RC8957f8313B30049n7628e3464D14328d0476q5106I2716J23617
$$ 131262 -164599 -164590 38957 -68313 230049 172421 -53464 414328 -40476 -125582 92716 216333
18243B16333g3568A80434d0548E3708R1751a56776c8461A9509d02737b3575l4795
$$ 216333 -73568 180434 -40548 53708 145459 -156776 -38461 19509 -402737 -23575 -58370
18232e8370j17689a6608j1819o947n6241E0751A9297K01544m8970a1483j58040
$$ -58370 -176059 -16608 -28427 -35374 -91615 50751 19297 220841 171871 -11483 -169523
18221a69523j670A24039d8591b2680A59034j2054L3180a89167C46805K41960c45101
$$ -169523 -171193 124039 -48591 -22680 159034 146980 180160 -189167 346805 588765 -345101
18209a66302B30118D3855b90251E4320j9380c03552c8435A81742a78489e2779
$$ -166302 230118 43855 -290251 54320 34940 -303552 -38435 181742 -178489 -52779
18198C45544a11625A42043i0658A26150b93762F8208b14481j41448Q5851a07223
$$ 345544 -111625 142043 -90658 126150 -293762 68208 -214481 -355929 -270078 -107223
18187a64115O2819B3913J19377a02817j26359k2872C3349O7182a12173I599K57791
$$ -164115 -101296 23913 143290 -102817 -229176 -252048 33349 100531 -112173 9599 267390
18176B67390b58978J11603D5097a70963j861a4942C04188a92556e3715I2645J83094
$$ 267390 -258978 -147375 45097 -170963 -172824 -14942 304188 -192556 -53715 92645 275739
18165B75739A28920a03653j6437K6011d856n3012A80291c10885B429J81528O3235
$$ 275739 128920 -103653 -120090 -94079 -4856 -57868 180291 -310885 2429 183957 247192
18154B47192i00k00075J4418h173j33904K6281e4178k96573F2471a27796o8132
$$ 247192 -900 -200975 -186557 -8173 -142077 -115796 -54178 -350751 62471 -127796 -195928
18143a95928d9349j56120O9497j68675f9552i776A41393a65049k1465j8656B56712
$$ -195928 -49349 -205469 -135972 -304647 -69552 -9776 141393 -165049 -186514 -205170 256712
18131a82696I6198a96140L862h3853A60410b9309m4031B04947d12205e8866j83816
$$ -182696 96198 -196140 -192278 -83853 160410 -29309 -73340 204947 -412205 -58866 -242682
18120b42682H963O782p586N0488K33431b4759A57711j8329d14234C10896a57175
$$ -242682 8963 15745 8159 58647 292078 -24759 157711 139382 -414234 310896 -157175
18108D26909A775N9218a9064B15059I9131b3287I8431c57174f0340A0253a82113
$$ 426909 1775 60993 -19064 215059 99131 -23287 98431 -357174 -60340 10253 -182113
18096d4802m0435j8834D9802d6333m3698H8970b51742I146J89898m0570A1871
$$ -44802 -85237 -104071 49802 -46333 -90031 88970 -251742 9146 199044 158474 11871
18084a71815O9771D9738a30427F0570a5537r8996k6061k65838B0814Q4087a39986
$$ -171815 -102044 49738 -130427 60570 -15537 -114533 -140594 -406432 20814 104901 -139986
18072A56843Q9806h5367j51072h6880B16730b58376R024A26385C6538a09271G7069
$$ 156843 246649 -85367 -236439 -86880 216730 -258376 -249352 126385 36538 -109271 77069
18060A32040C2043B174K74553B8523J53456c2342j15084A74247d33008h1490I0344
$$ 132040 32043 2174 276727 28523 181979 -32342 -147426 174247 -433008 -81490 90344
18048c7359G9812R316R7994B0271i7846B20381C8988b16692J4603A10918n4445
$$ -37359 79812 89128 187122 20271 -97846 220381 38988 -216692 -202089 110918 56473
18037E6473a18278j03147D9733L0629f6745j4718C33923b81971a624j43031M9161
$$ 56473 -118278 -221425 49733 80362 -66745 -81463 333923 -281971 -1624 -144655 -95494
18026i5494C8767M3090c55714g786k93938l6440a51450b5668j39127l0405Q7184
$$ -95494 38767 81857 -355714 -7786 -301724 -338164 -151450 -25668 -164795 -195200 -108016
18015a08016j92116R8080E4588b72937h535j36199j4382d6075m4441p8382L2653
$$ -108016 -300132 -202052 54588 -272937 -8535 -144734 -159116 -46075 -90516 -168898 -136245
18004a36245B94521b14730i1511k67126a16444A17502N9073D9598c9332B31576
$$ -136245 294521 -214730 -91511 -358637 -116444 117502 176575 49598 -39332 231576
17993a21584A11657c0847C226c1571o5600r5825B24055G7642j5547b72572D1942
$$ -121584 111657 -30847 3226 -31571 -97171 -192996 224055 77642 62095 -272572 41942
17981a37780r1935A3054J18338f1987A09794J15373a58495a8965j0481m9654A38688
$$ -137780 -229715 13054 131392 -61987 109794 225167 -158495 -18965 -29446 -79100 138688
17969f8978o3856N9419K5763k04474a8723p5278A10067K35274e8806F3580f4162
$$ -68978 -132834 -73415 -47652 -252126 -18723 -94001 110067 345341 -58806 63580 -64162
17957a44101e9932K3447B44724B2110f3367B20829a90011i2055F5584J08302j8726
$$ -144101 -59932 -36485 244724 22110 -63367 220829 -190011 -92055 65584 173886 155160
17946A55160j0759K9736a51027F1567a82651F8875a23509K4522A75742m3341J0294
$$ 155160 144401 174137 -151027 61567 -182651 68875 -123509 -98987 175742 132401 142695
17935A42695b60210C2287b4240A8737g7815C0237a74599D15572E6937J5469a37215
$$ 142695 -260210 32287 -24240 18737 -77815 30237 -174599 415572 56937 72406 -137215
17923c30172b6156j00886A54343a67367J9816A77056Q8638g2391j2680D042L31172
$$ -330172 -26156 -127042 154343 -167367 -147551 177056 265694 -72391 -85071 4042 335214
17912C35214a38730G1000i7389I5048a84071c0377j49594m6559K1478i6673k8454
$$ 335214 -138730 71000 -97389 95048 -184071 -30377 -179971 -226530 -205052 -96673 -125127
17901a25127L2922A8174K09311d4466i555A03365a14587G6784O5636b23331r2791
$$ -125127 -92205 18174 227485 -44466 -9555 103365 -114587 76784 142420 -223331 -316122
17890c16122e0221j58468B87920n4781d8527j27919E9264a86752P8964B99717
$$ -316122 -50221 -208689 287920 233139 -48527 -176446 59264 -186752 -107788 299717
17879d8176A129J95905G4449O2299M8905A826a85315I5525k1196J88864c0459
$$ -48176 1129 197034 74449 136748 185653 1826 -185315 95525 74329 263193 -30459
17867A3557q38K5673g3600L4015C32806j09846E4892R1987E0563P2252a61405
$$ 13557 12719 38392 -73600 -39585 332806 222960 54892 146879 50563 122815 -161405
17855c71901f6431L408o0869b1314H5420c63282b5366k9558A9645a81102n4117
$$ -371901 -66431 -63023 -123892 -21314 85420 -363282 -25366 -54924 19645 -181102 -235219
17844b35219B0958J07462a1763j69208e6201j4708A25345r540g207r4360k52100
$$ -235219 20958 128420 -11763 -180971 -56201 -70909 125345 115805 -7207 -101567 -353667
17833c53667J30799Q9903A5737b87967i3106k17602J9048A43265k0762a09742
$$ -353667 -222868 -132965 15737 -287967 -93106 -310708 -291660 143265 122503 -109742
17822D2548a75652C77053a3363A41583a72839N7321A19740M5790a5673j83487
$$ 42548 -175652 377053 -13363 141583 -172839 -115518 119740 165530 -15673 -199160
17812a99160N9083K0213B12255b14o8295n7321C6730b2932R454k8461E8945g9757
$$ -199160 -140077 -119864 212255 -214 -68509 -125830 36730 -22932 -13478 -41939 58945 -79757
17799B90277j42690a49518b8957C1861R5892j8157g1215j04144l2907A23814b62270
$$ 290277 147587 -149518 -28957 31861 127753 109596 -71215 -175359 -208266 123814 -262270
17787a7854J262l5064J2854A5485N4518B1047b7188q3925j34959B78929N3489
$$ -17854 -16592 -51656 -38802 15485 70003 21047 -27188 -111113 -246072 278929 332418
17776C32418b19839N4686d7472j54630F905a29628B37022b2539j76906A80308
$$ 332418 -219839 -165153 -47472 -202102 6905 -129628 237022 -22539 -199445 180308
17765B9567d8223j05117A756J976a01056F3978N3687j7988L08713A04844b11165
$$ 29567 -48223 -153340 1756 3732 -101056 63978 117665 99677 408390 104844 -211165
17753B54718m9401a23398A48930E0853e82412A64997k3966A2642f2640F085a68587
$$ 254718 205317 -123398 148930 50853 -582412 164997 141031 12642 -62640 6085 -168587
17741A84505A8596J90615d0309B48720b6197A34202C7872J17023a36134J9402
$$ 184505 18596 209211 -40309 248720 -26197 134202 37872 154895 -136134 -116732
17731a16732A17480m5101J050J26395p131n4439c53633b9730C6089e72B74525
$$ -116732 117480 72379 73429 199824 192693 138254 -353633 -29730 36089 -572 274525
17719c65755A18972b02898i6505A99595f7635H2926B1871b38825O3058G3875M4378
$$ -365755 118972 -202898 -96505 199595 -67635 82926 21871 -238825 -175767 73875 118253
17708A18253d11379C26643I7898b49584A59702d5647C67314l4291A66076O3513
$$ 118253 -411379 326643 97898 -249584 159702 -45647 367314 333023 166076 229589
17698B29589J81233p5482a44982b9596A69831a79059B11771b18890m501A96864
$$ 229589 410822 335340 -144982 -29596 169831 -179059 211771 -218890 -223391 196864
17687a41086A74472H1248a80319L0542A9682J35664g9157D9412J84063A4532L47431
$$ -141086 174472 81248 -180319 -149777 19682 155346 -79157 49412 233475 14532 361963
17676C61963f8788B313J009K46831R4963a5156l487H6098j523M719a32845B19268
$$ 361963 -68788 2313 3322 250153 345116 -15156 -18643 86098 84575 89294 -132845 219268
17663b89966h7900H3542k4227a5695B83928a23468A94146a69203K6512B71430
$$ -289966 -87900 83542 59315 -15695 283928 -123468 194146 -169203 -142691 271430
17652D94916e2766B39744A18514C1374e0988j14965D63917G2632a43661I6249
$$ 494916 -52766 239744 118514 31374 -50988 -165953 463917 72632 -143661 96249
17641b14007J778f8031A66093a48415B60569E0484k0267e2133A46027c7739r4116
$$ -214007 -212229 -68031 166093 -148415 260569 50484 30217 -52133 146027 -37739 -131855
17630a31855J8182b3712j7634A32625D0215J09290B721L36947f9319A2622b91883
$$ -131855 -113673 -23712 -41346 132625 40215 149505 2721 339668 -69319 12622 -291883
17618A61495d38365a56979A18715b15640B30799p5133p5180L8101a15906o1137
$$ 161495 -438365 -156979 118715 -215640 230799 155666 80486 118587 -115906 -177043
17608a77043F32N4918J42709J99224j43926H1967g5404F7749O5492L15728h9207
$$ -177043 632 55550 198259 397483 253557 81967 -75404 67749 133241 448969 -89207
17596A04818K1951J88934b53929E9934a42469k8226F5373K57733p6282a95728
$$ 104818 126769 315703 -253929 59934 -142469 -170695 65373 323106 246824 -195728
17585G0305N1952b7308l0474a9051B66421d1985A43779a80369f1369a6856j22498
$$ 70305 122257 -27308 -57782 -19051 266421 -41985 143779 -180369 -61369 -16856 -139354
17574a39354f9096I5193e563A55210E6070m35P7989A396R3482i1538A45012J73568
$$ -139354 -69096 95193 -5563 155210 56070 55635 133624 1396 94878 -91538 145012 318580
17562C18580C3905J72849L5373A16274G623N2115L48879a99772D5718J3051k963
$$ 318580 33905 206754 242127 116274 7623 59738 408617 -199772 45718 58769 55806
17551E5806a45633A33425J53075l4261A0716b8541k52379O9533h4678B83228E7118
$$ 55806 -145633 133425 286500 252239 10716 -28541 -280920 -211387 -84678 283228 57118
17539C8856a99973A42155A470L74461e1134B74516a724j89168F7711d3740k30155
$$ 38856 -199973 142155 1470 375931 -51134 274516 -1724 -190892 67711 -43740 -273895
17528b73895B13931I3811r177i9922g487A98536a46315A4452g1127A41875J41248
$$ -273895 213931 93811 84634 -99922 -7487 198536 -146315 14452 -71127 141875 283123
17517B83123q6329A636L37780g4391H1045d2489p1062A32789c7134Q877C31368
$$ 283123 196794 1636 339416 -74391 81045 -42489 -113551 132789 -37134 -28257 331368
17505d51831A52363L4692e2595E4839K21557h1043K4957D68833A02383P383J94980
$$ -451831 152363 187055 -52595 54839 276396 -81043 -56086 468833 102383 109766 304746
17494C04746F9639J90729O6894j23252b8577o6714A9959A470a89237D4539L52765
$$ 304746 69639 260368 327262 204010 -28577 -95291 19959 1470 -189237 44539 397304
17483C97304C2304P0674G180M94561k6844k04592C0279K17306b22001A85475p389
$$ 397304 32304 102978 7180 501741 474897 270305 30279 247585 -222001 185475 178086
17472A78086q2711N0085L1567N9463K61262B16133L0468n4531J53027m2805A00209
$$ 178086 95375 145460 177027 236490 497752 216133 246601 192070 345097 302292 100209
17460B105K37087J24547g4239A22857Q4061H2127L04459I0569K08734K29175k34904
$$ 2105 239192 363739 -74239 122857 206918 82127 386586 90569 299303 528478 293574
17449B93574J28505q0719N2824L6001J14015r9114q7615A65384E0330J11762j2672
$$ 293574 422079 341360 394184 430185 544200 445086 357471 165384 50330 162092 149420
17438A49420O3009D6229d4110E8987c0990A44364L02026j61154M5813A27001K2372
$$ 149420 212429 46229 -44110 58987 -30990 144364 446390 285236 331049 127001 149373
17427A49373J77784K0171j29591o5205n3919J88257E5242J24118J0388K00008
$$ 149373 327157 347328 217737 152532 98613 286870 55242 179360 189748 389756
17417C89756m0863J01642A54321L61873A63318g5499A89866P5406J93555m1707
$$ 389756 348893 450535 154321 516194 163318 -75499 189866 265272 458827 417120
17407D17120a38917C26908B0235M57870A54691G7214B3992J16225O9834P8516
$$ 417120 -138917 326908 20235 478105 154691 77214 23992 140217 210051 288567
17397B88567m2905j19384J0372O8317k3285m7386K56190a45510B68652O5465D6174
$$ 288567 245662 126278 136650 204967 181682 134296 390486 -145510 268652 334117 46174
17385B23000c381C5766J02822b03565C04737I9806D3402k968B38J5808J05225
$$ 223000 -3381 35766 138588 -203565 304737 99806 43402 40434 238 16046 121271
17374A21271C5275H332b387j0242B57544D7187J18396h395B74850j09501o4001
$$ 121271 35275 8332 -2387 -12629 257544 47187 165583 -8395 274850 165349 101348
17363A01348c9980C15462H5577B8307a46947o8673A17216K18720g9601B70382
$$ 101348 -39980 315462 85577 28307 -146947 -215620 117216 335936 -79601 270382
17352A53777L6222J7391H4552D0106K63306B8598J61069j3494J44002G7584Q7238
$$ 153777 189999 207390 84552 40106 303412 28598 189667 176173 320175 77584 164822
17341A64822k4124L02856d6015C3307L26900O3430o010A81434J38632q1025B1711
$$ 164822 140698 443554 -46015 33307 360207 423637 417627 181434 320066 239041 21711
17329D21545A91457p3771M7381G9050A0118a7433B45411J59194j21213q094j29395
$$ 421545 191457 117686 165067 79050 10118 -17433 245411 404605 283392 275298 145903
17318A45903K80498a88188A447K05707J57734d5753B2883J50769J92815l2765
$$ 145903 426401 -188188 1447 207154 364888 -45753 22883 173652 366467 333702
17308C33702l4862f3799A07545J57083J04011a27457I5426K37002A38108K61947
$$ 333702 298840 -63799 107545 264628 368639 -127457 95426 332428 138108 400055
17298D00055A86194i4863B53671A1052K62157I9872J217J37461g913D5618c5958
$$ 400055 186194 -94863 253671 11052 273209 99872 101089 238550 -7913 45618 -35958
17286G7030c5276e568D2652K40692r3877A9361J32887o016J26205A13416J40932
$$ 77030 -35276 -5568 42652 283344 189467 19361 152248 146232 272437 113416 254348
17275B54348k8799A03754j480K19477j07119J87838c6399A67401L7828r2633J63204
$$ 254348 225549 103754 102274 321751 214632 402470 -36399 167401 205229 112596 275800
17264B75800D9382k22L46853j63093A04874j1293J67607J06305A07889K28690
$$ 275800 49382 49160 396013 232920 104874 93581 261188 367493 107889 336579
17254C36579f8792A34724g135C57913B2715j0945J7597L06262e5011A92147J30528
$$ 336579 -68792 134724 -7135 357913 22715 11770 29367 335629 -55011 192147 322675
17243C22675J08886A30403g3159G8939O243J08307N3924J00956A55700J0032a49311
$$ 322675 431561 130403 -73159 78939 85182 193489 247413 348369 155700 165732 -149311
17231B68190A6794K22362I6711L10869l2219j58632g7367G8615K91596A31291
$$ 268190 16794 239156 96711 407580 375361 216729 -77367 78615 370211 131291
17220H2428J48948k8484K59938A31505J39772j12479L56529a9310m5559D2644
$$ 82428 231376 202892 462830 131505 271277 158798 515327 -19310 -64869 42644
17209D25963p1256p5484B4449K23475j9207a0518B38355R6053C9699J85691c1396
$$ 425963 354707 279223 24449 247924 228717 -10518 238355 334408 39699 225390 -31396
17197D6303j0161P3380P083M34470A98343a5812B46500a18999B40282A10377L19601
$$ 46303 36142 109522 116605 551075 198343 -15812 246500 -118999 240282 110377 429978
17186D29978F4830A0282g1714C08953J35918j6868k12380O5671P8767P5250j01332
$$ 429978 64830 10282 -71714 308953 444871 428003 215623 281294 360061 435311 333979
17175C33979j60271G2345M36575j490j61268o6673A28301L07708a3976q6450D5822
$$ 333979 173708 72345 508920 507430 346162 279489 128301 436009 -13976 -100426 45822
17163H0390L07602R42J7787A61770R8523L64744A11289k3669K4184K78871A49319
$$ 80390 387992 388934 406721 161770 260293 625037 111289 87620 111804 390675 149319
17151C31438j6884D7818K13973J17288k0936O3076J23507j02664m8673L5207A06252
$$ 331438 314554 47818 261791 379079 358143 421219 544726 442062 393389 428596 106252
17139C06420J93959F271K73019n2497H0046k2911L59511j29572L71098k49397
$$ 306420 500379 6271 279290 226793 80046 57135 416646 287074 658172 408775
17129D08775n5075j71188K65576n8981m0565K89941k95586A36440R3023J97716
$$ 408775 353700 182512 448088 389107 348542 638483 342897 136440 229463 427179
17119D27179J17997k68683r686r2034J3749J58939K05815p2449j91081J42897
$$ 427179 545176 276493 266807 174773 188522 347461 553276 480827 289746 432643
17109D32643J31634B00632L36538A85570P5479K6098J66920j16377K4811J91198
$$ 432643 564277 200632 537170 185570 261049 287147 454067 337690 362501 553699
17099E53699j98384O9139J6118j10018L09656k48691J37598j13525M7568j19242
$$ 553699 355315 424454 440572 330554 640210 391519 529117 415592 463160 343918
17089C43918K98637B15230J24521k7647L21928k65744J02652q2480J61073Q4929
$$ 343918 642555 215230 339751 312104 634032 368288 470940 388460 549533 634462
17079F34462j63620K3238H3848J24412K08976A19787M26223B19813J77839O5783
$$ 634462 470842 494080 83848 208260 417236 119787 546010 219813 397652 463435
17069D63435N6263N4449m828k75872N62502k17293k87561N0290J62586N7958k1153
$$ 463435 519698 574147 569319 293447 855949 638656 351095 401385 563971 621929 600776
17058F00776B49389M93707k97312k3803M93273C50541K54232K8027q8603j43256
$$ 600776 249389 743096 445784 421981 915254 350541 604773 632800 544197 400941
17048D00941K08351j96272M9026J38018M6538Q2402l25304L72568l02353Q9679
$$ 400941 609292 413020 462046 600064 646602 729004 403700 776268 473915 563594
17038E63594p7021L91058j24778K6375A06247M51775r5376o086K09626C15537
$$ 563594 486573 877631 752853 779228 106247 558022 462646 456560 666186 315537
17027F28235L41476m64597j052J25148j85554L3641K63618j77907L1627Q1417
$$ 628235 969711 505114 504062 629210 443656 477297 740915 563008 594635 676052
17017F76052j5179l2146L13390l14624j49413J66995J81114j67627J15230k86460
$$ 676052 660873 628727 942117 627493 478080 645075 826189 658562 773792 487332
17007D87332J26278J03346K8096N7512k17504J23897K49555k94763K0418j00113
$$ 487332 613610 716956 745052 802564 585060 708957 958512 663749 684167 584054
16997E84054M18174l13974j53819J26002Q7449j57555K68770J95028o7035j74017
$$ 584054 1002228 688254 534435 660437 747886 590331 859101 1054129 987094 813077
16987H13077j88707J78964J03080j12380j77043O5824J58703Q457L11070k36866
$$ 813077 624370 803334 906414 794034 616991 682815 841518 849975 1161045 924179
16977I24179j31881l43963L23588k53384M71891J52818r9348j74770J41403J9751
$$ 924179 792298 448335 771923 518539 990430 1143248 1043900 869130 1010533 1030284
16967A030284O3617K32283o22375K1102M17454q959j44776k5521j28679M5854
$$ 1030284 1093901 1326184 703809 724911 1142365 1133406 988630 963109 834430 880284
16957H80284Q4569J51463J40844j89616o9741K35221l1873q0647l38988N81386
$$ 880284 964853 1116316 1257160 1067544 997803 1233024 1201151 1120504 781516 1362902
16947A362902l83342K13850L2682n2262J06442L7145j54562J30222L27121l15467
$$ 1362902 979560 1193410 1226092 1173830 1280272 1317417 1162855 1293077 1620198 1304731
16937A304731j71321K16383k24981K02083j50505O00283k17631m58724N27530
$$ 1304731 1133410 1349793 1124812 1326895 1176390 1776673 1559042 1100318 1627848
16928A627848k32365m85464N92702j70386j70689q6357M06919M5725q8054N7900
$$ 1627848 1395483 910019 1502721 1332335 1161646 1075289 1482208 1527933 1439879 1497779
16918A497779K01863l61228J95627k00614M37898m29253L30093j4704K66010k37494
$$ 1497779 1699642 1338414 1534041 1333427 1771325 1342072 1672165 1657461 1923471 1685977
16908A685977j725J6574j11658r9739J43442N7655j91394J79336J43412j3067
$$ 1685977 1684252 1700826 1589168 1489429 1632871 1690526 1499132 1678468 1821880 1808813
16898A808813N3068l12460K11925r110m0879L17814j89506q6619J76544K30049
$$ 1808813 1861881 1549421 1761346 1752236 1711357 2029171 1839665 1753046 1929590 2159639
16888B159639j96021J46477L2922p7866P8525N63016k63595P4483p18683M15013
$$ 2159639 1963618 2110095 2143017 2065151 2143676 2706692 2443097 2517580 1798897 2213910
16878B213910k10158L14183K57820k51960j46496k209p6151M38566O9899M7770
$$ 2213910 2003752 2317935 2575755 2323795 2177299 2175090 2098939 2537505 2607404 2655174
16868B655174k78204L46648j88319j0895K89193M23838p39330K72200k27440N52974
$$ 2655174 2376970 2723618 2535299 2524404 2813597 3237435 2498105 2770305 2542865 3095839
16858C095839l05728N965J46963J14737j35853J18153L75074n0669j47540m2222
$$ 3095839 2790111 2796076 2943039 3057776 2921923 3040076 3415150 3364481 3216941 3174719
16848C174719j31316L15782L65125l77524K04202J00674K65883l78053R9833M59519
$$ 3174719 3043403 3359185 3724310 3346786 3550988 3651662 3917545 3539492 3639325 4098844
16838D098844N9827k60226K04173L8107M46863l04447M2206R1262O1372K54018
$$ 4098844 4158671 3898445 4102618 4140725 4587588 4283141 4325347 4416609 4477981 4731999
16828D731999p4731j02727j27121K07971O77172k19554K25857J27360r9985l2224
$$ 4731999 4657268 4554541 4427420 4635391 5312563 5093009 5318866 5446226 5346241 5314017
16818E314017k46101O44465j71524N37040K69580k98145J54591J73813K32959
$$ 5314017 5067916 5712381 5540857 6077897 6347477 6049332 6203923 6377736 6610695
16809F610695R5498o4674K71968K88089O27850n32564K36643J76396K85984J03947
$$ 6610695 6706193 6641519 6913487 7201576 7829426 7296862 7533505 7709901 7995885 8099832
16799H099832K43773M80622j73101N67691l31634O31975M5576K73589M36230O2760
$$ 8099832 8343605 8824227 8651126 9218817 8887183 9519158 9564734 9838323 10274553 10337313
16789A0337313L29739M84659k30150P44712J78909N53951p6873L59737O90518
$$ 10337313 10667052 11151711 10921561 11666273 11845182 12399133 12322260 12681997 13372515
16780A3372515L03521N22301K63745K68014J093285l1219O80296P75862M52854
$$ 13372515 13676036 14198337 14462082 14730096 15823381 15792162 16472458 17248320 17701174
16771A7701174M54776O56012Q96060L96611R36740Q68051N62296J003437Q99266
$$ 17701174 18155950 18811962 19708022 20104633 21041373 21909424 22471720 23475157 24374423
16762B4374423J259829O21171J162570J525774R99562J269223J823433J161686
$$ 24374423 25634252 26255423 27417993 28943767 29943329 31212552 33035985 34197671
16754C4197671J309003J789246J759388J806989J810881K048870K190370K999858
$$ 34197671 35506674 37295920 39055308 40862297 42673178 44722048 46912418 49912276
16746D9912276K584191L033781K869364K766946L481259L983699L763163M238220
$$ 49912276 52496467 55530248 58399612 61166558 64647817 68631516 72394679 76632899
16738G6632899M578317M538827N325196N727256N728749O170065O227559P115738
$$ 76632899 81211216 85750043 91075239 96802495 102531244 108701309 114928868 122044606
16730A22044606O996563P076438P453300P748767P199697P936665O799040O408708
$$ 122044606 129041169 136117607 143570907 151319674 158519371 166456036 173255076 179663784
16722A79663784N561018M953287L788832K335602J407054n6122j184165k761890
$$ 179663784 185224802 190178089 193966921 196302523 197709577 197653455 196469290 193707400
16714A93707400l840711m999147n703865o577966p127979p154924q007685p496272
$$ 193707400 189866689 184867542 179163677 172585711 165457732 158302808 150295123 142798851
16706A42798851p846790p181523p415959p163093o408666o521896n617056n893619
$$ 142798851 134952061 127770538 120354579 113191486 106782820 100260924 94643868 88750249
16698H8750249n110394n002765m231086m774022l691898l450384l694122l180920
$$ 88750249 83639855 78637090 74406004 69631982 65940084 62489700 58795578 55614658
16690E5614658k761015l021967k515805k147084k439554k234766j957887j784896
$$ 55614658 52853643 49831676 47315871 45168787 42729233 40494467 38536580 36751684
16682C6751684j591921j454036j935848j446178j154095j208789j166182j200455
$$ 36751684 35159763 33705727 31769879 30323701 29169606 27960817 26794635 25594180
16674B5594180j052689q22443j245685r00416m81874r87512n44773j001465n35195
$$ 25594180 24541491 23719048 22473363 21572947 21091073 20103561 19558788 18557323 18022128
16665A8022128p34619n82218j94934r95173k60574m85057o94765l24633k16190
$$ 18022128 17287509 16705291 16510357 15515184 15254610 14769553 14074788 13750155 13533965
16656A3533965n17937l27473m69993l06224n19086m43142J11933o86439K01787
$$ 13533965 13016028 12688555 12218562 11912338 11393252 10950110 11062043 10375604 10577391
16647A0577391o49752k57892k64236j90595j85660l02317k82782l06742N4307
$$ 10577391 9927639 9669747 9405511 9214916 9029256 8726939 8444157 8137415 8191722
16638H191722n09456j43400M7924l01904j79387j54746J55655l41849O5941n98771
$$ 8191722 7682266 7538866 7586790 7284886 7105499 6950753 7106408 6764559 6830500 6231729
16628F231729j32468m6550j60284l66455K51248J26183m43002m4730j00841j81130
$$ 6231729 6099261 6052711 5892427 5525972 5777220 5903403 5460401 5415671 5314830 5133700
16618E133700q1775R246k93311q439l9778j69871m44162P2916M8714j22594K49368
$$ 5133700 5051925 5061171 4767860 4759421 4719643 4549772 4105610 4178526 4227240 4104646 4354014
16607D354014j18784n98612J34545j70400J44947j96124J85067j97893j33418
$$ 4354014 4235230 3636618 3771163 3600763 3745710 3549586 3734653 3536760 3403342
16598C403342l15629l5527r2328M15901k16913o9220K76215m47133L68482l79968
$$ 3403342 3087713 3052186 2959858 3375759 3158846 3089626 3365841 2918708 3287190 2907222
16588B907222J21026l48415O6908l93403M81567n3701k17194q5654J22812N9826
$$ 2907222 3028248 2679833 2746741 2353338 2834905 2781204 2564010 2478356 2601168 2660994
16578B660994k09578l10682L88782k63122j29191k76122K72409k73865N39948
$$ 2660994 2451416 2140734 2529516 2266394 2137203 1861081 2133490 1859625 2399573
16569B399573k20943J22125k63762J74886k67831j13754L90550o74009M37479
$$ 2399573 2178630 2300755 2036993 2211879 1944048 1830294 2220844 1546835 1984314
16560A984314J63046l97732j58581K64105p4593j20877M29615n76948M34043l22018
$$ 1984314 2147360 1749628 1591047 1855152 1780559 1659682 2089297 1512349 1946392 1624374
16550A624374j08427J489Q361K55929k27674O0617M2570k0021o8812j32937K99214
$$ 1624374 1515947 1517436 1525797 1781726 1554052 1614669 1657239 1637218 1568406 1435469 1734683
16539A734683l27002q0327O2985Q8225j01138N9361Q5330J8923j98917k23736
$$ 1734683 1407681 1327354 1390339 1478564 1377426 1436787 1522117 1541040 1342123 1118387
16529A118387K32212m9298p3095O6432k73388j19871K82329j73258R5686j14189
$$ 1118387 1350599 1301301 1228206 1294638 1021250 901379 1183708 1010450 1106136 991947
16519I91947K67486l12858L09218j08479j92943j54570J90730R6768k43062J69637
$$ 991947 1259433 946575 1255793 1147314 954371 799801 990531 1087299 844237 1013874
16509A013874R6741N9335j51122r7089k9910k5560L97594n64366L04963m76975
$$ 1013874 1110615 1169950 1018828 921739 891829 866269 1263863 699497 1004460 527485
16499E27485M53465J47741k8847j59933J8356J16572k03845J42446q2229k66441
$$ 527485 980950 1128691 1099844 939911 958267 1074839 870994 1013440 931211 664770
16489F64770J90383j497C20647O94683D99249L47462J30090j66533J45040m70366
$$ 664770 855153 853656 320647 1015330 499249 846711 976801 810268 955308 484942
16479D84942L46487J075K56395k38977j03907K29764l12803O0531P1798O5230
$$ 484942 831429 832504 1088899 849922 746015 975779 662976 723507 795305 860535
16469H60535j48454K49175j42162n8969q5327P6220P6246K55220l17107n9000
$$ 860535 712081 961256 819094 760125 674798 751018 827264 1082484 765377 706377
16459G06377q0421K1679J89701B48577N16144q1344j57856K58830j29452M3723
$$ 706377 625956 647635 837336 248577 764721 683377 525521 784351 654899 698622
16449F98622n6162r0499J28042J50385k86338l4093p2632J99114o8228O5187j22900
$$ 698622 642460 551961 680003 830388 544050 509957 437325 636439 568211 633398 510498
16438E10498M5627k15304J36183k20926K84267k45979K50976J21737p7323j28875
$$ 510498 556125 340821 477004 256078 540345 294366 545342 667079 589756 460881
16428D60881j72259J55871O1389K8547j66348o8967J69900q3181Q3129j00526
$$ 460881 288622 444493 505882 534429 368081 299114 469014 385833 468962 368436
16418C68436L93685j00000j97365k058k28694L76920B39945K57030J15301R3952
$$ 368436 762121 662121 464756 462698 234004 610924 239945 496975 612276 706228
16408G06228A80651J90364J07418J3611k24976L36480j80632K61860B11780J22570
$$ 706228 180651 371015 478433 492044 267068 603548 422916 684776 211780 334350
16398C34350j0832K44796j14795M0549B37709K27293R2439k76257l5838K3777
$$ 334350 323518 568314 453519 494068 237709 465002 557441 281184 245346 269123
16388B69123j15721L63538l5550j55110A48598L54450B01286L88948j18203J8372
$$ 269123 153402 516940 481390 326280 148598 503048 201286 590234 472031 490403
16378D90403j99458J12171j96133p9304K96992R0405B39083L2565l6766K7350
$$ 490403 290945 403116 206983 127679 424671 515076 239083 271648 234882 262232
16368B62232K36582j87393K26632j76329D0745J61710r1622J5995J5845J597L04494
$$ 262232 498814 311421 538053 361724 40745 202455 110833 126828 142673 144270 448764
16357D48764j0894A00303B1143J88268R7474n9021L79167j38321j62188j39296
$$ 448764 437870 100303 21143 209411 306885 247864 627031 488710 326522 187226
16347A87226J14652D7154J16088J25071m5012K21251j36903B5893R6966K24407
$$ 187226 301878 47154 163242 288313 243301 464552 327649 25893 122859 347266
16337C47266d9104A60197d4144A7626J68202P2763J69026b144B82237K7547L3204
$$ 347266 -49104 160197 -44144 17626 185828 258591 427617 -2144 282237 309784 342988
16326C42988Q967j60739A71K82897j24022E1725J52156Q3648J67001A38513D1147
$$ 342988 351955 191216 171 283068 159046 51725 203881 287529 454530 138513 41147
16314a45643B20711K29389J2947h3866C97019b97368B62847L14809e4063A53983
$$ -145643 220711 450100 463047 -83866 397019 -297368 262847 577656 -54063 153983
16303G7032J4973L57029b7986B42551B9555a51803F1722a61618B18222J99087
$$ 77032 92005 449034 -27986 242551 29555 -151803 61722 -161618 218222 417309
16293D17309k01843a41201H8542a78617A70377J27780D0493K70772E6198J98221
$$ 417309 215466 -141201 88542 -178617 170377 298157 40493 311265 56198 254419
16283B54419F9048J06386c8994A85455M4101O8329F5106j1871K85152G0876M7240
$$ 254419 69048 175434 -38994 185455 229556 297885 65106 53235 338387 70876 118116
16272A18116M93929f4154B58932J86073j61474j25204J05360q5048l6235J05037
$$ 118116 612045 -64154 258932 445005 283531 158327 263687 178639 142404 247441
16262B47441l0323j8501a51118D55484d5837A07653a7605D2244j0777a43038B31776
$$ 247441 217118 198617 -151118 455484 -45837 107653 -17605 42244 31467 -143038 231776
16250A86789m9999K18951A06090J00177n7256N0611I1463M3118H764b4969q421
$$ 186789 136790 355741 106090 206267 149011 199622 91463 134581 8764 -24969 -33390
16239c3390o6263K6300a9889e924A57145M4165L38849H4542Q7871a13052F4213
$$ -33390 -99653 -73353 -19889 -5924 157145 201310 540159 84542 172413 -113052 64213
16227D02913j57531H1600N4120c786A30745R0137F9029N4813f1109A93490P3727
$$ 402913 245382 81600 135720 -3786 130745 220882 69029 123842 -61109 193490 267217
16216B67217d79863B3902b09013i61o492k1211A68371K39835C53P30418b82070
$$ 267217 -479863 23902 -209013 -961 -7453 -28664 168371 408206 353 730771 -282070
16204f7185I8060J72935J0632A01916N0754k1136K31901A71906c1967C29768a09415
$$ -67185 98060 270995 281627 101916 152670 131534 363435 171906 -31967 329768 -109415
16192C530L64357a77266B4264K75832j45638M3145J26669A49745Q5282q7782n1110
$$ 3530 367887 -177266 24264 300096 154458 197603 324272 149745 235027 147245 96135
16181I6135a78211B06533r5826J2716k4251L06193d7950k63336B66596J30407
$$ 96135 -178211 206533 110707 123423 99172 405365 -47950 -311286 266596 397003
16171C97003A18224A5721J63898a10006B35707F3371i8524k27119a14882C06774
$$ 397003 118224 15721 179619 -110006 235707 63371 -98524 -325643 -114882 306774
16160A12149m6685c41766a49523B76865j35342Q4628r6847g4703j01558o1388
$$ 112149 65464 -341766 -149523 276865 141523 226151 129304 -74703 -176261 -237649
16150b37649F5624c9671l36974A19328K01535L984o1382I3374d9656j05317A36020
$$ -237649 65624 -39671 -376645 119328 320863 324847 263465 93374 -49656 -154973 136020
16138e6556A44815O6809a85117I1525O2587i0660F0264j4843g4967C72424A80800
$$ -56556 144815 211624 -185117 91525 154112 -90660 60264 45421 -74967 372424 180800
16126B62290J14105m7001a52116j96097c3795K441k0284M24l354k5105A66413
$$ 262290 376395 329394 -152116 -348213 -33795 -31354 -51638 -51214 -54568 -79673 166413
16114c00490j1500A58339b38578O9109D2581L9379h812l4616A77142N4813i4097
$$ -300490 -311990 158339 -238578 -169469 42581 81960 -8812 -43428 177142 231955 -94097
16102B69656a0230B08431E5349K81262A67276h7916A29236A725J1464d8637I7835
$$ 269656 -10230 208431 55349 336611 167276 -87916 129236 1725 13189 -48637 97835
16090E7159c7992l7169K2907A08442d4720F2479a46352b1014i077j16677H9003
$$ 57159 -37992 -75161 -52254 108442 -44720 62479 -146352 -21014 -9077 -125754 89003
16078d0043j60783g1383j74356A6511a31325A62167f0571C55226B6329J69315
$$ -40043 -200826 -71383 -245739 16511 -131325 162167 -60571 355226 26329 195644
16068A95644e3981k30493a34030l2296r3022a4396F8587N6567e8255r3558P2115
$$ 195644 -53981 -284474 -134030 -166326 -259348 -14396 68587 125154 -58255 -151813 -79698
16057g9698B37797E1667N3302K19129p7079a2476C99364a18120C1899J85789a66302
$$ -79698 237797 51667 104969 324098 247019 -12476 399364 -118120 31899 217688 -166302
16045e8296g856j18429A90531f2118j65638B6031I0J7932h159D8406K50926b71779
$$ -58296 -7856 -126285 190531 -62118 -227756 26031 90 18022 -8159 48406 299332 -271779
16032E7253K71105j14922J48349e6288k83927l5727G3021M7220A1873D840d1418
$$ 57253 328358 213436 361785 -56288 -340215 -375942 73021 120241 11873 4840 -41418
16020A08277a93930R920c3896A94322b8381A54030a86446N9913J8211k09315J55264
$$ 108277 -193930 -184010 -33896 194322 -28381 154030 -186446 -126533 -108322 -317637 -162373
16009a62373F5126b79233j25045f0294F3705b40388C7606I145b04180A65657h7767
$$ -162373 65126 -279233 -404278 -60294 63705 -240388 37606 9145 -204180 165657 -87767
15997I5475a77205j11360J18764C1590F317i6787c1586A71592a26090K3375F6803
$$ 95475 -177205 -288565 -169801 31590 6317 -96787 -31586 171592 -126090 -102715 66803
15985B51801G6740g1571H5187J73612G0766J74246e3330n0159j30290L6743l1788
$$ 251801 76740 -71571 85187 258799 70766 245012 -53330 -103489 -233779 -197036 -228824
15974b28824d4393A47281a63878n1806d2219E4458Q0115o3077F516P6468a1743
$$ -228824 -44393 147281 -163878 -215684 -42219 54458 134573 71496 6516 82984 -11743
15962a71135M322j23620F6204a19930E1159J3563J11757f2772j98046H2298b99790
$$ -171135 -166813 -290433 66204 -119930 51159 64722 176479 -62772 -260818 82298 -299790
15950c78201C2671q789c7404B61883m8851b29422j24287C0186d4169a5928G4623
$$ -378201 32671 23882 -37404 261883 213032 -229422 -353709 30186 -44169 -15928 74623
15938C0385N833n50a76630C27395a65415b4539A10790l6672c4154l5180k83396
$$ 30385 36218 35668 -176630 327395 -165415 -24539 110790 74118 -34154 -69334 -352730
15927c52730a9324r5339A80621C8428J30009a03590k9983n7677C22215a64010
$$ -352730 -19324 -114663 180621 38428 168437 -103590 -133573 -191250 322215 -164010
15916a92490O118D1135M4102i6144k42452A4118N3356J26020i7944N219A3124
$$ -192490 -186372 41135 85237 -96144 -338596 14118 67474 193494 -97944 -92725 13124
15904B71104m228l0269a01625b7086a1625k1480A4309a35889J6112A03408b23968
$$ 271104 266876 236607 -101625 -27086 -11625 -33105 14309 -135889 -119777 103408 -223968
15892c0221C18339p9925f0423D00758a12556K3400B2232g8167K6476F9227K6043
$$ -30221 318339 238414 -60423 400758 -112556 -89156 22232 -78167 -51691 69227 95270
15881I5270J599d6469l37497Q3324j00813J38218A53052Q8343p317h2857j05280
$$ 95270 96869 -46469 -383966 -300642 -401455 -263237 153052 241395 234078 -82857 -188137
15870a88137n8753R6678o1589A76625a34994G2434K6030K3615b29855B2670q354
$$ -188137 -246890 -150212 -211801 176625 -134994 72434 98464 122079 -229855 22670 14316
15859A4316c00487a46964B88510c60893a72263I739a8416l22713b1604B6853Q1478
$$ 14316 -300487 -146964 288510 -360893 -172263 9739 -18416 -341129 -21604 26853 108331
15848A08331a48203B06148d1873J5835j07822c1681j33119p8636A04193h548I4752
$$ 108331 -148203 206148 -41873 -26038 -133860 -31681 -164800 -243436 104193 -8548 94752
15836I3383a06701C00315a12936E1424K12401f1276k43393f4309l75117b16881
$$ 93383 -106701 300315 -112936 51424 263825 -61276 -304669 -64309 -439426 -216881
15825a18445J8329H0167k8923a20905d445k91211F8083a42735j42360J21713f5070
$$ -118445 -100116 80167 51244 -120905 -4445 -295656 68083 -142735 -285095 -163382 -65070
15813f2327A42119a99150N2513B70561n5735b04778e4641B4739J84534r4908l2224
$$ -62327 142119 -199150 -146637 270561 214826 -204778 -54641 24739 209273 114365 82141
15802H2141J3952b1702q0044B7632q084g288j8603l26886h0848B19907a81246
$$ 82141 96093 -21702 -101746 27632 19548 -7288 -25891 -352777 -80848 219907 -181246
15790A00820N6958j8078F4049a42253D0033b95713j14464J82455j43132J78143
$$ 100820 157778 139700 64049 -142253 40033 -295713 -410177 -227722 -370854 -192711
15780a92711R4498m9419A69477a79062F17c0984j68217B39118c60447B711a2261
$$ -192711 -98213 -147632 169477 -179062 617 -30984 -199201 239118 -360447 2711 -12261
15768g6878C9383f5463j32474D23733G1485R4286K4008E1137o721c52853H9788
$$ -76878 39383 -65463 -197937 423733 71485 165771 189779 51137 44416 -352853 89788
15756e9460a4519k2196q4109F6060a67229C02484j09378C249L1408L00666j01658
$$ -59460 -14519 -36715 -120824 66060 -167229 302484 193106 3249 34657 335323 233665
15745B33665b25567D09832E3101b24287Q8984O185f4238j87017A03605O5627a99163
$$ 233665 -225567 409832 53101 -224287 -135303 -129118 -64238 -251255 103605 169232 -199163
15733B69821C2545i6904L5585A01205c16397A26190l3173a12596A00342a54375
$$ 269821 32545 -96904 -61319 101205 -316397 126190 93017 -112596 100342 -154375
15722h592k05970j75387F3357J252a46095j48665A83545e3591A00250d7670m56582
$$ -8592 -214562 -389949 63357 64609 -146095 -294760 183545 -53591 100250 -47670 -504252
15711e04252a55896o7979C0332a96235A09622e7008k07727e2251E973b80971M8950
$$ -504252 -155896 -223875 30332 -196235 109622 -57008 -264735 -52251 5973 -280971 -232021
15700b32021N7672A76811b29814G6509L5285g7582j7189a4520H7264J47854A14556
$$ -232021 -174349 176811 -229814 76509 111794 -77582 -94771 -14520 87264 235118 114556
15688A35564r280c3921C12913H477L64624j8518j62479e2340C0954d8904A56481
$$ 135564 126284 -33921 312913 8477 373101 354583 192104 -52340 30954 -48904 156481
15676A10159g6061F0234M6745n2268h0659j79128A5659b04320B7702a81217F9906
$$ 110159 -76061 60234 106979 54711 -80659 -259787 15659 -204320 27702 -181217 69906
15664D2628i9758d7645m58666A26118a72273i738A61596b88630a06966I720J7413
$$ 42628 -99758 -47645 -506311 126118 -172273 -9738 161596 -288630 -106966 9720 27133
15653B7133J21974b1970I7295b013q0850G6026b46648A61230i8078B05498M6139
$$ 27133 149107 -21970 97295 -2013 -82863 76026 -246648 161230 -98078 205498 251637
15642B51637I5694b03701A45965F8016d0415j8996A21258L5957o6569i932k28252
$$ 251637 95694 -203701 145965 68016 -40415 -59411 121258 157215 90646 -9932 -238184
15631b38184A00625a75107m5266K4917A9129b68233b9157j18275n4619I1114r661
$$ -238184 100625 -175107 -220373 -195456 19129 -268233 -29157 -147432 -202051 91114 81453
15620H1453a8464D7426c30296B30209b00538B31089q1540a71893E3169J99359
$$ 81453 -18464 47426 -330296 230209 -200538 231089 149549 -171893 53169 252528
15610B52528c39502a67626j03768O3557a9858j62140P2285F9195b7389l62265
$$ 252528 -339502 -167626 -271394 -207837 -19858 -181998 -109713 69195 -27389 -389654
15600c89654J58790a0810k78307c5123p3346k7781e5285A9256J24269a8688n2242
$$ -389654 -230864 -10810 -289117 -35123 -108469 -136250 -55285 19256 143525 -18688 -70930
15589g0930D3311J9120M0962f1508j02815C10432c1967k6058j48192c5385m7115
$$ -70930 43311 62431 103393 -61508 -164323 310432 -31967 -58025 -206217 -35385 -82500
15578h2500B95337b846r0947r4342m7992A55453e8406C02672c35564A18822n7383
$$ -82500 295337 -2846 -93793 -188135 -236127 155453 -58406 302672 -335564 118822 61439
15567F1439A0865a16944H4343N031g1856c0252j16800D3311R1596Q5988j08313
$$ 61439 10865 -116944 84343 89374 -71856 -30252 -147052 43311 134907 220895 112582
15556A12582l9815h9667A11306C929J79707c28648i4003M2982k8390l18786R4363
$$ 112582 72767 -89667 111306 3929 183636 -328648 -94003 -51021 -79411 -398197 -303834
15545c03834C90877h6599B33589c92582E496a77454d1943l1430A94498P0133o9203
$$ -303834 390877 -86599 233589 -392582 5496 -177454 -41943 -73373 194498 264631 195428
15534A95428H0729i5273k1058j07335L9072G9552f8218A19355i7182n2303d2695
$$ 195428 80729 -95273 -116331 -223666 -184594 79552 -68218 119355 -97182 -149485 -42695
15522A13218h2377k3514A62460o8661e3046O718j2660I2404J5155J77710a23987
$$ 113218 -82377 -105891 162460 93799 -53046 -46328 -58988 92404 107559 285269 -123987
15510f414A24447E9534g7404j9615a679l11822F4803k3736b37462b2341A70167
$$ -6414 124447 59534 -77404 -97019 -1679 -313501 64803 41067 -237462 -22341 170167
15498b28762B38226A3687L42482e3204R895q6250o262c9975B5035c38713A56854
$$ -228762 238226 13687 356169 -53204 -43309 -129559 -135821 -39975 25035 -338713 156854
15486G8578A916Q6189F590J3388b31480L4258c8984k400C55952F0534f3418A45099
$$ 78578 1916 88105 6590 19978 -231480 -197222 -38984 -41384 355952 60534 -63418 145099
15473a786A5193e7919B51180J45902A71139K2715b71942I2422a70432j04972i0115
$$ -1786 15193 -57919 251180 397082 171139 193854 -271942 92422 -170432 -275404 -90115
15461a22472H9087a80813A43754J36441I7213J06355d18287A52506O1694a75858
$$ -122472 89087 -180813 143754 280195 97213 203568 -418287 152506 214200 -175858
15450a09315I4704g7064L5036C6262c3904D10074A41886D5785o9E024L12453j6496
$$ -109315 94704 -77064 -42028 36262 -33904 410074 141886 45785 45716 5024 317477 300981
15438C00981f8483j41440q7801n2388C27398g8576B3324a36067L7412j36337g0637
$$ 300981 -68483 -209923 -297724 -350112 327398 -78576 23324 -136067 -98655 -234992 -70637
15426C1239a79070B48303D1662c78288C05174b12087O1303a002j54280D0400J34241
$$ 31239 -179070 248303 41662 -378288 305174 -212087 -150784 -1002 -155282 40400 174641
15415A74641g1934C7121O6939J56836a80738f1271C5741N5473f544k5556o7692
$$ 174641 -71934 37121 104060 260896 -180738 -61271 35741 91214 -6544 -32100 -99792
15404i9792B69779o8588e59065b1594B08163b12852h0162G926d8717F6677a22638
$$ -99792 269779 201191 -559065 -21594 208163 -212852 -80162 7926 -48717 66677 -122638
15392A98635j999F871b00865I309a01534A17922c4287C3803a23510i536j46833
$$ 198635 196636 6871 -200865 9309 -101534 117922 -34287 33803 -123510 -9536 -156369
15381a56369f9497F9958L9044Q3095G1675A750J22954b5041A68078J02726a02645
$$ -156369 -69497 69958 109002 192097 71675 1750 124704 -25041 168078 270804 -102645
15369d8192A04630n1406J13788C4771D059J72241b24746A55719b04896P3938A05297
$$ -48192 104630 53224 167012 34771 4059 176300 -224746 155719 -204896 -130958 105297
15357b43849M85B34533a15481C22268a01157B46656A0116O2872a76726C8178J17361
$$ -243849 -243364 234533 -115481 322268 -101157 246656 10116 72988 -176726 38178 155539
15346A55539a93693j70133g0688G8669b32958C8553L27747A02554m6416b7650
$$ 155539 -193693 -363826 -70688 78669 -232958 38553 366300 102554 56138 -27650
15335a59055D0799K7751J47378J26851E2833M6400a7433q9135I3094K6689g1038
$$ -159055 40799 68550 215928 342779 52833 99233 -17433 -106568 93094 119783 -71038
15323A77509G3583K29a5366B44216o427d2808o40j36233M4265d5012A8723K1526
$$ 177509 73583 73812 -15366 244216 237789 -42808 -43448 -179681 -135416 -45012 18723 40249
15311D0249K28088D9344J35682q1688a7281k63388a21108H2866g2485A42897b38505
$$ 40249 268337 49344 185026 103338 -17281 -280669 -121108 82866 -72485 142897 -238505
15299d07217D3728M6706K7265J07175C7974L82431A34851e9536C12508E1707M53878
$$ -407217 43728 90434 117699 224874 37974 420405 134851 -59536 312508 51707 505585
15288E05585c2554p1378L2762A86630j8700h2005A64460b27291B3495J8324e9590
$$ 505585 -32554 -103932 -71170 186630 167930 -82005 164460 -227291 23495 41819 -59590
15276C78458A28498K03834h0680B92838j22575J56779e7528j44492A58918l2716
$$ 378458 128498 332332 -80680 292838 170263 327042 -57528 -202020 158918 126202
15266A26202C845O7999a3656A25387K37736D5577a79047A37284E6717J50370H4317
$$ 126202 3845 71844 -13656 125387 363123 45577 -179047 137284 56717 207087 84317
15254a61991I2441C5945b58066B43693B4011N29334L81570O05894k67679P04462
$$ -161991 92441 35945 -258066 243693 24011 553345 934915 1540809 1273130 1977592
15244A977592p62363A59570C6080f5439I4402C895J02035b2599j12833C29290
$$ 1977592 1215229 159570 36080 -65439 94402 3895 105930 -22599 -135432 329290
15233a0376n7552B05491N0721C5549N3000e1806B82898H750O4915a46838B24442
$$ -10376 -67928 205491 256212 35549 88549 -51806 282898 8750 73665 -146838 224442
15221A82789f1623G797C665K1456Q0193m7134J94979C244b42129B44938E6190
$$ 182789 -61623 7797 3665 25121 105314 58180 253159 3244 -242129 244938 56190
15209c12320a39648G5977N23e8170A40939j5620b06261H1628C1055b04984D6641
$$ -312320 -139648 75977 76500 -58170 140939 125319 -206261 81628 31055 -204984 46641
15197B51028j25148j841k0677a35959B32028H4473J65324A03J12169m1144g0848
$$ 251028 125880 124039 103362 -135959 232028 84473 249797 103 112272 71128 -70848
15185A20542F0069h9909A81637F6657B1879J91892a0210j50773D18382j95923
$$ 120542 60069 -89909 181637 66657 21879 213771 -10210 -160983 418382 222459
15175B22459h4999A71776F4660i775A8523J31794L2404A4355a5905E3831K49732
$$ 222459 -84999 171776 64660 -9775 18523 150317 182721 14355 -15905 53831 303563
15164C03563H9553a00686B9432J47452c6477B71861m4524D2731a50026A00028
$$ 303563 89553 -100686 29432 176884 -36477 271861 227337 42731 -150026 100028
15153h5571j16855A73971P0320p7573f9086A58021L41587G5895M8855J45994d3899
$$ -85571 -202426 173971 244291 166718 -69086 158021 499608 75895 124750 270744 -43899
15141A64161a5419I4551J7821P4693b83880a9193A78005c05050B97893A11947
$$ 164161 -15419 94551 112372 187065 -283880 -19193 178005 -305050 297893 111947
15130a05035B04152a4546E7300j5559J93254D4032K4300Q7062R6857R2169K59283
$$ -105035 204152 -14546 57300 41741 234995 44032 68332 155394 252251 344420 603703
15119F03703A97688b13904B26920r0820e8066B04363e4231k09031I8500a08683
$$ 603703 197688 -213904 226920 136100 -58066 204363 -54231 -263262 98500 -108683
15108a9816H4116O8284a31266E912J00821J1447J2122A8647N1147o491e0547B3796
$$ -19816 84116 152400 -131266 5912 106733 118180 130302 18647 69794 63303 -50547 23796
15095c72645B39410J2394q7850K73979m4588E3324L08464o0430h8023B11894q7541
$$ -372645 239410 251804 163954 437933 393345 53324 361788 301358 -88023 211894 124353
15084A24353c05814e0748o0975B50970c6035E2237J33476C9244O5797K63811p7313
$$ 124353 -305814 -50748 -111723 250970 -36035 52237 185713 39244 105041 368852 291539
15073B91539c9929B17150I3581M8467Q5033K6363C9639g6556B45989J40078A23069
$$ 291539 -39929 217150 93581 142048 227081 253444 39639 -76556 245989 386067 123069
15061D67308a06330A5041g712I2689B8015e1389B32308A1827J73329R7982K3783
$$ 467308 -106330 15041 -7712 92689 28015 -51389 232308 11827 185156 283138 306921
15050C06921F9513k5192b45301D36338B01970p0858a749B52915N9250D9597K54539
$$ 306921 69513 44321 -245301 436338 201970 131112 -1749 252915 312165 49597 304136
15039C04136A39698e4542C47494F3075J43593j8959o0470O2407g883A77515H4617
$$ 304136 139698 -54542 347494 63075 206668 187709 127239 189646 -7883 177515 84617
15027D03832k3098p9933a06016B44918J52061j30641F2950R5737K8201J43202
$$ 403832 380734 300801 -106016 244918 396979 266338 62950 158687 186888 330090
15017C30090A13723J38448M6474j14826O9761r6585n9463K6345J49963O1081n6855
$$ 330090 113723 252171 298645 183819 253580 156995 97532 123877 273840 334921 278066
15006B78066Q5694J64909a14175A05267P4944J34631q0446N7627D3070L81796
$$ 278066 363760 528669 -114175 105267 180211 314842 234396 292023 43070 424866
14996D24866q3618B9164K38102r0303R2761a6649r4030C63879A30550L54694A4521
$$ 424866 341248 29164 267266 176963 269724 -16649 -110679 363879 130550 485244 14521
14984B77705h4619B08986J07465m1670j27669L4897h8977A01229K48746A41136
$$ 277705 -84619 208986 316451 274781 147112 182009 -88977 101229 349975 141136
14973D55982O5288A42840J18681j5878L75945B77047H3145l814J29861K13673
$$ 455982 521270 142840 261521 245643 621588 277047 83145 79331 209192 422865
14963D22865K8374J00966B27171J09732A64782P3986J39589j8657f2390A24799
$$ 422865 451239 552205 227171 336903 164782 238768 378357 359700 -62390 124799
14952D30904e9158D16332k0782j25383j6585p2581q7864N34974F7650J09787M34907
$$ 430904 -59158 416332 395550 270167 253582 181001 93137 628111 67650 177437 612344
14941F12344B03035J07606q69p4948K27211p7710q9642L1012J11413A78579J9859
$$ 612344 203035 310641 309772 234824 462035 384325 294683 325695 437108 178579 198438
14930A98438K76560k04693K10625A05068J67128J21660j53591K18967j19182q1258
$$ 198438 474998 270305 480930 105068 272196 393856 240265 459232 340050 258792
14920B58792o7862j8870p891E4509L22339A80182J99749j38205J76565j05544
$$ 258792 190930 172060 164169 54509 376848 180182 379931 241726 418291 312747
14910C12747l4618L07567B83463L66807B84081q8960N3590K38333j45146j70861
$$ 312747 278129 585696 283463 650270 284081 195121 248711 487044 341898 171037
14900A71037N5924J32789L4948j78954L13986r6098J54738j21433j48080k4096
$$ 171037 226961 359750 394698 215744 529730 433632 588370 466937 318857 294761
14890B94761R2884K67227k52695K4726k121B06222J40158l3197j6383J40787j18866
$$ 294761 387645 654872 402177 426903 424782 206222 346380 313183 296800 437587 318721
14879C18721r8901K32639K51980k67771C0528L60810K92533k27216Q060j72016
$$ 318721 219820 452459 704439 436668 30528 391338 683871 456655 464715 292699
14869B92699R9868K8511J67230r2397j93338J74659l6281j29609J38800R18j65639
$$ 292699 392567 421078 588308 495911 302573 477232 440951 311342 450142 451060 285421
14858B85421J32332m5955F6736M39267L47195l38134J78191k07856j33241M7859
$$ 285421 417753 371798 66736 506003 853198 515064 693255 485399 352158 400017
14848D00017J22495r4211J43764k22874E8931M68271m9347K03501A72691K51500
$$ 400017 522512 428301 572065 349191 58931 527202 477855 681356 172691 424191
14838D24191K29144l20316K18791k36088R4058n2222A55471J45259P6969j65964
$$ 424191 653335 333019 551810 315722 409780 357558 155471 300730 377699 211735
14828B11735R8095r297k457J97583N5953J19899B16107J88061O5607H2215K78054
$$ 211735 309830 300533 298076 495659 551612 671511 216107 404168 469775 82215 360269
14817C60269L19437p858j69770K68564l42157J04316o6564j61402J80774N1523
$$ 360269 679706 671848 502078 770642 428485 532801 466237 304835 485609 537132
14807E37132J29316B99894K17349j32370K84270O0489B53343L03394M3374O9462
$$ 537132 666448 299894 517243 384873 669143 729632 253343 556737 600111 669573
14797F69573j98439m169L75239o7638l61454R0569B41438L85478J9749j08558
$$ 669573 471134 466965 842204 774566 413112 503681 241438 626916 646665 538107
14787E38107J05240J24162C35551J87777J71561j23136j04243j41774J8813J65291
$$ 538107 643347 767509 335551 523328 694889 571753 467510 325736 344549 509840
14777E09840k24688J03346N76969l58233J32959p4654J79227k58050J95949k58969
$$ 509840 285152 388498 965467 607234 740193 665539 844766 586716 782665 523696
14767E23696K13867m6905m3764K33526m20034J80243J83434k22562L43619m05802
$$ 523696 737563 690658 646894 880420 460386 640629 824063 601501 945120 539318
14757E39318L83980l79587j25290M30642j69288j50636K31495r603j38099J00198
$$ 539318 923298 543711 418421 849063 679775 529139 760634 751031 612932 713130
14747G13130j28553K03512K54237j06270k29684K97476m0806j41649k17020J49833
$$ 713130 584577 788089 1042326 936056 706372 1003848 963042 821393 604373 754206
14737G54206r523p4495J64931J78287n2615j67027j73332M27304k83322k282J58218
$$ 754206 744683 670188 835119 1013406 960791 793764 620432 1047736 764414 762132 920350
14726I20350l0766j02975k9189O7990q1553l10917P28954l79546j52366R776M64473
$$ 920350 889584 786609 757420 825410 743857 432940 1161894 782348 629982 639758 1104231
14715A104231l82595j45942P3533J35410k22652K56994O1318r0418k51405K78746
$$ 1104231 721636 575694 649227 784637 561985 818979 880297 789879 538474 817220
14705H17220M2507m7123j98334L38385L13692l07443o0089L04784m20571J28535
$$ 817220 859727 812604 614270 952655 1266347 958904 898815 1203599 783028 911563
14695I11563j57615j99577K51198J49802j26556K31033k4736j96646K43862l17937
$$ 911563 753948 554371 805569 955371 828815 1059848 1035112 838466 1082328 764391
14685G64391n8344J22811J39376O9737P225l06685L84204J06048k43310K83283
$$ 764391 706047 828858 968234 1037971 1045196 738511 1122715 1228763 985453 1268736
14675A268736l5137l34686M05485l76597J87194j15128l93600N17076J22955j80070
$$ 1268736 1233599 898913 1304398 927801 1114995 999867 606267 1123343 1246298 1066228
14665A066228l9343j7743r3747J875M02609l26364R4435O0977K07886r1795Q7894
$$ 1066228 1026885 1009142 915395 917270 1319879 993515 1087950 1148927 1356813 1265018 1352912
14654A352912r0518p6603j02256N2036l9463l3849L82851R4005m35781M05855
$$ 1352912 1262394 1185791 1083535 1135571 1096108 1062259 1445110 1539115 1103334 1509189
14644A509189P0344p8067k85139j58907L01941j69252L21594k05450K37103j85050
$$ 1509189 1579533 1501466 1216327 1057420 1359361 1190109 1511703 1306253 1543356 1358306
14634A358306K93392p2970N036l12047M7450K67845k01212j46516K11321k6926
$$ 1358306 1651698 1578728 1583764 1271717 1319167 1587012 1385800 1239284 1450605 1423679
14624A423679k12381J67360M3928K23433K8029k48931j62140L22636l09403Q1069
$$ 1423679 1211298 1378658 1422586 1646019 1674048 1425117 1262977 1585613 1276210 1357279
14614A357279J2157J29297K81855j72216l36929K72347K10384j91141N2163K03568
$$ 1357279 1369436 1498733 1780588 1608372 1271443 1543790 1754174 1563033 1615196 1818764
14604A818764k03096r8956J52148j77907K76227j73565Q6285N43863l31005k47168
$$ 1818764 1615668 1516712 1668860 1490953 1767180 1593615 1679900 2223763 1892758 1645590
14594A645590r5889L95310j75659l50167K03127L53803k63548J42180j5910L06101
$$ 1645590 1549701 1945011 1769352 1419185 1622312 1976115 1712567 1854747 1838837 2144938
14584B144938m8591N1902l30548J30230P1563K3633K6603k56713M15150k8518
$$ 2144938 2096347 2148249 1817701 1947931 2019494 2043127 2069730 1813017 2228167 2199649
14574B199649j83086J01154M8829l8687L50386L1816m03513L18376J5028L1979
$$ 2199649 2016563 2117717 2166546 2127859 2478245 2510061 2106548 2424924 2439952 2471931
14564B471931J80129j25856N09631l23138L18530j25878J34290K01422j7654M44335
$$ 2471931 2652060 2526204 3035835 2712697 3031227 2905349 3039639 3241061 3223407 3667742
14554C667742K05502j25522R13816K17400J252352K300440M473594R212675J9041217
$$ 3667742 3873244 3747722 4661538 4878938 6131290 8431730 12905324 22117999 41159216
14545D1159216J709298k1263776j0764673E226652j602834r33639l22240k79546
$$ 41159216 42868514 21604738 10840065 5226652 3623818 2690179 2367939 2088393
14537B088393m0379K23652o4055q6182K27399j50154L80725j29273J9318M7583
$$ 2088393 2048014 2271666 2207611 2121429 2348828 2198674 2579399 2450126 2469444 2517027
14527B517027J58342l11549l940m517O8040O1991j34502M55129j35451k35411
$$ 2517027 2675369 2363820 2359880 2355363 2423403 2485394 2350892 2806021 2670570 2435159
14517B435159L31552j32014P1817J24499k67400J36272O3621N4563J08285L33415
$$ 2435159 2766711 2634697 2706514 2831013 2563613 2699885 2763506 2818069 2926354 3259769
14507C259769l49382N26220l80386m1009p6164J76796J05665J66831k01123K13209
$$ 3259769 2910387 3436607 3056221 3015212 2939048 3115844 3221509 3388340 3187217 3400426
14497C400426q7532l02363Q15196m46595K58627k15869K61360j25378J36457J84396
$$ 3400426 3312894 3010531 3825727 3379132 3637759 3421890 3683250 3557872 3694329 3878725
14487C878725j12699K9653m8074K20479j5181o5968k54607M90929n8049N02671
$$ 3878725 3766026 3795679 3747605 3968084 3952903 3886935 3632328 4123257 4065208 4567879
14477D567879m04259k0419K46877k38346L04437k40538o7783K17184J16289K26310
$$ 4567879 4163620 4143201 4390078 4151732 4456169 4215631 4147848 4365032 4481321 4707631
14467D707631R4504l5095K36527l86007K86685p2627J17006L08051l04534l8563
$$ 4707631 4802135 4767040 5003567 4617560 4904245 4831618 4948624 5256675 4952141 4913578
14457D913578K26470J59265J66486j42659J17439K2714P9410O9274k8595L12974
$$ 4913578 5140048 5299313 5465799 5323140 5440579 5463293 5542703 5611977 5583382 5896356
14447E896356p1003J02426J08J8032O9827J56727O3382J75499K0021J21819J79878
$$ 5896356 5825353 5927779 5927887 5945919 6015746 6172473 6235855 6411354 6431375 6553194 6733072
14436F733072j62805J80776L09523J6721P9045p4939M46300p6754J76734l12516
$$ 6733072 6570267 6751043 7060566 7077287 7156332 7081393 7527693 7450939 7627673 7315157
14426G315157L60338K31564r0327K37682M5543L8182j13892J31341J60009K34465
$$ 7315157 7675495 7907059 7816732 8054414 8099957 8138139 8024247 8155588 8315597 8550062
14416H550062O10813k10634K52388j33094L15406j26179M33632J4722P4278p1869
$$ 8550062 9160875 8950241 9202629 9069535 9384941 9258762 9692394 9707116 9781394 9709525
14406I709525P32200k67407K33994l7667P30547m2337l10394M62597L70787K36882
$$ 9709525 10441725 10174318 10408312 10370645 11101192 11058855 10748461 11211058 11581845 11818727
14396A1818727K30210k5255L65000J1151J36298Q9997O31715J39971Q3118J02115
$$ 11818727 12048937 12023682 12388682 12399833 12536131 12626128 13257843 13397814 13480932 13583047
14386A3583047J94138K75534L46783J51528O70890N4965J13876P14174Q4931N08646
$$ 13583047 13777185 14052719 14399502 14551030 15221920 15276885 15390761 16104935 16189866 16698512
14376A6698512l09454O17749N43319L41110K37936q5923O33412L65739j20035
$$ 16698512 16389058 17006807 17550126 17891236 18129172 18043249 18676661 19042400 18922365
14367A8922365R48135N14306N45572O104N89954K15545P63834P39887M8777R32234
$$ 18922365 19870500 20384806 20930378 20936482 21526436 21741981 22505815 23245702 23294479 24226713
14357B4226713M30166L64874P65244K95362Q42420M10159Q02748R55665N23626
$$ 24226713 24656879 25021753 25786997 26082359 26924779 27334938 28137686 29093351 29616977
14348B9616977M27669P90161Q22507J004270P78325J275113K89770J166636J057089
$$ 29616977 30044646 30834807 31657314 32661584 33439909 34715022 35004792 36171428 37228517
14339C7228517J175293P80280J347632R36519J165719J328774J522999J468567
$$ 37228517 38403810 39184090 40531722 41468241 42633960 43962734 45485733 46954300
14331D6954300J082700J652223J312505K077909J411803K027649J596244K231496
$$ 46954300 48037000 49689223 51001728 53079637 54491440 56519089 58115333 60346829
14323F0346829J876850K095788K047040K656876K446018K386679K811483L116499
$$ 60346829 62223679 64319467 66366507 69023383 71469401 73856080 76667563 79784062
14315G9784062L017432L001967L614039L477816L699941L966378M066950M036685
$$ 79784062 82801494 85803461 89417500 92895316 96595257 100561635 104628585 108665270
14307A08665270M891330M921873N299333N404745N844119O004536O291489O873290
$$ 108665270 113556600 118478473 123777806 129182551 135026670 141031206 147322695 154195985
14299A54195985P455558P592464Q161906Q573491R201788R078929J0131713J0491958
$$ 154195985 161651543 169244007 177405913 185979404 195181192 204260121 214391834 224883792
14291B24883792J1285146J1821915J2100919J2466539J2990216J3579970J3852271
$$ 224883792 236168938 247990853 260091772 272558311 285548527 299128497 312980768
14284C12980768J4354322J4438424J4301462J4291169J4456941J3645059J3003104
$$ 312980768 327335090 341773514 356074976 370366145 384823086 398468145 411471249
14277D11471249J2468909J1130444R675765P660924M387266L85863k69681j7870
$$ 411471249 423940158 435070602 444746367 452407291 456794557 457180420 456910739 456892869
14269D56892869l72187l618306n098287o419523p829913j0366524j1570605j2980502
$$ 456892869 456520682 452902376 447804089 441384566 433554653 423188129 411617524 398637022
14261C98637022j3570437j3907705j4618710j5059187j5082235j5100640j4655105
$$ 398637022 385066585 371158880 356540170 341480983 326398748 311298108 296643003
14254B96643003j3234650j3465283j3187907j2337771j2133851j1126597j0577713
$$ 296643003 283408353 269943070 256755163 244417392 232283541 221156944 210579231
14247B10579231j0385143r705936q692895q008532q488956p571032p329846o683055
$$ 210579231 200194088 190488152 181795257 173786725 165297769 157726737 150396891 143713836
14239A43713836o318456n853155n677122n427619n162480m925646m324568m317368
$$ 143713836 137395380 131542225 125865103 120437484 115275004 110349358 106024790 101707422
14231A01707422l684785l663225l967628l412068l290282l321023k720179k676368
$$ 101707422 98022637 94359412 90391784 86979716 83689434 80368411 77648232 74971864
14223G4971864k758403k752645k448125j897657k048027k294786k461452j190860
$$ 74971864 72213461 69460816 67012691 65115034 63067007 60772221 58310769 57119909
14215E7119909k056499j412457j154851k001293j674145j511592j258252j250277
$$ 57119909 55063410 53650953 52496102 50494809 48820664 47309072 46050820 44800543
14207D4800543q71540j179572j144438j294219j023544j409466o24401r38657
$$ 44800543 43929003 42749431 41604993 40310774 39287230 37877764 37253363 36314706
14199C6314706o45945j296276j052291j203496l83376k29897j211865p67634r99287
$$ 36314706 35668761 34372485 33320194 32116698 31733322 31503425 30291560 29523926 28524639
14190B8524639m98982p56319k94983r04579q97483l44319k33490m29679n90762
$$ 28524639 28025657 27269338 26974355 26069776 25172293 24827974 24594484 24164805 23574043
14181B3574043m86606p26967n83555j98602o72183m80901m01806Q0231o46066
$$ 23574043 23087437 22360470 21776915 21578313 20906130 20425229 20023423 20103654 19457588
14172A9457588n23312j71447l47055l86860p28119j53164k98927l25383m16562
$$ 19457588 18934276 18762829 18415774 18028914 17300795 17147631 16848704 16523321 16106759
14163A6106759q8957m87234l1389l97055k14927l97334l99973J48458k75259n50935
$$ 16106759 16017802 15530568 15499179 15102124 14887197 14489863 14089890 14238348 13963089 13412154
14153A3412154k9535k37407k42288n57644m500J40179m62120J8506m23358K6775
$$ 13412154 13382619 13145212 12902924 12345280 12340780 12480959 12018839 12037345 11613987 11640762
14143A1640762l74431j02072k32891K78840n15620L2897l66060Q5934o08857K63268
$$ 11640762 11266331 11164259 10931368 11210208 10694588 10727485 10361425 10447359 9838502 10101770
14133A0101770o6219P6722l90102m71436J43833m5602l00251K3112J17381m43957
$$ 10101770 10035551 10112273 9722171 9250735 9394568 9348966 9048715 9071827 9189208 8745251
14123H745251k89680J48459k6882n4326m95358m3243P2528k57862k5589O4060
$$ 8745251 8455571 8604030 8577148 8522822 8027464 7984221 8056749 7798887 7773298 7837358
14113G837358l2171o52347k6391M53711o83623P2885j94245J36037K92081o18011
$$ 7837358 7805187 7152840 7126449 7580160 6896537 6969422 6775177 6911214 7203295 6585284
14103F585284J69577j2483l08262J70640k01471m06740J50043k64794M9915k3755
$$ 6585284 6754861 6742378 6434116 6604756 6403285 5996545 6146588 5881794 5931709 5907954
14093E907954J95444m17799n1860J44656l28390N9705j68690K89834o40762L28814
$$ 5907954 6103398 5685599 5633739 5778395 5450005 5509710 5341020 5630854 4990092 5318906
14083E318906J8033j17026R5872l19817J68365K0171l36005P9791j35264j09167
$$ 5318906 5336939 5219913 5315785 4995968 5164333 5184504 4848499 4928290 4793026 4683859
14073D683859m6457k34357J48787J55746j01256J6919j84122L07291k77445j99264
$$ 4683859 4637402 4403045 4551832 4707578 4606322 4623241 4439119 4746410 4468965 4269701
14063D269701N0279J25581k3642k63410j2386J4721k87162J14109K12804o04253
$$ 4269701 4319980 4445561 4421919 4158509 4146123 4160844 3873682 3987791 4200595 3596342
14053C596342L73926L4536k44096L21521n43788M57596j90721k06049q7995J5452
$$ 3596342 3970268 4004804 3760708 4082229 3538441 3996037 3805316 3599267 3511272 3526724
14043C526724J28774o83717K90365J16875K49214j73409j47756k7523r2216j6973
$$ 3526724 3655498 2971781 3262146 3379021 3628235 3454826 3307070 3279547 3187331 3170358
14033C170358p8263K05349R5877k55138O6445J66842m08685J15157J87287p21943
$$ 3170358 3092095 3297444 3393321 3138183 3204628 3371470 2962785 3077942 3265229 2543286
14023B543286M20468j94664J96035j90860m5253k8452J19271j1715l35425Q5082
$$ 2543286 2963754 2769090 2965125 2774265 2729012 2700560 2819831 2808116 2472691 2557773
14013B557773J847p8445K89036l88471J31616j75274L71130l16976n6027k18266
$$ 2557773 2559620 2481175 2770211 2381740 2513356 2338082 2709212 2392236 2336209 2117943
14003B117943J17625K59231k35080J29795k34626K9158j0048o7283K68389m02666
$$ 2117943 2235568 2494799 2259719 2389514 2154888 2184046 2173998 2106715 2375104 1972438
13993A972438K72637J14098l0254Q65809R38888L414646P004271J9706897J0662620
$$ 1972438 2245075 2359173 2328919 3194728 4133616 7548262 14552533 34259430 44922050
13984D4922050j9516525j1569730n319237k155298j528915n63098m24553l78871
$$ 44922050 25405525 13835795 8516558 6361260 4832345 4269247 3844694 3465823
13976C465823l2631Q20m14788p8317L1338m40842j72640J53101O1173j75786J3331
$$ 3465823 3433192 3434012 3019224 2940907 2972245 2531403 2358763 2511864 2573037 2397251 2410582
13965B410582j13732R3334n0833o0540K91105k65028J44189j37322l02963Q0450
$$ 2410582 2296850 2390184 2339351 2278811 2569916 2304888 2449077 2311755 2008792 2089242
13955B089242J1489j36231O60979o40533J88120k4308P6944k15308M1728M0759
$$ 2089242 2100731 1964500 2625479 1984946 2173066 2148758 2225702 2010394 2052122 2092881
13945B092881k69096K40276r9579k23538L55778k46311j65755K79789k66026n0226
$$ 2092881 1823785 2064061 1964482 1740944 2096722 1850411 1684656 1964445 1698419 1648193
13935A648193L04172R9963k06242O393n5921J930p1323N2660k53815K55502J78310
$$ 1648193 1952365 2052328 1846086 1852479 1796558 1798488 1727165 1779825 1526010 1781512 1959822
13924A959822j58076m49994L30670j74964L16797o2813O0493l76357P156M04559
$$ 1959822 1801746 1351752 1682422 1507458 1824255 1761442 1821935 1445578 1452734 1857293
13914A857293l84612L95514k06344j37979k15222O3304n2582L39843q0914J47257
$$ 1857293 1472681 1868195 1661851 1523872 1308650 1371954 1319372 1659215 1578301 1725558
13904A725558Q8655k50265L2127m37121J55143K82119J8438K6253K04252l22830
$$ 1725558 1814213 1563948 1596075 1158954 1314097 1596216 1614654 1640907 1845159 1522329
13894A522329K37646o32263K01580K30821m65602J0520K71953J53593m67312k25299
$$ 1522329 1759975 1127712 1329292 1560113 1094511 1105031 1376984 1530577 1063265 837966
13884H37966L44009J39456L60412m36170Q1058r0086o2933k3382j965J09068k71482
$$ 837966 1181975 1321431 1681843 1245673 1326731 1236645 1173712 1150330 1148365 1257433 985951
13873I85951N08136o49009M99421k68087P5500K69409k65037J4694k89604M39656
$$ 985951 1494087 845078 1344499 1076412 1151912 1421321 1156284 1170978 881374 1321030
13863A321030m05047M03879k26360j09517k7973J06579J3669J73943p2324n39416
$$ 1321030 915983 1319862 1093502 983985 956012 1062591 1076260 1250203 1177879 638463
13853F38463O55963r3672r4588K62668k68655Q9645j78929K45509q6174k44274
$$ 638463 1294426 1200754 1106166 1368834 1100179 1189824 1010895 1256404 1170230 925956
13843I25956P3680K07718m34869L02475j34581J36433k32135J23509k41335M27813
$$ 925956 999636 1207354 772485 1074960 940379 1076812 844677 968186 726851 1154664
13833A154664O358j99689L64648l36126j41636K3781J74132j36199R433k55059
$$ 1154664 1161022 961333 1325981 989855 848219 872000 1046132 909933 919366 664307
13823F64307L63412q5439j80327J87165j22384J65805P8215l53033K63129k86196
$$ 664307 1027719 942280 761953 949118 826734 992539 1070754 717721 980850 694654
13813F94654J88604J7712Q6455K68428l28707j87861l17927N00254k96620M56547
$$ 694654 883258 900970 987425 1255853 927146 739285 421358 921612 624992 1081539
13803A081539l22044K45371J08943k39597j82118J09840n0646O1664j58826K99498
$$ 1081539 759495 1004866 1113809 874212 692094 801934 751288 812952 654126 953624
13793I53624j92935k4508k81829M72086o5930q484r0113K77759P0882j98754j12304
$$ 953624 760689 736181 454352 926438 860508 852024 761911 1039670 1110552 911798 799494
13782G99494J6346M1696k77428n8909J45415k52562K34837m5226M7073J52409
$$ 799494 815840 857536 580108 521199 666614 414052 648889 603663 650736 803145
13772H03145k7791M67203E60171M39103C41412J95678k26005N21805j089J24522
$$ 803145 775354 1242557 560171 999274 341412 537090 311085 832890 831801 956323
13762I56323l02621j89986j96750M71851j88157L64424j98488J22050j07502j9060
$$ 956323 653702 463716 266966 738817 550660 915084 716596 838646 731144 712084
13752G12084J80941J59119m93218J0366K3817p7160n1940J22697R4483j86414
$$ 712084 893025 1052144 558926 569292 593109 515949 464009 586706 681189 494775
13742D94775M81976o5578l30425M0048K08236j39611k69465R8557M1862j68272
$$ 494775 976751 911173 580748 620796 829032 689421 419956 518513 560375 392103
13732C92103N7316J02146K97297p1857B80628N32512C51969R7557L89732L9297
$$ 392103 449419 551565 848862 777005 280628 813140 351969 449526 839258 878555
13722H78555k76435k5558K7033m0196j96270M51624B58420L99211K62432m23189
$$ 878555 602120 576562 603595 563399 367129 818753 258420 657631 920063 496874
13712D96874n4897j32576J95928K95536l31458L49128k27999J6004P7118k19405
$$ 496874 441977 309401 505329 800865 469407 818535 590536 606540 683658 464253
13702D64253j41854K31619N0797R0326r2167M5751j07352K72802n8336l09762
$$ 464253 322399 554018 604815 695141 602974 648725 541373 814175 755839 446077
13692D46077A95799J30452J99789L12964k46685K6705q6188O1429P4286O0025
$$ 446077 195799 326251 526040 839004 592319 619024 532836 594265 668551 728576
13682G28576n3207C29068K13726k35747K35717r0537J14007j92861l2597N58172
$$ 728576 675369 329068 542794 307047 542764 452227 566234 373373 340776 898948
13672H98948l25585B65589K90288k1766j72316L45962k72105J44540q639j9222
$$ 898948 573363 265589 555877 534111 361795 707757 435652 580192 571553 552331
13662E52331k63195r4473K46441M0870k29282J89463F5622M97320B42048n5552
$$ 552331 289136 194663 441104 481974 252692 442155 65622 562942 242048 186496
13652A86496J79625J34695o0833o3495N366J54672J44376C21381Q4442A789L66917
$$ 186496 366121 500816 439983 376488 381854 536526 680902 321381 405823 1789 368706
13641C68706K19107j8053A93031M26894k78427R1751m6409L01663k32036L3927
$$ 368706 587813 569760 193031 619925 341498 433249 386840 688503 456467 490394
13631D90394A96698j9915E7290L68958P1121J8906G7373L12130d321C80015Q7870
$$ 490394 196698 176783 57290 426248 497369 516275 77373 389503 -4321 380015 467885
13620D67885j08291j66504L58638k47689J18820j44123F3469L11039J07317l7264
$$ 467885 359594 193090 551728 304039 422859 278736 63469 374508 481825 444561
13610D44561O171A09638O30745l44990j72636P8720q1902J1862M2559J81345p0934
$$ 444561 450732 109638 740383 395393 222757 301477 219575 231437 273996 455341 384407
13599C84407K51276B90425J53259j25119r1967K60045j46685J4013Q2455l313
$$ 384407 635683 290425 443684 318565 226598 486643 339958 353971 436426 433113
13589D33113k3091P1966q2973K19908k88463Q4790o5423p8216K78304l7506L34521
$$ 433113 410022 481988 399015 618923 330460 415250 349827 271611 549915 512409 846930
13578H46930l33672j75068R8743r6033J4760n740j6356K14321A57155R9149K1938
$$ 846930 513258 338190 436933 340900 355660 349920 333564 547885 157155 256304 278242
13567B78242j4309P8322J12797l2245J64678j60814A21123K4977F0003N39649
$$ 278242 263933 342255 455052 422807 587485 426671 121123 146100 60003 599652
13557E99652n3268L4974j27498j98000L05232p3168j60544J5443O9497P6077A90412
$$ 599652 546384 581358 453860 255860 561092 487924 327380 342823 412320 488397 190412
13545B33273A15028C9704J1610M32522n280m4390k04542B5162K92645A42647B4453
$$ 233273 115028 39704 51314 483836 478556 434166 229624 25162 317807 142647 24453
13533B02389K13421j35388l5149M02451p7982B72168a67192E773N63004B63164
$$ 202389 415810 280422 245273 647724 569742 272168 -167192 5773 568777 263164
13522A97134K6416p0441m1568O7441J82765G4082R2825P1384O9835J71033j74645
$$ 197134 223550 153109 111541 178982 361747 74082 166907 238291 308126 479159 304514
13511C04514J714K0288B3854M47671A65689K16439j17769j24391Q2641d917A56612
$$ 304514 306228 326516 23854 471525 165689 382128 264359 139968 222609 -4917 156612
13499C9729J83207J86253A20065R7448L20329A57891K30957p941e8992D63323
$$ 39729 222936 409189 120065 217513 537842 157891 388848 380907 -58992 463323
13488B04136P9169K59479A12903L16173J60268r2880A93847K78373A75579Q9179
$$ 204136 283305 542784 112903 429076 589344 496464 193847 472220 175579 264758
13478B64758K0164m0002j17237O6404P3145l7080k5038J72549j67278o9162C4822
$$ 264758 284922 244920 127683 194087 267232 230152 205114 377663 210385 141223 34822
13466B59721j2337p3426R699L12610j49935A58543O568a7481C39456n6425i4856
$$ 259721 247384 173958 183657 496267 346332 158543 165111 -17481 339456 283031 -94856
13454H8369K58590A58248K96326j56036g865H1067J3347K06356A30796h3607D98600
$$ 88369 346959 158248 454574 298538 -7865 81067 94414 300770 130796 -83607 498600
13442F48469q2279j92374K5401j22303m1206p8683L36876A88788E0710h5191C95498
$$ 648469 566190 373816 399217 276914 235708 157025 493901 188788 50710 -85191 395498
13430C14607j486l6041c7410C21866l209Q3491p7968d7754H8418K56553G6900
$$ 314607 313121 277080 -37410 321866 318657 402148 324180 -47754 88418 344971 76900
13418a3286G57950l76610M0417j75452A01770K66919b8645C23042d6230B95095
$$ -13286 757950 381340 421757 246305 101770 368689 -28645 323042 -46230 295095
13407A29703n2038J31293c2899H5631A0012Q0877G453N9610J23317J33351r7990
$$ 129703 77665 208958 -32899 85631 10012 90889 7453 67063 190380 323731 225741
13396B25741j00555J8593L01890A14486J55019J09184j28663L7124R6651J27986
$$ 225741 125186 143779 445669 114486 269505 378689 250026 287150 383801 511787
13386E11787A79711R7511a04888A84892J894Q8728j09247E0234K19213q529A24969
$$ 511787 179711 277222 -104888 184892 186786 275514 166267 50234 269447 260918 124969
13374D34394J25309J0965H6204O1876G3079K03913L59953k90179j63943N6678
$$ 434394 559703 570668 86204 148080 73079 276992 636945 346766 182823 239501
13364B39501J13837m5460R558j16382C9273L25911C9110J42857K49411j82174
$$ 239501 353338 307878 317436 201054 39273 365184 39110 181967 431378 249204
13354B49204A06901J85919m6357j10430L17180q0307J36990j21578j7346O8089
$$ 249204 106901 292820 246463 136033 453213 372906 509896 388318 370972 439061
13344D39061j81891K8050j04090K71134j68418N6750p2881m5656K09059j05368
$$ 439061 257170 285220 181130 452264 283846 340596 267715 222059 431118 325750
13334C25750N3841G7798N4441O3176B0287J64935L11597A11745k6856L14831j26547
$$ 325750 379591 77798 132239 195415 20287 185222 496819 111745 84889 399720 273173
13323B73173H8393L76260J15294k69218p5668O5754l5115J28199j05918j19749
$$ 273173 88393 464653 579947 310729 235061 300815 265700 393899 287981 168232
13313A68232A7926J74583K31326K1580B11683J20448r6730F4927J61589j5964
$$ 168232 17926 192509 423835 445415 211683 332131 235401 64927 226516 210552
13303B10552J21934a11066B80869A13463A3833J89431O3658F3854K3998l85B9229
$$ 210552 332486 -111066 280869 113463 13833 203264 266922 63854 87852 87467 29229
13291h2540B42797a03949A88026g100A45181k4597a27170F0334b4530C17069D5181
$$ -82540 242797 -103949 188026 -7100 145181 120584 -127170 60334 -24530 317069 45181
13279D048b5191A99217n71K63834A09622K03847b7884A71939a5857D05741A96459
$$ 4048 -25191 199217 198646 462480 109622 313469 -27884 171939 -15857 405741 196459
13267A17636P6415f7124B0111J71183o1473K02846B5094a4779C23901f2826A61995
$$ 117636 194051 -67124 20111 191294 129821 332667 25094 -14779 323901 -62826 161995
13255A74956o5352a6850C77966A31808J74165k7968A6255K92819j44315A7644
$$ 174956 109604 -16850 377966 131808 305973 278005 16255 309074 164759 17644
13244C5436J64110J5191q468G8857A4347J34508j0547N587l177b44374a0274F5952
$$ 35436 199546 214737 206269 78857 14347 148855 138308 143895 140718 -244374 -10274 65952
13231A58431J05323o6519Q4004E0568b28621D00908a26282D13958j02672d0925
$$ 158431 263754 197235 281239 50568 -228621 400908 -126282 413958 311286 -40925
13220D3046J75721B7399i8349C58797e0058A21727E7121A6174J19321J59011d7758
$$ 43046 218767 27399 -98349 358797 -50058 121727 57121 16174 135495 294506 -47758
13208e4091H231h0649j76125c067C7942R8721J8427F6979G826b54300a10681C47684
$$ -54091 8231 -80649 -256774 -3067 37942 136663 155090 66979 7826 -254300 -110681 347684
13195F2099M0077l4856J33399k8601a54458e8876k1692C37111I6079a80603C5960
$$ 62099 102176 67320 200719 172118 -154458 -58876 -80568 337111 96079 -180603 35960
13183d5401H901a00004B41489f3987A74712B6562K92070f723C63429I7308M9655
$$ -45401 8901 -100004 241489 -63987 174712 26562 318632 -6723 363429 97308 146963
13172A46963E5129P7679d1067p4037D9867J22381a0329C68619p2623C9474i4408
$$ 146963 55129 132808 -41067 -115104 49867 172248 -10329 368619 295996 39474 -94408
13160H334b2266E28513a63233N5398C15267A34503K39862C6707K61974a8052A25167
$$ 8334 -22266 528513 -163233 -107835 315267 134503 374365 36707 298681 -18052 125167
13148G071e2757E5916O1170K17360I4360K98678h9937B6262J02682l6868J24039
$$ 7071 -52757 55916 117086 334446 94360 393038 -89937 26262 128944 92076 216115
13137B16115q8182M27390g70k895H0948l0439J20354a95179D0225b06372B80396
$$ 216115 127933 555323 -770 -3665 80948 50509 170863 -195179 40225 -206372 280396
13125b6928k22112b6491l6264n7863D0479a03075A08676J04070P3512d0751E0401
$$ -26928 -249040 -26491 -62755 -120618 40479 -103075 108676 212746 286258 -40751 50401
13113f6075b570B0311J28613K4234N4510l4316d7689r2306A64977b5352A78572
$$ -66075 -2570 20311 148924 173158 227668 193352 -47689 -139995 164977 -25352 178572
13101i1516d3329D6321J87063b20804A99893g6055i363p702f454K17E2377b94033
$$ -91516 -43329 46321 233384 -220804 199893 -76055 -9363 -17065 -6454 -6237 52377 -294033
13088f5228A22688m4950c9254A95029q5169P3217A3616i8424j13922h0356E3772
$$ -65228 122688 77738 -39254 195029 109860 183077 13616 -98424 -212346 -80356 53772
13076C0023J25275O7032q8803K06983j00015D8227J71334j00494K5797i164B41296
$$ 30023 155298 222330 133527 340510 240495 48227 219561 119067 144864 -9164 241296
13064A13810a22714K0088B65245j15667j3915a33619N5803l3467B6766J40309
$$ 113810 -122714 -102626 265245 149578 135663 -133619 -77816 -111283 26766 167075
13054A67075o9356M12555j70424A65744R6638a35264B13485o4616L4866K37101
$$ 167075 97719 510274 339850 165744 262382 -135264 213485 148869 183735 420836
13044D20836j01876J70920F9567K58578j16829L3557d6509A43946C2248A0924
$$ 420836 318960 489880 69567 328145 211316 244873 -46509 143946 32248 10924
13033C28961r1159A00271K9467m7353A5341K35148J15934j67360b09356E7360
$$ 328961 237802 100271 129738 82385 15341 250489 366423 199063 -209356 57360
13022B91312J02856G9122K1044N3660m4111C6253K29758F271J67910O5671k6034
$$ 291312 394168 79122 100166 153826 109715 36253 266011 6271 174181 239852 213818
13011B13818G0076a98619K4677I8933c8316J6499k13751B37686a89177e294B40111
$$ 213818 70076 -198619 -173942 98933 -38316 -21817 -235568 237686 -189177 -5294 240111
12999a28408B310M42066k12622D0505A4120b5179k36405I5910A5878c136B14009
$$ -128408 2310 444376 231754 40505 14120 -25179 -261584 95910 15878 -3136 214009
12987C4993b91990B25345G0423Q2509A4371O5609J16368J20343b00140B99106
$$ 34993 -291990 225345 70423 152932 14371 79980 196348 316691 -200140 299106
12976E4253f3249B63187K0145a97945A18772J29311a49361d356o3269k6467D80436
$$ 54253 -63249 263187 283332 -197945 118772 248083 -149361 -4356 -67625 -94092 480436
12964G2254N5042d591j06422A78954O382i9532A41570R6886j5288I1117K56467
$$ 72254 127296 -4591 -111013 178954 185336 -99532 141570 238456 223168 91117 347584
12953C47584j70735l9889F4231K2892j8956h134j22353c5659H9074i3517G1965
$$ 347584 176849 136960 64231 87123 68167 -8134 -130487 -35659 89074 -93517 71965
12941c5513C7554L9121B3254L2288J0235b38947J13415k30552d4760J9403A86567
$$ -35513 37554 76675 23254 55542 65777 -238947 -125532 -356084 -44760 -25357 186567
12929e2305C04912k2436N5694j14694a76749e5j93869e5418l0744B73827C95Q8210
$$ -52305 304912 282476 338170 223476 -176749 -55 -193924 -55418 -86162 273827 395 88605
12917H8605f46m3740B1228a05166D2154a15356A87858c9625l0492C38764j4148
$$ 88605 -646 -44386 21228 -105166 42154 -115356 187858 -39625 -70117 338764 324616
12906C24616B3240J82772a4754m0131b63B76889f8116j07211C7893b02014h7323
$$ 324616 23240 206012 -14754 -54885 -263 276889 -68116 -175327 37893 -202014 -87323
12894A66922l1722c37965A45169b17910Q8535F3769c66539B60128d4423E49485
$$ 166922 135200 -337965 145169 -217910 -129375 63769 -366539 260128 -44423 549485
12883f1449A00641K5927k9332j0846J0719b98462A12412h0856b0208o2384K614
$$ -61449 100641 126568 97236 86390 97109 -298462 112412 -80856 -20208 -82592 -79978
12872g9978H9550D0999a79608a824j38864E7712b1020G7476C2435O9053A3956
$$ -79978 89550 40999 -179608 -1824 -140688 57712 -21020 77476 32435 101488 13956
12860H2905j0006N040a5523C7983K461J39461N237D2639A2783K31439j6290I4403
$$ 82905 72899 77939 -15523 37983 40444 179905 185142 42639 12783 244222 227932 94403
12847a47620H8025P4183a18752B78159a68035B73880a1556B71803C5842f3056
$$ -147620 88025 162208 -118752 278159 -168035 273880 -11556 271803 35842 -63056
12836A18509R0513i1090j62515c3697A00302B7934K54202c33214K7758B46707
$$ 118509 209022 -91090 -253605 -33697 100302 27934 282136 -333214 -305456 246707
12825b3553g241j26772D9816J07464D8381A5633R5727i2848A98923a68817m117
$$ -23553 -7241 -134013 49816 157280 48381 15633 111360 -92848 198923 -168817 -172934
12814a72934b3035r1334M0960A14920J54167L452L8769d7785A23114Q5253J87582
$$ -172934 -23035 -114369 -73409 114920 269087 272539 311308 -47785 123114 208367 395949
12803C95949h1903F4832B4765L12987A58183a27746A678N0444J46129B7981b3084
$$ 395949 -81903 64832 24765 337752 158183 -127746 1678 52122 198251 27981 -23084
12791B60066B1833J82674d376D1489a25722k16360D12518F5120B5272i369p6372
$$ 260066 21833 204507 -4376 41489 -125722 -342082 412518 65120 25272 -9369 -85741
12780h5741M571b012k40218A78374l2235a08244D9081J57429N534a28869A2242
$$ -85741 -81170 -2012 -242230 178374 146139 -108244 49081 206510 212044 -128869 12242
12768e5612F8315c0814j4333k85862H8759b7754A79395b84982B50843C4573i2832
$$ -55612 68315 -30814 -45147 -331009 88759 -27754 179395 -284982 250843 34573 -92832
12756C3431c69524J62073B29394b67113I6026L33692a37604A47307a04874D8363
$$ 33431 -369524 -207451 229394 -267113 96026 429718 -137604 147307 -104874 48363
12745a00624A15562E62K59486b27451F4832A6760J02852e8839C27678J0820a4336
$$ -100624 115562 562 260048 -227451 64832 16760 119612 -58839 327678 338498 -14336
12733A29991p08C3841b96765A06268L7358L2499F6613a86766I0847K27155N3889
$$ 129991 129283 33841 -296765 106268 143626 176125 66613 -186766 90847 318002 371891
12722C71891b06803A29620B8607Q2068l9503J18346d9306B70951G316K6365a68201
$$ 371891 -206803 129620 28607 110675 71172 189518 -49306 270951 7316 33681 -168201
12710c236E3278o660J35811J22536a24903c6024j6940A78483L4029L48936I7291
$$ -3236 53278 46618 182429 304965 -124903 -36024 -52964 178483 212512 561448 97291
12698a37504E21628B03727L41984b3224I7381d8532A0295a6302f598F947L37916
$$ -137504 521628 203727 545711 -23224 97381 -48532 10295 -16302 -6598 6947 344863
12687C44863A50868n2652g1473B64513q8783l6274K2770N0519h573B87862A11098
$$ 344863 150868 98216 -71473 264513 175730 139456 162226 212745 -8573 287862 111098
12675a81171A35747m7780J3388K02970L8325a62985H4880g2250G5264e8443B00320
$$ -181171 135747 87967 101355 304325 342650 -162985 84880 -72250 75264 -58443 200320
12663A18034N4802o2401L04955G5000J99374b05333g8439B42268O116A20243K20810
$$ 118034 172836 110435 415390 75000 274374 -205333 -78439 242268 248384 120243 341053
12652C41053H5521l4672J06295E0875a9425k7165B79582G4349J14860a51439d4777
$$ 341053 85521 50849 157144 50875 -19425 -46590 279582 74349 189209 -151439 -44777
12640B0740K46172M483J05780J68468i7060g48A15296R4748H2060r380M0706b39382
$$ 20740 266912 271395 377175 545643 -97060 -748 115296 210044 82060 72680 113386 -239382
12627A0252J07952K02632o7926I2366K33332H198J22137Q6733p6667a61844B56972
$$ 10252 118204 320836 252910 92366 325698 8198 130335 217068 140401 -161844 256972
12615A18221M068b51548B61597q2633n8718K7952a25694H2644d0810k03008B31270
$$ 118221 122289 -251548 261597 178964 120246 148198 -125694 82644 -40810 -243818 231270
12603C177K67700l7947A09479B4612j0769c4009B98530A39424E6330a80826k9824
$$ 3177 270877 232930 109479 24612 13843 -34009 298530 139424 56330 -180826 -210650
12592b10650R5908C86173F1554L1797f0975A75432b63175B7002M8956c36245B55435
$$ -210650 -114742 386173 61554 93351 -60975 175432 -263175 27002 75958 -336245 255435
12580F1279R5175A6436L68056a22613A70854n7340R6494l423I6507h792I4820
$$ 61279 156454 16436 384492 -122613 170854 113514 210008 206585 96507 -8792 94820
12568a26063j854K1899B03631j2956B9163g8090l8590k80576B4640i9597d2333
$$ -126063 -127917 -106018 203631 190675 29163 -78090 -116680 -397256 24640 -99597 -42333
12556D8781N4976a43361G6203c3125l7894J8604B52990H0291K89719A40274a48195
$$ 48781 103757 -143361 76203 -33125 -71019 -52415 252990 80291 370010 140274 -148195
12544c0600I2241a86915B34212H0327J32135g143m9865I1086a02666B63805Q9345
$$ -30600 92241 -186915 234212 80327 212462 -7143 -57008 91086 -102666 263805 353150
12533C53150i8970j98697J34927f5514a0060B0366a08638B68012g7338j91592
$$ 353150 -98970 -297667 -162740 -65514 -10060 20366 -108638 268012 -77338 -268930
12523b68930O3227A42126L4398G3781j6946J93770P599O438a99457A94353P224
$$ -268930 -205703 142126 176524 73781 56835 250605 258204 264642 -199457 194353 201577
12512B01577p4793F871N5765P6310n5748M4604J1013j9564j7514m7518a18816
$$ 201577 126784 6871 62636 138946 83198 127802 138815 119251 101737 54219 -118816
12500b68977K315C3732c27949A94341B0773K64617a72709b1070q2485B7086a46136
$$ -268977 -266662 33732 -327949 194341 20773 285390 -172709 -21070 -103555 27086 -146136
12488A30778B4128d0305C34819A50242b79561i6704b2259j82161P108N6013a114
$$ 130778 24128 -40305 334819 150242 -279561 -96704 -22259 -204420 -197312 -141299 -1114
12476C58003e83796I3342a01768b8656k24414j63601H641K76762a28990A23814
$$ 358003 -583796 93342 -101768 -28656 -253070 -416671 8641 285403 -128990 123814
12465A04284a5224A42467i0041E8028d11203D364a90196G1437b86134J33367b4103
$$ 104284 -15224 142467 -90041 58028 -411203 4364 -190196 71437 -286134 -152767 -24103
12453C19783b6583A706b18429N8016B89887f7137A78706G3444b980r3659j10910
$$ 319783 -26583 1706 -218429 -160413 289887 -67137 178706 73444 -2980 -96639 -207549
12442b07549c8315A44846a65679a3739j22942A02514K81369c31400A53758J27221
$$ -207549 -38315 144846 -165679 -13739 -136681 102514 383883 -331400 153758 280979
12432B80979a33602b7488j8838k8761E6509R3226L93824h4427C0679e4400l3763
$$ 280979 -133602 -27488 -46326 -75087 56509 149735 543559 -84427 30679 -54400 -88163
12421h8163q9066P3466A26352a38565q0882p109H5019j8405J24648a65865A80205
$$ -88163 -177229 -103763 126352 -138565 -219447 -226556 85019 66614 191262 -165865 180205
12409i3868c4773l32169a8663r9245d2637F6591C711a88979C49299C669Q4120
$$ -93868 -34773 -366942 -18663 -117908 -42637 66591 3711 -188979 349299 3669 87789
12398H7789C8806J66114a1683p9441j74830C0576O4651a50306j4633C3973P3347
$$ 87789 38806 204920 -11683 -91124 -265954 30576 95227 -150306 -164939 33973 107320
12387A07320b24079k055c5251k5047k93717B57594a1000A52350g4792j55612L4595
$$ 107320 -224079 -226134 -35251 -60298 -354015 257594 -11000 152350 -74792 -230404 -195809
12376a95809A04916a99560G5653K163J12963b40922m9344e8149B54787q6853b5091
$$ -195809 104916 -199560 75653 77816 190779 -240922 -290266 -58149 254787 167934 -25091
12364a19989N1266a0827I1415J39388i8291q085B14032a84054J3940g2765n3889
$$ -119989 -68723 -10827 91415 230803 -98291 -106376 214032 -184054 -170114 -72765 -126654
12353a26654A26984b37553g3230q9440F3852b42536A10606L7944a0609F3455b2525
$$ -126654 126984 -237553 -73230 -162670 63852 -242536 110606 148550 -10609 63455 -22525
12341A02130i9181D3888K27247j29242B7927L28371b372C6992h5430k14161A70883
$$ 102130 -99181 43888 271135 141893 27927 356298 -2372 36992 -85430 -299591 170883
12329B76165r1689e0380k01760J02638q7639C18755a43868l6146j8107A29591
$$ 276165 184476 -50380 -252140 -149502 -237141 318755 -143868 -180014 -198121 129591
12318A69397B5166e0160A40389J93133q9118b29088L9104B31646j02059l7672
$$ 169397 25166 -50160 140389 333522 244404 -229088 -189984 231646 129587 91915
12308I1915d8477N010l4161l402b5215q9872D63476a88575L0191N3182E9008e5616
$$ 91915 -48477 -43467 -77628 -81030 -25215 -115087 463476 -188575 -158384 -105202 59008 -55616
12295A00184a20288B48537C0828J40827c04598A96912N0524a33635O346a8928
$$ 100184 -120288 248537 30828 171655 -304598 196912 247436 -133635 -127289 -18928
12284D4454R1907A4741K25655C0688J45954p9185N5813b12960B22196J36476a43779
$$ 44454 136361 14741 240396 30688 176642 97457 153270 -212960 222196 358672 -143779
12272A31280K78313B5168L8352c979A99839a47342I5581L08356I1519K25829D3139
$$ 131280 409593 25168 63520 -3979 199839 -147342 95581 403937 91519 317348 43139
12260b35171A17828M4903c7893E2646K17512H1449j5672K80583A57208J64871
$$ -235171 117828 162731 -37893 52646 270158 81449 65777 346360 157208 322079
12250C22079J44189B8235A2942a17138D03820f575j92732A69061a65153A36325
$$ 322079 466268 28235 12942 -117138 403820 -6575 -199307 169061 -165153 136325
12239A4797O4566g0311I6528J15427o2691g7856l3553B75989H8882J48193q815
$$ 14797 79363 -70311 96528 211955 149264 -77856 -111409 275989 88882 237075 228260
12228B28260n8977a13564A44142p432L92402k37584n0717J57150H0619N1097J81085
$$ 228260 169283 -113564 144142 136710 529112 291528 240811 397961 80619 131716 312801
12217C12801A30486a16360A92557a53255J987B29068m6296n4405a35274B27039
$$ 312801 130486 -116360 192557 -153255 -151268 229068 182772 128367 -135274 227039
12206B55183B6216L32305I2587J4535J4564a46112I9325J04107J62596p8709O8450
$$ 255183 26216 358521 92587 107122 121686 -146112 99325 203432 366028 287319 355769
12195C55769g2345j27867D04799A66683J41414A2770N8654L84132H988L41895
$$ 355769 -72345 -200212 404799 166683 308097 12770 71424 455556 8988 350883
12185C50883g6153C12281A47521M2984n8788c86826B05754B9197h7397A98584
$$ 350883 -76153 312281 147521 190505 131717 -386826 205754 29197 -87397 198584
12174b5151A61504a53105h314C12338J644j27405B3624a1816k06546D04308d4398
$$ -25151 161504 -153105 -8314 312338 313982 186577 23624 -11816 -218362 404308 -44398
12162E5812K1316d5406A04682a27284J4891D15341a71585A36472a39515O5610
$$ 55812 77128 -45406 104682 -127284 -112393 415341 -171585 136472 -139515 -73905
12152g3905J3961A09884E1253a12941j05463C1064a04835F7027a0689j75206P987
$$ -73905 -59944 109884 51253 -112941 -218404 31064 -104835 67027 -10689 -185895 -177908
12141a77908A58891K57649a50525j47136C63845A1689b62494F3600R3967b1221
$$ -177908 158891 416540 -150525 -297661 363845 11689 -262494 63600 157567 -21221
12130I5678R8798C9565J54484n1611O6017b6876E9997J36441E6726a73922K1410
$$ 95678 194476 39565 194049 142438 208455 -26876 59997 196438 56726 -173922 -152512
12119a52512a8632C98535e6163l32025A18589n9127B4899m749R4421a30497B1292
$$ -152512 -18632 398535 -56163 -388188 118589 59462 24899 20150 114571 -130497 21292
12107I47J08392K3409A7893P2217d5060A61922J07538a9979l8171l04716B29923
$$ 947 109339 132748 17893 90110 -45060 161922 269460 -19979 -58150 -362866 229923
12095a63899o4735C10453a06393b7949l40231g1329j26541j453g6578n458B3679
$$ -163899 -228634 310453 -106393 -27949 -368180 -71329 -197870 -199323 -76578 -82036 23679
12083i331j49740A5731N8330i6773l5493e4716A56482A6307a4791B07469r8486
$$ -9331 -159071 15731 74061 -96773 -132266 -54716 156482 16307 -14791 207469 108983
12072A08983J42625a68746h3061k55810c261C0608K72735r6872J56011K5245N92438
$$ 108983 251608 -168746 -83061 -338871 -3261 30608 303343 206471 362482 387727 980165
12061I80165O96310p89514B03260J01369k4477a76510P6407B41777E3193f764
$$ 980165 1676475 886961 203260 304629 280152 -176510 -100103 241777 53193 -6764
12050a45796J8588q6341g5857G1381M5938L0960f3358A88088c54436i191A05667
$$ -145796 -127208 -213549 -75857 71381 117319 148279 -63358 188088 -354436 -9191 105667
12038a66097O1297D8200b91815C3925J30634a84859L7793C7874J6291a3499c311
$$ -166097 -104800 48200 -291815 33925 164559 -184859 -147066 37874 54165 -13499 -3311
12026G3736a38609f0465A93811a26621C26425P1587F1648e0148i349j93864A04237
$$ 73736 -138609 -60465 193811 -126621 326425 398012 61648 -50148 -9349 -203213 104237
12014d0550C06987f1103K6405M831o3112f002G3741b41338j3879A43701b31940
$$ -40550 306987 -61103 -34698 -29867 -92979 -6002 73741 -241338 -255217 143701 -231940
12002I764K5455a6240j9234A98863a48319Q142k77829K02678H5684K66019a39981
$$ 9764 35219 -16240 -35474 198863 -148319 -140177 -418006 -215328 85684 351703 -139981
11990g8525K5262A57447b67229c002l28199E9158a83591b8679H30J02697k3889
$$ -78525 -53263 157447 -267229 -3002 -331201 59158 -183591 -28679 830 103527 79638
11979G9638K4303a43574k0891H2696a15283C0317d5197k32454e9910B74331a03430
$$ 79638 103941 -143574 -164465 82696 -115283 30317 -45197 -277651 -59910 274331 -103430
11967g3074A55451C3186d33131J70603A58035f6547l06624A40905A8044L05428
$$ -73074 155451 33186 -433131 -262528 158035 -66547 -373171 140905 18044 323472
11957C23472A52002g9489I4281J04641q3954i5479J7825l4629J6072H7926d4064
$$ 323472 152002 -79489 94281 198922 114968 -95479 -77654 -112283 -96211 87926 -44064
11945a6144B5813G042g0360b7635B1239a28617c2002j32977B06703m0795a63276
$$ -16144 25813 7042 -70360 -27635 21239 -128617 -32002 -164979 206703 165908 -163276
11933a47626p753A71563c803l44936J47861a7014A02170a01184A16661B5171a52624
$$ -147626 -155379 171563 -3803 -348739 -200878 -17014 102170 -101184 116661 25171 -152624
11921D1526N2079b16520F6911a02958a379B38498c73716A96437d1527j95113D6861
$$ 41526 93605 -216520 66911 -102958 -1379 238498 -373716 196437 -41527 -236640 46861
11909F7700b0632F5319b82139e5892B06023o8238b0417m3710m5443M0643K6358
$$ 67700 -20632 65319 -282139 -55892 206023 137785 -20417 -64127 -109570 -68927 -42569
11898d2569f791A73668b64819a09648H7028R5639b31316l7855j62425A8283Q2932
$$ -42569 -6791 173668 -264819 -109648 87028 182667 -231316 -269171 -431596 18283 101215
11887A01215d4492B56982a51317A19724b50913k6763A29395E6150a32741I7411
$$ 101215 -44492 256982 -151317 119724 -250913 -277676 129395 56150 -132741 97411
11876A24841d2225o7097H8426J91531b68581A64969b0444l1592F4885a86971j24302
$$ 124841 -42225 -109322 88426 279957 -268581 164969 -20444 -52036 64885 -186971 -311273
11865c11273Q1811J2392g6062j09198F9806b37479B05604e1457o849m9581j07595
$$ -311273 -229462 -217070 -76062 -185260 69806 -237479 205604 -51457 -58306 -107887 -215482
11854b15482k3532A4724a67746B87899A16470e27803K19299r5774A5636P3986
$$ -215482 -239014 14724 -167746 287899 116470 -527803 -308504 -404278 15636 89622
11844H9622a70866H1741b10284E3797b14552o3066h5343j8633a5678B5603Q226
$$ 89622 -170866 81741 -210284 53797 -214552 -277618 -85343 -103976 -15678 25603 33829
11833C3829A6425K8843R8951m7515b31748o7631H0270a52104b7462A45795b9259
$$ 33829 16425 45268 144219 96704 -231748 -299379 80270 -152104 -27462 145795 -29259
11821A60073E579a2805j98157F7295a99743O1228D72545A52357o5178f4226K5123
$$ 160073 5579 -12805 -210962 67295 -199743 -138515 472545 152357 87179 -64226 -39103
11810c9103k3053B2868g2106j31458F1190a87509o905C3509n142O1185C0095a172
$$ -39103 -62156 22868 -72106 -203564 61190 -187509 -194414 33509 28367 89552 30095 -1172
11797G9283c00240A39364F5290M1052J49643A05216c7190I5200h1252B4519J49440
$$ 79283 -300240 139364 65290 106342 255985 105216 -37190 95200 -81252 24519 173959
11786A73959b32714h5136m3066B08787d04023E6033d500B44491m348g2516B72941
$$ 173959 -232714 -85136 -128202 208787 -404023 56033 -4500 244491 240143 -72516 272941
11774g0393J4568A20838f5800j55162i850q9659c7758j09717A74240K2306m5383
$$ -70393 -55825 120838 -65800 -220962 -9850 -99509 -37758 -147475 174240 196546 151163
11763A51163L676j7654K52626c2232D2431O0711k834a2285F8965j2792c7265C30085
$$ 151163 154839 137185 389811 -32232 42431 103142 100308 -12285 68965 56173 -37265 330085
11750f6848k49674A03013f1246j1555j4225E5294K18655F6175J43208C1331b054
$$ -66848 -316522 103013 -61246 -72801 -87026 55294 273949 66175 209383 31331 -2054
11738d0976a0599l13923C158Q6318a3211C19757j04479d8715q1470o1329O2690
$$ -40976 -10599 -324522 3158 89476 -13211 319757 215278 -48715 -130185 -191514 -128824
11727a28824A62496P5506b79775J15961n6923J01424N1934L3316k0214l121j25806
$$ -128824 162496 238002 -279775 -163814 -220737 -119313 -67379 -34063 -54277 -57398 -183204
11716a83204A69331J04822c9964p1444j46310D2895d5736B53927C7419K52924
$$ -183204 169331 274153 -39964 -111408 -257718 42895 -45736 253927 37419 290343
11706B90343A9405L81581g0192j73773B81857q7406c2374A25149a96719d2949
$$ 290343 19405 400986 -70192 -243965 281857 194451 -32374 125149 -196719 -42949
11695A15262i005A70373i7185F4575a35750C76936j4962G2465L7210b34394C9794
$$ 115262 -9005 170373 -97185 64575 -135750 376936 361974 72465 109675 -234394 39794
11683G2565J77309D3796J20811a67536L5197C41652a8723B27149O2201a3388k392
$$ 72565 249874 43796 164607 -167536 -132339 341652 -18723 227149 289350 -13388 -15780
11672a5780K479m2358A46376N518O8718c6855a1768E1408b73423k5175A6022d30963
$$ -15780 -13301 -55659 146376 151894 220612 -36855 -11768 51408 -273423 -298598 16022 -430963
11659E1232P5540a53972M0244H5475R9373h8825B08185a9661k3503A59247l0705
$$ 51232 126772 -153972 -113728 85475 184848 -88825 208185 -19661 -43164 159247 128542
11648A28542l1641D2747b3873A00969J7905M493j5855a53775A96474f7483C91589
$$ 128542 96901 42747 -23873 100969 118874 123367 107512 -153775 196474 -67483 391589
11636a03184C49359e8035A3800e6353B5038L8992g7238A48353b8654C9461c2163
$$ -103184 349359 -58035 13800 -56353 25038 64030 -77238 148353 -28654 39461 -32163
11624c2202C34377B7755J85549o1271C1132g3854o4459a060B47519C2151a43214
$$ -32202 334377 27755 213304 152033 31132 -73854 -138313 -1060 247519 32151 -143214
11612H5007L1338O8800c04630A08721c34524E8579J93828c7737A11984C6044a13405
$$ 85007 116345 185145 -304630 108721 -334524 58579 252407 -37737 111984 36044 -113405
11600A21041K6965H143a19792M9641C6558J04208B1813b16580A01653j8638g4906
$$ 121041 148006 8143 -119792 -70151 36558 140766 21813 -216580 101653 83015 -74906
11588B86641i0049h315G0238N2125J23464K4026a03519C18663a24266B42484J08235
$$ 286641 -90049 -8315 70238 122363 245827 269853 -103519 318663 -124266 242484 350719
11577C50719A45529a43510C05032a435C19179a00688B58801r8659d0286A99808
$$ 350719 145529 -143510 305032 -1435 319179 -100688 258801 160142 -40286 199808
11566h023A51960F8106c7652B88261j33896f3466B20542b6436C1280K5590L87867
$$ -8023 151960 68106 -37652 288261 154365 -63466 220542 -26436 31280 56870 444737
11555D44737H6222O3639E9934B2710J17162b54670I275L05556D0259J20775J25259
$$ 444737 86222 149861 59934 22710 139872 -254670 9275 314831 40259 161034 286293
11544B86293a2949A03183L1940g7439B16135M4939i5035A42740I683L83371g1742
$$ 286293 -12949 103183 135123 -77439 216135 261074 -95035 142740 9683 393054 -71742
11532H8900N1527n2791Q9901Q4045a06355A18890j641l6214h6340A72047e9473
$$ 88900 140427 87636 177537 261582 -106355 118890 117249 81035 -86340 172047 -59473
11520c4532C30716a03505B49543l4560a88793a0608C48894I5382c2088B6279c15776
$$ -34532 330716 -103505 249543 214983 -188793 -10608 348894 95382 -32088 26279 -315776
11508C99861A35820J3696J4255A1724L38780r1533C7024K26845C8078J18877a2019
$$ 399861 135820 149516 163771 11724 350504 258971 37024 263869 38078 156955 -12019
11496A97021L5441A8760M2747J93053j11051L237K5326K41219F0949K88058g0421
$$ 197021 232462 18760 61507 254560 143509 146746 172072 413291 60949 349007 -70421
11484A41347J26397L98563C1252c67798B08069q0551K93251A45540J10817m8333
$$ 141347 267744 666307 31252 -367798 208069 127518 420769 145540 256357 208024
11474B08024J23230a41420A77248o922q636J6467a62270B86473j26924K09794
$$ 208024 331254 -141420 177248 170326 161690 178157 -162270 286473 159549 369343
11464C69343F8745L3910m2595b0687A73945j8281l1664L46718A96652J66897I6675
$$ 369343 68745 102655 60060 -20687 173945 155664 124000 470718 196652 363549 96675
11452A62874L4053F4867J99889g4417B21794e1082K5083k2599P078j0343A12680
$$ 162874 196927 64867 264756 -74417 221794 -51082 -25999 -48598 -41520 -51863 112680
11440A68978J16547N138G9824b32139B00316l3576j8364a26705J9944A51301c14245
$$ 168978 285525 290663 79824 -232139 200316 166740 148376 -126705 -106761 151301 -314245
11428a09705F8732P2370d6858i189k2704B25680h6226j96343D3238J0242l45a79770
$$ -109705 68732 141102 -46858 -9189 -31893 225680 -86226 -282569 43238 53480 53135 -179770
11415a58915F1549K6077a7994A50216E3247f8910c1948a1586B77355G1231l2154
$$ -158915 61549 87626 -17994 150216 53247 -68910 -31948 -11586 277355 71231 39077
11404C9077i7024H8451L71660j40550J6621j53325p2508m6919A2421Q5862c0673
$$ 39077 -97024 88451 460111 319561 336182 182857 110349 63430 12421 98283 -30673
11392a39481a7173k49790b2779l23572A23025b36814B39390I0595l6103c8303
$$ -139481 -17173 -266963 -22779 -346351 123025 -236814 239390 90595 54492 -38303
11381b2799j70011G4729a2685o4432p4045L3956A53177B8432a38753A26441E4450
$$ -22799 -192810 74729 -12685 -77117 -151162 -117206 153177 28432 -138753 126441 54450
11369a06061F0754M9665q056K2508a55008J6507G603d806j9301B776f2864G3265
$$ -106061 60754 110419 102363 124871 -155008 -138501 7603 -4806 -24107 2776 -62864 73265
11356B5350d2478j22541C32716D798b84555J23914H360J71067G8721a16362a8909
$$ 25350 -42478 -165019 332716 4798 -284555 -160641 8360 179427 78721 -116362 -18909
11344G0954a69103H3253B7459a43202F3525J21127N0355H0245e7395E0764K74962
$$ 70954 -169103 83253 27459 -143202 63525 184652 235007 80245 -57395 50764 325726
11333C25726K989F8076a26345e3591j89922B55043k4348H9992Q1791b0567E2541
$$ 325726 328715 68076 -126345 -53591 -243513 255043 230695 89992 171783 -20567 52541
11321A67498a11819K3514k474B79705b59649A74304c7944C45786i3271D85330
$$ 167498 -111819 -88305 -90779 279705 -259649 174304 -37944 345786 -93271 485330
11310A01662J4465c20366J45966C8874L78307j89520K3026A1741L326c00948P9097
$$ 101662 116127 -320366 -174400 38874 417181 227661 250687 11741 15067 -300948 -221851
11299b21851A84178e7535A9140p427b60789f6623j47208e5179k7309f97A2673
$$ -221851 184178 -57535 19140 11713 -260789 -66623 -213831 -55179 -82488 -697 12673
11287B6916R5519c2106C2622J47498b16689l9461p5920J25677A69348p4134J11389
$$ 26916 122435 -32106 32622 180120 -216689 -256150 -332070 -206393 169348 95214 206603
11276B06603a62833j37263f9552A81665a44471o4930k73762b9460k4985k3394
$$ 206603 -162833 -300096 -69552 181665 -144471 -209401 -483163 -29460 -54445 -77839
11266g7839B80629c1545j83658A24074d3779H8041a64933H5905J96890L6634a64572
$$ -77839 280629 -31545 -215203 124074 -43779 88041 -164933 85905 282795 319429 -164572
11254a26518j49748a30907r1458B17753h9211B23234j09640K1923h7403o9878
$$ -126518 -276266 -130907 -222365 217753 -89211 223234 113594 135517 -87403 -157281
11244a57281B3411d03322B02047a13292L560B00718a73808D7108b07642h5045
$$ -157281 23411 -403322 202047 -113292 -109732 200718 -173808 47108 -207642 -85045
11233b9567j93292A27486m1681g6983a9111k52514p9832G6548c9575j50433m5868
$$ -29567 -222859 127486 85805 -76983 -19111 -271625 -351457 76548 -39575 -190008 -235876
11222b35876i3923M5846B65525a10411j560L550d0780j71556c2938r3293r6983
$$ -235876 -93923 -48077 265525 -110411 -111971 -108421 -40780 -212336 -32938 -126231 -223214
11211b23214e091B21277i9347n4860k03614c6533D16238c7191A28433i5243g176
$$ -223214 -5091 221277 -99347 -154207 -357821 -36533 416238 -37191 128433 -95243 -7176
11199i8215H3935c22718J49630M9234D5553J60808a45378E915P7557a07586D1583
$$ -98215 83935 -322718 -173088 -123854 45553 206361 -145378 5915 83472 -107586 41583
11187c05801G3483b33129a08229k35407F7104M6235k0537b2982j5133j06162d0184
$$ -305801 73483 -233129 -108229 -343636 67104 113339 92802 -22982 -38115 -144277 -40184
11175D640e56931A68611a81293g3029B88178h8570L6288B47433a52502M359M8914
$$ 4640 -556931 168611 -181293 -73029 288178 -88570 -52282 247433 -152502 -148143 -99229
11164i9229K7613m7749k1333l4990j22808c3007l6826m8809r1015k4335A6543
$$ -99229 -71616 -119365 -140698 -175688 -298496 -33007 -69833 -118642 -209657 -233992 16543
11152b59840D7842J74274H3075d5662C0849a0379A78964a62997K9412B8785A3546
$$ -259840 47842 222116 83075 -45662 30849 -10379 178964 -162997 -133585 28785 13546
11140a6464A11715b03894I2140m0767a45110B85736b6879G2542g4155k6447a5828
$$ -16464 111715 -203894 92140 51373 -145110 285736 -26879 72542 -74155 -100602 -15828
11128H5562g1997k14730B635a19350K3776A52666F053h7406A71208n4925b3607
$$ 85562 -71997 -286727 2635 -119350 -95574 152666 6053 -87406 171208 116283 -23607
11116C09481i9186A82855J78546A58771E3949J91199g1183B25793d4529k01454
$$ 309481 -99186 182855 361401 158771 53949 245148 -71183 225793 -44529 -245983
11106b45983A74475R6785f0803C5516a92933i0231A69188J95448e4375A0483K64086
$$ -245983 174475 271260 -60803 35516 -192933 -90231 169188 364636 -54375 10483 274569
11095B74569A22666a60053C47814A60928p6473J87362h9962C6616K80870j18638
$$ 274569 122666 -160053 347814 160928 84455 271817 -89962 36616 317486 198848
11085A98848L2154p0704c2727B40884A2803M28317A66986K75088G0683J58406
$$ 198848 231002 160298 -32727 240884 12803 441120 166986 442074 70683 229089
11075B29089L1109J42710k6228n5926M3060L4576K45802k61036n7094J87432A96792
$$ 229089 260198 402908 376680 320754 363814 398390 644192 383156 326062 513494 196792
11063B53236L45339R8361C35882L16069k25401L53120N9393J80166D80476J44697
$$ 253236 598575 696936 335882 651951 426550 779670 839063 1019229 480476 625173
11053F25173n2088K51515j6609J65835k52133J59688J68034k39827j47482K6297
$$ 625173 573085 824600 807991 973826 721693 881381 1049415 809588 662106 688403
11043F88403K15492k21974J78706K5458k40116K8625L79726r7995Q3079k10681
$$ 688403 903895 681921 860627 886085 645969 674594 1054320 956325 1039404 828723
11033H28723j37757L95122l20798k7351m2913J30031J64818l068o8180n2447j87561
$$ 828723 690966 1086088 765290 737939 695026 825057 989875 986807 918627 866180 678619
11022F78619j41882K96802j55812N0806K07784j84126P2579Q130q0460j66748
$$ 678619 536737 833539 677727 728533 936317 752191 824770 832900 752440 585692
11012E85692L04972k53931M11359p5081p5117k55627R2597l5128J59368k68229
$$ 585692 890664 636733 1048092 973011 897894 642267 734864 699736 859104 590875
11002E90875K71826j87789L32718j57687o9621R0275O7957M1345k15676J7086
$$ 590875 862701 674912 1007630 849943 780322 870597 938554 979899 764223 781309
10992G81309p6804l9502L04997Q9181p6709J37025j36355j29458J40497L80743
$$ 781309 704505 665003 970000 1059181 982472 1119497 983142 853684 994181 1374924
10982A374924O6122j78370J49175K28598j90212J89029M01488L04315R5015N39061
$$ 1374924 1441046 1262676 1411851 1640449 1450237 1639266 2040754 2345069 2440084 2979145
10972B979145J37368K44767K23062k21816l88062n1529j91527m97138n6892j77526
$$ 2979145 3116513 3361280 3584342 3362526 2974464 2922935 2731408 2234270 2177378 1999852
10962A999852l40019J58541L405o0924p60M38219l21608o1753l27542J77895j91264
$$ 1999852 1659833 1818374 1821779 1760855 1760095 2198314 1876706 1814953 1487411 1665306 1474042
10951A474042m96152j91793L7278m2895m6520j70913R4645k8388K8217F8990M34995
$$ 1474042 977890 786097 823375 780480 733960 563047 657692 629304 657521 68990 503985
10940E03985L8B07873j00936f5540D65880e1396G4034K17976j01887a9238B36489
$$ 503985 504023 207873 106937 -65540 465880 -51396 74034 292010 190123 -19238 236489
10928A0462M429Q0134L2552m132J30149J7703b38460a4558r2661c9084A73557
$$ 10462 14891 95025 127577 123445 253594 271297 -238460 -14558 -107219 -39084 173557
10916g2272j45029D92901a78431A603f9778r3291A37841E6984a35896A4423J3602
$$ -72272 -217301 492901 -178431 1603 -69778 -163069 137841 56984 -135896 14423 28025
10905B8025b6988A12886m0861j3678j7171J72448j05950i6047A93341a67105J3423
$$ 28025 -26988 112886 72025 58347 41176 213624 107674 -96047 193341 -167105 -153682
10894a53682A34974a29461I437a36775A09165J62399a37573B52171a38932A67960
$$ -153682 134974 -129461 9437 -136775 109165 271564 -137573 252171 -138932 167960
10883b52712C9068Q3402J93574j50365b6941H4849a15913A47489c19437B6239
$$ -252712 39068 122470 316044 165679 -26941 84849 -115913 147489 -319437 26239
10872B65942h6015K5454j25860B3640b1118E1766a93547H2085f073B01053d4742
$$ 265942 -86015 -60561 -186421 23640 -21118 51766 -193547 82085 -6073 201053 -44742
10860a73310A19481b58401C23334A60133c99347M0559A04368D5002b5539q2726
$$ -173310 119481 -258401 323334 160133 -399347 -358788 104368 45002 -25539 -108265
10850a08265K4272b3091B4808P9811c2160l2377q5921m1925j9427J02905B42567
$$ -108265 -83993 -23091 24808 104619 -32160 -64537 -150458 -192383 -211810 -108905 242567
10838E2529Q8473J20396c66460b4489k22042P5839C18913F0037a98738R2189J9324
$$ 52529 141002 261398 -366460 -24489 -246531 -170692 318913 60037 -198738 -106549 -87225
10827h7225C9830a62483b1803k14393E3054a00235K7218b7694B17646i0864j25967
$$ -87225 39830 -162483 -21803 -236196 53054 -100235 -73017 -27694 217646 -90864 -216831
10816b16831c1531D0071c8569j60136B10930q4193b55487a1529l53064A07429
$$ -216831 -31531 40071 -38569 -198705 210930 126737 -255487 -11529 -364593 107429
10805C7425e1767C1609a77153K8375k4220j26027A69036A4864a07199b2926k54552
$$ 37425 -51767 31609 -177153 -148778 -172998 -299025 169036 14864 -107199 -22926 -277478
10794b77478I4214a85996C51210b24329A88417b19802p6096J24754d9802k1912
$$ -277478 94214 -185996 351210 -224329 188417 -219802 -295898 -171144 -49802 -71714
10784g1714L2168o759B9017e0478I770a43464n1919H159J9810N1723a30453m4280
$$ -71714 -39546 -46305 29017 -50478 9770 -143464 -195383 8159 27969 79692 -130453 -174733
10772a74733j57550a41571c1369j21187E0506N3648b858A64886b09448A43729
$$ -174733 -332283 -141571 -31369 -152556 50506 104154 -2858 164886 -209448 143729
10761C31231b00361b4970F6671d33699a37873O8035B25041I1350d8074j48757
$$ 331231 -200361 -24970 66671 -433699 -137873 -69838 225041 91350 -48074 -196831
10751a96831B6908a499l01263E2613b62180k4369i4448k9071l1530b1632A29075
$$ -196831 26908 -1499 -302762 52613 -262180 -286549 -94448 -123519 -155049 -21632 129075
10739A39849h01j72318H7841i6425k07870n6496a41783e520A07194n3120f9738
$$ 139849 -801 -173119 87841 -96425 -304295 -360791 -141783 -5520 107194 54074 -69738
10727a47939E0271J1704a28508j62666A89193c06807A39139D2519i3791m8476
$$ -147939 50271 61975 -128508 -291174 189193 -306807 139139 42519 -93791 -142267
10717a42267K7003k42813o1032a00901m6485k9509K2951A74067K5967o7551E7753
$$ -142267 -115264 -358077 -419109 -100901 -147386 -176895 -153944 174067 200034 132483 57753
10705g3305j02209e4217a0749l14530a03122B9686h4347J141C8703J15191a38298
$$ -73305 -175514 -54217 -10749 -325279 -103122 29686 -84347 -83206 38703 153894 -138298
10693h25j26498h046k35099n2990A10826a50077C10600I2268Q8152b34760d5849
$$ -825 -127323 -8046 -243145 -296135 110826 -150077 310600 92268 180420 -234760 -45849
10681a09779J6922a7538l5995D4847h396j21337N3636A20150g751A43532E9942
$$ -109779 -92857 -17538 -53533 44847 -8396 -129733 -76097 120150 -7751 143532 59942
10669b23599b9833j8185k20947K2479O3116b0337F6529a64821A44319A4044M2631
$$ -223599 -29833 -48018 -268965 -246486 -183370 -20337 66529 -164821 144319 14044 56675
10658E6675b55480f1596j00455e3519D5920j4080b20160H4665a9751B6828c88283
$$ 56675 -255480 -61596 -162051 -53519 45920 31840 -220160 84665 -19751 26828 -388283
10646c96459H9054a36877B06811r3615c44483P9628A27843e9733O707A7235J71019
$$ -396459 89054 -136877 206811 113196 -344483 -264855 127843 -59733 -53026 17235 188254
10635A88254a82161F2388B0307J49318e442j67429M1291l27198G3699a26366B05463
$$ 188254 -182161 62388 20307 169625 -5442 -172871 -131580 -458778 73699 -126366 205463
10623a1863C8026a40748d5612D70005I8042a10117D12145A81693d4180n7703F4756
$$ -11863 38026 -140748 -45612 470005 98042 -110117 412145 181693 -44180 -101883 64756
10611A201c111j81074j9028B01603d0729k44620J17722J6805A74961J16926H0486
$$ 1201 -3111 -184185 -203213 201603 -40729 -285349 -167627 -150822 174961 291887 80486
10599d62415i5419D0974f6620k46739P7150e0541l03508c6901r0060F1741g4039
$$ -462415 -95419 40974 -66620 -313359 -236209 -50541 -354049 -36901 -126961 61741 -74039
10587I1811P1482A7209a19100C4487d36372A2022a50208B10403a04985n12342
$$ 91811 163293 17209 -119100 34487 -436372 12022 -150208 210403 -104985 -617327
10577f17327i3744d1131I9088J86824b04404I8699b09213C2457M3566J83342h7119
$$ -617327 -93744 -41131 99088 285912 -204404 98699 -209213 32457 76023 259365 -87119
10565C0689M7295J33455a49747d6525C42473D707d5366j06337O6825G6900a31319
$$ 30689 77984 211439 -149747 -46525 342473 4707 -45366 -151703 -84878 76900 -131319
10553B89370M3181i9252A41132a91937B39688B359J3482J01159c14630a08228
$$ 289370 332551 -99252 141132 -191937 239688 2359 15841 117000 -314630 -108228
10542H189f7397j44477j15121H512a18093c7465k14731G9168C7216d70149H9034
$$ 8189 -67397 -211874 -326995 8512 -118093 -37465 -252196 79168 37216 -470149 89034
10530A12235b6023j35623A58340P3944f7321A01261d1444A61558a80776B0003
$$ 112235 -26023 -161646 158340 232284 -67321 101261 -41444 161558 -180776 20003
10519A42741b64002H8269A7098J11218f0684H8007R1584a36822c6879j4297k28754
$$ 142741 -264002 88269 17098 128316 -60684 88007 179591 -136822 -36879 -51176 -279930
10508b79930O6495k12455J07909f6149p1062k2707I5914D5552f0598A2901Q7047
$$ -279930 -213435 -425890 -317981 -66149 -137211 -159918 95914 45552 -60598 12901 99948
10497I9948B5123a57390l2968H9523b3364C78089a72153e3230B07102a64563H8652
$$ 99948 25123 -157390 -190358 89523 -23364 378089 -172153 -53230 207102 -164563 88652
10485A50101h0068A83796G1474L7353L14954J58375J03796j62030A06267E2535
$$ 150101 -80068 183796 71474 108827 423781 582156 685952 523922 106267 52535
10474a7061j34197G1405L6145C5028L8429j4980h9586A02543b78475c6269C26693
$$ -17061 -151258 71405 107550 35028 73457 58477 -89586 102543 -278475 -36269 326693
10462a54038d938j28855B2441K5582d5320j82280Q8377M0161q8456b3332B06733
$$ -154038 -4938 -133793 22441 48023 -45320 -227600 -139223 -99062 -187518 -23332 206733
10450H3338L4113d7972j807k56954A99959k9170o1496K5601C8471H532a1301B21786
$$ 83338 117451 -47972 -49779 -306733 199959 170789 109293 134894 38471 8532 -11301 221786
10437a04015G9271g3313B20339j9260i0177d869A1387R9713M2794b71297j33860
$$ -104015 79271 -73313 220339 201079 -90177 -4869 11387 111100 153894 -271297 -405157
10426d05157e4723m3768C23494a37108B21956A04546J11807R9586B4343d5080
$$ -405157 -54723 -98491 323494 -137108 221956 104546 216353 315939 24343 -45080
10415b46334P2726d691m7988F89126f9095B4766d530C31047A7654J07196P8534
$$ -246334 -173608 -4691 -52679 689126 -69095 24766 -4530 331047 17654 124850 203384
10404B03384e3180A37130b93498a02931B00980H4598J8136b18445L7337f1015
$$ 203384 -53180 137130 -293498 -102931 200980 84598 102734 -218445 -181108 -61015
10393A1601Q8101D026b30120H751a2255A90319K52454A72671k1294G4496l5129
$$ 11601 99702 4026 -230120 8751 -12255 190319 442773 172671 151377 74496 39367
10382C9367e8133B557b02629H9885K73477j11746a1208B77165j36306l706J7188
$$ 39367 -58133 2557 -202629 89885 363362 251616 -11208 277165 140859 137153 154341
10371A54341D4741O39048M3736P3595C51802P759j9763J27147j09746A62352K40923
$$ 154341 44741 683789 727525 801120 351802 359561 339798 466945 357199 162352 403275
10360D03275Q6636L0306j07975k04976L6316N6165k8799m9200L01964J08163k42506
$$ 403275 489911 520217 412242 207266 243582 299747 270948 221748 523712 631875 389369
10349C89369L86658B28350n7402L56467o2852J72477j94997A94263l7897M25528
$$ 389369 776027 228350 170948 527415 464563 637040 442043 194263 156366 581894
10339E81894d0198B11265N3678j4751a0679A95077m4047J49011q0549f0030m7715
$$ 581894 -40198 211265 264943 250192 -10679 195077 151030 300041 219492 -60030 -107745
10328a07745G5796J6120k6075f764H5589K00277J4860A13922R332l9996a3334
$$ -107745 75796 91916 65841 -6764 85589 285866 300726 113922 123254 83258 -13334
10316B00281C043K27814A12378a05808A18684f1489j0326A50554D3937R862d3920
$$ 200281 3043 230857 112378 -105808 118684 -61489 -71815 150554 43937 53799 -43920
10304a22192p3374Q7984j06156A15277J31311j18480h4267K4995A16613C6111
$$ -122192 -195566 -107582 -213738 115277 246588 128108 -84267 -59272 116613 36111
10293A8728J19812b06777n239N1745j38447f0993k03189L0894b2255j97928j6453
$$ 18728 138540 -206777 -212016 -160271 -298718 -60993 -264182 -233288 -22255 -220183 -236636
10282b36636i1607D3688b33952H2794a19342d2192j06764A72580d06681A78743
$$ -236636 -91607 43688 -233952 82794 -119342 -42192 -148956 172580 -406681 178743
10271b35276B27385C4979g558j25590G1962b8063Q330j56898f3670C23728I3274
$$ -235276 227385 34979 -7558 -133148 71962 -28063 -19733 -176631 -63670 323728 93274
10259a06108B19600k7787N7580J42801d638A5083R7956b04092A47719C9319c64967
$$ -106108 219600 191813 249393 392194 -4638 15083 113039 -204092 147719 39319 -364967
10247a29551e7136H3115a26350A04331b6727l4343j82993b7353G3752e84975h0323
$$ -129551 -57136 83115 -126350 104331 -26727 -61070 -244063 -27353 73752 -584975 -80323
10235E258j692J34194F3436a68211O4444A81937e2214J3400j3320b1020I4382
$$ 5258 3566 137760 63436 -168211 -103767 181937 -52214 -38814 -52134 -21020 94382
10223G360O9892a56245A59550K06881D9641c8064J4269C04317d4595o3322D37639
$$ 7360 77252 -156245 159550 366431 49641 -38064 -23795 304317 -44595 -107917 437639
10211A462g8359l30362h2223a358j72202k5052G4127a17533p1012A97689a95425
$$ 1462 -78359 -408721 -82223 -1358 -173560 -198612 74127 -117533 -188545 197689 -195425
10199a06225J2331j73800o6095A43565i7897j34929A70603f617A38399i2937C3694
$$ -106225 -93894 -267694 -333789 143565 -97897 -232826 170603 -6617 138399 -92937 33694
10187b27187f7759k20910A81504B8749e3582E5639k7317a1857j36130l1096d2315
$$ -227187 -67759 -288669 181504 28749 -53582 55639 28322 -11857 -147987 -179083 -42315
10175b25105A43921a59641e7043M669j51429a00273l1315E9764J11905a67139
$$ -225105 143921 -159641 -57043 -52374 -203803 -100273 -131588 59764 171669 -167139
10164a70666C8114J41210c77121A49855k9917N8179M6893q3423o1182e3512l806
$$ -170666 38114 179324 -377121 149855 119938 178117 225010 141587 80405 -53512 -57318
10153e7318B82484b0544r9031H3764C840J97338c3314G3005B3362i8754A3377
$$ -57318 282484 -20544 -119575 83764 3840 201178 -33314 73005 23362 -98754 13377
10141a40155C0058K6378I878a96391k01592J15064L6785K5789n1920C06595A33699
$$ -140155 30058 56436 9878 -196391 -397983 -282919 -246134 -220345 -272265 306595 133699
10129c20487B30863b76624f2969l6397o433m3350L7240A01959b92872B87100c2065
$$ -320487 230863 -276624 -62969 -99366 -105799 -149149 -111909 101959 -292872 287100 -32065
10117F4824a52381r7165j07294A49263b09387A00202a41759g077k09663A22287
$$ 64824 -152381 -249546 -356840 149263 -209387 100202 -141759 -7077 -216740 122287
10106H4034c01374e0441I4504f4698G3625J76160c22249Q8136a5918B10567H3729
$$ 84034 -301374 -50441 94504 -64698 73625 249785 -322249 -234113 -15918 210567 83729
10094e4907r0071o4285k1479j02128h6022M1825m74852C3837a59461B58744a1718
$$ -54907 -144978 -209263 -230742 -332870 -86022 -44197 -519049 33837 -159461 258744 -11718
10082A13217a0646o5641r8650k2434a3524B2386b75134K2984B8815a70471j2996
$$ 113217 -10646 -76287 -174937 -197371 -13524 22386 -275134 -252150 28815 -170471 -183467
10071a83467B6340d86689K41535a16986k0133j87472b2250l72027g0355j39560
$$ -183467 26340 -486689 -245154 -116986 -137119 -324591 -22250 -394277 -70355 -209915
10061b09915H8185L62327d6295R175m0606D1627a7857k72570j37883a18597K3028
$$ -209915 88185 450512 -46295 -37120 -77726 41627 -17857 -290427 -428310 -118597 -95569
10050i5569j29262J05379k02208a50358E0320d9242j13740j42052l8330A43235
$$ -95569 -224831 -119452 -321660 -150358 50320 -49242 -162982 -305034 -343364 143235
10039H2667B3871R1282c02499a19510g509k69550C02423j19097p5205N588f9293
$$ 82667 23871 115153 -302499 -119510 -7509 -277059 302423 183326 108121 113709 -69293
10027a04329k4647A50870h4831J1886A71021J87041I4249C277a33666n3260L2464
$$ -104329 -128976 150870 -84831 -72945 171021 358062 94249 3277 -133666 -186926 -154462
10016a54462J1104j94126c8964d562j58582A48567E3225K75370d1995A69578q3542
$$ -154462 -143358 -337484 -38964 -4562 -163144 148567 53225 328595 -41995 169578 86036
10005H6036a41032e0220n3108j11313F9765a56229P113B13905i6551B01900b18366
$$ 86036 -141032 -50220 -103328 -214641 69765 -156229 -149116 213905 -96551 201900 -218366
9993c16552A25579D5094L0128i698l19150a53953A17299a91237h2648B5594b02665
$$ -316552 125579 45094 75222 -9698 -328848 -153953 117299 -191237 -82648 25594 -202665
9981D1818P7383J63243l1867g7002B02437a86929c8833H6229f4597C07107a36013
$$ 41818 119201 282444 250577 -77002 202437 -186929 -38833 86229 -64597 307107 -136013
9969a16657G4885c37685e883l53118a65480A7416b94835J3667g261I6702A4874
$$ -116657 74885 -337685 -5883 -359001 -165480 17416 -294835 -281168 -7261 96702 14874
9957B53a83949A30923g2600K5630A40339g7325A10633E0769N019P148B1621K8860
$$ 253 -183949 130923 -72600 -46970 140339 -77325 110633 50769 55788 62936 21621 50481
9945E0481f9052j6433e932B9378b09364b2952E9707a39449d2982n4962A24558
$$ 50481 -69052 -85485 -5932 29378 -209364 -22952 59707 -139449 -42982 -97944 124558
9933E0680J8397a25282j75614j48741B3466K32511G9603b47925h5748B16813b37306
$$ 50680 69077 -125282 -300896 -449637 23466 255977 79603 -247925 -85748 216813 -237306
9921A40563c61864I9278i5773i203D7531a61425B17964G4196d6015q2899k1583
$$ 140563 -361864 99278 -95773 -9203 47531 -161425 217964 74196 -46015 -128914 -150497
9910a50497A09385g171C3355a9511j85594j22032H0473b53950E407i415j05729
$$ -150497 109385 -7171 33355 -19511 -205105 -327137 80473 -253950 5407 -9415 -115144
9899a15144K9207L8925o4471k02853a5869A0263a53448l2673E538a35505M0333
$$ -115144 -85937 -47012 -111483 -314336 -15869 10263 -153448 -186121 5538 -135505 -95172
9888i5172A4914b53686L3457F6880b11514F8304a30074L4539D3546a15567A9947
$$ -95172 14914 -253686 -220229 66880 -211514 68304 -130074 -95535 43546 -115567 19947
9876c28486A35170k5355R1814b5021j50535M4523c0875j61249I0253c59671E3580
$$ -328486 135170 109815 201629 -25021 -175556 -131033 -30875 -192124 90253 -359671 53580
9864c8227B16906b8228J1433k65776d3918j4533A8241g7507j32624L0215b5582
$$ -38227 216906 -28228 -16795 -282571 -43918 -58451 18241 -77507 -210131 -179916 -25582
9852c17221d1498F248J92936a9296j2757j02402j20502I3388b09640G9971b21928
$$ -317221 -41498 6248 199184 -19296 -32053 -134455 -254957 93388 -209640 79971 -221928
9840F7450d39740B2502M6763c4794A01563b21875A10854b83575a38763j40283
$$ 67450 -439740 22502 69265 -34794 101563 -221875 110854 -283575 -138763 -279046
9830b79046A37008Q8051B2964J64650b40746e9950k55585C17404e6873B34663
$$ -279046 137008 225059 22964 187614 -240746 -59950 -315535 317404 -56873 234663
9819c9068k98935a32505I998c35619J16883E3999b93505l34D7857L11095a14864
$$ -39068 -338003 -132505 9998 -335619 -218736 53999 -293505 -293839 47857 358952 -114864
9807A9256a60918A06231b99181i1126A44727b12551f709j10447B74543a33229
$$ 19256 -160918 106231 -299181 -91126 144727 -212551 -6709 -117156 274543 -133229
9796a35684L2311A33490b98953A19315c05590a00841j9420b7013C734P7115a41020
$$ -135684 -103373 133490 -298953 119315 -305590 -100841 -120261 -27013 3734 80849 -141020
9784I6854f3457l15364i0638j32245C0480c9764I3059b49307h764m5614p2857
$$ 96854 -63457 -378821 -90638 -222883 30480 -39764 93059 -249307 -8764 -54378 -127235
9773a27235F4027c3469o201k32405G3826a76967A95437a96114g7193k50324a34586
$$ -127235 64027 -33469 -39670 -272075 73826 -176967 195437 -196114 -77193 -327517 -134586
9761H4494a74144G7424j4270e3838r7809B8357b7272n2057k35170D5863J93591
$$ 84494 -174144 77424 63154 -53838 -151647 28357 -27272 -79329 -314499 45863 239454
9750B39454A2127a38080A7351b85565f639A59805b99736A38627J15270b12558
$$ 239454 12127 -138080 17351 -285565 -6639 159805 -299736 138627 253897 -212558
9739C3131a43620B52822b16964H7859d06483a15359N4419D90268b35359n5851
$$ 33131 -143620 252822 -216964 87859 -406483 -115359 -60940 490268 -235359 -291210
9729b91210K9301B4739a16406k52955F1552k4914C877J32270b25115k95070J38833
$$ -291210 -261909 24739 -116406 -369361 61552 36638 3877 136147 -225115 -520185 -381352
9718c81352B65476a0808k44452D7807b71569n8394i9038A16349a74937A74584
$$ -381352 265476 -10808 -255260 47807 -271569 -329963 -99038 116349 -174937 174584
9707D9304d6302j26340C483b00012A58671c75388a78915N665O7453j55440A38249
$$ 49304 -46302 -172642 3483 -200012 158671 -375388 -178915 -173250 -105797 -261237 138249
9695i494D49O6041c49750a20906d2040j97196h1057j96399f347k85290a2539A09741
$$ -9494 449 66490 -349750 -120906 -42040 -239236 -81057 -277456 -6347 -291637 -12539 109741
9682B8331c17825a47547e8864l165m614n0087A43182i0908B16480D3463b65643
$$ 28331 -317825 -147547 -58864 -62029 -66643 -116730 143182 -90908 216480 43463 -265643
9670a00407j43047B6227a08414A83097a66456p6904C9031K3715O0313g7072j31068
$$ -100407 -243454 26227 -108414 183097 -166456 -243360 39031 62746 123059 -77072 -208140
9659b08140b6503k34238A8122P943P636i5601K9253A00489L1075j2073c07029
$$ -208140 -26503 -260741 18122 26065 33701 -95601 -66348 100489 131564 119491 -307029
9647B2003e7839j10666P8655j20692D9192J71699o9625a54421F4814L00212B711
$$ 22003 -57839 -168505 -89850 -210542 49192 220891 151266 -154421 64814 365026 2711
9635B01720r2796a68574E7414a88618j2620E14198A3468J85375b33868f0238j65752
$$ 201720 108924 -168574 57414 -188618 -201238 514198 13468 198843 -233868 -60238 -225990
9624b25990B06976i5525B769j348a59333l1373f3267C96000F9333c39724B0979
$$ -225990 206976 -95525 2769 1421 -159333 -190706 -63267 396000 69333 -339724 20979
9612A8147a44520p8334A4281K69300b34419J04464P986j56019C982K06971d3149
$$ 18147 -144520 -222854 14281 283581 -234419 -129955 -121969 -277988 3982 210953 -43149
9600a34216A59414b40569M6931f8327A5655J5427g1791D1156b71465c2932l3293
$$ -134216 159414 -240569 -193638 -68327 15655 31082 -71791 41156 -271465 -32932 -66225
9589f6225H5210e4771a6109m8306A24306F1908c02556F5885J38200g0229J9607
$$ -66225 85210 -54771 -16109 -64415 124306 61908 -302556 65885 204085 -70229 -50622
9578e0622r4183i184l68798A5173f5766b6740G97h1052J7443n1017N508k15468
$$ -50622 -144805 -9184 -377982 15173 -65766 -26740 797 -81052 -63609 -114626 -109118 -324586
9566c24586O1264m0991D5431f463C6621N5240R6245n2027b99549C6487f6008j81536
$$ -324586 -263322 -304313 45431 -6463 36621 91861 188106 136079 -299549 36487 -66008 -247544
9554b47544D6436a30831j87627N1393J19631L1231E4459k098a61357k20827i2072
$$ -247544 46436 -130831 -318458 -267065 -147434 -116203 54459 52361 -161357 -382184 -92072
9542I0369d75696d0004G2062c59144A4224l538J53975k7832b13828f3911j88241
$$ 90369 -475696 -40004 72062 -359144 14224 10686 164661 136829 -213828 -63911 -252152
9531b52152A52142J180c09289i4233A03666K02871f8471Q467A839J13008d0023
$$ -252152 152142 153322 -309289 -94233 103666 306537 -68471 -60004 1839 114847 -40023
9519f7588a1517j83820R5139F2614a18836D7011g4290a5749k51188b902l62447
$$ -67588 -11517 -195337 -100198 62614 -118836 47011 -74290 -15749 -266937 -2902 -365349
9508c65349A32439L49800a1738q2831r706C6214h8716k20456e990m15496B64313
$$ -365349 132439 482239 -11738 -94569 -104275 36214 -88716 -309172 -5990 -421486 264313
9496b18965C5269a52274F1891b6314k13641Q6948f4264m59304b10800B37899I431
$$ -218965 35269 -152274 61891 -26314 -239955 -153007 -64264 -523568 -210800 237899 9431
9484a95997Q759J0076A8815a83395n6059b0916A48633b260j64952p4872A9550
$$ -195997 -187238 -177162 18815 -183395 -239454 -20916 148633 -2260 -167212 -242084 19550
9472i6515B14479j00212l3909J97567j09292i0254G2966O4001b93172f5346j22746
$$ -96515 214479 114267 80358 277925 168633 -90254 72966 136967 -293172 -65346 -188092
9461a88092D9412a96477L824r3922d4347O614B01419b78903A26630f6283a2642
$$ -188092 49412 -196477 -192653 -286575 -44347 -37733 201419 -278903 126630 -66283 -12642
9449c92388K0063i2118m3445A91619p8360A0937O0323k8161K07723a67027f4433
$$ -392388 -372325 -92118 -135563 191619 113259 10937 71260 43099 250822 -167027 -64433
9437A39670c02045b4176F367h856k46998B5224N2073J69740a24432A14320C2068
$$ 139670 -302045 -24176 6367 -8856 -255854 25224 77297 247037 -124432 114320 32068
9425G2898J54653c26901A36553h2234E9515J32978h4415j11680D161J50500L7836
$$ 72898 227551 -326901 136553 -82234 59515 192493 -84415 -196095 4161 154661 192497
9414A92497a72223C16825h23j14535b8806A53193i8352r2019A11187c510j70514
$$ 192497 -172223 316825 -823 -115358 -28806 153193 -98352 -190371 111187 -3510 -174024
9403a74024e8286F4226B2308J04409a86290A62082e7752j5098D27550A79722b2871
$$ -174024 -58286 64226 22308 126717 -186290 162082 -57752 -72850 427550 179722 -22871
9391A08947b59851a07397b1990j06459c2869k8363f416k74702R4682F5698m089
$$ 108947 -259851 -107397 -21990 -128449 -32869 -61232 -6416 -281118 -186436 65698 61609
9380F1609J62065c02238F3165d913D3346b47616B05765a61270c9622p2882k4617
$$ 61609 223674 -302238 63165 -4913 43346 -247616 205765 -161270 -39622 -112504 -137121
9369a37121A34473b66277A65332a80781k24708N3513J28376K3742O3418e4010
$$ -137121 134473 -266277 165332 -180781 -405489 -351976 -223600 -199858 -136440 -54010
9358H1181h26E3125K1988a92172j230B46359j12441a20804J8349k9649A1647a60078
$$ 81181 -826 53125 75113 -192172 -193402 246359 133918 -120804 -102455 -132104 11647 -160078
9345D18126a16135J181B4539b1679l1356q4335q2398A27698b3649C8495a73021
$$ 418126 -116135 -114954 24539 -21679 -53035 -137370 -219768 127698 -23649 38495 -173021
9333c44449B50692a81458A16552J37373H5191h9275C94234b86007c6487l9346
$$ -344449 250692 -181458 116552 253925 85191 -89275 394234 -286007 -36487 -75833
9323g5833A03086b1460k87786b9935J3101j99026B1262a81001C5660a12011k50446
$$ -75833 103086 -21460 -309246 -29935 -16834 -215860 21262 -181001 35660 -112011 -362457
9312c62457A4952b82263G7862i1436r6190j01793A07012a61626K9139c0187A75625
$$ -362457 14952 -282263 77862 -91436 -187626 -289419 107012 -161626 -132487 -30187 175625
9300d5882j1986I9980b24325b8380j53686j11942a26005K657A45639c08028f5201
$$ -45882 -57868 99980 -224325 -28380 -182066 -294008 -126005 -123348 145639 -308028 -65201
9288a89382j31840c9049m3449n5126K8054A13914Q5885b43379A72528e2315C8094
$$ -189382 -321222 -39049 -82498 -137624 -109570 113914 199799 -243379 172528 -52315 38094
9276h371n4242j28103g5661l36068a21204b3111l0629m49434B65097p8587a76873
$$ -8371 -62613 -190716 -75661 -411729 -121204 -23111 -53740 -503174 265097 186510 -176873
9264a75611j23437a32009j8735B92982b0269A8386f8408A02989N5515a93787K1430
$$ -175611 -299048 -132009 -150744 292982 -20269 18386 -68408 102989 158504 -193787 -172357
9253a72357K5551j4086P6396a9007j57632A20705J77932F3736b08845A57529f4786
$$ -172357 -146806 -160892 -84496 -19007 -176639 120705 298637 63736 -208845 157529 -64786
9241A89928E7547a09206l30464a56912e629C079L2317g551j42528I3142a97823
$$ 189928 57547 -109206 -439670 -156912 -5629 3079 35396 -7551 -150079 93142 -197823
9229G8371A7268c7135B6627b9749j54238m8117R1783J2751j97634B08258c6169
$$ 78371 17268 -37135 26627 -29749 -183987 -232104 -140321 -127570 -325204 208258 -36169
9217C015a27067B9428b97849C432a55077b9504l80167J74972J02044C5557a80413
$$ 3015 -127067 29428 -297849 3432 -155077 -29504 -409671 -234699 -132655 35557 -180413
9205C38624h7258L1510r3070P023A17706J47310b95042a07838k1223A40143D9549
$$ 338624 -87258 -55748 -148818 -141795 117706 265016 -295042 -107838 -129061 140143 49549
9193d2024A37572a16006j08257R0124N1464m47238F217L8198P4925J4973b60508
$$ -42024 137572 -116006 -224263 -134139 -82675 -529913 6217 44415 119340 134313 -260508
9181b19967B81190H7038c27564J43072q352l2956B15975p4286O4143J08938H9628
$$ -219967 281190 87038 -327564 -184492 -192844 -225800 215975 141689 205832 314770 89628
9169A65110p5818j5514e9024B31006b0862A18725J22985A17980C8369c48027g5905
$$ 165110 89292 73778 -59024 231006 -20862 118725 241710 117980 38369 -348027 -75905
9157b95454E3979N157b6069H9290e6013F1904b56798D0183C4d77308b30607H9741
$$ -295454 53979 59136 -26069 89290 -56013 61904 -256798 40183 34 -477308 -230607 89741
9144C8371J22681a03422E7737b3303o4727k24569c36l5559D7811g2016p7552N7688
$$ 38371 161052 -103422 57737 -23303 -88030 -312599 -336 -35895 47811 -72016 -149568 -91880
9132i1880l65095a09956m9261B3188a87469N3436a0679C3075d2704A63803b25570
$$ -91880 -456975 -109956 -159217 23188 -187469 -134033 -10679 33075 -42704 163803 -225570
9120b13815g2750C8271J65388I9050g2097B46403c91665e089j40797j66579J33690
$$ -213815 -72750 38271 203659 99050 -72097 246403 -391665 -5089 -145886 -312465 -178775
9109a78775e7665j50361l2960P1903n149B03736b401j97088B64704e2222D2604
$$ -178775 -57665 -208026 -240986 -169083 -174232 203736 -2401 -199489 264704 -52222 42604
9097d18325D2313a00054l8419B03299E2909a42342L7013n1869G3337d44147F3883
$$ -418325 42313 -100054 -138473 203299 52909 -142342 -105329 -157198 73337 -444147 63883
9085c23441F5170b46030B87680C2318f50084D8979j9825a74324D74179A89725
$$ -323441 65170 -246030 287680 32318 -650084 48979 29154 -174324 474179 189725
9074b58499J12517B09530E0085b69805a13562m022A01923b5497A75158b36045
$$ -258499 -145982 209530 50085 -269805 -113562 -117584 101923 -25497 175158 -236045
9063f0789j72012A16815j2083L1540M1115J14344j33310d1411j56129O5481C84872
$$ -60789 -232801 116815 104732 136272 177387 291731 158421 -41411 -197540 -132059 384872
9051h1739H2869k34f1145j46903L4235O3858L7866G6182I41a41974B52234A10233
$$ -81739 82869 82635 -61145 -208048 -173813 -109955 -72089 76182 941 -141974 252234 110233
9038a229j24277m8876c4665C955a48615F800K17942r3635b64857k0661j67981
$$ -1229 -125506 -174382 -34665 3955 -148615 6800 224742 131107 -264857 -285518 -453499
9027d53499J51529h753c900r3891A4928L6756f6657B5561E807b17564B8767a82719
$$ -453499 -301970 -8753 -3900 -97791 14928 51684 -66657 25561 5807 -217564 28767 -182719
9014A66100J1667b63262G6418A6833a86565A94240p9106c9922I9336c92850G4195
$$ 166100 177767 -263262 76418 16833 -186565 194240 115134 -39922 99336 -392850 74195
9002h8275C6230a51016j82366J56556b8344E3437b1789D1383a99765I7396B6013
$$ -88275 36230 -151016 -333382 -176826 -28344 53437 -21789 41383 -199765 97396 26013
8990i3626C32270a22076B08255L6306e5603E3515K33123A2862a3623k62531e604
$$ -93626 332270 -122076 208255 244561 -55603 53515 286638 12862 -13623 -276154 -5604
8978a04927j13738D5681K7417b0119p4319A41994a00887F9798K46860b2069j74271
$$ -104927 -218665 45681 73098 -20119 -94438 141994 -100887 69798 316658 -22069 -196340
8967a96340Q0845q3631h6667l05361J63686C04709a14630j54213h6876D52803
$$ -196340 -115495 -199126 -86667 -392028 -228342 304709 -114630 -268843 -86876 452803
8956A57389b3540k3854C7556i682A8777M303a11546k56550a18085A29088b37198
$$ 157389 -23540 -47394 37556 -9682 18777 23080 -111546 -368096 -118085 129088 -237198
8944d1568l704j79813b1974I936J0132P7782L4340K39055A61028J44265h1062
$$ -41568 -45272 -225085 -21974 9936 20068 97850 132190 371245 161028 305293 -81062
8932A50986b94346H8491b00553A42274l2057a57517E64289m4949R62272J920828
$$ 150986 -294346 88491 -200553 142274 110217 -157517 564289 519340 1481612 3402440
8922C402440Q782085j347442C206874H93220m09055A79674H5849b00592B00968
$$ 3402440 12184525 10837083 3206874 893220 484165 179674 85849 -200592 200968
8912E891P8388J64507b52619A53370K06801a68106A25716b26945B2365a20086
$$ 5891 84279 248786 -252619 153370 360171 -168106 125716 -226945 22365 -120086
8901H1361c47540l2894F3641a33106j35160R7939A66551B4007b52739B06644f1793
$$ 81361 -347540 -380434 63641 -133106 -268266 -170327 166551 24007 -252739 206644 -61793
8889a61889A59025C1986K3695e24674B62254A03194C4329g8698B02008e3707j03561
$$ -161889 159025 31986 55681 -524674 262254 103194 34329 -78698 202008 -53707 -157268
8878a57268j03937D1431c28106a34839e2639F3655a97308E4366i494G7638b95339
$$ -157268 -261205 41431 -328106 -134839 -52639 63655 -197308 54366 -9494 77638 -295339
8866B40497b54183P8580B7064a41207I306d33038I4158a02985C1656a75198E6525
$$ 240497 -254183 -175603 27064 -141207 9306 -433038 94158 -102985 31656 -175198 56525
8854A40652a08557A08920a083G550P6242b640B35845b3641q8429B36499E707M7500
$$ 140652 -108557 108920 -1083 7550 83792 -2640 235845 -23641 -112070 236499 5707 53207
8842E3207K7636N8290b96844a07110j28117a04104L4561N474B54148p6115q8602
$$ 53207 80843 139133 -296844 -107110 -235227 -104104 -69543 -64069 254148 178033 89431
8831H9431B3319b0216j11728C56081a24160A1004b64990g8730q0286r265A43739
$$ 89431 23319 -20216 -131944 356081 -124160 11004 -264990 -78730 -159016 -168281 143739
$$ [...]
##END NTUPLES=NMR SPECTRUM
##END=
