
##TITLE=AC1373_DOM12185_7518827_GN5DaabZ4F
##JCAMPDX= 6.0         $$ Bruker NMR JCAMP-DX V2.0
##DATA TYPE= NMR SPECTRUM
##DATA CLASS= NTUPLES
##ORIGIN= BRUKER
##OWNER= Administrator
$$ 1.72 TOPSPIN		Version 2.1
$$ 2013-02-20 01:32:05.680 -0500  Administrator@X
$$ Compression mode = diff/dup
##.OBSERVE FREQUENCY= 400.02188249412
##.OBSERVE NUCLEUS= ^1H
##.ACQUISITION MODE= SIMULTANEOUS (DQD)
##.ACQUISITION SCHEME= undefined
##.AVERAGES= 64
##.DIGITISER RES= 22
##SPECTROMETER/DATA SYSTEM= spect
##.PULSE SEQUENCE= noesygpps1d.comp
##.SOLVENT NAME= COFFEE_meoh
##.SHIFT REFERENCE= INTERNAL, COFFEE_meoh, 1, 14.96088
##AUDIT TRAIL= $$ (NUMBER, WHEN, WHO, WHERE, PROCESS, VERSION, WHAT)
$$ ##TITLE= Audit trail, TOPSPIN		Version 2.1
$$ ##JCAMPDX= 5.01
$$ ##ORIGIN= Bruker BioSpin GmbH
$$ ##OWNER= Administrator
$$ $$ E:\/data/COFFEE/nmr/AC1373_DOM12185_7518827_GN5DaabZ4F/12/pdata/1/auditp.txt
$$ ##AUDIT TRAIL=  $$ (NUMBER, WHEN, WHO, WHERE, PROCESS, VERSION, WHAT)
(   1,<2013-02-20 01:31:59.695 -0500>,<Administrator>,<X>,<go>,<TOPSPIN 2.1>,
      <created by zg
	started at 2013-02-20 01:20:29.897 -0500,
	POWCHK enabled, PULCHK disabled,
       configuration hash MD5:
       86 BA 57 50 F2 9D 5C 9B 26 00 A9 28 5F 66 2E 89
       data hash MD5: 64K
       19 63 E3 C8 F5 60 D5 F8 2D A7 F4 7C F4 51 11 D2>)
(   2,<2013-02-20 01:32:02.758 -0500>,<Administrator>,<X>,<proc1d>,<TOPSPIN 2.1>,
      <Start of raw data processing
       efp LB = 0.3 FT_mod = 6 PKNL = 1 PHC0 = 0 PHC1 = 0 SI = 128K 
       data hash MD5: 128K
       E9 5F B5 E9 88 4E BA F9 11 6A A3 6F 39 E1 87 D4>)
(   3,<2013-02-20 01:32:03.961 -0500>,<Administrator>,<X>,<proc1d>,<TOPSPIN 2.1>,
      <pk PHC0 = -108.1879 PHC1 = 0 
       data hash MD5: 128K
       49 FD 06 84 6F BA 23 FB C3 E7 ED C9 0B B1 C0 33>)
(   4,<2013-02-20 01:32:04.664 -0500>,<Administrator>,<X>,<proc1d>,<TOPSPIN 2.1>,
      <abs ABSG = 1 
       data hash MD5: 128K
       D0 F0 39 74 A5 3F AD CF 25 BC C3 B5 2B 39 11 D7>)
(   5,<2013-02-20 01:32:04.852 -0500>,<Administrator>,<X>,<proc1d>,<TOPSPIN 2.1>,
      <abs ABSG = 2 
       data hash MD5: 128K
       B3 AD EF 51 C3 FE 4C B0 7B 06 CD 7C C9 8C 5B 2A>)
(   6,<2013-02-20 01:32:05.008 -0500>,<Administrator>,<X>,<proc1d>,<TOPSPIN 2.1>,
      <abs ABSG = 3 
       data hash MD5: 128K
       91 B0 DD 23 DF 83 0E AD 5E 16 7C 18 62 DC FB E0>)
(   7,<2013-02-20 01:32:05.195 -0500>,<Administrator>,<X>,<proc1d>,<TOPSPIN 2.1>,
      <abs ABSG = 4 
       data hash MD5: 128K
       DF AB 5C 32 9C 71 AA 57 C2 99 A9 D0 3F DA FB 72>)
(   8,<2013-02-20 01:32:05.352 -0500>,<Administrator>,<X>,<proc1d>,<TOPSPIN 2.1>,
      <abs ABSG = 5 
       data hash MD5: 128K
       E4 66 8C 13 6C 1C A3 8C 32 E5 18 FB 47 CC 04 68>)
$$ ##END=
$$ 
$$ $$ hash MD5
$$ $$ 84 58 FA 48 7F C5 B3 7D BA B6 33 FB 18 A7 CD B1
##$RELAX= 
##$RELAX= 
##$RELAX= 
##$RELAX= 
##$RELAX= 
##$RELAX= 
##$RELAX= 
##$RELAX= 
$$ Bruker specific parameters
$$ --------------------------
##$DU= <E:\>
##$EXPNO= 12
$$ [...]
##$TP07= 0
##$TPNAME0= <>
##$TPNAME1= <>
##$TPNAME2= <>
##$TPNAME3= <>
##$TPNAME4= <>
##$TPNAME5= <>
##$TPNAME6= <>
##$TPNAME7= <>
##$TPOAL= (0..7)
0.5 0.5 0.5 0.5 0.5 0.5 0.5 0.5
##$TPOFFS= (0..7)
0 0 0 0 0 0 0 0
##$TUNHIN= 0
##$TUNHOUT= 0
##$TUNXOUT= 0
##$USERA1= <user>
##$USERA2= <user>
##$USERA3= <user>
##$USERA4= <user>
##$USERA5= <user>
##$V9= 5
##$VALIST= <valist>
##$VCLIST= <CCCCCCCCCCCCCCC>
##$VD= 0
##$VDLIST= <DDDDDDDDDDDDDDD>
##$VPLIST= <PPPPPPPPPPPPPPP>
##$VTLIST= <TTTTTTTTTTTTTTT>
##$WBST= 1024
##$WBSW= 4
##$XGAIN= (0..3)
0 0 0 0
##$XL= 0
##$YL= 0
##$YMAX_a= 6435731
##$YMIN_a= -11462992
##$ZGOPTNS= <>
##$ZL1= 120
##$ZL2= 120
##$ZL3= 120
##$ZL4= 120
##$ABSF1= 14.96088
##$ABSF2= -5.597301
##$ABSG= 5
##$ABSL= 3
##$ALPHA= 0
##$AQORDER= 0
##$ASSFAC= 0
##$ASSFACI= 0
##$ASSFACX= 0
##$ASSWID= 0
##$AUNMP= <proc_prof1d_extract.lims>
##$AXLEFT= 0
##$AXNAME= <>
##$AXNUC= <1H>
##$AXRIGHT= 0
##$AXTYPE= 0
##$AXUNIT= <>
##$AZFE= 0.1
##$AZFW= 0.1
##$BCFW= 0
##$BC_mod= 0
##$BYTORDP= 0
##$COROFFS= 0
##$CY= 15
##$DATMOD= 1
##$DC= 0
##$DFILT= <>
##$DTYPP= 0
##$F1P= 0
##$F2P= 0
##$FCOR= 0.5
##$FTSIZE= 131072
##$FT_mod= 6
##$GAMMA= 0
##$GB= 0
##$INTBC= 1
##$INTSCL= 1
##$ISEN= 128
##$LB= 0.3
##$LEV0= 0
##$LPBIN= 0
##$MAXI= 10000
##$MC2= 0
##$MEAN= 0
##$ME_mod= 0
##$MI= 0
##$NCOEF= 0
##$NC_proc= -2
##$NLEV= 6
##$NOISF1= 0
##$NOISF2= 0
##$NSP= 0
##$NTH_PI= 0
##$NZP= 0
##$OFFSET= 14.96088
##$PC= 1
##$PHC0= -108.1879
##$PHC1= 0
##$PH_mod= 1
##$PKNL= yes
##$PPARMOD= 0
##$PPDIAG= 0
##$PPIPTYP= 0
##$PPMPNUM= 2147483647
##$PPRESOL= 1
##$PSCAL= 4
##$PSIGN= 0
##$PYNMP= <proc.py>
##$REVERSE= no
##$SF= 400.020009686731
##$SI= 131072
##$SIGF1= 0
##$SIGF2= 0
##$SINO= 400
##$SIOLD= 131072
##$SPECTYP= <>
##$SREGLST= <1H.CDCl3>
##$SSB= 0
##$STSI= 131072
##$STSR= 0
##$SW_p= 8223.68421052631
##$SYMM= 0
##$S_DEV= 0
##$TDeff= 65536
##$TDoff= 0
##$TI= <>
##$TILT= no
##$TM1= 0
##$TM2= 0
##$TOPLEV= 0
##$USERP1= <user>
##$USERP2= <user>
##$USERP3= <user>
##$USERP4= <user>
##$USERP5= <user>
##$WDW= 1
##$XDIM= 131072
##$YMAX_p= 389440079
##$YMIN_p= -12779
##$CURPLOT= <Network HP LaserJet P1505>
##$CURPRIN= <$Network HP LaserJet P1505>
##$DFORMAT= <normdp>
##$LAYOUT= <+/1D_H.xwp>
##$LFORMAT= <normlp>
##$PFORMAT= <normpl>
##$SURQMSG= 1
$$ End of Bruker specific parameters
$$ ---------------------------------
##NTUPLES= NMR SPECTRUM
##VAR_NAME=  FREQUENCY,     SPECTRUM/REAL,   SPECTRUM/IMAG
##SYMBOL=    X,             R,               I
##VAR_TYPE=  INDEPENDENT,   DEPENDENT,       DEPENDENT
##VAR_FORM=  AFFN,          ASDF,            ASDF
##VAR_DIM=   131072,        131072,          131072
##UNITS=     HZ,            ARBITRARY UNITS, ARBITRARY UNITS
##FACTOR=    0.0627417313425164, 1,          1
##FIRST=     8223.62146879497, 2477,         -67501
##LAST=      0,             4757,            -67585
##MIN=       0,             -12779,          0
##MAX=       8223.62146879497, 389440079,    0
$$ Real data points
##PAGE= N=1
##DATA TABLE= (X++(R..R)), XYDATA
$$ [...]
61637D86569L064K481J948J090j4r65j805k918m115m569l969l143l079l606l667
61622D63302k724j457q57j027j187p19J86R62J383J566J472Q99p7j003j552j883
61606D57284k415l452n058o971q497q845p910o528n631n244m640l440k216j824
61592C84613k398l227l632l666l834m261m486m116l369k762k475k353k340k483
61578C39211k610k410j953j730k058k628k830k413j705j287j435j791j719j113
61564C11529o46r30j678k057j782j322j121j162j290j470j526j191n76j19R2M07
61548B95158Q79J026O73M24Q43J656K216K387K417K302J903J505J588K111K504
61533C19592K443K179K027J934J655J111M32k10p47j256j842k390k568k226j692
$$ plain form
61637 486569 489633 492114 494062 495152 495138 494173 492368 489450 485335 480766 476797 473654 470575 466969 463302
61622 463302 460578 459121 458264 457237 456050 455331 455517 456479 457862 459428 460900 461799 461722 460719 459167 457284
61606 457284 454869 451417 446359 439388 430891 422046 414136 407608 401977 396733 392093 388653 386437 384613
61592 384613 382215 378988 375356 371690 367856 363595 359109 354993 351624 348862 346387 344034 341694 339211
61578 339211 336601 334191 332238 330508 328450 325822 322992 320579 318874 317587 316152 314361 312642 311529
61564 311529 310883 309953 308275 306218 304436 303114 301993 300831 299541 298071 296545 295354 294778 294659 294751 295158
61548 295158 296037 297063 297736 298160 299003 300659 302875 305262 307679 309981 311884 313389 314977 317088 319592
61533 319592 322035 324214 326241 328175 329830 330941 331373 331163 330416 329160 327318 324928 322360 320134 318442
61518C18442j516j922k560k785k214j158m11m22p61p51m48n06j062j461j301j007
61502B98157j054j198j061q78j036j300j222r39r23j112j068p71n63m09m7K85
61486B84861J19k54L6J021J637J229N33N15J013J198Q98O32O31N95M15M09P09
61469B96197R70Q57M57N8k22m03m83m37k42J50O90J092J026N04j50p07j128j217
61451B97012o15O17J806K380K454K345J832O09p57j076NJ471K173K072J881K013
61435C16222K412L014L780M411M602M430M137L696L028K424K209K176J856J274
61421C59671Q82R20J322K063K911L192K547J841K261L514L975K854J051l92j547
61406C87065k727l547l745m000m845n478m791l133j938j818k122k208k144k081
$$ plain form
61518 318442 316926 315004 312444 309659 307445 306287 305876 305454 304693 303942 303494 302988 301926 300465 299164 298157
61502 298157 297103 295905 294844 293966 292930 291630 290408 289469 288546 287434 286366 285595 285032 284623 284576 284861
61486 284861 284980 284726 284762 285783 287420 288649 289182 289697 290710 291908 292806 293438 294069 294664 295079 295488 296197
61469 296197 297167 298024 298481 298539 298317 297914 297431 296994 296752 296902 297592 298684 299710 300214 300064 299357 298229 297012
61451 297012 296397 297014 298820 301200 303654 305999 307831 308440 307683 306607 306612 308083 310256 312328 314209 316222
61435 316222 318634 321648 325428 329839 334441 338871 343008 346704 349732 352156 354365 356541 358397 359671
61421 359671 360553 361473 362795 364858 367769 370961 373508 375349 377610 381124 385099 387953 389004 388612 387065
61406 387065 384338 380791 377046 373046 368201 362723 357932 354799 352861 351043 348921 346713 344569 342488
61392C42488j853j434j113j020r75q66p62o21l48o2J00L29P70J016N72k43n09
61375C35469J71J298K225K693K645K083J304P83P02Q93J234J689K057K164K258
61360C59668K717L470M155M740N414N992O093N930O197P175Q505R873J1175J2039
61346D53143J1978J1210J0487R919Q809P022N576N308N687N673N210N046N419
61333E50487N635M963L368J383m47j941l290m629n682o039n781n463n363n235
61319E21966m890m484m059l326k229j231p20n24l77l15k86J07J051K147L121M391
61303E10342O303Q206Q927Q074O227M141K221O28p37k273m141n785o502o368o073
61288E23190n858n317m260l170k568k335j939j091J9R27J355J558K187L516N018
$$ plain form
61392 342488 340635 339201 338088 337068 336093 335227 334465 333844 333496 333434 333534 333863 334633 335649 336221 335978 335469
61375 335469 335640 336938 339163 341856 344501 346584 347888 348671 349373 350266 351500 353189 355246 357410 359668
61360 359668 362385 365855 370010 374750 380164 386156 392249 398179 404376 411551 420056 429929 441104 453143
61346 453143 465121 476331 486818 496737 505546 512568 518144 523452 529139 534812 540022 545068 550487
61333 550487 556122 561085 564453 565836 565389 563448 560158 555529 549847 543808 538027 532564 527201 521966
61319 521966 517076 512592 508533 505207 502978 501747 501027 500503 500126 499811 499525 499632 500683 502830 505951 510342
61303 510342 516645 524851 533778 541852 548079 552220 554441 555069 554332 552059 547918 542133 535631 529263 523190
61288 523190 517332 512015 507755 504585 502017 499682 497743 496652 496671 497598 498953 500511 502698 506214 511232
61273E11232O013O544P118P750P940P616P404P629P730P119O164N819O487P834
61259F10399R477J1293J3042J4194J4429J3950J3097J1871J0085P916O010M913
61247G40676M476L938K638O10j569l485n238p008q497r154q937q464q283q266
61233F83437q048p725p742q105q211p571o380n201m399l983l747l321k432j296
61219F05276n15l60m47l57j70p8J25O72J242J346J120J038J013M93m93j105p96
61202F08004K0O68J149J999L523N531P614R564J1620J4288J7589K0613K2273K2461
61188G46916K1902K0943J9311J7150J5309J4133J2879J1021R336Q829R136R020
61176I15885Q084O972O062N008L620K233R68n78k569m540o103p465q836r881j0317
$$ plain form
61273 511232 517245 523789 530907 538657 546597 554213 561617 569246 576976 584095 590259 596078 602565 610399
61259 610399 619876 631169 644211 658405 672834 686784 699881 711752 721837 729753 735763 740676
61247 740676 745152 749090 751728 752338 750769 747284 742046 735038 726541 717387 708450 699986 691703 683437
61233 683437 675389 667664 659922 651817 643606 636035 629655 624454 620055 616072 612325 609004 606572 605276
61219 605276 604761 604401 603954 603597 603427 603349 603474 604146 605388 606734 607854 608892 609905 610398 609905 608800 608004
61202 608004 608024 608692 609841 611840 615363 620894 628508 638072 649692 663980 681569 702182 724455 746916
61188 746916 768818 789761 809072 826222 841531 855664 868543 879564 888900 897729 906865 915885
61176 915885 923969 930941 937003 942011 945631 947864 948832 948254 945685 941145 935042 927577 918741 908860 898543
61161H98543j0649j1726j3649j5592j6714j6868j6361j5343j3725j1580r366p565
61149G39405o219n004l760k715k155k126k635l806n635p749r668j1144j2033j2155
61135F52601j1615j0958j0478r614p616m791k329q28L77K112M245O113P593R181
61121F23993J1198J3421J5432J6954J7977J8855K0231K2492K5239K7560K8861
61110H42213K9193K8941K8425K7914K7662K7689K7664K7114K5704K3302J9923
61099A135744J5812J1497P537M020L96l991r042j3702j6871j8533j9721k1289
61087A071857k3048k4338k5063k5658k6233k6293k5467k4044k2565k1280k0220
61076H07648j9415j8699j7557j5685j3560j2006j1232j0600r419p685n949m652
$$ plain form
61161 898543 887894 876168 862519 846927 830213 813345 796984 781641 767916 756336 746970 739405
61149 739405 733186 728182 724422 721707 719552 717426 714791 710985 705350 697601 687933 676789 664756 652601
61135 652601 640986 630028 619550 609936 602320 597529 595200 594372 594749 596861 601106 607219 614812 623993
61121 623993 635191 648612 664044 680998 698975 717830 738061 760553 785792 813352 842213
61110 842213 871406 900347 928772 956686 984348 1012037 1039701 1066815 1092519 1115821 1135744
61099 1135744 1151556 1163053 1170590 1174610 1175006 1171015 1161973 1148271 1131400 1112867 1093146 1071857
61087 1071857 1048809 1024471 999408 973750 947517 921224 895757 871713 849148 827868 807648
61076 807648 788233 769534 751977 736292 722732 710726 699494 688894 679475 671790 665841 661189
61064F61189l746k874j849q97k83K45J267K805M113M754N427P053R348J1073J1664
61049G09289J1794J2272J3246J4643J6541J8695K0414K1518K2764K4801K7283
61038I13260K9560L1670L3883L5850L7040L7809L9075M1027M2944M4386M5831
61027A332335M7845N0183N2046N3055N3591N4250N5159N6201N7995O2095O9529
61016A944284P9337Q9543R9462J10161J22774J37863J56856J82487K16966K61073
61006C400806L15739L82631M62105N52787O55380P75791R23741J110743J348260
60997I927983J636149J939814K181452K272044K166139J884973J485802J022585
60989B4516941N49722J50372p7316r0782M2415J78253J92759M5579k38895o24108
$$ plain form
61064 661189 657443 654569 652720 651823 651540 651785 653052 655857 659970 664724 670151 677204 686552 697625 709289
61049 709289 721083 733355 746601 761244 777785 796480 816894 838412 861176 885977 913260
61038 913260 942820 974490 1008373 1044223 1081263 1119072 1158147 1199174 1242118 1286504 1332335
61027 1332335 1380180 1430363 1482409 1535464 1589055 1643305 1698464 1754665 1812660 1874755 1944284
61016 1944284 2023621 2113164 2212626 2322787 2445561 2583424 2740280 2922767 3139733 3400806
61006 3400806 3716545 4099176 4561281 5114068 5769448 6545239 7468980 8579723 9927983
60997 9927983 11564132 13503946 15685398 17957442 20123581 22008554 23494356 24516941
60989 24516941 25066663 25217035 25139719 25048937 25091352 25269605 25462364 25507943 25269048 24644940
60979B4644940j075547j535043j913480k131151k165863k056641j865154j639879
60971A0262182j409637j192634j000083q34948o95015n78128m82479m04284l39242
60962C325732k85815k44164k12471j87025j65555j47821j33080j19478j06251
60953A724072r4251q3927p4561o5851n8510n2909m8556m5277m3401m2520m1493
60942A072816l9976l8577l7246l5063l2005k9386k7945k6877k5284k3406k1754
60931G35297k0249j8873j8017j7580j6763j5399j4339j3921j3229j1630r938r075
60919E56284q602p613o266n357m969m614m160l713k935j449K75J297J362J126
60905E10666J292J942K550K451J522N60M83J037J020n1j303j921k223k757l249
$$ plain form
60979 24644940 23569393 22034350 20120870 17989719 15823856 13767215 11902061 10262182
60971 10262182 8852545 7659911 6659828 5824880 5129865 4551737 4069258 3664974 3325732
60962 3325732 3039917 2795753 2583282 2396257 2230702 2082881 1949801 1830323 1724072
60953 1724072 1629821 1545894 1471333 1405482 1346972 1294063 1245507 1200230 1156829 1114309 1072816
60942 1072816 1032840 994263 957017 921954 889949 860563 832618 805741 780457 757051 735297
60931 735297 715048 696175 678158 660578 643815 628416 614077 600156 586927 575297 565359 556284
60919 556284 547682 540069 533803 528446 523477 518863 514703 510990 508055 506606 506881 508178 509540 510666
60905 510666 511958 513900 516450 518901 520423 520983 521466 522503 523523 523472 522169 520248 518025 515268 512019
60890E12019l314l440m240n268n585n171m831m978n334n613n685n262m291l489
60876D45518l683m611n137m664l692k886k269j495l70J023K332L075L133L139
60862D29413L911N524P290Q592R282R300Q526P172N877N174N097N391N817O133
60848E22499O086N647N076M652M386M017L245J916J43j707l205m090m434m613
60834E39618n044n763o378o591o600o697o624n879m687l961m111m446m199l598
60820D65040l406l771m141m121l827l480l129k829k669k511k000r86K16J118J556
60805D31060J891K556L444L918L692L416L930N033N685N464N159N604O556P229
60791D94637P452P748Q470R450J0334J0961J1479J2279J3643J5225J6257J6429
$$ plain form
60890 512019 508705 505265 501025 495757 490172 485001 480170 475192 469858 464245 458560 453298 449007 445518
60876 445518 441835 437224 432087 427423 423731 420845 418576 417081 416711 417734 420066 423141 426274 429413
60862 429413 433324 438848 446138 454730 464012 473312 481838 489010 494887 500061 505158 510549 516366 522499
60848 522499 528585 534232 539308 543960 548346 552363 555608 557524 557667 555960 552755 548665 544231 539618
60834 539618 534574 528811 522433 515842 509242 502545 495921 490042 485355 481394 477283 472837 468638 465040
60820 465040 461634 457863 453722 449601 445774 442294 439165 436336 433667 431156 429156 428170 428386 429504 431060
60805 431060 432951 435507 438951 442869 446561 449977 453907 458940 464625 470089 475248 480852 487408 494637
60791 494637 502089 509837 518307 527757 538091 549052 560531 572810 586453 601678 617935 634364
60779F34364J6291J6557J7419J8682K0087K1155K1377K1002K1058K2030K3015
60768H53037K2929K2036K1407K1188K0417J8500J5913J3269J0610P862N230K693
60756A035091l23m210q482j2211j5028j7291j9445k1524k3214k4173k4285k3806
60744H41099k3242k2909k2591k1812k0526j9430j9236j9762k0021j9403j8351
60733F13816j7582j7024j6072j4638j3219j2047j0889r738q919q271p037n000
60721D73380l022k032j996k329k634k576j718k96M95j62j438j835j140n18q08
60706D51371j670k487l224m110n069n825o166n963n286m582m344m552m729m618
60692C88746m457m559m869n043m774m004l055k393k116j821j196m99j76j97j49
$$ plain form
60779 634364 650655 667212 684631 703313 723400 744555 765932 786934 807992 830022 853037
60768 853037 875966 898002 919409 940597 961014 979514 995427 1008696 1019306 1027168 1032398 1035091
60756 1035091 1034768 1030558 1022076 1009865 994837 977546 958101 936577 913363 889190 864905 841099
60744 841099 817857 794948 772357 750545 730019 710589 691353 671591 651570 632167 613816
60733 613816 596234 579210 563138 548500 535281 523234 512345 502607 493688 485417 478380 473380
60721 473380 470358 468326 466330 464001 461367 458791 457073 456777 457272 457110 455672 453837 452697 452179 451371
60706 451371 449701 447214 443990 439880 434811 428986 422820 416857 411571 406989 402645 398093 393364 388746
60692 388746 384289 379730 374861 369818 365044 361040 357985 355592 353476 351655 350459 349960 349784 349587 349438
60677C49438J62N68Q66R83Q97P18P05R60J266J444J552J600J392R43N99M85K91
60660C64869jJ82R87J502R32n8j04J020K254K776K777K854L432M706O345P335
60644D01808O967N878N254N062M180K289N69Q9M90P11L37l42r87j495j956k535
60628D26319l143l251k608j999k435l588l984l014j772j496k116k841l280l354
60614C87438k889k036j526j732k047j825j390j351j452j067m17l29q36j074o54
60599C66813k69n84j188j150k62P39J128R55Q24J060J347J207O87K75K77N65Q70
60582C73294J010P97J75m65n31L2O65J001J313J885K479K854L305M143M974N193
60566D02124N047N534P134R180J0626J1080J0816J0125Q993P361N376L265J087
$$ plain form
60677 349438 349600 350168 351034 352017 352914 353632 354337 355297 356563 358007 359559 361159 362551 363494 364093 364578 364869
60660 364869 364868 365050 366037 367539 368471 368413 368309 369329 371583 374359 377136 379990 383422 388128 394473 401808
60644 401808 408775 414653 419907 424969 429149 431438 432007 432096 432586 433297 433634 433292 432305 430810 428854 426319
60628 426319 423176 419925 417317 415318 412883 409295 405311 402297 400525 399029 396913 394072 390792 387438
60614 387438 384549 382513 380987 379255 377208 375383 373993 372642 371190 370123 369706 369377 368541 367467 366813
60599 366813 366544 365960 364772 363622 363360 364099 365227 366182 367006 368066 369413 370620 371307 371582 371859 372424 373294
60582 373294 374304 375101 375276 374811 374280 374312 374977 375978 377291 379176 381655 384509 387814 391957 396931 402124
60566 402124 407171 412705 419839 429019 439645 450725 461541 471666 480659 488020 493396 496661 497748
60553D97748j174l289m787n379n186m360k837p26J290K503L038L654M654N602
60539D90751O201O904Q185R675J0454J0042Q790P386O196N038L514J616j28j301
60525E73323k252l583n035n589m851l662k946k495j577k22P22P72L41J45N12J333
60509E44936K252K795K664K071J608J774K726M438O837R661J2468J5043J7722
60496F26995K1090K5233K9431L2828L5389L7851M0546M2580M2428L9200L3034
60485A006605K4552J4444L522p354j7632k7006l5014m0989m4513m5629m4694m2298
60473G43994l9219l5927l2205k7744k3167j9735j7938j6918j5596j3806j2114
60462D89625j0977j0383r888q814o886m832l799l853l793k811j638j459k222k857
$$ plain form
60553 497748 496574 493285 488498 483119 477933 473573 470736 470010 471300 473803 476841 480495 485149 490751
60539 490751 496952 503856 512041 521716 532170 542212 551002 558388 564584 569622 573136 574752 574624 573323
60525 573323 571071 567488 562453 556864 552013 548351 545405 542910 541333 541111 541833 542605 542946 543091 543603 544936
60509 544936 547188 549983 552647 554718 556326 558100 560826 565264 572101 581762 594230 609273 626995
60496 626995 648085 673318 702749 735577 770966 808817 849363 891943 934371 973571 1006605
60485 1006605 1031157 1045601 1049123 1041769 1024137 997131 962117 921128 876615 830986 786292 743994
60473 743994 704775 668848 636643 608899 585732 565997 548059 531141 515545 501739 489625
60462 489625 478648 468265 458377 449563 442677 437845 434046 430193 426400 423589 421951 420492 418270 415413
60448D15413k738k247j998k155k459k513k135j679j757k321k575k117j633j787
60434C85299k041j466l40J77j57l82j0J82m34j142r22p3J69o16j547j670j034
60417C73993l15P4J46jj76JP22J510J598R47M98J034K144K683K156J124L49L1
60399C88518L8L37R50J691K209K237J784J192R42J144J327J068O69Q07J556K351
60383D08820K825L077L070K509J604J131J452K007K219K247K404K435J965J133
60369D38898L09m07p91l17J004K078J932J085Q35J419J884J650J206J039Q75L96
60353D53095K4M01J461K523L138L510M077M952N866O581P202P875Q236P653O109
60338E22703M341K848J274p88k839m082m607n196o029o427n967n115m480m072
$$ plain form
60448 415413 412675 410428 408430 406275 403816 401303 399168 397489 395732 393411 390836 388719 387086 385299
60434 385299 383258 381792 381452 381629 381472 381090 381080 381262 380828 379686 378764 378691 378860 378244 376697 375027 373993
60417 373993 373678 373752 373898 373897 373721 373722 374444 375954 377552 378499 378997 380031 382175 384858 387014 388138 388487 388518
60399 388518 388556 388893 389843 391534 393743 395980 397764 398956 399898 401042 402369 403437 404106 404913 406469 408820
60383 408820 411645 414722 417792 420301 421905 423036 424488 426495 428714 430961 433365 435800 437765 438898
60369 438898 439207 438800 438009 437692 438696 440774 442706 443791 444626 446045 447929 449579 450785 451824 452699 453095
60353 453095 453119 453520 454981 457504 460642 464152 468229 473181 479047 485628 492830 500705 508941 516594 522703
60338 522703 527044 529892 531166 530378 527539 523457 518850 513654 507625 501198 495231 490116 485636 481564
60324D81564l629l217l095l210l182k727j870q63o7K33J6l33k06P89K392L820
60308D66415M532M818N407O548P964R556J1520J3608J5071J5714J6225J6916J6855
60295F11149J5062J1909Q390M521k59n343q958j0228j0191j0343j0961j1357j1108
60282E72283j0430r682r037q484p947p458p193p175p041o497n872n716n882n629
60268D68240m664l546k928k912l252l658l737l235k406j743j230m72L42M22m40
60253D34781j368j551j195q54m28M00J260J408P97J32r8p1n1L4L42Q04J213J396
60235D36951J227O84j5m63l59L04J305K327L117L570L699L480K924K311K161K652
60219D65875L257L222K481J803J904K644L330L668M016M647N205N241M991N047
$$ plain form
60324 481564 477935 474718 471623 468413 465231 462504 460634 459771 459704 459937 459953 459620 459414 460203 462595 466415
60308 466415 470947 475765 481172 487720 495684 505240 516760 530368 545439 561153 577378 594294 611149
60295 611149 626211 638120 646510 651031 650772 645429 636471 626243 616052 605709 594748 583391 572283
60282 572283 561853 552171 543134 534650 526703 519245 512052 504877 497836 491339 485467 479751 473869 468240
60268 468240 463576 460030 457102 454190 450938 447280 443543 440308 437902 436159 434929 434457 434799 435221 434781
60253 434781 433413 431862 430667 429813 429385 429785 431045 432453 433250 433382 433284 433213 433162 433196 433538 434342 435555 436951
60235 436951 438178 438862 438847 438384 438025 438329 439634 441961 445078 448648 452347 455827 458751 461062 463223 465875
60219 465875 469132 472354 474835 476638 478542 481186 484516 488184 492200 496847 502052 507293 512284 517331
60205E17331N362N211M349L577L707M433M763M325L623L144K797K294J637J037
60191E67590O74N64M89R7o99j512j957k189k591l152l533l665l760l848l782l671
60175E35055l772l908l613k899k366k315k298j853j172p23n15j78M47J044J120
60160E12054M59n81j201q19K88J243J482J145O45K14K8L13J002J597J673J396
60144E20938J348J877K735L377L557L637M092M786N066M810M875N966P430P917
60130E82411P063N738M640L512K004M43p29j589k318k643k294j600j080p12j23
60115E92723O13R58O43nm98o43n33l29j62j41l60r08j805k883l800m232m071l549
60097E71018l172l318l816m044l662k937k180j182L01J906L051L792M612N437
$$ plain form
60205 517331 522693 527904 532253 535830 539537 543970 548733 553058 556681 559825 562622 564916 566553 567590
60191 567590 568264 568828 569317 569414 568715 567203 565246 563057 560466 557314 553781 550116 546356 542508 538726 535055
60175 535055 531283 527375 523762 520863 518497 516182 513884 512031 510859 510136 509621 509443 509890 510934 512054
60160 512054 512513 511932 510731 509912 510200 511443 512925 514070 514715 514929 514957 515270 516272 517869 519542 520938
60144 520938 522286 524163 526898 530275 533832 537469 541561 546347 551413 556223 561098 567064 574494 582411
60130 582411 589474 595212 599852 603364 605368 605811 605082 603493 601175 598532 596238 594638 593558 592846 592723
60115 592723 593336 594294 594937 594932 594434 593791 593258 592929 592767 592626 592266 591358 589553 586670 582870 578638 574567 571018
60097 571018 567846 564528 560712 556668 553006 550069 547889 546707 547008 548914 551965 555757 560369 565806
60083E65806N617M972M229M098M419M519M006L036K040J321O67n56k527m405n241
60068E92001n305n703o687p259o728n732n253n430n800o086o143n721m907m330
60054E10917m407m728m673m180l489k561j346j71O44J316K212L250M094M663N019
60039E06560N094M918M776M751M569M165L953L955L369J661m22j702k071k313
60025E41263k908l817n133o876q292q434p589p101p621q363q414p890p357o824
60011D44644n945m763l669k860k337k149k172j838o05J209K514K555J811J469
59997D27864K068K907K905J954J044J097J943K685K797K643K941L905M983N397
59983D67133N046M687M952N335M602K379j97j646j586p61r6j62j158k732m004
$$ plain form
60083 565806 571423 576395 580624 584722 589141 593660 597666 600702 602742 604063 604730 604174 601647 597242 592001
60068 592001 586696 580993 574306 567047 560319 554587 549334 543904 538104 532018 525875 520154 515247 510917
60054 510917 506510 501782 497109 492929 489440 486879 485533 485362 486006 487322 489534 492784 496878 501541 506560
60039 506560 511654 516572 521348 526099 530668 534833 538786 542741 546110 547771 547349 545647 543576 541263
60025 541263 538355 534538 529405 522529 514237 505803 498214 491113 483492 475129 466715 458825 451468 444644
60011 444644 438699 433936 430267 427407 425070 422921 420749 418911 418306 419515 422029 424584 426395 427864
59997 427864 429932 432839 435744 437698 438742 439839 441782 444467 447264 449907 452848 456753 461736 467133
59983 467133 472179 476866 481818 487153 491755 494134 493937 492291 490705 489944 489848 489686 488528 485796 481792
59968D81792m261l629k778k081j431p18q8L20M81L35j63p96j104p48J40R36R44
59951D67151Q1q55r53k79K79K55J12K76M22K02jK33M39j22j315k342k852l067
59933D57664k955k241j131k84M8J10j10q68j822k042j244k68K5k20l11L5O70J439
59915D46495K160K469K190J622J237J201J446J881K260K165J567J126J528K597
59901D71944L425L436K938K594K675K929L017K883K711K681K777K822K685K389
59887E11906K042J690J346J168J527K682M341N728O255O108N961O122O225N743
59873E68844M596L108J623K94q72j943k955l840m514n052n580o007o061n628m861
59858E31152l898k785j666q16l18P1O70J620K888M362N931P656R597J1260J1568
$$ plain form
59968 481792 477531 473902 471124 469043 467612 466894 466806 467126 467607 467942 467779 466983 465879 465131 465271 466207 467151
59951 467151 467232 466377 465424 465145 465424 465679 465791 466067 466489 466691 466690 466923 467362 467240 465925 463583 460731 457664
59933 457664 454709 452468 451337 451053 451101 451211 451101 450233 448411 446369 445125 444857 444882 444662 444351 444386 445056 446495
59915 446495 448655 451124 453314 454936 456173 457374 458820 460701 462961 465126 466693 467819 469347 471944
59901 471944 475369 478805 481743 484337 487012 489941 492958 495841 498552 501233 504010 506832 509517 511906
59887 511906 513948 515638 516984 518152 519679 522361 526702 532430 538685 544793 550754 556876 563101 568844
59873 568844 573440 576548 578171 578465 577593 575650 572695 568855 564341 559289 553709 547702 541641 536013 531152
59858 531152 527254 524469 522803 521987 521669 521740 522410 524030 526918 531280 537211 544867 554464 565724 577292
59843E77292J0001P484N448M190L045J996J858K665L104K254P73k88r83j924l137
59828F13778m352n730p232p997p425o403o295p074p607p476p330p469p361o687
59814E17340n861n282m889m560m251l737k920k316k404k647k145j150p83j193
59800D73202j270n63j97j155k721l462l139k615k424k253j760j213j164j792k621
59785D44853k873k290j546j526k224k755k481j637q09k91p9J7L97J303K282K566
59769D32907K126J791K074K519K489K066J780J891K286K755K999K720K029J489
59755D63921J464J734J953K213K770L507L941L793L346L222L700M244L950K668
59741E06426J363R78J295J464J296J251J350J103N23K93O89J161J333J514J910
$$ plain form
59843 577292 587293 594777 600225 604415 607460 609456 611314 613979 617083 619337 620110 619822 618839 616915 613778
59828 613778 609426 603696 596464 588467 581042 574639 568344 561270 553663 546187 538857 531388 524027 517340
59814 517340 511479 506197 501308 496748 492497 488760 485840 483524 481120 478473 476328 475178 474395 473202
59800 473202 471932 471369 471172 470017 467296 463834 460695 458080 455656 453403 451643 450430 449266 447474 444853
59785 444853 441980 439690 438144 436618 434394 431639 429158 427521 426712 426421 426342 426359 426756 428059 430341 432907
59769 432907 435033 436824 438898 441417 443906 445972 447752 449643 451929 454684 457683 460403 462432 463921
59755 463921 465385 467119 469072 471285 474055 477562 481503 485296 488642 491864 495564 499808 503758 506426
59741 506426 507789 508767 510062 511526 512822 514073 515423 516526 517049 517342 518031 519192 520525 522039 523949
59726E23949K092J714J085N69O6m63o38l20m2j36n4P41J685J725Q04l6m0M58P37
59707E33896O93Q37J435K017J933J343J205J989K806K445J023j61l16J24N27R21
59691E52717J484K000K253K321K063J037o90k200k696k338j722j108o28o18j177
59676E50698j796k002j967k106k479k957l512l981m043l803l823m204m290l735
59662E06000l121k934k735k141j780k322l061k677j060O41J627K075K265K111
59648D92888J740J645J889J872J143K0q58j303j639k237l039l570l458k976k735
59633D79382k741k277r62O29J775K421K663K142P54n29o12K15O45J64m85o17n14
59616D82053p35j293j857k236k375k225j847j366q08j39M96Q76R58P96M28Q9J85
$$ plain form
59726 523949 526041 527755 528840 529409 529475 529012 528374 528054 528012 527876 527822 528563 530248 531973 532777 532741 532701 533159 533896
59707 533896 534589 535426 536861 538878 540811 542154 543359 545348 548154 550599 551622 551461 551145 551269 551796 552717
59691 552717 554201 556201 558454 560775 562838 563875 563185 560985 558289 555951 554229 553121 552493 551875 550698
59676 550698 548902 546900 544933 542827 540348 537391 533879 529898 525855 522052 518229 514025 509735 506000
59662 506000 502879 499945 497210 495069 493289 490967 487906 485229 484169 484810 486437 488512 490777 492888
59648 492888 494628 496273 498162 500034 501177 501197 500339 499036 497397 495160 492121 488551 485093 482117 479382
59633 479382 476641 474364 473402 474031 475806 478227 480890 483032 483786 483257 482645 482860 483505 483669 483184 482567 482053
59616 482053 481318 480025 478168 475932 473557 471332 469485 468119 467311 467172 467668 468544 469502 470298 470726 470815 471000
59599D71000O63P55p0j216j631j108k65M95J186J622J497J092J030J257J137O08
59583D78052L45N20L48o57j815k257k116k073k263k388k609l492m982o074n778
59568D42761m188k383j384j261j255o81L68J246J451J019L48q1Q1Q02J630K134
59552D40607K353K599K900K946K536J854J349J504K578M233N563N916N623N675
59538D88236O717Q773J1670J5128J8311J9933J9134J6053J1418O032Q05l174n097
59525F13939m946l381j156J209L334M829N464N377M969M423L436J733l69k268
59511F36593l984o115q624j0419j0618r773r098q936q764q488q633r215r281q123
59497E16522o278m889m434m447m232l472k319j135j56O56J436K154K664K946K995
$$ plain form
59599 471000 471663 472418 472348 471132 469501 468393 468128 468623 469809 471431 472928 474020 475050 476307 477444 478052
59583 478052 478397 478917 479265 478608 476793 474536 472420 470347 468084 465696 463087 459595 454613 448539 442761
59568 442761 438573 436190 434806 433545 432290 431609 431977 433223 434674 435693 436041 435960 436041 436843 438473 440607
59552 440607 442960 445559 448459 451405 453941 455795 457144 458648 461226 465459 471022 476938 482561 488236
59538 488236 494953 503726 515396 530524 548835 568768 587902 603955 615373 621405 622210 619036 613939
59525 613939 608993 605612 604456 605665 608999 613828 619292 624669 629638 634061 637497 639230 638861 636593
59511 636593 632609 626494 617870 607451 596833 587060 577962 569026 560262 551774 543141 533926 524645 516522
59497 516522 510244 505355 500921 496474 492242 488770 486451 485316 485160 485816 487252 489406 492070 495016 498011
59482D98011K690K090J775K460M174O162P645Q465Q957R429R815R651Q473O429
59468E86226M352K985K245J543O46j61n88n38P7J281K825M427O073P724R011R792
59452F37920J0756J2660J5041J6556J6701J6356J6326J6169J4970J2539R294N419
59440H00707Q67m050q670j2495j5350j7125j7621j6746j4715j2221j0292r632
59428F62657r940j0184r680q581p225n505l164l12K783O033R327J2251J4465J6202
59414F69127J8029K0246K2791K5413K7510K7902K5436J9960J2418L865n054j3538
59402H54105k0043k2960k1920j7979j2521o510r78K362J912k321q595j4990k0552
59389G09010k4838k7137k6890k4616k1605j8683j5805j2812j0017p836o246m928
$$ plain form
59482 498011 500701 502791 504566 507026 511200 517362 525007 533472 542429 551858 561673 571324 579797 586226
59468 586226 590578 593563 595808 597351 597997 597836 597248 596710 596787 598068 600893 605320 611393 619117 628128 637920
59452 637920 648676 661336 676377 692933 709634 725990 742316 758485 773455 785994 795288 800707
59440 800707 801574 797524 788854 776359 761009 743884 726263 709517 694802 682581 672289 662657
59428 662657 652717 642533 632853 624272 617047 611542 608378 608066 610849 616882 626209 638460 652925 669127
59414 669127 687156 707402 730193 755606 783116 811018 836454 856414 868832 872697 867643 854105
59402 854105 834062 811102 789182 771203 758682 752172 751194 753556 755468 753147 744552 729562 709010
59389 709010 684172 657035 630145 605529 583924 565241 549436 536624 526607 518771 512525 507597
59377E07597l616k247q80K79R99J191R17K62n13q31j39J442L023L687L252K363
59361E16786J919K382L433M390N003N668O745P958Q865R618J0787J2498J4231
59348F10283J5541J6570J7688J8988K0256K1236K1794K1955K1730K0869J8975
59337H25885J6078J2852R929P117L763k57m362q001j1053j3446j5000j5875j6734
59324G90896j8021j9311j9665j8660j6861j5212j4050j2907j1319r596q423p894
59312F18977p449o762o040n259l915j979l20M81J088K404M168N549O739Q719J1641
59297F28042J4481J6359J7084J6295J3307Q324K800j994o088r898j2910j4102
59285F71700j3356j1667r931q113n734k930o27M31O76J312K854M642O009P293
$$ plain form
59377 507597 503981 501734 500854 501133 502132 503323 504240 504502 503989 503158 503019 504461 507484 511171 514423 516786
59361 516786 518705 521087 524520 528910 533913 539581 546326 554284 563149 572767 583554 596052 610283
59348 610283 625824 642394 660082 679070 699326 720562 742356 764311 786041 806910 825885
59337 825885 841963 854815 864744 871861 875624 875367 871005 863004 851951 838505 823505 807630 790896
59324 790896 772875 753564 733899 715239 698378 683166 669116 656209 644890 635294 626871 618977
59312 618977 611528 604766 598726 593467 589552 587573 587253 587734 588822 591226 595394 600943 607682 616401 628042
59297 628042 642523 658882 675966 692261 705568 713892 716692 714698 708610 698712 685802 671700
59285 671700 658344 646677 636746 628633 622899 619969 619342 619773 620449 621761 624615 629257 635266 642559
59271F42559R095J1160J2811J3971J4831J4865J3409J1040R099P779N921K926
59259G69466l35l042n605q617j1620j3730j4883j5555j5765j5120j3627j1872
59247F39695j0430r394q355o763m628k731j682q98O99L017M830N639O345P592
59233F22936Q573Q235O856N454M327L078J647L53q37k340m254o216p836q882r318
59218F21776r483r934j0706j1106j0602r534q512p575o493n482m969m856m562
59205E17962l746k582j417m42L94J267K159K623K299J633J554K285L102L445L592
59190E34128L957M437M876N401N839N556M449L452L364L784L852L498L184K958
59176E92735K621K480L007L962M629M834N058N629O357O979P498Q102R017J0267
$$ plain form
59271 642559 651654 662814 675625 689596 704427 719292 732701 743741 752840 760619 766540 769466
59259 769466 769131 766089 760484 751867 740247 726517 711634 696079 680314 665194 651567 639695
59247 639695 629265 619871 611516 604753 600125 597394 595712 594814 595513 598530 603360 608999 615344 622936
59233 622936 631509 639744 646600 652054 656381 659459 661106 661459 660622 658282 654028 647812 639976 631094 621776
59218 621776 612293 602359 591653 580547 569945 560411 551899 544324 537831 532349 527380 522524 517962
59205 517962 514216 511634 510217 509775 510169 511436 513595 516218 518517 520150 521704 523989 527091 530536 534128
59190 534128 538085 542522 547398 552799 558638 564194 568643 572095 575459 579243 583095 586593 589777 592735
59176 592735 595356 597836 600843 604805 609434 614268 619326 624955 631312 638291 645789 653891 662908 673175
59162F73175J1364J1560J0642R125P437N461L187J185j68j355l080n343p685r830
59148G05675j1542j2366j2146j1433j0879j0578j0378j0249r899q765o983n555
59136E84902m954m367l159k082j958k086j288J17R51J294K305M113N487N764N604
59121E90643N625N654N691O346P724Q992R591R996J0661J1136J0794R853R049
59108G01755Q719Q650Q390P526O132N049N084N774N702M300K640J935K025J900
59094G75581J123N4r66j859k441k411j874j385j414j889k436k847l282m028n188
59079G44738o697q478j0363j1833j2275j1668j0707j0008r526r034q662q563q382
59066F18542p683o615n671m950m226l536l172l218l526l950m179l724k658j992
$$ plain form
59162 673175 684539 696099 706741 715866 723303 728764 731951 733136 732968 731613 728533 723190 715505 705675
59148 705675 694133 681767 669621 658188 647309 636731 626353 616104 606205 597440 590457 584902
59136 584902 579948 575581 572422 570340 568382 566296 565008 565125 566076 567370 569675 573788 579275 585039 590643
59121 590643 596268 601922 607613 613959 621683 630675 640266 650262 660923 672059 682853 692706 701755
59108 701755 710474 719124 727514 735040 741172 746221 751305 757079 762781 767081 769721 771656 773681 775581
59094 775581 776704 776758 775792 773933 771492 769081 767207 765822 764408 762519 760083 757236 753954 749926 744738
59079 744738 738041 729563 719200 707367 695092 683424 672717 662709 653183 644149 635487 626924 618542
59066 618542 610859 604244 598573 593623 589397 585861 582689 579471 575945 571995 567816 564092 561434 559442
59052E59442k507l502l627k722j870j689j661j346j117j252j238o04K62P48R29
59037E38246J259J724J983K103K510L238L729L537K916K593L036M117N388O551
59023E82930P618Q756J0127J1727J3215J4045J4056J3754J3512J2754J0603P326
59011G20423M183J729o99l381n201n076l516j818m60Q18J946K725L585N007O481
58996G26746P152P139P117O886N675L673J944P78n90k493m331n808p398r136j0168
58981G27186r978r149q295p223n814m741m514m413l305j129J127K734L889N152
58967F81527O707Q211R226R676R860R925R630Q900Q278Q198Q093O902M432J551
58953G91116j034l445o041q811j1491j3701j4892j4722j3636j2534j1757j0869
$$ plain form
59052 559442 556935 553433 549806 547084 545214 543525 541864 540518 539401 538149 536911 536307 536569 537317 538246
59037 538246 539505 541229 543212 545315 547825 551063 554792 558329 561245 563838 566874 570991 576379 582930
59023 582930 590548 599304 609431 621158 634373 648418 662474 676228 689740 702494 713097 720423
59011 720423 724606 726335 725636 722255 717054 711978 708462 706644 706184 707002 708948 711673 715258 720265 726746
58996 726746 733898 741037 748154 755040 760715 764388 766332 767110 766520 764027 759696 753888 746490 737354 727186
58981 727186 717208 708059 699764 692541 686727 681986 677472 673059 669754 668625 669752 672486 676375 681527
58967 681527 688234 696445 705671 715347 725207 735132 744762 753662 761940 770138 778231 785133 789565 791116
58953 791116 790082 786637 780596 771785 760294 746593 731701 716979 703343 690809 679052 668183
58941F68183r439p518n399l471k215j830j866j773j640j801k089k281k899m509
58927F19453o436p352p139o894p024o679n442m236l952m147l846k850j636o66
58913E51154j88k09k28L84J510K492L221M245N630O778P610Q829J0599J2085J2833
58898F26745J3528J4685J5608J5472J4562J3631J2834J2108J1844J2322J3127
58887G76466J3934J5268J7564K0006K1188K0593J8746J6267J3518J0727P755M077
58875I56109l86m859q708j2321j6197j9666k1501k1585k1019k0625k0116j8907
58863G70219j7092j5345j4160j3424j2633j1514j0430r881r714r215q153p245
58851F31413p270q071q676q176o427m240k902l036l880m235m036m186m893n222
$$ plain form
58941 668183 658744 651226 645827 642356 640141 638311 636445 634672 633032 631231 629142 626861 623962 619453
58927 619453 613017 605665 598526 591632 584608 577929 572487 568251 564299 560152 556306 553456 551820 551154
58913 551154 550966 550757 550529 550913 552423 554915 558136 562381 568011 574789 582399 591228 601827 613912 626745
58898 626745 640273 654958 670566 686038 700600 714231 727065 739173 751017 763339 776466
58887 776466 790400 805668 823232 843238 864426 885019 903765 920032 933550 944277 952032 956109
58875 956109 955723 950864 942156 929835 913638 893972 872471 850886 829867 809242 789126 770219
58863 770219 753127 737782 723622 710198 697565 686051 675621 665740 656026 646811 638658 631413
58851 631413 624143 616072 607396 599220 592793 588553 585651 582615 578735 574500 570464 566278 561385 556163
58837E56163m589l662l225l113k948l043l719m374m225l485k937k688k162j178
58823E10815k59J16J9j38jM49Q10O72K68L32J133K073K542K629K716K819K744
58806E29739K460J971J200K63m42o56m19J60Q21R01m4j259j387k32R09R69K54
58789E35208m45q82r16j19J446K836L342L371L596L971M188M437M941N326N108
58774E75408M299L106J596O7r73j637k572l702m154l941m389n974p084o205m275
58759E39570l324l509l168j477N54J704J956K007K345K931L326L125K613K656
58745E51309L513M366M542M503M942N593N821N785O034O477O693O824P232P644
58731F31278P616P370P335P231O602N835N616N686N148L845K476J496P38K2n56
$$ plain form
58837 556163 551574 547912 544687 541574 538626 535583 531864 527490 523265 519780 516843 514155 511993 510815
58823 510815 510556 510672 510691 510553 510552 511001 511811 512483 512751 513083 514216 516289 518831 521460 524176 526995 529739
58806 529739 532199 534170 535370 535633 535191 534535 534116 534276 535097 535998 535954 534695 533308 533076 533985 534954 535208
58789 535208 534763 533881 532965 532846 534292 537128 540470 543841 547437 551408 555596 560033 564974 570300 575408
58774 575408 579707 582813 584409 584476 583503 581866 579294 575592 571438 567497 563108 557134 550050 543845 539570
58759 539570 536246 532737 529569 528092 528646 530350 532306 534313 536658 539589 542915 546040 548653 551309
58745 551309 554822 559188 563730 568233 573175 578768 584589 590374 596408 602885 609578 616402 623634 631278
58731 631278 638894 646264 653599 660830 667432 673267 678883 684569 689717 693562 696038 697534 698272 698294 697738
58716F97738r03q75k11J013K248L212M174M981M694K976J015kn84j948m024n807
58700G07697p156q871j1127j3188j4548j5245j5211j4330j3099j2182j1459j0434
58688E60847r275q429p579o138m587m022m477m885m716m466m460m355m041l894
58674D85523l815l014j164R44K324K771K805L090M080N717P383Q525R218R786
58660E34173J0078R638Q290O158L452O82j368k437l102l809m215m072l952m355
58646E45161m748m449l771l357l119k777k683l015k879j538J63R19R31J309K081
58631E18228K379K282K726L662L846K717J197M25O43J411K000J744R10R17K724
58616E47811N341P042P610Q127R010R604R524Q966P892O121M140K583J179o38
$$ plain form
58716 697738 696835 695960 695749 696762 699010 702222 706396 711377 716071 719047 720062 720060 719476 717528 713504 707697
58700 707697 700541 691670 680543 667355 652807 637562 622351 608021 594922 582740 571281 560847
58688 560847 551572 543143 535564 529426 524839 520817 516340 511455 506739 502273 497813 493458 489417 485523
58674 485523 481708 478694 477530 478474 480798 483569 486374 489464 493544 499261 506644 515169 524387 534173
58660 534173 544251 553889 562179 568337 571789 572471 571103 568666 565564 561755 557540 553468 549516 545161
58646 545161 540413 535964 532193 528836 525717 522940 520257 517242 514363 512825 512988 513907 514838 516147 518228
58631 518228 520607 522889 525615 529277 533123 535840 537037 537462 538105 539516 541516 543260 544170 545087 547811
58616 547811 553152 560194 567804 575931 584941 594545 604069 613035 620927 627048 631188 633771 634950 634312
58602F34312k426l313l427l511l533l151k935l581m339m020l074k839l076k272
58588E88815k82J488K505L725N544P107P954Q560Q976Q755Q408Q996J0018R718
58574F80287P861O261O001O217O191O556P569Q212Q066Q457J0539J3730J6904
58561G92851J9701K1847K2705K2515K2570K3207K2931K0560J6858J3097R319N205
58549A013366J410j235k944m410n752o866p975r114r895j0423j1496j3366j5272
58536I16028j6820j8618k0852k2304k1767j9604j7139j5110j3421j1669r435o653
58524G22636m061k531j860r94M59J949L144M154M596L887K594K097K550K700K009
58509G43329J420J579J808J390M80p39k299l509l363k362k318l769n238n651n682
$$ plain form
58602 634312 631886 628573 625146 621635 618102 614951 612016 608435 604096 600076 597002 594163 591087 588815
58588 588815 588533 590021 592526 596251 601795 608902 616856 625416 634392 643147 651555 660551 670569 680287
58574 680287 688148 694409 700410 706627 712818 719374 726943 735155 743221 751678 762217 775947 792851
58561 792851 812552 834399 857104 879619 902189 925396 948327 968887 985745 998842 1008161 1013366
58549 1013366 1014776 1013541 1010597 1006187 1000435 993569 985594 976480 966585 956162 944666 931300 916028
58536 916028 899208 880590 859738 837434 815667 796063 778924 763814 750393 738724 729289 722636
58524 722636 718575 716044 714184 713190 713649 715598 718742 722896 727492 731379 733973 736070 738620 741320 743329
58509 743329 744749 746328 748136 749526 750006 749267 746968 743459 740096 737734 735416 731647 726409 720758 715076
58494G15076n972n791m490k780j550p41j85j36k13O37K361L577L940M996P676
58479G16405J0620J2247J2981J4047J5349J5864J5178J3495J0969P880M713J482
58467H51230k084n413p471q461r567j0713j0442q509o545n441m120j816N23K180
58453G73351L990O480Q514R065Q583P512N297K055p60k606m737p543r165q413
58439G91623o912o502o469n295l355j773k47J824L516L821L773M947O948Q301
58425G94200Q847R437J0193J0825J1719J3075J3803J2847J0724Q447N906K713
58413I12736n00k944m815o404p328p740q779j0607j1564j0590q897p890p181o095
58399H11402n254n006m106j781N91J674K235L220L640K492R17L14o4j397k795
$$ plain form
58494 715076 709104 703313 698823 696043 694493 693752 693567 693431 693218 693855 696216 699793 703733 708729 716405
58479 716405 727025 739272 752253 766300 781649 797513 812691 826186 837155 845035 849748 851230
58467 851230 849146 843733 836262 827801 818234 807521 797079 788570 782025 776584 772464 770648 771171 773351
58453 773351 777341 783821 792335 801400 809983 817495 822792 824847 824087 821481 816744 809201 800036 791623
58439 791623 784711 778209 771740 766445 763090 761317 761070 762894 766410 770231 774004 778951 785899 794200
58425 794200 803047 812484 822677 833502 845221 858296 872099 884946 895670 904117 910023 912736
58413 912736 912236 909292 904477 898073 890745 883005 874226 863619 852055 841465 832568 824678 817497 811402
58399 811402 806148 801142 797036 795255 795846 797520 799755 802975 806615 809107 810024 810338 810274 808877 806082
58384H06082k814k060k016k547k719k698k833k256m83J129J545K066M036O249
58370H00681O997P006P868R103R390R363J0486J2358J3581J4220J5033J5563J5208
58357I46857J4846J5236J5186J3544J1383R982Q446N773L385K886L096K212J163
58344A053995J886L844N324O608Q782J0947J1674J1834J2926J4087J3854J3299
58332A169060J4246J5828J6134J5637J5720J5391J2982R702P892P119N545L697
58320A308953L221L297K132P51J459L666N049N677P213R197R999J0256J1563J2963
58306A395396J2677J1999J3374J5917J7000J6973J7984J9413J9042J7581J7478
58295A574834J8259J7625J6130J6113J7060J6720J5816J6810J8996J9780J9850
$$ plain form
58384 806082 803268 801208 799192 796645 793926 791228 788395 786139 785656 786785 788330 790396 794432 800681
58370 800681 807678 814684 822552 831655 841045 850408 860894 873252 886833 901053 916086 931649 946857
58357 946857 961703 976939 992125 1005669 1017052 1027034 1035480 1041253 1044638 1047524 1050620 1052832 1053995
58344 1053995 1055881 1059725 1065049 1071657 1080439 1091386 1103060 1114894 1127820 1141907 1155761 1169060
58332 1169060 1183306 1199134 1215268 1230905 1246625 1262016 1274998 1284700 1292592 1299711 1305256 1308953
58320 1308953 1312174 1315471 1317603 1318354 1319813 1323479 1328528 1334205 1341418 1350615 1360614 1370870 1382433 1395396
58306 1395396 1408073 1420072 1433446 1449363 1466363 1483336 1501320 1520733 1539775 1557356 1574834
58295 1574834 1593093 1610718 1626848 1642961 1660021 1676741 1692557 1709367 1728363 1748143 1767993
58284A767993K1970K5492K7223K7063K7672K9232K9766K9840L1714L4500L5489
58273B087954L5497L7493M0827M2409M2732M4959M8773N1162N2469N5580N9863
58262B599718O2209O3376O6789P1743P4406P4883P6470P8576P7655P4629P4036
58251C394490P6136P7291P7722Q1050Q6534Q9952R2127R8076J07602J15348J20524
58240D416852J27737J37649J45893J52013J60424J71594J81353J89822K01676
58231E885013K16810K30291K42323K58287K78291K97120L15233L38768L67836
58222H429972L96379M24569M59183N00629N42478N85144O36647O98308P64070
58213A3437379Q35665R23384J029639J147729J279347J436687J624948J841323
$$ plain form
58284 1767993 1789963 1815455 1842678 1869741 1897413 1926645 1956411 1986251 2017965 2052465 2087954
58273 2087954 2123451 2160944 2201771 2244180 2286912 2331871 2380644 2431806 2484275 2539855 2599718
58262 2599718 2661927 2725303 2792092 2863835 2938241 3013124 3089594 3168170 3245825 3320454 3394490
58251 3394490 3470626 3547917 3625639 3706689 3793223 3883175 3975302 4073378 4180980 4296328 4416852
58240 4416852 4544589 4682238 4828131 4980144 5140568 5312162 5493515 5683337 5885013
58231 5885013 6101823 6332114 6574437 6832724 7111015 7408135 7723368 8062136 8429972
58222 8429972 8826351 9250920 9710103 10210732 10753210 11338354 11975001 12673309 13437379
58213 13437379 14273044 15196428 16226067 17373796 18653143 20089830 21714778 23556101
58205B3556101K094706K407035K791464L250299L799519M473631N300686O294028
58197E3967469P471023Q853205J0446393J2258232J4352082J6858709J9919449
58190A44126562K3604601K7789354L1950549L5055851L5845596L3460163K7878382
58183C59711058J9759014R970007o03823j0908038j9712996k6017033k9493500
58176C02704689l0524410k9853415k8214228k6132291k3871999k1497748j9027722
58169A23582876j6556889j4231105j2142079j0301232q701157p346355o222656
58162D8081403n287125m503451l856766l327602k882673k500577k180638j918456
58154B1624115j695747j501068j338538j208458j098372r99870r16207q46939
$$ plain form
58205 23556101 25650807 28057842 30849306 34099605 37899124 42372755 47673441 53967469
58197 53967469 61438492 70291697 80738090 92996322 107348404 124207113 144126562
58190 144126562 167731163 195520517 227471066 262526917 298372513 331832676 359711058
58183 359711058 379470072 389440079 388836256 377928218 358215222 332198189 302704689
58176 302704689 272180279 242326864 214112636 187980345 164108346 142610598 123582876
58169 123582876 107025987 92794882 80652803 70351571 61650414 54304059 48081403
58162 48081403 42794278 38290827 34434061 31106459 28223786 25723209 23542571 21624115
58154 21624115 19928368 18427300 17088762 15880304 14781932 13782062 12865855 12018916
58146A2018916p81735p15720o55534o04367n55369n05249m60380m23921l89976
58137F926665l55782l27126l06411k87270k66285k48628k36955k25576k10931
58128D461701j97456j87813j77253j63010j49965j41555j33793j23555j14495
58119C072806j09407j04575r6902q9557q5476q1976p6502p1480o8935o6298o1751
58108B159947n7994n6745n5192n1541m8566m8076m7309m4309m1534m0746l9625
58097A628310l6729l4619l4761l4457l2035k9995k9857k8970k5757k3079k2983
58086A295068k2940k0750j8490j8163j8008j6639j6385j8823k1153k0686j9133
58075A083898j9037j9587j9350j9475k0836k1412j9761j7898j7668j7554j6017
$$ plain form
58146 12018916 11237181 10521461 9865927 9261560 8706191 8200942 7740562 7316641 6926665
58137 6926665 6570883 6243757 5937346 5650076 5383791 5135163 4898208 4672632 4461701
58128 4461701 4264245 4076432 3899179 3736169 3586204 3444649 3310856 3187301 3072806
58119 3072806 2963399 2858824 2761922 2672365 2586889 2504913 2428411 2356931 2287996 2221698 2159947
58108 2159947 2101953 2045208 1990016 1938475 1889909 1841833 1794524 1750215 1708681 1667935 1628310
58097 1628310 1591581 1556962 1522201 1487744 1455709 1425714 1395857 1366887 1341130 1318051 1295068
58086 1295068 1272128 1251378 1232888 1214725 1196717 1180078 1163693 1144870 1123717 1103031 1083898
58075 1083898 1064861 1045274 1025924 1006449 985613 964201 944440 926542 908874 891320 875303
58064H75303j4557j4537j4223j2111j0038r913j0337r513q560q980r638r209q871
58051G34816r704j0159q915p666q200r217q826p773p466p179n959n037n602o381
58037F26732n918n185n512o001n520n115o033p294p542p345p584p610p101p474
58023E35498r259j0322q971o767n951o124n847n374n471n342m129k786k330k011
58009D54814j126p97j891l025k726j750j335j049k01M59M17P52K044L007K964
57994D50557L333M737N190L449J577J677K432J720L47J77N39l09j786k145j661
57979D69834j765k197j839j279j846l038l438l197l337l531k924k022j610r53
57965D36858P03K092J765O98P47J629J896J721K136K561J752L26j74n7p88k269
$$ plain form
58064 875303 860746 846209 831986 819875 809837 799924 789587 780074 771514 762534 752896 743687 734816
58051 734816 725112 714953 706038 698372 690172 680955 672129 664356 656890 649711 643752 638715 633113 626732
58037 626732 620814 615629 610117 604116 598596 593481 587448 580154 572612 565267 557683 550073 542972 535498
58023 535498 526239 515917 506946 500179 494228 488104 482257 476883 471412 466070 461941 459155 456825 454814
58009 454814 453688 452891 451000 447975 445249 443499 442164 441115 440914 441373 441790 442542 444586 447593 450557
57994 450557 453890 458627 463817 467266 468843 470520 472952 474672 475019 475196 475735 475426 473640 471495 469834
57979 469834 468069 465872 464033 462754 460908 457870 454432 451235 447898 444367 441443 439421 437811 436858
57965 436858 437561 439653 441418 442116 442863 444492 446388 448109 450245 452806 454558 454884 454710 454653 453865 451596
57949D51596l118l123l075k777j524l4L47j02o6N67J020J558K919M504N198N494
57933D59384O636Q230Q837Q443Q142P803O237L499R30r35k664m329n441o308p717
57918D90747r382j0272j0248r991r648q941q117p457o434m730l281k879k683j702
57904C94982p48j077k056k182j595j559k153k528k779l463l936l283k308k426
57890C62889l085k568r43Q5jn9M22P01M28k9p70k014k835k218j139j502l215m443
57872C39704m658n073n965n904m240k248j180q37o68o96q23o16j45J44N45J814
57856C09154L703N098N683O208P025P580P429O658N460M297M022M702M860L258
57842C85137P64j010k057l226m030l355j814j139j472j512j045j035j272m09J473
$$ plain form
57949 451596 448478 445355 442280 439503 437979 437945 438292 438190 438124 438691 439711 441269 444188 448692 453890 459384
57933 459384 466020 474250 483087 491530 499672 507475 513712 517211 518141 517206 514542 510213 504772 498464 490747
57918 490747 481365 471093 460845 450854 441206 432265 424148 416691 410257 405527 402246 399367 396684 394982
57904 394982 394234 393157 391101 388919 387324 385765 383612 381084 378305 374842 370906 367623 365315 362889
57890 362889 359804 357236 356293 356378 356377 356318 356740 357441 357869 357840 357070 355056 352221 350003 348864 347362 344147 339704
57872 339704 335046 329973 324008 318104 313864 311616 310436 309599 308931 308235 307412 306796 306651 306795 307340 309154
57856 309154 312857 317955 323638 329846 336871 344451 351880 358538 363998 368295 372317 377019 381879 385137
57842 385137 385901 384891 382834 379608 375578 372223 370409 369270 367798 366286 365241 364206 362934 362525 363998
57827C63998K654K474K138K419K654K461K466K724K378J337N82L93N5m63l82M8
57811C87936m33j860k881l236m289o492q442r235r696j0423j0545r416p839o592
57797B96557n391m102l356l085k186n55L11l01r73l36J019J946K509L154L496
57782B88707L288L348M350N708O653P270P633P160N896N091N342N413M073J985
57768C61917M66n06j736l181m302n307o692q088q770q847q943r053q703p894p069
57753B73292o427n867n253m404l193k025j497j419r32J01Q14P55N59P02P10K08
57737B46124k86l38l41o72r96j083j321j802j887j331p60m50K43J423J960J150
57721B39633o2o02q54j601k354k099j038l01l95r95j749k387k505k074j732j835
$$ plain form
57827 363998 366652 369126 371264 373683 376337 378798 381264 383988 386366 387703 388285 388678 388733 388270 387888 387936
57811 387936 387503 385643 382762 379526 375237 368745 360303 351068 341372 330949 320404 310988 303149 296557
57797 296557 291166 287064 283708 280623 278437 277882 278193 277892 276919 276583 277602 279548 282057 285211 288707
57782 288707 291995 295343 299693 305401 312054 319324 326957 334117 340013 345104 350446 355859 359932 361917
57768 361917 362383 361877 360141 356960 352658 347351 340659 332571 323801 314954 306011 296958 288255 280361 273292
57753 273292 266865 260998 255745 251341 248148 246123 244626 243207 242275 242376 243190 243945 244504 245206 245916 246124
57737 246124 245838 245500 245159 244487 243491 242408 241087 239285 237398 236067 235307 234857 235100 236523 238483 239633
57721 239633 239571 238969 238115 236514 234160 232061 231023 230722 230327 229332 227583 225196 222691 220617 218885 217050
57705B17050j895j556j303j401j182l03J57p77k202k391j164J47O77O60L58k60
57689B04615p93n10N34J379J354Q18N65J085K379M038N475O419P203Q332J0060
57674B52953J2508J5786J9663K3624K7669L2667L9286M6815N3325N6657N5132
57663F36085M7902L5247J8518l62j9068l4935m5829n1296n2313m9931m4962l8871
57651D00185l3513k9436k5463k0601j5485j1398q883p809p724p547o001l259j141
57638B21925q76j597j811j309o83p4M65L12p39j599j272m40m42j210j530r63k18
57621B07939J11K6m30j187j688j376n52n2k09p64j411j876j824j383j257j732
57605A92335k134j858j286r53o41j15Q0m20q65n03J03J4n50q27j034j770k550
$$ plain form
57705 217050 215155 213599 212296 210895 209713 209410 209567 208790 206588 204197 203033 203180 203857 204517 204875 204615
57689 204615 203822 203312 203846 205225 206579 207397 207962 209047 211426 215464 220939 227358 234561 242893 252953
57674 252953 265461 281247 300910 324534 352203 384870 424156 470971 524296 580953 636085
57663 636085 683987 719234 737752 737390 718322 683387 637558 586262 533949 484018 439056 400185
57651 400185 366672 337236 311773 291172 275687 264289 255406 247597 239873 232326 226325 223066 221925
57638 221925 221049 219452 217641 216332 215649 215575 216040 216352 215613 214014 212742 212302 211860 210650 209120 208157 207939
57621 207939 208050 208076 207646 206459 204771 203395 202843 202791 202582 201818 200407 198531 196707 195324 194067 192335
57605 192335 190201 188343 187057 186104 185463 185348 185428 185008 184143 183640 183743 183757 183207 182380 181346 179576 177026
57588A77026k483j984k197k929k811j581o39r78j883k094j336k74K31k64j320
57573A54484j803j223o00j125k299k549j425j6O89O27r4j431k668k732j627n48
57557A35660k68l66l18k72l77l12P0L85M11M32O26P79Q55J031J022K24j110j737
57539A36735r48M62J301J383J211R11J88q71j652j774j572j719k402l037k847
57524A25369j746l59P70J598K046J767R10N03J266K488K886K306J706J615J627
57509A44752J408J313J755K547L154L191K642J915J552J553J214J40j012j394
57495A64730j171j141j541k025k485k974l017k101o89J15n3o05j056j363j347
57480A43277p26J91Q04J186J791K315J924P32q3O6M79M09M3j70k56l37k39N9K42
$$ plain form
57588 177026 174543 172559 170362 167433 164622 163041 162402 161424 159541 157447 156111 155837 156068 155804 154484
57573 154484 152681 151458 150858 149733 147434 144885 143460 143444 144133 144760 144666 143235 140567 137835 136208 135660
57557 135660 135392 135026 134708 134436 134059 133747 133817 134202 134613 135045 135671 136450 137305 138336 139358 139582 138472 136735
57539 136735 135787 136249 137550 138933 140144 141055 141243 140372 138720 136946 135374 133655 131253 128216 125369
57524 125369 123623 123264 124034 125632 127678 129445 130355 130858 132124 134612 137498 139804 141510 143125 144752
57509 144752 146160 147473 149228 151775 154929 158120 160762 162677 164229 165782 166996 167136 166124 164730
57495 164730 163559 162418 160877 158852 156367 153393 150376 148275 147586 147701 147648 147043 145987 144624 143277
57480 143277 142551 142742 143546 144732 146523 148838 150762 151494 151411 151477 151956 152365 152408 152238 151982 151645 151406 151465 151707
57461A51707K30L25N84P28P89J129J607J600J057O88Q05Q48M37O3K04N44N31J67
57443A64043k41n39n84k28K90M18J18o2Q9J52k0Q6P37J394J540J346J095O45O
57424A70285k65J66P95J017R57R80Q86L09m93r00p66l92R8P50J333J394Q43J12
57406A77109k96k07K12O95J142J604K020K101J722J218R54Q08M85J45J27K76K14
57389A90329J29N67J465K178K441K489K302J616Q53R80K117L162L190K418J496
57374B17732O88J65K13O38O88J57j56M04J390J965J952J652J308J207J687K470
57358B34160K645J898J153J369K260K884K932K766K574K309K082K066K131K086
57344B65315K024K057K070K079K403L095L583L322K467J567J025J154K140L534
$$ plain form
57461 151707 151937 152262 152846 153574 154363 155492 157099 158699 159756 160444 161249 162097 162534 162597 162801 163345 163876 164043
57443 164043 163802 163263 162679 162451 162741 163159 163277 163215 163304 163456 163436 163522 164259 165653 167193 168539 169634 170279 170285
57424 170285 170020 170186 170981 171998 172955 173935 174821 175130 174637 173737 172971 172579 172677 173427 174760 176154 176997 177109
57406 177109 176813 176606 176818 177513 178655 180259 182279 184380 186102 187320 188274 189082 189567 189712 189839 190115 190329
57389 190329 190458 191025 192490 194668 197109 199598 201900 203516 204369 205349 207466 210628 213818 216236 217732
57374 217732 218420 218585 218798 219436 220124 220281 220125 220529 221919 223884 225836 227488 228796 230003 231690 234160
57358 234160 236805 238703 239856 241225 243485 246369 249301 252067 254641 256950 259032 261098 263229 265315
57344 265315 267339 269396 271466 273545 275948 279043 282626 285948 288415 289982 291007 292161 294301 297835
57330B97835M307L917K857J839J068O76J108K322L378L543L298L467L875L773
57316C37263L175K824L046L431L580L489L226K905K850L301M014M550M833N041
57302C87528N273N593O055O348N939M998M592N357O514O885O409N871N647N618
57288D68627N943O889P972Q308P823P314P275P441P536P714Q053Q290Q311Q449
57274E75945R015R896J0758J1353J1595J1624J1782J2333J3153J3938J4551J4965
57262G20908J5137J5196J5504J6208J6905J7130J6922J6636J6441J6363J6471
57251H99821J6667J6634J6342J6331J7008J8021J8706J8842J8554J7923J7190
57240A092039J6882J7121J7224J6623J5778J5461J5530J5286J4740J4620J5179
$$ plain form
57330 297835 302142 306059 308916 310755 311823 312499 313607 315929 319307 322850 326148 329615 333490 337263
57316 337263 340438 343262 346308 349739 353319 356808 360034 362939 365789 369090 373104 377654 382487 387528
57302 387528 392801 398394 404449 410797 416736 421734 426326 431683 438197 445082 451491 457362 463009 468627
57288 468627 474570 481459 489431 497739 505562 512876 520151 527592 535128 542842 550895 559185 567496 575945
57274 575945 584960 594856 605614 616967 628562 640186 651968 664301 677454 691392 705943 720908
57262 720908 736045 751241 766745 782953 799858 816988 833910 850546 866987 883350 899821
57251 899821 916488 933122 949464 965795 982803 1000824 1019530 1038372 1056926 1074849 1092039
57240 1092039 1108921 1126042 1143266 1159889 1175667 1191128 1206658 1221944 1236684 1251304 1266483
57229A266483J5932J6592J7461J8716K0003K0985K1789K2730K3888K5057K5897
57218A495533K6226K6351K6854K7809K8629K8988K9337L0055L0715L0880L1002
57207A812379L1642L2363L2464L2304L2762L3644L3908L3379L2985L3191L3424
57196B174445L3239L2900L2545L1908L1218L1316L2362L3441L3928L4313L5095
57185B536710L5787L5739L5176L4674L4241L3682L3334L3680L4501L5130L5296
57174B917950L5234L5115L4921L4672L4463L4329L4320L4453L4527L4337L4194
57163C298515L4676L5697L6380L6263L6053L6682L8076L9351L9862L9518L8508
57152C709581L7197L6048L5115L3937L2445L1533L1986L3113L3265L1672K9018
$$ plain form
57229 1266483 1282415 1299007 1316468 1335184 1355187 1376172 1397961 1420691 1444579 1469636 1495533
57218 1495533 1521759 1548110 1574964 1602773 1631402 1660390 1689727 1719782 1750497 1781377 1812379
57207 1812379 1844021 1876384 1908848 1941152 1973914 2007558 2041466 2074845 2107830 2141021 2174445
57196 2174445 2207684 2240584 2273129 2305037 2336255 2367571 2399933 2433374 2467302 2501615 2536710
57185 2536710 2572497 2608236 2643412 2678086 2712327 2746009 2779343 2813023 2847524 2882654 2917950
57174 2917950 2953184 2988299 3023220 3057892 3092355 3126684 3161004 3195457 3229984 3264321 3298515
57163 3298515 3333191 3368888 3405268 3441531 3477584 3514266 3552342 3591693 3631555 3671073 3709581
57152 3709581 3746778 3782826 3817941 3851878 3884323 3915856 3947842 3980955 4014220 4045892 4074910
57141D074910K6171K3155J9708J6141J3118J0878R301Q562R191J1365J4509J7919
57129D254928K1597K6112L1641L7507M2835M7310N1054N3953N5659N6073N5378
57118D734047N3729N1544N0186N1596N6766O5113P5730Q8723J04793J24025J45832
57107E602084J69955J96862K27494K63340L06844L61190M29726N16040O24264
57098H697799P58484R21829J116700J345394J609162J906419K232878K583484
57090B1172149K952765L332721L710915M069297M381795M613958M732611M722577
57082E3688788M591351M349756L987236L473640K789957J954074J014654K6874
57074G5876330r59130j892649k721248l404267l925250m287901m502832m580995
$$ plain form
57141 4074910 4101081 4124236 4143944 4160085 4173203 4184081 4193382 4201944 4211135 4222500 4237009 4254928
57129 4254928 4276525 4302637 4334278 4371785 4414620 4461930 4512984 4566937 4622596 4678669 4734047
57118 4734047 4787776 4839320 4889506 4941102 4997868 5062981 5138711 5227434 5332227 5456252 5602084
57107 5602084 5772039 5968901 6196395 6459735 6766579 7127769 7557495 8073535 8697799
57098 8697799 9456283 10378112 11494812 12840206 14449368 16355787 18588665 21172149
57090 21172149 24124914 27457635 31168550 35237847 39619642 44233600 48966211 53688788
57082 53688788 58280139 62629895 66617131 70090771 72880728 74834802 75849456 75876330
57074 75876330 74917200 73024551 70303303 66899036 62973786 58685885 54183053 49602058
57066D9602058m536187m387572m157931l870854l548861l211277k872534k542952
57058B0473890k230786j942821j683581j455220j257947j089729r46387q23464
57050I043955p18084o28552n52934m89102m35645l91592l55526l25942l01908
57041D844670k82344k65232k48695k32606k17911k04650j91694j78249j64500
57032B858789j50832j37203j23138j07710q9911o9604m7556k4178R4K2057L5281
57021B166089L4902K2124J794k3505n3843q6693j14951j31965j36565j31974j21821
57010A423592j08682r4740q1649p0062o0254n2635m6949m1957l6823l2037k8250
56999G69554k5101k2079j9591j8219j7618j6985j6036j4765j2965j0660q358o196
$$ plain form
57066 49602058 45065871 40678299 36520368 32649514 29100653 25889376 23016842 20473890
57058 20473890 18243104 16300283 14616702 13161482 11903535 10813806 9867419 9043955
57050 9043955 8325871 7697319 7144385 6655283 6219638 5828046 5472520 5146578 4844670
57041 4844670 4562326 4297094 4048399 3815793 3597882 3393232 3201538 3023289 2858789
57032 2858789 2707957 2570754 2447616 2339906 2249995 2180391 2132835 2108657 2108751 2130808 2166089
57021 2166089 2200991 2223115 2224909 2201404 2147561 2060868 1945917 1813952 1677387 1545413 1423592
57010 1423592 1314910 1220170 1138521 1068459 1008205 955570 908621 866664 829841 797804 769554
56999 769554 744453 722374 702783 684564 666946 649961 633925 619160 606195 595535 587177 580981
56987E80981l573k64K870N008O306O907O009L019j118m972q429j2231j6113j8743
56973E45657j9461j8910j7871j6416j4330j1658q610n515k853q40J053L647P139
56960D41032J1026J4733J7852J9815J9881J7626J3184P163N27n665j0807j4948
56948E31419j8250k0471k1317k0920j9578j7240j3786r694n857k654M28M034Q073
56935C94187J1821J4971J8245K2498K7022K9347K7293K1029J2521L367n960j4930
56923E61411k2254k6897k8965k9186k8122k6240k4034k1602j8648j5307j2413
56912C07743j0585r559q763p989p129n958m589l625l314l103k432j511q40m18
56898B37928K05J397L231N315O794P142P086Q027J0371J3224J5857J8390K0644
$$ plain form
56987 580981 577408 577144 580014 585022 591328 598235 604244 607263 606145 601173 592744 580513 564400 545657
56973 545657 526196 507286 489415 472999 458669 447011 438401 432886 430033 429193 430246 433893 441032
56960 441032 452058 466791 484643 504458 524339 541965 555149 562312 562839 557174 546367 531419
56948 531419 513169 492698 471381 450461 430883 413643 399857 390163 384306 381652 382080 386114 394187
56935 394187 406008 420979 439224 461722 488744 518091 545384 566413 578934 582301 576341 561411
56923 561411 539157 512260 483295 454109 425987 399747 375713 354111 335463 320156 307743
56912 307743 297158 287599 278836 270847 263718 257760 253171 249546 246232 243129 240697 239186 238346 237928
56898 237928 238133 239530 242761 248076 254870 262012 269098 277125 287496 300720 316577 334967 355611
56885C55611K1520K0240J7216J3077P819J750l826p848j0664j2897j3955j2855
56873C75188r941o608l604o04K783O495J0371J4294J8170K2255K7112L2780L8406
56860E27097M3057M6135M6537M2481L3219K0367O603o363j7839k7098l3396l6511
56848F44289l6372l2760k6305j8848j1800m838K723J0273J7049K3939L2475M2542
56836F42367N2804O2664P1805P8066P7964O9788N4666L4603J1231j3163l5236
56825A107559n2218o3056o7816o7171o2745n6511m9250m0637l0998k1709j3454
56814E81994n434L118J1851K0404K9299L8772M7484N3189N4131M9450L9120K4240
56802I47618O820j1208k8329m2757n2483n6674n6385n3400m8921m3557l7734l1502
$$ plain form
56885 355611 377131 397371 414587 427664 435483 437233 433407 425559 414895 401998 388043 375188
56873 375188 365247 358639 355035 354431 357214 363709 374080 388374 406544 428799 455911 488691 527097
56860 527097 570154 616289 662826 705307 738526 758893 765496 759133 741294 714196 680800 644289
56848 644289 607917 575157 548852 530004 518204 513366 516089 526362 543411 567350 599825 642367
56836 642367 695171 757835 829640 907706 985670 1055458 1110124 1144727 1155958 1142795 1107559
56825 1107559 1055341 992285 924469 857298 794553 738042 688792 648155 617157 595448 581994
56814 581994 576560 579678 591529 611933 641232 680004 727488 780677 834808 884258 923378 947618
56802 947618 954438 943230 914901 872144 819661 762987 706602 653202 604281 560724 522990 491488
56790D91488k4648j7442j0784n194k79M589R696J5225K1155K6478K9315K8354
56778E67953K3662J5891N684n739j6373k4672l0473l4197l5783l5072l2600k9324
56766C68957k5879k2618j9911j7824j5881j3617j1107q664o500m996m689n540
56754B11731o553o691n798m423l119k274k133k488k696k357j747j310j073q21
56740A68248n18k25K1J33J8j50j13k4k71q51j310j400j223p82m3N98O12J48j55
56721A62713j25j5L24J198K064J979J260J230K005K074P44n23l29N99Q43O76J331
56704A78048K641L115K147O65m13j098j514j340m39O25J127Q32O6o21q59p99r07
56687A81276j251j337r25n00n75j029j521j980k183j556j13J015R32L50N74J498
$$ plain form
56790 491488 466840 449398 438614 433420 433141 437730 447426 462651 483806 510284 539599 567953
56778 567953 591615 607506 613190 607451 591078 566406 535933 501736 465953 430881 398281 368957
56766 368957 343078 320460 300549 282725 266844 253227 242120 233456 226956 221960 217271 211731
56754 211731 205178 198487 192689 188266 185147 182873 180740 178252 175556 173199 171452 170142 169069 168248
56740 168248 167730 167505 167526 167659 167677 167527 167414 167390 167119 166268 164958 163558 162335 161553 161510 162108 162720 162868 162713
56721 162713 162588 162573 162897 164095 166159 168138 169398 170628 172633 174707 175451 174928 174599 175198 176041 176717 178048
56704 178048 180689 183804 185951 186616 186203 185105 183591 182251 181812 182437 183564 184396 184462 183841 182982 182183 181276
56687 181276 180025 178688 177763 177263 176688 175659 174138 172158 169975 168419 168306 169321 170253 170603 171177 172675
56671A72675J778R25j0j7N63P76L52k23m34j52L66O49M32L1N7O38J206J230Q88
56652A81730Q27J437K463L289L450K912J975J061O33J001J920K517K177J420J370
56637B10182K246L001K724J792J246J480K045K310J898P34p89j897k140j837j503
56622B21492j118l76M98Q01J64j022k085k675k862k855k716k373j854j410j270
56607B00339j374j535j709j894j909j632j267j010o93l03m22j429k541k618j814
56592A78189j323j430j069L19J703J948J366J021J261J720K101K132J383m3j110
56577A88168r15J35R12R68P69Q59J368K048K367J874R11N62J442K962M200M995
56561B13625N749O629P539Q426R076R099Q500P751O939N540L519J887J399J466
$$ plain form
56671 172675 174453 175378 175368 175351 175914 176690 177042 176819 176385 176233 176599 177248 177680 177711 177768 178406 179612 180842 181730
56652 181730 182557 183994 186457 189746 193196 196108 198083 199144 199777 200778 202698 205215 207392 208812 210182
56637 210182 212428 215429 218153 219945 221191 222671 224716 227026 228924 229658 228869 226972 224832 222995 221492
56622 221492 220374 219998 220496 221297 221461 220439 218354 215679 212817 209962 207246 204873 203019 201609 200339
56607 200339 198965 197430 195721 193827 191918 190286 189019 188009 187316 187013 186591 185162 182621 180003 178189
56592 178189 176866 175436 174367 174686 176389 178337 179703 180724 181985 183705 185806 187938 189321 189278 188168
56577 188168 187253 187388 188300 189268 190037 190896 192264 194312 196679 198553 199464 200026 201468 204430 208630 213625
56561 213625 219374 226003 233542 241968 251044 260143 268643 276394 283333 288873 292392 294279 295678 297144
56547B97144J122M63J83K49N3m89r22j130j432j968k638l467m422n092n141m754
56531B67759m168l222j959j102j252j980k441k460k372k259k027j832j709j319
56517B37657p41q50k059l261l167k119j517j763j991j619j021o49n50q18j577
56502B13955k436k726k339j750j252p97m75m54n45m66l78o09r91j075p55j79O12
56485A97340J386J552R75M48O18R87Q11M71Q46J785K270J883J114M21j07l39k33
56468B12228j55k68L5J214K560L073K896K807K726J962O71l04p83j261j657j392
56452B24352o06j27j55j35J41L56N57J019J353R16P2j92J31J18l85n22j7L49J40
56433B27365m0L47J027J544J660J020n04j977k084q97Q5j2m86l81K72R32J260
$$ plain form
56547 297144 298266 298729 298912 299161 299214 298725 297803 296673 295241 293273 290635 287168 282746 277654 272513 267759
56531 267759 263591 260369 258410 257308 256056 254076 251635 249175 246803 244544 242517 240685 238976 237657
56517 237657 236916 236066 234007 230746 227579 225460 223943 222180 220189 218570 217549 216900 216350 215532 213955
56502 213955 211519 208793 206454 204704 203452 202655 202180 201726 201181 200715 200337 199728 198737 197662 196907 196728 197340
56485 197340 198726 200278 201253 201701 202319 203306 204117 204588 205434 207219 209489 211372 212486 212907 212800 212461 212228
56468 212228 212073 211805 211840 213054 215614 218687 221583 224390 227116 229078 229749 229445 228662 227401 225744 224352
56452 224352 223746 223619 223464 223329 223470 223826 224383 225402 226755 227671 227743 227551 227682 227800 227415 226893 226876 227225 227365
56433 227365 227325 227672 228699 230243 231903 232923 232419 230442 228358 227461 227546 227534 227048 226667 226939 227871 229131
56416B29131J052K84m81n54o1L03M30P66J221J234Q98R04J262J257O91J07k77
56399B38167p02r67n89J43N56Q89J814K825K765J896J664K249K331J635J521K441
56383B58638K871J832N90O04J377J633J300R66O15J79K25R34J344P44j02k54j22
56366B73374n07j060q77k3P04R98J056Q92N29L43N41P24O10N45P87R99R70J035
56348B81640J219R36J36j89N91J703K114J869J515J072L90k28m60l91lR40K014
56331B94868K199J444J030J634K248J864J084R95J451J649J547J576J641J417
56317C16647J019N81j38r77j096l04L48J51r2N09J387J574J326J413J645J442
56301C25435J219J794K954L800M094M127L818L046K379K314K210J178l25r68l56
$$ plain form
56416 229131 230183 230467 229986 229432 229371 229674 230104 230870 232091 233325 234223 235127 236389 237646 238337 238444 238167
56399 238167 237465 236498 235909 236052 236608 237497 239311 242136 244901 246797 248461 250710 253041 254676 256197 258638
56383 258638 261509 263341 263931 264535 265912 267545 268845 269811 270426 270605 270830 271764 273108 273852 273750 273496 273374
56366 273374 272867 271807 270930 270907 271611 272609 273665 274557 275086 275429 275970 276694 277304 277849 278636 279635 280605 281640
56348 281640 282859 283795 283931 283742 284333 286036 288150 290019 291534 292606 292996 292768 292308 291917 291914 292854 294868
56331 294868 297067 298511 299541 301175 303423 305287 306371 307366 308817 310466 312013 313589 315230 316647
56317 316647 317666 318247 318109 317132 316036 315732 316080 316231 316139 316648 318035 319609 320935 322348 323993 325435
56301 325435 326654 328448 331402 335202 339296 343423 347241 350287 352666 354980 357190 358368 358043 357075 356719
56286C56719O78J410J852K145K272K337K535K906L418L984M187L587K602K316
56272C92948K961L530L412L408M280N375N659N361N470O177O861P203P483Q088
56258D68216R295J1117J2990J4150J4651J5314J6475J7833J9574K2374K5900K8824
56246F76713L0816L2931L5400L6920L7016L7140L8111L8330L6168L2491K8992
56235A061028K5522K0946J5496J0211N063n26o062j0685j4692j8692k2019k3718
56223A041872k4390k5374k6670k7329k7219k6864k6165k4802k3319k2307k1216
56212G66217j9402j7653j7085j7282j6993j6000j4860j3579j1978j0633r895q949
56200E91908p212n666n258n147m269l300l218l148j893m55n96j775j961q65P5
$$ plain form
56286 356719 357397 358807 360659 362804 365076 367413 369948 372854 376272 380256 384443 388030 390632 392948
56272 392948 395909 399439 402851 406259 410539 415914 421573 426934 432404 438581 445442 452645 460128 468216
56258 468216 477511 488628 501618 515768 530419 545733 562208 580041 599615 621989 647889 676713
56246 676713 707529 740460 775860 812780 849796 886936 925047 963377 999545 1032036 1061028
56235 1061028 1086550 1107496 1122992 1133203 1138266 1137740 1131678 1120993 1106301 1087609 1065590 1041872
56223 1041872 1017482 992108 965438 938109 910890 884026 857861 833059 809740 787433 766217
56212 766217 746815 729162 712077 694795 677802 661802 646942 633363 621385 610752 600857 591908
56200 591908 584696 579030 573772 568625 564356 561056 557838 554690 552797 552342 551746 549971 548010 547145 547220
56185E47220L55O85J022P66N22J356K626K748J943J921L035L998M273M558M950
56170E81978M739M048L771L963M101M546N826O968O675N809O396Q453J0073J0470
56156F67816J0646J1156J1501J1849J3168J5553J8236K1127K4593K8139L1346
56145H65130L5453M1832M9483N6575O3839P3707Q6330R9273J10880J21040J28609
56134A732151J31073J27371J18755J06801R2894P9441O8798O0732N3378M6436
56124B617830M0682L4680K5555J3398J692p331j4820k2356k9985l8046m7967o0166
56112B513166p3370q6671r9807j11085j17778j19228j16991j11643j02322q9841
56102A484430p7106o5671n4691m4013l5236k8817k3121j7375j2812r974p622n200
$$ plain form
56185 547220 547575 548260 549282 550048 550570 551926 554552 557300 559243 561164 564199 568197 572470 577028 581978
56170 581978 586717 590765 594536 598499 602600 607146 612972 619940 626615 632424 638820 647273 657346 667816
56156 667816 678462 689618 701119 712968 726136 741689 759925 781052 805645 833784 865130
56145 865130 900583 942415 991898 1048473 1112312 1186019 1272349 1371622 1482502 1603542 1732151
56134 1732151 1863224 1990595 2109350 2216151 2309045 2388486 2457284 2518016 2571394 2617830
56124 2617830 2658512 2693192 2718747 2732145 2733837 2726506 2711686 2689330 2659345 2621299 2573332 2513166
56112 2513166 2439796 2353125 2253318 2142233 2024455 1905227 1788236 1676593 1574271 1484430
56102 1484430 1407324 1341653 1286962 1242949 1207713 1178896 1155775 1138400 1125588 1115614 1107992 1102792
56090A102792l668l037j836R5J201J265K008L717M396L272K255K802M096N280
56076A124638O697Q085Q399Q224R397J1568J2306J1304J1082J2677J4098J4146
56064A252621J4244J5323J6300J6808J8029J9744K0041J8962J8825J9952J9928
56053A450777J8226J7429J8519J9174J8240J7672J8390J8543J7718J8484K1682
56042A654854K4446K5042K5463K7026K7862K7122K7333K9993L2913L4473L6278
56031A972805L9226M1232M1462M2454M5397M7753M8096M8815N1266N3067N3047
56020B484620N4005N7432O0432O1131O2206O5670O9146P0851P3270P8211Q3197
56009C220171Q6426R0238R6006J00916J03595J07364J14044J20225J23919J28801
$$ plain form
56090 1102792 1099124 1096087 1094251 1094346 1095547 1096812 1098820 1102537 1106933 1110205 1112460 1115262 1119358 1124638
56076 1124638 1131335 1139420 1147819 1156043 1165440 1177008 1189314 1200618 1211700 1224377 1238475 1252621
56064 1252621 1266865 1282188 1298488 1315296 1333325 1353069 1373110 1392072 1410897 1430849 1450777
56053 1450777 1469003 1486432 1504951 1524125 1542365 1560037 1578427 1596970 1614688 1633172 1654854
56042 1654854 1679300 1704342 1729805 1756831 1784693 1811815 1839148 1869141 1902054 1936527 1972805
56031 1972805 2012031 2053263 2094725 2137179 2182576 2230329 2278425 2327240 2378506 2431573 2484620
56020 2484620 2538625 2596057 2656489 2717620 2779826 2845496 2914642 2985493 3058763 3136974 3220171
56009 3220171 3306597 3396835 3492841 3593757 3697352 3804716 3918760 4038985 4162904 4291705
55999D291705J37361J46043J52035J58629J68682J79074J87072J95859K08177
55990E824637K21001K32287K46217K65644K86271L04725L25269L51810L80671
55981H438532M08518M39835M78767N21256N63426O10124O66846P31141Q00638
55972A3659083Q81257R78554J089759J213781J359899J536923J744276J984507
55964B4448039K273984K630338L061844L581988M221732N013317N973955P116682
55956E8321879Q459523J0010683J1770466J3776585J6136943J8996671K2460602
55949A59933352K6477300L0644614L4040734L5378773L3583688K8366038K0252324
55942C68676823J0138133j025909j2126428k1789715k8753810l2460165l3233584
$$ plain form
55999 4291705 4429066 4575109 4727144 4885773 5054455 5233529 5420601 5616460 5824637
55990 5824637 6045638 6277925 6524142 6789786 7076057 7380782 7706051 8057861 8438532
55981 8438532 8847050 9286885 9765652 10286908 10850334 11460458 12127304 12858445 13659083
55972 13659083 14540340 15518894 16608653 17822434 19182333 20719256 22463532 24448039
55964 24448039 26722023 29352361 32414205 35996193 40217925 45231242 51205197 58321879
55956 58321879 66781402 76792085 88562551 102339136 118476079 137472750 159933352
55949 159933352 186410652 217055266 251096000 286474773 320058461 348424499 368676823
55942 368676823 378814956 377789047 365662619 343872904 315119094 282658929 249425345
55935B49425345l1899756k9295185k6063568k2673567j9438372j6513848j3948763
55928H9592286j1752480r909331q369945p076987n996438n106008m370904l754313
55920C3255880l238320k813742k460625k157007j896299j678724j494699j331885
55912A6184579j189775j072235r73048q82344q00277p31524o72509o16107n63288
55903H683472n18867m80810m44075m10049l82398l58189l32349l06484k84619
55894E165632k64727k42934k21697k05383j91842j76506j61037j49806j41282
55885C410418j30830j18948j09260j01106r1455q1747p5888p3428p1096o9029
55875B487631o9494p1482p2205p2061p2809p3028p0480o6782o4678o3051n9516
$$ plain form
55935 249425345 217525589 188230404 162166836 139493269 120054897 103541049 89592286
55928 89592286 77839806 67930475 59560530 52483543 46487105 41381097 37010193 33255880
55920 33255880 30017560 27203818 24743193 22586186 20689887 19011163 17516464 16184579
55912 16184579 14994804 13922569 12949521 12067177 11266900 10535376 9862867 9246760 8683472
55903 8683472 8164605 7683795 7239720 6829671 6447273 6089084 5756735 5450251 5165632
55894 5165632 4900905 4657971 4436274 4230891 4039049 3862543 3701506 3551700 3410418
55885 3410418 3279588 3160640 3051380 2950274 2858819 2777072 2701184 2627756 2556660 2487631
55875 2487631 2418137 2346655 2274450 2202389 2129580 2056552 1986072 1919290 1854612 1791561 1732045
55864A732045n5362n2883n0413m5360l9707l7087l6527l4536l1417l0085l0249
55853A288419k9190k7032k6146k6431k5992k5382k6462k8074k7497k5308k4369
55842I96536k4793k4244k2450k1217k0618j9167j7306j6837j7403j7063j5750
55831G79688j4897j4278j2683j0841j0415j0816j0286r253r383j0303j0412j0029
55819F46092j0443j0990j0312r452j0229j1530j0823q570p531q187q401p238n805
55806E26581m555k917j354r00r19J8J543K332K719L757M563L598J700Q97R45R8
55790E38106j515k415k859m140n529n238l888l680m625m921m674n713p914r253
55776D71742r367r764j0409r498o771l866j182K288N865P244O129M578L254N69
$$ plain form
55864 1732045 1676683 1623800 1573387 1528027 1488320 1451233 1414706 1380170 1348753 1318668 1288419
55853 1288419 1259229 1232197 1206051 1179620 1153628 1128246 1101784 1073710 1046213 1020905 996536
55842 996536 971743 947499 925049 903832 883214 864047 846741 829904 812501 795438 779688
55831 779688 764791 750513 737830 726989 716574 705758 695472 686219 676836 666533 656121 646092
55819 646092 635649 624659 614347 604895 594666 583136 572313 563743 556212 548025 539624 532386 526581
55806 526581 522026 519109 517755 516855 515936 515954 517497 519829 522548 526305 530868 534466 536166 537063 538008 538106
55790 538106 536591 534176 531317 527177 521648 516410 512522 508842 504217 499296 494622 488909 480995 471742
55776 471742 462375 452611 442202 432704 425933 422067 420885 423173 429038 436282 442411 446989 450243 450812
55762D50812l736p414r011r519r783r071p215n543m691l861l089l722n676o796
55748C61685o071n165n583o503o675o429o476o438n846n125m583l785k689k020
55734B88297j903j568r26r29j798k508k553k709l471m227m560m842n080m635l596
55719B42992l005l179l225k618j865j230k24J206K394L171M046M945N143M617
55705B53168M073L501K201L37j082j947l171m944o452p395q145q332p133n102
55691B09577l855l629l063j667o12o16r29q42n42QJ164K274K171J346J657L337
55675B05779M409L711K420J692R28m98j677j664j026p63r21j187j579j750j012
55660B06862K71P31R5k98K87R39J000J235K100K594J986J194J181J402R53O9o74
$$ plain form
55762 450812 447076 439662 430651 421132 411349 402278 395063 389520 384829 380968 377879 374157 368481 361685
55748 361685 355614 350449 344866 338363 331688 325259 318783 312345 306499 301374 296791 293006 290317 288297
55734 288297 286394 284826 283900 282971 281173 278665 276112 273403 269932 265705 261145 256303 251223 246588 242992
55719 242992 239987 236808 233583 230965 229100 227870 227646 228852 231246 234417 238463 243408 248551 253168
55705 253168 257241 260742 262943 263280 262198 260251 257080 252136 245684 238289 230144 221812 214679 209577
55691 209577 205722 202093 199030 197363 196751 196135 195206 194364 193822 193830 194994 197268 199439 200785 202442 205779
55675 205779 210188 213899 216319 218011 218939 218441 216764 215100 214074 213311 212390 211203 209624 207874 206862
55660 206862 207133 207864 207959 207661 207948 208887 209887 211122 213222 215816 217802 218996 220177 221579 222532 222601 221927
55643B21927j359j997k017j473j458k439l416l718m141n233n938n276m097l723
55629A75642l939l699k900k162j615j106q92j073j081o19l47q33j646k164k374
55614A49192k222j377l68n32j890k535j304L11L59p61j301q99n51o37o77o66j066
55597A33076j664j737j208o21k37l2k49j019j794j952j563r32k1R67J271O77K10
55580A23172P09J440J211K22l72k32Jl6m9J72N04Q62J185J373J615K306L185L270
55562A40538K191Q04p2o86j380j652j126n40o96j246j534j824k521l011k538j587
55546A23120j066p09L41J832K663K615K425K386K114J594J268J079N07m42j189
55531A38538j479j477j144m50j9n21j512j855j285o84p17j089j276j203j031q58
$$ plain form
55643 221927 220568 218571 216554 215081 213623 211184 207768 204050 199909 194676 188738 183462 179365 175642
55629 175642 171703 168004 165104 162942 161327 160221 159329 158256 157175 156556 156209 155376 153730 151566 149192
55614 149192 146970 145593 145225 144693 142803 140268 138964 139275 139634 138873 137572 136673 136122 135485 134808 134142 133076
55597 133076 131412 129675 128467 127846 127609 127577 127328 126309 124515 122563 121000 120068 120047 121014 122285 122962 123172
55580 123172 123881 125321 126532 126754 126382 126150 126151 126115 126066 126238 126742 127604 128789 130162 131777 134083 137268 140538
55562 140538 142729 143533 143461 142775 141395 139743 138617 138077 137381 136135 134601 132777 130256 127245 124707 123120
55546 123120 122054 121345 121686 123518 126181 128796 131221 133607 135721 137315 138583 139662 140169 139727 138538
55531 138538 137059 135582 134438 133988 133969 133448 131936 130081 128796 128112 127395 126306 125030 123827 122796 121938
55515A21938p99q84r26p99o98p86q38o91o27q39r40n74j14q4k93k31O3J93R9o5
55495A12105l36n98l71L73P40P4r24j157o75l13k71j65p1k89m00K34J150J221
55477A10327M12j16J76N02J97k90l52k84o71j344j565j044k65J07o0k72p4K79
55459A05663R0o87j158o52L51R27R13P39M94qn44o33l06nJ67M34P39P53M92K85
55439A08054K16J17jrn8l00m44j67K56L24J59K68N94N37m6o06o94m69k40l9K18
55418A07670N41Q68J021P70J56l84n41n43o83p44l79K14M79K88L5M8K40L30J42
55399A09528j91k50J73N61J25j047j920j772r61j54M43P33M83n4n8O86J301J129
55381A08755P04O86P81N53M79J066J640J196j30j431k366k982k898j864p34n25
$$ plain form
55515 121938 121139 120255 119329 118530 117832 117046 116208 115517 114890 114051 113111 112537 112423 112339 112046 111815 111878 112071 112170 112105
55495 112105 111769 111171 110800 111173 111913 111987 111063 109906 109231 108918 108647 108482 108411 108122 107722 107956 109106 110327
55477 110327 110739 110623 110799 111301 111498 111208 110856 110572 109901 108557 106992 105948 105683 105790 105730 105458 105384 105663
55459 105663 105753 105066 103908 103256 103607 104534 105447 106186 106680 106672 106128 105495 105189 105184 105351 105785 106524 107277 107769 108054
55439 108054 108270 108387 108386 108377 108319 108019 107575 107408 107664 107988 108147 108415 109009 109546 109500 108894 108200 107731 107491 107452 107670
55418 107670 108211 109079 110100 110870 111026 110642 110101 109558 108875 108131 107752 107966 108445 108733 108768 108816 109056 109386 109528
55399 109528 109337 109087 109260 109821 109946 108899 106979 105207 104246 104092 104535 105268 105751 105697 105639 106325 107626 108755
55381 108755 109459 110145 110926 111479 111958 113024 114664 115860 115730 114299 111933 108951 106053 104189 103455 102930
55365A02930r23q85m40n17j213j538r81j23L27K34k23o18l28O70J348R30J81L30
55347I9161J179J530J108O79N02J34l86n26l95n46p37l04L77K96m00n73j25j00
55329A00874n60k16J291K460K092R37K80J99O0k61o12j091j593j577q70l6M63
55312A01840P08O35o8j037j229l63N83P50L89kl69n87k19N78R22M54j82m67n66
55293A01770m40L53J447J629O57j64M4N22L99Q7J19J6n52p35NN84Jq04m40M86
55273A04984L43p26r49K17J313J197M57J11J51N3k49m72m57j98K19M99L74K9j49
55254A06747j17k5K72R39J563J478P12j1j67J06M21M76O2p26j323j287r18q29
55236A07373r44o10K65Q60N18l33p52m52k7p1l95l61K05P66Q00M59J58q0m28o49
$$ plain form
55365 102930 102007 101122 100682 100165 98952 97414 96433 96310 96637 96871 96648 96030 95702 96372 97720 98650 98831 99161
55347 99161 100340 101870 102978 103657 104159 104293 103907 103381 102986 102440 101703 101399 101776 102072 101672 101099 100974 100874
55329 100874 100314 100098 101389 103849 105941 106878 107158 107357 107417 107156 106544 105453 103860 102283 101413 101377 101840
55312 101840 102548 103183 103115 102078 100849 100486 101069 101819 102208 102206 101837 101250 101031 101609 102531 102985 102803 102336 101770
55293 101770 101330 101683 103130 104759 105416 105252 105296 105818 106217 106304 106423 106439 105887 105152 105157 105741 105742 104938 104498 104984
55273 104984 105327 104601 103652 103869 105182 106379 106836 106947 107098 107151 106902 106430 105973 105775 105994 106493 106867 106896 106747
55254 106747 106630 106605 106877 107816 109379 110857 111569 111558 111391 111497 111918 112394 112456 111730 110407 109120 108202 107373
55236 107373 106429 105819 106084 106944 107462 107129 106377 105925 105898 105827 105432 105071 105276 106042 106842 107301 107459 107379 106951 106302
55216A06302m07j6p8l45J31J479K515K218R16l50r86r13k65M50N66J05j65j6k04
55197A10937j127j879j498l95L63N22M94L11j52m21N2Q30R72L65k87o36q90r85
55179A06576n53K54P78P37M48J59j08j54K26O88O37J47j23J44O50J156J621J773
55161A15056J214J34p35r00l95N82J658K081J334k1q21o85k03J70N67R29P30j46
55143A20549j050j462j549j554j334r29q17j112j075j34J110J591J142N24K36
55128A14136J5n05j163j515j304o05L23J189J763J912J570P72j97q10o81QO18
55111A15526O67L00M7J32K38K2l51m94m14m54o82p90o79o10n40K6J199K219K349
55092A17711J861J528J441J081L60j47p8K56L89K39n1l06l03N8M33K73m80j302
$$ plain form
55216 106302 105895 105879 105801 105456 105587 107066 109581 111799 112715 112365 111379 110466 110201 110651 111217 111322 111157 111141 110937
55197 110937 109810 107931 106433 106038 106401 106923 107417 107728 107576 107155 107207 108037 109009 109374 109087 108451 107561 106576
55179 106576 106023 106277 107055 107792 108240 108399 108291 108137 108363 109051 109688 109835 109712 109856 110506 111662 113283 115056
55161 115056 116270 116404 115669 114769 114374 114956 116614 118695 120029 120008 119187 118502 118299 118469 119036 119965 120695 120549
55143 120549 119499 118037 116488 114934 113600 112671 111854 110742 109667 109533 110643 112234 113376 113900 114136
55128 114136 114151 113646 112483 110968 109664 109059 109382 110571 112334 114246 115816 116588 116391 115581 114900 114908 115526
55111 115526 116193 116493 116540 116672 116910 116932 116581 116087 115673 115219 114537 113747 113068 112458 111918 111944 113143 115362 117711
55092 117711 119572 121100 122541 123622 123982 123835 123757 124013 124402 124641 124590 124284 123981 124039 124472 124745 124265 122963
55074A22963j712j640j147k98N22P08J02p01j070j001q05m90J03P53R73O87L87
55057A18334M40N85L76q6k28K17Q07R46N50M9j34P0M34N78K10n10r75p50j18L46
55037A21141N43P74J018R03M20J01K31M04J45m18p95p45m37k75n90j213j392o55
55019A19160L72O74L04K22O36O73M4k78K36N21l61j393r05R29K371K547K156J830
55001A29738J319N38P3K13L42r4q14j216j031k62R27J939K035J222K75k86o30
54984A34288q52n56L54J070P26n61j843k301j717m41P75J184P42K40M71J340K066
54967A34985K043J337N01O1J08K66J75j2J39O77J083R20L51j28k90l36m91o91
54949A40698o98n14m88q58j281j134l80L17M22J15j69k98k40J67P84J007O01J90
$$ plain form
55074 122963 121251 119611 118464 118166 118688 119396 119498 118797 117727 116726 115921 115431 115534 116287 117260 117947 118334
55057 118334 118774 119359 119735 119649 119421 119638 120445 121391 121941 121990 121856 121926 122360 122938 123148 122638 121663 120913 120795 121141
55037 121141 121684 122458 123476 124379 124799 124900 125131 125535 125680 125262 124467 123722 123285 123010 122420 121207 119815 119160
55019 119160 119532 120206 120510 120732 121368 122041 122085 121807 122043 122564 122203 120810 119905 120834 123205 125752 127908 129738
55001 129738 131057 131595 131668 131881 132223 132129 131315 130099 129068 128806 129733 131672 133707 134929 135204 134918 134288
54984 134288 133436 132880 133234 134304 135030 134469 132626 130325 128608 128167 128942 130126 130868 131108 131579 132919 134985
54967 134985 137028 138365 138866 138927 139035 139301 139476 139464 139603 140280 141363 142283 142634 142506 142216 141880 141389 140698
54949 140698 140000 139486 138998 138140 136859 135725 135345 135662 136084 136199 136030 135732 135492 135659 136443 137450 138051 138241
54931A38241L38O16L90R3O93K085L112L219L056L269L609L648L583L797M215M541
54915A78505M693M695M484M043L391K306N29j596l182l740l694l756m135m528
54901A78015m616m355m022l970m094l763k632j343q14j048j234r65n49k42P2L33
54885A44773K73J00L97J185J852K213K729L429L643L306L445M658N951N998M961
54870A88913M065L803L536K730J606N28o36k246m291o225p293p140o215n385m973
54855A60777m543l665k575j797j505j532j663j611j103l35Qm39j147j333r19m31
54839A36187k20j46j6N5k37r67j695j691o87O64J429J374R49M33k16o71k40J050
54821A35355K125K032R59k69j157j607j569j193r24r58r44n87j70q3k32l34l34
$$ plain form
54931 138241 138579 139195 139585 139678 140371 142456 145568 148787 151843 155112 158721 162369 165952 169749 173964 178505
54915 178505 183198 187893 192377 196420 199811 202117 202646 201050 197868 194128 190434 186678 182543 178015
54901 178015 173399 169044 165022 161052 156958 153195 150563 149220 148406 147358 146124 145159 144610 144368 144440 144773
54885 144773 145046 145146 145543 146728 148580 150793 153522 156951 160594 163900 167345 172003 177954 183952 188913
54870 188913 192978 196781 200317 203047 204653 205181 204545 202299 198008 191783 184490 177350 171135 165750 160777
54855 160777 156234 152569 149994 148197 146692 145160 143497 141886 140783 140448 140456 140017 138870 137537 136618 136187
54839 136187 135967 135821 135805 135860 135623 134656 132961 131270 130583 131247 132676 134050 134999 135432 135216 134545 134305 135355
54821 135355 137480 139512 140471 140202 139045 137438 135869 134676 133752 132794 131850 131263 131093 131010 130778 130444 130110
54804A30110j60M49J351J780J283M98L59Q29J056N79k11p04o68l07m9j22j86K97
54786A36184J153J449P51j79l66J67P36J020J151J246J411J821K235J981J007
54771A51767L49Q06J798K364K708L652M994N766N852O065O627O778O094N017L852
54756B14489K347O36m65o22o59j501l110m842o207o866o586n639m723m122l486
54741A68644k729k358k490k320j237O1L90l90j311j502q13M91J935K823K683J864
54725A63741J240J299J822K461L172M049N012N819O174N853M905L704K613J601
54711B13465L77j180k851m326n365n801n605n036m499m170l869l397k868k548
54697A62327k423k117j376n00j16m42r60j011n97l68p65j473j799j486r47o97
$$ plain form
54804 130110 129950 130399 131750 133530 134813 135311 135670 136499 137555 138134 137923 137219 136551 136244 136195 136073 135887 136184
54786 136184 137337 138786 139537 139358 138992 139159 139895 140915 142066 143312 144723 146544 148779 150760 151767
54771 151767 152116 152922 154720 157084 159792 163444 168438 174204 180056 186121 192748 199526 205620 210637 214489
54756 214489 216836 217472 217007 216385 215726 214225 211115 206273 200066 193200 186614 180975 176252 172130 168644
54741 168644 165915 163557 161067 158747 157510 157571 157961 157571 156260 154758 153945 154436 156371 159194 161877 163741
54725 163741 164981 166280 168102 170563 173735 177784 182796 188615 194789 200642 205547 209251 211864 213465
54711 213465 213842 212662 209811 205485 200120 194319 188714 183678 179179 175009 171140 167743 164875 162327
54697 162327 159904 157787 156411 155911 155795 155353 154393 153382 152785 152417 151652 150179 148380 146894 145947 145250
54681A45250p43o20lQ77J463J458J048N67J80j00k91m68p51j071j156q76n18m23
54663A43823n32m92k22j6r2k67k02J82O29Q27P02M30J97m2l95o52l36O75J796
54644A46013K274J951J242N37o3m71n12j64L28P14R63J154J283J272R85L27n67
54627A57266j249j319r14o20p86j159j297j122r10q30p47m36J15O65Q71N19k70
54610A47777j033j243p60K1N51N81K64j12l41k95m8P1j84m48k5J024J597R17k42
54591A48072m56M24J122Q08J54J05N09O25L97L95P92J140J111Q33M87R4k65l76
54573A55971j51K90P36R36P39L85L85P81Q14q7j283j515n43N36P46L54J97M17
54555A59708M77J87M2L94P75N28j89n23j09M38M64K53M58R80J171R83J020J392
$$ plain form
54681 145250 144507 143887 143884 144761 146224 147682 148730 149297 149477 149377 149086 148618 147867 146796 145640 144764 144246 143823
54663 143823 143291 142799 142577 142561 142469 142202 142000 142182 142811 143638 144340 144770 144967 144925 144530 143878 143542 144217 146013
54644 146013 148287 150238 151480 152017 151954 151483 150971 150807 151135 151849 152812 153966 155249 156521 157506 157833 157266
54627 157266 156017 154698 153784 153164 152378 151219 149922 148800 147890 147060 146313 145877 145992 146657 147528 148047 147777
54610 147777 146744 145501 144741 144762 145313 145894 146158 146046 145705 145410 145362 145433 145249 144801 144776 145800 147397 148314 148072
54591 148072 147616 148040 149162 149970 150124 150229 150738 151363 151760 152155 152947 154087 155198 156031 156518 156612 156347 155971
54573 155971 155820 156110 156846 157782 158521 158906 159291 160072 160886 160799 159516 158001 157458 157994 158740 159094 159291 159708
54555 159708 160185 160372 160414 160808 161583 162111 161922 161399 161290 161728 162192 162445 162903 163883 165054 166037 167057 168449
54537A68449J453R43N28O98R62P94O49J136J844J899J319Q36O43K84k64m29l8
54520A81706L65L85J75j90r58j971k399j716n31M9l22r84j165q37o06q63j161
54503A68977p04N36J562J551Q76M57M18J22n90r92n17M04Q61M59m62j294j631
54486A70033j477j109p14j75O07J377J774J810J822J995K185K104J540O05l1L66
54470A82712J592K439K169J513J554K057J852O63n23q63n34p8K94M82L31M2J03
54453A95805N96J035J071Q59N83J70l44p25r29j131j285j167r04q52r82r89r82
54436A89829j299j625j205j66L49k24r71p83J43P24L99m35j015q16J40J225J700
54419A85970J474J038O36P4n39o54j54L33L73L18N22O99N34L43M81O76M92P0j92
$$ plain form
54537 168449 169902 170845 171373 172071 173033 173827 174476 175612 177456 179355 180674 181510 182153 182437 182173 181744 181706
54520 181706 182071 182456 182631 182441 181483 179512 177113 175397 174866 174915 174593 173609 172444 171607 171001 170138 168977
54503 168977 168273 168809 170371 171922 172798 173255 173673 173795 173205 172213 171696 172100 172961 173420 172958 171664 170033
54486 170033 168556 167447 166733 166558 167165 168542 170316 172126 173948 175943 178128 180232 181772 182377 182346 182712
54470 182712 184304 186743 188912 190425 191979 194036 195888 196551 196028 195165 194631 194553 194847 195329 195660 195702 195805
54453 195805 196401 197436 198507 199366 199949 200119 199775 199050 198121 196990 195705 194538 193634 192782 191800 190811 189829
54436 189829 188530 186905 185700 185534 185883 185659 184688 183905 184048 184772 185171 184736 183721 182905 183045 184270 185970
54419 185970 187444 188482 189118 189192 188653 187999 187845 188178 188551 188869 189391 190090 190624 190967 191448 192124 192616 192686 192494
54400A92494k64k64J2O92J342J378P91K8n23o32j07R13J821K130J904J343M03
54383B03461q75j993k454k294j787j020j14N24O34M93M44M50L82M06O02O39K70
54366A97768k01l48j93L7K85M45K60j84k92J42M70J26l97k80L61O15j3j142k133
54347A95326k529k097j046j20Qn76j212j390j062m89p6p8k17K6N51O75K60Q6O40
54328A86680J280J219P19N47Q47J253J603J756J285J83o59n18N1O0n35j151j702
54311A92918k273k276j225l6j12j251j828j154k07J64L75R25J316Q70j80j057
54295A84969j308r23j61L62O7p62j102m91L38N10Q5k56j47K69O80Q31N98J53j70
54276A83542j98J4L17M41M3p40j078l81P54J177O39r5m31m35k01L28P91N03n07
$$ plain form
54400 192494 192230 191966 191978 192670 194012 195390 196181 196209 195686 195054 194947 195860 197681 199811 201715 203058 203461
54383 203461 202586 200593 198139 195845 194058 193038 192924 193448 194082 194575 195019 195469 195851 196257 196859 197498 197768
54366 197768 197567 197219 197026 197063 197348 197793 198053 197869 197577 197719 198189 198315 197918 197638 197999 198614 198601 197459 195326
54347 195326 192797 190700 189654 189534 189542 188966 187754 186364 185302 184813 184737 184659 184442 184468 185019 185694 185954 186040 186680
54328 186680 187960 189179 189898 190445 191292 192545 194148 195904 197189 197372 196713 196195 196246 196306 195771 194620 192918
54311 192918 190645 188369 187144 187108 186996 185745 183917 182763 182556 182720 183095 184020 185336 186206 186026 184969
54295 184969 183661 182738 182577 182939 183006 182244 181142 180651 180989 181499 181584 181328 181181 181450 182130 182961 183559 183712 183542
54276 183542 183344 183358 183675 184116 184159 183419 182341 181960 182714 183891 184530 184435 184004 183569 183368 183696 184487 184990 184483
54257A84483j272r68K50J580K240J824O92k6N20J758K342J814Q55p3j143k207
54241A92669k566k096j526j172n07N23Q93%j191j401p04o9J47L14O09Q21P83M22
54223A85949l58j235j428o60K19K84k22m05j44j57p23j160p56K30P79K21r48j453
54205A78033o43O18R39J74m74k19L40L37p2j80J36M73O14N87L80J15J44M75N31
54186A82308po02o26k35P7L26P08Q83L87m95j014r68q02q71j152j486j586j078
54168A73767r1N05P1r09j417j216q43o58n12k60Q1N55J072J230Q44M09M22O09
54150A73659M76K62M89Q35M72n66j295j140m62K69R73J469J319N29k62n35l47
54133A76145M0M06L77k26q03m96N95J434J523J443J629J568P73j96m48N6O63R77
$$ plain form
54257 184483 183211 182243 182493 184073 186313 188137 188829 188803 189323 191081 193423 195237 196092 196019 194876 192669
54241 192669 190103 188007 186481 185309 184802 185325 186218 186218 185027 183626 182922 182853 183000 183314 183923 184744 185527 185949
54223 185949 185591 184356 182928 182268 182487 182771 182549 182144 182000 181843 181120 179960 179204 179434 180213 180434 179486 178033
54205 178033 177390 178008 178947 179121 178647 178428 178768 179105 179033 178853 178989 179462 180076 180663 181043 181158 181302 181777 182308
54186 182308 182301 181699 181073 180838 180915 181241 181949 182832 183219 182724 181710 180742 179940 179069 177917 176431 174845 173767
54168 173767 173676 174181 174252 173343 171926 170710 169867 169209 168697 168437 168518 169073 170145 171375 172219 172628 173050 173659
54150 173659 174135 174397 174886 175721 176193 175627 174332 173192 172730 172999 173972 175441 176760 177289 177027 176492 176145
54133 176145 176185 176591 176968 176742 175939 175443 176038 177472 178995 180438 182067 183635 184408 184212 183764 183820 184483 185460
54115A85460J018P40J20m81n47m8N27P09L64l28r83j222j075j002j312j687j558
54098A78695q05J32P16P59N26M85P87R64M42n70j117n96N15J277J264O39l38j380
54080A82395j947j529k79R89J559J397J022R22J168J467J513J274Q79L82j92o10
54064A90410o05l00j61l69n57l92j17j57m21l58K95J140J530J202N02L8J54O46
54046A92480J117J490J977K571K906K773K451K353K607L146L894M572M710M310
54032B33357M132M780N661N538M158K653K158K617L242L597L690L465K841K160
54018B84049J942K133K102J549R32P86R97J117J099J311J972L032M528O547Q698
54003C22794J0003R616P550M545J374j637m549p494j0276j2249j2807j2059j0816
$$ plain form
54115 185460 186478 187218 187338 186857 186310 186262 186789 187498 187862 187534 186551 185329 184254 183252 181940 180253 178695
54098 178695 177890 178022 178738 179497 180023 180508 181295 182259 182701 182131 181014 180418 180933 182210 183474 184113 183775 182395
54080 182395 180448 178919 178640 179629 181188 182585 183607 184529 185697 187164 188677 189951 190830 191212 191020 190410
54064 190410 189805 189505 189344 188975 188418 188026 187909 187752 187331 186973 187268 188408 189938 191140 191642 191680 191834 192480
54046 192480 193597 195087 197064 199635 202541 205314 207765 210118 212725 215871 219765 224337 229047 233357
54032 233357 237489 242269 247930 253468 257626 260279 262437 265054 268296 271893 275583 279048 281889 284049
54018 284049 285991 288124 290226 291775 292707 293493 294490 295607 296706 298017 299989 303021 307549 314096 322794
54003 322794 332797 342413 349963 354508 355882 354245 349696 342202 331926 319677 306870 294811 283995
53990B83995r758q829p632o136m711l633k954k725k970l417l599l307k716k031
53976B19577j297n90j73k41o56j046j078o45Q1P52J054R72P41N45L35q2p46j400
53958B16103j623j282p19k98J57J077K267K866K482J831J785K232K529K643L038
53943B35088L634L844L693L940M833N585N517N055N050N704O589P277P376O468
53929C09653M591K506R72K0o51r89q43n20l85j66O02J601J976J542J025J054J575
53912C23563K343L301M232M708M632M348L955L145J998J254J248J208L14j006
53898C59243j672j573j696k602l650m022l810l646l760l906l957l975l879l574
53884C13521l379l858n018o080o258n575m665l926l166k188j315j091j539j994
$$ plain form
53990 283995 274237 265408 257776 251640 246929 243296 240342 237617 234647 231230 227631 224324 221608 219577
53976 219577 218280 217690 217517 217276 216620 215574 214496 213851 213932 214684 215738 216710 217451 217996 218331 218249 217503 216103
53958 216103 214480 213198 212479 212181 212338 213415 215682 218548 221030 222861 224646 226878 229407 232050 235088
53943 235088 238722 242566 246259 250199 255032 260617 266134 271189 276239 281943 288532 295809 303185 309653
53929 309653 314244 316750 317722 317742 317091 316102 315259 314739 314354 314188 314790 316391 318367 319909 320934 321988 323563
53912 323563 325906 329207 333439 338147 342779 347127 351082 354227 356225 357479 358727 359935 360249 359243
53898 359243 357571 355998 354302 351700 348050 344028 340218 336572 332812 328906 324949 320974 317095 313521
53884 313521 310142 306284 301266 295186 288928 283353 278688 274762 271596 269408 268093 267002 265463 263469
53870B63469j840j260r82j305j717j656j328j379j834j980j401o86o33j126j355
53855B42987j017o38n77l78M73J640K335K483K828L877N256O385P359Q806J0998
53840B92817J3470J5404J6162J5449J3226R669N128P0m859q833j1102j1466j0428
53827C34707q776o967n011k898j012P2J28m79j169j707k254k953l617l959m036
53812B90069m203m567m712m175l119k215j769j298k51J053J687J322Q05J224K646
53797B72497M066M493L822K720K008K114K772L151K555J224J45l5L08M01N1l65
53781C01927n98p54r20j054j302j951k916l659l826l662l600l720l862l971m013
53766B62119l827l357k896k720k638k275j715j430j521j456p32M66J444J714J381
$$ plain form
53870 263469 261629 260369 259387 258082 256365 254709 253381 252002 250168 248188 246787 246101 245468 244342 242987
53855 242987 241970 241332 240755 240377 240850 242490 244825 247308 250136 254013 259269 265654 273013 281819 292817
53840 292817 306287 321691 337853 353302 366528 376197 381325 381395 376536 367703 356601 345135 334707
53827 334707 325931 318964 313953 311055 310043 310115 310243 309764 308595 306888 304634 301681 298064 294105 290069
53812 290069 285866 281299 276587 272412 269293 267078 265309 264011 263760 264813 266500 267822 268627 269851 272497
53797 272497 276563 281056 284878 287598 289606 291720 294492 297643 300198 301422 301567 301532 301840 302241 302292 301927
53781 301927 301329 300575 299655 298601 297299 295348 292432 288773 284947 281285 277685 273965 270103 266132 262119
53766 262119 258292 254935 252039 249319 246681 244406 242691 241261 239740 238284 237552 238018 239462 241176 242557
53751B42557R23O69N20K11k17l50K0N05N16l0o99j101j207j152j069j079j175
53734B37842j057m17O11J527K005K082J871J441J004Q50R70J051R56Q89J036J323
53718B53984J679K150K639K865K738K504K383K368K459K710K913K649J880J153
53704B87074R82J385K078K720K891K384J757J889K719L179K798K513L158M059
53690C21586M129L663L728M177L796K348J010M71L3q95j682j674j421j671j970
53675C35628j415l02K12j41n04l96l39p04r49n44N2J9o37j235j364j147o54J31
53657C25711P62M58q13j951j948j128o13q05j054p80j88L50R24J610J945J506
53641C23986O68K50M70Q61J068J191J277J121O76K87K20L28L98N04Q19J251J602
$$ plain form
53751 242557 243480 244149 244669 244880 244663 244313 244333 244838 245354 245324 244625 243524 242317 241165 240096 239017 237842
53734 237842 236785 236368 236979 238506 240511 242593 244464 245905 246909 247759 248729 249780 250736 251625 252661 253984
53718 253984 255663 257813 260452 263317 266055 268559 270942 273310 275769 278479 281392 284041 285921 287074
53704 287074 288056 289441 291519 294239 297130 299514 301271 303160 305879 309058 311856 314369 317527 321586
53690 321586 325715 329378 333106 337283 341079 343427 344437 344908 344941 344046 342364 340690 339269 337598 335628
53675 335628 334213 333911 334123 333982 333478 333082 332743 332039 331090 330546 330598 330617 329980 328745 327381 326234 325580 325711
53657 325711 326473 326931 326118 324167 322219 321091 320478 319673 318619 317839 317651 318001 318925 320535 322480 323986
53641 323986 324654 324904 325374 326235 327303 328494 329771 330892 331568 331855 332075 332403 332801 333305 334124 335375 336977
53624C36977J836K061K292K438K515K714L225L952M488M501M216M240M725N058
53610C85238M686M022L966M622N111M743L881L302L216L253L138K991K941K859
53596D37969K482J761R84N25M35L54N2j55J46O67N54n55j984k822k916k813k914
53579D31770l028k714j898j090r87j729k572k573j663p37n78r62j082o03N9M15
53563D10028N65J008J913K835L262L323L642M427N115N150M795M729N097N432
53549D61321N370M904M058K897J840J314R89J07j262k003j375nR81J289J393J730
53533D83548K537M052O159Q022Q823Q809R019R967J1116J1762J1957J2292J3142
53520F01205J4300J5327J6060J6749J7628J8526J9162J9768K1017K3033K5047
$$ plain form
53624 336977 338813 340874 343166 345604 348119 350833 354058 358010 362498 366999 371215 375455 380180 385238
53610 385238 389924 393946 397912 402534 407645 412388 416269 419571 422787 426040 429178 432169 435110 437969
53596 437969 440451 442212 443196 443721 444156 444510 444562 444407 444553 445220 445774 445219 443235 440413 437497 434684 431770
53579 431770 428742 426028 424130 423040 422053 420324 417752 415179 413516 412779 412201 411239 410157 409554 409613 410028
53563 410028 410593 411601 413514 416349 419611 422934 426576 431003 436118 441268 446063 450792 455889 461321
53549 461321 466691 471595 475653 478550 480390 481704 482693 482800 481538 479535 478160 478155 479136 480425 481818 483548
53533 483548 486085 490137 496296 504318 513141 521950 530969 540936 552052 563814 575771 588063 601205
53520 601205 615505 630832 646892 663641 681269 699795 718957 738725 759742 782775 807822
53509H07822K6335K7108K7985K8902K9239K8859K8288K7881K7412K6735K6256
53498A112822K6381K6835K6892K6177K5001K3984K3508K3486K3559K3492K3369
53487A385506K3303K3074K2301K1001J9718J8947J8527J7880J6788J5745J5339
53476A598129J5477J5426J4594J3064J1188R040O511L767J129j394m092o995r772
53463A666072j2174j4265j6005j7153j7804j8546j9748k0993k1675k1926k2484
53452A463299k3687k5022k5717k5544k4969k4677k4979k5493k5393k4068k1625
53441A192125j8812j6492j5084j4256j3208j1428r154o988n211l730k442j236
53429A074084K55K286M466O114P255Q603J0481J2459J4206J5893J7461J8372J8581
$$ plain form
53509 807822 834157 861265 889250 918152 947391 976250 1004538 1032419 1059831 1086566 1112822
53498 1112822 1139203 1166038 1192930 1219107 1244108 1268092 1291600 1315086 1338645 1362137 1385506
53487 1385506 1408809 1431883 1454184 1475185 1494903 1513850 1532377 1550257 1567045 1582790 1598129
53476 1598129 1613606 1629032 1643626 1656690 1667878 1676918 1683429 1687196 1688325 1686931 1682839 1675844 1666072
53463 1666072 1653898 1639633 1623628 1606475 1588671 1570125 1550377 1529384 1507709 1485783 1463299
53452 1463299 1439612 1414590 1388873 1363329 1338360 1313683 1288704 1263211 1237818 1213750 1192125
53441 1192125 1173313 1156821 1141737 1127481 1114273 1102845 1093691 1086703 1081492 1077762 1075320 1074084
53429 1074084 1074339 1076625 1081091 1087205 1094460 1103063 1113544 1126003 1140209 1156102 1173563 1191935 1210516
53416A210516J9038K0517K2569K4307K5685K7268K9198L1125L2861L4432L5817
53405A513333L7209L9193M1966M4788M6963M8871N1281N3979N6127N7716N9605
53394B051031O2066O4240O5289O5336O5111O5211O5806O6504O6443O5016O2436
53383B764489N9294N5823N2144M8765M5940M3000L9191L4940L1128K7474K2910
53372C225098J7503J2520Q362L845k010q796j5865k3404l1564l9652m7049n3929
53360C045059o0251o4958o7303o8168o8994o9929p0081o9069o7318o5140o2626
53349B311222o0180n8222n6513n4643n3024n2451n2748n2726n1598m9643m7387
53338A722087m4840m1822l8467l5130l2113k9505k7041k4173k0766j7566j5514
$$ plain form
53416 1210516 1229554 1250071 1272640 1296947 1322632 1349900 1379098 1410223 1443084 1477516 1513333
53405 1513333 1550542 1589735 1631701 1676489 1723452 1772323 1823604 1877583 1933710 1991426 2051031
53394 2051031 2113097 2177337 2242626 2307962 2373073 2438284 2504090 2570594 2637037 2702053 2764489
53383 2764489 2823783 2879606 2931750 2980515 3026455 3069455 3108646 3143586 3174714 3202188 3225098
53372 3225098 3242601 3255121 3263483 3267328 3265318 3256522 3240657 3217253 3185689 3146037 3098988 3045059
53360 3045059 2984808 2919850 2852547 2784379 2715385 2645456 2575375 2506306 2438988 2373848 2311222
53349 2311222 2251042 2192820 2136307 2081664 2028640 1976189 1923441 1870715 1819117 1769474 1722087
53338 1722087 1677247 1635425 1596958 1561828 1529715 1500210 1473169 1448996 1428230 1410664 1395150
53327A395150j4659j4235j3748j3399j3396j3512j3464j3181j2527j1256r539
53316A252234q083p376p049o334m919l146j486j08J130K460M028N802P553Q992
53302A243698J0019J0938J2324J4393J6640J8364J9634K1254K3630K6130K7947
53291A444971K9118L0230L1454L2432L2918L2849L1902K9699K6617K3747K1799
53280A767736K0445J8979J7145J4982J2363R099N368J614j942n413q890j2215
53268A839271j5172j7738k0080k2429k4937k7594l0156l2265l3744l4813l5871
53257A544472l7000l7828l8062l7976l8060l8190l7569l5734l3278l1260l0115
53246A149400k9480k8970k8716k8969k9485k9549k8630k6902k5108k3873k3155
$$ plain form
53327 1395150 1380491 1366256 1352508 1339109 1325713 1312201 1298737 1285556 1273029 1261773 1252234
53316 1252234 1244151 1236775 1229726 1223392 1218473 1215327 1213841 1213733 1214863 1217323 1221351 1227153 1234706 1243698
53302 1243698 1253717 1264655 1276979 1291372 1308012 1326376 1346010 1367264 1390894 1417024 1444971
53291 1444971 1474089 1504319 1535773 1568205 1601123 1633972 1665874 1695573 1722190 1745937 1767736
53280 1767736 1788181 1807160 1824305 1839287 1851650 1860749 1866117 1867731 1865789 1860376 1851486 1839271
53268 1839271 1824099 1806361 1786281 1763852 1738915 1711321 1681165 1648900 1615156 1580343 1544472
53257 1544472 1507472 1469644 1431582 1393606 1355546 1317356 1279787 1244053 1210775 1179515 1149400
53246 1149400 1119920 1090950 1062234 1033265 1003780 974231 945601 918699 893591 869718 846563
53235H46563k2409k1188j9474j7514j5566j3836j2383j1065r788q810q507q790
53223F77233r146r345r711j0508j1447j2107j2423j2492j2273j1893j1813j2192
53211E41883j2363j1548r906q381p645p639p980q245p992p177o507o789p795q412
53197D23504q041p295p063p364p510p048o146n266m715m485m356m161l988l903
53183C42163l670l029k237j896k144k427k299j985j886j882j566r71o57r64j567
53168C12983j813j380n28K20N40M63J73k12n77p42o68o38q98j200j036l74J50
53151C04463No50j267j561j611j533j423j486j817k056j633n23N33P98L95P0K14
53134B90918N35O71O86O67L27m95j250j220n42mJ57M11Q12O97j01n82L5J032J188
$$ plain form
53235 846563 824154 802966 783492 765978 750412 736576 724193 713128 703340 694530 686023 677233
53223 677233 668087 658742 649031 638523 627076 614969 602546 590054 577781 565888 554075 541883
53211 541883 529520 517972 508066 499685 492040 484401 476421 468176 460184 453007 446500 439711 431916 423504
53197 423504 415463 408168 401105 393741 386231 379183 373037 367771 363056 358571 354215 350054 346066 342163
53183 342163 338493 335464 333227 331331 329187 326760 324461 322476 320590 318708 317142 316171 315514 314550 312983
53168 312983 311170 309790 309262 309482 310022 310485 310658 310446 309869 309127 308459 307821 306923 305723 304687 304313 304463
53151 304463 304468 303818 302551 300990 299379 297846 296423 294937 293120 291064 289431 288908 289441 290239 290634 290704 290918
53134 290918 291453 292124 292810 293477 293804 293309 292059 290839 290297 290293 290450 290861 291673 292370 292269 291687 291722 292754 293942
53115B93942N06r0l56q37j552j784j384j144j531k012k099k073k135j743n68N10
53099B75650K88j138k407k426j367k27J27l88j085j206p76m26l59l6Q44J658J713
53082B68439J194O36kr40j698j531o46oP8K91J081J909K057J513P14n8o05o37
53064B71789j20M17L30m45j330j637j084J7R95J431J581J927K382K337J543N04
53048B80637j69m00m29l99m29p03j150j335j034o09n16o85p94r02j253j624j415
53031B66791n19L48M26k26q06o18K39R64Q45k0q29r63n42m3L33O15P17N75M79
53012B67766P51J141R79Q0j006j679j807j457o53L35R39R14O65O51P49O55N97
52995B69620J079K016K643K346J296J24o94j082j193j137q27j52O71J180J234
$$ plain form
53115 293942 294448 294358 294002 293165 291613 289829 288445 287301 285770 283758 281659 279586 277451 275708 275140 275650
53099 275650 275938 274800 272393 269967 268600 268373 268500 268112 267027 265821 265045 264619 264260 264224 265068 266726 268439
53082 268439 269633 270269 270267 269327 267629 266098 265452 265446 265524 265815 266896 268805 270862 272375 273089 273031 272426 271789
53064 271789 271669 272086 272416 271971 270641 269004 267920 267937 268932 270363 271944 273871 276253 278590 280133 280637
53048 280637 280468 280068 279639 279240 278811 278108 276958 275623 274589 273980 273464 272779 271985 271083 269830 268206 266791
53031 266791 266272 266620 267046 266820 266014 265396 265635 266599 267444 267424 266595 265632 265090 265047 265380 265995 266712 267287 267766
53012 267766 268517 269658 270637 270717 269711 268032 266225 264768 264115 264450 265389 266303 266968 267619 268368 269023 269620
52995 269620 270699 272715 275358 277704 279000 279124 278430 277348 276155 275018 274191 274039 274710 275890 277124
52980B77124J208J350J277O08j89k64L45O79K46k67o8N75Q16N28M38J071K055
52963B87532K622K458J916J550J536J548J170L70n66j413k063k272j839j119r15
52948B90515j533k349k592k271j901j635j220o15j34K0m3j63l30n20o90q85j076
52931B72578j007m75K28N67L94M7j96l98o48q40q76q19p49o23l71J9M47O51L67
52912B68296k32m90l1O61Q74P12Q38J327J512J084N68L58P0o82j519j861j807
52895B69678j773j660j040J2R63J513J698J447P13J5N0O55Q09Lj005j237p91n35
52877B69515q15j102r06m53k57m04n59m72k38m9L5J27M15R79J628J963J810J487
52859B72704J419J486J119K04n79o43l49m45r23j081p25n19r27j434j339q53p80
$$ plain form
52980 277124 278332 279682 280959 281567 281378 281114 281459 282138 282384 282117 282049 282624 283440 283968 284406 285477 287532
52963 287532 290154 292612 294528 296078 297614 299162 300332 300702 300136 298723 296660 294388 292549 291430 290515
52948 290515 288982 286633 284041 281770 279869 278234 277014 276399 276265 276285 276242 276079 275749 275229 274539 273654 272578
52931 272578 271571 271096 271324 271891 272285 272332 272136 271738 271090 270250 269374 268555 267806 267183 266812 266831 267278 267929 268296
52912 268296 268064 267574 267543 268204 269078 269790 270628 271955 273467 274551 275119 275477 275547 274865 273346 271485 269678
52895 269678 267905 266245 265205 265217 266180 267693 269391 270838 271551 271566 271616 272271 273080 273083 272078 270841 270050 269515
52877 269515 268700 267598 266692 266239 265982 265578 265019 264547 264309 264260 264295 264422 264837 265816 267444 269407 271217 272704
52859 272704 274123 275609 276728 276932 276353 275710 275361 274916 273993 272912 272187 271668 270741 269307 267968 267115 266335
52842B66335j380k109k471k572k713k876k799k342j635r10l31J16N28Q75J003
52827B46719R07Q63J031J083N25o10j690k135j932j453j000o22k38K20P12J080
52811B43460J215J231J372J756K311K926L503L817L578K724J536K74j081k560
52797B66062l791m134l368k058j127j081j694k311k393j824r14j25K85M86P85
52782B42798J181J338J132R30J024R97J77j253k125j552OJ308J642J253O53O0
52766B49569m62p86q58q09p18m98j22J87K23J22K11N06O33L06k01l16J05M91K61
52747B47844l60n73p8N12N83M23O80J281J520J204R86J343J909K230K547L225
52731B65276L840L600K514J382O29q4r33j413j143n87m30o57q14q70j115j448
$$ plain form
52842 266335 264955 262846 260375 257803 255090 252214 249415 247073 245438 244528 244197 244313 244841 245716 246719
52827 246719 247626 248489 249520 250603 251128 250518 248828 246693 244761 243308 242308 241686 241448 241668 242380 243460
52811 243460 244675 245906 247278 249034 251345 254271 257774 261591 265169 267893 269429 269703 268622 266062
52797 266062 262271 258137 254769 252711 251584 250503 248809 246498 244105 242281 241367 241242 241527 242013 242798
52782 242798 243979 245317 246449 247379 248403 249400 249577 248324 246199 244647 244653 245961 247603 248856 249509 249569
52766 249569 249107 248321 247463 246654 245936 245438 245316 245503 245726 245848 246059 246565 247198 247504 247303 246987 247092 247583 247844
52747 247844 247484 246911 246833 247345 247928 248351 249031 250312 251832 253036 254022 255365 257274 259504 262051 265276
52731 265276 269116 272716 275230 276612 277241 277157 276224 274811 273668 273081 272651 271994 271180 270310 269195 267747
52715B67747j424r78n27l05j86j97n90j213j448j074o16n25n29k47Q7O6j33j30
52697B57778j14m55p80k97R51J965K090J705J339Q79J12n23l77M65J236J403J179
52680B68556J123J466J810J490L44q59j125m33J90K3m54l97J13K94j37n82n10
52663B70912j50k4k36m34l19L9L20L04J49L40J225K570L676L962L404K473J668
52646B89879J042K25j001k185k617k252j840j925k169j982j395p69k0J133K293
52631B76417K535J726Q92R86J733K179J960J536J354J285R39J42r84k100k821
52616B87779k926k543k062j794j768j851j919j909j739j287n03M56J266J618J412
52601B72230P89J02j77K25J039J595J516J139J027J205J229R48P83J098J668J966
$$ plain form
52715 267747 266323 265345 264818 264513 264327 264130 263540 262327 260879 259805 259189 258664 258135 257888 257975 258041 257908 257778
52697 257778 257664 257209 256429 256132 257083 259048 261138 262843 264182 265061 265173 264650 264273 264738 265974 267377 268556
52680 268556 269679 271145 272955 274445 274789 273930 272805 272372 272562 272585 272131 271734 271847 272141 272004 271422 270912
52663 270912 270762 270738 270502 270068 269749 269788 270108 270412 270561 270901 272126 274696 278372 282334 285738 288211 289879
52646 289879 290921 291146 290145 287960 285343 283091 281251 279326 277157 275175 273780 273011 272991 274124 276417
52631 276417 278952 280678 281570 282556 284289 286468 288428 289964 291318 292603 293542 293684 292700 290600 287779
52616 287779 284853 282310 280248 278454 276686 274835 272916 271007 269268 267981 267478 267934 269200 270818 272230
52601 272230 273019 273121 272944 273169 274208 275803 277319 278458 279485 280690 281919 282867 283650 284748 286416 288382
52585B88382J728J017K7q74j167o20K57O23K64j65L0P35J226J011K60n46j033
52568B91155j064p33l70l50o61q44n39J0K93K51K96N75O76K47m12p82q15q65j031
52549B85037j047p73l37K21J016J844K110J494M58k75n25o36q56j076j178j255
52533B84222j349j296r27l28K30N20N11M36O76J294J716J172k91j570j622o49
52517B82745K18L04jJM70J200K081L029L701L800L515L286L162K830K195J506
52501C14042Q49m3j306k593l416l649l530l354l246l038k384j230j36K55P4R9
52485B87394N78Q54M19k19k72J86N03N28O30Q33P40M10M56J018J415J156P66R76
52467B98371J643K028J916J760J902K201K495K808K960K511J374J57m98p26j196
$$ plain form
52585 288382 290110 291127 291154 290280 289113 288493 288750 289373 289637 289472 289502 290237 291463 292474 292734 292188 291155
52568 291155 290091 289358 288988 288638 287977 287133 286594 286604 286897 287148 287444 288019 288695 288942 288530 287748 286933 286068 285037
52549 285037 283990 283217 282880 283101 284117 285961 288071 289565 290023 289748 289223 288587 287731 286655 285477 284222
52533 284222 282873 281577 280650 280322 280552 281072 281583 282019 282695 283989 285705 286877 286586 285016 283394 282745
52517 282745 282963 283267 283266 283267 283737 284937 287018 290047 293748 297548 301063 304349 307511 310341 312536 314042
52501 314042 314891 314848 313542 310949 307533 303884 300354 297000 293754 290716 288332 287102 286966 287221 287295 287394
52485 287394 287972 288826 289245 289026 288754 288940 289443 289971 290601 291434 292174 292584 293040 294058 295473 296629 297395 298371
52467 298371 300014 302042 303958 305718 307620 309821 312316 315124 318084 320595 321969 322126 321628 320902 319706
52452C19706k176l153l438k928k179j853k131k560k508j844j100q79j195j595
52438B90167j788j808j639j118m04n9l75q84q33l6J028J724J708J080L44%m2k84
52420B86781o66l88Q44J935J650L76l70M7Q96J594K457L666M628M991N403O502
52404C20346P984R320J0629J1914J2117J0069O139J982j245l620n540o994p830
52391C65271q078p718o642n018l311j986j283j204j363j188o37l54o90r83m38
52376C24378O24J225J184J258J921K925M038N294O329O366N231L770K879K636
52362C70058K546K146J222Lp79n84M0J2p01r78k77M71L40m9O16K380L859L928
52344C84253K816J631J305K021L201L964L931L624L816M621N488O056O612P598
$$ plain form
52452 319706 317530 314377 310939 308011 305832 303979 301848 299288 296780 294936 293836 292957 291762 290167
52438 290167 288379 286571 284932 283814 283410 283351 282976 282092 281259 281223 282251 283975 285683 286763 287107 287107 287065 286781
52420 286781 286115 285727 286571 288506 290156 290532 290162 290209 291105 292699 295156 298822 303450 308441 313844 320346
52404 320346 328330 337650 348279 360193 372310 382379 388518 390500 389255 385635 380095 373101 365271
52391 365271 357193 349475 342833 337815 334504 332518 331235 330031 328668 327480 326843 326489 325799 324816 324378
52376 324378 325002 326227 327411 328669 330590 333515 337553 342847 349176 355542 360773 364543 367422 370058
52362 370058 372604 374750 375972 375975 375196 374612 374652 374664 373963 372985 372708 373179 373519 373470 374086 376466 380325 384253
52344 384253 387069 388700 390005 392026 395227 399191 403122 406746 410562 415183 420671 426727 433339 440937
52330D40937Q898R934J0438J0872J1829J3163J4158J4648J5425J7069J8913J9826
52318F06110J9764J9754K0376K1058K1063K0481J9922J9786K0086K0596K0874
52307H29870K0580J9932J9480J9361J9227J8950J8804J8797J8469J7567J6311
52296A037348J4786J2697J0056P503N478L639J496q73l080m977o537p694q565
52283A061277r430j0189j0366r857r083q139o628m649l042k185j341R8J645K727
52269I90838L855N779Q131R973J1192J2298J3279J3753J3956J4475J5191J5509
52257A128229J5436J5486J5625J5404J4955J4816J4751J3956J2446J1059R844
52246A282007P639L872k82l240m770n806p066q529r886j0948j1752j2610j3866
$$ plain form
52330 440937 449835 459769 470207 481079 492908 506071 520229 534877 550302 567371 586284 606110
52318 606110 625874 645628 666004 687062 708125 728606 748528 768314 788400 808996 829870
52307 829870 850450 870382 889862 909223 928450 947400 966204 985001 1003470 1021037 1037348
52296 1037348 1052134 1064831 1074887 1082390 1087868 1091507 1093003 1092130 1089050 1084073 1077536 1069842 1061277
52283 1061277 1051847 1041658 1031292 1021435 1012352 1004213 997585 992936 989894 987709 986368 986466 988111 990838
52269 990838 994693 1000472 1008603 1018576 1029768 1042066 1055345 1069098 1083054 1097529 1112720 1128229
52257 1128229 1143665 1159151 1174776 1190180 1205135 1219951 1234702 1248658 1261104 1272163 1282007
52246 1282007 1289646 1293518 1293236 1289996 1285226 1279420 1272354 1263825 1253939 1242991 1231239 1218629 1204763
52233A204763j5423j6665j7113j6860j6319j5802j5373j4850j3961j2798j1954
52222A037645j1808j1815j1123r790q639p929p032n574m051k907j760j61J442
52209I56498K232K178K055K439L099L478L400L187L224L524L795L890L963M037
52195A000999L830L311L040L426L950L812L159K875L202L423L002K169J224O1
52181A041483j284k425l367m678o488p974q454q310q266q244p667o501n308m470
52167I58047l851l158k246j228m40n9M35J832L960N516N631M976M693M809M511
52152I83428L617K758K258J754J056O46J073K318L875N062N260M336K976K081
52138A022498J769J401O77K49R31K625M451N663O267O825P885R597J1682J3740
$$ plain form
52233 1204763 1189340 1172675 1155562 1138702 1122383 1106581 1091208 1076358 1062397 1049599 1037645
52222 1037645 1025837 1014022 1002899 993109 984470 976541 969509 963935 959884 956977 955217 955056 956498
52209 956498 958730 960908 962963 965402 968501 971979 975379 978566 981790 985314 989109 992999 996962 1000999
52195 1000999 1004829 1008140 1011180 1014606 1018556 1022368 1025527 1028402 1031604 1035027 1038029 1040198 1041422 1041483
52181 1041483 1040199 1037774 1034407 1029729 1023241 1015267 1006813 998503 990237 981993 974326 967825 962517 958047
52167 958047 954196 951038 948792 947564 947124 947065 947500 949332 953292 958808 964439 969415 974108 978917 983428
52152 983428 987045 989803 992061 993815 994871 995517 996590 998908 1002783 1007845 1013105 1017441 1020417 1022498
52138 1022498 1024267 1025668 1026345 1026594 1027525 1030150 1034601 1040264 1046531 1053356 1061241 1070838 1082520 1096260
52124A096260J5655J7736K0420K3781K7214K9773L0991L1344L1621L1934L1666
52113A388395L0524K9089K8037K7269K6182K4537K2515K0155J7409J4655J2584
52102A641351J1374J0444R243P856O607N433M058K526J136j69j939m554p673j0628
52088A675065j3241j5945j8989k1816k3504k3686k2780k1348j9528j7210j4520
52077A462498j1853r481p308n093k849q19R47K833N173P651R605J0999J2531J4482
52063A489316J6057J6403J5858J5488J5681J5993J6171J6373J6338J5420J3694
52052A662792J2147J1296J0389Q526N902L302R91j315l765o338r168j2261j5114
52039A667384j7121j8210j8741j9021j9285j9740k0227k0136j9164j7848j6910
$$ plain form
52124 1096260 1111915 1129651 1150071 1173852 1201066 1230839 1261830 1293174 1324795 1356729 1388395
52113 1388395 1418919 1448008 1476045 1503314 1529496 1554033 1576548 1596703 1614112 1628767 1641351
52102 1641351 1652725 1663169 1672412 1680268 1686875 1692308 1696366 1698892 1700028 1699859 1697920 1693366 1685693 1675065
52088 1675065 1661824 1645879 1626890 1605074 1581570 1557884 1535104 1513756 1494228 1477018 1462498
52077 1462498 1450645 1441164 1433856 1428763 1425914 1425095 1426042 1428875 1434048 1441699 1451304 1462303 1474834 1489316
52063 1489316 1505373 1521776 1537634 1553122 1568803 1584796 1600967 1617340 1633678 1649098 1662792
52052 1662792 1674939 1686235 1696624 1705150 1711052 1714354 1715345 1714030 1710265 1703927 1694759 1682498 1667384
52039 1667384 1650263 1632053 1613312 1594291 1575006 1555266 1535039 1514903 1495739 1477891 1460981
52028A460981j6399j5906j5295j4694j4115j3586j3368j3475j3338j2522j1464
52017A306819j0891j0813j0751j0580j0446j0122r258q107p301p093p493q769
52005A195195j0920j2974j3898j4089j4904j6698j8538j9849k1105k2512k3311
51994A006397k2937k1793k0244j7965j5010j2550j1541j1465j1346j1338j2069
51983H38139j3010j2884j1626j0699j1169j2443j3314j3509j3667j4163j4503
51972F97152j3870j2119j0135r007q714p955n645k294N92K294L443M796O177P014
51958F51729P302P456P430O593M536J659j227l667n681p308q302q388p605o268
51944F38259m696l085j516L3J627L219M682O144P980J0172J1919J2356J1542J0192
$$ plain form
52028 1460981 1444582 1428676 1413381 1398687 1384572 1370986 1357618 1344143 1330805 1318283 1306819
52017 1306819 1295928 1285115 1274364 1263784 1253338 1243216 1233958 1225851 1218550 1211457 1203964 1195195
52005 1195195 1184275 1171301 1157403 1143314 1128410 1111712 1093174 1073325 1052220 1029708 1006397
51994 1006397 983460 961667 941423 923458 908448 895898 884357 872892 861546 850208 838139
51983 838139 825129 812245 800619 789920 778751 766308 752994 739485 725818 711655 697152
51972 697152 683282 671163 661028 652021 643307 635352 629707 627413 628005 630299 633742 638538 644715 651729
51958 651729 659031 666487 673917 680510 685046 686705 685478 681811 676130 668822 660520 652132 644527 638259
51944 638259 633563 630478 628962 628995 630622 633841 638523 644667 652647 662819 674738 687094 698636 708828
51930G08828Q527O085K729q55m006o800r453j1643j3039j4073j5443j6989j7842
51917F16026j7582j6696j5699j4411j2377r669p001n172m428m262l841k705j093
51904E01090N40K054L538M897N937O702P379P899Q019P719P117N937L640K15l495
51889E69188o520q493r512r672r047p851o297m343j876R72L917O800R536J1953
51875E38755J4039J6269J9238K2764K5737K7032K6384K4106K0273J4674P539j75
51863G56635p436j3736j8795k2126k3355k2825k1336j9272j6436j2881r290o360
51851E62787m102k222p91j74m48j310k481l779m848n291n136m905n120n860o787
51836E09533p352p019n655l762k127j105m69P7N30P95Q81P58L31k81p52j044j623
$$ plain form
51930 708828 717355 723440 726169 725314 721308 714508 705055 693412 680373 666300 650857 633868 616026
51917 616026 598444 581748 566049 551638 539261 529592 522591 517419 512991 508729 504888 502183 501090
51904 501090 501630 503684 507222 512119 518056 524758 532137 540036 548055 555774 562891 568828 572468 572683 569188
51889 569188 562668 554175 544663 534991 525944 518093 511796 507453 505577 506549 510466 517266 526802 538755
51875 538755 552794 569063 588301 611065 636802 663834 690218 714324 734597 749271 756810 756635
51863 756635 749199 735463 716668 694542 671187 648362 627026 607754 591318 578437 569147 562787
51851 562787 558685 556463 555672 555498 555050 553740 551259 547480 542632 537341 532205 527300 522180 516320 509533
51836 509533 502181 495162 489507 485745 483618 482513 482044 482121 482651 483446 484327 485085 485416 485135 484383 483339 481716
51819D81716k816m093m450l514j981q41l45J21J183K663L685L610K811K282K469
51804D82500K695J938P3j964l217l597l607l467k890j789p32m14p94j194j249
51789D62292j305j685k032j819j231r69j234j496j344r98p84o23l42j47l56r20
51773D45007j428j451o89Q58K591L610L749L979N270P278Q764R119Q817Q379P614
51758E11467O095L860J281j342l792n791p185q049q445q322p764p097o531n893
51744D52492m891l506j981n72O27J754L133M921O801Q245R105R656R995R864R120
51729E14763P998O701N194L621K559K482L222M221M899M636K921J3k874m631n244
51714E50481n305m959l979k586j460r44q93j213j906k506k175o23J464L119L906
$$ plain form
51819 481716 478900 474807 470357 466843 464862 464021 463676 463797 464980 467643 471328 474938 477749 480031 482500
51804 482500 485195 487133 487206 485242 482025 478428 474821 471354 468464 466675 465943 465529 464735 463541 462292
51789 462292 460987 459302 457270 455451 454220 453251 452017 450521 449177 448179 447395 446772 446430 446283 445927 445007
51773 445007 443579 442128 441439 442297 444888 448498 452247 456226 461496 468774 477538 486657 495474 503853 511467
51758 511467 517562 521422 522703 521361 517569 511778 504593 496544 488099 479777 472013 464916 458385 452492
51744 452492 447601 444095 442114 441542 442169 443923 447056 451977 458778 467023 476128 485784 495779 505643 514763
51729 514763 522761 529462 534656 538277 540836 543318 546540 550761 555660 560296 563217 563230 560356 555725 550481
51714 550481 545176 540217 536238 533652 532192 531248 530355 529142 527236 524730 522555 521932 523396 526515 530421
51699E30421L920L422K625J591K14j430k731k935j940m09R09J682J794J131l76
51684E37888k659n458q160r829r928q845p326n590l571j712n96P8J242L005M425
51669D82964M973N209N705O278O811P807R297J0163R377P255M593J394k494o123
51655E53209q200q791q959q912p771n256k237O04L406N976P188O314M033J395
51641E31999j548n175q948j1601j2514j2142j1224j0209r398q868q185o796m913
51628D20478l457k890k581j731m98L52O34R10J418J572R18M3r2N35J022P71J45
51611D17549k33k10N7M76Q82R33M71k35q35j156r39K13K212M260N581O143O344
51594D41513O448O736P655R126J0099R567P802N849M124K313M87o53q38o24m29
$$ plain form
51699 530421 534341 537763 540388 541979 542193 540763 538032 535097 533157 532748 533657 535339 537133 538264 537888
51684 537888 535229 529771 521611 511782 501854 493009 485683 480093 476522 474810 474214 474292 475534 478539 482964
51669 482964 487937 493146 498851 505129 511940 519747 529044 539207 548584 555839 560432 561826 559332 553209
51655 553209 545009 536218 527259 518347 510576 505320 503083 503687 507093 513069 520257 526571 530604 531999
51641 531999 530451 525276 516328 504727 492213 480071 468847 458638 449240 440372 432187 425391 420478
51628 420478 417021 414131 411550 409819 409321 409673 410307 411217 412635 414207 415125 415168 415076 415611 416633 417404 417549
51611 417549 417316 417106 417163 417639 418521 419454 419925 419690 418855 417699 416760 416973 419185 423445 429026 435169 441513
51594 441513 447961 454697 462352 471478 481577 491144 498946 504795 508919 511232 511719 511066 510228 509604 509175
51579E09175J30J614M042P093J0473J3777J6478J8466K0274K2399K4708K6722
51567F75351K8117K8763K8582K7739K6672K5787K5239K5230K6218K8674L2755
51556I79127L8140M3864M8368N0102M8384M3400L5453K4684J1659k283j5579k7138
51544A278181l6480m3628m9021n3038n5482n5882n4432n2062m9336m5902m1378
51533G41540l6205l1159k6482k2107j8355j5710j4017j2491j0661q875p757p448
51521E30273p475p260o705o215o111o067n486m331l235k666k402k022j551j350
51507D67397j611k236k939l331l164k641k257k191k162j997j804j515p89K46Q13
51492D39819M77j53k15K51N92N58M43M00K25k02p90j493k227k622k353j698j330
$$ plain form
51579 509175 509305 510919 514961 522054 532527 546304 562782 581248 601522 623921 648629 675351
51567 675351 703468 732231 760813 788552 815224 841011 866250 891480 917698 946372 979127
51556 979127 1017267 1061131 1109499 1159601 1207985 1251385 1286838 1311522 1323181 1320898 1305319 1278181
51544 1278181 1241701 1198073 1149052 1096014 1040532 984650 930218 878156 828820 782918 741540
51533 741540 705335 674176 647694 625587 607232 591522 577505 565014 554353 545478 537721 530273
51521 530273 522798 515538 508833 502618 496507 490440 484954 480623 477388 474722 472320 470298 468747 467397
51507 467397 465786 463550 460611 457280 454116 451475 449218 447027 444865 442868 441064 439549 438760 439006 439819
51492 439819 440296 440143 439928 440179 440771 441329 441772 442172 442397 442195 441405 439912 437685 435063 432710 431012 429682
51475D29682j498j794j733j239n21J86O74Q56R29J211J725K048J669N41p40j421
51459D30575j387j337j955k976l561l434l060k696j959o69O50J577K435L585M706
51444D20494N504O635R031J2509J5806J7895J8520J7686J5364J1881P979M397
51432E63701J689K31j13k56j163k954n120p357r534j1151j1682j1380j0936j0321
51418D83654q866o576m437l107k186j163k84P4K42P48J448J737J401P31O6l43
51402D63139k50L98J220J764J993K223K712L482M373N086N297N042M858N378O839
51387E13554R095J1901J5011J8186K1376K4898K9222L4508M0377M6167N1540N6812
51375H72647O2524O8444P3173P5029P3225O7997N9800M8887L5611K0707N090j0353
$$ plain form
51475 429682 428184 426390 424657 423418 422897 423083 423757 424613 425542 426753 428478 430526 432195 432736 431996 430575
51459 430575 429188 427851 425896 422920 419359 415925 412865 410169 408210 407541 408191 409768 412203 415788 420494
51444 420494 425998 432633 441664 454173 469979 487874 506394 524080 539444 551325 559304 563701
51432 563701 565390 565621 565508 565252 564089 561135 556015 548658 539124 527973 516291 504911 493975 483654
51418 483654 474788 468212 463775 460668 458482 457319 457035 457109 457351 458099 459547 461284 462685 463416 463482 463139
51402 463139 462889 463287 464507 466271 468264 470487 473199 476681 481054 486140 491437 496479 501337 506715 513554
51387 513554 522649 534550 549561 567747 589123 614021 643243 677751 718128 764295 815835 872647
51375 872647 935171 1003615 1076788 1151817 1225042 1293039 1352839 1401726 1437337 1458044 1463134 1452781
51363A452781k4815l7732m8889n8068o4728o8505o9888o9796o8426o5221o0129
51352H16584n4150m8336m2836l7333l1894k6846k2362j8591j5869j4203j2895
51341D91269j1262r512q315p705p046o013m971m252l625k735j741j202j409k066
51327D19415k546k416j780j057n08l6M24O14K82l50q08r59j069j179q58J80J428
51310D08777J962J457N41Qp1k29o64r27n89N4K78k38j117j757j875j657j612k139
51292D00202l065l661l365k430j563j042n71O4O28Q81J031J495K478L850N256
51277D00188O283O686O563O134N421M367L166K163J504J183J297J793K123J743
51263D50614R57N68O15K60q93k099k564k480k428k389k134k080k839m107m848
$$ plain form
51363 1452781 1427966 1390234 1341345 1283277 1218549 1150044 1080156 1010360 941934 876713 816584
51352 816584 762434 714098 671262 633929 602035 575189 552827 534236 518367 504164 491269
51341 491269 480007 470495 462180 454475 447429 441416 436445 432193 428568 425833 424092 422890 421481 419415
51327 419415 416869 414453 412673 411616 411108 411072 411496 412110 412392 412042 411234 410275 409206 408027 407169 407349 408777
51310 408777 410739 412196 412737 412745 412674 412445 411781 410854 410265 410319 410597 410359 409242 407485 405610 403953 402341 400202
51292 400202 397137 393476 390111 387681 386118 385076 384505 384569 385197 386078 387109 388604 391082 394932 400188
51277 400188 406471 413157 419720 425854 431275 435642 438808 440971 442475 443658 444955 446748 448871 450614
51263 450614 451571 452139 452754 453014 452121 450022 447458 444978 442550 440161 438027 435947 433108 429001 424153
51248D24153m553l681k797k013j379j181j514j938j917j426q62n31l86k42r4j12
51232C99527l18l75J03R61J533J361P14K06J43M21P69Q48L85l76n84L44J868K828
51214D10358K770K339K292K602K768K593K292K097K058K188K483K751K677K153
51200D44421J487J150J306J633J620J020J0j053j899k455k755k806k548j947j166
51185D36018m67O0N20Q87R12N98M31Q11J465J806J740J581J348Q13J94O8L85L27
51167D49497n88j793k498k598k443k174j809j459j055l19N33O43l22j371j378
51152D30866o29l38r05j534j555j203r37p95o66o33p48q71q79p28l26L59J004
51135D19482J276J336J559J803J577R23M45L74K55k25o81o63k18M29J323K461
$$ plain form
51248 424153 419600 415919 413122 411109 409730 408549 407035 405097 403180 401754 400892 400361 399975 399733 399639 399527
51232 399527 399209 398834 398937 399898 401431 402792 403506 403712 403855 404276 405045 405893 406278 405902 405318 405662 407530 410358
51214 410358 413128 415467 417759 420361 423129 425722 428014 430111 432169 434357 436840 439591 442268 444421
51200 444421 445908 447058 448364 449997 451617 452637 452647 451594 449695 447240 444485 441679 439131 437184 436018
51185 436018 435551 435611 436131 437018 437930 438528 438959 439770 441235 443041 444781 446362 447710 448523 448717 448785 449170 449497
51167 449497 448909 447116 444618 442020 439577 437403 435594 434135 433080 432761 433294 433937 433615 432244 430866
51152 430866 430237 429899 428994 427460 425905 424702 423765 422970 422304 421671 420923 420052 419173 418445 418119 418478 419482
51135 419482 420758 422094 423653 425456 427033 427956 428401 428775 429030 428805 428124 427461 427243 427672 428995 431456
51119D31456L506M142M470M640M557M201L950M072M194L742K712J602P27Ko88
51104D77285j238j448j180m62L61P90P39P23J179J755J739J064M22L12M91N55
51088D83087O41J148K007K636K615K086J392O57n3m02j2R53J695J522N66l97p92
51071D99349o94m94l27K8P26J540K092K343K649L238L925M635N927Q390J1420
51056E44747J3273J2770J0482P898N857M379L614L998N493P423R249J0952J2414
51043F52549J3118J2782J1858J0922R978Q740P305O030M843L205P80k146n116
51030G34848q115j1494j5199j8303j9603j8853j7121j5666j4647j3316j1238q721
51018E62572o103l373p00J312K394L171M418O043P287P708P613P547P819Q351
$$ plain form
51119 431456 434962 439104 443574 448214 452771 456972 460922 464994 469188 472930 475642 477244 477971 477973 477285
51104 477285 476047 474599 473419 472957 473318 474108 474847 475570 476749 478504 480243 481307 481729 482041 482532 483087
51088 483087 483728 484876 486883 489519 492134 494220 495612 496269 496216 495814 495802 496755 498450 499972 500538 500141 499349
51071 499349 498655 498161 497834 497862 498588 500128 502220 504563 507212 510450 514375 519010 524937 533327 544747
51056 544747 558020 570790 581272 589170 595027 599406 603020 607018 612511 619934 629183 640135 652549
51043 652549 665667 678449 690307 701229 711207 719947 727252 733282 738125 741330 742110 739964 734848
51030 734848 726733 715239 700040 681737 662134 643281 626160 610494 595847 582531 571293 562572
51018 562572 556469 553096 552396 553708 556102 559273 563691 569734 577021 584729 592342 599889 607708 616059
51004F16059Q765Q696Q278Q151Q641R253R368R200R503J0485J1655J2685J3759
50991G44498J4868J5467J5279J4977J5545J7151J9036K0428K1184K1604K1983
50980I42020K2398K2682K2544K1851K0802J9701J8564J7168J5569J4382J4353
50969A152034J5719J8195K1596K6165L2091L8850M5446N1403N7128O3033O8594
50958A590254P2767P5200P6482P7103P6660P4377P0026O3888N6209M7242L7697
50947B317905K8575K0284J2358M282l631j0406j5262j8228k0055k1707k3806k6362
50935B243947k9030l1610l4137l6527l8369l9251l9120l8244l7054l6148l6139
50924A848318l7198l8906m0796m2797m4917m6786m7966m8487m8617m8183m6701
$$ plain form
51004 616059 624824 633520 641798 649949 658590 667843 677211 686411 695914 706399 718054 730739 744498
50991 744498 759366 774833 790112 805089 820634 837785 856821 877249 898433 920037 942020
50980 942020 964418 987100 1009644 1031495 1052297 1071998 1090562 1107730 1123299 1137681 1152034
50969 1152034 1167753 1185948 1207544 1233709 1265800 1304650 1350096 1401499 1458627 1521660 1590254
50958 1590254 1663021 1738221 1814703 1891806 1968466 2042843 2112869 2176757 2232966 2280208 2317905
50947 2317905 2346480 2366764 2379122 2383404 2379773 2369367 2354105 2335877 2315822 2294115 2270309 2243947
50935 2243947 2214917 2183307 2149170 2112643 2074274 2035023 1995903 1957659 1920605 1884457 1848318
50924 1848318 1811120 1772214 1731418 1688621 1643704 1596918 1548952 1500465 1451848 1403665 1356964
50913A356964m4161m1186l8336l5699l3199l0786k8196k5107k1758j8910j6885
50902A022741j5200j3470j2109j1560j1316j0445q851p331o427n827m987l864
50890I11354k844k307k257k225j527O5J951L294L911M221M488M582M496M639N384
50875I37225O722Q392J0102J1477J2229J2557J3095J4236J5763J7306J8891K0720
50863A098715K2693K4563K6516K9149L2741L6910M1182M5688N0892N6843O3176
50852A529068O9949P7856Q7245R7382J07322J17203J27812J38994J49497J58600
50842B660928J66860J74730J81257J84982J85365J82401J75394J63302J46164
50833D221383J25179J01394P5219M7316J9031q222l3350n5243p2913q6175r5452
$$ plain form
50913 1356964 1312803 1271617 1233281 1197582 1164383 1133597 1105401 1080294 1058536 1039626 1022741
50902 1022741 1007541 994071 981962 970402 959086 948641 939790 932459 926032 920205 915218 911354
50890 911354 908510 906203 903946 901721 900194 900259 902210 905504 909415 913636 918124 922706 927202 931841 937225
50875 937225 943947 952339 962441 973918 986147 998704 1011799 1026035 1041798 1059104 1077995 1098715
50863 1098715 1121408 1145971 1172487 1201636 1234377 1271287 1312469 1358157 1409049 1465892 1529068
50852 1529068 1599017 1676873 1764118 1861500 1968822 2086025 2213837 2352831 2502328 2660928
50842 2660928 2827788 3002518 3183775 3368757 3554122 3736523 3911917 4075219 4221383
50833 4221383 4346562 4447956 4523175 4570491 4589522 4581300 4547950 4492707 4419794 4333619 4238167
50822D238167j00674j01224r7249r0239q1752p2362o2419n3237m6678m3808m4453
50811C444072m7785n2890n9047o5955p3628q1825q9803r6823j02538j06667j08769
50800B558342j08652j06537j02434r5959q7292p7748o8710o0316n1910m3389l5325
50789A720070k7868k0539j3205o562j268K836O287R121J0727J0552Q752O172L610
50776A708685J147j605m651p378r417j1212j3338j5677j7798j9818k2168k4775
50764A561995k7128k9108l0993l2670l3608l3711l3421l2730l0929k7751k4093
50753A225853k1016j8492j5797j2738r769p080m275j030K414N635Q519J1288J4285
50740A177797J7809K1908K6229L0344L4376L8976M4546N0708N6820O2849O9263
$$ plain form
50822 4238167 4137493 4036269 3939020 3848781 3767029 3694667 3632248 3579011 3532333 3488525 3444072
50811 3444072 3396287 3343397 3284350 3218395 3144767 3062942 2973139 2876316 2773778 2667111 2558342
50800 2558342 2449690 2343153 2240719 2144760 2057468 1979720 1911010 1850694 1798784 1755395 1720070
50789 1720070 1692202 1671663 1658458 1651896 1650628 1653464 1659751 1668872 1679599 1690151 1698903 1705075 1708685
50776 1708685 1709832 1708227 1703576 1696198 1686781 1675569 1662231 1646554 1628756 1608938 1586770 1561995
50764 1561995 1534867 1505759 1474766 1442096 1408488 1374777 1341356 1308626 1277697 1249946 1225853
50753 1225853 1204837 1186345 1170548 1157810 1148041 1140961 1136686 1135656 1138070 1143705 1152224 1163512 1177797
50740 1177797 1195606 1217514 1243743 1274087 1308463 1347439 1391985 1442693 1499513 1562362 1631625
50729A631625P6125Q2720Q8299R2882R7052J01052J04348J06059J05527J02552
50719B588241R7254Q9841Q0239O7985N2624L4406J4435n899k5447m3205n8040
50708B892434o8872p5187p7177p5376p0380o2981n4338m5658l7655l0446k4086
50697B270278j9064j6026j5182j6326j9419k4597l1336l8148m3672m7840n1390
50686A947278n4389n5912n5203n2436m8120m2395l5260k7063j8357r507p82P563
50674A555417J5543K3524L1638L9407M6226N1940N6579N9809O1139O0507N8301
50663B060030N4890N0506M5463M0113L4589K8943K3530J8910J5333J2635J0597
50652B395539R152Q047O667M488J726o66j754j349J37K439N725J0036J4883J9806
$$ plain form
50729 1631625 1707750 1790470 1878769 1971651 2068703 2169755 2274103 2380162 2485689 2588241
50719 2588241 2685495 2775336 2855575 2923560 2976184 3010590 3025025 3019126 2993679 2950474 2892434
50708 2892434 2823562 2748375 2671198 2595822 2525442 2462461 2408123 2362465 2324810 2294364 2270278
50697 2270278 2251214 2235188 2220006 2203680 2184261 2159664 2128328 2090180 2046508 1998668 1947278
50686 1947278 1892889 1836977 1781774 1729338 1681218 1638823 1603563 1576500 1558143 1548636 1547854 1555417
50674 1555417 1570960 1594484 1626122 1665529 1711755 1763695 1820274 1880083 1941222 2001729 2060030
50663 2060030 2114920 2165426 2210889 2251002 2285591 2314534 2338064 2356974 2372307 2384942 2395539
50652 2395539 2404691 2412738 2419405 2423893 2425619 2424953 2423199 2421850 2421987 2424426 2430151 2440187 2455070 2474876
50638B474876K4908L0300L5293L8955M1347M3212M4463M4078M1956L9756L9085
50627B898229L9620L9802L8449L4746K7446J5589k56j8579l8418n8850p7120q9046
50615B811612r2124q7354p7646o5370n1953l8600k6264j5308o010R23M943O394
50603B363243N932L510j375q644j7549k7492l8210m9002n8454o5316o9425p1450
50591A965768p1995p1185o8996o5635o1571n7292n3107m9088m5032m0620l5715
50580A345532l0606k5831k1685j8057j4748j1695q823o023l552k062j799j916
50568A198735j172O89K759M207N242O603Q601J0974J3462J6128J9261K3147K7854
50555A336490L2997L7969M2502M6907N1479N5810N8997O0528O0638N9740N7829
$$ plain form
50638 2474876 2499784 2530084 2565377 2604332 2645679 2688891 2733354 2777432 2819388 2859144 2898229
50627 2898229 2937849 2977651 3016100 3050846 3078292 3093881 3093625 3075046 3036628 2977778 2900658 2811612
50615 2811612 2719488 2632134 2554488 2489118 2437165 2398565 2372301 2356993 2350983 2351906 2356849 2363243
50603 2363243 2369175 2372685 2371310 2362666 2345117 2317625 2279415 2230413 2171959 2106643 2037218 1965768
50591 1965768 1893773 1822588 1753592 1687957 1626386 1569094 1515987 1466899 1421867 1381247 1345532
50580 1345532 1314926 1289095 1267410 1249353 1234605 1222910 1214087 1208064 1204512 1202450 1200651 1198735
50568 1198735 1197563 1198252 1201011 1205218 1210460 1217063 1225664 1236638 1250100 1266228 1285489 1308636 1336490
50555 1336490 1369487 1407456 1449958 1496865 1548344 1604154 1663151 1723679 1784317 1844057 1901886
50544A901886N4718N0722M6665M3190M0419L8538L8260M0192M3932M8380N3034
50533B399936N8330O4589P1209P7367Q3002Q8677R4754J01193J07845J14539J21004
50522C382445J27061J32536J36650J37928J35370J29392J21071J10701R7674Q1570
50512D592398O2629M1378J8543m749k7449m9251p0128q9290j05431j17913j26863
50501D123874j32052j32650j28319j19679j07430r1925p3916n4785l5456j5983
50491C231679L267K0688L4383M3349M7147M5081L6666K2492L884j7927m1624o5172
50479C363913q6308j03716j17141j26502j31550j32486j30300j26365j21759j16824
50469B170962j11083j03909r5611q7561q0815p4957o8808o2001n5195m8984m3339
$$ plain form
50544 1901886 1956604 2007326 2053991 2097181 2137600 2176138 2214398 2254590 2298522 2346902 2399936
50533 2399936 2458266 2522855 2594064 2671431 2754433 2843110 2937864 3039057 3146902 3261441 3382445
50522 3382445 3509506 3642042 3778692 3916620 4051990 4181382 4302453 4413154 4510828 4592398
50512 4592398 4655027 4696405 4714948 4710199 4682750 4633499 4563371 4474081 4368650 4250737 4123874
50501 4123874 3991822 3859172 3730853 3611174 3503744 3411819 3337903 3283118 3247662 3231679
50491 3231679 3234946 3255634 3290017 3333366 3380513 3425594 3462260 3484752 3488636 3470709 3429085 3363913
50479 3363913 3277605 3173889 3056748 2930246 2798696 2666210 2535910 2409545 2287786 2170962
50469 2170962 2059879 1955970 1860359 1772798 1691983 1617026 1548218 1486217 1431022 1382038 1338699
50458A338699l8140l3591k9831k6618k3589k0607j7722j5057j2758j0802q914
50447A101070o840m732k997j869j251p99PJ527L400M607M573M042M333N882P915
50432A118868R544J0635J1689J3287J5702J8674K1540K3922K6222K9021L2108
50421A331212L4598L6055L6944L7903L9108M0516M2272M4538M7264N0427N4298
50410A795135N9138O4762P0545P5773P9924Q2729Q4157Q4234Q2844P9747P4792
50399B633780O8002N9527M9661L8810K7248J4903J595j2564k7095m1346n4598
50388B757923o6189p5764q3240q8183q9568q6723q0420p2416o3792n4328m3612
50377A953688l2087k0694r999k40Q109J4299J7818J8598J6799J2590O067k715
$$ plain form
50458 1338699 1300559 1266968 1237137 1210519 1186930 1166323 1148601 1133544 1120786 1109984 1101070
50447 1101070 1094230 1089498 1086501 1084632 1083381 1082582 1082589 1084116 1087516 1092123 1096696 1100738 1105071 1110953 1118868
50432 1118868 1128412 1139047 1150736 1164023 1179725 1198399 1219939 1243861 1270083 1299104 1331212
50421 1331212 1365810 1401865 1438809 1476712 1515820 1556336 1598608 1643146 1690410 1740837 1795135
50410 1795135 1854273 1919035 1989580 2065353 2145277 2228006 2312163 2396397 2479241 2558988 2633780
50399 2633780 2701782 2761309 2810970 2849780 2877028 2891931 2893526 2880962 2853867 2812521 2757923
50388 2757923 2691734 2615970 2532730 2444547 2354979 2268256 2187836 2115420 2051628 1997300 1953688
50377 1953688 1921601 1900907 1890908 1890668 1898777 1913076 1930894 1949492 1966291 1978881 1984948 1982233
50365A982233j3413k5016l6074m5526n3162n9064o2983o4618o4255o2635o0230
50354A435257n7095n3394m9647m6319m3462m0857l8229l5288l1920k8511k5706
50343I84829k3644k1718j9418j7054j5193j3702j1959j0032q798q617q555p512
50331H18627n717m374m062m214m164l916l627l018j853n20L89Q81J437K240L014
50316G91123L567M017M487N026N876P359R340J1155J2392J3451J4992J6992J8742
50303I18519J9762K0357K1091K1945K2210K1143J8491J4432R363L875j297n610
50291A084281q912j1166j2129j1654j0212q670p521o635n803n027m072k222R11
50278I91169M554P159P705O416M224J807o81l204n358o473o315n527n104n343
$$ plain form
50365 1982233 1968820 1943804 1907730 1862204 1809042 1749978 1686995 1622377 1558122 1495487 1435257
50354 1435257 1378162 1324768 1275121 1228802 1185340 1144483 1106254 1070966 1039046 1010535 984829
50343 984829 961185 939467 920049 902995 887802 874100 862141 852109 843311 834694 826139 818627
50331 818627 812910 808536 804474 800260 796096 792180 788553 785535 783682 783162 783551 784432 785869 788109 791123
50316 791123 794690 798707 803194 808220 814096 821455 830795 841950 854342 867793 882785 899777 918519
50303 918519 938281 958638 979729 1001674 1023884 1045027 1063518 1077950 1087313 1091188 1089891 1084281
50291 1084281 1075369 1064203 1052074 1040420 1030208 1021538 1014017 1007382 1001579 996552 992480 990258 991169
50278 991169 995723 1002882 1010587 1017003 1021227 1023034 1022353 1019149 1013791 1007318 1001003 995476 990372 985029
50264I85029n645n447m957m634m396l793k847k104j799j416m44P76J364J026N19
50249I51232P92J819K627K524J902J604J818K049J971J718J450J202J228J800
50235I75736K570K749K224J803J991K243J960J508J626K330L200M243N681P252
50221A017116Q627J0268J2921J6373J9740K2921K6773L1685L6952M1861M6423
50210A291660N0600N3600N4615N3698N1437M8260M4590M1270L9082L8031L7430
50199A804273L6516L4675L1307K5906J8199Q030m604j9098l4019m7732n9152o7792
50187A726509p3381p5747p4938p1218o5133n7665n0003m2832l6116k9818k4599
50176A125059k1395k0468k1235k2883k4874k6790k8168k8534k7574k5301k2166
$$ plain form
50264 985029 979384 973937 968980 964346 959950 956157 953310 951206 949407 947991 947547 948323 949687 950713 951232
50249 951232 952024 953843 956470 958994 960896 962500 964318 966367 968338 970056 971506 972708 973936 975736
50235 975736 978306 981055 983279 985082 987073 989316 991276 992784 994410 996740 999940 1004183 1009864 1017116
50221 1017116 1025743 1036011 1048932 1065305 1085045 1107966 1134739 1166424 1203376 1245237 1291660
50210 1291660 1342260 1395860 1450475 1504173 1555610 1603870 1648460 1689730 1728812 1766843 1804273
50199 1804273 1840789 1875464 1906771 1932677 1950876 1958906 1954302 1935204 1901185 1853453 1794301 1726509
50187 1726509 1653128 1577381 1502443 1431225 1366092 1308427 1258424 1215592 1179476 1149658 1125059
50176 1125059 1103664 1083196 1061961 1039078 1014204 987414 959246 930712 903138 877837 855671
50165H55671j8854j5817j3044j0375p841n631l871k601j719q46M79K230L796M774
50151G86351N543O649P885Q453P937O615M903K976J033o17j937l248m647n703
50137H22193n961n455m451k954q96J399L410M949O156O942P016O485N970N802
50123H50605N605N014M442M552N228N744N981O772Q781J1463J3520J4205J3906
50110I55818J3763J4896J7682K1460K5083K7964L0531L3569L7442M2135M7686
50099A268029N4126O1295O9017P7236Q5656R3468R9770J04071J06043J05324J02168
50088B226203R7968R4359R1836Q9973Q8808Q8955R0001Q9639Q5084P4975N9593
50077C177394L9749J6262r619l5948o0611q2079r9690j13304j22819j28127j29572
$$ plain form
50165 855671 836817 821000 807956 797581 789740 784109 780238 777637 775918 775072 775551 777781 781577 786351
50151 786351 791894 798543 806428 814881 822818 829433 834336 837312 838345 837728 835791 832543 827896 822193
50137 822193 816232 810777 806326 803372 802476 803875 807285 812234 818390 825332 832348 838833 844803 850605
50123 850605 856210 861224 865666 870218 875446 881190 887171 893943 902724 914187 927707 941912 955818
50110 955818 969581 984477 1002159 1023619 1048702 1076666 1107197 1140766 1178208 1220343 1268029
50099 1268029 1322155 1383450 1452467 1529703 1615359 1708827 1808597 1912668 2018711 2124035 2226203
50088 2226203 2324171 2418530 2510366 2600339 2689147 2778102 2868103 2957742 3042826 3117801 3177394
50077 3177394 3217143 3233405 3223786 3187838 3127227 3045148 2945458 2832154 2709335 2581208 2451636
50066B451636j28111j24791j20088j13932j06211r7014q6746p6370o7213n9937
50056A471223n3897m8144m2852l8954l6423l3974l0668k6953k3651k0744j7765
50045A097198j4753j2077r696p267m810k751j413p45l90J85J286K511L114L075
50031A053467L289M311N444N661M972M212L740L071J683l16k340l786m438m776
50017A074194n592p037q301q740q859r557j0743j1510j1557j1540j1888j2104
50005I56766j1583j0512r450q416o896m597j780J134M077P359J1209J5301J8749
49992I61361K0716K0983K0012J8559J7333J6773J6859J7234J7657J8311J9473
49981A165271K1054K2682K4200K5882K8215L1597L6156M1545M6985N1578N4624
$$ plain form
50066 2451636 2323525 2198734 2078646 1964714 1858503 1761489 1674743 1598373 1531160 1471223
50056 1471223 1417326 1369182 1326330 1287376 1250953 1216979 1186311 1159358 1135707 1114963 1097198
50045 1097198 1082445 1070368 1060672 1053405 1048595 1045844 1044431 1043686 1043296 1043481 1044767 1047278 1050392 1053467
50031 1053467 1056756 1061067 1066511 1072172 1077144 1081356 1085096 1088167 1089850 1089534 1087194 1083408 1078970 1074194
50017 1074194 1068602 1061565 1053264 1044524 1035665 1026108 1015365 1003855 992298 980758 968870 956766
50005 956766 945183 934671 925221 916805 909909 905312 903532 904666 908743 916102 927311 942612 961361
49992 961361 982077 1003060 1023072 1041631 1058964 1075737 1092596 1109830 1127487 1145798 1165271
49981 1165271 1186325 1209007 1233207 1259089 1287304 1318901 1355057 1396602 1443587 1495165 1549789
49970A549789N5734N4910N2628M9585M6254M2932M0245L9006L9201L9561L8476
49959B048321L4987K8575J8638N005j1294k8519m5269o0451p2473p9617q1475
49948A756428p9313p4774o8784o1954n5215m9377m4502m0171l6137l2361k8788
49937A185052k5579k3392k2829k3644k4900k6028k7213k8668k9906l0198k9491
49926H93204k8382k7174k5473k2897j9789j6714j3642j0255o934m646l698l260
49914G10340k500j586j114j024p38NJ041K367M144O211Q077R472J0543J1527J2565
49899G69330J3722J4917J5841J6293J6359J6027J4891J2623R524O167K796n08
$$ plain form
49970 1549789 1605523 1660433 1713061 1762646 1808900 1851832 1892077 1931083 1970284 2009845 2048321
49959 2048321 2083308 2111883 2130521 2135526 2124232 2095713 2050444 1989993 1917520 1837903 1756428
49948 1756428 1677115 1602341 1533557 1471603 1416388 1367011 1322509 1282338 1246201 1213840 1185052
49937 1185052 1159473 1136081 1113252 1089608 1064708 1038680 1011467 982799 952893 922695 893204
49926 893204 864822 837648 812175 789278 769489 752775 739133 728878 721944 717298 713600 710340
49914 710340 707840 706254 705140 704116 703378 703383 704424 706791 710935 717146 725223 734695 745238 756765 769330
49899 769330 783052 797969 813810 830103 846462 862489 877380 890003 899527 905694 908490 907982
$$ [...]
##END NTUPLES=NMR SPECTRUM
##END=
