
##TITLE=AC1375_BRAA12187_7518783_2MIMsC2Fym
##JCAMPDX= 6.0         $$ Bruker NMR JCAMP-DX V2.0
##DATA TYPE= NMR SPECTRUM
##DATA CLASS= NTUPLES
##ORIGIN= BRUKER
##OWNER= Administrator
$$ 1.72 TOPSPIN		Version 2.1
$$ 2013-02-21 02:38:32.112 -0500  Administrator@X
$$ Compression mode = diff/dup
##.OBSERVE FREQUENCY= 400.02188249412
##.OBSERVE NUCLEUS= ^1H
##.ACQUISITION MODE= SIMULTANEOUS (DQD)
##.ACQUISITION SCHEME= undefined
##.AVERAGES= 64
##.DIGITISER RES= 22
##SPECTROMETER/DATA SYSTEM= spect
##.PULSE SEQUENCE= noesygpps1d.comp
##.SOLVENT NAME= COFFEE_meoh
##.SHIFT REFERENCE= INTERNAL, COFFEE_meoh, 1, 14.96077
##AUDIT TRAIL= $$ (NUMBER, WHEN, WHO, WHERE, PROCESS, VERSION, WHAT)
$$ ##TITLE= Audit trail, TOPSPIN		Version 2.1
$$ ##JCAMPDX= 5.01
$$ ##ORIGIN= Bruker BioSpin GmbH
$$ ##OWNER= Administrator
$$ $$ E:\/data/COFFEE/nmr/AC1375_BRAA12187_7518783_2MIMsC2Fym/12/pdata/1/auditp.txt
$$ ##AUDIT TRAIL=  $$ (NUMBER, WHEN, WHO, WHERE, PROCESS, VERSION, WHAT)
(   1,<2013-02-21 02:38:25.509 -0500>,<Administrator>,<X>,<go>,<TOPSPIN 2.1>,
      <created by zg
	started at 2013-02-21 02:26:55.294 -0500,
	POWCHK enabled, PULCHK disabled,
       configuration hash MD5:
       86 BA 57 50 F2 9D 5C 9B 26 00 A9 28 5F 66 2E 89
       data hash MD5: 64K
       F9 48 56 21 59 3E 1A 01 6B 5E DE FE EA E8 EC EB>)
(   2,<2013-02-21 02:38:28.915 -0500>,<Administrator>,<X>,<proc1d>,<TOPSPIN 2.1>,
      <Start of raw data processing
       efp LB = 0.3 FT_mod = 6 PKNL = 1 PHC0 = 0 PHC1 = 0 SI = 128K 
       data hash MD5: 128K
       91 BE 73 BA F6 4D 1B 6D DB D7 05 10 C6 3F CF 87>)
(   3,<2013-02-21 02:38:30.187 -0500>,<Administrator>,<X>,<proc1d>,<TOPSPIN 2.1>,
      <pk PHC0 = 252.3779 PHC1 = 0 
       data hash MD5: 128K
       11 D0 49 60 E3 E3 4A 2B 68 2D B7 41 EB 08 11 19>)
(   4,<2013-02-21 02:38:30.926 -0500>,<Administrator>,<X>,<proc1d>,<TOPSPIN 2.1>,
      <abs ABSG = 1 
       data hash MD5: 128K
       7F CC 2B E1 89 0B 24 3C 4A BF D9 02 F1 DD 4F BE>)
(   5,<2013-02-21 02:38:31.115 -0500>,<Administrator>,<X>,<proc1d>,<TOPSPIN 2.1>,
      <abs ABSG = 2 
       data hash MD5: 128K
       53 BA 86 19 33 92 CA E2 25 00 F9 63 92 D9 91 E2>)
(   6,<2013-02-21 02:38:31.322 -0500>,<Administrator>,<X>,<proc1d>,<TOPSPIN 2.1>,
      <abs ABSG = 3 
       data hash MD5: 128K
       C1 DF DB CB CC 33 A9 BF C3 38 11 54 03 76 B2 AD>)
(   7,<2013-02-21 02:38:31.511 -0500>,<Administrator>,<X>,<proc1d>,<TOPSPIN 2.1>,
      <abs ABSG = 4 
       data hash MD5: 128K
       9D E9 80 5E 70 7C 8C CF F9 D1 E3 E5 0F B3 2F AA>)
(   8,<2013-02-21 02:38:31.734 -0500>,<Administrator>,<X>,<proc1d>,<TOPSPIN 2.1>,
      <abs ABSG = 5 
       data hash MD5: 128K
       A6 10 C6 C9 89 E7 F6 E3 FF CE 80 6D 3E 62 7B 72>)
$$ ##END=
$$ 
$$ $$ hash MD5
$$ $$ 0F A0 61 97 AE E9 9A 8F 15 BB 22 5B 8D 20 79 E6
##$RELAX= 
##$RELAX= 
##$RELAX= 
##$RELAX= 
##$RELAX= 
##$RELAX= 
##$RELAX= 
##$RELAX= 
$$ Bruker specific parameters
$$ --------------------------
##$DU= <E:\>
##$EXPNO= 12
$$ [...]
150 150 150 150 150 150 150 150
##$TP07= 0
##$TPNAME0= <>
##$TPNAME1= <>
##$TPNAME2= <>
##$TPNAME3= <>
##$TPNAME4= <>
##$TPNAME5= <>
##$TPNAME6= <>
##$TPNAME7= <>
##$TPOAL= (0..7)
0.5 0.5 0.5 0.5 0.5 0.5 0.5 0.5
##$TPOFFS= (0..7)
0 0 0 0 0 0 0 0
##$TUNHIN= 0
##$TUNHOUT= 0
##$TUNXOUT= 0
##$USERA1= <user>
##$USERA2= <user>
##$USERA3= <user>
##$USERA4= <user>
##$USERA5= <user>
##$V9= 5
##$VALIST= <valist>
##$VCLIST= <CCCCCCCCCCCCCCC>
##$VD= 0
##$VDLIST= <DDDDDDDDDDDDDDD>
##$VPLIST= <PPPPPPPPPPPPPPP>
##$VTLIST= <TTTTTTTTTTTTTTT>
##$WBST= 1024
##$WBSW= 4
##$XGAIN= (0..3)
0 0 0 0
##$XL= 0
##$YL= 0
##$YMAX_a= 6281331
##$YMIN_a= -10704296
##$ZGOPTNS= <>
##$ZL1= 120
##$ZL2= 120
##$ZL3= 120
##$ZL4= 120
##$ABSF1= 14.96077
##$ABSF2= -5.597412
##$ABSG= 5
##$ABSL= 3
##$ALPHA= 0
##$AQORDER= 0
##$ASSFAC= 0
##$ASSFACI= 0
##$ASSFACX= 0
##$ASSWID= 0
##$AUNMP= <proc_prof1d_extract.lims>
##$AXLEFT= 0
##$AXNAME= <>
##$AXNUC= <1H>
##$AXRIGHT= 0
##$AXTYPE= 0
##$AXUNIT= <>
##$AZFE= 0.1
##$AZFW= 0.1
##$BCFW= 0
##$BC_mod= 0
##$BYTORDP= 0
##$COROFFS= 0
##$CY= 15
##$DATMOD= 1
##$DC= 0
##$DFILT= <>
##$DTYPP= 0
##$F1P= 0
##$F2P= 0
##$FCOR= 0.5
##$FTSIZE= 131072
##$FT_mod= 6
##$GAMMA= 0
##$GB= 0
##$INTBC= 1
##$INTSCL= 1
##$ISEN= 128
##$LB= 0.3
##$LEV0= 0
##$LPBIN= 0
##$MAXI= 10000
##$MC2= 0
##$MEAN= 0
##$ME_mod= 0
##$MI= 0
##$NCOEF= 0
##$NC_proc= -2
##$NLEV= 6
##$NOISF1= 0
##$NOISF2= 0
##$NSP= 0
##$NTH_PI= 0
##$NZP= 0
##$OFFSET= 14.96077
##$PC= 1
##$PHC0= 252.3779
##$PHC1= 0
##$PH_mod= 1
##$PKNL= yes
##$PPARMOD= 0
##$PPDIAG= 0
##$PPIPTYP= 0
##$PPMPNUM= 2147483647
##$PPRESOL= 1
##$PSCAL= 4
##$PSIGN= 0
##$PYNMP= <proc.py>
##$REVERSE= no
##$SF= 400.020009727415
##$SI= 131072
##$SIGF1= 0
##$SIGF2= 0
##$SINO= 400
##$SIOLD= 131072
##$SPECTYP= <>
##$SREGLST= <1H.CDCl3>
##$SSB= 0
##$STSI= 131072
##$STSR= 0
##$SW_p= 8223.68421052631
##$SYMM= 0
##$S_DEV= 0
##$TDeff= 65536
##$TDoff= 0
##$TI= <>
##$TILT= no
##$TM1= 0
##$TM2= 0
##$TOPLEV= 0
##$USERP1= <user>
##$USERP2= <user>
##$USERP3= <user>
##$USERP4= <user>
##$USERP5= <user>
##$WDW= 1
##$XDIM= 131072
##$YMAX_p= 404529207
##$YMIN_p= -11333
##$CURPLOT= <Network HP LaserJet P1505>
##$CURPRIN= <$Network HP LaserJet P1505>
##$DFORMAT= <normdp>
##$LAYOUT= <+/1D_H.xwp>
##$LFORMAT= <normlp>
##$PFORMAT= <normpl>
##$SURQMSG= 1
$$ End of Bruker specific parameters
$$ ---------------------------------
##NTUPLES= NMR SPECTRUM
##VAR_NAME=  FREQUENCY,     SPECTRUM/REAL,   SPECTRUM/IMAG
##SYMBOL=    X,             R,               I
##VAR_TYPE=  INDEPENDENT,   DEPENDENT,       DEPENDENT
##VAR_FORM=  AFFN,          ASDF,            ASDF
##VAR_DIM=   131072,        131072,          131072
##UNITS=     HZ,            ARBITRARY UNITS, ARBITRARY UNITS
##FACTOR=    0.0627417313425164, 1,          1
##FIRST=     8223.62146879497, 2085,         -59568
##LAST=      0,             3499,            -59748
##MIN=       0,             -11333,          0
##MAX=       8223.62146879497, 404529207,    0
$$ Real data points
##PAGE= N=1
##DATA TABLE= (X++(R..R)), XYDATA
$$ [...]
$$ plain form
63914 3541895 3284070 3034711 2796767 2572193 2362942 2171121 1998099 1843903 1707537
63905 1707537 1587497 1482084 1389798 1309666 1240809 1181632 1129927 1083943 1042968 1006591 973935
63894 973935 943993 916351 890982 867514 845239 823848 803632 784851 767307 750799 735653
63883 735653 722555 711996 704140 699104 697077 698109 701988 708460 717441 728954 742926 759155 777433
63870 777433 797548 819196 842072 866024 890874 915963 940172 962678 983519 1003122 1021318
63859 1021318 1037161 1049668 1058410 1063397 1064820 1063037 1058426 1050950 1040071 1025372 1007145 986236
63847 986236 963451 939244 913738 886878 858724 829790 800917 772662 745033 717902 691340
63836 691340 665242 639067 612463 585989 560689 537009 514607 493190 473005 454367 437183
$$ packed form
63914C541895k57825k49359k37944k24574k09251j91821j73022j54196j36366
63905A707537j20040j05413r2286q0132o8857n9177n1705m5984m0975l6377l2656
63894I73935k9942k7642k5369k3468k2275k1391k0216j8781j7544j6508j5146
63883G35653j3098j0559p856n036k027J032L879O472Q981J1513J3972J6229J8278
63870G77433K0115K1648K2876K3952K4850K5089K4209K2506K0841J9603J8196
63859A021318J5843J2507Q742M987J423j783m611p476j0879j4699j8227k0909
63847I86236k2785k4207k5506k6860k8154k8934k8873k8255k7629k7131k6562
63836F91340k6098k6175k6604k6474k5300k3680k2402k1417k0185j8638j7184
$$ plain form
63825 437183 421151 406135 392149 379281 367716 357531 348262 339058 329567 320428 312578 306200 300647
63812 300647 295284 290050 285254 281134 277722 274929 272612 270629 268930 267532 266322 264973 263244 261409
63798 261409 260166 259881 260009 259558 258155 256304 254483 252437 249715 246592 243843 241753 239941 238190 236835
63783 236835 236017 235089 233237 230505 227789 225918 224988 224542 224103 223503 222835 222178 221427 220495 219644 219326 219634
63766 219634 220094 220113 219446 218214 216757 215580 215139 215435 215976 216327 216468 216511 216438 216346 216614 217449 218504 219315 219839
63747 219839 220240 220389 220141 219899 220341 221676 223667 226261 229511 232915 235605 237496 239513 242269 245132
63732 245132 247163 248514 250190 252701 255619 258427 261122 263839 266436 268817 271336 274560 278706 283506
63718 283506 288537 293537 298394 302939 306834 309776 311847 313498 314942 315663 314820 312198 308533 304822 301599
$$ packed form
63825D37183j6032j5016j3986j2868j1565j0185r269r204r491r139p850o378n553
63812C00647n363n234m796m120l412k793k317j983j699j398j210j349j729j835
63798B61409j243k85J28m51j403j851j821k046k722l123k749k090j812j751j355
63783B36835q18r28j852k732k716j871r30m46m39o00o68o57p51r32q51l18L08
63766B19634M60J9o67j232j457j177m41K96N41L51J41M3p3r2K68Q35J055Q11N24
63747B19839M01J49k48k42M42J335J991K594L250L404K690J891K017K756K863
63732B45132K031J351J676K511K918K808K695K717K597K381K519L224M146M800
63718B83506N031N000M857M545L895K942K071J651J444P21q43k622l665l711l223
$$ plain form
63703 301599 299023 297269 296353 295698 294454 292484 290734 290309 291372 293224 295249 297324 299277 300549 300877
63688 300877 301101 302708 306394 311305 315887 319206 321286 322431 322789 322667 322792 323728 325157 326100 326023 325408
63672 325408 325058 325149 325302 325452 326096 327549 329387 330956 332173 333403 334639 335249 334655 332907 330455 327626
63656 327626 324568 321443 318259 314597 309937 304483 299399 295912 294198 293307 292145 290326 288098 285817
63642 285817 283805 282543 282533 283789 285719 287747 289958 292876 296701 301084 305681 310603 316076 321948 327843
63627 327843 333745 340056 346988 354215 361314 368308 375530 383165 391346 400606 411719 424820 439023
63614 439023 453288 467550 482728 499724 518791 539806 562800 588056 615918 646533 679491
63603 679491 713641 747588 780455 811798 840545 864546 881717 891494 894811 892978 887180 878871
$$ packed form
63703C01599k576j754r16o55j244j970j750m25J063J852K025K075J953J272L28
63688C00877K24J607L686M911M582L319K080J145L58j22J25R36J429R43p7o15
63672C25408l50R1J53J50O44J453J838J569J217J230J236O10n94j748k452k829
63656C27626l058l125l184l662m660n454n084l487j714q91j162j819k228k281
63642B85817k012j262j0J256J930K028K211K918L825M383M597M922N473N872N895
63627C27843N902O311O932P227P099O994P222P635Q181R260J1113J3101J4203
63614D39023J4265J4262J5178J6996J9067K1015K2994K5256K7862L0615L2958
63603F79491L4150L3947L2867L1343K8747K4001J7171R777L317j833n798q309
$$ plain form
63591 878871 869695 860508 850930 840245 828393 815639 801559 785011 765172 742264 717227 691046
63579 691046 664568 638689 614359 592285 572701 555409 540078 526525 514750 504749 496439 489820
63567 489820 485090 482477 481996 483463 486636 491162 496484 502101 508029 514815 522970 532451 542826 553809
63553 553809 565496 578200 592243 607984 625891 646440 669973 696761 727244 761994 801220
63542 801220 844151 888908 932954 973467 1007385 1031774 1044997 1047808 1042881 1032992 1019843 1004722
63530 1004722 989585 976566 966261 957146 947021 934723 920133 903035 882614 858124 829487
63519 829487 797125 761706 724385 686970 651263 618148 587534 559143 533021 509244 487554
63508 487554 467629 449527 433539 419713 407872 398037 390402 384698 379961 375259 370460 365927 361678
$$ packed form
63591H78871r176r187r578j0685j1852j2754j4080j6548j9839k2908k5037k6181
63579F91046k6478k5879k4330k2074j9584j7292j5331j3553j1775j0001q310o619
63567D89820m730k613m81J467L173M526N322N617N928O786Q155R481J0375J0983
63553E53809J1687J2704J4043J5741J7907K0549K3533K6788L0483L4750L9226
63542H01220M2931M4757M4046M0513L3918K4389J3223K811m927r889j3149j5121
63530A004722j5137j3019j0305r115j0125j2298j4590j7098k0421k4490k8637
63519H29487l2362l5419l7321l7415l5707l3115l0614k8391k6122k3777k1690
63508D87554j9925j8102j5988j3826j1841r835p635n704m737m702m799m533m249
$$ plain form
63495 361678 357346 352994 349426 347343 346476 345899 345075 344258 343925 344118 344458 344629 344734 345212 346418 348256 350350
63478 350350 352606 355460 359342 363989 368559 372387 375429 377966 380173 382006 383180 383101 381152 377331 372522
63463 372522 367898 364087 361018 358318 355677 352985 350443 348500 347409 346878 346435 346076 346264 347273 348923
63448 348923 351055 353890 357681 362310 367508 373271 379694 386685 394293 403244 414517 428129 442813
63435 442813 457348 472111 489006 509902 535351 564517 595698 626671 655048 679013 698003
63424 698003 712563 723622 732033 738833 745537 753851 765107 780132 799527 823726 852654 885571
63412 885571 921431 959254 997901 1035638 1070265 1099717 1122401 1137150 1143414 1141776 1133973 1122141
63400 1122141 1108133 1093456 1079183 1065402 1051052 1034822 1016062 994439 969115 939111 904590
$$ packed form
63495C61678m332m352l568k083q67n77q24q17l33J93L40J71J05M78J206J838K094
63478C50350K256K854L882M647M570L828L042K537K207J833J174p9j949l821m809
63463C72522m624l811l069k700k641k692k542j943j091n31m43l59J88J009J650
63448C48923K132K835L791M629N198N763O423O991P608Q951J1273J3612J4684
63435D42813J4535J4763J6895K0896K5449K9166L1181L0973K8377K3965J8990
63424F98003J4560J1059Q411O800O704Q314J1256J5025J9395K4199K8928L2917
63412H85571L5860L7823L8647L7737L4627K9452K2684J4749O264j638p803j1832
63400A122141j4008j4677j4273j3781j4350j6230j8760k1623k5324l0004l4521
$$ plain form
63389 904590 867132 828681 790774 754661 721174 690074 660406 632109 606660 585404 567860
63378 567860 552469 538636 527094 518489 512541 508690 506690 506415 507737 510845 516144 523634 532861 543635
63364 543635 556305 571170 588143 607187 628562 652386 678427 706549 736962 769773 804709
63353 804709 841568 880448 921123 962415 1002434 1039163 1070707 1095527 1112925 1123174 1126931 1124851
63341 1124851 1117865 1107336 1094504 1080126 1064937 1049880 1035195 1019563 1000859 977823 950788
63330 950788 920981 889487 856787 822912 788102 753435 720562 690628 663821 640239 620623
63319 620623 605677 595083 587811 583060 580087 577253 572083 562580 548232 529914 509345 488514 468892
63306 468892 450922 434467 419647 406796 395872 386550 378829 372836 368017 363299 358296 353683 350086
$$ packed form
63389I04590l7458l8451l7907l6113l3487l1100k9668k8297k5449k1256j7544
63378E67860j5391j3833j1542q605n948l851k000k75J322L108N299P490R227J0774
63364E43635J2670J4865J6973J9044K1375K3824K6041K8122L0413L2811L4936
63353H04709L6859L8880M0675M1292M0019L6729L1544K4820J7398J0249L757k080
63341A124851o986j0529j2832j4378j5189j5057j4685j5632j8704k3036k7035
63330I50788k9807l1494l2700l3875l4810l4667l2873k9934k6807k3582j9616
63319F20623j4946j0594p272m751k973k834n170r503j4348j8318k0569k0831j9622
63306D68892j7970j6455j4820j2851j0924r322p721n993m819m718n003m613l597
$$ plain form
63293 350086 347177 344268 341286 338667 336614 334943 333511 332356 331372 330099 327966 324838 321366 318590
63279 318590 316954 315837 314321 312315 310555 309661 309633 310183 310967 311454 311156 310252 309565 309728 310694 312166 314095
63262 314095 316557 319522 322941 326807 331008 335358 339782 344190 348240 351720 355126 359293 364398 369882
63248 369882 375401 381211 387394 393572 399843 407324 417090 428909 441608 454450 467780 482489 499295
63235 499295 518368 539312 561541 584774 609014 634087 659607 685459 711784 738317 764282
63224 764282 789252 813584 837679 861364 884435 907313 930646 954548 978688 1002756 1026459
63213 1026459 1049307 1070647 1089588 1104730 1114609 1118747 1117617 1111194 1098425 1078808 1053663 1024939
63201 1024939 993479 959553 924482 890317 858048 827482 798922 773748 752993 736382 723234
$$ packed form
63293C50086k909k909k982k619k053j671j432j155r84j273k133l128l472k776
63279C18590j636j117j516k006j760q94k8N50P84M87k98r04o87J63R66J472J929
63262C14095K462K965L419L866M201M350M424M408M050L480L406M167N105N484
63248C69882N519N810O183O178O271P481R766J1819J2699J2842J3330J4709J6806
63235D99295J9073K0944K2229K3233K4240K5073K5520K5852K6325K6533K5965
63224G64282K4970K4332K4095K3685K3071K2878K3333K3902K4140K4068K3703
63213A026459K2848K1340J8941J5142R879M138j130o423j2769j9617k5145k8724
63201A024939l1460l3926l5071l4165l2269l0566k8560k5174k0755j6611j3148
$$ plain form
63190 723234 713486 707409 705018 706209 710855 718381 727801 738617 751236 766139 783034 801183 820135
63177 820135 839699 859466 878818 897330 914918 931734 948058 964185 980210 995871 1010521
63166 1010521 1023170 1032792 1038802 1041118 1039499 1033108 1021204 1004057 982640 957549 928863 897039
63154 897039 863271 828848 794677 761484 729839 699804 671152 644201 619876 598724 580384
63143 580384 564235 550027 537558 526452 516696 508909 503431 499439 495564 491251 487094 483902 481797
63130 481797 480270 478900 477909 477944 479173 480808 481939 482728 484213 486846 489916 492743 495758 499854 505072
63115 505072 510482 515120 518631 521209 523408 525881 528886 532142 535358 538675 542255 545744 548575 550634
63101 550634 552251 553636 554772 555795 557014 558490 559911 561019 561995 563298 565110 566997 568244 568700 569075
$$ packed form
63190G23234r748o077k391J191M646P526R420J0816J2619J4903J6895J8149J8952
63177H20135J9564J9767J9352J8512J7588J6816J6324J6127J6025J5661J4650
63166A010521J2649R622O010K316j619o391j1904j7147k1417k5091k8686l1824
63154H97039l3768l4423l4171l3193l1645l0035k8652k6951k4325k1152j8340
63143E80384j6149j4208j2469j1106r756p787n478l992l875m313m157l192k105
63130D81797j527j370r91L5J229J635J131P89J485K633L070K827L015M096N218
63115E05072N410M638L511K578K199K473L005L256L216L317L580L489K831K059
63101E50634J617J385J136J023J219J476J421J108R76J303J812J887J247M56L75
$$ plain form
63086 569075 570071 571365 572031 571980 572244 573594 575613 577621 579821 582839 586668 590878 595521 600967 607061
63071 607061 613357 620135 628303 638150 648992 660233 672067 684914 698893 714235 731589 751492
63059 751492 774036 799404 828130 860290 895000 931486 970357 1013109 1060472 1111922 1166685
63048 1166685 1224381 1284514 1346137 1408532 1471700 1535679 1599755 1662899 1724714 1785378 1844838
63037 1844838 1902760 1959366 2015672 2072546 2129825 2186509 2241328 2292841 2339415 2379546 2411956
63026 2411956 2435033 2446623 2444933 2429492 2400750 2359140 2305316 2241172 2169640 2093181 2013150
63015 2013150 1930923 1848920 1769985 1696246 1629074 1569663 1518934 1476989 1443216 1417008 1398179
63004 1398179 1386832 1383127 1387030 1397871 1414216 1434441 1457554 1483387 1512123 1543668 1577229 1611431
$$ packed form
63086E69075R96J294O66n1K64J350K019K008K200L018L829M210M643N446O094
63071F07061O296O778Q168R847J0842J1241J1834J2847J3979J5342J7354J9903
63059G51492K2544K5368K8726L2160L4710L6486L8871M2752M7363N1450N4763
63048A166685N7696O0133O1623O2395O3168O3979O4076O3144O1815O0664N9460
63037A844838N7922N6606N6306N6874N7279N6684N4819N1513M6574M0131L2410
63026B411956K3077J1590j690j5441k8742m1610n3824o4144p1532p6459q0031
63015B013150q2227q2003p8935p3739o7172n9411n0729m1945l3773k6208j8829
63004A398179j1347l705L903J0841J6345K0225K3113K5833K8736L1545L3561L4202
$$ plain form
62992 1611431 1645142 1678330 1711743 1745545 1778718 1810054 1839218 1866321 1890887 1911803 1927978
62981 1927978 1938361 1941578 1936336 1922200 1899383 1867798 1827098 1777862 1722063 1661973 1598984 1533805
62969 1533805 1467510 1401896 1338837 1279396 1223618 1171221 1122527 1078469 1039469 1004580 972185
62958 972185 941385 912265 884951 859120 834517 811333 789749 769569 750596 732954 716664
62947 716664 701201 685798 670053 654111 638518 624096 611557 600818 590915 580931 570852 561216
62935 561216 552144 543250 534492 526629 520509 516115 512527 508802 504741 500799 497434 494707 492452 490626
62921 490626 489375 488851 489112 490041 491174 491748 491215 489768 488104 486651 485228 483429 481071 478230 475134
62906 475134 472119 469429 466924 464224 461196 458038 454741 450845 446090 441105 437081 434763 433978 434092 434634
$$ packed form
62992A611431L3711L3188L3413L3802L3173L1336K9164K7103K4566K0916J6175
62981A927978J0383L217n242j4136k2817l1585m0700m9236n5799o0090o2989o5179
62969A533805o6295o5614o3059n9441n5778n2397m8694m4058l9000l4889l2395
62958I72185l0800k9120k7314k5831k4603k3184k1584k0180j8973j7642j6290
62947G16664j5463j5403j5745j5942j5593j4422j2539j0739r903r984j0079r636
62935E61216r072q894q758p863o120m394l588l725m061l942l365k727k255j826
62921D90626j251n24K61R29J133N74n33j447j664j453j423j799k358k841l096
62906D75134l015k690k505k700l028l158l297l896m755m985m024k318p85J14N42
$$ plain form
62891 434634 435458 436501 437538 438142 437924 436890 435523 434392 433687 433235 432913 432857 433236 434006 435085 436639 438916
62874 438916 441684 444083 445340 445557 445460 445398 444943 443667 441880 440263 438984 437697 436331 435364 435152 435359
62858 435359 435293 434672 433887 433618 434286 435768 437501 438942 439877 440286 440039 438991 437406 436000 435411 435739 436597
62841 436597 437460 437927 437820 437118 435820 433976 431959 430499 430066 430219 429943 428763 427293 426597 427223 428954
62825 428954 431219 433540 435713 437741 439603 441151 442389 443788 446036 449431 453659 458117 462232 465633
62811 465633 468449 471449 475439 480425 485788 491329 497569 504870 512882 521186 529883 539093 548476 557933
62797 557933 568375 580972 595791 611855 628439 645584 663408 681829 701293 723032 748083
62786 748083 776511 808131 843592 884142 930475 982443 1039944 1103534 1173881 1250979 1334275
$$ packed form
62891D34634Q24J043J037O04k18j034j367j131p05m52l22n6L79P70J079J554K277
62874D38916K768K399J257K17r7o2m55j276j787j617j279j287j366r67k12K07
62858D35359o6o21p85k69O68J482J733J441R35M09k47j048j585j406n89L28Q58
62841D36597Q63M67j07p02j298j844k017j460m33J53k76j180j470o96O26J731
62825D28954K265K321K173K028J862J548J238J399K248L395M228M458M115L401
62811D65633K816L000L990M986N363N541O240P301Q012Q304Q697R210R383R457
62797E57933J0442J2597J4819J6064J6584J7145J7824J8421J9464K1739K5051
62786G48083K8428L1620L5461M0550M6333N1968N7501O3590P0347P7098Q3296
$$ plain form
62775 1334275 1423313 1517770 1616743 1718390 1820501 1921193 2018711 2110609 2193548 2264083 2319597
62764 2319597 2358498 2379879 2383294 2368848 2337325 2290186 2229399 2157135 2075566 1986958 1893814
62753 1893814 1798547 1702906 1607983 1514910 1425245 1340379 1260822 1186406 1117095 1053232 995026
62742 995026 942137 893843 849462 808638 771461 738334 709501 684599 662774 643269 625781
62731 625781 610356 597114 586074 576952 569139 562145 556123 551682 549000 547388 545955 544556 543812 544288
62717 544288 546010 548873 553203 559563 568014 577906 588587 600253 613864 630239 649424 671016 694879
62704 694879 721387 751146 784738 822693 865375 912773 964563 1020573 1081001 1146019 1215170
62693 1215170 1287405 1361721 1437526 1514171 1590209 1663375 1731293 1791997 1843720 1884475 1912191
$$ packed form
62775A334275Q9038R4457R8973J01647J02111J00692R7518R1898Q2939P0535N5514
62764B319597L8901K1381L415j4446l1523m7139o0787p2264q1569q8608r3144
62753A893814r5267r5641r4923r3073q9665q4866p9557p4416o9311o3863n8206
62742I95026n2889m8294m4381m0824l7177l3127k8833k4902k1825j9505j7488
62731F25781j5425j3242j1040r122p813o994o022m441k682j612j433j399p44M76
62717E44288J722K863M330O360Q451R892J0681J1666J3611J6375J9185K1592K3863
62704F94879K6508K9759L3592L7955M2682M7398N1790N6010O0428O5018O9151
62693A215170P2235P4316P5805P6645P6038P3166O7918O0704N1723M0755K7716
$$ plain form
62682 1912191 1925324 1923265 1906303 1875447 1832261 1778589 1716176 1646520 1571108 1491767 1410812
62671 1410812 1330795 1253952 1181598 1113951 1050492 990590 934032 881337 833604 791628 754844
62660 754844 721455 689970 660405 633626 609851 588462 569108 552139 537782 525570 514892
62649 514892 505509 497086 488755 479675 469848 460017 450968 443181 436808 431616 427150 423247 420170 418035
62635 418035 416513 415397 415054 415810 417258 418675 419844 420877 421484 421127 419844 418286 416858 415395 413761
62620 413761 412240 411145 410534 410520 411524 413881 417407 421527 425791 430247 435430 441952 449938 458951 468576
62605 468576 478835 489782 501062 512384 524340 538219 554992 574802 597422 622760 650960
62594 650960 682413 717609 756572 798536 842617 888671 936831 986235 1034932 1081119 1123739
$$ packed form
62682A912191J3133k059j6962l0856m3186n3672o2413o9656p5412p9341q0955
62671A410812q0017p6843p2354o7647o3459n9902n6558n2695m7733m1976l6784
62660G54844l3389l1485k9565k6779k3775k1389j9354j6969j4357j2212j0678
62649E14892r383q423q331r080r827r831r049p787o373n192m466l903l077k135
62635D18035j522j116l43P56J448J417J169J033O07l57j283j558j428j463j634
62620D13761j521j095o11j4J004K357L526M120M264M456N183O522P986R013R625
62605D68576J0259J0947J1280J1322J1956J3879J6773J9810K2620K5338K8200
62594F50960L1453L5196L8963M1964M4081M6054M8160M9404M8697M6187M2620
$$ plain form
62583 1123739 1161741 1193542 1217643 1233107 1239110 1234819 1220403 1197608 1168616 1134609 1095993 1053601
62571 1053601 1008882 963079 916933 871238 827087 785406 746620 710890 678360 649027 622560
62560 622560 598401 576095 555643 537565 522368 509846 499186 489835 481856 475250 469500 464224
62548 464224 459791 456626 454238 451698 448928 446753 445628 445073 444566 444259 444426 444778 444876 444897 445442 446707 448302
62531 448302 449893 451622 453694 455823 457441 458615 460593 465151 473211 484143 496573 509851 524606
62518 524606 541919 562175 584867 609474 636344 666539 700746 738541 778948 821468 866025
62507 866025 911862 957215 1000527 1041454 1080068 1115370 1145360 1168500 1184408 1193120 1194472 1188532
62495 1188532 1176080 1158209 1135857 1110118 1082693 1055586 1030498 1008721 991291 978755 970951
$$ packed form
62583A123739L8002L1801K4101J5464O003m291j4416k2795k8992l4007l8616m2392
62571A053601m4719m5803m6146m5695m4151m1681l8786l5730l2530k9333k6467
62560F22560k4159k2306k0452j8078j5197j2522j0660r351p979o606n750n276
62548D64224m433l165k388k540k770k175j125n55n07l07J67L52R8K1N45J265J595
62531D48302J591J729K072K129J618J174J978M558Q060J0932J2430J3278J4755
62518E24606J7313K0256K2692K4607K6870L0195L4207L7795M0407M2520M4557
62507H66025M5837M5353M3312M0927L8614L5302K9990K3140J5908Q712J352n940
62495A188532j2452j7871k2352k5739k7425k7107k5088k1777j7430j2536p804
$$ plain form
62484 970951 967532 968781 975540 988251 1006361 1028811 1054918 1084628 1118025 1154734 1193676 1233173
62472 1233173 1271175 1305485 1334003 1355040 1367587 1371383 1366697 1353967 1333491 1305320 1269571 1226972
62460 1226972 1179009 1127357 1073241 1017597 961758 907507 856264 808578 764665 725061 690245
62449 690245 659827 632732 608364 587170 569901 556620 546648 539127 533388 529028 526085 525016 526098
62436 526098 528825 532192 535614 539190 543015 546653 549509 551293 551739 550255 546432 540800 534463 527881
62422 527881 520500 511698 501625 490904 480037 469500 460011 452123 445686 440117 435102 430631 426523
62409 426523 422504 418785 415945 414044 412256 409784 406845 404363 402840 401853 400664 399019 397250 395746
62395 395746 394565 393634 393188 393791 395778 398807 402135 405250 408037 410431 412272 413623 414987 416962 419775
$$ packed form
62484I70951l419J249O759J2711J8110K2450K6107K9710L3397L6709L8942L9497
62472A233173L8002L4310K8518K1037J2547L796m686j2730k0476k8171l5749m2599
62460A226972m7963n1652n4116n5644n5839n4251n1243m7686m3913l9604l4816
62449F90245l0418k7095k4368k1194j7269j3281r972p521n739m360k943j069J082
62436E26098K727L367L422L576L825L638K856J784M46j484l823n632o337o582
62422E27881p381q802j0073j0721j0867j0537r489p888o437n569n015m471m108
62409D26523m019l719k840j901j788k472k939k482j523r87j189j645j769j504
62395C95746j181r31m46O03J987L029L328L115K787K394J841J351J364J975K813
$$ plain form
62380 419775 423269 427240 431678 436710 442498 449227 457121 466308 476613 487527 498587 509770 521377
62367 521377 533506 545969 558908 573119 589420 607863 627954 649577 673359 700279 731335
62356 731335 767443 809019 855558 906073 960079 1017591 1078028 1139569 1199766 1256298 1306964
62345 1306964 1349681 1383127 1407153 1422192 1428579 1426704 1417284 1400946 1377910 1348599 1314162 1275840
62333 1275840 1234193 1189701 1143903 1099077 1056787 1017355 980760 947283 917172 890355 866696
62322 866696 845993 827524 810170 793196 776442 759629 742109 723519 704075 683923 662874
62311 662874 641243 620343 601450 584684 569436 555546 543325 532663 522941 513959 506285 500414
62299 500414 496001 492218 488686 485756 483909 483021 482348 481287 480012 479178 479097 479631 480845 483138 486407 489635
$$ packed form
62380D19775L494L971M438N032N788O729P894R187J0305J0914J1060J1183J1607
62367E21377J2129J2463J2939J4211J6301J8443K0091K1623K3782K6920L1056
62356G31335L6108M1576M6539N0515N4006N7512O0437O1541O0197N6532N0666
62345A306964M2717L3446K4026J5039O387j875r420j6338k3036k9311l4437l8322
62333A275840m1647m4492m5798m4826m2290l9432l6595l3477l0111k6817k3659
62322H66696k0703j8469j7354j6974j6754j6813j7520j8590j9444k0152k1049
62311F62874k1631k0900j8893j6766j5248j3890j2221j0662r722q982p674n871
62299E00414m413l783l532k930j847q88o73j061j275q34q1N34J214K293L269L228
$$ plain form
62283 489635 491904 493523 495583 498579 502040 505377 508523 511728 515270 519383 524045 528797 533280 537943
62269 537943 543709 550870 558880 567382 576792 587617 599809 613308 628798 647319 669389 694982
62257 694982 724232 757693 795968 839426 888243 942299 1000922 1062937 1126931 1191208 1253532
62246 1253532 1311301 1362190 1404601 1437542 1460442 1473298 1476821 1472031 1459525 1439230 1410996 1375251
62234 1375251 1332836 1284326 1230066 1171256 1110630 1051385 995347 942589 892848 846771 805537
62223 805537 769770 739306 713704 692528 675272 661452 650825 643240 638265 635115 632951 631155
62211 631155 629492 628121 627219 626361 624581 621377 617403 613693 610364 606634 602096 597317 592963 588802 584065
62196 584065 578559 573124 568978 566774 566239 566651 567668 569662 573168 578168 584118 590574 597421 604546 611746
$$ packed form
62283D89635K269J619K060K996L461L337L146L205L542M113M662M752M483M663
62269E37943N766P161Q010Q502R410J0825J2192J3499J5490J8521K2070K5593
62257F94982K9250L3461L8275M3458M8817N4056N8623O2015O3994O4277O2324
62246A253532N7769N0889M2411L2941K2900J2856L523m790j2506k0295k8234l5745
62234A375251m2415m8510n4260n8810o0626n9245n6038n2758m9741m6077m1234
62223H05537l5767l0464k5602k1176j7256j3820j0627p585m975l150k164j796
62211F31155j663j371r02q58j780l204l974l710l329l730m538m779m354m161m737
62196E84065n506n435m146k204n35M12J017J994L506N000N950O456O847P125P200
$$ plain form
62181 611746 619178 627475 637070 647574 658067 667825 676532 683993 690135 695347 700524 706567 713933 722797
62167 722797 733623 747457 765559 788757 817154 850351 887794 928794 972483 1017946 1064206
62156 1064206 1109743 1152102 1188407 1216535 1235768 1246505 1249710 1246564 1238047 1224476 1205668 1181720
62144 1181720 1153342 1121293 1085982 1048033 1008938 970620 934424 900921 870537 843879 821362
62133 821362 802868 787933 776091 766999 760442 756243 754004 753005 752547 752384 752639 753488 755237 758583 764297
62118 764297 772446 782152 792206 801664 809842 816133 820091 821598 820829 818267 814724 811071 807720 804502
62104 804502 800961 796474 790125 781131 769828 757946 747439 739181 733001 728632 726064 725201 725856 728229
62090 728229 732824 739573 747443 755250 762662 770109 777991 786350 795253 804965 815573 826786 838408
$$ packed form
62181F11746P432Q297R595J0504J0493R758Q707P461O142N212N177O043P366Q864
62167G22797J0826J3834J8102K3198K8397L3197L7443M1000M3689M5463M6260
62156A064206M5537M2359L6305K8128J9233J0737L205l146q517j3571j8808k3948
62144A181720k8378l2049l5311l7949l9095l8318l6196l3503l0384k6658k2517
62133H21362j8494j4935j1842r092o557m199k239r99m58j63K55Q49J749L346N714
62118G64297Q149R706J0054R458Q178O291L958J507p69k562l543l653l351l218
62104H04502l541m487o349q994j1303j1882j0507q258o180m369k568q63O55K373
62090G28229M595O749P870P807P412P447P882Q359Q903R712J0608J1213J1622
$$ plain form
62077 838408 850817 864628 879913 896132 912902 930499 949358 969339 989872 1010650 1031723
62066 1031723 1052913 1073730 1094116 1114835 1136820 1160406 1185539 1212359 1240957 1270563 1299493
62055 1299493 1326011 1348933 1367381 1380388 1387053 1386945 1380307 1368031 1351379 1331280 1307671 1279728
62043 1279728 1246888 1209419 1168048 1123489 1076642 1028828 981343 934964 890203 847780 808387
62032 808387 772121 738652 707950 680387 656136 634903 616326 600191 586124 573531 562067
62021 562067 551821 542750 534316 526041 518084 510818 504005 496918 489320 481864 475394 470127 465674 461653
62007 461653 458004 454909 452671 451741 452645 455627 460304 465904 472040 479103 487537 496781 505408 512547 518675
61992 518675 524623 530195 534384 536788 538047 538801 538830 537522 534663 530346 524536 517234 508879 500145 491432
$$ packed form
62077H38408J2409J3811J5285J6219J6770J7597J8859J9981K0533K0778K1073
62066A031723K1190K0817K0386K0719K1985K3586K5133K6820K8598K9606K8930
62055A299493K6518K2922J8448J3007O665j08o638j2276j6652k0099k3609k7943
62043A279728l2840l7469m1371m4559m6847m7814m7485m6379m4761m2423l9393
62032H08387l6266l3469l0702k7563k4251k1233j8577j6135j4067j2593j1464
62021E62067j0246r071q434q275p957p266o813p087p598p456o470n267m453m021
62007D61653l649l095k238r30R04K982M677N600O136P063Q434R244Q627P139O128
61992E18675N948N572M189K404J259P54K9j308k859m317n810p302q355q734q713
$$ plain form
61977 491432 482840 474507 466590 459042 451762 444935 438803 433161 427478 421602 415969 410982 406565 402501
61963 402501 398882 395985 393883 392362 391028 389424 387403 385568 384972 386036 388068 390186 392404 395297
61949 395297 398896 402629 406348 410635 415929 422039 428952 437483 448467 461579 475592 489694 504025
61936 504025 518976 534571 550638 567118 583861 600411 616235 631033 644725 657319 668918
61925 668918 679623 689252 697248 703013 706227 706843 704943 700721 694456 686419 677039 667256 658380 651301
61911 651301 645989 642051 639649 639583 642578 648820 658110 670084 684138 699354 714620 728785 740815
61898 740815 750051 756355 759811 760333 757778 752380 744711 735174 723909 711293 698126 685087 672335
61885 672335 659923 648244 637651 627869 618288 608717 599409 590366 581191 571783 562650 554242 546340
$$ packed form
61977D91432q592q333p917p548p280o827o132n642n683n876n633m987m417m064
61963D02501l619k897k102j521j334j604k021j835n96J064K032K118K218K893
61949C95297L599L733L719M287N294O110O913Q531J0984J3112J4013J4102J4331
61936E04025J4951J5595J6067J6480J6743J6550J5824J4798J3692J2594J1599
61925F68918J0705R629P996N765L214O16j900m222o265q037r380r783q876p079
61911F51301n312l938k402o6K995O242R290J1974J4054J5216J5266J4165J2030
61898G40815R236O304L456N22k555n398p669r537j1265j2616j3167j3039j2752
61885F72335j2412j1679j0593r782r581r571r308r043r175r408r133q408p902
$$ plain form
61872 546340 538512 530888 523976 517886 512258 507063 502946 500464 499324 498786 498703 499809 502986 508531 516173
61857 516173 525473 536065 547707 560442 574677 590928 609402 629862 651913 675389 700491 727493
61845 727493 756228 785824 815098 843223 869851 894500 916096 933410 945830 953413 956286 954365
61833 954365 947792 937301 924028 909225 894249 880460 868695 859058 851627 847295 847395 852374 861174
61820 861174 872133 884110 896403 907868 916801 921790 922274 918070 908786 894149 874688 851669 826320
61807 826320 799461 771806 744141 717008 690588 665137 641297 619713 600574 583795 569340
61796 569340 557003 546126 536037 526758 518785 512118 505969 499591 493049 486967 481809 477592 474006
61783 474006 470585 466961 463241 459964 457489 455552 453660 451757 450195 449108 448110 446706 444884 443183
$$ packed form
61872E46340p828p624o912o090n628n195m117k482j140n38q3J106L177N545P642
61857E16173R300J0592J1642J2735J4235J6251J8474K0460K2051K3476K5102K7002
61845G27493K8735K9596K9274K8125K6628K4649K1596J7314J2420P583K873j921
61833I54365o573j0491j3273j4803j4976j3789j1765r637p431m332J00M979Q800
61820H61174J0959J1977J2293J1465Q933M989M84m204r284j4637j9461k3019k5349
61807H26320k6859k7655k7665k7133k6420k5451k3840k1584j9139j6779j4455
61796E69340j2337j0877j0089r279p973o667o149o378o542o082n158m217l586
61783D74006l421l624l720l277k475j937j892j903j562j087r98j404j822j701
$$ plain form
61769 443183 442260 442344 443049 443711 443977 444079 444499 445435 446630 447726 448729 450131 452481 455753 459258 462356
61753 462356 465139 468184 471636 474900 477263 478476 478602 477710 476008 474033 472233 470477 468288 465536 462582
61738 462582 459723 456771 453319 449363 445595 443005 442058 442243 442606 442761 443089 443844 444550 444715 444800 445843 448119
61721 448119 450777 452951 454754 456911 459783 463139 466674 470325 474028 477505 480446 482797 484628 485725
61707 485725 485564 483857 481028 477880 474792 471515 467784 463799 459916 456190 452531 449070 446024 443302
61693 443302 440569 437647 434611 431586 428710 426187 424027 421851 419233 416224 413253 410575 408121 405792
61679 405792 403570 401435 399485 398001 397013 395932 394119 391683 389182 386643 383645 380416 378011 377023 376838
61664 376838 376573 376128 375754 375242 374323 373490 373553 374445 375295 375705 376257 377486 378936 379656 379384 378904 379302 381073
$$ packed form
61769D43183r23Q4P05O62K66J02M20R36J195J096J003J402K350L272L505L098
61753D62356K783L045L452L264K363J213J26q92j702j975j800j756k189k752k954
61738D62582k859k952l452l956l768k590r47J85L63J55L28P55P06J65Q5J043K276
61721D48119K658K174J803K157K872L356L535L651L703L477K941K351J831J097
61707D85725j61j707k829l148l088l277l731l985l883l726l659l461l046k722
61693D43302k733k922l036l025k876k523k160k176k618l009k971k678k454k329
61679D05792k222k135j950j484r88j081j813k436k501k539k998l229k405r88j85
61664C76838k65m45l74n12r19q33O3Q92Q50M10N52J229J450P20k72m80L98J771
$$ plain form
61646 381073 383887 387051 390073 392854 395467 398007 400608 403380 406217 408922 411568 414398 417113 418623
61632 418623 417963 415342 411993 409086 407049 405738 404810 403891 402717 401245 399499 397455 395241 393295 391999
61617 391999 391281 390842 390579 390465 390247 389740 389250 389107 388852 387497 384625 380671 376046 370717 364853 359128
61601 359128 353961 348999 343868 338965 334934 331734 328796 325863 323075 320419 317691 314922 312324 309786
61587 309786 306983 304001 301414 299596 298324 297123 295679 293913 292028 290517 289656 288872 287161 284388 281675
61572 281675 280154 279730 279569 279432 279847 281010 282220 282712 282552 282345 282325 282159 281605 280941 280614 280731 281124 281718
61554 281718 282542 283420 283981 284101 284089 284319 284872 285746 287162 289323 291963 294486 296537 298128 299242 299746 299836
61537 299836 300147 301136 302548 303789 304665 305487 306573 307899 309256 310480 311472 312098 312206 311803 311207 310833 310640
$$ packed form
61646C81073K814L164L022K781K613K540K601K772K837K705K646K830K715J510
61632D18623o60k621l349k907k037j311r28r19j174j472j746k044k214j946j296
61617C91999p18m39k63j14k18n07m90j43k55j355k872l954m625n329n864n725
61601C59128n167m962n131m903m031l200k938k933k788k656k728k769k598k538
61587C09786k803k982k587j818j272j201j444j766j885j511q61p84j711k773k713
61572B81675j521m24j61j37M15J163J210M92j60k07k0j66n54o64l27J17L93N94
61554B81718Q24Q78N61J20j2K30N53Q74J416K161K640K523K051J591J114N04R0
61537B99836L11R89J412J241Q76Q22J086J326J357J224R92O26J08m03n96l74j93
$$ plain form
61520 310640 309913 308018 305385 303271 302368 302034 301213 299720 298174 297034 296267 295799 295715 295958 296299 296652 297064
61503 297064 297347 297105 296172 294785 293353 292346 292231 293016 293895 293960 293331 293022 293578 294385 294540 293860 292834 292118
61485 292118 292374 293979 296428 298504 299500 299894 300438 301135 301644 302143 303008 304069 304996 306154 308155 310666
61469 310666 312594 313507 314000 314475 314487 313688 312618 311940 311417 310335 308646 307111 306432 306647 307282 307779 307936
61452 307936 308164 309126 310837 312408 313087 313312 314138 315732 317084 317391 317097 317148 317690 318164 318567 319897 323034
61435 323034 327554 332028 335402 337828 340241 343355 346983 350106 351699 351778 351530 352124 353454 354468 354651
61420 354651 354608 355108 356234 357760 359702 361990 364102 365676 367149 369142 371456 373285 374253 374617 374571 373993
61404 373993 372840 371158 368730 365323 361336 357653 354818 352837 351729 351598 352110 352576 352680 352518 351946 350630
$$ packed form
61520C10640p27j895k633k114r03l34q21j493j546j140p67m68q4K43L41L53M12
61503B97064K83k42r33j387j432j007j15P85Q79O5o29l09N56Q07J55o80j026p16
61485B92118K56J605K449K076R96L94N44O97N09M99Q65J061R27J158K001K511
61469C10666J928R13M93M75J2p99j070o78n23j082j689j535o79K15O35M97J57
61452C07936K28R62J711J571O79K25Q26J594J352L07k94N1N42M74M03J330L137
61435C23034M520M474L374K426K413L114L628L123J593P9k48N94J330J014J83
61420C54651m3N00J126J526J942K288K112J574J473J993K314J829R68L64m6n78
61404C73993j153j682k428l407l987l683k835j981j108j31N12M66J04j62n72j316
$$ plain form
61388 350630 348861 347479 346709 345890 344638 343460 342816 342425 342047 342088 342777 343525 343947 344770 346798 349496 351649
61371 351649 353025 354367 356017 357665 359354 361536 364018 365905 366950 368052 369961 372232 374022 375355
61357 375355 376997 379433 382473 385735 389080 392608 396514 400985 406166 412178 419076 426617 434108 440689
61343 440689 445777 449237 451355 452941 455120 458548 462811 466925 470333 473136 475633 478164 481246 485146
61329 485146 489220 492291 493830 494274 494088 493179 491526 489746 488522 487867 487384 487005 487049 487759 489202 491508
61313 491508 494867 499275 504515 510356 516707 523707 531775 541353 552425 564453 576882 589481 602004
61300 602004 613762 623868 631785 637415 640723 641550 639837 635888 630349 623914 616965 609455 601181 592154
61286 592154 582637 572947 563432 554518 546425 538857 531336 523970 517504 512460 508578 505354 502788 501331
$$ packed form
61388C50630j769j382p70q19j252j178o44l91l78M1O89P48M22Q23K028K698K153
61371C51649J376J342J650J648J689K182K482J887J045J102J909K271J790J333
61357C75355J642K436L040L262L345L528L906M471N181O012O898P541P491O581
61343D40689N088L460K118J586K179L428M263M114L408K803K497K531L082L900
61329D85146M074L071J539M44j86r09j653j780j224o55m83l79M4P10J443K306
61313D91508L359M408N240N841O351P000Q068R578J1072J2028J2429J2599J2523
61300F02004J1758J0106P917N630L308Q27j713l949n539o435o949p510q274r027
61286E92154r517r690r515q914q093p568p521p366o466n044l882l224k566j457
$$ plain form
61272 501331 501274 502504 504648 507243 509930 512792 516338 520886 526076 531163 535656 539543 543149 547113 552266
61257 552266 559065 567102 575421 583219 590086 595792 600280 603812 606754 609235 611326 613428 616041 619073
61243 619073 621820 623781 625095 626027 626451 626145 625267 624155 622764 620652 617491 613410 608940 604815 601696
61228 601696 599853 599134 599376 600666 602958 605689 608218 610678 613901 618322 623375 628232 632849 637926 643977
61213 643977 650822 657936 664939 671628 677802 683210 687642 691045 693590 695604 697366 698982 700551 702286
61199 702286 704396 706994 710390 715294 722335 731391 741766 753003 765110 777857 790340 801491 810708
61186 810708 817753 822437 824881 825823 826140 826114 825500 824212 822503 820431 817647 813921 809597 805246 800971
61171 800971 796282 790729 784576 778687 773633 768943 763516 756787 749178 741272 732950 723768 713895 704129
$$ packed form
61272E01331n7J230K144K595K687K862L546M548N190N087M493L887L606L964N153
61257E52266O799Q037Q319P798O867N706M488L532K942K481K091K102K613L032
61243F19073K747J961J314R32M24l06q78j112j391k112l161m081m470m125l119
61228F01696j843p19K42J290K292K731K529K460L223M421N053M857M617N077O051
61213F43977O845P114P003O689O174N408M432L403K545K014J762J616J569J735
61199G02286K110K598L396M904P041R056J0375J1237J2107J2747J2483J1151R217
61186H10708P045M684K444R42L17k6o14j288j709k072k784l726m324m351m275
61171H00971m689n553o153n889n054m690n427o729p609p906q322r182r873r766
$$ plain form
61157 704129 694920 685887 676433 666579 657020 648574 641651 636083 631393 627350 624260 622454 621506 620232
61143 620232 617600 613421 608076 601884 595028 587827 580696 573737 566777 560009 554379 550889 549478 548955
61129 548955 548311 547816 548475 550673 553943 557941 563007 569594 577769 587585 599313 612885 627641 643176
61115 643176 660006 678782 699217 720467 742335 765317 789571 814550 839678 864720 889369
61104 889369 913061 935378 956198 975293 992138 1006140 1016703 1023179 1025271 1023562 1019110 1012479
61092 1012479 1003587 992412 979250 964266 947457 929230 910403 891442 872221 852670 833091
61081 833091 813625 794070 774509 755567 737750 720984 705055 690013 675913 662742 650921
61070 650921 641198 633629 627219 621090 615531 611378 608815 607385 606791 607053 608084 609726 612088 615439 619846
$$ packed form
61157G04129r209r033r454r854r559q446o923n568m690m043l090j806r48j274
61143F20232k632m179n345o192o856p201p131o959o960o768n630l490j411n23
61129E48955o44m95O59K198L270L998N066O587Q175R816J1728J3572J4756J5535
61115F43176J6830J8776K0435K1250K1868K2982K4254K4979K5128K5042K4649
61104H89369K3692K2317K0820J9095J6845J4002J0563O476K092j709m452o631
61092A012479q892j1175j3162j4984j6809j8227j8827j8961j9221j9551j9579
61081H33091j9466j9555j9561j8942j7817j6766j5929j5042j4100j3171j1821
61070F50921r723p569o410o129n559m153k563j430n94K62J031J642K362L351M407
$$ plain form
61055 619846 625323 632110 640418 649935 659977 670098 680362 691166 703004 716286 731165 747629
61043 747629 765789 785865 807809 831298 856221 882824 911282 941512 973573 1007779 1044244
61032 1044244 1082760 1123335 1166391 1212178 1260445 1310886 1363387 1417592 1472873 1529112 1587061
61021 1587061 1647671 1711764 1780605 1856058 1939632 2032031 2133995 2246841 2371841 2510374
61011 2510374 2665765 2844471 3054875 3305791 3606699 3968068 4400474 4915348 5529060
61002 5529060 6265901 7155963 8232039 9529946 11083905 12903321 14936091 17047476
60994 17047476 19039790 20707033 21895291 22545617 22712982 22557558 22299962 22143996 22197681
60985 22197681 22434124 22709728 22821607 22573668 21833675 20573414 18879001 16919451 14884865
$$ packed form
61055F19846N477O787Q308R517J0042J0121J0264J0804J1838J3282J4879J6464
61043G47629J8160K0076K1944K3489K4923K6603K8458L0230L2061L4206L6465
61032A044244L8516M0575M3056M5787M8267N0441N2501N4205N5281N6239N7949
61021A587061O0610O4093O8841P5453Q3574R2399J01964J12846J25000J38533
61011B510374J55391J78706K10404K50916L00908L61369M32406N14874O13712
61002E529060P36841Q90062J076076J297907J553959J819416K032770K111385
60994A7047476J992314J667243J188258O50326J67365j55424k57596j55966N3685
60985B2197681K36443K75604J11879k47939p39993j260261j694413j959550k034586
$$ plain form
60976 14884865 12929521 11148563 9585765 8250382 7129557 6197938 5427062 4790995
60968 4790995 4266640 3833077 3472833 3172437 2920500 2706240 2520704 2358021 2214275
60959 2214275 2086005 1970613 1867159 1775421 1694600 1623613 1561967 1509385 1464924 1427061 1394231
60948 1394231 1364826 1337356 1311199 1286690 1264037 1242781 1222721 1204557 1188968 1175760 1164490
60937 1164490 1155135 1147490 1140699 1134179 1128284 1123221 1118109 1112057 1105484 1099307 1093396 1086999 1080170 1073556
60923 1073556 1067016 1059721 1051495 1042926 1034095 1024216 1012649 999399 984581 968269 950986 933536
60911 933536 916283 899272 882955 867878 853652 839219 824382 810118 797168 785197 773696
60900 773696 762807 752790 743454 734708 727015 720675 715154 709681 704090 698561 692947 686951 680668 674374
$$ packed form
60976A4884865j955344j780958j562798j335383j120825r31619p70876o36067
60968D790995n24355m33563l60244l00396k51937k14260j85536j62683j43746
60959B214275j28270j15392j03454r1738q0821p0987o1646n2582m4461l7863l2830
60948A394231k9405k7470k6157k4509k2653k1256k0060j8164j5589j3208j1270
60937A164490r355p645o791o520n895n063n112o052o573o177n911o397o829o614
60923A073556o540p295q226q569q831r879j1567j3250j4818j6312j7283j7450
60911I33536j7253j7011j6317j5077j4226j4433j4837j4264j2950j1971j1501
60900G73696j0889j0017r336q746p693o340n521n473n591n529n614n996o283o294
$$ plain form
60886 674374 667948 661016 653587 646087 638768 631440 623790 615743 607553 599632 592146 584637 576393 567506
60872 567506 559314 553269 549387 546151 542003 536633 530818 525430 520798 516831 513444 510780 509071 508217
60858 508217 507577 506383 504392 501988 499496 496655 493055 488951 485247 482572 480737 479288 478150 477287 476033
60843 476033 473493 469716 465867 462942 460737 458340 455194 451176 446100 439899 433280 427503 423210 419883
60829 419883 416664 413367 410429 408227 406918 406748 407964 410251 412629 414223 414968 415326 415502 415330 414868 414576
60813 414576 414692 414774 414239 413107 411874 410838 409986 409346 409021 408907 408875 409172 410087 411158 411291 409894 407442
60796 407442 404753 402229 400001 398168 396481 394328 391573 389001 387364 386360 385121 383408 381646 379978
60782 379978 377994 375439 372590 369814 367238 364920 362897 360967 358845 356734 355369 355234 355906 356362 355892
$$ packed form
60886F74374o426o932p429p500p319p328p650q047q190p921p486p509q244q887
60872E67506q192o045l882l236m148n370n815n388m632l967l387k664j709q54
60858E08217o40j194j991k404k492k841l600m104l704k675j835j449j138q63j254
60843D76033k540l777l849k925k205k397l146m018n076o201o619n777m293l327
60829D19883l219l297k938k202j309j70J216K287K378J594P45L58J76j72m62k92
60813D14576J16Q2n35j132j233j036q52o40l25j14l2K97R15J071J33j397k452
60796D07442k689k524k228j833j687k153k755k572j637j004j239j713j762j668
60782C79978j984k555k849k776k576k318k023j930k122k111j365j35O72M56m70
$$ plain form
60767 355892 354728 353914 354478 356533 359144 361198 362381 363283 364731 367158 370297 373173 374670 374565 373925
60752 373925 374102 375393 377042 378420 379678 381224 383098 385119 387323 389922 392961 396141 398883 400551
60738 400551 400708 399216 396104 391581 386245 380947 376082 371234 365966 360782 356765 354279 352550 350641
60724 350641 348384 346111 343888 341360 338222 334588 330936 327759 325226 323176 321472 320228 319571 319346 319254
60709 319254 319080 318600 317516 315867 314343 313781 314353 315538 316727 317550 317871 317930 318366 319562 321100 322334
60693 322334 323271 324268 325085 325165 324890 325541 327642 330192 332043 333332 334896 336964 339115 341177 343351 345656
60677 345656 348005 350757 354549 359437 364681 369523 373816 377750 381339 384433 387074 389518 391839 393603
60663 393603 394096 392945 390464 387359 384168 381093 378195 375508 373073 371109 370030 370014 370615 371166 371504 371854
$$ packed form
60767C55892j164q14N64K055K611K054J183R02J448K427L139K876J497j05o40
60752C73925J77J291J649J378J258J546J874K021K204K599L039L180K742J668
60738D00551J57j492l112m523n336n298m865m848n268n184m017k486j729j909
60724C50641k257k273k223k528l138l634l652l177k533k050j704j244o57k25r2
60709C19254j74m80j084j649j524n62N72J185J189Q23L21N9M36J196J538J234
60693C22334R37R97Q17Q0k75O51K101K550J851J289J564K068K151K062K174K305
60677C45656K349K752L792M888N244M842M293L934L589L094K641K444K321J764
60663C93603M93j151k481l105l191l075k898k687k435j964j079j6O01N51L38L50
$$ plain form
60647 371854 372130 371948 371399 371177 371659 372380 372783 372998 373437 373959 373865 372536 369774 365790 361174 356662 352642
60630 352642 349081 346099 344182 343488 343354 342968 342290 341874 342050 342737 343798 345000 345746 345478 344405 343386
60614 343386 343040 343273 343613 343593 342883 341509 340039 339185 339175 339808 341008 342796 344694 345802 345882 345975 347484 350698
60596 350698 354480 357386 358895 359634 360590 362232 364321 366357 368006 369096 369514 369343 368924 368539 368109 367505
60580 367505 367060 367447 368981 371276 373615 375466 376698 377653 379120 381960 386497 392319 398750 405448 412523
60565 412523 420281 429003 438840 449678 460996 471854 481118 487854 491631 492489 490643 486301 479816 471919
60551 471919 463676 456198 450325 446357 444038 442951 443078 444873 448703 454364 461292 469102 477795 487623
60537 487623 498907 511838 526288 541869 558204 574829 590709 604249 614215 620479 623616 624051
$$ packed form
60647C71854K76j82n49k22M82P21M03K15M39N22r4j329k762l984m616m512m020
60630C52642l561k982j917o94j34l86o78m16J76O87J061J202P46k68j073j019
60614C43386l46K33L40k0p10j374j470q54j0O33J200J788J898J108Q0R3J509L214
60596C50698L782K906J509P39R56J642K089K036J649J090M18j71m19l85m30o04
60580C67505m45L87J534K295K339J851J232R55J467K840M537N822O431O698P075
60565D12523P758Q722R837J0838J1318J0858R264O736L777Q58j846m342o485p897
60551D71919q243p478n873l968k319j087J27J795L830N661O928P810Q693R828
60537D87623J1284J2931J4450J5581J6335J6625J5880J3540R966O264L137M35
$$ plain form
60525 624051 621939 617601 611509 604031 595689 587522 580606 575142 570516 566261 562407 558853 555107 551022
60511 551022 547347 545178 545080 546840 549740 552918 555940 559325 564239 571503 581219 593459 608766 627688
60497 627688 650316 676669 707039 741419 778903 818252 858761 899961 940643 978805 1012563
60486 1012563 1040670 1062259 1076681 1083628 1082904 1074043 1056692 1031473 999943 963604 923459 880690
60474 880690 837100 794355 753199 713844 676902 643405 614026 588674 566806 547780 530946
60463 530946 515796 502173 490194 479866 470872 462776 455353 448674 442865 437781 432987 428198 423645
60450 423645 419784 416606 413607 410552 407892 406082 404745 402982 400434 397687 395602 394521 394117 393730 392836
60435 392836 391429 390020 389074 388455 387664 386557 385569 385192 385504 386234 387004 387430 387334 386932 386603 386427 386234 386118
$$ packed form
60525F24051k112m338o092p478q342q167o916n464m626m255l854l554l746m085
60511E51022l675k169r8J760K900L178L022L385M914P264R716J2240J5307J8922
60497F27688K2628K6353L0370L4380L7484L9349M0509M1200M0682L8162L3758
60486A012563K8107K1589J4422O947p24q861j7351k5219l1530l6339m0145m2769
60474H80690m3590m2745m1156l9355l6942l3497k9379k5352k1868j9026j6834
60463E30946j5150j3623j1979j0328q994q096p423o679n809n084m794m789m553
60450D23645l861l178k999l055k660j810j337j763k548k747k085j081m04l87q94
60435C92836j407j409r46o19p91j107r88l77L12P30P70M26r6m02l29j76j93j16
$$ plain form
60417 386118 386420 387076 387470 387295 387070 387424 388187 388733 389007 389615 390920 392534 393835 394613 395099 395633 396415 397417
60399 397417 398488 399657 401188 403129 404983 406219 406984 407906 409264 410851 412649 414984 417781 420265 421839
60384 421839 422912 424382 426555 428980 431190 433175 435218 437622 440557 443853 447006 449711 452280 455161
60370 455161 458096 460311 461599 462692 464221 465836 466813 467217 467846 469079 470407 471275 471829 472506 473355 474252
60354 474252 475565 478003 481785 486395 491259 496271 501533 506977 512514 518241 524170 529924 534925 538750
60340 538750 541032 541297 539255 535208 529908 524095 518370 513265 509015 505360 501942 498877 496543 494872
60326 494872 493263 491189 488480 485028 480775 476129 471858 468327 465217 462275 459913 458769 459004 460394
60312 460394 462816 466263 470574 475524 481054 487203 494061 502076 512080 524554 539068 554869 571802
$$ packed form
60417C86118L02O56L94j75k25L54P63N46K74O08J305J614J301P78M86N34P82J002
60399C97417J071J169J531J941J854J236P65R22J358J587J798K335K797K484J574
60384D21839J073J470K173K425K210J985K043K404K935L296L153K705K569K881
60370D55161K935K215J288J093J529J615R77M04O29J233J328Q68N54O77Q49Q97
60354D74252J313K438L782M610M864N012N262N444N537N727N929N754N001L825
60340E38750K282K65k042m047n300n813n725n105m250l655l418l065k334j671
60326D94872j609k074k709l452m253m646m271l531l110k942k362j144K35J390
60312D60394K422L447M311M950N530O149O858Q015J0004J2474J4514J5801J6933
$$ plain form
60299 571802 589944 608308 624519 636099 641793 641556 635769 624955 610091 592712 574519 556844
60287 556844 540428 525556 512429 501396 492813 486632 482254 478926 476278 474398 473363 472744 471749 469944
60273 469944 467727 465842 464397 462651 459934 456504 453152 450130 446957 443355 439861 437218 435441 433911
60259 433911 432234 430614 429289 428038 426464 424556 422731 421425 420857 421010 421524 421661 420812 419270 418195
60244 418195 418550 420132 421839 422789 423037 423346 424416 426309 428441 430175 431451 432681 434013 435028 435373
60229 435373 435416 435904 437147 438872 440752 442725 444855 447171 449613 451969 454041 456069 458647 461893 465083
60214 465083 467670 470214 473600 477699 481742 485850 491094 497933 505673 513739 522346 531430 539995 547284
60200 547284 553771 560148 566083 570921 575052 579591 584988 590779 596386 601387 605326 608122 610406 612623
$$ packed form
60299E71802J8142J8364J6211J1580N694k37n787j0814j4864j7379j8193j7675
60287E56844j6416j4872j3127j1033q583o181m378l328k648j880j035o19r95j805
60273D69944k217j885j445j746k717l430l352l022l173l602l494k643j777j530
60259D33911j677j620j325j251j574j908j825j306n68J53N14J37q49j542j075
60244D18195L55J582J707R50K48L09J070J893K132J734J276J230J332J015L45
60229D35373M3M88J243J725J880J973K130K316K442K356K072K028K578L246L190
60214D65083K587K544L386M099M043M108N244O839P740Q066Q607R084Q565P289
60200E47284O487O377N935M838M131M539N397N791N607N001L939K796K284K217
$$ plain form
60186 612623 614048 613585 611326 608372 605239 601464 596818 591772 586563 580841 574669 568915 564114 559713
60172 559713 555061 550457 546488 542880 538821 534280 530286 527825 526799 526101 524522 521702 518407 515854
60158 515854 514627 514352 514398 514556 514942 515549 516175 516637 516850 516876 517052 517873 519561 521761 523803 525192 525919 526461
60140 526461 527477 529363 532087 535560 539953 545400 551580 558009 564549 571159 577277 582164 585938 589558
60126 589558 593584 597569 600949 603803 606198 607479 607028 605483 604414 604776 606225 607997 609861 612006 614423
60111 614423 616846 619183 621595 624040 625969 626803 626683 626381 626248 625591 623507 620140 616566 613499 610665
60096 610665 607558 604228 600986 597770 594229 590270 586257 582762 580239 578764 578035 577747 577912 578492 578869
60081 578869 578247 576683 575145 574362 574112 573914 573844 574217 574870 575170 574452 572173 568062 562551 556638 550936 545139
$$ packed form
60186F12623J425m63k259k954l133l775m646n046n209n722o172n754m801m401
60172E59713m652m604l969l608m059m541l994k461j026o98j579k820l295k553
60158E15854j227k75M6J58L86O07O26M62K13K6J76Q21J688K200K042J389P27N42
60140E26461J016J886K724L473M393N447O180O429O540O610O118M887L774L620
60126E89558M026L985L380K854K395J281m51j545j069L62J449J772J864K145K417
60111F14423K423K337K412K445J929Q34j20l02j33o57k084l367l574l067k834
60096F10665l107l330l242l216l541l959m013l495k523j475p29k88J65N80L77
60081E78869o22j564j538p83k50j98p0L73O53L00p18k279m111n511n913n702n797
$$ plain form
60064 545139 538767 531992 525336 518949 512741 506881 501626 496924 492649 488922 485704 482516 479147 476210
60050 476210 474320 473154 472160 471772 472847 475099 477315 479195 481776 485712 490305 494794 499577 505402 512061
60035 512061 518691 524791 530147 534279 536884 538603 540451 542552 544055 544248 543077 540624 536799 531766
60021 531766 526056 520011 513573 506808 500148 493787 487275 480189 472942 466427 460977 456130 451430 446957
60007 446957 442890 438973 434805 430502 426710 423924 422067 420799 419946 419468 419161 418680 417837 416764 415780 415192
59991 415192 415208 415954 417505 419894 423016 426524 429946 433013 435817 438650 441781 445412 449551 453694 456867
59976 456867 458356 458406 457878 457235 456232 454592 452559 450485 448269 445663 442959 440871 439715 439145 438877 439262
59960 439262 440762 443118 445564 447865 450583 454044 457486 459743 460566 460674 460543 459804 458112 455998 454349
$$ packed form
60064E45139o372o775o656o387o208n860n255m702m275l727l218l188l369k937
60050D76210j890j166r94l88J075K252K216J880K581L936M593M489M783N825O659
60035E12061O630O100N356M132K605J719J848K101J503J93j171k453l825n033
60021E31766n710o045o438o765o660o361o512p086p247o515n450m847m700m473
60007D46957m067l917m168m303l792k786j857j268q53m78l07m81q43j073r84n88
59991D15192J6P46J551K389L122L508L422L067K804K833L131L631M139M143L173
59976D56867J489N0n28o43j003j640k033k074k216k606k704k088j156n70k68L85
59960D39262J500K356K446K301K718L461L442K257Q23J08j31p39j692k114j649
$$ plain form
59945 454349 453417 452988 453316 455143 458548 462387 465224 466568 466911 466876 466687 466330 465767 464923 463731 462332 461148
59928 461148 460649 461037 462161 463747 465745 468445 472133 476599 481144 485226 489059 493429 498945 505496 512432
59913 512432 519094 525227 530963 536453 541426 545136 546933 546937 546016 544911 543495 541060 537348 533062 529270
59898 529270 526468 524421 522745 521325 520174 519255 518664 518751 519737 521359 523221 525426 528525 532746 537630
59883 537630 542569 547422 552378 557450 562469 567453 572602 577954 583335 588708 594224 599787 604817 608627
59869 608627 610925 611834 611609 610438 608313 604973 600237 594574 589029 584256 579895 575312 570730 567063 564767
59854 564767 563508 563030 563641 565518 568193 571238 575025 580233 586801 593898 600681 606556 610828 612798 612397
59839 612397 610390 607824 605588 604386 604554 605591 606153 604865 601156 595372 588390 581208 574632 569097 564736
$$ packed form
59945D54349r32m29L28J827L405L839K837J344L43l5j89l57n63q44j192j399j184
59928D61148m99L88J124J586J998K700L688M466M545M082L833M370N516O551O936
59913E12432O662O133N736N490M973L710J797Mr21j105j416k435l712m286l792
59898E29270k802k047j676j420j151r19n91Q7R86J622J862K205L099M221M884
59883E37630M939M853M956N072N019M984N149N352N381N373N516N563N030L810
59869F08627K298R09k25j171k125l340m736n663n545m773m361m583m582l667k296
59854E64767j259m78O11J877K675L045L787N208O568P097O783N875M272J970m01
59839F12397k007k566k236j202J68J037N62j288l709n784o982p182o576n535m361
$$ plain form
59824 564736 561522 559203 557217 555023 552549 550035 547536 544866 542063 539432 537013 534482 531816 529675
59810 529675 528754 528916 529304 529166 528309 526849 524840 522201 518875 515022 511036 507344 504181 501600 499559
59795 499559 497820 495960 493794 491737 490353 489580 488844 487957 487397 487571 488285 489167 490120 491073 491736 491947 491913
59778 491913 491766 491282 490419 489765 489963 490960 492265 493634 495021 496167 496895 497660 499159 501438 503902 506170
59762 506170 508297 510136 511157 511270 511361 512624 515499 519388 523274 526483 529063 531608 534732 538682 543445
59747 543445 548926 554820 560526 565610 570309 575259 580697 586214 591203 595315 598532 601165 603709 606338
59733 606338 608537 609636 609686 609413 609284 609104 608631 608073 607695 607304 606496 605157 603468 601587 599609 597732 596185
59716 596185 595026 594133 593380 592755 592345 592218 592245 592146 591882 591900 592698 594151 595593 596627 597559 598938 601035 603899
$$ packed form
59824E64736l214k319j986k194k474k514k499k670k803k631k419k531k666k141
59810E29675r21J62L88j38q57j460k009k639l326l853l986l692l163k581k041
59795D99559j739j860k166k057j384p73p36q87n60J74P14Q82R53R53O63K11l4
59778D91913j47m84q63o54J98R97J305J369J387J146P28P65J499K279K464K268
59762E06170K127J839J021J13R1J263K875L889L886L209K580K545L124L950M763
59747E43445N481N894N706N084M699M950N438N517M989M112L217K633K544K629
59733F06338K199J099N0k73j29j80m73n58l78l91q08j339j689j881j978j877j547
59716E96185j159q93p53o25m10j27K7r9k64J8P98J453J442J034R32J379K097K864
$$ plain form
59698 603899 607567 611900 616460 620841 625042 629313 633748 638178 642347 645983 648790 650516 650986 650072 647833
59683 647833 644855 642145 640383 639306 637999 635755 632515 628648 624594 620616 616612 612086 606591 600271
59669 600271 593777 587591 581643 575716 570003 565032 561094 558008 555449 553292 551542 550119 548919 548008
59655 548008 547648 548163 549885 553068 557591 562757 567629 571656 574828 577285 579016 579955 580078 579330 577720
59640 577720 575539 573133 570309 566455 561592 556854 553355 550806 547836 543597 538505 533455 528970 525325
59626 525325 522777 521204 519883 518149 516158 514586 513617 512611 510844 508269 505385 502525 499497 495935
59612 495935 491866 487869 484677 482623 481412 480415 479292 478405 478478 479744 481527 482858 483381 483462 483578 483943
59596 483943 484600 485395 485853 485621 485127 485281 486332 487652 488878 490517 492864 495051 495994 495855 495691 495868 495694
$$ packed form
59698F03899L668M333M560M381M201M271M435M430M169L636K807J726M70r14k239
59683F47833k978k710j762j077j307k244l240l867m054l978m004m526n495o320
59669F00271o494o186n948n927n713m971l938l086k559k157j750j423j200r11
59655E48008l60N15J722L183M523N166M872M027L172K457J731R39J23p48j610
59640E77720k181k406k824l854m863m738l499k549k970m239n092n050m485l645
59626E25325k548j573j321j734j991j572r69j006j767k575k884k860l028l562
59612D95935m069l997l192k054j211r97j123q87P3J266J783J331N23Q1J16L65
59596D83943O57P95M58k32m94J54J051J320J226J639K347K187R43j39j64J77j74
$$ plain form
59579 495694 494527 492421 489620 486236 482524 478818 475010 470735 466204 462218 459176 456725 454555 452837
59565 452837 451552 450146 448417 447174 447319 448567 449650 449687 448894 448014 447445 447008 446397 445746 445668 446624 448386
59548 448386 450454 452799 455705 458977 462029 464945 468752 474225 480983 488226 495949 505024 516470 531069
59534 531069 549080 569495 589644 606178 616699 620490 618193 611362 602133 592592 584208 577892 574310
59521 574310 573669 575382 578447 582228 586530 590936 594500 596278 595977 594022 591060 587315 582380 575792 567902
59506 567902 559814 552212 544634 536334 527562 519390 512451 506529 501442 497615 495423 494392 493477 491983
59492 491983 490003 488148 487053 487001 487771 488868 489994 491197 492456 493344 493398 492880 492912 494690 498585 504121
59476 504121 510702 518070 526014 534007 541510 548540 555503 562349 568168 571854 573001 572097 570068 567821
$$ packed form
59579D95694j167k106k801l384l712l706l808m275m531l986l042k451k170j718
59565D52837j285j406j729j243J45J248J083L7p93q80n69m37o11o51p8R56J762
59548D48386K068K345K906L272L052K916L807N473O758P243P723R075J1446J4599
59534E31069J8011K0415K0149J6534J0521L791k297o831r229r541q384o316l582
59521E74310o41J713L065L781M302M406L564J778l01j955k962l745m935o588p890
59506E67902q088p602p578q300q772q172o939n922n087l827k192j031r15j494
59492D91983j980j855j095n2P70J097J126J203J259Q88N4n18L2J778L895N536
59476E04121O581P368P944P993P503P030O963O846N819L686J147r04k029k247
$$ plain form
59462 567821 565993 564787 563974 563228 562596 562586 563824 566636 570996 576849 584310 593334 603245 613048 622444
59447 622444 632217 643210 655119 666706 676913 685131 690593 692439 690634 686126 679753 671628 662019
59434 662019 652145 643337 635703 628260 620286 611978 603928 596504 589865 584202 579757 576662 574805 573943
59420 573943 574239 576714 582675 592421 604876 618864 634385 652224 672689 695366 719941 746460
59408 746460 774391 801569 824249 838349 841289 833378 817711 798523 779488 763356 752450 748594
59396 748594 752233 761734 773568 783190 786303 780216 764660 741586 714247 686169 660244 638050
59384 638050 619845 605304 594176 586274 581189 578233 576499 574993 573219 571789 571845 573519 575556 576978
59370 576978 578435 581207 585356 589779 593744 597408 600958 604238 607329 610639 614224 617787 621558 626415
$$ packed form
59462E67821j828j206q13p46o32j0J238K812M360N853P461R024R911R803R396
59447F22444R773J0993J1909J1587J0207Q218N462J846j805m508o373q125r609
59434F62019r874q808p634p443p974q308q050p424o639n663m445l095j857q62
59420E73943K96K475N961R746J2455J3988J5521J7839K0465K2677K4575K6519
59408G46460K7931K7178K2680J4100K940p911j5667j9188j9035j6132j0906l856
59396G48594L639R501J1834R622L113o087j5556k3074k7339k8078k5925k2194
59384F38050j8205j4541j1128p902n085k956j734j506j774j430N6J674K037J422
59370E76978J457K772M149M423L965L664L550L280L091L310L585L563L771M857
$$ plain form
59356 626415 632831 640269 647887 655258 662213 668632 674821 681592 689601 698947 709638 721839 735279
59343 735279 748909 761704 773616 785360 797527 810113 822565 833922 843250 850326 855613 859218
59331 859218 860228 857587 851455 843194 834113 824618 814433 803168 790637 777092 763313 750222 738275
59318 738275 727394 717510 708875 701716 695787 690475 685380 680696 676996 674621 673271 672245 671124 670174
59304 670174 670143 671786 675591 681714 689937 699776 710831 722902 735414 746574 753443 753374 745728 732157
59290 732157 715236 696959 678539 661070 645571 632265 620436 609520 600022 592939 588490 585929
59278 585929 584540 584304 585520 588217 592169 597226 603433 610957 619937 630213 641218 652409 663822
59265 663822 675852 688395 700563 711407 720588 728062 733501 736418 736727 734755 730701 724429 715928
$$ packed form
59356F26415O416P438P618P371O955O419O189O771Q009R346J0691J2201J3440
59343G35279J3630J2795J1912J1744J2167J2586J2452J1357R328P076N287L605
59331H59218J010k641o132q261r081r495j0185j1265j2531j3545j3779j3091j1947
59318G38275j0881r884q635p159n929n312n095m684l700k375j350j026j121r50
59304F70174l1J643L805O123Q223R839J1055J2071J2512J1160O869o9p646j3571
59290G32157j6921j8277j8420j7469j5499j3306j1829j0916r498p083m449k561
59278E85929j389k36J216K697L952N057O207P524Q980J0276J1005J1191J1413
59265F63822J2030J2543J2168J0844R181P474N439K917L09j972m054o272q501
$$ plain form
59252 715928 705797 695128 684951 675769 667551 660065 653280 647429 642687 638870 635574 632589 630077
59239 630077 628292 627235 626751 626878 627889 629883 632512 635318 638244 641511 645015 648191 650680 652843 655320
59224 655320 658156 660617 661886 661756 660612 658833 656340 652765 648054 642787 637746 633241 629086 625212
59210 625212 621984 619795 618559 617732 616638 614773 612102 609214 606867 605226 603857 602557 601727 601597 601591 600962
59194 600962 599757 598631 597875 597172 596307 595623 595656 596547 597792 598480 598030 596950 596620 597929 600400 603003 605548
59177 605548 608666 612625 616826 620584 623877 627161 630769 634617 638279 641408 644339 648100 653512 660442
59163 660442 668237 676587 685418 694242 702346 709479 715704 720607 723421 724066 723339 721872 719524 715966 711249
59148 711249 705484 698560 690550 681966 673271 664508 655647 646925 638558 630463 622512 614779 607380 600403
$$ packed form
59252G15928j0131j0669j0177r182q218p486o785n851m742l817l296k985k512
59239F30077j785j057m84J27J011J994K629K806K926L267L504L176K489K163K477
59224F55320K836K461J269j30j144j779k493l575m711n267n041m505m155l874
59210F25212l228k189j236q27j094j865k671k888k347j641j369j300q30j30oo29
59194F00962j205j126p56p03q65o84L3Q91J245O88m50j080l30J309K471K603K545
59177F05548L118L959M201L758L293L284L608L848L662L129K931L761N412O930
59163F60442P795Q350Q831Q824Q104P133O225M903K814O45p27j467k348l558m717
59148G11249n765o924q010q584q695q763q861q722q367q095p951p733p399o977
$$ plain form
59134 600403 594078 588607 583688 578706 573622 569215 566206 564551 563828 563896 564839 566639 569265 572826 577348
59119 577348 582650 588646 595466 603123 611432 620433 630456 641519 653002 664176 674676 684264 692576
59106 692576 699506 705468 710924 715971 720641 725179 729613 733406 735957 737207 737429 736776 735456 733972 732655
59091 732655 731145 728820 725640 722215 719181 716879 715384 714382 713127 710981 707985 704570 700757 696003
59077 696003 689823 682273 673874 665338 657318 650071 643332 636678 630002 623502 617343 611558 606215 601437
59063 601437 597260 593618 590387 587312 584028 580310 576245 572054 567888 563854 560083 556610 553329 550200
59049 550200 547367 545032 543388 542625 542644 542738 542036 540502 539032 538305 538034 537711 537567 538128 539171 539912 540228
59032 540228 540945 542730 545243 547717 550016 552813 556851 562306 568851 576145 584226 593430 604024 615943
$$ packed form
59134F00403o325n471m919m982n084m407l009j655p23O8R43J800K626L561M522
59119E77348N302N996O820P657Q309R001J0023J1063J1483J1174J0500R588Q312
59106F92576O930N962N456N047M670M538M434L793K551J250K22o53j320j484j317
59091G32655j510k325l180l425l034k302j495j002j255k146k996l415l813m754
59077F96003o180p550q399q536q020p247o739o654o676o500o159n785n343m778
59063F01437m177l642l231l075l284l718m065m191m166m034l771l473l281l129
59049E50200k833k335j644p63J9R4p02j534j470p27k71l23j44N61J043P41L16
59032E40228P17J785K513K474K299K797M038N455O545P294Q081R204J0594J1919
$$ plain form
59018 615943 628867 642395 656146 669845 683332 696333 708141 717740 724366 727905 728695 727208 724023
59005 724023 719922 715696 711874 708727 706469 705347 705531 706908 709067 711639 714721 718711 723476 727966
58991 727966 731077 732750 733749 734475 734573 733746 732316 730731 728993 726839 724139 720912 717320 713858 711227
58976 711227 709884 709983 711791 715676 721588 728997 737516 747142 757799 769188 781233 794049 807272
58963 807272 820121 832384 844566 856610 867312 875671 882118 887601 891940 893990 893125 889657 883893
58950 883893 875588 864502 850948 835676 819545 803267 787155 771214 755694 741316 728646 717588
58938 717588 707877 699727 693433 688601 684415 680573 677396 675024 673025 670905 668652 666711 665619 665537 665924
58923 665924 665845 664869 663485 662389 661626 660698 659177 656870 653761 650357 647785 646940 647588 648749 649811 650878
$$ packed form
59018F15943J2924J3528J3751J3699J3487J3001J1808R599O626L539P90j487l185
59005G24023m101m226l822l147k258j122J84J377K159K572L082L990M765M490
58991G27966L111J673R99P26R8q27j430j585j738k154k700l227l592l462k631
58976G11227j343R9J808L885N912P409Q519R626J0657J1389J2045J2816J3223
58963H07272J2849J2263J2182J2044J0702Q359O447N483M339K050q65l468n764
58950H83893q305j1086j3554j5272j6131j6278j6112j5941j5520j4378j2670j1058
58938G17588r711q150o294m832m186l842l177k372j999k120k253j941j092q2L87
58923F65924p9r76j384j096p63r28j521k307l109l404k572q45O48J161J062J067
$$ plain form
58907 650878 652302 654386 657410 661457 666319 672029 679290 688806 700250 712462 724669 737059 750121
58894 750121 763876 777829 791309 803727 814840 824984 835023 846048 858997 874220 891243
58883 891243 909197 927592 946248 964397 980477 993242 1002620 1009072 1012602 1012895 1009959 1004031 995266
58870 995266 984062 971251 957336 942023 925210 907980 891779 877024 863477 851590 842281 835349
58858 835349 829239 822613 815270 807320 798449 788497 778099 768139 758875 749962 741058 732205 723847 716552
58844 716552 710486 705134 699814 694390 689138 684052 678708 672724 665987 658538 650676 643022 636017 629488
58830 629488 623149 617336 612685 609286 606703 604700 603355 602572 602193 602493 603971 606663 610222 614470 619190
58815 619190 623563 626757 629141 632042 636120 640707 644904 648549 651819 654568 656457 657257 656771 654952 652263
$$ packed form
58907F50878J424K084L024M047M862N710P261R516J1444J2212J2207J2390J3062
58894G50121J3755J3953J3480J2418J1113J0144J0039J1025J2949J5223J7023
58883H91243J7954J8395J8656J8149J6080J2765R378O452L530K93k936n928q765
58870I95266j1204j2811j3915j5313j6813j7230j6201j4755j3547j1887r309o932
58858H35349o110o626p343p950q871r952j0398r960r264q913q904q853q358p295
58844G16552o066n352n320n424n252n086n344n984o737p449p862p654p005o529
58830F29488o339n813m651l399k583k003j345p83l79L00J478K692L559M248M720
58815F19190M373L194K384K901M078M587M197L645L270K749J889Q00m86j819k689
$$ plain form
58800 652263 649426 646539 642941 638096 632191 625739 619116 612654 606618 600766 594455 587546 580931 575872
58786 575872 572947 571711 571190 570668 570230 570504 571779 573680 575949 579059 583475 588673 593648 598049 602016
58771 602016 605046 606052 604633 601491 597464 592846 587661 581863 575208 567718 560269 553870 548307 542474
58757 542474 536238 530980 527971 527126 527668 529096 531016 532978 535136 538364 543067 548432 553420 557919 562404
58742 562404 567020 571675 576587 582078 588021 594005 599836 605591 611427 617616 624411 631599 638486 644604
58728 644604 650092 655234 659991 664232 667958 670996 672885 673355 672666 671252 669375 667298 665476 664350 664183
58713 664183 665106 667040 669585 672406 675615 679292 682773 685071 685942 685872 685069 683255 680386 676604 671392
58698 671392 663820 653969 643141 632236 620772 608021 594284 580522 567408 555296 544480 534951
$$ packed form
58800F52263k837k887l598m845n905o452o623o462o036n852o311o909o615n059
58786E75872k925j236n21n22m38K74J275J901K269L110M416N198M975M401L967
58771F02016L030J006j419l142m027m618n185n798o655p490p449o399n563n833
58757E42474o236n258l009q45N42J428J920J962K158L228M703N365M988M499M485
58742E62404M616M655M912N491N943N984N831N755N836O189O795P188O887O118
58728F44604N488N142M757M241L726L038J889M70o89j414j877k077j822j126j67
58713F64183R23J934K545K821L209L677L481K298Q71p0q03j814k869l782n212
58698F71392p572r851j0828j0905j1464j2751j3737j3762j3114j2112j0816r529
$$ plain form
58686 534951 526417 518955 513031 508548 504602 500566 496687 493210 489783 486271 483285 481157 479135 476422
58672 476422 473364 470874 469294 468670 469529 472331 476474 480801 484982 489637 495306 502034 509779 518330 526725
58657 526725 533437 537488 539108 539271 538746 537596 535392 531972 527984 524444 521705 519234 516481 513474 510389
58642 510389 507136 503730 500623 498218 496340 494498 492410 490074 487713 485901 485340 486249 488224 490721 493281
58627 493281 495383 496764 497932 499614 501531 502603 502625 502840 504394 507024 509792 512334 514827 517452 520546
58612 520546 524668 529891 535472 540722 545656 550395 554579 557931 560764 563398 565633 567302 568700 569936
58598 569936 570569 570477 570426 571075 571990 572270 571609 570205 568286 566397 565514 566178 568032 570787 574946 580922 588168
58581 588168 595929 604200 613221 622717 632435 642686 653403 663386 671473 677940 683735 689039 693733 698723
$$ packed form
58686E34951q534p462n924m483l946m036l879l477l427l512k986k128k022k713
58672D76422l058k490j580o24Q59K802M143M327M181M655N669O728P745Q551Q395
58657E26725O712M051J620J63n25j150k204l420l988l540k739k471k753l007l085
58642E10389l253l406l107k405j878j842k088k336k361j812n61R09J975K497K560
58627D93281K102J381J168J682J917J072K2K15J554K630K768K542K493K625L094
58612E20546M122N223N581N250M934M739M184L352K833K634K235J669J398J236
58598E69936O33r2n1O49R15K80o61j404j919j889q83O64J854K755M159N976P246
58581E88168P761Q271R021R496R718J0251J0717R983Q087O467N795N304M694M990
$$ plain form
58567 698723 705404 714086 724187 735733 749354 764837 781064 797748 816122 837439 861487 886914
58555 886914 912308 936510 958348 976595 990299 999145 1003619 1004679 1003183 999794 995352 990718 986009
58542 986009 980587 974131 967060 959507 950615 939454 926026 910674 893164 873191 851377 829011
58530 829011 807104 786273 767101 749860 734289 720344 708784 700323 694518 690157 686418 683083
58518 683083 680087 677526 675679 674392 672801 670320 667490 665225 663671 662460 661528 660957 660413 659525 658494
58503 658494 657675 656836 655474 653553 651496 649830 649157 649803 651066 651563 650926 650345 650826 651810 652366 652856 654414
58486 654414 657410 661445 666252 671708 677554 683993 692016 702285 714315 727470 741999 758208 775467
58473 775467 792962 810560 827843 843116 854615 861995 865647 865402 861189 854124 845614 836078 825815
$$ packed form
58567F98723O681Q682J0101J1546J3621J5483J6227J6684J8374K1317K4048K5427
58555H86914K5394K4202K1838J8247J3704Q846M474J060j496l389m442m634m709
58542I86009n422o456p071p553q892j1161j3428j5352j7510j9973k1814k2366
58530H29011k1907k0831j9172j7241j5571j3945j1560q461n805m361l739l335
58518F83083k996k561j847j287j591k481k830k265j554j211r32n71n44q88j031
58503F58494q19q39j362j921k057j666o73O46J263M97o37n81M81R84N56M90J558
58486F54414K996M035M807N456N846O439Q023J0269J2030J3155J4529J6209J7259
58473G75467J7495J7598J7283J5273J1499P380L652k45m213p065q510r536j0263
$$ plain form
58460 825815 816264 808855 803308 798587 794976 793680 794960 798257 803633 811456 821006 830994 841071 851263
58446 851263 860277 866104 868173 867351 863988 857501 847903 836302 823874 811520 800293 790846 782751
58433 782751 775595 770352 768235 768691 770105 772107 775461 780089 785181 791222 799867 811413 823999 835716
58419 835716 846207 855930 865085 873537 880701 885448 887059 886097 883355 878398 870472 860399 850056 840280
58405 840280 830740 821566 813540 806793 800808 795517 791048 786810 782406 779047 778433 780474 783739 787701
58391 787701 792786 798684 804534 810410 816652 822081 825063 826170 827581 829880 831631 832149 832436 833147 833792
58376 833792 834344 835588 837480 839017 840102 841832 844753 848575 853530 860117 867532 874449 881325 889807
58362 889807 899876 909963 919931 931411 944826 958625 972023 986035 1001103 1015932 1029407 1041480
$$ packed form
58460H25815r551p409n547m721l611j296J280L297N376P823R550R988J0077J0192
58446H51263R014N827K069q22l363o487r598j1601j2428j2354j1227r447q095
58433G82751p156n243k117M56J414K002L354M628N092O041Q645J1546J2586J1717
58419H35716J0491R723R155Q452P164M747J611r62k742m957p926j0073j0343r776
58405H40280r540r174q026o747n985n291m469m238m404l359o14K041L265L962
58391G87701N085N898N850N876O242N429K982J107J411K299J751N18K87P11O45
58376H33792N52J244J892J537J085J730K921L822M955O587P415O917O876Q482
58362H89807J0069J0087R968J1480J3415J3799J3398J4012J5068J4829J3475J2073
$$ plain form
58350 1041480 1051596 1058503 1062390 1065111 1067569 1069020 1069551 1070939 1074198 1078456 1083159 1089323 1097657 1107379
58336 1107379 1117799 1129302 1142013 1155297 1169159 1184344 1200554 1216488 1232052 1248454 1265707
58325 1265707 1282180 1297067 1311089 1324270 1335374 1344102 1351588 1358171 1363038 1366550 1370469 1375325 1379990
58312 1379990 1384348 1389801 1396643 1403678 1411012 1420394 1432102 1444418 1456937 1471391 1488244 1505560
58300 1505560 1522354 1540106 1559729 1579907 1599641 1619608 1639869 1659083 1677190 1696038 1716207
58289 1716207 1736100 1755199 1775206 1796915 1819184 1842048 1867490 1895812 1924680 1953117 1983039
58278 1983039 2015379 2048288 2080797 2114769 2151533 2190022 2229799 2272333 2317559 2362903 2407553
58267 2407553 2454044 2503910 2555579 2608318 2664213 2724190 2786163 2849238 2915655 2986425 3059249
$$ packed form
58350A041480J0116O907L887K721K458J451N31J388L259M258M703O164Q334R722
58336A107379J0420J1503J2711J3284J3862J5185J6210J5934J5564J6402J7253
58325A265707J6473J4887J4022J3181J1104Q728P486O583M867L512L919M856M665
58312A379990M358N453O842P035P334R382J1708J2316J2519J4454J6853J7316
58300A505560J6794J7752J9623K0178J9734J9967K0261J9214J8107J8848K0169
58289A716207J9893J9099K0007K1709K2269K2864K5442K8322K8868K8437K9922
58278A983039L2340L2909L2509L3972L6764L8489L9777M2534M5226M5344M4650
58267B407553M6491M9866N1669N2739N5895N9977O1973O3075O6417P0770P2824
$$ plain form
58256 3059249 3132975 3209762 3290432 3372157 3453317 3536171 3622054 3708648 3794929 3884262 3979540
58245 3979540 4079738 4184190 4295478 4415024 4540615 4671446 4810797 4960649 5118852
58236 5118852 5284708 5461852 5652270 5853228 6063706 6287925 6528824 6784364 7054312
58227 7054312 7344132 7657814 7993512 8350754 8734993 9150417 9595894 10073177 10591284
58218 10591284 11157292 11770974 12434433 13158374 13952658 14820097 15766725 16808774 17962245
58209 17962245 19236209 20645044 22217137 23983529 25970623 28214889 30773908 33715083
58201 33715083 37110679 41059018 45697473 51181980 57670141 65339321 74405093 85113282
58193 85113282 97749660 112690247 130418896 151459230 176285766 205242507 238318295
$$ packed form
58256C059249P3726P6787Q0670Q1725Q1160Q2854Q5883Q6594Q6281Q9333R5278
58245C979540J00198J04452J11288J19546J25591J30831J39351J49852J58203
58236E118852J65856J77144J90418K00958K10478K24219K40899K55540K69948
58227G054312K89820L13682L35698L57242L84239M15424M45477M77283N18107
58218A0591284N66008O13682O63459P23941P94284Q67439R46628J042049J153471
58209A7962245J273964J408835J572093J766392J987094K244266K559019K941175
58201C3715083L395596L948339M638455N484507O488161P669180R065772J0708189
58193H5113282J2636378J4940587J7728649K1040334K4826536K8956741L3075788
$$ plain form
58186 238318295 274678584 312221985 347624241 376992642 396775452 404529207 399425740
58179 399425740 382458841 356182862 323945568 288984765 253882303 220482587 189993437
58172 189993437 163049308 139786308 120008694 103367953 89455977 77842858 68125191
58165 68125191 59966353 53090066 47257847 42272825 37989302 34295742 31092831 28296537
58157 28296537 25846919 23696146 21794107 20095823 18572793 17204743 15967635 14839750
58149 14839750 13811288 12877080 12026001 11246283 10534268 9888573 9301411 8763862 8273892
58140 8273892 7830928 7427661 7054737 6708607 6387748 6086164 5797889 5523618 5266287
58131 5266287 5024239 4794740 4579704 4381529 4197174 4022351 3857876 3706146 3565067
$$ packed form
58186B38318295L6360289L7543401L5402256K9368401J9782810P753755n103467
58179C99425740j6966899k6275979l2237294l4960803l5102462l3399716l0489150
58172A89993437k6944129k3263000j9777614j6640741j3911976j1613119r717667
58165F8125191q158838o876287n832219m985022m283523l693560l202911k796294
58157B8296537k449618k150773j902039j698284j523030j368050j237108j127885
58149A4839750j028462r34208q51079p79718p12015o45695n87162n37549m89970
58140H273892m42964m03267l72924l46130l20859l01584k88275k74271k57331
58131E266287k42048k29499k15036j98175j84355j74823j64475j51730j41079
$$ plain form
58122 3565067 3431129 3305016 3188666 3080024 2975940 2877128 2785282 2698427 2614019 2533494
58112 2533494 2458885 2388017 2317832 2249507 2185536 2124718 2064799 2007152 1953906 1903068 1851507
58101 1851507 1800515 1753560 1710457 1668411 1627028 1587838 1550466 1513542 1477981 1445396 1414686
58090 1414686 1383864 1353788 1326499 1301457 1276867 1253126 1231444 1210670 1188969 1167166 1147081
58079 1147081 1128046 1108346 1088528 1069962 1051675 1031957 1011720 992974 975254 956727 937593
58068 937593 919367 902065 885010 869013 854864 841142 826500 812598 801696 792814 783413 773453
58056 773453 764472 755972 746152 735327 725320 716160 706365 695868 685908 676699 667835 660130 654485
58043 654485 649777 644301 638318 632844 627198 620366 613460 608085 603455 597873 591821 586698 581719 575092
$$ packed form
58122C565067j33938j26113j16350j08642j04084r8812r1846q6855q4408q0525
58112B533494p4609p0868p0185o8325o3971o0818n9919n7647n3246n0838n1561
58101A851507n0992m6955m3103m2046m1383l9190l7372l6924l5561l2585l0710
58090A414686l0822l0076k7289k5042k4590k3741k1682k0774k1701k1803k0085
58079A147081j9035j9700j9818j8566j8287j9718k0237j8746j7720j8527j9134
58068I37593j8226j7302j7055j5997j4149j3722j4642j3902j0902q882r401r960
58056G73453q981q500r820j0825j0007r160r795j0497r960r209q864p705n645
58043F54485m708n476n983n474n646o832o906n375m630n582o052n123m979o627
$$ plain form
58029 575092 567186 559502 551591 542186 532381 524317 517389 509100 499198 489744 481499 473516 466053 460595
58015 460595 456919 453063 448331 443619 438924 433417 427944 424480 422817 420488 416315 411498 406982 402269
58001 402269 397245 392814 389245 385939 383048 381298 380145 378213 375629 373844 373156 372576 372135 373051 375466
57986 375466 378140 380605 383514 386769 389353 391146 392816 393836 392756 389656 386268 383493 380763 377906
57972 377906 375494 373249 370251 366968 364947 364239 363320 361848 361220 361994 362911 363085 363127 363526 363843 364110 365073
57955 365073 366375 366411 364673 362524 360986 359444 357205 354691 352451 350523 349314 349585 351075 352698 354471
57940 354471 357564 362055 366561 370701 376009 383534 392314 401196 410451 420469 430264 438434 444503 448394
57926 448394 449719 448547 445862 442383 437840 432055 425738 419502 413102 406314 399627 393413 387382 381563
$$ packed form
58029E75092p906p684p911r405r805q064o928q289r902r454q245p983p463n458
58015D60595l676l856m732m712m695n507n473l464j663k329m173m817m516m713
58001D02269n024m431l569l306k891j750j153j932k584j785o88n80m41R16K415
57986C75466K674K465K909L255K584J793J670J020j080l100l388k775k730k857
57972C77906k412k245k998l283k021p08r19j472o28P74R17J74M2L99L17K67R63
57955C65073J302L6j738k149j538j542k239k514k240j928j209K71J490J623J773
57940C54471L093M491M506M140N308P525Q780Q882R255J0018R795Q170O069L891
57926D48394J325j172k685l479m543n785o317o236o400o788o687o214o031n819
$$ plain form
57912 381563 376927 374249 372979 371863 370174 368024 366057 365105 365477 366343 366405 365153 362885 359814 356101
57897 356101 352455 349463 346497 342644 338603 336137 335596 335536 335048 334823 335489 336422 336865 336871 336523 335459 333811
57880 333811 332499 331944 331485 330575 329523 328604 327498 326100 324867 323926 322855 321761 321485 322308 323512 324636
57864 324636 326143 328366 330874 333313 335852 338431 340620 342681 345627 349713 353887 357217 359854 362090
57850 362090 363518 363710 362823 361066 358395 355075 351631 347934 343361 338080 333107 328814 324559 320141 316344
57835 316344 313542 311024 308250 305669 303741 302240 301008 300318 300045 299614 299190 299681 301131 302439 303157 304060
57819 304060 305391 306120 305847 305852 307133 308721 309156 308492 307587 306444 304468 301526 297641 292453 286066 279651
57803 279651 274220 269596 265538 262857 262238 262826 263298 263665 264734 266411 267884 269083 270721 273096 275939
$$ packed form
57912C81563m636k678j270j116j689k150j967r52L72Q66O2j252k268l071l713
57897C56101l646k992k966l853m041k466n41o0m88k25O66R33M43Ol48j064j648
57880C33811j312n55m59r10j052r19j106j398j233r41j071j094k76Q23J204J124
57864C24636J507K223K508K439K539K579K189K061K946M086M174L330K637K236
57850C62090J428J92q87j757k671l320l444l697m573n281m973m293m255m418l797
57835C16344k802k518k774k581j928j501j232o90k73m31m24M91J450J308P18R03
57819C04060J331P29k73NJ281J588M35o64r05j143j976k942l885n188o387o415
57803B79651n431m624m058k681o19N88M72L67J069J677J473J199J638K375K843
$$ plain form
57788 275939 279191 282946 286850 290543 294432 299109 304154 308463 311688 314561 317835 321599 325640 329806
57774 329806 333891 337529 340239 341497 341009 339055 336196 332511 327648 321706 315373 309000 302362 295683
57760 295683 289948 285608 281882 278024 274462 271859 269826 267544 265169 263612 263237 263676 264733 266650 269478
57745 269478 272824 276276 279719 283286 287105 290969 294201 296245 297378 298357 299363 299998 300297 300866 301862
57730 301862 302804 303628 304850 306327 306994 306407 305527 305264 305243 304676 303480 301777 299280 296113 293363 291785
57714 291785 290675 288923 286522 284143 281928 279613 277166 274412 270759 266212 261948 258848 256185 252856
57700 252856 249215 246460 244733 243147 241373 239971 239277 239074 239259 239894 240724 241506 242609 244428 246404 247563
57684 247563 247904 248428 249914 252435 255886 260234 265426 271754 280095 291220 305245 322487 344297 372102
$$ packed form
57788B75939L252L755L904L693L889M677N045M309L225K873L274L764M041M166
57774C29806M085L638K710J258m88j954k859l685m863n942o333o373o638o679
57760B95683n735m340l726l858l562k603k033k282k375j557l75M39J057J917K828
57745B69478L346L452L443L567L819L864L232K044J133R79J006O35K99N69R96
57730C01862R42Q24J222J477O67n87q80k63k1n67j196j703k497l167k750j578
57714B91785j110j752k401k379k215k315k447k754l653m547m264l100k663l329
57700B52856l641k755j727j586j774j402o94k03J85O35Q30P82J103J819J976J159
57684B47563L41N24J486K521L451M348N192O328Q341J1125J4025J7242K1810K7805
$$ plain form
57670 372102 406017 445581 491667 546437 610990 683384 758371 827967 882575 913432 915630 889611
57658 889611 840451 776072 705120 634700 569131 510592 460375 418942 385344 357732 334638
57647 334638 315348 299378 286362 276297 269134 264176 260431 257394 254909 252629 250319 248406 247450
57634 247450 247227 247049 246723 246469 246193 245714 245497 246192 247445 248063 247400 245854 243969 241798 239252 236446 233637
57617 233637 231295 230118 230346 231152 231363 230653 229476 228056 226221 224123 222298 220906 219552 217902 215939
57602 215939 213661 211155 208882 207322 206336 205386 204226 202839 200934 198215 195061 192207 189892 187914 186401
57587 186401 185754 185825 185840 185213 183918 182150 180143 178328 177151 176775 177202 178357 179622 179853 178548 176595
57571 176595 175157 174241 173136 171773 170612 169514 167892 165806 163914 162406 161030 160068 160161 161140 162093 162686
$$ packed form
57670C72102L3915L9564M6086N4770O4553P2394P4987O9596N4608L0857K198k6019
57658H89611m9160o4379p0952p0420o5569n8539n0217m1433l3598k7612k3094
57647C34638j9290j5970j3016j0065p163m958l745l037k485k280k310j913r56
57634B47450k23j78l26k54k76m79k17O95J253O18o63j546j885k171k546k806k809
57617B33637k342j177K28Q06K11p10j177j420j835k098j825j392j354j650j963
57602B15939k278k506k273j560r86r50j160j387j905k719l154k854k315j978j513
57587A86401o47P1J5o27j295j768k007j815j177l76M27J155J265K31j305j953
57571A76595j438r16j105j363j161j098j622k086j892j508j376r62R3R79R53N93
$$ plain form
57555 162686 163402 164334 164862 164816 164961 165948 167565 169326 170963 172053 171976 170705 168994 167446 165932 164181
57539 164181 162306 160519 158872 157497 156555 155799 154681 153019 151086 149065 146967 145003 143310 141422 138778
57524 138778 135752 133282 131504 129709 127841 126974 127838 129743 131517 132874 134356 136387 138869 141390 143637
57509 143637 145783 148406 151625 154528 156152 156860 157972 160032 162309 163945 164704 164546 163509 162217 161472
57494 161472 161082 160070 158345 157109 157106 157466 156951 155506 153910 152542 151231 149825 148366 147088 146573 147379
57478 147379 149152 150694 151239 151048 150504 149383 147500 145341 143480 141942 140594 139523 138525 136969 134848
57463 134848 133314 133432 134808 136124 136621 136417 135773 134837 133947 133514 133617 134063 134764 135742 136932 138198 139346
57446 139346 139969 139682 138671 137627 136933 136357 135772 135649 136497 138265 140558 143010 145166 146528 147104 147454
$$ packed form
57555A62686P16R32N28m6J45R87J617J761J637J090p7j271j711j548j514j751
57539A64181j875j787j647j375r42p56j118j662j933k021k098j964j693j888k644
57524A38778l026k470j778j795j868q67Q64J905J774J357J482K031K482K521K247
57509A43637K146K623L219K903J624P08J112K060K277J636P59j58j037j292p45
57494A61472l90j012j725j236lL60n15j445j596j368j311j406j459j278n15Q06
57478A47379J773J542N45j91n44j121j883k159j861j538j348j071r98j556k121
57463A34848j534J18J376J316M97k04o44r36q90m33J03M46P01R78J190J266J148
57446A39346O23k87j011j044o94n76n85j23Q48J768K293K452K156J362N76L50
$$ plain form
57430 147454 147950 148413 148684 148887 148845 147959 146184 144514 143925 144347 145172 146215 147543 148842 149671 150049 150211
57413 150211 150091 149570 148938 148623 148698 149114 150092 151791 153863 155784 157354 158482 158837 158270 157275 156545 156262
57396 156262 156244 156494 157170 158218 159419 160616 161630 162308 162969 164330 166573 168929 170693 172154 174025 176358
57380 176358 178736 181139 183836 186587 188711 189921 190461 190424 189510 187583 185072 182685 180963 180011 179410 178496
57364 178496 177052 175625 174946 175216 176151 177426 178781 179952 180801 181335 181407 180801 179908 179817 181181 183325 185001
57347 185001 185766 186062 186288 186497 186822 187437 188008 187842 186814 185741 185631 186795 188748 190681 191971 192457 192345
57330 192345 191833 190945 189869 189232 189708 191386 193679 195789 197156 197664 197631 197547 197687 198076 198770 199877 201235
57313 201235 202443 203407 204435 205675 206836 207785 208946 210708 212722 214232 214951 215313 215954 217185 218804
$$ packed form
57430A47454M96M63K71K03m2q86j775j670n89M22Q25J043J328J299Q29L78J62
57413A50211j20n21o32l15P5M16R78J699K072J921J570J128L55n67r95p30k83
57396A56262j8K50O76J048J201J197J014O78O61J361K243K356J764J461J871K333
57380A76358K378K403K697K751K124J210N40l7r14j927k511k387j722r52o01r14
57364A78496j444j427o79K70R35J275J355J171Q49N34P2o06q93r1J364K144J676
57347A85001P65K96K26K09L25O15N71j66j028j073j10J164J953J933J290M86j12
57330A92345n12q88j076o37M76J678K293K110J367N08l3q4J40L89O94J107J358
57313B01235J208R64J028J240J161R49J161J762K014J510P19L62O41J231J619
$$ plain form
57298 218804 220328 221525 222738 224360 226117 227449 228557 230346 233109 236056 238474 240520 242384 243558
57284 243558 243683 243427 243628 244105 244195 244003 244127 244416 244041 242724 240964 239045 236767 234341 232677 232315 232621
57267 232621 232473 231523 230506 230453 231711 233667 235375 236453 237249 238220 239544 241410 244104 247486 250882 253940
57251 253940 257158 261057 265306 269248 272905 276792 280995 285168 289234 293419 297661 301613 305194 308700
57237 308700 312464 316828 322125 328106 333673 337890 341166 344772 349335 354473 359886 365990 373248 381424
57223 381424 389776 397714 405191 412632 420392 428130 435066 441169 447658 455775 465437 475645 485804 495896
57209 495896 505739 515098 524401 534472 545474 556877 568436 580433 592988 605953 619537 634171
57197 634171 649662 665261 680712 696372 712145 727224 741223 754752 768465 782337 796298
$$ packed form
57298B18804J524J197J213J622J757J332J108J789K763K947K418K046J864J174
57284B43558J25k56K01M77R0j92J24K89l75j317j760j919k278k426j664l62L06
57267B32621j48r50j017n3J258J956J708J078P96R71J324J866K694L382L396L058
57251B53940L218L899M249L942L657L887M203M173M066M185M242L952L581L506
57237C08700L764M364N297N981N567M217L276L606M563N138N413O104P258Q176
57223C81424Q352P938P477P441P760P738O936O103O489Q117R662J0208J0159J0092
57209D95896R843R359R303J0071J1002J1403J1559J1997J2555J2965J3584J4634
57197F34171J5491J5599J5451J5660J5773J5079J3999J3529J3713J3872J3961
$$ plain form
57186 796298 810794 826072 841523 856423 870861 885338 899801 913752 927193 940836 955374
57175 955374 970882 986978 1003343 1020029 1037342 1055347 1073548 1091261 1108273 1124924 1141635
57164 1141635 1158700 1176459 1195208 1214872 1235208 1256358 1278736 1302253 1326244 1350402 1375259
57153 1375259 1401379 1428433 1455496 1482033 1508335 1535172 1563213 1592499 1622212 1651176 1678893
57142 1678893 1706056 1733859 1762883 1792717 1822578 1852240 1882413 1914179 1947929 1983051 2018938
57131 2018938 2056064 2095593 2138045 2182939 2229754 2278524 2329250 2381446 2434870 2490349 2549336
57120 2549336 2612701 2680340 2751914 2827718 2908819 2996591 3092149 3196094 3308725 3430480 3562265
57109 3562265 3705576 3862657 4036560 4230898 4449493 4696483 4976905 5297269 5665788
$$ packed form
57186G96298J4496J5278J5451J4900J4438J4477J4463J3951J3441J3643J4538
57175I55374J5508J6096J6365J6686J7313J8005J8201J7713J7012J6651J6711
57164A141635J7065J7759J8749J9664K0336K1150K2378K3517K3991K4158K4857
57153A375259K6120K7054K7063K6537K6302K6837K8041K9286K9713K8964K7717
57142A678893K7163K7803K9024K9834K9861K9662L0173L1766L3750L5122L5887
57131B018938L7126L9529M2452M4894M6815M8770N0726N2196N3424N5479N8987
57120B549336O3365O7639P1574P5804Q1101Q7772R5558J03945J12631J21755J31785
57109C562265J43311J57081J73903J94338K18595K46990K80422L20364L68519
$$ plain form
57100 5665788 6092389 6588755 7168614 7848390 8647656 9588364 10692676 11980709 13469303
57091 13469303 15171224 17093543 19235526 21587442 24130659 26837781 29671438 32581283
57083 32581283 35499820 38339247 40993004 43345251 45287858 46739231 47655964 48030047
57075 48030047 47872931 47198264 46017335 44350078 42240132 39760132 37004502 34077210
57067 34077210 31081177 28110289 25243253 22540126 20042008 17772478 15739781 13940075
57059 13940075 12361375 10986673 9795855 8767526 7880972 7117147 6458560 5889244 5395001
57050 5395001 4963024 4581412 4239980 3931647 3652000 3397077 3162314 2943932 2740388
57041 2740388 2551850 2378747 2221138 2078622 1950132 1834211 1729888 1636996 1555571 1485616
$$ packed form
57100E665788M26601M96366N79859O79776P99266R40708J104312J288033J488594
57091A3469303J701921J922319K141983K351916K543217K707122K833657K909845
57083C2581283K918537K839427K653757K352247J942607J451373R16733L74083
57075D8030047j57116o74667j180929j667257k109946k480000k755630k927292
57067C4077210k996033k970888k867036k703127k498118k269530k032697j799706
57059A3940075j578700j374702j190818j028329q86554p63825o58587n69316m94243
57050E395001m31977l81612l41432l08333k79647k54923k34763k18382k03544
57041B740388j88538j73103j57609j42516j28490j15921j04323r2892q1425o9955
$$ plain form
57031 1485616 1427598 1382262 1349475 1328141 1317838 1319588 1333740 1357089 1382409 1400532 1402870 1383463
57019 1383463 1340617 1277320 1199707 1114710 1028614 946509 871686 805279 746932 695943 651668
57008 651668 613284 579791 550343 524331 501288 480932 463095 447360 432999 419518 407025
56997 407025 395804 385745 376439 367600 359126 351009 343472 336997 331953 328337 326059 325320 326591 330377
56983 330377 336891 345561 354721 362206 366397 366517 362202 353509 341402 327452 312752 297756 283271
56970 283271 270714 260896 253299 247116 242407 239639 238765 239474 241932 246559 253431 262534 274291 289098
56956 289098 306397 324587 341624 355343 363655 365182 359836 348629 333168 315465 297603 280980
56944 280980 266043 253015 242408 234504 228952 225510 224732 227277 232940 241090 251802 265909 284009
$$ packed form
57031A485616n8018m5336l2787k1334j0303J750J4152K3349K5320J8123K338j9407
57019A383463m2846o3297p7613q4997q6096q2105p4823o6407n8347n0989m4275
57008F51668l8384l3493k9448k6012k3043k0356j7837j5735j4361j3481j2493
56997D07025j1221j0059r306q839q474q117p537o475n044l616k278p39J271L786
56983C30377O514Q670R160P485M191J20m315q693j2107j3950j4700j4996j4485
56970B83271j2557r818p597o183m709k768q74P09K458M627O872R103J1757J4807
56956B89098J7299J8190J7037J3719Q312J527n346j1207j5461j7703j7862j6623
56944B80980j4937j3028j0607p904n552l442p78K545N663Q150J0712J4107J8100
$$ plain form
56931 284009 305898 330595 356245 380018 398733 409740 411350 403116 386360 363975 338966 313214
56919 313214 287828 264027 242842 224392 208260 194380 182816 172940 163802 155282 148072 142469
56907 142469 137855 133449 128959 124423 120076 116506 114347 113570 113475 113527 113826 114673 116047 117721 119665 122306
56891 122306 126471 132952 141963 153263 166989 183921 204365 227001 249231 268457 282727 290680
56879 290680 291847 287156 278564 268070 257213 247186 238768 232221 227792 226329 228874 235630 245817
56866 245817 258668 274284 293617 317932 348232 384799 427074 473886 523337 572175 615754
56855 615754 649227 668955 673022 661385 636349 602491 565136 528604 495793 468635 448170 434520
56843 434520 427554 427449 434211 447292 466507 492954 528170 572764 626712 690348 763477 843105
$$ packed form
56931B84009K1889K4697K5650K3773J8715J1007J610q234j6756k2385k5009k5752
56919C13214k5386k3801k1185j8450j6132j3880j1564r876r138q520p210n603
56907A42469m614m406m490m536m347l570k159p77r5N2K99Q47J374J674J944K641
56891A22306M165O481R011J1300J3726J6932K0444K2636K2230J9226J4270P953
56879B90680J167m691q592j0494j0857j0027q418o547m429j463K545O756J0187
56866B45817J2851J5616J9333K4315L0300L6567M2275M6812M9451M8838M3579
56855F15754L3473J9728M067j1637k5036l3858l7355l6532l2811k7158k0465j3650
56843D34520o966j05O762J3081J9215K6447L5216M4594N3948O3636P3129P9628
$$ plain form
56831 843105 922812 994442 1049863 1081977 1086261 1062713 1015978 953193 881780 808496 738744 675743
56819 675743 620797 574669 538197 511544 493918 484533 483259 490043 504513 526727 557650 598135
56807 598135 647515 703208 760937 814800 857772 883349 887518 869743 832753 781597 722342 660807
56795 660807 601736 548320 501872 462215 428960 402379 382702 369081 360225 355948 357205 364599
56783 364599 377780 396406 420496 449189 479754 508284 530946 544513 546707 536894 516320 487391
56771 487391 452956 416110 379757 345739 314647 286561 261583 239655 220581 204338 190800
56760 190800 179116 168206 158071 149809 143969 139667 135586 131150 126437 121835 118134 116026 115014
56747 115014 113663 111424 109326 108301 107856 107133 106321 105957 105629 104592 103164 102357 102387 102604 102664 102774 102878
$$ packed form
56831H43105P9707P1630N5421L2114M284k3548m6735o2785p1413p3284o9752o3001
56819F75743n4946m6128l6472k6653j7626r385j274O784J4470K2214L0923M0485
56807E98135M9380N5693N7729N3863M2972K5577M169j7775l6990n1156n9255o1535
56795F60807n9071n3416m6448l9657l3255k6581j9677j3621q856m277J257P394
56783C64599J3181J8626K4090K8693L0565K8530K2662J3567K194r813k0574k8929
56771D87391l4435l6846l6353l4018l1092k8086k4978k1928j9074j6243j3538
56760A90800j1684j0910j0135q262n840m302m081m436m713m602l701k108j012
56747A15014j351k239k098j025m45p23q12l64l28j037j428q07L0K17O0J10J04
$$ plain form
56730 102878 102615 102111 101936 102191 102385 102335 102455 103006 103678 104102 104266 104318 104511 105464 107865 111489 114931 116781
56712 116781 116984 116771 117267 118417 119340 119529 119370 119454 119815 120216 120825 121979 123413 124473 125160 126146 127510
56695 127510 128299 127885 127013 126819 127356 127858 127991 128051 128124 127941 127544 127414 127813 128523 129292 130143 131174 132388 133709
56676 133709 134872 135395 135023 134119 133276 132626 131902 131129 130802 131308 132441 133602 134289 134428 134424 134917 136296 138399
56658 138399 140720 142846 144733 146672 149019 151757 154349 156302 157840 159665 162029 164450 166463 168107
56644 168107 169531 170606 171265 171815 172598 173644 174865 176143 177038 176935 175803 174324 172944 171352 169263
56629 169263 167106 165390 163920 162188 160086 157693 154885 151854 149473 148353 147924 147232 146311 145807 145564
56614 145564 144671 142946 141361 140728 140789 140927 141059 141350 141562 141190 140127 138903 138271 138566 139319 139606 138968 137879
$$ packed form
56730A02878k63n04j75K55J94n0J20N51O72M24J64N2J93R53K401L624L442J850
56712A16781K03k13M96J150R23J89j59Q4L61M01O09J154J434J060O87R86J364
56695A27510P89m14q72j94N37N02J33O0P3j83l97j30L99P10P69Q51J031J214J321
56676A33709J163N23l72r04q43o50p24p73l27N06J133J161O87J39mM93J379K103
56658A38399K321K126J887J939K347K738K592J953J538J825K364K421K013J644
56644A68107J424J075O59N50P83J046J221J278Q95j03j132j479j380j592k089
56629A69263k157j716j470j732k102k393k808l031k381j120m29o92r21n04k43
56614A45564q93j725j585o33O1J38J32K91K12l72j063j224o32K95P53K87o38j089
$$ plain form
56596 137879 137147 137069 137434 138011 138624 139033 139218 139566 140279 140863 140786 140371 140306 140481 140215 139587 139560 140487 141449 141606
56576 141606 141484 142178 143817 145601 147150 148939 151291 153660 155371 156676 158510 161294 164491 167506 170615
56561 170615 174694 180362 187799 197090 208056 219709 230558 239604 246550 250965 252110 250082 246441
56548 246441 242985 240236 237603 234619 231319 227781 224071 220587 217786 215547 213315 210868 208517 206583
56534 206583 205117 204048 203180 202030 200130 197617 195227 193652 193008 192804 192264 190885 188924 187137 185858
56519 185858 184629 182965 181052 179278 177541 175535 173398 171468 169644 167595 165403 163500 162139 161370
56505 161370 161285 161634 161499 160081 157771 155820 155015 155241 156206 157886 160178 162664 164873 166471 167313 167671
56489 167671 168163 168988 169527 169269 168755 168811 169174 168863 167816 167086 167318 168059 168820 169843 171295 172610 173288 173779
$$ packed form
56596A37879p32p8L65N77O13M09J85L48P13N84p7m15o5J75k66o28k7R27R62J57
56576A41606j22O94J639J784J549J789K352K369J711J305J834K784L197L015L109
56561A70615M079N668P437R291J0966J1653J0849R046O946M415J145k028l641
56548B46441l456k749k633k984l300l538l710l484k801k239k232k447k351j934
56534B06583j466j069q68j150j900k513k390j575o44k04n40j379j961j787j279
56519A85858j229j664j913j774j737k006k137j930j824k049k192j903j361p69
56505A61370q5L49j35j418k310j951q05K26R65J680K292K486K209J598Q42L58
56489A67671M92Q25N39k58n14N6L63l11j047p30K32P41P61J023J452J315O78M91
$$ plain form
56471 173779 174842 176431 177877 178976 180286 182330 184905 187294 188900 189569 189415 188568 187215 185756 184633
56456 184633 184029 184006 184874 186862 189286 190735 190529 189482 188764 188618 188746 189300 190586 192227 193594 194742
56440 194742 196035 197070 197080 196288 195787 195933 195887 195011 193838 193246 193344 193521 193081 191659 189546 187809 187509 188612
56422 188612 190047 190910 191159 191143 191111 191273 191772 192446 193026 193541 194112 194529 194636 194905 195930 197456 198678 199397
56404 199397 200069 200826 201351 201732 202475 203601 204597 205387 206401 207603 208406 208793 209500 210790 211908 212139 211616
56387 211616 210784 209875 209221 209267 209925 210636 211341 212644 214778 217272 219834 222659 225566 227810 229091 229890
56371 229890 230495 230664 230585 230995 231841 231946 230720 229188 228682 229419 231069 233619 236734 239212 240213 240441 241170
56354 241170 242681 244460 246292 248185 249708 250441 250736 251259 252092 252995 254078 255450 256632 257148 257382 258095
$$ packed form
56471A73779J063J589J446J099J310K044K575K389J606O69j54q47j353j459j123
56456A84633o04k3Q68J988K424J449k06j047p18j46J28N54J286J641J367J148
56440A94742J293J035J0p92n01J46m6q76j173n92R8J77m40j422k113j737l00J103
56422A88612J435Q63K49j6l2J62M99O74N80N15N71M17J07K69J025J526J222P19
56404A99397O72P57N25L81P43J126R96P90J014J202Q03L87P07J290J118K31n23
56387B11616q32r09o54M6O58P11P05J303K134K494K562K825K907K244J281P99
56371B29890O05J69p9M10Q46J05j226j532n06P37J650K550L115K478J001K28P29
56354B41170J511J779J832J893J523P33K95N23Q33R03J083J372J182N16K34P13
$$ plain form
56338 258095 259404 260929 262621 264697 267023 269273 271493 273916 276472 279044 281876 285095 288210 290726
56324 290726 292993 295758 299083 302327 305024 307227 309117 310808 312401 313829 314792 315202 315413 315743 316103
56309 316103 316399 316854 317587 318380 319325 321146 324337 328403 332520 336577 341011 345983 351317 356969 363003
56294 363003 369229 375239 380612 384934 387996 390215 392381 394819 397329 400097 403933 409268 415660 422681
56280 422681 430497 439140 448008 456619 465130 473728 482395 491729 502917 516126 529970 543407 557221
56267 557221 572722 589971 608412 628340 650498 674910 701382 730587 763455 799999 839931
56256 839931 883948 933201 987976 1048155 1114635 1189028 1272206 1364265 1465612 1576805 1697483
56245 1697483 1826573 1963296 2106749 2254641 2403693 2551233 2695194 2832594 2959299
$$ packed form
56338B58095J309J525J692K076K326K250K220K423K556K572K832L219L115K516
56324B90726K267K765L325L244K697K203J890J691J593J428R63M10K11L30L60
56309C16103K96M55P33P93R45J821L191M066M117M057M434M972N334N652O034
56294C63003O226O010N373M322L062K219K166K438K510K768L836N335O392P021
56280D22681P816Q643Q868Q611Q511Q598Q667R334J1188J3209J3844J3437J3814
56267E57221J5501J7249J8441J9928K2158K4412K6472K9205L2868L6544L9932
56256H39931M4017M9253N4775O0179O6480P4393Q3178R2059J01347J11193J20678
56245A697483J29090J36723J43453J47892J49052J47540J43961J37400J26705
$$ plain form
56236 2959299 3071499 3166373 3241229 3293220 3320440 3322625 3300636 3255930 3190656 3107475 3009070
56225 3009070 2898257 2778353 2652735 2524125 2394880 2267550 2144189 2025326 1910627
56216 1910627 1800514 1696297 1598824 1508021 1423715 1345909 1274121 1207376 1145123 1087464 1034450
56205 1034450 985831 941506 901494 865390 832513 802607 775753 751649 729634 709343 690758
56194 690758 673699 657990 644033 632486 623314 615667 608609 601584 594455 587664 582047 577936 574659
56181 574659 571396 568126 565263 562956 561331 560796 561370 562380 563517 565451 568565 571945 574626 577034 580018
56166 580018 583299 586256 589544 594369 600637 607339 614349 622382 631481 641052 651191 662583 675380
56153 675380 689588 706285 726913 751481 778919 809098 843139 881978 926188 977117 1036655
$$ packed form
56236B959299J12200R4874P4856N1991K7220K185k1989m4706o5274q3181r8405
56225C009070j10813j19904j25618j28610j29245j27330j23361j18863j14699
56216A910627j10113j04217r7473r0803q4306p7806p1788o6745o2253n7659n3014
56205A034450m8619m4325m0012l6104l2877k9906k6854k4104k2015k0291j8585
56194F90758j7059j5709j3957j1547r172p647p058p025p129o791n617m111l277
56181E74659l263l270k863k307j625n35N74J010J137J934L114L380K681K408K984
56166E80018L281K957L288M825O268O702P010Q033R099R571J0139J1392J2797
56153F75380J4208J6697K0628K4568K7438L0179L4041L8839M4210N0929N9538
$$ plain form
56142 1036655 1105835 1184893 1274267 1373619 1479678 1586591 1688747 1782255 1864282 1933116 1989427
56131 1989427 2036074 2076231 2112376 2146353 2178398 2205990 2225411 2234910 2235326 2228116 2214570 2196581
56119 2196581 2175836 2151538 2120489 2079698 2027600 1963102 1885791 1797734 1703385 1607181 1512537
56108 1512537 1422994 1342072 1271346 1210274 1158253 1115179 1079880 1050184 1025161 1005540 991409
56097 991409 981313 974028 969278 966181 963057 959567 957200 956885 957856 959512 962480 967050 972368 978057
56083 978057 984875 993006 1001390 1009540 1018283 1027932 1037438 1046198 1055021 1064528 1074236 1083968 1094538 1106328
56069 1106328 1118841 1132193 1147250 1163696 1179854 1195126 1210724 1227381 1244274 1260898 1277978
56058 1277978 1295884 1314195 1333396 1354779 1377911 1400481 1421474 1442164 1463288 1483783 1503273
$$ packed form
56142A036655O9180P9058Q9374R9352J06059J06913J02156R3508Q2027O8834N6311
56131A989427M6647M0157L6145L3977L2045K7592J9421R499M16p210j3546j7989
56119B196581k0745k4298l1049m0791n2098o4498p7311q8057r4349r6204r4644
56108A512537q9543q0922p0726o1072n2021m3074l5299k9696k5023j9621j4131
56097I91409j0096p285m750l097l124l490k367l15R71J656K968M570N318N689
56083I78057O818Q131Q384Q150Q743R649R506Q760Q823R507R708R732J0570J1790
56069A106328J2513J3352J5057J6446J6158J5272J5598J6657J6893J6624J7080
56058A277978J7906J8311J9201K1383K3132K2570K0993K0690K1124K0495J9490
$$ plain form
56047 1503273 1523089 1543616 1563196 1581074 1598964 1618355 1638763 1660056 1683894 1711126 1740078
56036 1740078 1769191 1799254 1831456 1865414 1900660 1937932 1977442 2017905 2058711 2101089 2145932
56025 2145932 2192637 2240987 2291702 2344161 2396384 2448346 2502351 2559160 2617023 2675758 2738070
56014 2738070 2805211 2875021 2946163 3020611 3099981 3183227 3270162 3363305 3463661 3568528 3676135
56003 3676135 3788614 3907757 4031918 4160140 4295263 4439646 4591785 4750494 4918494
55994 4918494 5098358 5288918 5489235 5702025 5929536 6170339 6424099 6695201 6987637
55985 6987637 7300809 7634521 7993396 8381909 8799999 9248448 9733634 10261923 10834602
55976 10834602 11453689 12127493 12864973 13670387 14549587 15515813 16583306 17761820 19064629
$$ packed form
56047A503273J9816K0527J9580J7878J7890J9391K0408K1293K3838K7232K8952
56036A740078K9113L0063L2202L3958L5246L7272L9510M0463M0806M2378M4843
56025B145932M6705M8350N0715N2459N2223N1962N4005N6809N7863N8735O2312
56014B738070O7141O9810P1142P4448P9370Q3246Q6935R3143J00356J04867J07607
56003C676135J12479J19143J24161J28222J35123J44383J52139J58709J68000
55994D918494J79864J90560K00317K12790K27511K40803K53760K71102K92436
55985F987637L13172L33712L58875L88513M18090M48449M85186N28289N72679
55976A0834602O19087O73804P37480Q05414Q79200R66226J067493J178514J302809
$$ plain form
55967 19064629 20515894 22143869 23975259 26045322 28407446 31127036 34278045 37957607
55959 37957607 42295595 47439310 53539068 60760253 69298592 79377368 91258452 105286894
55951 105286894 121912081 141635771 164931664 192164264 223385261 257898308 293789382
55944 293789382 327856647 356162912 374980707 381710518 375505259 357479471 330396455
55937 330396455 297860799 263352900 229566877 198238658 170286367 146017658 125323385
55930 125323385 107866130 93229408 80989780 70743062 62131329 54862532 48700006
55923 48700006 43442743 38925125 35022446 31638859 28690821 26107363 23835819 21834364
55915 21834364 20061994 18482436 17071034 15808863 14674474 13648246 12719273 11880174
$$ packed form
55967A9064629J451265J627975J831390K070063K362124K719590L151009L679562
55959C7957607M337988N143715O099758P221185Q538339J0078776J1881084J4028442
55951A05286894J6625187J9723690K3295893K7232600L1220997L4513047L5891074
55944B93789382L4067265K8306265J8817795O729811o205259j8025788k7083016
55937C30396455l2535656l4507899l3786023l1328219k7952291k4268709k0694273
55930A25323385j7457255j4636722j2239628j0246718q611733p268797o162526
55923D8700006n257263m517618l902679l383587k948038k583458k271544k001455
55915B1834364j772370j579558j411402j262171j134389j026228r28973q39099
$$ plain form
55907 11880174 11119174 10423794 9787827 9207938 8677102 8187440 7735673 7319877 6934425
55898 6934425 6573826 6238072 5928545 5641790 5372618 5120236 4886015 4668157 4463794
55889 4463794 4273686 4099658 3939665 3790207 3651372 3524807 3408832 3300038 3197723
55880 3197723 3102278 3010985 2919796 2827787 2736156 2644630 2552817 2463267 2379039 2299518 2222269
55869 2222269 2147512 2077089 2010501 1945808 1883362 1825034 1770714 1718875 1669663 1624318 1582491
55858 1582491 1543021 1506239 1472634 1440508 1407885 1375536 1345237 1316351 1287162 1258226 1231216
55847 1231216 1205510 1179078 1151810 1125003 1098473 1071224 1044131 1018944 995372 972055 949576
55836 949576 929541 911388 893207 875197 859249 845423 831850 817973 805084 793674 782896
$$ packed form
55907A1880174p61000o95380o35967n79889n30836m89662m51767m15796l85452
55898F934425l60599l35754l09527k86755k69172k52382k34221k17858k04363
55889D463794j90108j74028j59993j49458j38835j26565j15975j08794j02315
55880C197723r5445r1293r1189r2009r1631r1526r1813q9550q4228p9521p7249
55869B222269p4757p0423o6588o4693o2446n8328n4320n1839m9212m5345m1827
55858A582491l9470l6782l3605l2126l2623l2349l0299k8886k9189k8936k7010
55847A231216k5706k6432k7268k6807k6530k7249k7093k5187k3572k3317k2479
55836I49576k0035j8153j8181j8010j5948j3826j3573j3877j2889j1410j0778
$$ plain form
55825 782896 772639 763567 755010 745227 733941 722498 711474 700141 688268 676430 664569 652172
55813 652172 639800 628620 618543 608553 598648 589788 582293 575980 571368 568940 567711 566394 565429 565917
55799 565917 567212 567720 567615 568493 570616 572724 574341 576056 577560 577584 575903 573524 570912 567816 564728
55784 564728 562577 561012 558806 555741 552230 547366 539545 529077 518173 508260 499238 491458 486381 485027
55770 485027 487574 494547 506335 521166 535322 545724 550827 549278 540069 524563 506408 488641
55758 488641 472146 457014 443507 431269 419369 407740 397200 387757 378468 369221 360931 353641
55746 353641 346164 338106 330528 324094 318268 312920 309039 307142 306449 306298 306850 307763 307791 306533 305094 304141
55730 304141 302663 299648 295687 291880 288198 283931 278883 273260 267189 261076 255676 251201 247092 243184
$$ packed form
55825G82896j0257r072q557r783j1286j1443j1024j1333j1873j1838j1861j2397
55813F52172j2372j1180j0077r990r905q860p495o313m612k428j229j317r65M88
55799E65917J295N08j05Q78K123K108J617J715J504K4j681k379k612l096l088
55784E64728k151j565k206l065l511m864p821j0468j0904r913r022p780n077j354
55770D85027K547O973J1788J4831J4156J0402N103j549r209j5506j8155j7767
55758D88641j6495j5132j3507j2238j1900j1629j0540r443r289r247q290p290
55746C53641p477q058p578o434n826n348l881j897o93j51N52R13K8j258j439r53
55730C04141j478l015l961l807l682m267n048n623o071o113n400m475m109l908
$$ plain form
55716 243184 240247 238906 238895 239867 242023 245455 249743 254696 260598 267256 273746 279543 284868 289362 291483
55701 291483 290007 285376 278940 271604 263802 256006 248542 241443 234931 229452 224884 220467 215964 212138
55687 212138 209646 208196 207250 206815 207007 207575 208386 209815 212153 215138 218441 222014 225611 228552 230376
55672 230376 231251 231446 230923 229660 227828 225484 222706 220119 218532 217884 217290 216297 215355 214885 214747 214870 215537
55655 215537 216756 218129 219581 221450 223577 225191 225951 226275 226325 225559 223658 221065 218282 215456 212936
55640 212936 211296 210333 208932 206368 202981 199191 194767 189545 184061 178889 174067 169631 165923 162936
55626 162936 160149 157472 155519 154473 153560 152255 151162 151009 151490 151833 151795 151378 150242 148251 146110 144639
55610 144639 143684 142428 140509 138325 136465 135271 134741 134511 134148 133584 132958 132087 130663 129029 127977 127609
$$ packed form
55716B43184k937j341j1R72K156L432M288M953N902O658O490N797N325M494K121
55701B91483j476m631o436p336p802p796p464p099o512n479m568m417m503l826
55687B12138k492j450r46m35J92N68Q11J429K338K985L303L573L597K941J824
55672B30376Q75J95n23j263j832k344k778k587j587o48n94r93r42m70j38J23O67
55655B15537J219J373J452J869K127J614P60L24N0p66j901k593k783k826k520
55640B12936j640r63j401k564l387l790m424n222n484n172m822m436l708k987
55626A62936k787k677j953j046r13j305j093j53M81L43l8m17j136j991k141j471
55610A44639r55j256j919k184j860j194n30k30l63n64o26q71j424j634j052l68
$$ plain form
55594 127609 127147 126143 125098 124577 124498 124601 124812 124791 123939 122313 120732 119621 118612 117666 117535 118421 119168
55577 119168 118687 117504 117029 117880 119659 121818 123936 125622 126911 128452 130764 133606 136466 139088 141124
55562 141124 141982 141689 141249 141405 141617 140979 139626 138366 137371 136061 134082 131663 129199 127113 125899 125663
55546 125663 125733 125218 123910 122358 121238 120944 121495 122543 123654 124675 125581 126059 125880 125583 125985 126903 127323
55529 127323 127016 126886 127332 127479 126679 125623 125033 124300 122524 120070 117916 116071 113823 111099 108479 106140
55513 106140 103809 101494 99375 97228 94861 92851 92000 92263 92952 93649 94147 93926 92688 91150 90300 90050
55497 90050 89584 88937 89202 91032 93818 96456 98228 98852 98456 97695 97293 97275 97081 96470 95804 95434 95334 95435
55479 95435 95828 96470 96974 96927 96329 95783 96218 98028 100365 101736 101542 100506 99341 97747 95313 92726 91177
$$ packed form
55594A27609m62j004j045n21p9J03K11k1q52j626j581j111j009r46j31Q86P47
55577A19168m81j183m75Q51J779K159K118J686J289J541K312K842K860K622K036
55562A41124Q58k93m40J56K12o38j353j260r95j310j979k419k464k086j214k36
55546A25663P0n15j308j552j120k94N51J048J111J021R06M78j79k97M02R18M20
55529A27323l07j30M46J47q00j056n90p33j776k454k154j845k248k724k620k339
55513A06140k331k315k119k147k367k010q51K63O89O97M98k21j238j538q50k50
55497I0050m66o47K65J830K786K638J772O24l96p61m02j8j94o11o66l70j00J01
55479I5435L93O42N04m7n98n46M35J810K337J371j94j036j165j594k434k587j549
$$ plain form
55462 91177 90896 91089 91085 90863 90664 90759 91413 92421 92947 92477 91711 91835 93064 94585 95713 96390 96686 96564 96209
55443 96209 95963 95877 95841 96036 96734 97640 97999 97423 96236 95019 94117 93500 92866 91991 91199 91125 91801 92439 92420 91933
55423 91933 91256 90149 88669 87887 88830 91124 93580 95746 97920 99921 100979 100844 100052 99008 97605 95874
55407 95874 94293 93232 92558 91880 90876 89503 88232 87722 87837 87468 85950 84187 83551 84125 84914 85405 85860
55390 85860 86350 86673 87146 88379 90161 91605 92473 93398 94657 95719 96214 96411 96465 96082 95269 94680 94809 95464
55372 95464 96304 97256 98172 98704 98802 98802 98810 98486 97588 96249 94674 93088 91930 91433 91006 89810 88025 86783
55354 86783 86660 87004 86947 86345 85443 84397 83492 83232 83751 84628 85507 86416 87241 87438 86665 85290 84007 83220
55336 83220 82953 83021 83172 83327 83667 84253 84763 85035 85512 86521 87436 87379 86583 86077 86140 86072 85571 85232 85470 85923
$$ packed form
55462I1177k81J93mk22j99R5O54J008N26m70p66J24J229J521J128O77K96j22l55
55443I6209k46q6l6J95O98R06L59n76j187j217r02o17o34q75p92p4O76O38j9m87
55423I1933o77j107j480p82R43K294K456K166K174K001J058j35p92j044j403j731
55407I5874j581j061o74o78j004j373j271n10J15l69j518j763o36N74P89M91M55
55390H5860M90L23M73J233J782J444Q68R25J259J062M95J97N4l83q13n89J29O55
55372I5464Q40R52R16N32R8%Ql24q98j339j575j586j158m97m27j196j785j242
55354H6783j23L44n7o02r02j046r05k60N19Q77Q79R09Q25J97p73j375j283p87
55336H3220k67O8J51J55L40N86N10K72M77J009R15n7p96n06O3o8n01l39K38M53
$$ plain form
55316 85923 86281 86770 87414 87677 87278 86645 86198 85926 85985 86833 88347 89584 89870 89390 88377 86636 84490 83236
55298 83236 83833 85722 87663 89152 90305 90919 90627 89696 88908 88732 89097 89793 90595 91186 91402 91411 91398 91295 91060
55279 91060 90864 90712 90218 89088 87559 86183 85483 85910 87599 89945 91902 92956 93350 93303 92685 91706 91089
55262 91089 91108 91165 90764 90242 90015 89859 89559 89560 90220 90945 90903 90205 89609 89359 89060 88460 87667 86771 85861 85255 85137
55241 85137 85118 84651 83765 82991 82772 83264 84370 85522 85882 85288 84696 85104 86359 87540 88164 88378 88317 88011
55223 88011 87838 88333 89508 90794 91596 91564 90571 88910 87344 86498 86301 86362 86503 86559 86132 85185 84514 84879 85970
55204 85970 86934 87605 88382 89172 89515 89705 90696 92632 94382 94929 94493 93910 93589 93524 93757 94183 94266 93499 92059
55185 92059 90657 89865 89756 90041 90304 90259 90020 90024 90481 90991 90874 89902 88604 87807 87937 88771 89838 90916 92009
$$ packed form
55316H5923L58M89O44K63l99o33m47k72N9Q48J514J237K86m80j013j741k146j254
55298H3236N97J889J941J489J153O14k92r31p88j76L65O96Q02N91K16Rj3j03k35
55279I1060j96j52m94j130j529j376p00M27J689K346J957J054L94m7o18r79o17
55262I1089J9N7m01n22k27j56l00JO60P25m2o98n96k50k99o00p93q96r10o06j18
55241H5137j9m67q86p74k19M92J106J152L60n94n92M08J255J181O24K14o1l06
55223H8011j73M95J175J286Q02l2r93j661j566q46j97O1J41N6m27r47o71L65J091
55204H5970R64O71P77P90L43J90R91J936J750N47m36n83l21o5K33M26Q3p67j440
55185I2059j402p92j09K85K63m5k39MM57N10j17r72j298p97J30Q34J067J078J093
$$ plain form
55166 92009 92956 93468 93620 93952 94823 95912 96618 96706 96308 95584 94763 94290 94410 94725 94585 93886 93094 92559 92232
55147 92232 92096 92327 92866 93195 92846 91976 91251 91254 92028 93089 93847 94135 94311 94733 95247 95396 95067 94651 94518
55128 94518 94638 94790 94864 94787 94426 93893 93809 94878 97002 99089 100040 99862 99511 99677 100097 100215 100044 99982 100107
55109 100107 100173 100148 100223 100332 100235 100080 100310 100931 101425 101573 101813 102526 103504 104402 105231 106026 106525 106579 106506 106677 107093
55088 107093 107717 108757 110130 111061 110767 109364 107652 106232 105267 104812 104856 105103 105180 104995 104661 104268 104020 104315
55070 104315 105290 106523 107549 108393 109202 109717 109615 109121 108694 108303 107598 106632 105841 105353 104859 104188 103485 102846
55052 102846 102265 101968 102284 103024 103396 102691 100853 98401 96057 94433 93766 93897 94625 95954 97786 99575
55036 99575 100681 100976 100878 100880 101243 101911 102442 102342 101783 101686 102592 103843 104429 104345 104394 104807 104919 104253 103177 102257
$$ packed form
55166I2009R47N12J52L32Q71J089P06Q8l98p24q21m73J20L15j40o99p92n35l27
55147I2232j36K31N39L29l49q70p25LP74J061P58K88J76M22N14J49l29m16j33
55128I4518J20J52P4p7l61n33q4J069K124K087R51j78l51J66M20J18j71o2J25
55109A00107O6k5P5J09r7j55K30O21M94J48K40P13R78Q98Q29P95M99N4p3J71M16
55088A07093O24J040J373R31k94j403j712j420r65m55M4K47P7j85l34l93k48K95
55070A04315R75J233J026Q44Q09N15j02m94m27l91p05r66p91m88m94o71p03o39
55052A02846n81k97L16P40L72p05j838k452k344j624o67J31P28J329J832J789
55036I9575J106K95r8KL63O68N31j00n59r7R06J251N86q4M9M13J12o66j076r20
$$ plain form
55016 102257 101583 101089 100980 101415 102026 102178 101642 100880 100640 101287 102463 103425 103770 103672 103420 103059 102703 102791 103613
54997 103613 104890 106188 107475 108822 109862 110139 109803 109466 109503 109952 110893 112341 113939 115276 116374 117346
54981 117346 117835 117399 116281 115073 113848 112361 110979 110537 111247 112477 113601 114311 114174 112861 110963 109642
54965 109642 109241 109085 108806 108851 109338 109519 108990 108512 108876 109716 110235 110476 110973 111704 112259 112733 113550 114532 114931
54946 114931 114391 113319 112307 111638 111248 110754 109652 107983 106648 106576 107620 108752 109308 109578 110183 111344
54930 111344 112883 114518 115939 116886 117318 117499 117829 118692 120429 123288 127363 132564 138595 144940 151077
54915 151077 156828 162432 168232 174440 181117 187985 194098 198101 199166 197545 194013 189014 182679 175407
54901 175407 168044 161422 155945 151563 147920 144614 141516 138820 136683 134936 133328 131860 130645 129587
$$ packed form
55016A02257o74m94j09M35O11J52n36p62k40O47J176R62L45r8k52l61l56Q8Q22
54997A03613J277J298J287J347J040K77l36l37L7M49R41J448J598J337J098R72
54981A17346M89m36j118j208j225j487j382m42P10J230J124P10j37j313j898j321
54965A09642m01j56k79M5M87J81n29m78L64Q40N19K41M97P31N55M74Q17R82L99
54946A14931n40j072j012o69l90m94j102j669j335p2J044J132N56K70O05J161
54930A11344J539J635J421R47M32J81L30Q63J737K859M075N201O031O345O137
54915A51077N751N604N800O208O677O868O113M003J065j621l532m999o335p272
54901A75407p363o622n477m382l643l306l098k696k137j747j608j468j215j058
$$ plain form
54887 129587 128439 127159 125961 125091 124746 125152 126449 128503 131007 133771 136741 139805 142844 146028 149858
54872 149858 154803 160944 167977 175401 182607 188864 193422 195826 196258 195471 194129 192094 188496 182703 175164
54857 175164 167184 159913 153688 148290 143584 139706 136732 134387 132201 129936 127747 125908 124499 123413
54843 123413 122539 121797 121030 120011 118627 117009 115451 114221 113387 112812 112327 111926 111719 111727 111857 112044 112227 112217
54825 112217 111900 111602 111850 112603 113136 113026 112809 113146 113706 113536 112429 111181 110424 109966 109521 109460 110301 111864
54807 111864 113456 114691 115700 116613 117265 117495 117415 117231 116974 116582 116216 116311 117171 118527 119625 119863 119280 118403
54789 118403 117709 117355 117306 117525 117955 118407 118615 118533 118559 119241 120565 121782 122291 122430 122894 123547 123633 123210 123427
54770 123427 125006 127373 129925 133222 138000 143673 148997 153860 159186 165262 171429 177520 184336 192207
$$ packed form
54887A29587j148j280j198q70l45M06J297K054K504K764K970L064L039L184L830
54872A49858M945O141P033P424P206O257M558K404M32p87j342k035l598n793p539
54857A75164p980p271o225n398m706l878k974k345k186k265k189j839j409j086
54843A23413q74p42p67j019j384j618j558j230q34n75m85m01k07QJ30J87J83j0
54825A12217l17k98K48P53N33j10k17L37N60j70j107j248p57m58m45o1Q41J563
54807A11864J592J235J009R13O52K30q0j84k57l92l66R5Q60J356J098K38n83q77
54789A18403o94l54m9K19M30M52K08q2K6O82J324J217N09J39M64O53Q6m23K17
54770A23427J579K367K552L297M778N673N324M863N326O076O167O091O816P871
$$ plain form
54756 192207 200019 206184 209906 211129 209978 206827 202400 197267 191554 185401 179263 173430 167710 161913
54742 161913 156312 151321 147108 143782 141579 140504 140093 139766 139202 138298 137118 135981 135143 134385 133426 132786
54726 132786 133558 136048 139352 142569 145732 149167 152688 156142 160127 165360 171612 177973 183942 189586
54712 189586 194779 198887 201284 201717 200150 196626 191363 184781 177437 170009 163146 157110 151723 146803
54698 146803 142524 139200 136935 135575 134727 133737 132018 129657 127459 126134 125633 125359 124788 123819 122839 122529
54682 122529 123259 124533 125359 125210 124285 122902 121241 119729 118960 118964 119120 119019 118832 118667 118300 117818 117737 118067
54664 118067 118030 117254 116517 116735 117784 118946 119859 120382 120201 119347 118614 118665 119151 119380 119325 119247 118910 118109 117438
54645 117438 117474 117619 116937 115936 116233 118406 121277 123535 125032 126099 126491 125684 123818 121897 121141 122105
$$ packed form
54756A92207P812O165L722J223j151l151m427n133n713o153o138n833n720n797
54742A61913n601m991m213l326k203j075m11l27n64r04j180j137q38p58r59o40
54726A32786P72K490L304L217L163L435L521L454L985N233O252O361N969N644
54712A89586N193M108K397M33j567l524n263o582p344p428o863o036n387m920
54698A46803m279l324k265j360q48r90j719k361k198j325n01k74n71r69r80l10
54682A22529P30J274Q26j49r25j383j661j512p69MJ56j01j87j65l67m82q1L30
54664A18067l7p76p37K18J049J162R13N23j81q54p33N1M86K29n5p8l37q01o71
54645A17438L6J45o82j001K97K173K871K258J497J067L92q07j866j921p56R64
$$ plain form
54629 122105 124116 125660 125712 124619 123397 122564 122209 122726 124497 126889 128482 128462 127149 125209 123153 121606
54613 121606 121155 121629 122240 122672 123235 123828 123715 122818 122319 123155 124505 124672 123221 121449 120740 121130 121699 121844
54595 121844 121799 122020 122496 122847 122943 123046 123303 123466 123368 123306 123613 124104 124367 124374 124351 124244 123851 123375 123277 123618 124041
54574 124041 124369 124704 124958 124910 124801 125270 126534 128098 129387 130196 130402 129822 128619 127351 126346 125414 124412
54557 124412 123656 123441 123496 123303 122730 122051 121530 121272 121378 121939 122893 124018 125127 126268 127719 129663 131780
54540 131780 133373 134113 134483 135177 136188 136847 136696 135970 135229 134881 135045 135597 136250 136703 136659 135705 133541 130614
54522 130614 128093 126796 126405 126229 126302 127065 128272 129063 129082 128746 128443 128190 128101 128388 128769 128630 127972 127502 127586
54503 127586 127828 127912 128085 128496 128823 129015 129694 131244 132983 133894 133851 133653 134080 135257 136645 137349 136790 135405
$$ packed form
54629A22105K011J544N2j093j222q33l55N17J771K392J593k0j313j940k056j547
54613A21606m51M74O11M32N63N93j13q97m99Q36J350J67j451j772p09L90N69J45
54595A21844m5K21M76L51R6J03K57J63r8o2L07M91K63Pk3j07l93m76r8L41M23
54574A24041L28L35K54m8j09M69J264J564J289Q09K06n80j203j268j005r32j002
54557A24412p56k15N5j93n73o79n21k58J06N61R54J125J109J141J451J944K117
54540A31780J593P40L70O94J011O59j51p26p41l48J64N52O53M53m4r54k164k927
54522A30614k521j297l91j76P3P63J207P91J9l36l03k53q9K87L81j39o58m70Q4
54503A27586K42Q4J73M11L27J92O79J550J739R11m3j98M27J177J388P04n59j385
$$ plain form
54485 135405 134376 134341 134732 134650 133955 133122 132458 131974 131739 131774 131803 131635 131664 132467 133897 135083 135456 135409 135774 136854
54465 136854 138189 139190 139771 140299 141002 141673 142013 142081 142220 142684 143488 144462 145191 145100 143999 142462 141353 141023
54447 141023 141254 141718 142054 141759 140639 139291 138536 138349 138026 137379 137010 137218 137461 137216 136727 136400 136038 135256
54429 135256 134323 134055 134950 136720 138585 139856 140391 140606 140917 141259 141419 141634 142394 143743 145305 146888 148418
54412 148418 149391 149287 148586 148478 149238 149811 149394 148524 148051 147886 147534 147155 147237 147658 147949 148137 148602 149288 149840
54393 149840 150365 151395 153090 154995 156613 157826 158732 159347 159541 159161 158343 157640 157522 157757 157769 157569 157646 157843
54375 157843 157304 156008 155397 156696 159203 161133 161673 161379 160949 160607 160594 161279 162636 164132 165231 165718 165704
54358 165704 165694 166351 167803 169494 171155 173449 176970 181098 184665 187496 190288 193084 194823 194569 192455
$$ packed form
54485A35405j029l5L91q2o95q33o64m84k35L5K9j68K9Q03J430J186L73m7L65J080
54465A36854J335J001N81N28P03O71L40O8J39M64Q04R74P29r1j101j537j109l30
54447A41023K31M64L36k95j120j348p55j87l23o47l69K08K43k45m89l27l62p82
54429A35256r33k68Q95J770J865J271N35K15L11L42J60K15P60J349J562J583J530
54412A48418R73j04p01j08P60N73m17q70m73j65l52l79Q2M21K91J88M65O86N52
54393A49840N25J030J695J905J618J213R06O15J94l80q18p03j18K35J2k00P7J97
54375A57843n39j296o11J299K507J930N40k94m30l42j3O85J357J496J099M87j4
54358A65704j0O57J452J691J661K294L521M128L567K831K792K796J739k54k114
$$ plain form
54343 192455 189248 185635 182102 178892 175860 172767 169862 167718 166423 165370 163961 162130 160126 158238
54329 158238 156843 156335 156727 157503 157942 157512 156110 154139 152200 150520 148954 147775 147926 149893 152670 154567
54313 154567 154931 154436 153871 153422 153121 153166 153476 153527 152949 151945 150956 150215 149664 148982 147774 146118 144850 144803
54295 144803 145785 146774 147074 146778 146170 145337 144526 144239 144693 145574 146490 147305 148006 148613 149306 150219 151111 151633 151896
54276 151896 152248 152587 152528 152232 152346 153042 153832 154541 155633 157222 158540 158919 158707 158596 158544 158030 157048 156166
54258 156166 155771 155785 156047 156525 157174 157998 159228 161065 163219 165032 166116 166638 166923 166974 166545 165546 164248
54241 164248 162997 161881 160811 159910 159482 159504 159492 159130 158690 158423 157890 156499 154553 153050 152435 152233 152004
54224 152004 151930 152206 152520 152584 152660 153109 153857 154734 155902 157441 158767 159061 158175 156709 155287 154131 153264 152740
$$ packed form
54343A92455l207l613l533l210l032l093k905k144j295j053j409j831k004j888
54329A58238j395n08L92P76M39m30j402j971j939j680j566j179J51J967K777J897
54313A54567L64m95n65m49l01M5L10N1n78j004r89p41n51o82j208j656j268m7
54295A44803R82R89L00k96o08q33q11k87M54Q81R16Q15P01O07O93R13Q92N22K63
54276A51896L52L39n9k96J14O96P90P09J092J589J318L79k12j11n2n14r82q82
54258A56166l95J4K62M78O49Q24J230J837K154J813J084N22K85N1m29r99j298
54241A64248j251j116j070r01m28K2j2l62m40k67n33j391j946j503o15k02k29
54224A52004p4K76L14O4P6M49P48Q77J168J539J326K94q86j466j422j156q67n24
$$ plain form
54206 152740 152645 153073 154070 155367 156280 156140 154877 153088 151596 150950 151099 151342 150826 149423 148010 147660 148635
54189 148635 150349 152100 153463 154075 153633 152355 151130 150777 151223 151708 151825 152021 152889 154221 155181 155340 155030
54172 155030 154615 153922 152767 151613 151133 151342 151718 152045 152525 153045 153063 152399 151575 151001 150295 148857 146835 145125
54154 145125 144522 145080 146148 146797 146519 145704 145286 145625 146023 145630 144623 144085 144822 146683 148981 151210 153200
54137 153200 154904 156219 157005 157184 156873 156379 155986 155758 155629 155599 155698 155781 155600 155140 154729 154633 154659 154440 154140 154519
54117 154519 156011 157977 159353 159962 160650 161982 163413 164152 164339 164777 165790 167029 168273 169682 171141
54102 171141 172035 171957 171192 170257 169322 168341 167417 166763 166458 166425 166454 166243 165721 165396 165986 167547 169376 170959 172574
54083 172574 174588 176602 177815 178036 177873 178019 178778 180234 182393 185005 187589 189853 192006 194560 198018
$$ packed form
54206A52740r5M28R97J297R13j40j263j789j492o46J49K43n16j403j413l50R75
54189A48635J714J751J363O12m42j278j225l53M46M85J17J96Q68J332R60J59l10
54172A55030m15o93j155j154m80K09L76L27M80N20J8o64q24n74p06j438k022j710
54154A45125o03N58J068O49k78q15m18L39L98l93j007n38P37J861K298K229J990
54137A53200J704J315P86J79l11m94l93k28j29l0R9Q3j81m60m11r6K6k19l00L79
54117A54519J492J966J376O09O88J332J431P39J87M38J013J239J244J409J459
54102A71141Q94p8p65r35r35r81r24o54l05l3K9k11n22l25N90J561J829J583J615
54083A72574K014K014J213K21j63J46P59J456K159K612K584K264K153K554L458
$$ plain form
54068 198018 202776 209048 216518 224067 230131 233627 234574 233743 231791 228867 224959 220300 215288 210281 205633
54053 205633 201713 198654 196315 194700 194188 195060 197038 199623 202632 205954 209026 211201 212616 214113 216189
54038 216189 218581 221019 223836 227520 232035 236920 241797 246584 251462 256782 262743 268985 274739 279499
54024 279499 283326 286424 288789 290427 291584 292512 293202 293530 293431 292834 291681 290099 288327 286384 284061 281242
54008 281242 277916 273907 269100 264040 259757 256688 254170 251268 247814 244343 241396 239166 237515 236020
53994 236020 234261 232356 230972 230607 231097 232029 233308 235059 237183 239282 240774 240994 239567 237005 234518
53979 234518 232884 231717 230163 228018 225783 223830 221941 219589 216477 212916 209812 207984 207290 206694 205443
53964 205443 203916 203087 203442 204650 206004 206907 207230 207412 207970 208803 209459 210169 211919 215120 218883 222190
$$ packed form
54068A98018M758O272P470P549O064L496R47q31j952k924l908m659n012n007m648
54053B05633l920l059k339j615n12Q72J978K585L009L322L072K175J415J497K076
54038B16189K392K438K817L684M515M885M877M787M878N320N961O242N754M760
54024B79499L827L098K365J638J157R28O90L28r9n97j153j582j772j943k323k819
54008B81242l326m009m807n060m283l069k518k902l454l471k947k230j651j495
53994B36020j759j905j384l65M90R32J279J751K124K099J492K20j427k562k487
53979B34518j634j167j554k145k235j953j889k352l112l561l104j828o94n96j251
53964B05443j527q29L55J208J354R03L23J82N58Q33O56P10J750L201L763L307
$$ plain form
53948 222190 225170 228528 232304 236058 239835 243973 248181 251843 255229 259424 264931 271160 277487 283948
53934 283948 290562 296806 302337 307686 313620 320161 326780 333393 340718 349643 360504 372974 386417
53921 386417 400276 414137 427363 438739 446785 450596 450413 447380 442891 438095 433723 430110 427330
53908 427330 425327 423935 422904 421993 420977 419557 417452 414724 411796 408938 405900 402309 398245 394093
53894 394093 389880 385164 379657 373705 367991 362861 358000 352663 346202 338461 329787 320815 312329 305105
53880 305105 299483 295027 290907 286741 282709 278880 274918 270713 266765 263530 260762 257922 254861 251702
53866 251702 248407 245056 242223 240397 239144 237465 234949 232016 229121 226312 223650 221467 219981 219063
53852 219063 218511 218278 218352 218669 219140 219530 219429 218604 217290 215800 214076 212053 210151 208857 208017 207228 206748
$$ packed form
53948B22190K980L358L776L754L777M138M208L662L386M195N507O229O327O461
53934B83948O614O244N531N349N934O541O619O613P325Q925J0861J2470J3443
53921C86417J3859J3861J3226J1376Q046L811j83l033m489m796m372l613k780
53908D27330k003j392j031r11j016j420k105k728k928k858l038l591m064m152
53894C94093m213m716n507n952n714n130m861n337o461p741q674q972q486p224
53880C05105n622m456m120m166m032l829l962m205l948l235k768k840l061l159
53866B51702l295l351k833j826j253j679k516k933k895k809k662k183j486r18
53852B19063n52k33P4L17M71L90j01q25j314j490j724k023j902j294q40p89m80
$$ plain form
53835 206748 207154 208117 208418 207500 206161 205369 205124 205030 205237 206119 207401 208377 208853 209297 210155 211440 212911 214266
53817 214266 215206 215671 216024 216727 217865 219186 220553 222136 224220 226990 230426 234238 238007 241593 245319
53802 245319 249554 254191 258802 263202 267634 272317 277091 281576 285585 289179 292422 295223 297492 299360
53788 299360 301111 302862 304436 305608 306433 307203 308146 309182 309881 309564 307679 304290 300156 296042 291993
53773 291993 287520 282472 277407 272968 269136 265343 261260 257196 253616 250379 246750 242301 237605 233715
53759 233715 230958 228641 226089 223561 221792 220946 220434 219662 218516 217144 215674 214267 213149 212497 212392
53744 212392 212870 213851 214976 215733 215774 215097 213980 212814 211880 211163 210594 210505 211537 213802 216434 218370 219434
53727 219434 220317 221616 223233 224605 225253 225175 224952 225314 226415 227744 228928 230166 231546 232559 232989 233788
$$ packed form
53835B06748M06R63L01r18j339p92k45r4K07Q82J282R76M76M44Q58J285J471J355
53817B14266R40M65L53P03J138J321J367J583K084K770L436L812L769L586L726
53802B45319M235M637M611M400M432M683M774M485M009L594L243K801K269J868
53788B99360J751J751J574J172Q25P70R43J036O99l17j885l389m134m114m049
53773B91993m473n048n065m439l832l793m083m064l580l237l629m449m696l890
53759B33715k757k317k552k528j769q46n12p72j146j372j470j407j118o52j05
53744B12392M78R81J125P57M1o77j117j166r34p17n69q9J032K265K632J936J064
53727B19434Q83J299J617J372O48p8k23L62J101J329J184J238J380J013M30P99
$$ plain form
53711 233788 236120 239710 243104 245563 247766 250503 253648 256826 260193 263956 267647 270514 272340 273508
53697 273508 274566 276018 278209 281034 284006 286866 289876 293321 296997 300400 303197 305276 306630 307354
53683 307354 307508 306890 305244 302792 300260 298291 297120 296756 296955 296982 296021 294098 292108 290619 289201 287208
53667 287208 284748 282491 280930 280148 279928 279772 279240 278542 278295 278452 278118 276897 275693 275476 275840 275724 275144
53650 275144 275142 276085 277060 277206 276856 276949 277851 279173 280394 281293 282014 283057 285079 288354 292321 295772 297638
53633 297638 297785 297139 296992 298082 300277 303015 305825 308470 310900 313274 315848 318734 321894 325337 329045
53618 329045 332693 335883 338831 342373 347015 352365 357826 363435 369556 376105 382665 389116 395541 401590
53604 401590 406655 410769 414741 419111 423381 426572 428229 428595 428078 426945 425482 424037 422649 420843 418105
$$ packed form
53711B33788K332L590L394K459K203K737L145L178L367L763L691K867J826J168
53697B73508J058J452K191K825K972K860L010L445L676L403K797K079J354P24
53683C07354J54o18j646k452k532j969j171l64J99K7r61j923j990j489j418j993
53667B87208k460k257j561p82k20j56n32o98k47J57l34j221j204k17L64j16n80
53650B75144kR43R75J46l50R3R02J322J221Q99P21J043K022L275L967L451J866
53633B97638J47o46j47J090K195K738K810K645K430K374K574K886L160L443L708
53618C29045L648L190K948L542M642N350N461N609O121O549O560O451O425O049
53604D01590N065M114L972M370M270L191J657L66n17j133j463j445j388j806k738
$$ plain form
53589 418105 414571 411038 408115 405605 402842 399545 396105 393209 391376 390610 390177 388984 386697 384282 382854
53574 382854 382165 381045 379240 377811 377406 377252 376486 375526 375211 375293 374992 374604 375300 377263 379194 379992 380010 380188
53556 380188 380636 380800 380673 381109 382848 385585 388261 390194 391750 393747 396386 399087 401411 403683 406474
53541 406474 409843 413496 417422 421922 427164 433054 439425 446010 452476 458890 465922 474112 483085 492066
53527 492066 501037 510791 521829 533871 546573 560114 574735 590181 605983 622056 638704 656218
53515 656218 674690 694089 714302 735201 756856 779600 803770 829372 855944 882696 908903
53504 908903 934387 959601 985077 1010831 1036446 1061603 1086213 1110085 1132920 1154813 1176405
53493 1176405 1198243 1220105 1241233 1261171 1280177 1298774 1317198 1335443 1353690 1372314 1391391
$$ packed form
53589D18105l534l533k923k510k763l297l440k896j833p66m33j193k287k415j428
53574C82854o89j120j805j429m05j54p66r60l15Q2l01l88O96J963J931P98J8J78
53556C80188M48J64j27M36J739K737K676J933J556J997K639K701K324K272K791
53541D06474L369L653L926M500N242N890O371O585O466O414P032Q190Q973Q981
53527D92066Q971R754J1038J2042J2702J3541J4621J5446J5802J6073J6648J7514
53515F56218J8472J9399K0213K0899K1655K2744K4170K5602K6572K6752K6207
53504I08903K5484K5214K5476K5754K5615K5157K4610K3872K2835K1893K1592
53493A176405K1838K1862K1128J9938J9006J8597J8424J8245J8247J8624J9077
$$ plain form
53482 1391391 1410492 1429191 1447502 1465478 1482634 1498254 1512179 1524651 1535409 1543625 1548987 1552104
53470 1552104 1553422 1552347 1548030 1540590 1530931 1519706 1507081 1493263 1478605 1463298 1447486 1431491
53458 1431491 1415439 1398836 1381129 1362499 1343480 1323906 1302970 1280387 1256869 1233407 1210663
53447 1210663 1189086 1168930 1149947 1131665 1114215 1098340 1084400 1071938 1060590 1050853 1043444 1038223
53435 1038223 1034233 1030733 1027849 1026256 1026450 1028359 1031563 1035812 1041183 1047686 1055058 1063242 1072811 1084420
53421 1084420 1097938 1112616 1128027 1144403 1162100 1181368 1202610 1226158 1251602 1277988 1305019
53410 1305019 1333585 1364785 1398816 1435011 1472486 1510501 1548814 1588147 1629890 1674872 1722705
53399 1722705 1772663 1824717 1879215 1935858 1993675 2051885 2110289 2168924 2227840 2287159 2346847
$$ packed form
53482A391391J9101J8699J8311J7976J7156J5620J3925J2472J0758Q216N362L117
53470A552104J318j075m317p440r659j1225j2625j3818j4658j5307j5812j5995
53458A431491j6052j6603j7707j8630j9019j9574k0936k2583k3518k3462k2744
53447A210663k1577k0156j8983j8282j7450j5875j3940j2462j1348r737p409n221
53435A038223l990l500k884j593J94J909L204M249N371O503P372Q184R569J1609
53421A084420J3518J4678J5411J6376J7697J9268K1242K3548K5444K6386K7031
53410A305019K8566L1200L4031L6195L7475L8015L8313L9333M1743M4982M7833
53399A722705M9958N2054N4498N6643N7817N8210N8404N8635N8916N9319N9688
$$ plain form
53388 2346847 2406283 2464437 2520599 2574704 2626905 2677084 2724872 2769957 2812139 2851133 2886431
53377 2886431 2917415 2943691 2965347 2982805 2996342 3005808 3010738 3010583 3004729 2992450 2973025 2945981
53365 2945981 2911316 2869639 2822118 2770159 2715080 2658118 2600545 2543400 2487039 2431192 2375616
53354 2375616 2320543 2266501 2213978 2163342 2114774 2068060 2022547 1977524 1932601 1887774 1843294
53343 1843294 1799572 1757023 1715916 1676442 1638899 1603598 1570531 1539430 1510241 1483303 1458980
53332 1458980 1437303 1418115 1401337 1386847 1374157 1362308 1350122 1336690 1321803 1305944 1289800
53321 1289800 1273853 1258526 1244355 1231633 1220070 1209277 1199537 1191593 1185674 1181282 1177980 1175884
53309 1175884 1175265 1176230 1178951 1183594 1189728 1196454 1203564 1212111 1223280 1237106 1252778 1269883 1288713
$$ packed form
53388B346847N9436N8154N6162N4105N2201N0179M7788M5085M2182L8994L5298
53377B886431L0984K6276K1656J7458J3537R466M930j55n854j2279j9425k7044
53365B945981l4665m1677m7521n1959n5079n6962n7573n7145n6361n5847n5576
53354B375616n5073n4042n2523n0636m8568m6714m5513m5023m4923m4827m4480
53343A843294m3722m2549m1107l9474l7543l5301l3067l1101k9189k6938k4323
53332A458980k1677j9188j6778j4490j2690j1849j2186j3432j4887j5859j6144
53321A289800j5947j5327j4171j2722j1563j0793r740p944n919m392l302k096
53309A175884o19R65K721M643O134O726P110Q547J1169J3826J5672J7105J8830
$$ plain form
53296 1288713 1309577 1332382 1356844 1382603 1409193 1436364 1464435 1493832 1524146 1553990 1581980
53285 1581980 1607680 1631523 1654021 1675165 1694423 1711145 1724953 1735783 1743680 1748677 1750757 1749725
53273 1749725 1745143 1736692 1724694 1709998 1693269 1674635 1654083 1631754 1607677 1581563 1553192 1522801
53261 1522801 1490971 1458421 1426016 1394388 1363188 1331260 1298124 1264929 1233358 1203856 1175535
53250 1175535 1147569 1119910 1092724 1065960 1039662 1014003 988762 963297 937367 911539 886469
53239 886469 862278 839022 817361 798046 780854 764618 748518 733013 719287 707992 698741 690626
53227 690626 682873 674910 666122 655961 644392 632054 619790 607960 596184 583685 569907 554934
53215 554934 539408 523993 508922 494137 479837 466693 455386 445962 437712 429696 421474 413399
$$ packed form
53296A288713K0864K2805K4462K5759K6590K7171K8071K9397L0314K9844K7990
53285A581980K5700K3843K2498K1144J9258J6722J3808J0830P897M997K080j032
53273A749725m582q451j1998j4696j6729j8634k0552k2329k4077k6114k8371l0391
53261A522801l1830l2550l2405l1628l1200l1928l3136l3195l1571k9502k8321
53250A175535k7966k7659k7186k6764k6298k5659k5241k5465k5930k5828k5070
53239H86469k4191k3256k1661j9315j7192j6236j6100j5505j3726j1295r251q115
53227F90626p753p963q788j0161j1569j2338j2264j1830j1776j2499j3778j4973
53215E54934j5526j5415j5071j4785j4300j3144j1307r424q250q016q222q075
$$ plain form
53203 413399 406133 399717 393245 385665 376882 367841 359566 352376 345970 339865 333674 327318 321184 315810
53189 315810 311350 307560 304293 301581 299195 296628 293755 291041 288849 286996 285238 283623 281998 279784
53175 279784 276882 274336 273272 273412 273416 272561 271331 270321 269375 268103 266625 265429 264796 264578 264242 263059
53159 263059 260664 257682 255396 254544 254643 254656 253969 252514 250415 248069 246332 246021 247063 248516 249596 250339
53143 250339 251106 251821 252108 251999 251948 252071 251887 251124 250375 250527 251742 253420 254969 256155 256881 257229 257661 258519
53125 258519 259299 259095 257891 256689 256099 255617 254746 254045 254340 255429 256380 256752 256791 256748 256727 256990 257648 258167 257877
53106 257877 256890 255849 254902 253649 252032 250456 248942 246973 244470 242216 240933 240454 240163 239851 239777 240207
53090 240207 241133 242217 242839 242500 241307 239854 238581 237559 236865 236711 237032 237385 237476 237500 237801 238448 239219 239713
$$ packed form
53203D13399p266o416o472p580q783r041q275p190o406o105o191o356o134n374
53189C15810m460l790l267k712k386k567k873k714k192j853j758j615j625k214
53175B79784k902k546j064J40Mq55j230j010r46j272j478j196o33k18l36j183
53159B63059k395k982k286q52R9J3o87j455k099k346j737l11J042J453J080P43
53143B50339P67P15K87j09n1J23j84p63p49J52J215J678J549J186P26L48M32Q58
53125B58519P80k04j204j202n90m82q71p01K95J089R51L72L9m3k1K63O58N19k90
53106B57877r87j041r47j253j617j576j514j969k503k254j283m79k91l12p4M30
53090B40207R26J084O22l39j193j453j273j022o94j54L21L53R1K4L01O47P71M94
$$ plain form
53072 239713 239520 238639 237744 237631 238308 239062 239411 239509 239555 239372 238797 238007 237251 236685 236545 236931 237277 236714 235241
53053 235241 233877 233263 232800 231806 230898 231416 233707 236683 238970 239913 239599 238491 237152 235918 234765 233649
53037 233649 232820 232533 232666 232932 233270 233697 234000 233944 233577 233009 232133 231054 230458 230984 232335 233620 234502 235378
53019 235378 236462 237413 238059 238804 239921 240958 241330 241142 240969 241074 241340 241824 242891 244638 246523 247767
53003 247767 248040 247661 247218 247039 246985 246706 246086 245457 245275 245603 246004 246008 245617 245212 245036 245005 245063 245413 246163 247005
52983 247005 247612 248226 249408 251234 253186 254992 257050 259708 262524 264691 265966 266790 267630 268609 269722
52968 269722 270984 272321 273598 274845 276228 277755 279216 280432 281347 281865 281819 281170 280081 278698 277042
52953 277042 275126 273044 270900 268791 266847 265160 263600 261904 260044 258369 257237 256586 256017 255290 254614
$$ packed form
53072B39713j93q81q95j13O77P54L49R8M6j83n75p90p56n66j40L86L46n63j473
53053B35241j364o14m63r94r08N18K291K976K287R43l14j108j339j234j153j116
53037B33649q29k87J33K66L38M27L03n6l67n68q76j079n96N26J351J285Q82Q76
53019B35378J084R51O46P45J117J037L72j88j73J05K66M84J067J747J885J244
53003B47767K73l79m43j79n4k79o20o29j82L28M01Ml91m05j76l1N8L50P50Q42
52983B47005O07O14J182J826J952J806K058K658K816K167J275Q24Q40R79J113
52968B69722J262J337J277J247J383J527J461J216R15N18m6o49j089j383j656
52953B77042j916k082k144k109j944j687j560j696j860j675j132o51n69p27o76
$$ plain form
52938 254614 254401 254791 255529 256262 256743 256704 255821 254131 252390 251571 251882 252545 252648 251890 250447 248614 246937
52921 246937 246228 246864 248249 249506 250541 251851 253373 254227 253833 252676 251676 251222 251134 251120 250868 250005 248514
52904 248514 247022 246223 246099 246078 245863 245657 245589 245425 245080 244960 245463 246381 247074 247071 246246 244619 242454 240567 240025
52885 240025 241210 243339 245215 246365 247254 248425 249759 250678 250850 250477 249974 249573 249324 249344 249868 250987 252445
52868 252445 253847 255091 256379 257709 258567 258428 257427 256240 255316 254627 254206 254437 255439 256564 256991 256703
52852 256703 256373 256339 256183 255410 254036 252274 250070 247309 244183 240964 237631 234161 231050 229019 228140 227717
52836 227717 227196 226777 226871 227337 227687 227813 227957 228060 227680 226765 226036 226265 227392 228718 229781 230668 231484 231932
52818 231932 231586 230413 228879 227576 226739 226050 224952 223329 221857 221490 222572 224602 226879 229160 231564
$$ packed form
52938B54614k13L90P38P33M81l9q83j690j741q19L11O63J03p58j443j833j677
52921B46937p09O36J385J257J035J310J522Q54l94j157j000m54q8j4k52q63j491
52904B48514j492p99j24k1k15k06o8j64l45j20N03R18O93lq25j627k165j887n42
52885B40025J185K129J876J150Q89J171J334R19J72l73n03m01k49K0N24J119J458
52868B52445J402J244J288J330Q58j39j001j187r24o89m21K31J002J125M27k88
52852B56703l30l4j56p73j374j762k204k761l126l219l333l470l111k031q79m23
52836B27717n21m19R4M66L50J26J44J03l80r15p29K29J127J326J063Q87Q16M48
52818B31932l46j173j534j303q37o89j098j623j472l67J082K030K277K281K404
$$ plain form
52803 231564 234058 236273 237784 238409 238257 237525 236276 234472 232325 230469 229465 229070 228328 226690 224745
52788 224745 223553 223411 223673 223742 223742 224073 224679 225099 225085 224813 224499 224120 223650 223347 223532 224107 224577 224719 225010 226037
52768 226037 227470 228075 227024 224962 223398 223159 223794 224469 224897 225197 225276 224905 224302 224131 224765 225857 226799
52751 226799 227387 227781 228032 227967 227577 227263 227578 228822 230901 233416 235853 237885 239603 241328 243126 244701
52735 244701 245903 247106 248800 250927 252952 254503 255622 256411 256902 257402 258493 260304 262058 262722 262002
52720 262002 260385 258385 256169 253898 251875 250175 248463 246500 244568 243139 242251 241543 240856 240478 240660
52705 240660 241115 241176 240428 239122 237948 237437 237584 237999 238412 238918 239720 240739 241615 242104 242307 242470 242720 243113
52687 243113 243862 245285 247414 249728 251394 251898 251492 250967 250940 251348 251675 251586 251162 250547 249676 248537 247448
$$ packed form
52803B31564K494K215J511O25j52p32j249j804k147j856j004l95p42j638j945
52788B24745j192j42K62O9%L31O06M20j4k72l14l79m70l03J85N75M70J42K91J027
52768B26037J433O05j051k062j564k39O35O75M28L00P9l71o03j71O34J092R42
52751B26799N88L94K51o5l90l14L15J244K079K515K437K032J718J725J798J575
52735B44701J202J203J694K127K025J551J119P89M91N00J091J811J754O64p20
52720B62002j617k000k216k271k023j700j712j963j932j429q88p08o87l78J82
52705B40660M55O1p48j306j174n11J47M15M13N06Q02J019Q76M89K03J63K50L93
52687B43113P49J423K129K314J666N04m06n25k7M08L27q9m24o15q71j139j089
$$ plain form
52670 247448 246752 246375 245968 245481 245203 245219 245197 244869 244405 244114 244040 244113 244471 245328 246607 248061 249715 251911 254860
52651 254860 258346 261958 265432 268634 271274 272785 272626 270810 268061 265328 263113 261369 259933 258735
52637 258735 257586 256211 254713 253646 253356 253525 253666 253737 253958 254407 255253 257064 260167 263855 266850 268536
52621 268536 269171 268971 267756 265639 263327 261409 259900 258754 258208 258223 258164 257570 256793 256348 255994 255109 253753
52604 253753 252774 252930 254329 256587 259036 260870 261654 261787 262095 262895 263805 264450 264938 265539 266290 267119 268051
52587 268051 269092 270071 270794 271216 271405 271427 271329 271069 270465 269408 268209 267453 267338 267358 266909 266099 265695 266234 267387
52568 267387 268344 268655 268513 268295 268075 267685 267122 266678 266667 267075 267428 267018 265469 263250 261474 260880 261086 261086 260377
52549 260377 259289 258222 257105 255783 254498 253572 252886 252020 250828 249569 248598 248184 248565 249805 251532 253061
$$ packed form
52670B47448o96l77m07m87k78J6k2l28m64k91p4P3L58Q57J279J454J654K196K949
52651B54860L486L612L474L202K640J511j59j816k749k733k215j744j436j198
52637B58735j149j375j498j067k90J69J41P1K21M49Q46J811L103L688K995J686
52621B68536O35k00j215k117k312j918j509j146n46J5n9n94p77m45l54q85j356
52604B53753r79J56J399K258K449J834P84J33L08Q00R10O45M88O01P51Q29R32
52587B68051J041R79P23M22J89K2r8k60o04j057j199p56j15K0m49q10m04N39J153
52568B67387R57L11j42k18k20l90n63m44j1M08L53m10j549k219j776n94K06%p09
52549B60377j088j067j117j322j285r26o86q66j192j259r71m14L81J240J727J529
$$ plain form
52533 253061 253976 254491 255113 255956 256509 256203 255191 254364 254447 255256 256138 256935 258099 259835 261628 262805 263242
52516 263242 263338 263600 264423 265903 267630 269008 270021 271379 273688 276819 280344 284086 287813 290842 292568
52501 292568 293132 293017 292242 290591 288440 286564 285045 283052 279917 275957 272040 268798 266427 264774 263379
52486 263379 261735 259820 258143 257186 257110 258032 260096 262967 265704 267526 268539 269330 270052 270335 270066 269834
52470 269834 270424 272086 274382 276650 278496 279945 281277 282817 284782 287159 289621 291676 293025 293786 294292
52455 294292 294706 294827 294194 292351 289182 285183 281289 278287 276308 274893 273388 271320 268632 265816 263608
52440 263608 262367 261833 261630 261771 262398 263193 263476 262871 261632 260313 259328 258866 258993 259695 260834 262020 262676
52423 262676 262504 261923 261723 262193 262987 263985 265669 268226 270855 272603 273503 274190 274773 275011 275472 277463 281624
$$ packed form
52533B53061R15N15O22Q43N53l06j012q27Q3Q09Q82P97J164J736J793J177M37
52516B63242R6K62Q23J480J727J378J013J358K309L131L525L742L727L029J726
52501B92568N64j15p75j651k151j876j519j993l135l960l917l242k371j653j395
52486B63379j644j915j677r57p6R22K064K871K737J822J013P91P22K83k69k32
52470B69834N90J662K296K268J846J449J332J540J965K377K462K055J349P61N06
52455B94292M14J21o33j843l169l999l894l002j979j415j505k068k688k816k208
52440B63608j241n34k03J41O27P95K83o05j239j319r85m62J27P02J139J186O56
52423B62676j72n81k00M70P94R98J684K557K629J748R00O87N83K38M61J991M161
$$ plain form
52406 281624 287349 293851 301084 309307 318398 327946 337348 345383 350292 350990 348002 342809 336546 329730
52392 329730 322895 316838 312186 309086 307347 306588 306208 305474 303925 301770 299862 299085 299545 300465 301036 301242
52376 301242 301619 302515 304034 306489 310247 315061 320192 325351 330931 337151 343530 349448 354655 358902 361731
52361 361731 363063 363527 363706 363491 362655 361580 360783 360032 358703 356881 355477 355201 355922 357084 358343 359727
52345 359727 361525 364093 367521 371428 375324 379140 383226 387861 393021 398671 405062 412604 421475 431399
52331 431399 441867 452680 464205 476969 491088 506353 522804 540737 560146 580581 601691
52320 601691 623509 646063 669144 692602 716364 739960 762608 784074 804874 825254 844607
52309 844607 862437 879285 896047 912835 929182 944861 959723 973154 984697 995006 1005226
$$ packed form
52406B81624N725O502P233Q223R091R548R402Q035M909O98k988n193o263o816
52392C29730o835o057m652l100j739p59l80p34j549k155j908p77M60R20N71K06
52376C01242L77Q96J519K455L758M814N131N159N580O220O379N918N207M247K829
52361C61731J332M64J79k15q36j075p97p51j329j822j404k76P21J162J259J384
52345C59727J798K568L428L907L896L816M086M635N160N650O391P542Q871R924
52331D31399J0468J0813J1525J2764J4119J5265J6451J7933J9409K0435K1110
52320F01691K1818K2554K3081K3458K3762K3596K2648K1466K0800K0380J9353
52309H44607J7830J6848J6762J6788J6347J5679J4862J3431J1543J0309J0220
$$ plain form
52298 1005226 1015467 1024740 1032367 1038450 1042889 1045007 1044559 1042226 1038544 1033047 1025113 1015141 1004296 993434
52284 993434 982806 972602 963197 954895 947812 942039 937735 935097 934357 935684 939049 944315 951501 960710
52270 960710 971725 983963 997029 1011128 1026691 1043678 1061280 1078265 1093703 1107613 1120909
52259 1120909 1134449 1148113 1161037 1172709 1183445 1193794 1203910 1213673 1222942 1231380 1238316 1243185
52247 1243185 1245977 1247020 1246420 1243859 1238814 1230911 1220267 1207647 1194006 1179704 1164364 1147739 1130568
52234 1130568 1114291 1099981 1087647 1076460 1065507 1054434 1043558 1033424 1024291 1016130 1008943 1002728
52222 1002728 997151 991778 986854 983420 982237 982832 983979 984977 986045 987630 989847 992687 996335 1000974
52208 1000974 1006477 1012586 1019260 1026549 1034088 1041023 1046700 1051301 1055503 1059562 1063127 1066081 1069017 1072465
$$ packed form
52298A005226J0241R273P627O083M439K118m48k333l682n497p934r972j0845j0862
52284I93434j0628j0204r405q302p083n773m304k638p40J327L365N266P186R209
52270I60710J1015J2238J3066J4099J5563J6987J7602J6985J5438J3910J3296
52259A120909J3540J3664J2924J1672J0736J0349J0116R763R269Q438O936M869
52247A243185K792J043o00k561n045p903j0644j2620j3641j4302j5340j6625j7171
52234A130568j6277j4310j2334j1187j0953j1073j0876j0134r133q161p187o215
52222A002728n577n373m924l434j183N95J147R98J068J585K217K840L648M639
52208A000974N503O109O674P289P539O935N677M601M202M059L565K954K936L448
$$ plain form
52194 1072465 1076044 1079020 1081465 1084117 1087144 1089958 1092519 1095867 1100694 1106051 1110314 1113041 1114934 1116154
52180 1116154 1115711 1112743 1107595 1101219 1094076 1086120 1077471 1068481 1059333 1050044 1040870 1032349 1024861 1018450
52166 1018450 1013097 1008962 1006229 1004947 1005084 1006582 1009194 1012431 1015908 1019704 1024121 1029005 1033517 1036771
52152 1036771 1038643 1039764 1040727 1041470 1041497 1040666 1039614 1039318 1040187 1041721 1043203 1044617 1046534 1049064 1051459 1053135
52136 1053135 1054705 1057398 1061556 1066361 1071125 1076300 1083008 1091992 1103296 1116589 1131513 1148103 1167162
52123 1167162 1189787 1216139 1245005 1275021 1306045 1338736 1373030 1407693 1441419 1473755 1504741
52112 1504741 1534129 1561277 1585642 1607106 1625878 1642077 1655326 1664923 1670651 1673248 1673746 1672482
52100 1672482 1669292 1664515 1659092 1653495 1647263 1639984 1632126 1624395 1616700 1608371 1599082 1588863 1577406
$$ packed form
52194A072465L579K976K445K652L027K814K561L348M827N357M263K727J893J220
52180A116154m43k968n148o376p143p956q649q990r148r289r174q521p488o411
52166A018450n353m135k733j282J37J498K612L237L477L796M417M884M512L254
52152A036771J872J121R63P43K7q31j052k96Q69J534J482J414J917K530K395J676
52136A053135J570K693M158M805M764N175O708Q984J1304J3293J4924J6590J9059
52123A167162K2625K6352K8866L0016L1024L2691L4294L4663L3726L2336L0986
52112A504741K9388K7148K4365K1464J8772J6199J3249R597N728K597M98j264
52100A672482l190m777n423n597o232p279p858p731p695q329r289j0219j1457
$$ plain form
52087 1577406 1564039 1548532 1531388 1513287 1494760 1476576 1459913 1445784 1434520 1426062 1420492 1418006
52075 1418006 1418515 1421548 1426493 1432854 1440472 1449656 1460958 1474617 1490306 1507502 1525837 1544905 1563985
52062 1563985 1582343 1599690 1615978 1630794 1643394 1653471 1661592 1668608 1674801 1679774 1682975 1684114
$$ packed form
52087A577406j3367j5507j7144j8101j8527j8184j6663j4129j1264q458n570k486
52075A418006N09L033M945O361P618R184J1302J3659J5689J7196J8335J9068J9080
52062A563985J8358J7347J6288J4816J2600J0077Q121P016O193M973L201J139
$$ [...]
##END NTUPLES=NMR SPECTRUM
##END=
