
##TITLE=AC1377_PERAH12189_7518924_tSsVhEgFss
##JCAMPDX= 6.0         $$ Bruker NMR JCAMP-DX V2.0
##DATA TYPE= NMR SPECTRUM
##DATA CLASS= NTUPLES
##ORIGIN= BRUKER
##OWNER= Administrator
$$ 1.72 TOPSPIN		Version 2.1
$$ 2013-02-20 22:46:28.121 -0500  Administrator@X
$$ Compression mode = diff/dup
##.OBSERVE FREQUENCY= 400.02188249412
##.OBSERVE NUCLEUS= ^1H
##.ACQUISITION MODE= SIMULTANEOUS (DQD)
##.ACQUISITION SCHEME= undefined
##.AVERAGES= 8
##.DIGITISER RES= 22
##SPECTROMETER/DATA SYSTEM= spect
##.PULSE SEQUENCE= zg30
##.SOLVENT NAME= COFFEE_meoh
##.SHIFT REFERENCE= INTERNAL, COFFEE_meoh, 1, 14.98509
##AUDIT TRAIL= $$ (NUMBER, WHEN, WHO, WHERE, PROCESS, VERSION, WHAT)
$$ ##TITLE= Audit trail, TOPSPIN		Version 2.1
$$ ##JCAMPDX= 5.01
$$ ##ORIGIN= Bruker BioSpin GmbH
$$ ##OWNER= Administrator
$$ $$ E:\/data/COFFEE/nmr/AC1377_PERAH12189_7518924_tSsVhEgFss/10/pdata/1/auditp.txt
$$ ##AUDIT TRAIL=  $$ (NUMBER, WHEN, WHO, WHERE, PROCESS, VERSION, WHAT)
(   1,<2013-02-20 22:46:19.904 -0500>,<Administrator>,<X>,<go>,<TOPSPIN 2.1>,
      <created by zg
	started at 2013-02-20 22:45:13.420 -0500,
	POWCHK enabled, PULCHK disabled,
       configuration hash MD5:
       86 BA 57 50 F2 9D 5C 9B 26 00 A9 28 5F 66 2E 89
       data hash MD5: 64K
       C3 A3 C7 48 E9 7F 9D 21 04 83 CF 4C FB B4 14 3B>)
(   2,<2013-02-20 22:46:22.906 -0500>,<Administrator>,<X>,<proc1d>,<TOPSPIN 2.1>,
      <Start of raw data processing
       efp LB = 0 FT_mod = 6 PKNL = 1 PHC0 = 0 PHC1 = 0 SI = 32K 
       data hash MD5: 32K
       E1 1E B0 30 6B B4 DE 80 0E 6F 9C CE 45 AE 45 5B>)
(   3,<2013-02-20 22:46:23.406 -0500>,<Administrator>,<X>,<proc1d>,<TOPSPIN 2.1>,
      <pk PHC0 = 66.66504 PHC1 = 0 
       data hash MD5: 32K
       15 98 92 AA 25 73 7E 29 57 47 77 A8 31 DC F4 89>)
(   4,<2013-02-20 22:46:23.618 -0500>,<Administrator>,<X>,<proc1d>,<TOPSPIN 2.1>,
      <abs ABSG = 1 
       data hash MD5: 32K
       18 60 0D 29 31 E6 A8 29 B2 DA 83 2F FE 17 EF 27>)
(   5,<2013-02-20 22:46:23.785 -0500>,<Administrator>,<X>,<proc1d>,<TOPSPIN 2.1>,
      <abs ABSG = 2 
       data hash MD5: 32K
       EC F5 21 AA 2E 65 02 05 33 18 C7 C5 19 63 3A FE>)
(   6,<2013-02-20 22:46:23.921 -0500>,<Administrator>,<X>,<proc1d>,<TOPSPIN 2.1>,
      <abs ABSG = 3 
       data hash MD5: 32K
       F2 72 27 FD AD 1D C4 E4 1A 91 90 F5 EC 91 35 C6>)
(   7,<2013-02-20 22:46:24.058 -0500>,<Administrator>,<X>,<proc1d>,<TOPSPIN 2.1>,
      <abs ABSG = 4 
       data hash MD5: 32K
       20 4F 78 A6 F9 43 72 3D 9F FE 56 56 D5 66 7F 2D>)
(   8,<2013-02-20 22:46:24.194 -0500>,<Administrator>,<X>,<proc1d>,<TOPSPIN 2.1>,
      <abs ABSG = 5 
       data hash MD5: 32K
       2B 92 7C 47 8C 46 57 C2 3F 91 A0 E2 C8 D9 3E FD>)
$$ ##END=
$$ 
$$ $$ hash MD5
$$ $$ 1E 13 5F D3 6B 22 FB EE 7C 3D 7D E2 C3 22 ED D7
##$RELAX= 
##$RELAX= 
##$RELAX= 
##$RELAX= 
##$RELAX= 
##$RELAX= 
##$RELAX= 
$$ Bruker specific parameters
$$ --------------------------
##$DU= <E:\>
##$EXPNO= 10
##$NAME= <AC1377_PERAH12189_7518924_tSsVhEgFss>
$$ [...]
150 150 150 150 150 150 150 150
##$TP07= 0
##$TPNAME0= <>
##$TPNAME1= <>
##$TPNAME2= <>
##$TPNAME3= <>
##$TPNAME4= <>
##$TPNAME5= <>
##$TPNAME6= <>
##$TPNAME7= <>
##$TPOAL= (0..7)
0.5 0.5 0.5 0.5 0.5 0.5 0.5 0.5
##$TPOFFS= (0..7)
0 0 0 0 0 0 0 0
##$TUNHIN= 0
##$TUNHOUT= 0
##$TUNXOUT= 0
##$USERA1= <user>
##$USERA2= <user>
##$USERA3= <user>
##$USERA4= <user>
##$USERA5= <user>
##$V9= 5
##$VALIST= <valist>
##$VCLIST= <CCCCCCCCCCCCCCC>
##$VD= 0
##$VDLIST= <DDDDDDDDDDDDDDD>
##$VPLIST= <PPPPPPPPPPPPPPP>
##$VTLIST= <TTTTTTTTTTTTTTT>
##$WBST= 1024
##$WBSW= 4
##$XGAIN= (0..3)
0 0 0 0
##$XL= 0
##$YL= 0
##$YMAX_a= 546718
##$YMIN_a= -542721
##$ZGOPTNS= <>
##$ZL1= 120
##$ZL2= 120
##$ZL3= 120
##$ZL4= 120
##$ABSF1= 14.98509
##$ABSF2= -5.573092
##$ABSG= 5
##$ABSL= 3
##$ALPHA= 0
##$AQORDER= 0
##$ASSFAC= 0
##$ASSFACI= 0
##$ASSFACX= 0
##$ASSWID= 0
##$AUNMP= <proc_prof1d_extract_pilot.lims>
##$AXLEFT= 0
##$AXNAME= <>
##$AXNUC= <1H>
##$AXRIGHT= 0
##$AXTYPE= 0
##$AXUNIT= <>
##$AZFE= 0.1
##$AZFW= 0.1
##$BCFW= 0
##$BC_mod= 0
##$BYTORDP= 0
##$COROFFS= 0
##$CY= 15
##$DATMOD= 1
##$DC= 0
##$DFILT= <>
##$DTYPP= 0
##$F1P= 0
##$F2P= 0
##$FCOR= 0.5
##$FTSIZE= 32768
##$FT_mod= 6
##$GAMMA= 0
##$GB= 0
##$INTBC= 1
##$INTSCL= 1
##$ISEN= 128
##$LB= 0
##$LEV0= 0
##$LPBIN= 0
##$MAXI= 10000
##$MC2= 0
##$MEAN= 0
##$ME_mod= 0
##$MI= 0
##$NCOEF= 0
##$NC_proc= -8
##$NLEV= 6
##$NOISF1= 0
##$NOISF2= 0
##$NSP= 0
##$NTH_PI= 0
##$NZP= 0
##$OFFSET= 14.98509
##$PC= 1
##$PHC0= 66.66504
##$PHC1= 0
##$PH_mod= 1
##$PKNL= yes
##$PPARMOD= 0
##$PPDIAG= 0
##$PPIPTYP= 0
##$PPMPNUM= 2147483647
##$PPRESOL= 1
##$PSCAL= 4
##$PSIGN= 0
##$PYNMP= <proc.py>
##$REVERSE= no
##$SF= 400.02
##$SI= 32768
##$SIGF1= 0
##$SIGF2= 0
##$SINO= 400
##$SIOLD= 32768
##$SPECTYP= <>
##$SREGLST= <1H.CDCl3>
##$SSB= 0
##$STSI= 32768
##$STSR= 0
##$SW_p= 8223.68421052631
##$SYMM= 0
##$S_DEV= 0
##$TDeff= 65536
##$TDoff= 0
##$TI= <>
##$TILT= no
##$TM1= 0
##$TM2= 0
##$TOPLEV= 0
##$USERP1= <user>
##$USERP2= <user>
##$USERP3= <user>
##$USERP4= <user>
##$USERP5= <user>
##$WDW= 1
##$XDIM= 32768
##$YMAX_p= 455379437
##$YMIN_p= -755772
##$CURPLOT= <Network HP LaserJet P1505>
##$CURPRIN= <$Network HP LaserJet P1505>
##$DFORMAT= <normdp>
##$LAYOUT= <+/1D_H.xwp>
##$LFORMAT= <normlp>
##$PFORMAT= <normpl>
##$SURQMSG= 1
$$ End of Bruker specific parameters
$$ ---------------------------------
##NTUPLES= NMR SPECTRUM
##VAR_NAME=  FREQUENCY,     SPECTRUM/REAL,   SPECTRUM/IMAG
##SYMBOL=    X,             R,               I
##VAR_TYPE=  INDEPENDENT,   DEPENDENT,       DEPENDENT
##VAR_FORM=  AFFN,          ASDF,            ASDF
##VAR_DIM=   32768,         32768,           32768
##UNITS=     HZ,            ARBITRARY UNITS, ARBITRARY UNITS
##FACTOR=    0.250966925370066, 1,           1
##FIRST=     8223.43324360094, 142106,       -42355
##LAST=      0,             57488,           -359762
##MIN=       0,             -755772,         0
##MAX=       8223.43324360094, 455379437,    0
$$ Real data points
##PAGE= N=1
##DATA TABLE= (X++(R..R)), XYDATA
$$ [...]
$$ plain form
19563 29720 -394087 -252154 -82264 -208161 5862 -16316 -138155 229631 -174991 -356545
19553 -356545 47066 164054 -11119 -9682 -115004 246842 -76581 24002 100351 -263035 -171258
19542 -171258 -243717 -81923 187595 107754 -84078 -103081 -112499 35629 5514 253187 -53579
19530 -219449 125488 11678 -278984 -16925 -222098 43813 -383979 -427402 -162152 -121810
19520 -121810 188149 -138994 26923 -133395 -130052 232700 -150556 -259106 -71767 -141969
19510 -141969 -168007 90391 -164580 -185332 81535 375383 -280770 39816 -50803 -300965 -41686
19498 34552 116854 33257 123281 -96718 -211060 72829 -11330 63977 80894 -243482 167079
19486 -11865 -179497 -357323 -40062 -165123 71044 9688 79181 -365616 -166466 -48744 -281091
$$ packed form
19563B9720c94087J41933h2264j25897E862a6316j21839B29631a74991j81554
19553c56545D7066J16988a1119J437j05322B46842g6581B4002P6349b63035R1777
19542a71258p2459h1923A87595p9841h4078j9003r418C5629E514K47673e3579
19530b19449A25488A1678b78984a6925k05173D3813c83979m3423a62152M0342
19520a21810A88149a38994B6923a33395L343B32700a50556j08550g1767p0202
19510a41969k6038I0391a64580k0752H1535K93848b80770C9816e0803k50162d1686
19498C4552Q2302C3257R0024i6718j14342G2829a1330F3977J6917b43482A67079
19486a1865j67632j77826d0062j25061G1044I688O9493c65616a66466d8744k32347
$$ plain form
19475 -281091 -11882 32760 332923 102498 -57682 20337 -183678 21244 59978 -233711 -33179
19463 59585 -61162 -24600 -42658 -159391 157368 77729 -243629 395630 -148961 58620 -347164
19451 -254182 106412 72008 12824 -93795 -245045 19690 226960 284082 -358371 -481832
19441 -481832 -95077 -225221 -1322 -145083 -232123 -64466 150703 -8395 22805 -125928 -45891
19429 -269487 -147464 75764 -3917 219955 -306062 11716 -81692 -102043 -358975 249168 -209013
19417 7225 42713 -65595 -245596 -167197 38096 75878 150593 -94049 15402 -161268 261514
19405 -787 -171685 -7132 5608 -4233 -396411 -4631 -14150 -50908 74189 -161021 95144 -200637
19392 -142757 -151010 -339376 -230328 -133838 -166803 31136 -351607 -100131 120869 170736 144878
$$ packed form
19475b81091a1882C2760L00163A02498e7682B0337a83678B1244L8734b33711c3179
19463E9585f1162b4600j8058j16733A57368G7729b43629C95630a48961E8620c47164
19451b54182A06412l4404A2824i3795j51250A9690K07270N7122c58371j23461
19441d81832i5077j30144a322j43761q7040f4466A50703h395B2805a25928d5891
19429b69487J22023G5764c917B19955c06062A1716h1692k0351k56932B49168b09013
19417G225L5488f5595j80001P8399C8096L7782P4715i4049A5402a61268B61514
19405g87j70898g132E608d233l92178d631r519l6758G4189a61021I5144b00637
19392a42757q253j88366J09048R6490l2965C1136c51607a00131A20869M9867k5858
$$ plain form
19381 144878 -94706 182493 -205235 -247214 216775 238726 -128809 102048 -56860 -130635
19371 -130635 -122585 27285 40122 114922 -280942 21134 15582 -183970 -42130 -168523 43153
19359 -10594 -46599 -303110 108572 224451 -171119 11952 139934 -60038 -65906 -33156 -188190
19348 -188190 14211 -165708 174963 41575 -262293 -126210 -204653 70136 -139700 -58494
19337 92132 60201 48657 -72285 -20759 60668 -125617 -25633 -150791 -141409 -7333 -210172
19326 -210172 -191036 -143229 114321 77985 8771 -155679 -120349 166243 -151543 -82676 -230613
19315 -230613 57069 244320 -129660 31818 -303892 25381 238122 -356366 -168766 -109611
19305 -109611 -155424 -241294 224444 29806 -33289 -35895 142908 -416775 -152773 -190230 146031
$$ packed form
19381A44878i4706A82493b05235m1979B16775K1951a28809A02048e6860p3775
19371a30635Q050B7285J2837P4800b80942B1134n552a83970d2130j26393D3153
19359a0594l6005k56511A08572J15879a71119A1952J27982f0038n868L2750j55034
19348a88190A4211a65708A74963D1575b62293a26210p8443G0136a39700e8494
19337I2132l1931j1544g2285b0759F0668a25617b5633j25158R382g333k02839
19326b10172J9136M7807A14321l6336H771a55679L5330A66243a51543O8867j47937
19315b30613E7069J87251a29660C1818c03892B5381K12741c56366a68766N9155
19305a09611m5813q5870B24444B9806c3289k606A42908d16775a52773l7457A46031
$$ plain form
19293 10051 -135725 -229618 150733 190037 -90846 -222837 -190550 46822 -252358 -39923 -38168
19282 -38168 -145154 -207109 170632 -242753 -13767 43794 -33039 38087 -191882 65433 -88083
19270 -61569 139138 79370 -332326 -110946 -217792 -118406 -226720 32919 -120705 19093
19259 106234 -29956 37734 139891 -179315 132015 -8305 -146821 -190123 -241629 -15806 49967
19247 -164150 -320543 -352266 48381 -175352 -391231 -88975 180698 -149674 -121744 24746
19236 -134491 100661 148391 6288 -14123 24537 19749 -190185 308395 121211 90253 278759
19225 278759 -244876 -12783 -6953 -88395 -362347 -229893 -97972 -95931 51982 382799 -162458
19213 -195747 -143752 -12986 -223352 -161439 -224860 -164190 69723 -252684 -30435 -137782 -95940
$$ packed form
19293A0051a35725r3893A50733L9304i0846j31991L2287D6822b52358c9923J755
19282c8168j06986o1955A70632b42753a3767D3794c3039C8087a91882F5433h8083
19270f1569A39138n9768c32326a10946j06846R9386j08314C2919a20705A9093
19259A06234b9956C7734J02157a79315A32015h305j38516m3302n1506a5806D9967
19247a64150j56393l1723D8381a75352k15879h8975A80698a49674K7930B4746
19236a34491A00661M7730F288a4123B4537m788a90185C08395A21211l0958J88506
19225B78759b44876a2783N830q1442k73952J32454i7972K041E1982L30817a62458
19213a95747N1995a2986k10366O1913o3421O0670F9723b52684c0435j07347M1842
$$ plain form
19202 -95940 -32444 -146819 -233625 69330 -91460 -65423 -338155 95787 28059 138186 308145
19191 308145 78528 138708 -346166 -172021 -75080 119955 -320808 -20703 -202158 111567
19180 -397315 195017 123706 16325 -42680 -127647 -391952 215416 143155 -250665 75169 91579
19169 91579 164066 173052 162380 -112431 -143954 185319 -464179 -104935 -301048 -160371 1301
19157 -112490 212911 -142734 -28584 -47068 150553 13411 -164688 169202 -130064 -156280
19147 -156280 145410 12855 21878 -116553 23670 184324 -167455 -98642 -155191 -5311 -317079
19136 -317079 45529 12400 33750 -77333 -23586 -61403 -34681 -112237 -187227 185298 113587
19125 113587 -162935 -122367 365208 -173393 -215418 -176953 -196309 -208032 21944 259940 167221
$$ packed form
19202i5940c2444j14375q6806F9330i1460K6037k72732I5787B8059J10127J69959
19191C08145G8528O0180c46166a72021g5080A19955c20808b0703j81455A11567
19180c97315A95017p1311A6325d2680q4967k64305B15416p2261b50665G5169J6410
19169I1579P2487Q986j0672a12431l1523A85319d64179a04935j96113J40677A301
19157a12490B12911a42734b8584j8484A50553A3411a64688A69202a30064k6216
19147a56280A45410A2855R023a16553B3670J60654a67455O8813n6549e311l11768
19136c17079D5529A2400K1350g7333b3586l7817K6722p7556p4990A85298p1711
19125A13587a62935M0568C65208a73393m2025L8465j9356j1723B1944K37996r2719
$$ plain form
19114 167221 82132 411304 96264 167098 266364 -62132 171903 -62883 63982 82973 -50618
19102 222582 -503159 84242 -369283 43530 16355 -63477 -134131 -98906 -190275 -402699 -94131
19090 107870 -10853 -229274 -181225 -62489 5711 -50776 -163495 -151206 -242290 136105 112815
19079 112815 103613 -517535 169541 -220243 -243226 -185209 4388 -20607 -31346 7856 -148408
19067 16872 -73969 1154 101410 301627 -124848 3075 121326 -101857 -265709 -123921 58356
19055 -210327 -253621 98241 -54658 -409075 60071 -28295 -177064 184873 60673 54918 216203
19044 216203 6147 -174159 248766 -73030 -181880 -77123 -29850 295784 -66039 -436221 -16546
19032 173879 -430092 -23760 -51819 -90061 -118833 -176272 -92068 127848 90119 140296 -95065
$$ packed form
19114A67221H2132L29172I6264P0834R9266f2132A71903f2883F3982J8991e0618
19102B22582e03159H4242c69283D3530A6355f3477p0654L5225r1369k12424i4131
19090A07870a0853k18421M8049f2489E711e0776j12719J2289r1084A36105k3290
19079A12815r202e17535A69541b20243k2983N8017D388b0607j0739G856a48408
19067A6872g3969A154J00256K00217a24848C075J18251a01857j63852a23921E8356
19055b10327m3294I8241e4658l54417F0071b8295j48769A84873F0673n755J61285
19044B16203F147a74159B48766g3030j08850g7123b9850B95784f6039l70182a6546
19032A73879d30092b3760k8059l8242k8772n7439Q4204A27848l7729N0177i5065
$$ plain form
19020 38848 21740 -52279 205300 -19500 -320609 -326586 107470 -386768 -108147 11609 -355756
19008 -178437 -148986 -183847 47532 -258800 -33797 175210 -158532 -296813 17811 -47033 416634
18996 25820 -231839 -258067 -102014 -206349 -185262 -49890 37354 -207183 -17149 149861 -17240
18984 166037 115315 -146699 -123988 69364 -128474 35402 -350599 -15641 -233211 -512420
18974 -512420 8995 23309 14508 17619 -140767 -334600 140910 -81526 29907 -241164 -469738
18963 -469738 157561 281692 315012 14547 -48212 -98736 -51945 -219332 37967 -59482 -31428
18952 -31428 -7470 117600 -57091 -73371 -66177 6865 -134625 -64514 -215832 -17932 75601 213579
18940 213579 -367130 -141004 198101 -153308 -5045 236896 343916 -94037 9715 -223053
$$ packed form
19020C8848j7108e2279B05300a9500l01109n977A07470c86768a08147A1609c55756
19008a78437K9451l4861D7532b58800c3797A75210a58532j38281A7811d7033D16634
18996B5820b31839k6228a02014j04335K1087d9890C7354b07183a7149A49861a7240
18984A66037n0722a46699K2711F9364a28474C5402c50599a5641k17570k79209
18974e12420H995J4314q801L111a40767j93833A40910h1526B9907b41164k28574
18963d69738A57561J24131L3320A4547d8212n0524M6791j67387C7967e9482K8054
18952c1428g470A17600e7091j6280P194F865a34625f4514j51318a7932G5601J37978
18940B13579c67130a41004A98101a53308e045B36896J07020i4037I715b23053
$$ plain form
18929 -318811 -41549 -26726 -278734 130344 -96476 304825 191189 33884 -94798 -179477 60492
18917 151627 -75346 58058 -122815 78479 -210753 35572 202156 64324 154933 -5138 201760
18905 -197618 -410370 -218036 -70516 -221233 171949 376614 -47894 236017 -162928 -121858
18895 -121858 -298985 -58563 -294496 -322248 -47326 -100713 -386279 -152755 -234078 350952
18884 104931 -142415 19152 59899 -179335 -27114 23073 -194814 -228295 -224657 -505501 -38510
18872 86447 -197905 118188 -335010 128805 -124271 23774 -18662 301834 25204 284945
18862 284945 -299020 119150 -29159 -120582 -98438 249491 -181220 -367557 243381 -137374
18851 203534 175693 32164 53391 -208626 7125 -71654 164787 -270914 -231153 -221984 -81300
$$ packed form
18929c18811d1549J4823k52008A30344i6476C04825j13636C3884i4798q4679F0492
18917A51627g5346E8058a22815G8479b10753C5572J66584F4324R0609e138B01760
18905a97618k12752J92334g0516j50717A71949K04665d7894B36017a62928M1070
18895a21858j77127e8563k35933k7752d7326n3387k85566a52755q1323C50952
18884A04931a42415A9152M0747a79335b7114B3073a94814l3481L638k80844c8510
18872H6447a97905A18188c35010A28805a24271B3774a8662C01834B5204K59741
18862B84945b99020A19150b9159r1423K2144B49491a81220j86337B43381a37374
18851B03534k7841C2164K1227b08626G125g1654A64787b70914L9761R169h1300
$$ plain form
18839 -286384 -227010 16239 -168739 136832 101525 59335 -15796 -11256 -234437 47075 64574
18828 64574 -119408 -263815 -355507 57773 189646 18922 10310 -222914 -46907 157033 -375884
18816 134405 -298457 -31022 92048 67979 -140067 194593 95733 477301 98654 72813 3525
18804 448096 -242799 -55595 -297982 -121807 -232286 331538 -55936 2246 163067 -42764
18793 -254244 202439 -172209 -70811 192286 -84949 -57903 136250 -19363 12149 -35000 76966
18781 156594 130170 -21597 260853 -193595 46897 127216 -245192 18899 -458638 -114741
18770 -183019 6151 -26324 46562 60113 -123481 176468 320804 -151724 -116161 -159308 -101673
18759 -101673 153008 71858 -27142 -150785 -40755 -173745 -125670 -5617 -110686 159944 -33586
$$ packed form
18839b86384N9374A6239a68739A36832l5307m2190a5796M540k23181D7075J7499
18828F4574a19408j44407r1692E7773J31873A8922q612b22914d6907A57033c75884
18816A34405b98457c1022I2048k4069a40067A94593I5733L81568I8654k5841C525
18804D48096b42799e5595k42387a21807j10479C31538e5936B246J60821d2764
18793b54244B02439a72209g0811A92286h4949K7046A36250a9363A2149c5000G6966
18781A56594k6424b1597B60853a93595D6897Q0319b45192A8899d58638a14741
18770a83019F151b6324D6562J3551a23481A76468J44336a51724L5563m3147N7635
18759a01673A53008G1858b7142j23643d0755j32990M8075e617j05069A59944c3586
$$ plain form
18747 337101 -127471 -97672 -90482 -82959 125020 -219154 22981 -134077 -112515 -136803 -196111
18736 -196111 -105278 -109454 -14667 62719 -123863 103616 -146094 148935 193099 -112420 -128283
18725 -128283 -172173 122892 -306204 117593 29700 -184915 -353056 210370 -154151 -114542
18715 -114542 39031 -128714 -34700 181582 -34978 -395190 -161654 -108626 -147271 -207802 -165775
18704 -165775 42763 64405 53989 241548 -3907 -14870 107681 29775 -171396 16600 354626
18693 354626 -291116 -79034 11601 -186588 -394291 -297765 -207263 -79469 342013 -153565
18682 122218 -318948 -398876 -161407 -99503 119750 -66184 -301886 -57406 1554 -32490 -232902
18671 -232902 -109729 15782 -38853 -111684 60824 -129092 121622 -13364 15546 -44135 -159676
$$ packed form
18747C37101a27471K9799P190P523A25020b19154B2981a34077K1562k4288n9308
18736a96111R0833m176a4667F2719a23863A03616a46094A48935M4164a12420j5863
18725a28283m3890A22892c06204A17593B9700a84915j68141B10370a54151L9609
18715a14542C9031a28714c4700A81582c4978l60212a61654N3028l8645o0531M2027
18704a65775D2763K1642j0416J87559c907j0963A07681B9775a71396A6600L38026
18693C54626b91116g9034A1601a86588k07703R6526R0502g9469C42013a53565
18682A22218c18948p9928a61407O1904A19750f6184k35702e7406A554c2490k00412
18671b32902a09729A5782c8853p2831F0824a29092A21622a3364A5546d4135j15541
$$ plain form
18660 -159676 6787 5883 -311060 -30634 22928 -6422 -117860 -327153 -8162 -25808 -123231 183476
18647 -67105 154950 154320 222165 -212310 226826 239854 -167928 -192685 -283100 242663 4348
18635 54038 180541 70685 -32143 -178623 3139 44311 122307 -482399 2598 -55417 -138149
18624 -138149 83897 201526 334744 -131018 -37219 -206562 -263855 -163512 5922 -178527
18613 202187 -312905 -271727 -38387 -53327 22507 -109654 -87986 -302625 -87279 -201885 -123775
18602 -123775 -5995 -385895 175589 117263 -28472 -240645 -102794 -271347 58476 28014 -96692
18590 -333107 -189289 -73764 -106485 -139863 -218916 5086 -189531 178927 -183488 261282 -70428
18578 -154090 -144627 -11596 -81596 -155730 100798 -343591 74934 -379793 -146962 -123996 -165269
$$ packed form
18660a59676F787r04c11060c0634B2928f422j11438k09293h162j7646r7423A83476
18647f7105A54950o30O7845b12310B26826J3028a67928k4757r0415B42663D348
18635E4038J26503G0685c2143j46480C139M1172P7996d82399B598e5417q2732
18624a38149H3897J17629J33218a31018c7219j69343n7293J00343E922a78527
18613B02187c12905M1178c8387j4940B2507a09654K1668k14639h7279j14606P8110
18602a23775e995l79900A75589n8326b8472k12173a02794j68553E8476B8014i6692
18590c33107J43818g3764l2721l3378p9053E086a89531A78927a83488B61282g0428
18578a54090R463a1596p0000p4134A00798c43591G4934c79793a46962K2966m1273
$$ plain form
18567 -165269 -208758 -159457 72229 2738 -131330 29768 -10243 -62218 -194955 -291908 -214422
18556 -214422 95438 23403 84799 -239786 -110885 67044 15253 251292 -68556 -123083 -55326
18544 -89687 -9533 28612 -2817 -291324 -284752 59612 -273924 -229667 7911 274603 23723 36815
18532 36815 -168697 67549 -56975 -103675 -73323 -125932 -334536 150322 -203550 532617 -37331
18520 51656 158119 48644 -87942 -266170 -39000 -158703 -16843 18812 -117314 -22420 -85391
18509 -85391 -31537 110515 276175 -61727 -163343 -16809 63512 -33877 -146048 -100390 -55296
18498 -55296 -30802 81454 -268500 -112626 -141836 -322047 -45061 -58589 100085 79542 -6286
18486 260176 187707 141421 112873 -70733 -228196 -229180 205689 41352 206536 -106173 -440797
$$ packed form
18567a65269m3489M9301G2229B738a31330B9768a0243n1975j32737r6953P7486
18556b14422I5438B3403O1396b39786a10885F7044A5253K36039f8556n4527e5326
18544h9687i533B8612b817k88507O572E9612b73924M4257G911K66692B3723J3092
18532C6815a68697F7549e6975m6700L0352n2609k08604A50322b03550E32617c7331
18520E1656J06463D8644h7942j78228c9000j19703a6843A8812a17314b2420o2971
18509h5391c1537A10515J65660f1727j01616a6809F3512c3877j12171M5658M5094
18498e5296K4494H1454b68500a12626k9210j80211d5061j3528A00085k0543f286
18486B60176p2469m6286k8548g0733j57463r84B05689D1352J65184a06173l34624
$$ plain form
18475 -440797 -138551 -178517 -13724 -40947 -84889 -280478 -297727 -101839 25776 -28660 -293965
18464 -293965 77912 135372 -150321 11918 -78380 -99669 -59426 -39781 50911 -221784 214599
18452 11979 -2322 98970 -165359 -192509 84138 -224333 337797 60872 47987 -287633 -86098
18440 38021 -158459 174149 -153630 -233020 -74088 -9503 4092 -180795 101138 55535 -15320
18428 86280 -147833 -99719 82776 -62128 47802 -364155 55852 7513 77110 -2028 -102631
18417 -102631 -83273 -245481 -90755 -179281 492738 -211618 -212788 -178372 -164699 -257865 -124788
18405 -311926 80441 -45804 136112 102154 106959 59949 16934 230265 -112849 -189760 -26544
18393 49992 -16932 -3957 30535 146108 -84103 81778 -59155 129022 41935 -66151 9919 -170092
$$ packed form
18475d40797a38551l9966a3724k7223m3942j95589j7249a01839B5776b8660k65305
18464b93965G7912N7460a50321A1918g8380k1289M0243J9645E0911b21784B14599
18452A1979b322I8970a65359k7150H4138b24333C37797F0872j2885b87633h6098
18440C8021a58459A74149a53630p9390g4088i503D092a80795A01138m5603a5320
18428H6280a47833M8114H2776f2128D7802c64155E5852G513O9597b028j00603
18417a02631J9358j62208i0755q8526D92738b11618j170L4416J3673r3166a24788
18405c11926H0441d5804A36112l3958M805m7010A6934K13331a12849p6911b6544
18393D9992a6932c957C0535J15573h4103H1778e9155A29022D1935f6151I919a70092
$$ plain form
18380 -47852 3382 200913 -195938 -8799 -386542 -22280 -108383 -242323 -21153 -160909 -372942
18369 -372942 -171628 71937 26055 -202602 -46653 -251565 -342061 137118 71245 -140861
18358 65026 -24700 125863 90509 -144170 194687 22506 21183 -228216 -1174 271082 -41591
18346 230077 -51672 81823 -38396 -52525 -136971 6277 -262953 65417 387512 -273893 138822
18334 -42600 -103225 104701 -302955 -66434 -324172 -170064 76155 185383 69501 -37130 168904
18322 103878 47434 16201 329410 -134206 -228013 -107146 30671 -134625 95659 35446 -99554
18310 -126038 108037 -31 33677 -23125 89742 -142422 -60296 -176771 100850 -54568 -299123
18299 -299123 76733 100376 -37631 -30566 74600 -428312 188251 30710 269385 351787 215811
$$ packed form
18380d7852C382J97531a95938h799l77743b2280q6103j33940b1153j39756k12033
18369c72942a71628G1937B6055b02602d6653k04912r0496A37118o5873a40861
18358F5026b4700A25863l5354a44170A94687B2506j323b28216a174B71082d1591
18346B30077e1672H1823c8396j4129q4446F277b62953F5417L22095b73893A38822
18334d2600o0625A04701c02955f6434k57738J54108G6155J09228F9501c7130A68904
18322A03878D7434A6201L13209a34206r3807a07146C0671a34625I5659C5446i9554
18310a26038A08037c1C3677b3125H9742a42422f0296j16475A00850e4568k44555
18299b99123G6733K3643c7631P065G4600d28312A88251C0710K38675Q2402j35976
$$ plain form
18288 215811 12595 -58955 -90246 181498 -406392 179736 -368168 -25291 -283410 -178731
18278 -178731 -165772 -86035 24169 -147793 -135287 -3883 59104 -160335 -220583 -171852 313005
18266 170158 -14581 55182 82436 278773 -120174 -304212 -4922 64226 -259893 75878 -290031
18254 58388 121071 -270191 -182842 -120244 -138601 -299907 10650 63220 -214943 36779 89861
18243 89861 -203569 96009 30192 -323881 151051 89462 107360 130537 -309928 159040 264319
18232 264319 -162677 59888 265491 -426959 -196438 -293498 27068 19427 264349 11290 33341
18221 33341 109877 227391 219860 -206609 -191696 147503 -247100 -70357 -68485 -165443 -76455
18209 5925 -167693 13062 -15833 78150 112368 -7659 -153531 -398543 -128206 -304431 36763
$$ packed form
18288B15811A2595e8955l1291A81498d06392A79736c68168b5291k58119J04679
18278a78731J2959P9737B4169a47793J2506c883E9104a60335o0248M8731C13005
18266A70158a4581E5182K7254J96337a20174j84038d922F4226b59893G5878b90031
18254E8388O2683b70191Q7349O2598j8357j61306A0650N2570b14943C6779N3082
18243H9861b03569I6009C0192c23881A51051o1589J7898K3177c09928A59040J05279
18232B64319a62677E9888K05603d26959a96438r7060B7068p641K44922A1290K2051
18221C3341P6536J17514p531b06609J4913A47503b47100g0357J872r6958g6455
18209E925a67693A3062a5833G8150L4218g659j45872k45012a28206j76225C6763
$$ plain form
18197 141159 -30620 -221813 -178944 -91115 13570 -210102 -97394 -95660 -311008 -296231 -12866
18185 -51944 -95098 295888 -427411 227283 16996 -110913 46009 -90824 25974 -71539 -70916
18174 -70916 -165131 -232331 -49178 66350 5286 -583162 -20154 -26442 191762 71347 -182351
18162 -144584 -75721 -488537 43236 60514 33172 -68868 336574 99798 -9617 -13315 -125778
18151 -125778 60962 -59715 172514 -128472 -80796 -64497 -119725 -342510 -229136 -14798 -306019
18140 -306019 -162383 66515 160491 -89610 -116910 20738 -92280 -251124 -64679 205185 83207
18128 -66360 45638 -260230 -36333 10899 -10287 -133233 -16713 364920 -359917 -18196 -322178
18117 -322178 170276 -87700 -187926 -240474 99847 21797 -278548 -87560 433896 -149668
$$ packed form
18197A41159c0620j91193M2869Q7829A3570b10102i7394J734k15348J4777a2866
18185e1944m3154B95888d27411B27283A6996a10913D6009i0824B5974g1539O23
18174g0916r4215o7200d9178F6350E286e83162b0154o288A91762G1347a82351
18162a44584O8863m12816D3236J7278k7342f8868C36574I9798i617l698j12463
18151a25778F0962e9715A72514a28472M7676J6299n5228k22785J13374a4798k91221
18140c06019J43636F6515R3976h9610k7300B0738i2280j58844f4679B05185H3207
18128f6360D5638b60230c6333A0899a0287j22946a6713C64920c59917a8196l03982
18117c22178A70276h7700j00226n2548I9847B1797b78548h7560D33896a49668
$$ plain form
18106 -90199 -149293 226275 -220519 873 -106572 -73327 -60349 -54360 141364 132264 -121640
18094 174242 97668 129281 28278 88060 -72977 -171225 118435 -158654 25395 -149961 -209290
18083 -209290 -452763 69792 -114106 35492 7474 174140 126857 55010 191623 -213111 -564411
18072 -564411 27070 -17306 -242065 -212951 -25831 -106213 -208480 -80788 170802 122762 64529
18061 64529 -228613 -235576 -171436 -198295 -62015 262873 -141175 94648 -184229 89188 34627
18049 -106805 -91181 -131303 -89938 43520 -194956 -12 196364 -215028 -250119 -334170 117046
18037 78432 197260 -42047 -241224 44279 122626 103750 -91037 231594 254378 -23834 79667
18025 -191253 -86 -112899 142800 92366 185249 66453 -84060 285834 -66513 -231626 156617
$$ packed form
18106i0199n9094B26275b20519H73a06572L3245J2978N989A41364r100a21640
18094A74242p6574L1613B8278N9782g2977r8248A18435a58654B5395a49961n9329
18083b09290k43473F9792a14106C5492G474J66666m7283E5010J36613b13111l51300
18072e64411B7070a7306k24759K9114b5831q0382j02267h0788A70802m8040n8233
18061F4529b28613o963O4140k6859f2015B62873a41175I4648a84229H9188C4627
18049a06805J5624m0122M1365D3520a94956a2A96364b15028l5091q4051A17046
18037G8432J18828d2047j99177D4279P8347j8876i1037B31594K2784b3834G9667
18025a91253h6j12813A42800n0434R2883F6453h4060B85834f6513j65113A56617
$$ plain form
18013 101447 -108931 -176007 -82468 180914 27199 239365 -98852 -100350 343741 -331980 -17488
18001 -201065 -35332 -84184 -183950 -208879 -50781 73755 -66343 -57218 473413 2138 -41953 189272
17988 -227181 158264 -335918 155465 34075 -136990 70376 -286172 47607 -359009 -62060
17977 -58963 12761 -51895 82388 38544 -18532 177736 -128040 62924 -228010 66797 39347
17966 39347 -81906 -56894 127543 -104366 61065 -180069 69243 54337 58448 5762 341707
17955 341707 -151266 56561 7212 -106502 -230671 239278 83094 -143597 -104602 -31008 51987
17943 -79038 -7831 -157277 255173 1746 -12369 -145135 243909 -384639 96996 -56418 69415
17931 66802 -65179 -503505 41125 468692 -89881 185929 190764 40733 -132622 35058 -52838
$$ packed form
18013A01447a08931o7076h2468A80914B7199K12166i8852j498C43741c31980a7488
18001b01065c5332m8852r9766k4929e0781G3755f6343R125D73413B138d1953A89272
17988b27181A58264c35918A55465C4075a36990G0376b86172D7607c59009f2060
17977e8963A2761e1895H2388C8544a8532A77736a28040F2924b28010F6797k7450
17966C9347h1906K5012A27543a04366F1065a80069F9243j4906M111E762L35945
17955C41707a51266E6561G212a06502j24169B39278H3094a43597L8995c1008E1987
17943g9038g831j49446B55173A746a2369j32766B43909c84639I6996e6418F9415
17931F6802f5179m38326D1125M27567h9881A85929M835D0733a32622C5058e2838
$$ plain form
17919 277351 -30294 108144 -95626 216018 19631 26117 -8463 -14874 76278 -212607 84952
17907 44899 68756 77298 18508 -225631 -68352 -15250 -5909 -430554 146036 33901 -213822
17895 42336 223749 -246961 115154 215228 29588 -122118 220937 50134 -229571 -118557
17885 -118557 -35052 46152 -256107 -52089 -86263 -150965 269616 -228699 -110176 -183042 -91131
17873 169884 -47743 12652 -7214 -30050 109568 -60807 237132 -134043 42546 -71956 136110
17861 -90318 -20191 -356792 -255963 -139732 127667 9283 225528 80652 -53216 -44207 218181
17849 -335456 142455 -77526 -94474 143458 -115642 -42604 -224697 -44022 -89078 4791 -283341
17837 -72531 35626 -118275 -20596 130309 99116 -450560 24181 -41098 -76952 143668 158728
$$ packed form
17919B77351c0294A08144i5626B16018A9631O486h463o411G6278b12607H4952
17907D4899K3857Q542A8508b25631f8352a5250e909m24645A46036C3901b13822
17895D2336J81413b46961A15154J00074B9588a22118B20937E0134b29571J11014
17885a18557c5052D6152b56107e2089l4174o4702B69616b28699a10176p2866i1131
17873A69884d7743A2652g214k2836A09568f0807B37132a34043D2546g1956A36110
17861i0318b0191l36601J00829J16231A27667I283K16245H0652e3216R009B18181
17849c35456A42455g7526j6948A43458a15642d2604j82093d4022m5056D791b83341
17837g2531C5626a18275b0596A30309l1193d50560B4181d1098l5854A43668J5060
$$ plain form
17826 158728 -33283 41978 20969 146509 116366 -46478 -47574 29683 56978 -29906 -15112
17815 -15112 -64425 59387 -38311 -36339 86823 -289412 -211202 -44193 -17858 275230 -10678
17803 4257 -131467 -120573 -2743 49591 -42353 12880 51566 -57168 -103085 260131 -250267
17791 -47371 160683 157534 22602 -181130 145619 37182 57295 67487 107017 260869 -117293
17779 80427 -58981 -139517 -97121 201978 80143 99632 -11266 77571 -135059 -76446 249755
17767 114451 -78545 -114028 -45877 -84740 51939 -44489 -45072 -165666 -128153 -1446 -15335 108555
17754 -37006 -204318 62974 23556 -312744 199620 -1760 111886 -107419 -79375 164482 -64754
17742 104839 12696 185578 62832 -247142 33666 -33278 -197971 34208 15895 -50030 -122396
$$ packed form
17826A58728c3283D1978B0969J25540l0143d6478j096B9683K7295b9906J4794
17815a5112m9313E9387c8311J972H6823b89412P8210d4193a7858B75230a0678
17803D257a31467J0894b743D9591d2353A2880L8686e7168m5917B60131b50267
17791d7371A60683l149B2602a81130A45619C7182K0113J0192L9530J53852a17293
17779H0427e8981q0536M2396B01978H0143J9489a1266G7571a35059N8613B49755
17767A14451g8545l5483d5877l8863E1939d4489n83j20594L7513a446j3889A08555
17754c7006j67312F2974B3556c12744A99620a760A11886a07419K8044A64482f4754
17742A04839A2696J72882F2832b47142C3666c3278j64693C4208A5895e0030p2366
$$ plain form
17731 -122396 -116719 121715 1170 404677 -74736 -285529 -181862 -128665 88130 380924 127783
17719 144006 -32873 117547 32533 85891 -183709 107069 51523 73306 -266289 137025
17708 -69734 -198776 9444 -199089 -95639 -60201 -34802 -17417 144069 -202790 -62 -193617
17697 -193617 37628 122865 -104564 -96716 144149 -60092 206700 244852 169484 200729 -162205
17685 26658 45162 25821 -201545 9436 212155 174384 195512 115098 -113086 5884 -45517
17673 24167 349167 -3162 17391 46085 -23265 -181693 169353 -126533 219960 31434 126331
17662 126331 -94742 -130203 64720 240348 373280 -39246 -149537 -32002 29209 135946 236679
17651 236679 186316 -63722 -70841 11212 91067 -155146 43394 40252 -5356 -18752 55850 -128274
$$ packed form
17731a22396N677A21715A170M03507g4736k10793J03667N3197H8130K92794A27783
17719A44006c2873A17547C2533N3358a83709A07069E1523K1783b66289A37025
17708f9734j29042I444a99089i5639L5438K5399J7385A44069b02790f2j93555
17697a93617C7628Q5237a04564P848A44149f0092B06700L8152p5368L1245a62205
17685B6658J8504j9341b01545I436K02719l7771K1128q0414a13086E884d5517
17673B4167L25000c162A7391K8694b3265j58428A69353a26533B19960C1434R4897
17662A26331i4742l5461F4720J75628J32932c9246j10291c2002B9209J06737J00733
17651B36679n0363f3722p119A1212P9855a55146D3394l142e356j3396E5850a28274
$$ plain form
17638 160874 -277199 -27791 -115694 230404 266681 53362 92649 -28850 -30668 105572 36247
17626 -50884 -56572 322312 -198477 21502 250547 179816 93651 114373 220787 -60159 -124500
17615 -124500 -168754 -49590 158641 42089 167512 224499 106607 -153538 81099 7419 -121329
17603 -80763 -62888 30979 -222397 -144692 -123450 2096 179112 32893 221510 -81054 88459
17591 77164 -282535 332140 -168998 216953 -31251 21251 255742 -88082 28708 89579 259409
17580 259409 -192272 -6710 127846 161188 91644 65340 -184537 40162 1752 -163833 275449
17568 55906 -202243 170299 -40962 3554 -172299 77083 -196863 436516 -14818 -220771 -7756
17556 -246334 268561 -63975 -25968 164353 111143 -122665 -201066 240694 244057 -29358 300405
$$ packed form
17638A60874b77199b7791q7903B30404L6277E3362L9287b8850j818A05572C6247
17626e0884n688C22312a98477B1502K29045p0731q6165K0722J06414f0159o4341
17615a24500m4254d9590A58641D2089J25423N6987A06607a53538H1099G419a21329
17603h0763J7875C0979b22397P7705K1242B096J77016C2893J88617h1054H8459
17591G7164b82535C32140a68998B16953c1251B1251K34491h8082B8708O0871J69830
17580B59409a92272f710A27846L3342o9544k6304a84537D0162A752a63833B75449
17568E5906b02243A70299d0962C554a72299G7083a96863D36516a4818k05953g756
17556b46334B68561f3975b5968A64353n3210a22665p8401B40694L363b9358C00405
$$ plain form
17544 -231424 208028 58915 244459 98842 -82626 -19904 -241037 45926 -87491 260581 67481
17532 21247 26832 19597 171303 152578 191820 -28397 185488 105377 145686 35822 -66063 240809
17519 207799 276806 394751 105800 202009 -260399 192932 180663 -281454 219831 397830
17509 397830 37230 975 246924 -15345 282442 326913 163613 81988 10990 100081 358356
17498 358356 76461 57746 210044 166516 514385 -34337 -241979 180126 317682 -3486 78100
17486 48419 36482 349605 47913 158069 106258 -144915 -76925 232709 75276 90850 140627
17475 140627 -86680 305603 74324 70184 339350 68180 88210 141644 118635 -66730 342421
17463 -74791 33203 -51371 10951 389945 308255 -20982 -147149 242806 304304 40235 -24502
$$ packed form
17544b31424B08028E8915J85544I8842h2626a9904k21133D5926h7491B60581F7481
17532B1247N585p235J51706j8725L9242b8397A85488q0111M0309C5822f6063B40809
17519B07799O9007J17945A05800R6209b60399A92932j2269b81454B19831J77999
17509C97830C7230I75K45949a5345B82442M4471j63300q1625A0990Q9091K58275
17498C58356G6461j8715J52298m3528L47869c4337k07642A80126J37556c486G8100
17486D8419j1937L13123D7913J10156n1811a44915O7990B32709G5276J5574M9777
17475A40627h6680C05603G4324m140K69166F8180K0030N3434k3009f6730C42421
17463g4791C3203e1371A0951L78994q1690b0982j26167B42806O1498D0235b4502
$$ plain form
17451 103518 293533 145816 143122 179516 353174 92922 176450 146932 422711 434030 -51487
17439 -161285 237381 -52757 401051 85892 4634 -67567 497983 182545 554443 152086
17428 162676 66030 94252 352699 452721 -14744 126662 176175 597890 232429 364394
17418 364394 392138 536464 255368 414993 127646 153225 204344 214333 269519 234405 90173
17406 -91221 155678 512331 66089 133508 26249 -11750 -9400 110416 156002 96598 243253
17395 243253 -497 -17633 -124593 -187600 -53746 233039 141587 262855 -217597 -138673 409342
17383 11597 112367 154276 202278 233924 240171 393452 69041 297815 -60363 35220 -203420
17371 217392 99543 176562 25760 157707 174679 41224 4945 94984 627819 43671 68485
$$ packed form
17451A03518J90015A45816k694L6394J73658I2922Q3528k9518K75779J1319e1487
17439a61285B37381e2757D01051H5892D634f7567D97983A82545L71898A52086
17428A62676F6030K8222K58447J00022a4744A26662M9513M21715B32429J31965
17418C64394K7744J44326B55368J59625A27646K5579N1119R989N5186l5114I0173
17406i1221A55678L56653F6089O7419B6249a1750K350A10416M5586n9404J46655
17395B43253d97j7136j06960o3007e3746B33039r1452J21268b17597P8924D09342
17383A1597J00770M1909M8002L1646O247J53281F9041K28774f0363C5220b03420
17371B17392I9543P7019B5760J31947J6972D1224D945R0039N32835D3671K4814
$$ plain form
17360 68485 104957 185731 241413 232782 35313 430854 244893 -53344 148148 62067 -152399
17348 339257 64955 88556 -276944 -122229 -118044 375165 116596 -238434 24898 66262 -2840
17336 2151 -65491 333872 379103 -123366 244244 31544 46138 192678 366915 17340 160531
17325 160531 14917 6663 143881 95477 -66913 56761 442234 191533 95187 -86787 -48405
17314 -48405 311907 63254 -110656 107587 -100807 157221 -77068 93122 87453 131143 141420
17303 141420 70343 70374 259633 -135052 464622 71071 237729 400720 211157 316831 -170767
17291 180774 287209 263893 120703 101025 -157099 232055 119829 420879 65576 40988
17281 40988 247065 89880 160801 165464 257097 149007 81049 18152 74113 -43873 176998
$$ packed form
17360F8485L6472Q0774N5682q631C5313L95541j85961e3344A48148F2067a52399
17348C39257F4955K3601b76944a22229M185C75165A16596b38434B4898M1364b840
17336B151f5491C33872M5231a23366B44244C1544J4594J46540J74237A7340J43191
17325A60531A4917F663J37218m8404f6913E6761L85473A91533I5187h6787L8382
17314d8405C11907F3254a10656A07587a00807A57221g7068I3122n669M3690J0277
17303A41420G0343L1J89259a35052D64622G1071J66658J62991j89563J05674a70767
17291A80774J06435k3316A20703j9678a57099B32055j12226L01050F5576k4588
17281D0988K06077H9880P0921M663R1633j08090o7958A8152N5961d3873A76998
$$ plain form
17269 143257 131373 226788 150364 110260 345721 195160 289772 -40633 292386 -96528 70757
17257 230832 -258827 45815 274600 318440 287145 30224 154240 -9824 236641 -97713 269448
17245 199945 194083 132695 324197 170014 166498 125797 -101405 -38899 159618 339112 189910
17234 189910 144036 382704 164729 281082 135441 255215 428258 426348 594951 184209
17223 447163 237850 184181 440304 444593 68170 361570 350732 42216 173072 230341 312920
17212 312920 306578 -61933 430787 259508 122414 209393 214119 369683 358918 259984 238188
17201 238188 351566 365718 348095 452255 283225 43156 263058 -3798 -84521 404948 69052
17189 454176 -35181 310705 254264 221348 195023 -31816 465147 267570 213969 192585 352981
$$ packed form
17269A43257j1884R5415p6424m0104K35461j50561R4612d0633B92386i6528G0757
17257B30832b58827D5815K28785M3840l1295C0224J24016i824B36641i7713B69448
17245A99945n862o1388J91502j54183l516m0701a01405c8899A59618J79494j49202
17234A89910m5874K38668A64729J16353A35441J19774J73043j910J68603A84209
17223D47163k09313n3669K56123M289F8170K93400j0838D2216J30856N7269Q2579
17212C12920o342f1933D30787j71279A22414Q6979M726J55564j0765r8934k1796
17201B38188J13378J4152j7623J04160j69030D3156K19902c798q0723D04948F9052
17189D54176c5181C10705n6441l2916k6325c1816D65147j97577n3601k1384J60396
$$ plain form
17178 352981 129174 121190 181628 125245 452486 84880 -34123 371550 312653 424388 115605
17166 -135249 332078 166619 519786 198164 310858 300768 -43940 32333 395629 131600
17155 307036 298730 186179 66320 281555 102862 422113 425794 190714 293359 75107 620550
17144 620550 181354 329471 569373 207199 71435 455184 431329 279183 121538 209041
17134 209041 354449 422184 109016 324966 146888 395635 272950 189676 569407 94723
17123 167701 516913 615313 572396 400187 224781 351612 471796 -13996 131735 280306
17113 280306 349403 540998 337554 421448 459921 179289 144615 538361 679114 345844
17103 345844 338338 382112 390867 379550 295294 327772 446619 327143 296999 547917 631985
$$ packed form
17178C52981A29174p984O0438n6383L27241H4880c4123C71550n8897J11735A15605
17166a35249C32078j65459L53167A98164J12694j0090d3940C2333L63296A31600
17155C07036q306j12551F6320K15235A02862L19251L681A90714J02645G5107N45443
17144F20550A81354J48117K39902B07199G1435L83749k3855j52146A21538Q7503
17134B09041J45408O7735A09016K15950A46888K48747j22685q3274L79731I4723
17123A67701L49212R8400m2917j72209j75406J26831J20184a3996A31735J48571
17113B80306O9097J91595k03444Q3894L8473A79289l4674L93746J40753l33270
17103C45844p506M3774Q755j1317q4256L2478J18847j19476l0144K50918Q4068
$$ plain form
17092 631985 434847 319919 259185 470101 214798 601480 213315 176503 64316 443179
17082 443179 417615 252262 323054 780397 549234 381710 439196 631309 415560 349741
17072 349741 405391 346395 126929 389463 624094 540672 352871 394722 311397 349346 564715
17061 564715 328637 86929 535068 613281 543530 329591 603469 161739 383385 450665
17051 450665 690718 469082 450778 761234 238420 389614 376627 625225 534459 417517
17041 417517 129195 521917 812766 930681 438666 578372 477534 542822 518826 721303
17031 721303 523780 598854 714308 640779 217609 1008193 753229 422899 322824 685153
17021 685153 761632 884368 899919 478796 696611 619606 997646 407742 638308 665470
$$ packed form
17092F31985j97138j14928o0734K10916B14798L86682B13315l6812F4316L78863
17082D43179k5564j65353P0792M57343k31163j67524N7486J92113k15749o5819
17072C49741N5650n8996A26929K62534K34631q3422j87801M1851q3325L7949K15369
17061E64715k36078H6929M48139P8213o9751k13939K73878A61739K21646O7280
17051D50665K40053k21636j8304L10456B38420J51194j2987K48598r0766j16942
17041D17517A29195L92722K90849J17915D38666J39706j00838O5288k3996K02477
17031G21303j97523P5074J15454p3529B17609P90584k54964l30330j00075L62329
17021F85153P6479J22736J5551m21123K17815p7005L78040D07742K30566K7162
$$ plain form
17011 665470 494541 517600 687561 917704 845773 517301 670652 607847 554352 663712
17001 663712 537445 750952 836949 604948 602217 1126042 812756 767357 641442 556041
16991 556041 846580 443847 620936 799081 521084 692279 759686 851293 605764 595396
16981 595396 755725 696127 1251669 875510 701008 800057 841104 700559 490396 917384
16971 917384 687289 560630 1094545 1043888 917482 936331 689468 1076785 914207 741983
16961 741983 979575 855281 815207 1154068 1426199 1027894 723209 935562 943738 1182732
16951 1182732 966683 1071895 821898 863480 965435 1253055 1013446 1136031 1033490 1125983
16941 1125983 1076489 1015607 1311463 1170229 1144304 1393590 1373538 1114278 1345659 1209963
$$ packed form
17011F65470j70929K3059J69961K30143p1931l28472J53351o2805n3495J09360
17001F63712j26267K13507Q5997k32001k731N23825l13286m5399j25915q5401
16991E56041K90539m02733J77089J78145k77997J71195O7407R1607k45529j0368
16981E95396J60329n9598N55542l76159j74502R9049M1047j40545k10163M26988
16971I17384k30095j26659N33915n0657j26406J8849k46863L87317j62578j72224
16961G41983K37592j24294m0074L38861K72131l98305l04685K12353Q176K38994
16951A182732k16049J05212k49997M1582J01955K87620k39609J22585j02541R2493
16941A125983m9494o0882K95856j41234k5925K49286k0052k59260K31381j35696
$$ plain form
16931 1209963 1109306 1567305 1154807 1225339 1684846 1317621 990088 1105584 1599320 1539403
16921 1539403 1247249 1240486 1339609 1303891 1702780 1517645 1555227 1326989 1240858 1620991
16911 1620991 1437761 1730674 1545023 1726306 1420961 1439384 1598073 1624651 1393400 1743353
16901 1743353 1528686 1614224 1216079 1583870 1718471 1826824 1664138 1636131 1828780 1976745
16891 1976745 1596837 2076167 1888492 1922260 2025675 1927424 1615623 2077100 2232229 2062345
16881 2062345 2198476 2069736 2130405 1890603 2260914 2117045 2232440 2357703 2572908 2380456
16871 2380456 2458411 2469024 2454195 2446767 2349204 2786924 2545524 2725468 2862586 2614456
16861 2614456 3094620 2934234 2845502 3050010 3014292 3292226 2992766 3161911 3407786 3038542
$$ packed form
16931A209963j00657M57999m12498P0532M59507l67225l27533J15496M93736n9917
16921A539403k92154o763R9123l5718L98889j85135L7582k28238q6131L80133
16911A620991j83230K92913j85651J81283l05345J8423J58689K6578k31251L49953
16901A743353k14667Q5538l98145L67791J34601J08353j62686k8007J92649J47965
16891A976745l79908M79330j87675L3768J03415r8251l11801M61477J55129j69884
16881B062345J36131j28740O0669k39802L70311j43869J15395J25263K15205j92452
16871B380456P7955J0613j4829p428r7563M37720k41400J79944J37118k48130
16861B614456M80164j60386q8732K04508l5718K77934k99460J69145K45875l69244
$$ plain form
16851 3038542 2819076 3050058 3339272 3025077 3086929 3427632 3560236 3721552 3423405 3680828
16841 3680828 3535646 4033630 3890893 3863461 3907922 4033845 4185314 4113481 4613097 4080714
16831 4080714 4337687 4358162 4722961 4358993 4488788 4554867 4798598 4707352 4904325 4890891
16821 4890891 5353267 5205021 5429267 5467732 5856606 5486370 5956238 5892586 6191346 6129484
16811 6129484 6146640 6467158 6292621 6675048 6651736 7204785 7177870 7148044 7491824 7321041
16801 7321041 8016542 7948599 8486192 8266067 8673741 8842890 9167226 9110470 9459797 9674572
16791 9674572 10038548 10091438 10626331 10641530 10792473 11103720 11717522 11945428 12322060 12510504
16781 12510504 13075462 13462969 13795139 14173811 14745305 15153493 15702940 16194542 16724123
$$ packed form
16851C038542k19466K30982K89214l14195O1852L40703J32604J61316k98147K57423
16841C680828j45182M97984j42737k7432M4461J25923J51469p1833M99616n32383
16831D080714K56973K0475L64799l63968J29795O6079K43731r1246J96973j3434
16821D890891M62376j48246K24246L8465L88874l70236M69868o3652K98760o1862
16811F129484J7156L20518j74537L82427k3312N53049k6915k9826L43780j70783
16801G321041O95501o7943N37593k20125M07674J69149L24336n6756L49327K14775
16791I674572L63976N2890N34893J5199J50943L11247O13802K27906L76632J88444
16781A2510504N64958L87507L32170L78672N71494M08188N49447M91602N29581
$$ plain form
16772 16724123 17677892 18370543 18177917 19217134 19854936 20819933 21365300 22275591 23080859
16763 23080859 23981177 24910484 26131201 27126762 28619981 29364927 30927739 31892599 33571630
16754 33571630 35430605 36955926 38583728 40630700 42425274 44774337 46498736 49299163
16746 49299163 51934865 54609228 57994909 60856445 64590017 67998528 72410181 76754464
16738 76754464 81446150 86339426 91641918 96977488 103081053 109662186 116064014 123487027
16730 123487027 130686325 138118014 145940282 153452501 161409915 168820426 175656649 182366590
16722 182366590 187615740 192435257 195783679 197866915 198342472 197906139 195878937 192386238
16714 192386238 187872194 182163814 175745004 168855924 161385504 153555627 145454649 137767568
$$ packed form
16772A6724123R53769O92651j92626J039217O37802R64997N45367R10291Q05268
16763B3080859R00318R29307J220717R95561J493219P44946J562812R64860J679031
16754C3571630J858975J525321J627802K046972J794574K349063J724399K800427
16746D9299163K635702K674363L385681K861536L733572L408511M411653M344283
16738G6754464M691686M893276N302492N335570O103565O581133O401828P423013
16730A23487027P199298P431689P822268P512219P957414P410511O836223O709941
16722A82366590N249150M819517L348422K083236M75557m36333k027202l492699
16714A92386238m514044n708380o418810o889080p470420p829877q100978p687081
$$ plain form
16706 137767568 129786648 122337150 115345633 108528889 102166849 95697995 89774358 84638613
16698 84638613 79394713 75411711 70484275 66556285 62784674 58849902 55636903 52764488
16690 52764488 49861392 47489485 44893960 42531667 40224393 38524346 36767160 34930177
16682 34930177 33378510 31770970 30382071 28954581 27655613 26479595 25400486 24140109
16674 24140109 23574096 22360162 21604985 20555317 20086954 19098678 18489776 17507643 17195199
16665 17195199 16350507 16011174 15388900 15070401 14133884 14023917 13285859 13250644 12623266
16656 12623266 12476551 11866689 11595616 11177231 10557902 10453165 10024055 9653954 9742145
16647 9742145 9374000 9109750 8817318 8711349 8576900 8132168 7955706 7731741 7968483
$$ packed form
16706A37767568p980920p449498o991517o816744o362040o468854n923637n135745
16698H4638613n243900l983002m927436l927990l771611l934772l212999k872415
16690E2764488k903096k371907k595525k362293k307274j700047j757186j836983
16682C4930177j551667j607540j388899j427490j298968j176018j079109j260377
16674B4140109n66013j213934p55177j049668m68363r88276o08902r82133l12444
16665A7195199q44692l39333o22274l18499r36517j09967p38058l5215o27378
16656A2623266j46715o09862k71073m18385o19329j04737m29110l70101Q8191
16647I742145l68145k64250k92432j05969j34449m44732j76462k23965K36742
$$ plain form
16638 7968483 7571983 7413694 7072562 7109214 6827164 6754468 6469285 6496843 6173783 6022669
16628 6022669 5689103 5682259 5609606 5268603 5249037 5311673 4837939 4923191 4855039 4826194 5065000
16617 5065000 4319374 4672398 4588067 4134779 4097643 4225032 3936167 4000337 4068652 3806244
16607 3806244 3495403 3807171 3708288 3939048 3619977 3370838 3514705 3537109 3264894 3192434
16597 3192434 3115518 3079328 2886897 2718321 2799908 3361835 2884192 2705789 2640682 2719277
16587 2719277 2436733 2534173 3007254 2875895 2364883 2595191 2544959 2606891 2383508 2383566 2326679
16576 2326679 2134766 2132696 1937648 1776365 2271111 2198289 2316290 2083523 1747114 1803708
16566 1803708 1858324 1735839 2028217 1996524 1528077 1733696 1718888 1428897 1654514 1883642
$$ packed form
16638G968483l96500j58289l41132L6652k82050p2696k85183K7558l23060j51114
16628F022669l33566o844p2653l41003j9566O2636m73734Q5252o8152k8845K38806
16617E065000p45626L53024q4331m53288l7136J27389k88865O4170O8315k62408
16607C806244l10841L11768r8883K30760l19071k49139J43867K2404k72215p2460
16597C192434p6916l6190j92431j68576Q1587N61927m77643j78403o5107P8595
16587B719277k82544R7440M73081j31359n11012K30308n0232O1932k23383N8n6887
16576B326679j91913k070j95048j61283M94746p2822J18001k32767l36409N6594
16566A803708N4616j22485K92378l1693m68447K05619j4808k89991K25617K29128
$$ plain form
16556 1883642 1791611 1466420 1848398 1522520 1382788 1522360 1603708 1547972 1551179 1734248
16546 1734248 1616367 1483188 1357675 1150603 1614806 1456593 1243426 1418204 1253744
16537 1253744 853992 1365826 1457726 1454261 1389736 1365440 1452238 886745 1373327 1295490 1131105
16526 1131105 1183061 1155460 1149539 1316690 1287994 1062310 1303650 1158076 1336452 1161963
16516 1161963 1160495 977613 1013312 1135300 1090755 959214 1037522 941526 989698 968922 835345
16505 835345 708576 795635 1323853 671572 689011 641690 594325 855482 786051 1100977
16495 1100977 834724 799213 735072 894919 507277 362815 1227347 720026 997142 611967
16485 611967 665814 634860 767491 631321 578654 644326 881724 750518 824843 934402
$$ packed form
16556A883642r2031l25191L81978l25878j39732J39572Q1348n5736L207J83069
16546A734248j17881j33179j25513k07072M64203j58213k13167J74778j64460
16537A253744l99752N11834R1900l465o4525k4296Q6798n65493M86582p7837j64385
16526A131105N1956k7601n921J67151k8696k25684K41340j45574J78376j74489
16516A161963j468j82882L5699J21988m4545j31541P8308r5996M8172k0776j33577
16505H35345j26769Q7059N28218o52281J7439m7321m7365K61157o9431L14926
16495A100977k66253l5511o4141J59847l87642j44462Q64532n07321K77116l85175
16485F11967N3847l0954J32631j36170n2667O5672K37398j31206P4325J09559
$$ plain form
16475 934402 746280 643503 835275 626265 798055 720709 920872 399382 902221 497304
16465 497304 608333 533653 415768 537393 583831 534305 646466 664211 712783 386384
16455 386384 645606 442864 344916 691742 613255 412737 426588 356512 743170 229637
16444 573944 337365 550602 562730 443397 486049 669458 410598 730239 493405 530856
16434 530856 203556 548687 603278 355323 494882 303534 493955 286950 355372 442510
16424 442510 673948 278703 477095 537567 433537 754261 329155 162151 210900 841651
16414 841651 634814 519348 697455 528631 252932 177216 346719 347804 321834 657778
16404 657778 -58799 437726 415576 422015 493645 552259 86524 460945 535580 177235 607537
$$ packed form
16475I34402j88122j02777J91772k09010J71790p7346K00163C99382N02839m04917
16465D97304J11029p4680j17885J21625M6438m9526J12161J7745M8572l26399
16455C86384K59222k02742r7948L46826p8487k00518J3851p0076L86658B29637
16444E73944k36579K13237J2128j19333M2652J83409k58860L19641k36834L7451
16434E30856B03556L45131N4591k47955J39559j91348J90421k07005O8422Q7138
16424D42510K31438B78703J98392O0472j04030L20724C29155A62151M8749O30751
16414H41651k06837j15466J78107j68824B52932p5716J69503J085k5970L35944
16404F57778e8799D37726k2150O439P1630N8614H6524L74421P4635A77235M30302
$$ plain form
16393 607537 389076 342203 355835 539345 345825 248121 390860 210029 537470 343328
16383 343328 293198 273554 9272 359222 244877 485512 342778 432410 220140 -188140
16372 -3797 268868 396774 182266 322250 244739 61611 556461 602192 460457 359632
16362 359632 229617 363611 167151 396211 490891 556957 212631 146219 96553 -102106
16351 370572 358997 184997 323402 282091 328200 58687 416660 -55164 -179959 202754
16340 232963 385420 288676 244046 109725 60917 334974 463589 77316 81992 235216 184276
16329 184276 421375 167911 468289 127991 30256 255052 201916 -2691 -49628 273880
16318 -108669 25043 294716 277692 286710 66502 49852 71830 108121 56730 427449 29903
$$ packed form
16393F07537k18461m6873J3632J83510j93520r7704J42739j80831L27441j94142
16383C43328n0130j9644I272L49950j14345K40635j42734Q9632k12270a88140
16372c797B68868J27906A82266J39984p7511F1611M94850M5731j41735j00825
16362C59632j30015J33994A67151K29060R4680O6066B12631o6412m9666a02106
16351C70572j1575j74000J38405m1311M6109E8687L57973e5164j24795B02754
16340B32963J52457r6744m4630A09725m8808K74057J28615G7316M676J53224n0940
16329A84276K37099A67911L00378A27991C0256K24796n3136b691m6937B73880
16318a08669B5043K69673j7024R018F6502j6650K1978L6291n1391L70719B9903
$$ plain form
16306 288429 291885 85909 283230 -20230 221400 127718 92003 74704 161176 89737 264234
16295 264234 334386 49381 279056 172147 47069 192446 104830 -204241 81215 173420 302320
16284 302320 -86788 315249 68664 220563 275203 186541 137975 71047 150493 298711 -107798
16272 136776 -29475 -168282 -99899 156399 3462 577908 214160 270258 130161 319637
16262 319637 -107307 82954 58677 71451 48284 464997 319447 291456 301683 -23571 56803
16250 -21354 345448 401410 386967 109018 -106386 36026 45837 63859 400322 417182 175699
16238 -197903 243632 199379 287296 8063 52338 174759 198910 123013 260360 344055 -109924
16226 79320 147437 61512 68963 -78623 -124608 206334 127461 129092 178319 237505 205973 -231549
$$ packed form
16306B88429L456H5909J97321b0230B21400r3682l5715j7299Q6472p1439J74497
16295B64234P0152D9381K29675j06909D7069J45377q7616b04241H1215R2205J28900
16284C02320h6788C15249F8664J51899N4640q8662m8566o6928P9446J48218a07798
16272A36776b9475j38807O8383A56399C462N74446B14160N6098A30161J89476
16262C19637a07307H2954k4277J2774k3167M16713j45550k7991J0227b3571E6803
16250b1354C45448N5962j4443A09018a06386C6026R811J8022L36463J6860A75699
16238a97903B43632m4253Q7917H063M4275J22421K4151p5897J37347Q3695a09924
16226G9320O8117F1512P451g8623m5985B06334p8873J631M9227N9186l1532b31549
$$ plain form
16213 149226 -26772 199053 154410 230914 -45309 -132728 89435 141289 -84600 204069 41748
16201 -104097 -163571 -36930 88047 -75951 194877 41859 -44429 32571 268740 60490 21374
16189 119144 35732 100511 -3581 -77497 -173185 147643 28977 336608 -30392 -165894 -46233
16177 -141931 232165 13704 -81258 87804 117653 -26412 -88327 -176215 169789 59173 341561
16166 341561 216974 85340 310474 264239 -232 247014 341628 -243110 169552 114887 138767
16155 138767 -105081 -16724 5331 289668 -41063 -16579 55372 -448844 95960 -140766 147720
16143 59314 -183963 -2467 -102153 -93719 150138 -261256 3035 -125248 -31909 307287 -94142
16131 281252 -147168 352226 13124 425797 -50348 -24825 119953 247927 92595 72842
$$ packed form
16213A49226b6772A99053m4643P6504d5309q7419H9435N1854h4600B04069D1748
16201a04097n9474c6930H8047g5951A94877D1859d4429C2571K36169F0490B1374
16189A19144C5732O4779c581p3916r5688A47643B8977L07631c0392j35502d6233
16177a41931B32165A3704h1258H7804K9849b6412o1915q7888A69789E9173K82388
16166C41561j24587H5340K25134m6235b32B47014R4614b43110A69552n4665K3880
16155A38767a05081a6724E331K84337d1063a6579E5372d48844I5960a40766A47720
16143E9314a83963b467r9686Q434A50138b61256C035a25248c1909C07287i4142
16131B81252a47168C52226A3124M12673e0348b4825A19953J27974I2595j9753
$$ plain form
16121 72842 -152559 179226 86291 -195538 308507 -196690 163254 293515 -102185 177150
16110 129557 374361 134581 -192737 75178 -149926 95802 73621 140088 183241 141626 17162
16098 216426 20770 64489 -181267 277579 -33791 71641 -5827 -305092 -456777 242957 -123229
16086 -145142 283406 -52829 -54204 81873 65949 -21417 23098 -167138 -127528 210131 -23527
16074 -140267 -284421 220992 198284 -87968 173753 -27019 -225731 -181584 119682 208567
16064 208567 110903 18633 -100762 114230 -151529 -22875 251608 94765 -91994 -51722 58650
16052 -133177 16119 224266 -333272 -144639 -20161 -187739 -70549 27427 -157229 3537 78975
16041 78975 49343 -79284 -335188 122416 -151085 -106852 318489 -123645 -81013 -432210
$$ packed form
16121G2842a52559A79226H6291a95538C08507a96690A63254J30261a02185A77150
16110A29557K44804A34581a92737G5178a49926I5802k2181O6467M3153m1615A7162
16098B16426B0770M3719a81267B77579c3791G1641e827k99265j51685B42957a23229
16086a45142B83406e2829j375H1873j5924b1417B3098a67138L9610B10131b3527
16074a40267j44154B20992k2708h7968A73753b7019j98712M4147A19682Q8885
16064B08567r7664A8633a00762A14230a51529b2875B51608I4765i1994M0272E8650
16052a33177A6119K08147c33272a44639b0161j67578g0549B7427a57229C537P5438
16041G8975k9632g9284k55904A22416a51085M4233C18489a23645M2632l51197
$$ plain form
16031 -432210 47265 196530 -47404 370 -203593 -3329 173565 -32189 8607 -199675 -139414
16020 -139414 275936 156815 -174269 95734 -178081 -3040 76838 28523 -41134 120039 32612
16008 120258 -8803 95460 292733 44049 -67448 130820 -129642 -95992 15270 -111581 98130
15996 16676 -320536 -9783 -439262 -209370 292606 -99132 -162051 -406904 31958 -46689 -43623
15985 -43623 33511 882 63033 -40852 124724 371890 103688 -55609 110636 -119665 -166177
15974 -166177 -31112 117327 -110798 -86627 -194816 -149976 223304 68151 -55603 29536 126046
15963 126046 505302 88974 287905 115325 -20338 122234 70430 -105279 91025 -196579
15952 -461881 -423793 -105154 -74198 207209 208068 190230 -194271 34837 314166 32880 42781
$$ packed form
16031d32210D7265J49265d7404C70b03593c329A73565c2189H607a99675O0261
16020a39414B75936j19121a74269I5734a78081c040G6838B8523d1134A20039C2612
16008A20258h803I5460J97273D4049f7448A30820a29642L3650A5270a11581I8130
15996A6676c20536i783m29479b09370B92606i9132o2919k44853C1958d6689L066
15985d3623C3511H82O2151d0852A24724K47166A03688e5609A10636a19665m6512
15974a66177c1112A17327a10798K4171j08189M4840B23304F8151e5603B9536R6510
15963A26046L79256H8974J98931A15325b0338A22234n1804a05279I1025a96579
15952d61881L8088a05154L0956B07209Q59j7838a94271C4837K79329C2880R901
$$ plain form
15941 42781 -520597 49109 -209464 19440 -189517 -132284 -240234 -136242 -109582 -262894
15931 -262894 88934 33705 61056 -58736 -128538 125703 111292 -152267 78296 -211273 113008
15919 20490 -177878 -123183 -200364 -26461 -303078 -88156 -23067 -200424 -19830 -34746 -6316
15907 92556 -181150 -142337 -67423 51832 -48515 -55650 -94680 -145510 -27684 -225668 -155840
15896 -155840 21083 93441 -288166 135278 -119935 -170638 -47571 -63615 -155149 469 -19976
15884 222794 156913 172410 -211678 -331878 -249054 76214 -164542 27696 -46841 -250103 -131776
15873 -131776 28605 34411 -166779 -316932 -166357 39505 -93990 -326552 -104418 90547 -86027
15861 94122 35923 -243055 -148794 -97092 75851 -119211 -346757 -183765 134004 -68895 254693
$$ packed form
15941D2781e20597D9109b09464A9440a89517N7233j07950J03992K6660j53312
15931b62894H8934C3705K7351e8736o9802A25703j4411a52267G8296b11273A13008
15919B0490a77878N4695p7181b6461k76617h8156b3067j77357a9830j4916f316
15907I2556a81150L8813f7423E1832d8515p135l9030n0830b7684j97984O9828
15896a55840B1083P2358b88166A35278a19935n0703d7571j6044r1534D69a9976
15884B22794o5881J5497b11678j20200Q2824G6214a64542B7696d6841k03262J18327
15873a31776B8605N806a66779j50153J50575C9505i3990k32562a04418I0547h6027
15861I4122C5923b43055R4261N1702G5851a19211k27546J62992A34004f8895B54693
$$ plain form
15849 -103190 -134641 -55830 146928 130631 24067 213344 159726 -165587 -152549 -254508 -3
15837 8355 124440 -319475 275073 -177661 -341562 -162639 44424 34955 87467 207882 -162732
15825 -144926 186641 -466347 -22038 80595 18210 75133 -177592 -19827 -42081 121579 114071
15814 114071 -170752 -277966 -48037 207749 -38884 134371 -161004 154943 94301 -53909
15803 227800 183399 -8202 -97876 156951 212832 -226243 -159303 85590 217390 -205361 -320599
15792 -320599 10293 -68689 7375 -155826 221828 66025 44082 63922 -322801 400968 -74930
15780 -26782 21341 224154 -129335 -83746 -221355 299053 -240883 -258233 -21122 68201 308199
15769 308199 -184511 -439422 75772 12467 -47274 -46734 -134232 44083 -15583 163826 95367
$$ packed form
15849a03190l1451e5830A46928j6297B4067J89277n3618a65587J3038j01959c
15837H355J16085c19475B75073a77661j63901a62639D4424r469N2512J20415a62732
15825a44926A86641d66347b2038H0595A8210N6923a77592a9827k2254A21579p508
15814A14071a70752j07214d8037B07749c8884A34371a61004A54943o0642e3909
15803B27800m4401h202q9674A56951N5881b26243O6940H5590J31800b05361j15238
15792c20599A0293f8689G375a55826B21828F6025k1943J9840c22801D00968g4930
15780b6782B1341K02813a29335M5589j37609B99053b40883j7350b1122F8201K39998
15769C08199a84511k54911G5772A2467d7274N40q7498D4083a5583A63826o8459
$$ plain form
15758 95367 429686 -8187 -50184 195539 132771 39037 -131678 -61932 63155 -72189 -70931
15747 -70931 211327 -89830 103166 256861 335178 344344 -89872 -322420 -139573 91964 -305702
15735 78335 1706 -231510 -188644 -179534 35017 -237786 95847 -287344 -185043 -146609 -99057
15724 -99057 94947 310202 -293795 -28841 64805 56589 175562 -106323 34925 121711 -92220
15712 -217945 20164 66122 162477 6496 7356 -97011 -84574 172298 -159382 -23541 12611 127023
15700 127023 165685 -111794 -44109 59034 -81929 -198770 149298 219141 -122606 98117 123102
15689 123102 -259521 -317636 21896 -19334 -147296 -313715 155837 34168 -156563 -65472
15678 206285 -814 101877 -119511 84203 17415 60704 61018 257690 -96837 91609 -238394
$$ packed form
15758I5367L34319h187m1997A95539o2768C9037a31678f1932F3155g2189J258
15747g0931B11327h9830A03166J53695P8317R166h9872k32548a39573I1964c05702
15735G8335A706b31510M2866R110C5017b37786I5847b87344J02301L8434M7552
15724i9057I4947K15255b93795b8841F4805q216J18973a06323C4925Q6786i2220
15712b17945B0164M5958R6355F496Q60i7011J2437A72298a59382b3541A2611J14412
15700A27023L8662a11794d4109E9034h1929j16841A49298O9843a22606I8117K4985
15689A23102b59521n8115B1896a9334j27962j66419A55837C4168a56563f5472
15678B06285h14A01877a19511H4203A7415M3289L14J96672i6837I1609b38394
$$ plain form
15666 75293 -161829 137911 -364747 87461 -144498 257052 8302 36022 186464 280916 -294722
15654 -69970 -269286 30785 -77133 99226 215854 21532 -473323 -238961 -153630 -17132 16036
15642 151973 -47045 -164897 -79793 -31430 74553 112163 -97459 817 43150 -16690 -34162 -135915
15630 -135915 -235071 -44431 258580 -212118 132743 109255 183000 19759 -239817 251197
15619 84517 -296039 119806 215047 -86794 -154159 3982 -586228 -126929 -208875 -63136 133428
15607 -43061 -141982 -329982 -107074 -286742 -209317 -21953 129326 122969 -235205 65558 52430
15596 52430 -280959 4968 -139452 134159 7943 -98398 44797 74123 -194782 -161330 204491
15584 242200 -294398 364870 -210807 271843 127547 -178198 -123468 252064 -97462 -129102
$$ packed form
15666G5293a61829A37911c64747H7461a44498B57052H302K7720J50442R4452b94722
15654f9970j99316C0785g7133I9226J16628B1532d73323K34362Q5331a7132A6036
15642A51973d7045j17852g9793c1430G4553L7610i7459H17M2333a6690j7472j01753
15630a35915r9156d4431B58580b12118A32743k3488P3745A9759b39817B51197
15619H4517b96039A19806R5241h6794o7365C982e86228a26929q1946f3136A33428
15607d3061r8921j88000a07074j79668P7425b1953A29326o357b35205F5558j3128
15596E2430b80959D968a39452A34159G943i8398D4797K9326a94782L3452B04491
15584B42200b94398C64870b10807B71843A27547a78198N4730B52064i7462l1640
$$ plain form
15574 -129102 -246229 -441576 -189452 33073 212876 -180206 -125645 -194326 126351 135620
15564 135620 99807 10752 -139003 220989 -14073 -196722 50400 -51611 -142036 -57727 153759
15552 -14079 -21727 -204360 -120141 -4712 289929 -55868 117277 72704 -50608 123914 -245136
15540 208948 -134334 -150217 6196 -271438 270544 -75213 -81935 146622 -278631 48217 333145
15529 333145 128099 194483 -144948 34646 59872 47727 -44905 -59666 -143793 41849 -215133
15517 102204 -132298 -1121 -36708 45783 -99120 -61179 -41841 72465 309194 109419 244096
15506 244096 83266 -53829 -17220 275720 1219 72143 -120262 101490 538 -186579 -233144
15495 -233144 24757 45617 -163249 -34414 -101079 -39544 -39643 -163305 288700 -58744 -133030
$$ packed form
15574a29102j17127j95347a89452C3073J79803a80206N4561o8681A26351R269
15564A35620l5813A0752a39003B20989a4073j82649E0400e1611r0425e7727A53759
15552a4079p648j82633Q4219d712B89929e5868A17277m4573e0608A23914b45136
15540B08948a34334j5883F196b71438B70544g5213o722A46622b78631D8217K84928
15529C33145A28099O6384a44948C4646K5226j2145d4905j4761q4127D1849b15133
15517A02204a32298a121l5587D5783i9120L7941J9338G2465K36729A09419J34677
15506B44096H3266e3829a7220B75720A219P0924a20262A01490E38a86579m6565
15495b33144B4757K0860a63249c4414o6665c9544r9j23662B88700e8744p4286
$$ plain form
15484 -133030 -106714 24517 2583 -62233 -183959 66958 -92438 -138563 229609 243392 23137
15472 -248800 6611 71406 -97122 20927 138343 -29072 -117914 -244068 -19123 10337 -81669
15460 -113123 55490 9077 -368539 43557 -161601 -98207 -350383 195733 18639 -99158 -149238
15449 -149238 -217402 -238141 -91394 322184 -56167 -17981 301507 64873 94059 95991 125980
15438 125980 38038 52671 -59013 -4130 -117198 -84533 119920 -183285 373279 153483 -182425
15426 -78552 158706 36357 8838 -396184 -302769 -4458 114437 15918 374091 -67621 113086
15414 233977 50369 86947 151225 283125 -400490 -79724 -88911 -147746 -50764 -295881 80026
15402 66035 -107054 2476 -129086 207870 262060 -139834 -118587 -116532 -212271 140245 312161
$$ packed form
15484a33030K6316B4517B583f2233j21726F6958i2438m6125B29609J3783B3137
15472b48800F611O4795i7122B0927J17416b9072q8842j26154a9123A0337h1669
15460a13123E5490I077c68539D3557a61601O3394k52176A95733A8639i9158n0080
15449a49238o8164k0739i1394C22184e6167a7981C01507F4873K9186J932K9989
15438A25980C8038J4633e9013d130j13068L2665A19920a83285C73279A53483a82425
15426g8552A58706C6357H838c96184R3415d458A14437A5918L58173f7621A13086
15414B33977E0369L6578O4278J31900d00490g9724r187n8835e0764k45117H0026
15402F6035a07054B476a29086B07870N4190a39834K1247K055r5739A40245J71916
$$ plain form
15391 312161 -139323 88778 -134282 10195 78969 -42607 -263396 122221 32347 136251
15381 136251 -571852 -69865 257045 -220991 135405 19548 120649 144203 -26847 40866
15370 -252858 44766 91249 80856 80174 64483 175187 -18742 -81327 -218787 -180727 101451
15358 20348 246131 -180579 200301 -118172 -128721 132898 -45312 -51941 298603 112163
15347 148975 78066 -91285 -108202 -84780 54250 235256 94049 33606 -166697 -61562 265123
15335 -313670 17416 -40758 94805 -39009 225329 45833 -96794 -74788 296771 -24836 -239079
15324 -239079 252343 354138 127456 -50430 -156779 235015 96319 227686 269123 -209641
15313 80823 162545 -4452 -59541 99219 108727 -16052 12858 -43476 1276 214713 68425 -290196
$$ packed form
15391C12161a39323H8778a34282A0195O8774d2607k20789A22221C2347J03904
15381A36251e71852f9865B57045b20991A35405A9548J01101K3554b6847D0866
15370b52858D4766M6483j0393o82j5691J10704a8742o2585j37460L8060A01451
15358B0348K25783a80579B00301a18172j0549A32898d5312o629B98603A12163
15347A48975p0909i1285j6917K3422E4250J81006I4049C3606a66697f1562B65123
15335c13670A7416d0758I4805c9009B25329D5833i6794K2006B96771b4836k14243
15324b39079B52343J01795A27456e0430j06349B35015I6319J31367M1437b09641
15313H0823Q1722d452n5089I9219R508a6052A2858d3476A276K13437F8425b90196
$$ plain form
15300 145252 -684 54916 -50415 -270221 82392 64892 110775 53220 289914 -148555 -241522
15289 -241522 192726 226305 -77361 335860 -30686 76509 -309077 -27849 -80784 -291077 -115830
15277 189251 -77143 -105696 143647 -311750 242397 -29834 318651 178676 395748 11158
15266 161398 -31029 382837 199298 -239517 -39312 -156014 64083 20135 -128468 7352 192385
15255 192385 -163804 -17301 -14722 -90620 42050 231870 290283 929495 1628925 815182 1321218
15244 1321218 921973 387435 88972 358514 44405 30361 -22440 -20204 -46665 226438 172299
15233 172299 -185956 -156581 -281628 32262 78248 165114 97026 -63201 -134003 40321 220546
15222 220546 383917 -134810 23723 -78466 121892 222546 -125211 -39305 250432 -214784
$$ packed form
15300A45252f84E4916e0415k19806H2392j7500M5883E3220K36694a48555r2967
15289b41522A92726L3579g7361C35860c0686G6509c09077b7849n2935k10293a15830
15277A89251g7143k8553A43647c11750B42397b9834C18651j39975K17072A1158
15266A61398c1029C82837j83539b39517c9312j16702F4083B0135a28468G352J85033
15255A92385a63804a7301K579p5898D2050J89820N8413O39212O99430q13743N06036
15244A321218l99245C87435H8972K69542D4405j4044b2440K236k6461B26438n4139
15233A72299a85956K9375j25047C2262M5986Q6866o8088f3201p0802D0321J80225
15222B20546J63371a34810B3723g8466A21892J00654a25211c9305B50432b14784
$$ plain form
15211 -125720 10490 40157 155425 83331 108758 27284 58089 281101 292365 -46879 29604
15199 158431 -189478 -89479 -102935 -31214 28095 325568 371037 189413 -140451 104596
15188 295202 304753 220337 -69037 35077 259036 -15418 298563 48232 -205928 173841 75330
15176 173657 -112053 -75469 381043 29147 -167643 40999 -1191 310170 109108 -317069
15165 148821 -190497 -195876 -214613 44005 -60244 -42036 147639 139831 84085 196569 -47373
15153 56965 235949 -225283 -3723 -156570 159502 225204 122908 -198338 373134 -55717
15142 86504 374774 71833 312783 101069 116655 -186782 -100899 -159278 366581 198208
15132 198208 144724 -34524 -77583 227414 130245 150375 154079 140630 390606 252261 125080
$$ packed form
15211a25720A0490K9667J15268p2094K5427B7284L0805K23012J1264d6879B9604
15199A58431a89478h9479j3456c1214B8095K97473M5469j81624a40451A04596
15188B95202R551q4416f9037C5077K23959a5418B98563D8232b05928A73841G5330
15176A73657a12053L6584C81043B9147a67643D0999a191C10170A09108c17069
15165A48821a90497n379j8737D4005f0244J8208A47639p808n5746J12484d7373
15153E6965J78984b25283c723j52847A59502O5702j02296a98338C73134e5717
15142H6504K88270G1833K40950A01069J5586a86782Q5883n8379C66581j68373
15132A98208n3484c4524m3059B27414r7169K0130L704j3449K49976j38345A25080
$$ plain form
15120 69597 170039 166690 97718 339652 184528 243794 178040 173974 -31471 287897 35313
15108 131221 140942 195855 15631 146273 314783 -29701 -213929 92933 47780 129205 98256
15097 98256 60046 78106 54383 2295 270824 300943 129551 -226195 308270 -69594 -230633
15086 -230633 154836 262784 99988 386713 122347 310110 392517 161724 236790 186970
15076 186970 29117 378507 176120 6952 -565 -38089 -99128 -133042 -63674 -69722 15096 449410
15064 449410 276982 225105 424285 668338 -24718 71717 654305 34944 9205 100551 414238
15053 414238 288179 51500 365834 111880 142968 19778 542380 -24229 77890 -881 366864
15041 286064 -204869 -139647 299693 -209476 260941 220196 286066 63267 293735 -11096
$$ packed form
15120F9597J00442l349o8972K41934j55124N9266o5754m066c1471B87897C5313
15108A31221R721N4913A5631J30642J68510b9701j84228I2933m5153Q1425l0949
15097I8256l8210J8060k3723B295K68529L0119A29551b26195C08270f9594j61039
15086b30633A54836J07948I9988K86725A22347J87763Q2407A61724P5066m9820
15076A86970B9117L49390A76120F952e65l7524o1039l3914f3674o048A5096M34314
15064D49410j72428n1877J99180K44053b4718G1717N82588C4944I205R1346L13687
15053D14238j26059E1500L14334A11880L1088A9778N22602b4229G7890h81C66864
15041B86064b04869O5222B99693b09476B60941m0745O5870F3267K30468a1096
$$ plain form
15030 465818 63822 -6264 171795 138703 -268331 545611 -1549 144321 -39943 99432 181829
15019 181829 43366 -262842 117519 57798 154234 63159 87207 237579 245836 21574 80098
15008 80098 55897 355131 464568 234974 34766 -12505 261875 423756 126217 188679
14998 188679 486697 419575 182462 391171 323358 369348 148259 163644 103938 377543
14988 377543 289291 231710 324705 252934 181407 -138349 -141230 47727 222152 151773 -51391
14976 179425 93628 119450 -23327 247162 238655 499215 508544 132088 335693 465900 447983
14965 447983 272341 314758 169258 328527 314993 324366 236704 143203 537867 203495 303012
14954 303012 346161 110039 422399 157642 397101 145062 293548 185547 219849 218279
$$ packed form
15030D65818F3822f264A71795l3092b68331E45611a549A44321c9943I9432Q2397
15019A81829D3366b62842A17519E7798R6436F3159K4048J50372Q257B1574N8524
15008H0098k4201K99234J09437k29594C4766a2505B61875J61881A26217O2462
14998A88679K98018o7122A82462K08709o7813M5990A48259J5385n9706K73605
14988C77543q8252n7581R2995p1771p1527a38349k881D7727J74425p0379e1391
14976A79425q5797K5822b3327B47162q507K60560R329A32088K03605J30207j7917
14965D47983j75642M2417j45500J59269j3534R373q7662r3501L94664B03495R9517
14954C03012M3149A10039L12360A57642K39459A45062J48486j08001L4302j570
$$ plain form
14944 218279 598183 174845 234105 140761 311543 205295 219318 342066 283213 453463
14934 453463 431779 39274 474796 256796 67954 334648 547109 263138 57533 273084
14924 273084 449123 310147 219729 408818 -151351 730807 219329 231337 378025 -12022
14913 419022 362708 101453 292796 131357 355006 252807 254726 268319 376126 326347
14903 326347 467533 603972 101193 542620 346140 386301 503372 364369 393714 304564
14893 304564 327046 104050 165084 203579 -9921 319416 256218 402467 599204 347937 287887
14882 287887 441702 313472 391013 626400 63521 473893 292253 424515 424421 122882 295024
14871 295024 467383 354682 447589 473899 740183 268747 445745 423829 188137 659365
$$ packed form
14944B18279L79904A74845N9260r3344J70782j06248J4023J22748n8853J70250
14934D53463k1684C9274M35522k18000F7954K66694K12461B63138E7533K15551
14924B73084J76039j38976r0418J89089a51351G30807B19329J2008J46688a2022
14913D19022n6314A01453J91343A31357K23649j02199J919J3593J07807m9779
14903C26347J41186J36439A01193M41427j96480M0161J17071j39003K9345q9150
14893C04564K2482A04050O1034L8495i921C19416o3198J46249J96737k51267o0050
14882B87887J53815j28230P7541K35387F3521M10372j81640J32262r4A22882J72142
14871B95024J72359j12701R2907K6310K66284B68747J76998k1916A88137M71228
$$ plain form
14861 659365 102264 481048 385057 496329 504043 344667 535013 302596 396278 276236
14851 276236 612486 62114 -117300 479093 293302 523792 305607 214752 493569 385167
14841 385167 366675 266797 387036 652343 567465 470851 604632 544703 532938 559940 347334
14830 347334 200735 525030 243060 593771 711644 472511 361029 409336 244597 593399
14820 593399 571700 515636 184407 785936 498277 479858 554242 632944 433398 489863 556511
14809 556511 550686 539119 275967 357605 487236 716706 433786 538087 702773 364193
14799 364193 449768 526485 483201 511444 678608 325340 306745 745893 431908 629693
14789 629693 572827 498742 878106 332143 310965 501394 626731 489986 344190 743204
$$ packed form
14861F59365A02264L78784r5991J11272P714j59376J90346k32417R3682j20042
14851B76236L36250F2114a17300D79093j85791K30490k18185r0855K78817j08402
14841C85167j8492r9878J20239K65307q4878r6614J33781n9929j1765K7002k12606
14830C47334j46599L24295B43060L50711J17873k39133j11482M8307j64739L48802
14820E93399k1699n6064A84407O01529k87659j8419P4384P8702j99546N6465O6648
14809E56511n825j1567k63152Q1638J29631K29470k82920J04301J64686l38580
14799C64193Q5575P6717m3284K8243J67164C25340j8595M39148l13985J97785
14789F29693n6866p4085L79364C32143k1178J90429J25337j36745j45796L99014
$$ plain form
14779 743204 465640 -10664 640797 547940 556834 678011 458584 443667 601713 424037
14769 424037 955289 682283 387748 499745 389059 590677 676518 469512 580858 407512
14759 407512 1058619 891114 975188 871407 559074 616750 753285 961406 626018 1039072
14749 1039072 688799 716288 756458 595254 587765 408245 757069 797014 782490 643108
14739 643108 620526 689295 434543 616005 782637 737400 982372 839593 685575 627622
14729 627622 806909 858533 969769 531901 688723 852221 810918 818478 497417 747170
14719 747170 809805 726901 1074855 792018 647284 963145 684087 736724 1195719 929698
14709 929698 1095625 862981 550855 1090000 801722 800805 1036437 948647 902025 787214
$$ packed form
14779G43204k77564a0664F40797r2857Q894J21177k19427j4917J58046j77676
14769D24037N31252k73006k94535J11997j10686K01618Q5841k07006J11346j73346
14759D07512O51107j67505Q4074j03781l12333N7676J36535K08121l35388M13054
14749A039072l50273K7489M0170j61204p489j79520L48824L9945j4524j39382
14739F43108k2582O8769k54752J81462J66632m5237K44972j42779j54018n7953
14729F27622J79287N1624J11236m37868J56822J63498m1303P560l21061K49753
14719G47170O2635q2904L47954k82837j44734L15861k79058N2637M58995k66021
14709I29698J65927k32644l12126N39145k88278r17K35632q7790m6622j14811
$$ plain form
14699 787214 781825 838871 1094405 793826 520664 881513 1087921 847118 1177676 1102989
14689 1102989 961083 964520 811744 722937 1206007 1028468 1001593 977434 966551 895459 970433
14678 970433 1035217 1025581 973959 737981 827585 1157109 1022386 924368 1060279 1204346 1380538
14667 1380538 887276 950209 1114049 1271361 931100 1395499 1115882 1338663 1087903 1290423
14657 1290423 992406 1376703 1258264 914063 814549 1434177 1051534 1439289 1347108 1246349
14647 1246349 1278526 1465551 943606 1147775 1258168 1230990 1167788 952811 1230982 1329902
14637 1329902 1332799 1242742 1318292 1514590 1308316 1712405 1643610 1275903 1058042 1466337
14627 1466337 1012026 1345375 1184070 1271359 1243796 1351870 1478402 1398483 1220865 1734070
$$ packed form
14699G87214n389N7046K55534l00579k73162L60849K06408k40803L30558p4687
14689A102989j41906L437j52776q8807M83070j77539k6875k4159j0883p1092P4974
14678I70433O4784r636n1622k35978Q9604L29524j34723r8018J35911J44067J76192
14667A380538m93262O2933J63840J57312l40261M64399k79617K22781k50760K02520
14657A290423k98017L84297j18439l44201r9514O19628l82643L87755r2181j00759
14647A246349L2177J87025n21945K04169J10393k7178o3202k14977K78171R8920
14637A329902K897r0057P5550J96298k06274M04089o8795l67707k17861M08295
14627A466337m54311L33349j61305Q7289k7563J08074J26532p9919j77618N13205
$$ plain form
14617 1734070 1440408 1816687 1345802 1543777 1478069 1673227 1393523 1437806 1332302 1938848
14607 1938848 1729858 1520518 1560305 1366857 1663651 1532796 1521842 1747628 1830236 1558694
14597 1558694 1573591 1760273 1863694 1717165 1978716 1865786 1629755 1764518 1287774 1965050
14587 1965050 2132192 1803297 1991708 1913378 1917068 2057869 1852390 1968098 2006665 2086422
14577 2086422 2179518 2128400 1866149 1892883 1951090 2281278 2284343 2427020 2222172 2444766
14567 2444766 2493235 2276986 2431039 2412943 2455338 2713446 2418513 2997780 2870866 2459620
14557 2459620 2879806 3410491 3544933 3346709 3943133 4170502 4952216 5967871 6975143
14548 6975143 10806793 19656705 37561128 47565893 24859341 10802127 5055901 2965880
$$ packed form
14617A734070k93662L76279m70885J97975o5708J95158k79704M4283j05504O06546
14607A938848k08990k09340L9787j93448K96794j30855j0954K25786Q2608k71542
14597A558694J4897J86682J03421j46529K61551j12930k36031J34763m76744O77276
14587A965050J67142l28895J88411p8330L690J40801k05479J15708L8567P9757
14577B086422R3096n1118k62251K6734N8207L30188L065J42677k04848K22594
14567B444766M8469k16249J54053j8096M2395K58108k94933N79267j26914m11246
14557B459620M20186N30685J34442j98224N96424K27369P81714J015655J007272
14548F975143L831650Q849912J7904423J0004765k2706552A0802127E055901k090021
$$ plain form
14540 2965880 2261963 2513688 1999533 2173413 2018151 2002076 2135637 2191405 2053497 2207324
14530 2207324 2313868 1903099 1964164 2046552 2529557 2771158 2376441 2331333 2661574 2415297
14520 2415297 2239238 2548642 2450157 2503667 2716531 2946647 2635321 3044357 2900784 2724230
14510 2724230 2885008 2964956 3229122 2836716 3035831 2939461 3198387 2968550 3123992 2812799
14500 2812799 3077511 3541833 3160899 3316247 3325782 3276563 3536864 3392164 3481333 3591159
14490 3591159 3492903 3944952 3885648 3587960 3865264 3648923 3635243 3799276 3816372 3710313
14480 3710313 3907341 4137522 4213999 4356175 3960229 4378218 4104459 4245595 4571705 4373396
14470 4373396 4391536 4425405 4371897 4504064 4832880 4576375 4630247 4771884 4566934 4868905
$$ packed form
14540B965880p03917K51725n14155J73880j55262j6075J33561N5768j37908J53827
14530B207324J06544m10769O1065Q2388M83005K41601l94717m5108L30241k46277
14520B415297j76059L09404r8485N3510K12864K30116l11326M09036j43573j76554
14510B724230J60778P9948K64166l92406J99115r6370K58926k29837J55442l11193
14500B812799K64712M64322l80934J55348R535m9219K60301j44700Q9169J09826
14490C591159r8256M52049n9304k97688K77304k16341j3680J64033J7096j06059
14480C710313J97028K30181P6477J42176l95946M17989k73759J41136L26110j98309
14470D373396J8140L3869n3508J32167L28816k56505N3872J41637k04950L01971
$$ plain form
14460 4868905 4858159 5043854 5173459 5155186 5226962 5033787 5149203 5205068 5445863 5703734
14450 5703734 5634271 5474753 5607833 5859824 5816369 6007013 6304956 6325034 6203647 6241477
14440 6241477 6198098 6180539 6276198 6610174 6482240 6617741 6855374 6907226 6652236 6976277
14430 6976277 7076526 7244887 7267459 7333615 7647029 7387069 7981867 7931733 7815889 8109314
14420 8109314 7975587 8270255 8679731 8388550 8630158 8887832 9104003 8923380 9050838
14411 9050838 9283607 9495268 9470509 9420663 9777739 9850435 10091932 10394547 10427382 10760652
14401 10760652 10739008 10774473 11443417 11280513 11510393 11846550 12118794 11876475 11970955 12419405
14391 12419405 12737754 13269983 12995984 13494896 13611225 14208015 14171972 14271156 14513667 14484579
$$ packed form
14460D868905j0746J85695J29605j8273P1776j93175J15416N5865K40795K57871
14450E703734o9463j59518J33080K51991m3455J90644K97943K0078j21387L7830
14440F241477m3379j7559R5659L33976j27934J35501K37633N1852k54990L24041
14430F976277J00249J68361K2572O6156L13414k59960N94798n0134j15844K93425
14420H109314j33727K94668M09476k91181K41608K57674K16171j80623J27458
14411I050838K32769K11661k4759m9846L57076P2696K41497L02615L2835L33270
14401A0760652k1644L5465O68944j62904K29880L36157K72244k42319R4480M48450
14391A2419405L18349N32229k73999M98912J16329N96790l6043R9184K42511k9088
$$ plain form
14381 14484579 15169539 15538910 15999314 15821065 16005444 16084450 16433625 17277829 17420308
14372 17420308 17731201 18044248 18549103 18638160 19339168 19335461 20105743 20430646 20566456 21399128
14362 21399128 21560859 22140408 22939985 23281358 23698250 24143548 24799332 25653165 25792884
14353 25792884 26691756 26988695 28017391 28588555 29336341 29998341 30727547 31421229 32362063
14344 32362063 33553895 33676740 35029958 35769890 37031060 38047386 39082060 40196160
14336 40196160 40821832 42530328 43634876 44871404 46529228 47700904 49482854 50623509
14328 50623509 52113813 54031027 55821637 57329903 59447909 61717689 63783862 65641949
14320 65641949 68397664 70757575 73244873 75930472 78886963 81879298 84923887 88655248
$$ packed form
14381A4484579O84960L69371M60404j78249J84379P9006L49175Q44204J42479
14372A7420308L10893L13047N04855Q9057P01008l707P70282L24903J35810Q32672
14362B1399128J61731N79549P99577L41373M16892M45298O55784Q53833J39719
14353B5792884Q98872K96939J028696N71164P47786O62000P29206O93682R40834
14344C2362063J191832J22845J353218P39932J261170J016326J034674J114100
14336D0196160O25672J708496J104548J236528J657824J171676J781950J140655
14328E0623509J490304J917214J790610J508266K118006K269780K066173J858087
14320F5641949K755715K359911K487298K685599K956491K992335L044589L731361
$$ plain form
14312 88655248 91923235 95530275 99493862 103686777 107916012 112768146 117902433 122970861
14304 122970861 128453847 134399026 140293183 147100641 153835022 161089552 169126860 177091184
14296 177091184 185674537 194891517 204477931 215095796 225747784 236826841 248560029
14289 248560029 260958483 273666021 287163903 300638143 315016770 329012880 343444006
14282 343444006 357840856 372097402 385749338 399206009 411588642 423170383 433524902
14275 433524902 442332228 449328998 453897747 455379437 454053236 450190134 448939296 445695820
14267 445695820 440817851 433946974 424385690 413233617 400744427 387525301 373299343
14260 373299343 358546598 343612639 328574336 313700471 299181754 285125392 272473940
$$ packed form
14312H8655248L267987L607040L963587M192915M229235M852134N134287N068428
14304A22970861N482986N945179N894157O807458O734381P254530Q037308P964324
14296A77091184Q583353R216980R586414J0617865J0651988J1079057J1733188
14289B48560029J2398454J2707538J3497882J3474240J4378627J3996110J4431126
14282C43444006J4396850J4256546J3651936J3456671J2382633J1581741J0354519
14275D33524902Q807326O996770M568749J481690j326201l863102j250838l243476
14267D45695820m877969o870877r561284j1152073j2489190j3219126j4225958
14260C73299343j4752745j4933959j5038303j4873865j4518717j4056362j2651452
$$ plain form
14253 272473940 259283061 246758585 234655374 223356075 212541612 202364997 192413459
14246 192413459 183347825 174858377 166916845 158862656 151506493 144676890 138153617 132396108
14238 132396108 126213194 121287307 116042784 111060325 106218820 101913782 98114925 94323862
14230 94323862 90442267 87349892 83891517 80855105 77788838 74667632 72079726 69673064
14222 69673064 66838146 64690600 62696296 60690556 58607219 56464741 54854020 52987446
14214 52987446 52010697 50625963 48804794 47160789 45833748 44416669 43068079 42400353
14206 42400353 41380583 39921569 38753955 37267532 36606407 35651118 35178540 34106375
14198 34106375 32720502 31840155 31424122 30584050 29949649 29114578 28815339 27957739 27158108
$$ packed form
14253B72473940j3190879j2524476j2103211j1299299j0814463j0176615r951538
14246A92413459r065634q489448p941532q054189p356163o829603o523273n757509
14238A32396108o182914m925887n244523m982459m841505m305038l798857l791063
14230I4323862l881595l092375l458375l036412l066267l121206k587906k406662
14222F9673064k834918k147546j994304k005740k083337k142478j610721j866574
14214E2987446r76749j384734j821169j644005j327041j417079j348590o67726
14206D2400353j019770j459014j167614j486423o61125r55289m72578j072165
14198C4106375j385873q80347m16033q40072o34401q35071k99239q57600p99631
$$ plain form
14189 27158108 26740817 25955527 25071572 24752698 23961610 23486763 22939246 22505947 22092783
14180 22092783 21557592 21261267 20674613 19814617 19690935 19619268 19180625 18720656 18213849
14171 18213849 17904500 17687954 17248473 17349582 16973931 16670647 16051299 15651740 15430629
14162 15430629 15172898 14946092 14703342 14506473 14275304 13983091 13909226 13622112 13241283
14153 13241283 12997074 12890345 12560469 12556269 12206831 11878848 11532752 11346692 11061476 11402517
14143 11402517 11106566 10883268 10640820 10480483 10432554 10524164 10068752 10023822 9502908 9787664
14133 9787664 9607547 9559303 9329223 9235613 9184309 8818957 9007006 8690034 8477561 8693904
14123 8693904 8451366 8200227 7917534 8037346 7886845 7887394 7797986 7770215 7301436 7193163
$$ packed form
14189B7158108m17291p85290q83955l18874p91088m74847n47517m33299m13164
14180B2092783n35191k96325n86654q59996j23682p1667m38643m59969n06807
14171A8213849l09349k16546m39481J01109l75651l03284o19348l99559k21111
14162A5430629k57731k26806k42750j96869k31169k92213p3865k87114l80829
14153A3241283k44209j06729l29876m200l49438l27983l46096j86060k85216L41041
14143A1402517k95951k23298k42448j60337m7929R1610m55412m4930n20914K84756
14133I787664j80117m8244k30080r3610n1304l65352J88049l16972k12473K16343
14123H693904k42538k51139k82693J19812j50501N49q9408k7771m68779j08273
$$ plain form
14113 7193163 7256701 7104882 7029815 7100698 6991154 6994733 6763519 7035271 6611709 6225609
14103 6225609 6165315 6196894 6534073 6184526 6332277 6236969 5894342 5831918 5946153 5682647
14093 5682647 5764111 5537085 5799484 5287023 5666387 5380357 5388797 5367458 5333270 5182105
14083 5182105 5198828 5256360 4919284 5283791 4902445 4691235 4782125 4566458 4717557 4565908
14073 4565908 4737177 4346753 4498857 4336512 4252083 4508462 4278751 4121279 4367060 4137192
14063 4137192 4237818 4241759 4149888 4141740 3978403 3947716 4324454 3704215 3840952 3818193 3991464
14052 3991464 3899554 3435247 3653165 3835163 3478057 3343059 3451381 3503274 3610050 3221152
14042 3221152 3106725 3311565 3411766 3105824 3420703 3094735 3378569 3266909 3293434 2852386
$$ packed form
14113G193163O3538j51819p5067P0883j09544L579k31214K71752m23562l86100
14103F225609o0294L1579L37179l49547J47751r5308l42627o2424J14235k63506
14093E682647Q1464k27026K62399n12461L79364k86030Q440k1339l4188j51165
14083E182105J6723N7532l37076L64507l81346k11210R0890k15667J51099j51649
14073D565908J71269l90424J52104j62345q4429K56379k29711j57472K45781k29868
14063D137192J00626L941r1871q148j63337l0687L76738o20239J36737k2759J73271
14052C991464r1910m64307K17918J81998l57106j34998J08322N1893J06776l88898
14042C221152j14427K04840J00201l05942L14879l25968K83834j11660K6525m41048
$$ plain form
14032 2852386 3133584 3033660 3181890 3114412 2992878 2865191 2937992 2875413 2533392 2897458
14022 2897458 3194484 2869789 2794191 2779765 2618634 2686395 2486073 2639923 2457681 2605742
14012 2605742 2277002 2444971 2216957 2521035 2653079 2482178 2356219 2211429 2446322
14003 2446322 2290484 2182963 2415489 2129881 2289414 2242033 2194160 2068379 1862819 2005312
13993 2005312 1998903 2309208 2492131 2686577 3273610 5698893 12346793 30203871 47525049
13984 47525049 28774269 14270119 8510202 5998353 4610340 4239237 3755530 3366242
13976 3366242 3159348 2883863 3031279 2794855 2925830 2839851 2738488 2738195 2408259 2789990
13966 2789990 2327697 2587309 2303691 2344756 2212968 2081824 2170069 2350276 1846908 2437365
$$ packed form
14032B852386K81198r9924J48230o7478j21534j27687P2801o2579l42021L64066
14022B897458K97026l24695p5598j4426j61131O7761k00322J53850j82242J48061
14012B605742l28740J67969k28014L04078J32044j70901j25959j44790K34893
14003B446322j55838j07521K32526k85608J59533m7381m7873j25781k05560J42493
13993B005312o409L10305J82923J94446N87033K425283O647900J7857078J7321178
13984D7525049j8750780A4270119n759917k511849j388013l71103m83707l89288
13976C366242k06894k75485J47416k36424J30975q5979j01363k93l29936L81731
13966B789990m62293K59612k83618M1065j31788j31144Q8245J80207n03368N90457
$$ plain form
13956 2437365 1852634 2069434 1919989 2057503 2306720 2150266 2384166 2092152 1890642
13947 1890642 1780034 1946064 2044956 1852943 1751549 2077403 2033489 2086854 1776017 1795363
13937 1795363 1813427 1690268 1707509 1691908 1305949 1969522 1556158 1829352 1514129 1677701
13927 1677701 1475705 1493161 1596860 1620641 1757633 1635573 1645222 1438749 1555080 1424556
13917 1424556 1531994 1447396 1360608 1384978 1928559 1727693 1629409 1224440 1425094 1438985
13907 1438985 1612750 1459224 1461864 1515398 1389948 1625226 1188566 1148009 1313859 1315684
13897 1315684 1157540 1421278 1200152 1340836 1473933 927516 1225459 900759 1278329
13888 1278329 1428097 1087529 1508043 1111735 1554498 1386694 1297823 1265580 1219918 1086202
$$ packed form
13956B437365n84731K16800j49445J37514K49217j56454K33900k92014k01510
13947A890642j10608J66030R8892j92013j01394L25854m3914N3365l10837J9346
13937A795363J8064j23159J7241j5601l85959O63573m13364K73194l15223J63572
13927A677701k01996J7456J03699K3781J36992j22060R649k06473J16331j30524
13917A424556J07438q4598q6788K4370N43581k00866r8284m04969K00654J3891
13907A438985J73765j53526K640N3534j25450K35278m36660m0557J65850J825
13897A315684j58144K63738k21126J40684J33097n46417K97943l24700L77570
13888A278329J49768l40568M20514l96308M42763j67804q8871l2243m5662j33716
$$ plain form
13878 1086202 1033298 1388969 1520671 1095240 1386929 1164794 1225847 1218601 1002532 1254140
13868 1254140 1028589 1217617 1124457 1005736 1255206 822571 1111655 1108862 1339218 925855
13858 925855 1398387 1209502 989021 1101909 1117730 905763 1289887 1200031 1091554 865412
13848 865412 839488 851829 1064772 811197 1058853 1087124 1184144 1168026 868569 1327487
13838 1327487 1071104 716690 1144652 1106140 927437 1161123 842985 988456 1000419 1034693
13828 1034693 1201221 1050252 842297 857912 936938 788160 1209108 878122 856441 800183
13818 800183 1216983 908855 1030196 1033456 866269 742152 896094 736739 681200 792407
13808 792407 904446 838113 596468 978580 876490 872921 677437 1003323 900451 1096093
$$ packed form
13878A086202n2904L55671J31702m25431K91689k22135O1053p246k16069K51608
13868A254140k25551J89028r3160j18721K49470m32635K89084k793K30356m13363
13858I25855M72532j88885k20481J12888J5821k11967L84124q9856j08477k26142
13848H65412k5924J2341K12943k53575K47656K8271R7020j6118k99457M58918
13838A327487k56383l54414M27962l8512j78703K33686l18138J45471J1963L4274
13828A034693J66528j50969k07955J5615P9026j48778M20948l30986k1681n6258
13818H00183M16800l08128J21341L260j67187j24117J53942j59355n5539J11207
13808G92407J12039o6333k41645L82112j02090l569j95484L25886j02872J95642
$$ plain form
13798 1096093 1205072 772609 533761 1094917 796292 976240 746352 1058239 930145
13789 930145 566635 936846 673407 829339 788324 962387 790219 538780 809357 534994
13779 534994 635751 851920 734182 980450 784358 796383 771404 464527 869756 699717
13769 699717 711158 841785 672168 596270 685011 756057 771766 602747 494585 510297 709184
13758 709184 937783 505609 953114 891061 815248 464397 522316 708734 642812 430864
13748 430864 730598 553573 833359 499076 826107 578721 411823 628098 315426 586624
13738 586624 753605 610034 440803 880553 779557 635527 700294 732823 677490 464917
13728 464917 638095 471029 644847 764577 674724 411688 734143 418413 553387 581856
$$ packed form
13798A096093J08979m32463k38848N61156k98625J79948k29888L11887j28094
13789I30145l63510L70211k63439J55932m1015J74063j72168k51439K70577k74363
13779E34994J00757K16169j17738K46268j96092J2025k4979l06877M05229j70039
13769F99717J1441J30627j69617p5898Q8741P1046J5709j69019j08162J5712J98887
13758G09184K28599m32174M47505o2053p5813l50851N7919J86418o5922k11948
13748D30864K99734j77025K79786l34283L27031k47386j66898K16275l12672K71198
13738E86624J66981j43571j69231M39750j00996j44030O4767L2529n5333k12573
13728D64917J73178j67066J73818J19730q9853k63036L22455l15730J34974K8469
$$ plain form
13718 581856 646623 472510 571207 338910 405094 363069 368947 611798 735239 845987 550464
13707 550464 632579 365814 497010 622628 648520 675832 609734 460851 586000 741097
13697 741097 464294 570201 420737 714247 322517 457192 443956 367218 438205 362230
13687 362230 483453 391792 574633 577283 67748 772581 357942 51547 544385 401793
13677 401793 747122 486325 272885 444951 270760 411340 719705 268535 739654 536013
13667 536013 517062 203424 582446 428394 493473 469168 202576 521312 330708 576913
13657 576913 762450 411450 450798 232569 483944 516586 382841 595813 413368 565266
13647 565266 453953 465195 296997 402693 266565 213079 657720 503006 399845 618202
$$ packed form
13718E81856O4767j74113R8697k32297O6184m2025N878K42851J23441J10748k95523
13707E50464Q2115k66765J31196J25618K5892K7312o6098j48883J25149J55097
13697G41097k76803J05907j49464K93510C22517J34675j3236p6738P0987p5975
13687C62230J21223r1661J82841K650F7748P04833C57942E1547M92838j42592
13677D01793L45329k60797k13440J72066j74191J40580L08365B68535M71119k03641
13667E36013j8951B03424L79022j54052O5079k4305B02576L18736j90604K46205
13657E76913J85537l51000L9348k18229K51375L2642j33745K12972j82445J51898
13647E65266j11313J1242j68198J05696j36128n3486M44641j54714j03161K18357
$$ plain form
13637 618202 162396 495250 227664 409007 566453 443847 727097 410693 407060 499115
13627 499115 406537 427932 428218 460720 375862 125201 488019 473645 429021 639258 250076
13615 316120 413907 212529 277053 404997 623257 253991 189436 492812 389652 370097
13605 370097 151473 152624 82255 405280 665834 199784 461242 174083 471248 388346
13595 388346 304627 264261 489330 345582 525264 286630 434555 377672 472979 795568
13585 795568 511894 -7745 498863 142238 624706 399691 382785 543767 522720 283621
13575 283621 213123 366677 380748 588045 499306 309469 616934 91054 261247 362281
13565 362281 311442 222893 415776 407174 108428 504890 358606 262300 395220 550710
$$ packed form
13637F18202A62396L32854B27664J81343J57446j22606K83250l16404l633R2055
13627D99115r2578K1395K86L2502q4858A25201L62818j4374m4624K10237B50076
13615C16120R7787k01378O4524J27944K18260B53991o4555L03376j03160j9555
13605C70097A51473J151p0369L23025K60554A99784K61458A74083K97165q2902
13595C88346q3719m0366K25069j43748J79682k38634J47925n6883R5307L22589
13585G95568k83674g745D98863A42238M82468k25015j6906J60982k1047k39099
13575B83621p0498J53554J4071K07297q8739j89837L07465I1054J70193J01034
13565C62281n0839q8549J92883q602A08428L96462j46284r6306J32920J55490
$$ plain form
13555 550710 195762 818329 347591 517597 372668 313460 341284 498832 244506 419280
13545 419280 38608 437926 415998 122504 382840 450444 340659 176591 391991 441769
13535 441769 -99197 433084 537450 214167 469936 2963 37973 403722 -142282 263805
13524 416393 393042 429831 74705 461010 163197 387148 416924 406388 267804 134493
13514 134493 224206 -19292 467104 329276 192390 69068 401688 94031 299763 577739
13504 577739 608215 438535 178841 552275 53821 173444 242500 199489 246892 372022
13494 372022 325475 255362 277912 254795 -76081 17613 206096 358226 300910 41034 77 138364
13482 138364 459294 382213 322186 322482 232598 368508 486762 25920 245721 334291 191512
$$ packed form
13555E50710A95762O22567C47591J70006j44929n9208K7824J57548B44506J74774
13545D19280C8608L99318k1928A22504K60336O7604j09785j64068K15400M9778
13535D41769i9197D33084J04366B14167K55769B963L5010L65749a42282B63805
13524D16393k3351L6789G4705L86305A63197K23951K9776j0536j38584j33311
13514A34493Q9713a9292D67104j37828j36886F9068L32620I4031K05732K77976
13504E77739L0476j69680A78841L73434E3821J19623O9056m3011M7403J25130
13494C72022m6547p0113K2550k3117g6081A7613J88483J52130n7316D1034G7J38287
13482A38364L20930p7081o0027K96q9884J35910J18254B5920K19801Q8570j42779
$$ plain form
13471 191512 146085 193812 313938 183391 72017 10042 275742 121218 565138 401453
13461 401453 293884 13107 219853 111052 118566 259947 196685 357796 448838 408539 412416
13450 412416 260195 157624 85227 265208 331617 -19511 210934 113755 147430 -267378
13439 416372 335265 48242 238269 441470 155670 -117974 54883 240658 794896 29005
13428 180296 426444 288721 102176 418103 268097 410480 -120406 345389 188625 33116
13417 235795 17163 440063 84129 73528 366528 118719 341171 -140135 547338 125949
13406 256984 201205 223267 373980 209686 -3634 70601 342318 109396 270499 129382
13395 225202 112570 103134 178959 47731 -197797 305802 83594 55095 736405 374931 323104
$$ packed form
13471A91512m5427M7727J20126j30547G2017A0042K65700A21218M43920j63685
13461D01453j07569A3107K06746j08801P514J41381o3262J61111R1042m0299L877
13450D12416j52221j02571p2397J79981O6409a9511B10934r7179L3675b67378
13439D16372q1107D8242J90027K03201A55670a17974E4883J85775N54238B9005
13428A80296K46148j37723A02176L15927j50006J42383a20406C45389j56764C3116
13417B35795A7163M22900H4129j0601K93000A18719K22452a40135E47338A25949
13406B56984n5779K2062J50713j64294c634G0601K71717A09396J61103A29382
13395B25202A12570r436P5825D7731a97797C05802H3594k8499O81310l61474n1827
$$ plain form
13384 323104 205903 343963 -86872 43153 460515 26756 51948 323034 173316 358126
13374 358126 453997 381047 307225 612204 110367 159640 105298 365967 57604 195921 420680
13363 420680 6626 192603 223912 133677 177232 53859 125843 48520 63203 211134 274818
13352 274818 230571 442717 70529 577131 194760 284028 461237 327804 469092 336291
13342 336291 132027 -14900 357247 372332 222675 306663 289777 281713 177190 214484 489984
13331 489984 373901 -84494 157653 365563 167618 -79885 230441 209133 247388 326588
13321 326588 356693 211524 545631 -34952 159865 312225 524 299774 218990 140915 82025
13310 82025 243187 204177 81208 145304 196024 48949 388813 340490 68716 248033 -84188
$$ packed form
13384C23104j17201J38060h6872D3153M17362B6756K5192K71086j49718J84810
13374C58126R5871p2950p3822L04979A10367M9273n4342K60669E7604J38317K24759
13363D20680F626J85977L1309r0235M3555E3859P1984D8520J4683J47931O3684
13352B74818m4247K12146G0529N06602A94760Q9268J77209j33433J41288j32801
13342C36291A32027a4900C57247J5085j49657Q3988j6886q064j04523L7294K75500
13331D89984j16083h4494A57653K07910A67618g9885B30441k1308L8255P9200
13321C26588L0105j45169L34107c4952A59865J52360E24K99250q0784p8075n8890
13310H2025J61162l9010H1208O4096N0720D8949L39864m8323F8716J79317h4188
$$ plain form
13298 111150 117755 43783 18916 6855 118108 131256 272301 411910 -158409 16652 219009
13287 219009 306884 -9287 197071 81504 239369 349838 599807 310852 30664 -191681
13276 220539 5785 239809 130142 244903 -116124 -60888 106652 54001 490155 490362 329425
13265 329425 278220 153106 -128214 103959 200255 127674 239489 113304 882 25041 322923
13254 322923 -274544 149639 217619 320695 137123 200152 -25250 405191 -57244 218304
13243 -178247 -85407 182360 201379 263902 58211 107606 217136 297547 212890 51892 136405
13232 136405 32221 256472 152865 455821 201166 170372 232849 -83739 483911 310527
13222 310527 -23334 232314 167161 143488 -111563 -81129 -139735 164892 186439 225495 268627
$$ packed form
13298A11150O605D3783A8916F855J11253J3148J41045J39609a58409A6652K02357
13287B19009Q7875i287A97071H1504J57865J10469K49969k88955C0664a91681
13276B20539E785K34024j09667J14761a16124N5236A06652n2651M36154K07j60937
13265C29425n1205j25114a28214A03959R6296p2581J11815A13304H82K4159K97882
13254C22923b74544A49639O7980J03076A37123O3029b5250D05191e7244B18304
13243a78247h5407A82360J9019O2523E8211M9395J09530Q0411q4657E1892Q4513
13232A36405C2221K24251j03607L02956B01166l0794O2477h3739D83911j73384
13222C10527b3334B32314o5153k3673a11563L0434n8606A64892K1547L9056M3132
$$ plain form
13211 268627 219134 130343 -213918 -93053 103373 -39856 183960 158014 42587 207197 124403
13200 124403 211553 341460 162802 -359810 382301 -45089 117952 -40213 294783 6152
13189 -16375 157516 -20640 102540 282102 -1112 99042 -102269 301046 297786 -107166 102760
13177 170292 66139 49227 -22785 28803 38436 -142323 126428 289525 286583 418037 139296
13165 116170 -45510 246072 52494 -261850 101068 -52464 150751 313293 82430 134650
13155 134650 223378 136964 71847 -269816 139078 -46844 151936 4567 -155903 -108510 131292
13143 113374 -123520 -21426 -39610 162668 217801 -50808 -18909 -15531 47723 236151 45416
13131 -208071 107742 43427 250205 -344466 -163148 82961 198449 118873 -250410 -34190
$$ packed form
13211B68627m9493q8791b13918i3053A03373c9856A83960k5946D2587J64610q2794
13200A24403Q7150J29907A62802c59810C82301d5089A17952d0213B94783F152
13189a6375A57516b0640A02540J79562a112I9042a02269C01046l260a07166A02760
13177A70292F6139j6912b2785B8803R633a42323A26428J63097k942J31454A39296
13165A16170d5510B46072E2494b61850A01068e2464A50751J62542H2430N2220
13155A34650Q8728q6414o5117b69816A39078d6844A51936D567a55903M7393A31292
13143A13374a23520b1426j8184A62668N5133e0808a8909L378D7723J88428D5416
13131b08071A07742D3427K06778c44466a63148H2961J15488p9576b50410c4190
$$ plain form
13120 128237 -296430 -117007 9084 -58517 116394 403972 -39138 189548 211729 -25644 -10623
13108 243709 115630 335349 400584 63391 -300839 55575 -90209 94413 547032 332597
13098 332597 247472 -235989 104749 228584 121252 67319 -151861 -203455 16014 -190249
13087 -227750 70494 -82957 85626 23 247736 385394 -19358 355650 -102258 158878 196538
13076 196538 -64034 -42182 -220186 251544 -114844 195334 -116617 -37876 138062 35081
13065 348894 -53031 -89003 433610 -126217 108729 -312210 361489 75962 163998 46032
13054 74778 328370 3390 -244323 -21975 225336 343779 -215277 512683 469899 334147
13044 334147 -291602 285443 -226149 -182135 -107516 298371 -128738 281547 88151 248023
$$ packed form
13120A28237b96430a17007I084e8517A16394K87578c9138A89548K2181b5644a0623
13108B43709A15630K19719O5235F3391c00839E5575i0209I4413M52619k14435
13098C32597q5125b35989A04749J23835j07332n3933a51861n1594A6014a90249
13087b27750G0494h2957H5626B3K47713J37658a9358C55650a02258A58878L7660
13076A96538f4034K1852j78004B51544a14844A95334a16617c7876A38062C5081
13065C48894e3031l5972D33610a26217A08729c12210C61489G5962Q8036D6032
13054G4778K53592C390b44323b1975B25336J18443b15277E12683m2784j35752
13044C34147b91602B85443b26149M4014P4619B98371a28738B81547H8151J59872
$$ plain form
13034 248023 34131 34648 120678 215543 40537 -44008 163759 268582 -102870 127349 129503
13023 129503 52724 -62578 -50811 173433 107492 313361 155670 82813 279919 325072 283125
13012 283125 213119 123696 178833 451312 99000 102402 -20013 99098 527205 6576 -116445
13000 273389 57427 127061 84794 275961 -17116 -49220 -141060 318340 -95915 127362 171632
12989 171632 -21685 164493 -103130 222453 74234 207945 -131857 -91826 152815 462132
12979 462132 -16649 302019 -95005 357935 78257 -23518 17390 -481448 345282 114368
12968 34881 -6531 360853 323365 150385 -194814 161473 77475 -37921 8460 174678 -31999
12956 -77349 243248 -29362 248364 -103131 45296 60555 144648 232068 -80022 -77035 105759
$$ packed form
13034B48023C4131N17Q6030R4865D0537d4008A63759J04823a02870A27349K154
13023A29503E2724f2578J1767A73433o5941K05869A55670p2857J97106M5153m1947
13012B83125p0006q9423N5137K72479I9000L402b0013I9098M28107F576a16445
13000B73389E7427O9634m2267J91167a7116l2104r1840C18340i5915A27362M4270
12989A71632b1685A64493a03130B22453G4234J33711a31857M0031A52815L09317
12979D62132a6649C02019i5005C57935G8257b3518A7390d81448C45282A14368
12968C4881f531C60853l7488A50385a94814A61473G7475c7921H460J66218c1999
12956g7349B43248b9362B48364a03131D5296J5259Q4093Q7420h0022K987A05759
$$ plain form
12944 145916 -32306 76635 -129520 136975 43152 -24746 252834 106450 -206736 51474
12933 181884 168161 -93734 -249182 -280717 425976 201699 34745 331709 -90019 -227146
12923 -227146 300451 9499 57264 5214 41139 -153569 48209 308458 184368 -68471 85760
12911 192482 66498 -168485 -147483 -207013 -21908 13277 215314 -44383 -140711 202195 127028
12900 127028 -19497 -127956 170658 9960 170774 -87947 -219399 29573 -363585 52171 215109
12889 215109 74273 -52135 22617 -134088 182202 18604 -230703 -104583 -50557 29005 276720
12878 276720 -127073 92092 10002 -30644 351088 27285 85151 -94791 160003 177408 83353
12866 82810 -49599 171454 50245 -160724 279195 -162990 -56586 -179104 235963 480713
$$ packed form
12944A45916c2306G6635a29520A36975D3152b4746B52834A06450b06736E1474
12933A81884j3723i3734j55448l1535D25976B01699C4745K96964i0019j37127
12923b27146C00451I499M7765E214L5925a53569D8209K60249j24090f8471H5760
12911A92482F6498a68485K1002n9530b1908A3277K02037d4383r6328B02195p5167
12900A27028a9497j08459A70658I960J60814h7947j31452B9573c63585E2171J62938
12889B15109G4273e2135B2617a34088A82202A8604b30703a04583e0557B9005K47715
12878B76720a27073I2092A0002c0644C51088B7285N7866i4791A60003J7405H3353
12866H2810d9599A71454E0245a60724B79195a62990e6586j22518B35963K44750
$$ plain form
12856 480713 27570 -60374 -161833 77782 53346 -118191 64424 -191722 34940 76148 -43395
12844 -63203 -59260 -26246 495823 200550 99644 -66900 168677 319482 -107883 149506 -152260
12832 26902 -97313 -83076 173042 -54319 82405 -66581 281550 -230213 -116482 261561 189556
12821 189556 41996 185257 -8371 68782 212563 106680 -78878 61383 417094 88789 423209
12810 423209 211358 54396 -152062 139827 -88903 -192747 -167495 106495 135324 -72891
12799 6508 104962 -594806 54481 -129421 105550 148198 48860 -42941 114429 -136548 -248297
12788 -248297 293647 219646 -200857 7759 223579 91310 -344704 -83946 26921 -50013 67552
12776 139875 -152885 -227238 -224822 25964 -42771 -122146 -298835 69322 -129664 169534 -94435
$$ packed form
12856D80713B7570f0374j01459G7782k4436a18191F4424a91722C4940M1208d3395
12844f3203L943b6246D95823B00550I9644f6900A68677J50805a07883A49506a52260
12832B6902i7313J4237A73042e4319H2405f6581B81550b30213J13731B61561p2005
12821A89556D1996J43261h371F8782J43781j05883g8878F1383L55711H8789L34420
12810D23209B11358E4396a52062A39827h8903j03844K5252A06495K8829g2891
12799F508R8454e94806E4481a29421A05550M2648D8860d2941A14429a36548j11749
12788b48297B93647p4001b00857G759K15820I1310c44704h3946B6921e0013F7552
12776A39875a52885p4353K416B5964d2771p9375j76689F9322a29664A69534i4435
$$ plain form
12764 -19302 -28931 32685 129703 -89789 68083 193403 -160175 -35338 -181924 -35238 -81835
12753 -81835 176302 256829 -126208 59208 2175 116392 138628 -153236 -170258 53461 -40590
12741 -357850 -255641 182457 -222325 102849 240464 602405 -82037 462055 185990 185743
12731 185743 76685 65977 -95119 -24263 -548639 -56234 -108621 38297 173605 -464362 187157
12719 181454 46425 29833 -88709 33247 194048 36560 154892 140656 168431 44624 251019
12708 251019 217108 197432 468298 6162 215094 206355 208219 -54916 -1984 297878 274461 139687
12696 139687 -22618 -4590 -69303 95289 208931 -88218 -74032 -59061 450028 303172 216655
12685 216655 -156127 278084 -14068 65388 230323 11323 -202546 180850 264327 59772
$$ packed form
12764a9302r629C2685R7018h9789F8083J25320a60175c5338j46586c5238m6597
12753h1835A76302Q0527a26208E9208B175J14217K2236a53236j7022E3461d0590
12741c57850J02209A82457b22325A02849J37615L61941h2037D62055A85990k47
12731A85743G6685j0708i5119b4263n24376e6234n2387C8297J35308d64362A87157
12719A81454D6425j6592h8709C3247J60801C6560J18332j4236K7775D4624K06395
12708B51019l3911j9676K70866F162K08932q739J864e4916a984B97878k3417j34774
12696A39687b2618d590o4713I5289J13642h8218J4186J4971D50028j46856q6517
12685B16655a56127B78084a4068F5388J64935A1323b02546A80850Q3477E9772
$$ plain form
12674 91046 352906 259895 55111 293967 17564 110918 -18499 328886 -44568 2800 35745
12663 35745 82366 197347 121464 524065 4117 127660 132033 270899 -10812 397637 -40108
12651 312677 92271 473581 76396 165450 355786 86529 -99494 -202593 -285002 -174696 91137
12639 -194210 -2026 83456 -35386 141327 -83008 183007 -190540 124972 295855 232501 164444
12628 164444 208372 228363 -89261 279030 142288 79847 20005 245209 478818 -7919 55003
12616 313439 9534 136763 119532 -265640 -173810 207977 -52619 -122317 119325 -22771 -73308
12605 -73308 90902 216826 437351 251268 93823 -218956 102342 -149119 128321 283726
12595 283726 14677 193980 99783 330531 72676 -425487 -69392 -157722 -362911 -588986
$$ packed form
12674I1046K61860r3011E5111K38856A7564R3354a8499C28886d4568B800L2945
12663C5745M6621J14981p5883M02601D117J23543M373J38866a0812C97637d0108
12651C12677I2271L81310G6396Q9054J90336H6529i9494j03099q2409J10306I1137
12639a94210b026H3456c5386A41327h3008A83007a90540A24972J70883o3354o8057
12628A64444M3928J9991h9261B79030j36742o2441B0005K25204K33609g919E5003
12616C13439I534J27229j7231b65640R1830B07977e2619o9698A19325b2771n0537
12605g3308I0902J25924K20525j86083I3823b18956A02342a49119A28321J55405
12595B83726A4677J79303r4197K30748G2676d25487f9392q8330k05189k26075
$$ plain form
12585 -588986 -54186 234896 113594 -110477 75733 -1208 162965 245896 -9718 43752 861
12573 77450 285621 -248572 289235 -316889 195809 -37037 -235060 45932 16881 -30304
12562 155704 59220 143246 383487 -72561 -108394 126203 -293398 241896 143152 169667 42104
12550 -191453 278177 66450 14323 -64440 -92194 -123831 -163824 -73772 -27351 -66226 26745
12538 261637 -267325 -120538 46848 -15209 160374 -141909 67733 -365393 -34701 -331270
12528 -331270 136789 173768 168322 -187561 3321 245060 113820 -36193 461303 299649 285262
12517 285262 185129 291880 -23245 -307123 267082 56275 66797 70603 397845 64117 13397
12505 -32132 109571 -71034 82471 -117900 -7735 -112625 18741 72761 -156052 319060 -339234
$$ packed form
12585e88986e4186B34896A13594a10477G5733a208A62965Q2931i718D3752H61
12573G7450K08171b48572B89235c16889A95809c7037j98023D5932A6881c0304
12562A55704E9220Q4026K40241g2561l5833A26203b93398B41896r8744K6515D2104
12550a91453B78177F6450A4323f4440k7754l1637l9993g3772b7351l8875B6745
12538B61637b67325a20538D6848a5209A60374a41909F7733c65393c4701k96569
12528c31270A36789L6979n446a87561C321K41739A13820c6193D61303j61654j4387
12517B85262j00133J06751b3245k83878B67082E6275J0522L806L27242F4117A3397
12505c2132A09571g1034H2471a17900g735j04890A8741N4020a56052C19060c39234
$$ plain form
12493 196112 120406 126236 -160100 -8934 227283 114027 180555 -181321 -259205 39497 148170
12482 148170 94857 187478 -150950 78683 171874 59640 168703 -105905 129035 33383 -81648
12470 -197676 -30935 -157615 197503 169274 -155204 132046 179518 88155 -30037 240049
12459 -35445 293633 225160 -10472 34006 99043 60889 154253 147983 35329 234690 280631
12448 280631 245877 14181 23905 -73373 -32541 -307654 -175415 -174982 -56401 -224507 228782
12436 -35733 159271 418162 -224671 -37732 -65320 -16881 -30395 -261038 -138439 -207297 268500
12424 -12304 55575 -283156 -236606 204116 189045 156594 183336 208451 22371 155330 243734
12413 243734 176839 122120 147365 -97653 39220 75278 54719 239213 69602 77648 -195184
$$ packed form
12493A96112p5706N830a60100h934B27283j13256O6528a81321p7884C9497J08673
12482A48170n3313R2621a50950G8683R3191E9640J09063a05905A29035C3383h1648
12470a97676c0935j26680A97503k8229a55204A32046M7472H8155c0037B40049
12459c5445B93633o8473a0472C4006O5037l8154R3364o270C5329J99361M5941
12448B80631l4754A4181R724g3373c2541k75113J32239M33e6401j68106B28782
12436c5733A59271K58891b24671c7732k7588a6881j3514k30643J22599o8858B68500
12424a2304E5575b83156M6550B04116j5071l2451K6742K5115B2371J32959Q8404
12413B43734o6895n4719K5245i7653C9220L6058k0559J84494F9602Q046a95184
$$ plain form
12401 12146 -212622 55512 22489 197408 -40377 909 -181383 122233 34901 -121907 -169738
12390 -169738 131516 87613 -177507 8556 85674 144805 -413977 -185049 13009 278353 229995
12379 229995 45907 274255 -33742 176095 295272 91169 -12721 68542 -250527 114556
12368 -180099 116758 -121043 88867 284870 -124523 -161657 58204 54064 -89067 -59370 -133023
12357 -133023 -69257 117859 -45400 111085 122651 144064 -18260 -121888 350818 70656 72346
12346 72346 -7026 237888 118523 254048 71067 -17703 -299983 305087 338424 -210911 79384
12334 -141966 -34597 -191943 57186 -91625 -139268 155373 -28218 -137635 -113182 -203490 37284
12322 -134733 -171239 -134338 264955 314537 218765 223163 -244757 51607 -98092 -145997 170787
$$ packed form
12401A2146b12622E5512B2489J74919d0377I09a81383A22233C4901a21907m7831
12390a69738A31516m3903a77507H556P7118N9131d13977a85049A3009K65344m8358
12379B29995D5907K28348c3742A76095J19177I1169a2721F8542b50527A14556
12368a80099A16758a21043H8867J96003a24523l7134E8204m140h9067K9697p3653
12357a33023O3766A17859d5400A11085J1566K1413a8260j03628C50818G0656J690
12346G2346g026B37888A18523J35525G1067a7703k82280C05087L3337b10911G9384
12334a41966c4597j57346E7186i1625m7643A55373b8218j09417K4453r0308C7284
12322a34733l6506L6901B64955M9582r5772M398b44757E1607i8092m7905A70787
$$ plain form
12310 103986 285685 97928 -31335 239218 -148154 47706 194837 196176 -85623 -169518 -388740
12299 -388740 120066 16804 145241 -236116 144033 -95754 -237983 333273 -234994 35463
12288 59838 -127268 -15028 305910 336352 91372 -12591 87047 -97568 111972 81755 247488
12277 247488 -202931 74819 97051 141530 444599 277145 272844 108387 46140 -32455 73161
12265 10603 130437 -1358 -103379 -7335 221200 214165 43350 -341313 49598 174832 251754
12254 251754 370 -26163 356667 276997 241740 516166 217959 555862 -31911 85418 92126
12243 92126 336788 7774 46497 20355 140851 -245628 -313038 244915 78984 146806 262806
12232 262806 262187 70053 70167 450015 200271 72694 192182 -102560 97727 8998 33764 123754
$$ packed form
12310A03986J81699I7928c1335B39218a48154D7706J47131J339h5623q3895k19222
12299c88740A20066A6804J28437b36116A44033i5754j42229C33273b34994C5463
12288E9838a27268a5028C05910L0442I1372a2591H7047i7568A11972l0217J65733
12277B47488b02931G4819K2232M4479L03069j67454m301A08387D6140c2455G3161
12265A0603J19834a358j02021g335B21200p035D3350c41313D9598J25234P6922
12254B51754C70b6163C56667p9670l5257K74426B17959L37903c1911H5418O708
12243I2126K44662G774L8723B0355J20496b45628o7410B44915G8984O7822J16000
12232B62806o19G0053J14L79848B00271G2694J19488a02560I7727H998K4766Q9990
$$ plain form
12220 123754 377567 165968 -187749 49600 313833 179022 303335 8926 176596 60239
12209 130597 39226 -211476 46451 334123 197922 313771 277336 305145 425723 304645
12199 304645 346940 -83364 180540 -52313 431005 379467 -122974 -109991 151712 248297 -172245
12187 -157626 176116 332600 79836 75491 326491 86498 360636 84695 49318 127328 340240
12176 340240 167833 -150516 -97895 77564 88824 309662 164297 134129 129242 -116091 208726
12164 317300 138943 19586 159900 99547 50557 -36439 -327480 185342 -11340 -141823
12154 -141823 105479 -85129 21724 97006 6915 -87935 94132 -228739 223412 -2786 7414
12142 -353504 83021 146580 -152770 220982 -198035 -126502 173593 145019 17528 -81131 269248
$$ packed form
12220A23754K53813A65968a87749D9600K64233j34811J24313H926J67670F0239
12209A30597C9226b11476D6451K87672j36201J15849l6435K7809J20578j21078
12199C04645M2295h3364A80540e2313D31005n1538a22974J2983A51712R6585a72245
12187a57626A76116J56484G9836m345K51000H6498K74138H4695l5377P8010K12912
12176C40240A67833a50516N2621G7564J1260K20838j45365l0168m887a16091B08726
12164C17300A38943A9586J40314o0353m8990c6439k91041A85342a1340j30483
12154a41823A05479h5129B1724P5282F915h7935I4132b28739B23412b786G414
12142c53504H3021O3559a52770B20982a98035P1533A73593k8574A7528h1131B69248
$$ plain form
12130 -121781 96284 190758 -110585 -39633 212804 42182 106515 355209 134739 -34307 -133232
12119 -133232 -229214 55055 -302442 -15289 -180680 201573 -156859 116874 -200435 -153204
12109 -153204 58029 137423 51926 244237 -110611 -95928 -88491 46562 135260 180928 235822
12098 235822 33953 28496 -307550 291142 -219060 -17038 -212374 -275087 -117090 93924 -30593
12086 -157237 -232976 -73804 35665 237310 147002 -139089 96934 270503 -261406 62525 88929
12075 88929 -38708 70428 269506 117558 55451 332850 13414 -136213 103517 361205
12065 361205 -21234 -93140 637561 1102521 2061330 767494 437474 382850 -139348 -148294
12055 -148294 36210 -337227 -149003 465244 30535 192392 -54297 30862 -179676 -15046
$$ packed form
12130a21781I6284R4474a10585c9633B12804D2182O4333K48694A34739c4307r8925
12119a33232r5982E5055c02442a5289j65391B01573a56859A16874b00435M7231
12109a53204E8029P9394E1926J92311a10611J4683P437D6562Q8698M5668N4894
12098B35822C3953n457c07550B91142b19060a7038j95336o2713a17090I3924c0593
12086a57237p5739g3804C5665K01645r0308a39089I6934J73569b61406F2525K6404
12075H8929c8708G0428J99078A17558E5451K77399A3414a36213A03517K57688
12065C61205b1234p1906F37561M64960R58809G67494l30020n4624a39348q946
12055a48294C6210c37227a49003D65244C0535J61857e4297C0862a79676a5046
$$ plain form
12044 128078 690 -174120 -47953 615 6666 -28389 -57198 -120906 -226915 46638 -97857 386381
12031 139919 338642 408242 98006 -238053 -151821 43402 211161 253395 -36284 -267294 -562521
12020 -562521 34021 190625 145708 151890 329450 -146222 38814 -74660 -26744 -75487 279971
12008 -150201 59386 183152 -208671 147151 67021 -134259 -276800 146209 -293640 -108803
11997 17180 46600 147554 -97029 -148451 35755 -466902 -206989 -377827 130559 28824 16354
11986 16354 95152 -55216 73060 -65400 177674 113173 -278049 165693 55496 157196 100383
11975 100383 -381504 31917 -205482 167842 154104 -19807 -16387 -541103 -164217 71829 -349380
11963 211401 -31244 296357 217030 -258111 -96818 46126 92543 -237956 129684 90845 74836
$$ packed form
12044A28078F90a74120d7953F15O051b8389k8809o3708j06009D6638i7857C86381
12031A39919J98723O9600I8006b38053Q6232D3402J67759M2234c6284k31010k95227
12020e62521C4021J56604m4917O182J77560a46222C8814g4660b6744m8743B79971
12008a50201E9386J23766b08671A47151F7021a34259j42541A46209b93640a08803
11997A7180K9420J00954i7029n1422C5755d66902b06989j70838A30559B8824j2470
11986A6354P8798e5216G3060f5400A77674o4501b78049A65693E5496J01700n6813
11975A00383c81504C1917b05482A67842j3738a9807L420n24716a64217G1829c49380
11963B11401c1244B96357p9327b58111i6818D6126M6417b37956A29684l8839j6009
$$ plain form
11952 74836 -65356 27492 74852 196432 -222665 -190801 -148716 49431 54688 -130204 35001
11940 20984 263963 127503 -84657 -27524 -119889 -132213 -73464 -293978 -162806 80797 -147846
11928 122676 -35088 -68733 182896 146858 4783 48035 -95907 -59736 110470 -228390 -85825
11916 -168746 -45842 -150026 26359 -39145 177953 47542 -80604 94638 79758 226286 9634
11904 -87716 -24570 -17733 -83802 -211475 -315351 -31199 -85685 -86471 -85479 -399360 210861 331258
11892 331258 -66587 -60835 54701 -316219 136213 164820 163610 -219116 300144 63827 85458
11881 85458 -38639 153831 -155308 -139690 258571 -96314 117195 -104479 -217841 220888
11870 66188 -274888 -104953 -64860 -61592 -347730 392733 -118739 -213485 -205963 -181207 -326798
$$ packed form
11952G4836f5356B7492M7360J21580b22665L1864M2085D9431N257a30204C5001
11940B0984K42979A27503h4657b7524r2365j2324N8749k20514J31172H0797a47846
11928A22676c5088l3645A82896l6038D783M3252i5907L6171A10470b28390h5825
11916a68746d5842j04184B6359c9145A77953D7542h0604I4638j4880J46528I634
11904h7716b4570O837o6069j27673j03876c1199n4486p86R92l13881B10861J20397
11892C31258f6587N752E4701c16219A36213K8607j210b19116C00144F3827K1631
11881H5458c8639A53831a55308J5618B58571i6314A17195a04479j13362B20888
11870F6188b74888a04953M0093L268k86138C92733a18739r4746P522K4756j45591
$$ plain form
11859 -326798 235822 -107885 72837 -131726 84603 76991 -107506 -37083 -118560 138305 22874
11847 357137 199789 40605 -435955 -64327 -42808 -316468 -209669 -276670 123893 -265292
11836 -38080 -126076 96421 40751 69515 -27994 -112431 108444 252367 -23836 66278 -151016
11824 291464 -160784 -236612 -107950 -231817 144089 84906 -89066 -55913 -360824 -29674
11813 -193879 -33578 -90248 -274666 129858 41584 43474 -62164 323063 121197 129008 -186896
11801 -100734 182353 -441131 -145336 144075 -131268 -124274 159700 -13199 113395 72074
11791 72074 137971 -272886 95662 173666 -192842 133649 -225996 -77608 -30071 -225563 -499216
11780 -499216 106499 -174063 183292 -274009 -88778 59369 34778 183349 -304167 68326
$$ packed form
11859c26798B35822a07885G2837a31726H4603p612a07506c7083q1477A38305B2874
11847C57137j57348D0605d35955f4327K1519k73660J06799o7001A23893b65292
11836c8080q7996I6421D0751K8764b7994q4437A08444J43923b3836F6278a51016
11824B91464a60784p5828a07950j23867A44089n9183h9066L3153l04911b9674
11813a93879c3578n6670j84418A29858D1584J890f2164C23063A21197P811a86896
11801a00734A82353d41131a45336A44075a31268O994A59700a3199A13395m1321
11791G2074O5897b72886I5662P8004a92842A33649b25996g7608c0071j95492k73653
11780d99216A06499a74063A83292b74009h8778E9369k4591J48571c04167F8326
$$ plain form
11769 61635 19921 229874 22008 65174 -89311 102558 106105 -21661 1671 -42496 -146126
11758 -146126 -345824 84510 -376875 133271 225248 188842 -91715 -70331 -14100 94335 -97441
11746 -76258 -58757 163917 -48972 85832 -17848 31825 158577 35340 232129 95444 -75407
11734 237823 -314053 -103633 19534 -195309 190392 -215506 -103024 -272651 76323 154198
11724 154198 -241354 91645 -445254 135280 -206414 27893 29586 89041 86830 -7951 17051
11712 322102 -113284 185487 -151494 222582 7658 172455 138117 -20884 28668 38094 -279733
11700 -231049 62826 -147362 141602 -48942 62625 133912 122019 -154281 1807 217766 89142
11688 92980 111675 51720 202349 99679 -165801 156691 -118830 236198 81492 -21661 -72336
$$ packed form
11769F1635A9921K09953B2008M3166h9311A02558L547b1661A671d2496j03630
11758a46126j99698H4510c76875A33271R1977l6406i1715K1384a4100I4335i7441
11746g6258J7501A63917d8972H5832a7848C1825J26752C5340J96789I5444g5407
11734B37823c14053a03633A9534a95309A90392b15506a03024j69627G6323P7875
11724A54198b41354I1645d45254A35280b06414B7893J693N9455k211g951A7051
11712C22102a13284A85487a51494B22582G658J64797l4338b0884B8668R426b79733
11700b31049F2826a47362A41602d8942F2625P1287j1893a54281A807K15959H9142
11688I2980J8695E1720J50629I9679a65801A56691a18830B36198H1492b1661n0675
$$ plain form
11677 -72336 122033 2525 12293 85417 52705 213733 317398 -61580 -129361 -47684 -267344
11666 -267344 247158 274514 264790 3901 -154038 167807 -73607 30554 50033 -101662 -350319
11655 -350319 -317899 281035 40259 72615 -228964 11154 -233413 57216 199900 -141302
11644 -229694 -43777 -5517 -79074 -13004 315186 1708 343986 -163821 142295 -214362 6652
11632 10898 202859 197074 117521 -288087 -203238 -299422 -151659 62370 -100560 250560 -251127
11620 -80740 238600 191184 -123752 35442 107784 322893 141479 200933 138530 121884 77980
11609 77980 -115055 -358576 49531 199869 149137 132876 -206216 186320 110373 -209812
11598 -148737 -127409 45740 205905 -72376 -20983 -158699 52737 108561 -33370 327639 37820
$$ packed form
11677g2336A22033B525R768P3124l2712J61028J03665f1580o7781d7684k19660
11666b67344B47158K7356r724C901a54038A67807g3607C0554J9479a01662k48657
11655c50319L2420B81035D0259L2356b28964A1154b33413E7216J42684a41302
11644b29694d3777e517p3557a3004C15186A708L42278a63821A42295b14362F652
11632A0898J91961n785p9553b88087Q4849r6184J47763F2370a00560B50560b51127
11620h0740B38600m7416a23752C5442P2342K15109A41479N9454o2403j6646m3904
11609G7980a15055k43521D9531J50338n0732j6261b06216A86320p5947b09812
11598a48737K1328D5740J60165g2376b0983j37716E2737N5824c3370C27639C7820
$$ plain form
11586 60933 10883 49367 -83944 -111584 46824 -30923 248301 80663 77452 -186880 218320
11574 125694 266695 81310 117789 52179 125101 -11122 -333363 1175 247834 152551 63542
11562 44626 300518 139580 -532019 -206055 327 457260 89795 160621 398875 -35022 -95430
11551 -95430 209471 173229 78403 -41072 86637 259171 -203258 31111 176111 98238 283786
11540 283786 265642 353595 145482 321998 8330 132618 105044 -285520 348977 -155252
11529 -125575 428563 -106445 -92359 466356 59043 -64339 38688 315499 253391 294714 -46385
11517 -244832 121313 -73588 56783 -145021 -51991 148113 -239541 -313211 123272 100440
11507 100440 208536 547102 223401 259349 153347 -42450 137267 311505 113852 185595
$$ packed form
11586F0933A0883L8484h3944k7640D6824c0923B48301H0663l211a86880B18320
11574A25694J41001H1310L6479E2179P2922a1122l22241A175K46659r5283F3542
11562D4626K55892A39580e32019b06055C27M56933H9795P0826K38254c5022o0408
11551i5430B09471l6242G8403d1072H6637J72534b03258C1111J45000p7873J85548
11540B83786j8144Q7953A45482J76516H330J24288k7574b85520C48977a55252
11529a25575D28563a06445J4086D66356E9043f4339C8688K76811o2108M1323d6385
11517b44832A21313g3588E6783a45021e1991A48113b39541p3670A23272k2832
11507A00440J08096L38566B23401L5948j06002d2450A37267J74238A13852P1743
$$ plain form
11497 185595 -75949 80155 261030 186383 15590 293093 192774 317317 -103952 107925
11486 345923 436175 179008 158443 226566 343702 -55766 227864 42160 61563 275973 35683
11474 3325 55145 61694 218283 45392 74720 191424 178953 318856 -103246 118305 106159
11463 106159 -172081 -176081 530788 -19869 149 172004 317959 46670 -75542 100532 220812
11452 220812 72473 149937 402825 -273470 198530 102322 -50153 -825 -384892 -121940 -22349
11440 30385 -35805 324115 423 548748 -22257 85610 20039 198095 -163869 129740 213048
11429 213048 103764 180626 -153404 212337 -287320 28106 218910 -130095 245022 268925
11419 268925 -33393 97991 255946 -28091 -103559 82232 -188885 -100689 -66624 -55096 23047
$$ packed form
11497A85595g5949H0155J80875p4647A5590K77503j00319J24543a03952A07925
11486C45923R0252A79008k0565O8123J17136e5766B27864D2160J9403K14410C5683
11474C325N1820O549J56589D5392K9328J16704j2471J39903a03246A18305j2146
11463A06159a72081m000E30788a9869A49J71855J45955D6670g5542A00532J20280
11452B20812G2473P7464K52888b73470A98530r6208e0153h25l84067a21940b2349
11440C0385c5805C24115D23N48325b2257H5610B0039J78056a63869A29740Q3308
11429B13048A03764P6862a53404B12337b87320B8106J90804a30095B45022K3903
11419B68925c3393I7991J57955b8091p5468H2232a88885Q8196L4065J1528B3047
$$ plain form
11407 -57197 51852 -403292 -28828 43627 132203 32099 39511 171979 -73196 400809 48752
11395 -170694 364177 123192 -215056 -28421 -22522 -60087 195029 -312364 -24685 -351347
11385 -351347 -292573 -107232 -393287 -49563 -49765 196508 -245798 5426 -9798 74508 183898
11374 183898 -188083 -29275 -101533 114613 322350 -80761 -77866 324531 -39419 76665 -365426
11362 121402 38550 60430 -171580 54622 -157252 100666 -35364 -58362 104704 -118944
11351 86373 -7548 256764 139609 -255164 173306 318190 5436 153949 358182 -44776 202870
11339 221862 21008 69028 99568 342863 -17096 -120115 298161 -232240 -223397 -147589 -243349
11328 -243349 92442 -51597 -41242 -265540 84614 85064 237093 -146427 73402 74050 -10096 -223245
$$ packed form
11407e7197E1852d03292b8828D3627Q8576C2099P412J32468g3196D00809D8752
11395a70694C64177A23192b15056b8421N899l7565A95029c12364b4685l26662
11385c51347N8774a07232k86055d9563k02A96508b45798E426i798G4508J09390
11374A83898a88083b9275p2258A14613K07737h0761K895C24531c9419G6665c65426
11362A21402C8550K1880a71580E4622a57252A00666c5364k2998A04704a18944
11351H6373g548B56764j17155b55164A73306J44884E436J48513K04233d4776B02870
11339B21862B1008M8020L0540K43295a7096j03019B98161b32240Q843P5808r5760
11328b43349I2442e1597J0355k24298H4614M50J52029a46427G3402O48a0096k13149
$$ plain form
11316 -223245 126719 -24404 -383269 -21405 392320 -44319 -18030 -217110 -14657 240207
11305 -17775 -86278 -81890 -132923 33072 -7501 115589 -357666 59954 157586 -145357 -170602
11294 -170602 119873 290797 -202076 -58475 -247612 -9748 43566 -128255 -66015 -305339
11284 -305339 101458 -5992 -8174 -256390 111634 86495 90151 108914 82847 -158411 -278251
11273 -278251 41613 5886 -115164 -109963 -70340 4613 -213954 195556 -267508 -158040 9342
11261 128971 11991 144024 -87912 195863 49068 -316016 157524 19943 433238 78856
11250 150828 -211862 27099 -68679 115425 97853 127665 310553 66799 -293288 -83844 -228258
11239 -228258 -112867 -166217 -134084 -111247 231686 -386776 -74727 -13684 87955 -369723 -299399
$$ packed form
11316b23245A26719b4404l58865b1405C92320d4319a8030j99080a4657B40207
11305a7775o8503M388n1033C3072g501A15589c57666E9954R7632a45357k5245
11294a70602A19873J70924b02076e8475j89137i748D3566a28255O2240k39324
11284c05339A01458e992k182k48216A11634k5139L656J8763k6067a58411j19840
11273b78251D1613E886a15164N201L9623D613b13954A95556b67508J09468I342
11261A28971A1991J32033h7912A95863D9068c16016A57524A9943M13295G8856
11250A50828b11862B7099f8679A15425j7572K9812J82888F6799b93288h3844j44414
11239b28258a12867n3350L2133K2837B31686c86776g4727a3684H7955c69723P0324
$$ plain form
11228 -299399 -235178 -77033 -3454 -196752 122511 129574 43383 -94291 152480 86264 -194501
11216 -437489 -394073 227464 -516916 36155 -9962 -12487 -125704 328151 96827 -107007 -98524
11205 -98524 16076 -62808 48492 -60530 266087 -457258 -153393 -124657 270378 -251012 -317334
11194 -317334 353852 -244949 -65123 -115581 47724 110817 -273354 -121934 -244573 -124914
11184 -124914 -65282 -196427 141417 -53654 247583 -208913 18320 34419 -181224 -110255
11174 -110255 52339 136503 -451194 -127614 92732 7289 -289070 53805 216284 -93781 161506
11162 86000 57481 -60553 116857 -155091 53678 -116499 -109989 -261209 -53573 31779 -218851
11150 -215051 106910 93018 -7634 -177499 174996 -5908 -40660 -94169 -39621 -45356 -73968
$$ packed form
11228b99399O4221g7033c454j93298A22511P063D3383i4291A52480o6216a94501
11216d37489M3416B27464e16916C6155i962k525j13217C28151I6827a07007Q483
11205i8524A6076f2808D8492f0530B66087d57258a53393K8736B70378b51012o6322
11194c17334C53852b44949f5123n0458D7724O3093b73354a21934j22639J19659
11184a24914N9632j31145A41417e3654B47583b08913A8320J6099a81224P0969
11174a10255E2339Q4164d51194a27614I2732G289b89070E3805J62479i3781A61506
11162H6000k8519f0553A16857a55091E3678a16499O510j51220e3573C1779b18851
11150b15051A06910j3892g634j69865A74996e908l4752n3509c9621n735k8612
$$ plain form
11139 -73968 147413 9881 93398 -250368 -41930 264863 458746 -181957 4486 116014 244202
11128 244202 245509 195965 94950 31755 152471 63248 89410 295692 -65261 266190 -219739
11116 190491 105610 -303260 386842 -166185 229316 80781 244242 399031 27194 -232308
11105 286706 212779 -78863 -10369 466224 147863 102916 53509 78763 364034 73304 51590
11094 51590 481878 -57506 417082 -4671 138852 183225 92918 178903 157627 57891 446454
11083 446454 52443 189262 345846 517117 350871 287942 509220 303762 292410 415779
11073 415779 57665 86791 149721 -106789 159362 67856 425356 292596 421287 546560
11063 546560 381341 584126 581791 444458 807951 423140 922095 989768 740161 768663
$$ packed form
11139g3968A47413I881Q3517b50368d1930B64863J93883a81957D486J11528J28188
11128B44202J307m9544I4950C1755J20716F3248K6162K06282f5261B66190b19739
11116A90491q4881c03260C86842a66185B29316H0781J63461J54789B7194b32308
11105B86706p3927g8863a0369D66224A47863m4947m9407K5254K85271G3304k1714
11094E1590M30288e7506D17082d671A38852M4373r0307Q5985k1276E7891L88563
11083D46454E2443J36819J56584J71271j66246o2929K21278k05458j1352J23369
11073D15779E7665K9126O2930a06789A59362F7856L57500j32760J28691J25273
11063E46560j65219K02785k335j37333L63493l84811M98955O7673k49607K8502
$$ plain form
11053 768663 612496 834922 573322 557840 885770 588856 711233 1145344 496680 758969
11043 758969 851511 919581 607197 678755 805491 891997 853907 562403 828210 842959 806301
11032 806301 536153 768433 1105566 671173 646748 810945 699532 705117 827032 475808
11022 475808 837211 557740 590763 825812 756077 539969 885646 815554 426311 583889
11012 583889 812764 677489 545543 344718 770844 797977 576876 384707 750604 493554
11002 493554 595564 1010954 735903 579774 702410 701057 733249 696126 863053 1097465
10992 1097465 710985 462740 985100 934523 670999 1039869 991220 778139 839540 1089627
10982 1089627 1124941 1114912 1117626 1533222 1496602 1787873 1986326 1890352 2546745 2533279 3058575
$$ packed form
11053G68663j56167K22426k61600j5482L27930k96914J22377M34111D96680K62289
11043G58969R2542O8070l12384P1558J26736Q6506l8090k91504K65807J4749l6658
11032H06301k70148K32280L37133m34393k4425J64197j11413N585J21915l51224
11022D75808L61403k79471L3023K35049o9735k16108L45677p0092l89243J57578
11012E83889K28875j35275j31946k00825M26126K7133k21101j92169L65897k57050
11002D93554J02010M15390k75051j56129J22636j353L2192l7123J66927K34412
10992A097465l86480k48245N22360n0577k63524L68870m8649k13081O1401K50087
10982A089627L5314j0029K714M15596l6620K91271J98453r5974O56393j3466N25296
$$ plain form
10971 3058575 2975046 3160487 2962015 2896208 2831569 2599151 2384600 2099883 1857103 2056234
10961 2056234 1865447 1716052 2217800 2111449 2169841 2018256 1858702 1814827 1318307 1063460
10951 1063460 1111675 920201 695642 683407 607524 351611 48201 291659 130623 367317
10941 367317 132406 276572 227646 139242 217977 156931 116390 89832 285038 119220 237623
10930 237623 4631 26379 12392 188002 236391 243296 -142940 124767 174884 -276075 -185817
10919 -185817 296702 125938 7153 82037 -169573 260657 -193970 -44003 -303435 331274
10908 -70375 -364251 -204205 -7793 214226 71324 120821 -306838 280849 63533 -66310 36410
10896 -203384 204225 363297 -15641 42775 142431 -244864 72752 -104451 -40292 11650 237234
$$ packed form
10971C058575q3529J85441j98472o5807o4639k32418k14551k84717k42780J99131
10961B056234j90787j49395N01748j06351N8392j51585j59554m3875m96520k54847
10951A063460M8215j91474k24559j2235p5883k55913D8201K43458A30623K36694
10941C67317A32406J44166m8926q8404P8735o1046m0541k6558J95206A19220J18403
10930B37623D631K1748A2392J75610M8389O905a42940A24767N0117b76075R0258
10919a85817B96702A25938G153P4884a69573B60657a93970d4003k59432C31274
10908g0375k93876J60046g793B14226G1324M9497c06838B80849F3533f6310C6410
10896b03384B04225J59072a5641D2775R9656b44864G2752a04451d0292A1650K25584
$$ plain form
10885 237234 -69363 -96942 -36133 236607 163550 -106616 37145 29661 78518 -275386 304068
10873 15288 30721 -31850 -32689 -220084 162042 119383 -129844 -140528 -331024 -26405 45348
10861 -109337 142645 -89946 1125 -47729 277353 385220 188644 76952 237871 -269885
10850 -96779 442422 35928 -293402 306360 -64255 -261706 -67987 87682 235738 190924 -94094
10838 158986 102671 113679 51562 -54026 -181438 -95956 100499 192456 -211862 -147832 -176155
10827 -176155 -73931 6618 -184053 -436813 -82754 25506 -247765 -81858 230884 106794 -22117
10815 78681 132960 -84011 58557 -73515 96975 -105001 -90231 -3604 -136682 -175461 181915
10803 34046 -21083 -276288 30436 84899 -102264 -422537 -406006 68617 -181180 -187671 -3450
$$ packed form
10885B37234f9363k7579c6133B36607p3057a06616C7145p484M8857b75386C04068
10873A5288J5433c1850q39j87395A62042m2659a29844j0684j90496b6405D5348
10861a09337A42645h9946A125d7729B77353J07867A88644G6952J60919b69885
10850i6779D42422C5928b93402C06360f4255j97451f7987H7682J48056m4814i4094
10838A58986n6315J1008E1562e4026j27412Q5482A00499R1957b11862O4030k8323
10827a76155g3931F618a84053k52760h2754B5506b47765h1858B30884A06794b2117
10815G8681N4279h4011E8557g3515I6975a05001J4770c604j33078l8779A81915
10803C4046b1083k55205C0436N4463a02264l20273J6531F8617a81180o491c450
$$ plain form
10791 -83052 49053 242479 187272 -155110 26160 -119813 -398022 -26900 20737 -230435 -53255
10779 -81984 -435227 -137151 -28681 -51957 169307 -61759 -272776 84550 -40900 248370 -144406
10767 -156953 -8942 -207903 -179544 -42940 -150586 34008 -40236 -298328 -22757 -346121 -225133
10756 -225133 5208 112672 -77261 -213858 263413 -223819 -458254 -152868 -23069 250862
10745 -208273 80263 -149811 14366 -167602 161423 -141531 3928 18413 -164279 -62260 -178936
10734 -178936 -19803 -49591 -96630 280711 -203163 -332752 86759 133652 -206704 187088
10723 208289 -47771 -276149 -103610 -202306 -40644 -15644 -85519 56219 -248779 33169 15159
10711 -259777 22225 -6547 -62732 151835 82759 -74350 10127 157160 305035 -69572 14800
$$ packed form
10791h3052D9053J93426n5207a55110B6160a19813k78209b6900B0737b30435e3255
10779h1984l53243a37151b8681k3276A69307f1759k11017H4550d0900B48370a44406
10767a56953h942j98961K8359d2940j07646C4008d0236k58092b2757l23364J20988
10756b25133E208J07464g7261j36597B63413b23819k34435a52868b3069B50862
10745b08273H0263a49811A4366a67602A61423a41531C928J4485a64279f2260j16676
10734a78936a9803k9788m7039B80711b03163j29589H6759M6893b06704A87088
10723B08289d7771k28378a03610r8696d0644a5644o9875E6219b48779C3169A5159
10711b59777B2225f547n6185A51835o9076g4350A0127J47033J47875f9572A4800
$$ plain form
10699 136456 -91913 -116329 -190690 -253201 -9469 -122375 -23544 -392119 123318 208693 -277485
10687 -115168 -111132 -85221 -420401 -347739 -88674 -276492 377865 100004 -165092 -183215 -42324
10675 -273959 -370042 97624 184244 -58523 -166968 -56029 -598404 -53840 61487 109271 -60685
10663 86899 53952 18948 88027 155363 -398309 182672 44236 -131829 -108391 139013 -225247
10651 61194 71081 147480 -158795 -154799 -53705 -139435 -148584 344855 -145701 -307428 -4120 -196244
10639 -196244 352241 -389009 -74878 22452 92332 29903 -35533 -180904 9875 -121155 20126
10627 -13905 201728 -84028 -166307 -314949 85205 -55703 -177392 -264533 -269399 -18747 -6593
10615 -371892 -82270 -132731 137777 80439 4012 23150 76937 -126008 205206 252397 -188174
$$ packed form
10699A36456i1913k4416p4361o2511i469j12906b3544l68575A23318Q5375b77485
10687a15168M036K5911l35180P2662h8674j87818C77865A00004a65092j8123d2324
10675b73959r6083I7624Q6620e8523j08445e6029n42375e3840F1487M7784f0685
10663H6899l2947A8948O9079O7336c98309A82672D4236a31829K3438A39013b25247
10651F1194R887P6399a58795L996e3705q5730r149C44855a45701j61727d120j92124
10639a96244C52241c89009g4878B2452O9880B9903c5533j45371I875a21155B0126
10627a3905B01728h4028q2279j48642H5205e5703j21689q7141m866a8747f593
10615c71892h2270n0461A37777n7338D012J9138N3787a26008B05206M7191a88174
$$ plain form
10603 118003 -293334 41123 -165130 -113850 38901 -120327 3873 36096 -72202 -202192 -234056
10592 -234056 -97853 -225297 -116037 65669 -205060 -286866 -98542 -17449 -492076 -203456
10581 37388 209068 -10035 -70941 190765 136420 -260345 -195281 -39636 261692 122344 241189
10570 241189 -151729 172379 -205910 -325379 -106582 282888 -131136 120528 -150738 -7524
10559 -237368 25676 163140 174708 -91437 -42040 148382 85019 182583 288100 -27751 17682
10547 -170107 102913 86184 -175242 -159479 90104 93426 107983 -84379 -129109 -232514 34839
10535 182483 252287 -30055 -16137 -408402 266069 -122193 169778 -3107 169773 -10343 124712
10523 281007 303432 54755 43978 176199 133595 -15278 -153388 -77355 -51468 318186 -338298
$$ packed form
10603A18003b93334D1123a65130N1280C8901a20327C873L2223g2202j29990l1864
10592b34056i7853j27444J09260F5669b05060q1806i8542a7449m74627b03456
10581C7388J71680a0035o0906A90765n4345b60345O5064c9636B61692A22344J18845
10570B41189a51729A72379b05910j19469a06582B82888a31136A20528a50738g524
10559b37368B5676J37464J1568i1437d2040A48382o3363R7564J05517b7751A7682
10547a70107A02913j6729a75242J5763I0104L322J4557h4379m4730j03405C4839
10535A82483O9804c0055J3918l92265B66069a22193A69778c107A69773a0343A24712
10523B81007K2425E4755j0777J32221m2604a5278j38110P6033K5887C18186c38298
$$ plain form
10511 125860 131953 -328600 -223076 -1406 -97025 -194863 -317960 -106777 221260 -123318 -13975
10499 -88079 -217341 72718 -118565 132575 10969 27125 -240767 178130 -243191 -22169
10488 20918 178157 -228072 194682 138354 163582 -7564 130059 632471 628003 571651 107609
10476 158366 276619 206683 -215614 -76 -111090 87575 -90853 -97812 235872 -66177 24990
10464 -198505 45767 -414644 -198689 -65424 99034 -152389 132294 -58091 103815 460305
10454 460305 70461 282751 86720 -202771 55702 -173115 73198 -250356 31547 -37133 120892
10442 -106842 117573 40998 115030 -42852 -184977 -155430 -321381 -344697 172707 -161841
10431 26307 -119278 -201931 74596 -204113 282483 32893 -476195 -153110 -155188 47407 -263795
$$ packed form
10511A25860O093c28600J05524a406r5619r7838j23097a06777B21260a23318a3975
10499h8079j29262G2718a18565A32575A0969J6156b40767A78130b43191b2169
10488B0918J57239b28072A94682n6328K5228g564A30059N02412m468n6352A07609
10476A58366J18253o9936b15614g6j11014H7575i0853o959B35872f6177B4990
10464a98505D5767d14644a98689f5424I9034a52389A32294e8091A03815L56490
10454D60305G0461K12290H6720b02771E5702a73115G3198b50356C1547c7133A20892
10442a06842A17573D0998P4032d2852j42125K9547j65951k3316A72707a61841
10431B6307a19278q2653G4596b04113B82483C2893d76195a53110k078D7407b63795
$$ plain form
10419 -45517 147817 84945 223019 -53816 -1597 340604 -125973 -141803 107221 298104 86376
10407 -82583 184056 74146 -51675 126930 -92032 -52118 -206470 470864 65838 -90989 -173832
10396 -173832 476039 2037 71344 -37416 99080 -45597 262279 172006 453061 270706 149098
10385 149098 113445 136257 71164 -154860 56774 225050 509602 76994 192934 461744
10375 461744 146833 73573 509158 -44603 284405 259853 172004 196287 632370 506509
10365 506509 545921 515000 399897 473760 323338 -15193 193256 178377 -66974 -51628 216558
10353 94551 367806 289575 354608 396439 294247 353572 375421 221240 165142 327960 493277
10342 493277 675958 231827 58527 116658 339717 245041 18181 -61601 350446 -64630 266113
$$ packed form
10419d5517A47817o2872J38074e3816a597C40604a25973j5830A07221J90883H6376
10407h2583A84056G4146e1675A26930i2032L9914j54352D70864F5838i0989q2843
10396a73832D76039B037O9307c7416I9080d5597B62279r0273K81055j82355j21608
10385A49098l5653K2812o5093a54860E6774J68276K84552G6994J15940K68810
10375D61744A46833p3260M35585d4603B84405k4552q7849K4283M36083j25861
10365E06509L9412l0921j15103P3863j50422a5193A93256j4879f6974J5346B16558
10353I4551K73255p8231O5033M1831j02192N9325K1849j54181n6098J62818J65317
10342D93277J82681B31827E8527N8131K23059r4676A8181f1601C50446f4630B66113
$$ plain form
10330 122734 -61192 209440 27497 -135820 -138762 -182907 205530 -54267 375170 418572 143369
10318 -30632 207254 517532 233337 26557 159381 232551 380781 448498 85480 116644 249040
10307 249040 2921 108891 12065 -20499 -184562 -154147 -9553 252003 478193 -239806 -1269
10295 53664 -263221 204455 -221282 -216922 10761 186716 16792 -311955 64707 -26850 -108530
10284 -108530 -70731 -325427 -53650 97919 -113036 218653 -178163 15735 -111956 -115165 -361232
10273 -361232 -58571 -330420 162100 -99296 -286122 -34598 -50017 10933 20392 -74373 308114
10261 55376 334325 592478 377404 332313 329024 21380 532555 16789 -4349 7002 -14817
10249 92434 98350 -315888 -34680 270579 -385459 80704 -122889 -89182 -75011 -137393 -252093
$$ packed form
10330A22734f1192B09440B7497a35820k942m4145B05530e4267C75170M3402A43369
10318c0632B07254L10278B33337B6557J32824P3170J48230O7717H5480L1164J32396
10307B49040B921J05970A2065b0499j64063L0415i553B52003K26190b39806a269
10295E3664b63221B04455b21282M360A0761J75955A6792c11955F4707b6850q1680
10284a08530L7799k54696e3650I7919a13036B18653a78163A5735a11956l209k46067
10273c61232e8571k71849A62100i9296j86826c4598j5419A0933R459g4373C08114
10261E5376K78949K58153k15074m5091l289B1380N11175A6789d349G002a4817
10249I2434N916c15888c4680B70579c85459H0704a22889L3707J4171o2382j14700
$$ plain form
10238 -252093 138037 15934 177798 6941 -69962 -45929 -17599 38199 -325478 175217 -21992
10226 -87511 -199646 -509291 -35651 -8816 116479 -89766 -335365 -327596 184670 -452997 57756
10214 162737 53650 54203 -34417 -259144 20269 19743 -170946 -319218 -131245 261129 -122741
10202 -8825 -146431 -198702 41714 83402 -254901 -172380 139384 20866 137080 -211218 -132580
10191 -132580 75544 -345506 -52297 -64902 406316 -445328 -94840 -89076 -237782 -460439 16339
10179 -205876 -350693 -26757 94569 -159734 -419465 72089 -234096 -29038 95736 -12942 8948
10167 -81033 170409 9758 -149369 -147136 -227438 -17639 -196991 -283820 22534 -451886 -211132
10155 -75048 -193902 -105424 143959 -110989 -123944 -453891 28912 105880 202825 15535 39236
$$ packed form
10238b52093A38037A5934J61864F941f9962K4033a7599C8199c25478A75217b1992
10226h7511j12135l09645c5651h816A16479h9766k45599P769A84670d52997E7756
10214A62737E3650N53c4417k24727B0269n26a70946j48272a31245B61129a22741
10202h825j37606n2271D1714M1688b54901Q2521A39384B0866J16214b11218P8638
10191a32580G5544c45506e2297j2605D06316d45328i4840N764j48706k22657A6339
10179b05876j44817b6757I4569a59734k59731G2089b34096b9038I5736a2942H948
10167h1033A70409I758a49369K233q0302a7639j79352q6829B2534d51886b11132
10155g5048j18854Q8478A43959a10989j2955l29947B8912P6968R6945A5535K3701
$$ plain form
10144 39236 -170434 -259061 -67835 -51690 138619 66242 4620 -4312 -123071 -92237 -237969
10133 -237969 106494 -352216 -191167 -36384 -153673 -208632 269304 406919 241267 94449
10122 -56860 -29333 -204260 260920 -52957 -238754 74150 90675 -338750 -68094 -313749 -68657
10110 -4451 -195123 -2557 -185973 -260712 48603 -179580 34831 15356 -99645 -117635 -331967
10099 -331967 -23065 -444885 -21028 783 8388 37822 -216178 -179527 19993 -193569 -187180 81148
10086 -62781 -34052 -105312 -8148 -312296 -83142 -195254 -37154 -68486 81938 -32793 -134591
10075 -134591 -225528 -290492 34227 -7641 19408 -346356 -97873 329729 -12729 103891 47889
10063 -104190 -346561 15445 344893 -164313 -58685 167625 -120809 -244860 -9615 -323682
$$ packed form
10144C9236a70434q8627f7835J6145A38619F6242D620d312j18759L0834j45732
10133b37969A06494c52216J61049c6384j17289n4959B69304J37615j65652I4449
10122e6860K7527j74927B60920e2957j85797G4150J6525c38750f8094k45655f8657
10110d451j90672b557j83416p4739D8603a79580C4831A5356i9645j7990k14332
10099c31967b3065m21820b1028G83P605K9434b16178L6651A9993a93569O389H1148
10086f2781K8729p1260h148l04148h3142j12112c7154l1332H1938c2793j01798
10075a34591r0937o4964C4227g641A9408c46356i7873C29729a2729A03891D7889
10063a04190k42371A5445L29448a64313e8685A67625a20809j24051i615l14067
$$ plain form
10053 -323682 -89406 -285 116322 -135345 -250937 71575 -152167 -344445 53739 -252879 100031
10041 -80418 162776 241887 14957 -238932 -199509 449475 -193638 -97286 -11278 -156610 68572
10029 -73581 -119146 -294019 -163257 -331883 -191039 -65021 -230263 120788 -396867 -332325
10019 -332325 -228373 -113774 -224265 223872 -18803 -8987 186126 -98019 166238 -22853
10008 -68177 -359053 -79052 -209013 -309661 161916 -436690 158485 -117170 -3703 69205
9997 -366418 -61880 -228505 -205142 188734 67828 245183 232455 -470939 -97587 47589 65979
9986 65979 -88776 -410349 30375 -27137 -424133 -63272 -216034 -503616 30869 275237 -159513
9974 -78702 -310742 93444 224303 -205451 -229466 20744 175797 -18160 -125108 18977 402714
$$ packed form
10053c23682h9406b85A16322a35345j15592G1575a52167j92278E3739b52879A00031
10041h0418A62776P9111A4957b38932L9423D49475a93638R6352a1278j45332F8572
10029g3581m5565j74873J30762j68626J40844f5021j65242A20788c96867O4542
10019c32325J03952a13774j10491B23872a8803h987A86126i8019A66238b2853
10008f8177k90876g9052j29961j00648A61916d36690A58485a17170c703F9205
9997c66418f1880j66625K3363A88734F7828J77355j2728d70939i7587D7589J8390
9986F5979h8776l21573C0375b7137l96996f3272j52762k87582C0869K44368a59513
9974g8702k32040I3444J30859b05451k4015B0744J55053a8160j06948A8977L83737
$$ plain form
9963 402714 -42740 98321 -142612 19353 98295 -323534 -153577 -257587 -15473 -257572 -467576
9952 -467576 132401 -98690 -192583 -22604 -154338 160397 171788 -4469 -157054 4110 49849
9941 49849 51089 -228195 -138671 35592 -78322 -206364 21252 -373112 -259056 -11062 279787
9929 -70663 -178710 -131481 387200 -97628 -114862 -90883 -259740 62763 -66307 112179 -129514
9917 57412 -175905 -352818 -53783 -285066 -137273 96110 -368963 22428 119975 87087 -17131
9905 -32038 -169371 -87373 42474 -154607 90860 -310608 -267522 -169270 334552 -116082 314064
9893 46052 -191646 -175585 -63153 -248352 -131381 -103958 375177 -14591 -273391 60680 -53552
9881 202076 -56504 -558794 197999 69301 136211 -400317 -15180 -488425 -142978 -449956
$$ packed form
9963D02714d2740I8321a42612A9353P8942c23534a53577j04010a5473k42099k10004
9952d67576A32401i8690r3893b2604j31734A60397J1391d469j52585D110M5739
9941D9849J240b28195Q9524C5592g8322j28042B1252c73112J14056a1062B79787
9929g0663j08047M7229C87200i7628j7234K3979j68857F2763f6307A12179a29514
9917E7412a75905j76913e3783k31283a37273I6110c68963B2428R7547l2888a7131
9905c2038j37333Q1998D2474a54607I0860c10608M3086R8252C34552a16082C14064
9893D6052a91646J6061f3153j85199J16971K7423C75177a4591k58800F0680e3552
9881B02076e6504n02290A97999F9301O6910d00317a5180m73245a42978l06978
$$ plain form
9871 -449956 161037 -62219 60270 -431296 -42102 -101103 -48825 -123782 -197125 -263327 170444
9859 2546 -88276 14785 -91126 177903 108705 -8130 -117127 157386 43358 144015 -122887
9847 6143 -341119 -177959 144721 -70347 -156988 -130004 227279 24928 -320122 -72161 -210999
9836 -210999 -404599 -91410 -279581 -465254 60105 -215471 -161785 -33886 40736 68580 -144838
9824 -8827 -62484 -236668 -32847 -73275 -513976 -397328 192033 -16377 107120 48368 -245458
9812 -67389 274265 -53928 -48128 60827 -61305 -61410 -97847 6550 -29743 26509 46361 -112902
9799 361067 -74576 -295853 -95782 -277575 123941 128311 -250174 151168 -13961 -87531 43222
9787 -138130 -342129 67633 -185499 -26509 -186898 223115 69072 -227559 -136047 122934
$$ packed form
9871d49956A61037f2219F0270d31296d2102n9001d8825p4957p3343o6202A70444
9859B546h8276A4785i1126A77903o9198h130j08997A57386D3358J00657a22887
9847F143c41119J63160A44721g0347q6641K6984B27279B4928c20122g2161j38838
9836b10999j93600i1410j88171j85673F0105b15471N3686c3886D0736K7844a44838
9824h827n3657j74184c2847m0428m40701J16648A92033a6377A07120D8368b45458
9812f7389B74265e3928N800F0827f1305j05l6437F550b9743B6509J9852a12902
9799C61067g4576k21277i5782j81793A23941M370b50174A51168a3961p3570D3222
9787a38130k03999F7633a85499b6509j60389B23115F9072b27559R1512A22934
$$ plain form
9776 -87693 255171 -326317 -181154 -291337 -116397 -80426 158991 -213905 26091 -69374
9765 -264192 -318884 -271092 -237542 -26707 175156 126950 106017 -216177 186777 -308359 -466099
9754 -466099 66715 -460367 131594 115857 -225864 -114682 49866 172557 -139071 -56006
9743 -67023 69410 34005 32991 -57449 -205280 -56817 -276628 200572 246650 117926 -65829
9731 270800 200033 -182646 65619 -61461 14695 -245378 19155 -244373 258378 -32702 -247907
9720 -247907 -14660 230991 -215418 -105848 263149 46606 146595 177204 -102152 -231446
9710 -231446 -33329 -169329 131376 46898 -283564 135909 39462 -1823 -70348 -230994 -93633
9698 -291315 176015 -115940 -246082 -238449 85895 16147 -228994 47940 -116832 -101367 315925
$$ packed form
9776h7693B55171c26317J45163j10183a16397L5971A58991b13905B6091f9374
9765b64192n4692M7792L3550b6707A75156m8206k0933b16177A86777c08359j57740
9754d66099F6715d60367A31594j5737b25864J11182D9866J22691a39071e6006
9743f7023F9410C4005j014e7449j47831e6817k19811B00572M6078A17926f5829
9731B70800p0767a82646F5619f1461A4695b45378A9155b44373B58378c2702k15205
9720b47907a4660B30991b15418a05848B63149D6606R9989L0609a02152j29294
9710b31446c3329j36000A31376D6898b83564A35909C9462a823o8525j60646i3633
9698b91315A76015a15940j30142P633H5895A6147b28994D7940a16832J5465C15925
$$ plain form
9686 -94767 -37050 -355966 -12384 -41340 -600448 -11726 155942 -113697 9040 -92742 7348
9674 -51075 184547 -126047 63286 258768 70606 -287349 -53311 -193409 -307452 -90526 -365027
9663 -365027 -277159 104362 -101306 179638 -128159 -80236 191694 -134413 148827 33370
9652 99253 68332 79951 -259437 -23378 -221719 261436 -71154 122583 -237946 -278353 -293842
9641 -293842 -1266 -35092 -34031 -219415 12584 -155443 -136022 166483 -266088 -97629 -129493
9630 -129493 13971 58701 -172596 175136 -72095 281345 -79528 -268661 -166854 104997
9619 212015 300003 -263284 4007 -50937 -14578 -199683 -513458 76061 13582 -160416 -455555
9608 -455555 -52697 -62116 92050 -64237 -136021 -93588 82876 82919 34405 -191486 242467 70277
$$ packed form
9686i4767c7050l18916a2384k8956n59108a1726A55942a13697I040i2742G348
9674e1075A84547a26047F3286J95482G0606b87349e3311j40098j14043i0526k74501
9663c65027Q7868A04362a01306A79638a28159M7923A91694a34413A48827C3370
9652I9253l0921J1619b59437b3378j98341B61436g1154A22583b37946m0407j5489
9641b93842a266l3826J061j85384A2584a55443J9421A66483b66088i7629l1864
9630a29493A3971M4730a72596A75136g2095B81345g9528j89133J01807A04997
9619B12015Q7988b63284D007e0937a4578j85105l13775G6061A3582a60416k95139
9608d55555e2697r419I2050f4237p1784M2433H2876M3C4405a91486B42467G0277
$$ plain form
9595 -3249 64073 -217524 -91195 35277 -329944 -304746 -150058 -168954 -268351 70399 -246379
9583 25088 190013 -213483 46218 4889 -99464 -239021 -210730 -60271 -27805 137912 170631
9572 170631 -27229 -209168 -131318 -186900 -54325 56769 -100087 217315 -278790 168836 83139
9560 70890 -89403 -87886 190068 3588 -21974 -171442 146131 215011 -199389 -166654 48017
9548 -128432 -142475 -73 -422519 -84850 157731 -35908 -84094 -128297 -38017 -38735 206201 -25317
9535 -212049 47432 -496890 -148364 -156556 -33721 -221981 -91035 312099 482390 -63836 -243063
9524 -243063 -118971 38185 -44839 -56606 -161003 -17574 -112991 -73128 -129624 -160039 -90576
9513 -90576 -30605 198405 218484 -108502 -189027 -22611 139727 -160028 -66318 -124550 40379
$$ packed form
9595c249F4073b17524i1195C5277c29944K5198a50058j8896r9397G0399b46379
9583B5088J64925b13483D6218D889i9464j39557K8291f0271b7805A37912L2719
9572A70631b7229j81939P7850n5582e4325E6769a00087B17315b78790A68836H3139
9560G0890h9403J517A90068C588b1974j49468A46131O8880a99389L2735D8017
9548a28432j4043g3m22446h4850A57731c5908m8186m4203c8017p18B06201b5317
9535b12049D7432d96890a48364q192c3721j88260i1035C12099J70291f3836j79227
9524b43063a18971C8185d4839j1767j04397a7574r5417L9863n6496l0415O9463
9513i0576c0605A98405K0079a08502q0525b2611A39727a60028f6318n8232D0379
$$ plain form
9501 -148714 -156472 93784 82861 -107074 20590 79235 -27603 42299 86483 -138809 -127117
9490 -127117 -87492 -215964 -379280 -169793 -137750 54048 -152353 -269679 12859 13456 -136819
9478 -156703 29880 -46300 -246275 -128781 104026 -176778 -315804 19480 -304684 24122
9467 143926 55111 -4556 -71929 45094 -25923 42406 -86780 214923 -29944 -93551 -62712 -97748
9455 -97748 -168972 -214725 -55033 -174456 -38943 -755772 -134451 216027 -71634 -206955 -221157
9444 -221157 -501176 -112858 -76485 -166219 346344 123058 8439 -41103 -17188 -12138 -61924
9433 -61924 -69928 -101582 -114419 -256837 106406 20666 -54530 32348 -89153 53453 -97244 -132470
9421 -132470 -155977 -293724 -102501 -130211 -17276 -141090 -91389 -138962 73300 136714 167081
$$ packed form
9501a48714p758I3784j0923a07074B0590N8645b7603D2299M4184a38809J1692
9490a27117L9625j28472j63316a69793L2043E4048a52353j17326A2859N97a36819
9478a56703B9880d6300j99975J17494A04026a76778j39026A9480c04684B4122
9467A43926E5111d556o7373D5094b5923D2406h6780B14923b9944o3607L0839l5036
9455i7748p1224m5753e5033j19423c8943p16829a34451B16027g1634j35321j4202
9444b21157k80019a12858L6373q9734C46344A23058H439d1103a7188N050m9786
9433f1924q004l1654j2837j42418A06406B0666e4530C2348h9153E3453i7244l5226
9421a32470k3507j37747a02501k7710a7276j23814M9701m7573G3300O3414L0367
$$ plain form
9410 167081 -150243 97459 -100281 56566 -90840 -299998 -62585 -132148 -252485 23288 -260236
9398 -17406 -45163 12424 75449 -60143 -118888 211010 134079 -8743 -154875 200135 -72627
9386 76003 274040 7402 -281122 -300442 44735 29866 -445671 -237007 125815 255436 -278829
9374 -18235 26125 35306 47171 -103692 -274031 -206233 37889 57310 -74802 -193848 -100377
9363 -100377 15177 15365 163575 -257645 -15195 -423442 48904 -98740 211631 -198681 184595
9351 90836 11125 -157092 -229616 264512 -52651 53972 -190950 -442909 -205997 -40330 6575
9339 -202239 -88519 -73185 -60826 -204238 -115685 13033 13795 -183990 -112398 -27192 -153173
9328 -153173 -56844 -149105 -139093 80947 -329596 -92520 -85673 134850 56428 -30607 -103456
$$ packed form
9410A67081a50243I7459a00281E6566i0840k09158f2585o9563j20337B3288b60236
9398a7406k7757A2424O3025f0143n8745B11010p6931h743j46132B00135g2627
9386G6003J98037G402b81122j9320D4735j4869d45671K08664A25815J29621b78829
9374a8235B6125R181J1865a03692j70339O7798C7889J9421g4802j19046R3471
9363a00377A5177J88J48210b57645a5195m08247D8904i8740B11631a98681A84595
9351I0836A1125a57092p2524B64512e2651E3972a90950k51959b05997d0330F575
9339b02239h8519J5334J2359j43412Q8553A3033P62a83990P1592b7192j25981
9328a53173e6844r2261J0012H0947c29596i2520O847A34850E6428c0607p2849
$$ plain form
9317 -103456 20899 -218026 -61797 -237803 -89806 48751 58582 -112896 -60912 -167214 -17367
9305 210629 -149085 80277 21422 -402230 -276170 -96571 -86527 288772 -205979 95402 314529
9294 314529 -44240 58020 -227490 20490 -122910 -197340 -134755 -226078 -53839 -42306 142232
9282 -311515 43890 17638 136427 104138 135366 -66855 64437 84038 -88574 -183909 -370293
9271 -370293 -297150 -197182 138560 10525 -224583 -36070 424306 19660 408183 210554 -47807
9259 -52129 -108906 53622 98867 -11401 -38944 -223827 -436713 -96827 -81454 248777 168122
9248 168122 -13377 -271944 82724 -148906 -124089 -97316 -255838 -288854 -187422 49004 -136405
9236 -180827 453291 10004 20334 -41454 118144 -27860 -103503 -461793 28850 -229358 -170093
$$ packed form
9317a03456B0899b18026f1797j76006h9806D8751R831a12896N1984j06302a7367
9305B10629a49085H0277B1422d02230J26060i6571J0044B88772b05979I5402K19127
9294C14529d4240E8020b27490B0490a22910p4430O2585r1323e3839J1533A42232
9282c11515D3890A7638J18789l2289L1228f6855F4437J9601h8574r5335j86384
9271c70293P3143R9968A38560A0525b24583c6070D24306A9660L88523j97629d7807
9259e2129n6777E3622M5245a1401k7543j84883k12886i6827J5373B48777q0655
9248A68122a3377k58567H2724a48906K4817K6773j58522l3016J01432D9004a36405
9236a80827D53291A0004J0330d1454A18144b7860p5643l58290B8850b29358N9265
$$ plain form
9225 -170093 -168353 -23666 88454 -205128 -55531 -116781 -192282 302538 7810 217381 58882
9213 -34789 -114341 -238515 -185397 9437 -69818 -237863 220941 -368953 81957 -223018 -77626
9201 -211676 183221 -267139 -88678 -15036 25568 -340849 -66513 152275 -199964 156255
9190 -211346 279877 264538 -37069 -69468 -392404 24175 20696 181410 -196642 -250628 -123037
9178 -176744 -293471 -31652 300907 -242450 -92835 -158597 -272594 -170682 30687 -155264
9167 102818 -311580 37392 142274 242878 -67757 173896 330731 207401 91490 -403001
9156 39696 301472 271874 -69078 -45179 105946 147879 -17621 -74221 -184777 -175568 -98595
9145 -98595 231463 -233085 -257455 -158020 79250 169343 -114793 -215143 -61430 -169630 -126466
$$ packed form
9225a70093J740b3666H8454b05128e5531o1250p5501C02538G810K09571E8882
9213c4789p9552j24174N3118I437f9818j68045B20941c68953H1957b23018g7626
9201b11676A83221b67139h8678a5036B5568c40849f6513A52275a99964A56255
9190b11346B79877j5339c7069l2399l22936B4175l479J60714a96642n3986a23037
9178a76744j16727c1652C00907b42450i2835o5762j13997J01912C0687a55264
9167A02818c11580C7392J04882J00604f7757A73896J56835j23330I1490d03001
9156C9696K61776k9598f9078K3899A05946M1933a7621n6600j10556R209P6973
9145i8595B31463b33085k4370R9435G9250R0093a14793j00350f1430j08200M3164
$$ plain form
9134 -126466 -328457 -320751 -37882 102292 119020 41342 -22769 108393 87615 77925 37996
9122 -534517 -438329 -180149 -255488 -160883 103248 82329 -34138 -74613 367958 -232044 -11265
9110 208025 -235415 -566933 -132422 -388626 18655 193070 181435 -6988 -35025 -261315 136082
9098 -7413 -163576 -62306 -20596 -9985 -375693 -37156 -26605 119677 -79492 292744 84969
9086 359992 -227406 238278 -121724 -191955 -21529 31799 -381315 -55909 204642 -182506
9075 -43008 157613 62406 -267555 58902 -185287 -74029 426168 40837 -40048 -112782 -339333
9064 -339333 -234330 -249624 -244247 -37229 212509 -257224 -192583 -82479 -165430 -101249 -71460
9053 -71460 -70550 242185 55620 206112 -170940 -4825 29372 -183353 -183929 144461 -319477 -95484
$$ packed form
9134a26466k01991P706c7882A02292J6728D1342b2769A08393k0778r690C7996
9122e34517R6188a80149p5339R4605A03248k0919c4138m0475C67958b32044a1265
9110B08025b35415l31518a32422k56204A8655J74415j1635f988k8037k26290A36082
9098g413j56163f2306b0596i985l65708c7156J0551A19677g9492B92744H4969
9086C59992b27406B38278a21724p0231b1529C1799c81315e5909B04642a82506
9075d3008A57613F2406b67555E8902a85287g4029D26168D0837d0048p2734k26551
9064c39333J05003j5294N377c7229B12509b57224O4641h2479q2951O4181K9789
9053g1460R10B42185E5620J50492a70940d825B9372a83353n76A44461c19477i5484
$$ plain form
9040 49697 -177122 -193434 -73084 -100968 -42553 -72558 235853 -58385 -317715 -38654 -353810
9029 -353810 16878 38195 -81523 88312 -40192 -271118 -68651 278207 -75731 76408 -51020
9017 80012 -140388 44891 -262514 -96532 21525 35498 -9366 60935 -64622 -312799 -9537 -141881
9005 -141881 -78467 -89318 23314 18277 14665 -230459 -90421 -272772 -132147 -427796 -280204
8994 -280204 -87050 16543 67767 211202 116600 327850 -80892 -46201 -43123 -149908 -91438
8983 -91438 -64631 -223112 -232130 -297555 276911 -213631 -59217 197629 -163665 25298 -84424
8971 162313 -310327 110691 -145644 180931 -79401 187671 -259907 -159973 57694 293058
8961 293058 -135863 68438 -112912 -172303 -181053 -320346 -254204 -143305 -2801 -117738 -115795
$$ packed form
9040D9697a77122j6312g3084k7884d2553l0005B35853e8385k59330c8654l15156
9029c53810A6878K1317h1523H8312d0192k30926f8651B78207g5731G6408e1020
9017H0012a40388D4891b62514i6532B1525J3973i366F0935f4622k48177i537j32344
9005a41881O3414j0851B3314n037l612b30459i0421j82351a32147k95649J47592
8994b80204h7050A6543N1224J43435r4602K11250h0892L4691L078j06785N8470
8983i1438K6807j58481r018o5425B76911b13631e9217A97629a63665B5298h4424
8971A62313c10327A10691a45644A80931g9401A87671b59907R9934E7694K35364
8961B93058a35863F8438a12912n9391q750j39293O6142J10899b801j14937J943
$$ plain form
8950 -115795 -315335 -93768 -323233 210823 -163770 -179063 -13125 -216342 -121298 129224
8939 -276329 197895 -116819 68726 -138741 161609 156425 221936 -50284 -177749 -148744 45881
8927 133723 -182790 324829 260624 1111318 3531696 11424998 12390214 2842558 1084655
8917 357418 433874 315647 356696 62614 -6920 -225154 108391 100502 116038 796691 87375
8905 -48224 -90408 -73748 132666 305963 -48195 40767 -100499 -171742 -35106 -467563 39699
$$ packed form
8950a15795j99540i3768k29465B10823a63770j5293a3125k03217R5044A29224
8939b76329A97895a16819F8726a38741A61609n184O5511e0284j27465K9005D5881
8927A33723a82790C24829o4205Q50694K420378P893302R65216B842558A084655
8917C57418P6456j18227M1049F2614f920k18234A08391p889J5536O80653H7375
8905d8224m2184J6660A32666J73297d8195D0767a00499p1243c5106m32457C9699
$$ [...]
##END NTUPLES=NMR SPECTRUM
##END=
