
##TITLE=AC1378_MEXAH12190_7519188_bsWp4RNT6U
##JCAMPDX= 6.0         $$ Bruker NMR JCAMP-DX V2.0
##DATA TYPE= NMR SPECTRUM
##DATA CLASS= NTUPLES
##ORIGIN= BRUKER
##OWNER= Administrator
$$ 1.72 TOPSPIN		Version 2.1
$$ 2013-02-20 20:21:25.683 -0500  Administrator@X
$$ Compression mode = diff/dup
##.OBSERVE FREQUENCY= 400.02188249412
##.OBSERVE NUCLEUS= ^1H
##.ACQUISITION MODE= SIMULTANEOUS (DQD)
##.ACQUISITION SCHEME= undefined
##.AVERAGES= 8
##.DIGITISER RES= 22
##SPECTROMETER/DATA SYSTEM= spect
##.PULSE SEQUENCE= zg30
##.SOLVENT NAME= COFFEE_meoh
##.SHIFT REFERENCE= INTERNAL, COFFEE_meoh, 1, 14.98509
##AUDIT TRAIL= $$ (NUMBER, WHEN, WHO, WHERE, PROCESS, VERSION, WHAT)
$$ ##TITLE= Audit trail, TOPSPIN		Version 2.1
$$ ##JCAMPDX= 5.01
$$ ##ORIGIN= Bruker BioSpin GmbH
$$ ##OWNER= Administrator
$$ $$ E:\/data/COFFEE/nmr/AC1378_MEXAH12190_7519188_bsWp4RNT6U/10/pdata/1/auditp.txt
$$ ##AUDIT TRAIL=  $$ (NUMBER, WHEN, WHO, WHERE, PROCESS, VERSION, WHAT)
(   1,<2013-02-20 20:21:17.352 -0500>,<Administrator>,<X>,<go>,<TOPSPIN 2.1>,
      <created by zg
	started at 2013-02-20 20:20:11.541 -0500,
	POWCHK enabled, PULCHK disabled,
       configuration hash MD5:
       86 BA 57 50 F2 9D 5C 9B 26 00 A9 28 5F 66 2E 89
       data hash MD5: 64K
       08 27 AC 12 D4 B4 EF 1C 01 98 8A 21 DB 54 18 B7>)
(   2,<2013-02-20 20:21:20.369 -0500>,<Administrator>,<X>,<proc1d>,<TOPSPIN 2.1>,
      <Start of raw data processing
       efp LB = 0 FT_mod = 6 PKNL = 1 PHC0 = 0 PHC1 = 0 SI = 32K 
       data hash MD5: 32K
       B8 58 B6 CB 10 31 A1 8A 30 76 33 D0 BE 52 1D 34>)
(   3,<2013-02-20 20:21:20.875 -0500>,<Administrator>,<X>,<proc1d>,<TOPSPIN 2.1>,
      <pk PHC0 = 68.56567 PHC1 = 0 
       data hash MD5: 32K
       FD F5 08 66 2A 59 A8 D7 94 3B 9C 8E 51 5C 00 4A>)
(   4,<2013-02-20 20:21:21.104 -0500>,<Administrator>,<X>,<proc1d>,<TOPSPIN 2.1>,
      <abs ABSG = 1 
       data hash MD5: 32K
       FB 01 42 81 02 EA C5 D6 E3 27 87 F5 26 F0 B0 7B>)
(   5,<2013-02-20 20:21:21.258 -0500>,<Administrator>,<X>,<proc1d>,<TOPSPIN 2.1>,
      <abs ABSG = 2 
       data hash MD5: 32K
       AE 12 C9 0A 56 EF 55 CC B0 D9 D1 6B CE 96 00 84>)
(   6,<2013-02-20 20:21:21.395 -0500>,<Administrator>,<X>,<proc1d>,<TOPSPIN 2.1>,
      <abs ABSG = 3 
       data hash MD5: 32K
       CF 20 E0 C6 74 EE 46 AB 8A 98 A7 F4 9F 80 BC 4C>)
(   7,<2013-02-20 20:21:21.549 -0500>,<Administrator>,<X>,<proc1d>,<TOPSPIN 2.1>,
      <abs ABSG = 4 
       data hash MD5: 32K
       C2 B9 E8 28 22 17 A2 E6 2C 6E 20 AF 4A 8C FE D1>)
(   8,<2013-02-20 20:21:21.686 -0500>,<Administrator>,<X>,<proc1d>,<TOPSPIN 2.1>,
      <abs ABSG = 5 
       data hash MD5: 32K
       7F 1D C9 3C BE 2D D7 21 49 3A 78 61 00 C5 51 0F>)
$$ ##END=
$$ 
$$ $$ hash MD5
$$ $$ 5A C7 4D E0 B0 67 FA C0 06 D4 5B 77 95 F7 FC 77
##$RELAX= 
##$RELAX= 
##$RELAX= 
##$RELAX= 
##$RELAX= 
##$RELAX= 
##$RELAX= 
$$ Bruker specific parameters
$$ --------------------------
##$DU= <E:\>
##$EXPNO= 10
##$NAME= <AC1378_MEXAH12190_7519188_bsWp4RNT6U>
$$ [...]
##$TP= (0..7)
150 150 150 150 150 150 150 150
##$TP07= 0
##$TPNAME0= <>
##$TPNAME1= <>
##$TPNAME2= <>
##$TPNAME3= <>
##$TPNAME4= <>
##$TPNAME5= <>
##$TPNAME6= <>
##$TPNAME7= <>
##$TPOAL= (0..7)
0.5 0.5 0.5 0.5 0.5 0.5 0.5 0.5
##$TPOFFS= (0..7)
0 0 0 0 0 0 0 0
##$TUNHIN= 0
##$TUNHOUT= 0
##$TUNXOUT= 0
##$USERA1= <user>
##$USERA2= <user>
##$USERA3= <user>
##$USERA4= <user>
##$USERA5= <user>
##$V9= 5
##$VALIST= <valist>
##$VCLIST= <CCCCCCCCCCCCCCC>
##$VD= 0
##$VDLIST= <DDDDDDDDDDDDDDD>
##$VPLIST= <PPPPPPPPPPPPPPP>
##$VTLIST= <TTTTTTTTTTTTTTT>
##$WBST= 1024
##$WBSW= 4
##$XGAIN= (0..3)
0 0 0 0
##$XL= 0
##$YL= 0
##$YMAX_a= 558572
##$YMIN_a= -556206
##$ZGOPTNS= <>
##$ZL1= 120
##$ZL2= 120
##$ZL3= 120
##$ZL4= 120
##$ABSF1= 14.98509
##$ABSF2= -5.573092
##$ABSG= 5
##$ABSL= 3
##$ALPHA= 0
##$AQORDER= 0
##$ASSFAC= 0
##$ASSFACI= 0
##$ASSFACX= 0
##$ASSWID= 0
##$AUNMP= <proc_prof1d_extract_pilot.lims>
##$AXLEFT= 0
##$AXNAME= <>
##$AXNUC= <1H>
##$AXRIGHT= 0
##$AXTYPE= 0
##$AXUNIT= <>
##$AZFE= 0.1
##$AZFW= 0.1
##$BCFW= 0
##$BC_mod= 0
##$BYTORDP= 0
##$COROFFS= 0
##$CY= 15
##$DATMOD= 1
##$DC= 0
##$DFILT= <>
##$DTYPP= 0
##$F1P= 0
##$F2P= 0
##$FCOR= 0.5
##$FTSIZE= 32768
##$FT_mod= 6
##$GAMMA= 0
##$GB= 0
##$INTBC= 1
##$INTSCL= 1
##$ISEN= 128
##$LB= 0
##$LEV0= 0
##$LPBIN= 0
##$MAXI= 10000
##$MC2= 0
##$MEAN= 0
##$ME_mod= 0
##$MI= 0
##$NCOEF= 0
##$NC_proc= -8
##$NLEV= 6
##$NOISF1= 0
##$NOISF2= 0
##$NSP= 0
##$NTH_PI= 0
##$NZP= 0
##$OFFSET= 14.98509
##$PC= 1
##$PHC0= 68.56567
##$PHC1= 0
##$PH_mod= 1
##$PKNL= yes
##$PPARMOD= 0
##$PPDIAG= 0
##$PPIPTYP= 0
##$PPMPNUM= 2147483647
##$PPRESOL= 1
##$PSCAL= 4
##$PSIGN= 0
##$PYNMP= <proc.py>
##$REVERSE= no
##$SF= 400.02
##$SI= 32768
##$SIGF1= 0
##$SIGF2= 0
##$SINO= 400
##$SIOLD= 32768
##$SPECTYP= <>
##$SREGLST= <1H.CDCl3>
##$SSB= 0
##$STSI= 32768
##$STSR= 0
##$SW_p= 8223.68421052631
##$SYMM= 0
##$S_DEV= 0
##$TDeff= 65536
##$TDoff= 0
##$TI= <>
##$TILT= no
##$TM1= 0
##$TM2= 0
##$TOPLEV= 0
##$USERP1= <user>
##$USERP2= <user>
##$USERP3= <user>
##$USERP4= <user>
##$USERP5= <user>
##$WDW= 1
##$XDIM= 32768
##$YMAX_p= 460369902
##$YMIN_p= -712811
##$CURPLOT= <Network HP LaserJet P1505>
##$CURPRIN= <$Network HP LaserJet P1505>
##$DFORMAT= <normdp>
##$LAYOUT= <+/1D_H.xwp>
##$LFORMAT= <normlp>
##$PFORMAT= <normpl>
##$SURQMSG= 1
$$ End of Bruker specific parameters
$$ ---------------------------------
##NTUPLES= NMR SPECTRUM
##VAR_NAME=  FREQUENCY,     SPECTRUM/REAL,   SPECTRUM/IMAG
##SYMBOL=    X,             R,               I
##VAR_TYPE=  INDEPENDENT,   DEPENDENT,       DEPENDENT
##VAR_FORM=  AFFN,          ASDF,            ASDF
##VAR_DIM=   32768,         32768,           32768
##UNITS=     HZ,            ARBITRARY UNITS, ARBITRARY UNITS
##FACTOR=    0.250966925370066, 1,           1
##FIRST=     8223.43324360094, -133395,      -6503
##LAST=      0,             59980,           -91566
##MIN=       0,             -712811,         0
##MAX=       8223.43324360094, 460369902,    0
$$ Real data points
##PAGE= N=1
##DATA TABLE= (X++(R..R)), XYDATA
$$ [...]
23877 -262203 -255941 66234 -34315 17598 -93169 103149 -225456 372788 61498 -166419 -54183
23865 300835 37751 137684 -20367 154997 40140 114291 272026 -88272 -2936 391274 95765
23853 -166795 185394 114086 99484 208113 -165696 125535 -247256 -440959 84368 -45790
23842 -267506 -130968 -199051 -133419 321089 -258443 -80382 -249918 -86111 3540 63233 -76772
23830 -35950 -108823 -43518 214451 -112644 75333 -66528 96402 151071 197544 -189314 185785
23818 -232795 -153343 -233646 -298615 222550 189356 10013 -10695 -146246 153259 205675 36721
23806 -27959 -364806 61260 422761 -96479 -9870 152011 -74940 -26676 15854 26407 -68387
23794 -292427 94863 -368035 199681 -134805 -163832 104867 -108402 -228600 -77575 -273960
23784 -273960 40606 -229679 -211491 195417 32290 -196284 -338061 -63115 55334 114826 87618
23773 87618 -143106 -25613 -39972 -167485 11396 -104922 -50090 54508 388802 327341 -195455
23761 232074 -151125 243542 180748 170805 -130692 360333 -30155 -101348 -116055 119190 68920
23750 68920 37602 464898 -223687 17476 268550 129035 -61765 -84248 120986 -163842
23739 -70080 -101327 -155715 301200 -83484 259789 -51584 111367 -87520 -130326 122020 -225565
23727 -181872 -85466 -132260 -37309 -2124 -30712 62147 76111 96677 -128442 -46419 -66750
23716 -66750 -23928 -98060 -117508 -299365 11457 174592 -6550 48519 41518 1198 -201011 38982
23703 24755 -224309 -89006 -64453 49693 -60353 -119772 -294920 -150146 29715 -97794 29734
23691 -38344 68409 -207877 53199 173906 31695 80002 164989 70690 -292962 -36855 54497
23679 106991 -150281 72063 -103233 -187112 295960 -50328 127109 178660 -223084 -30725
23668 55904 147975 24146 140260 50739 13996 131318 -346953 159023 61213 -90207 129837
23656 -174625 -122328 121608 -256616 -410838 -112732 -209074 -85048 249835 -196265 167948
23645 25930 -64974 -131604 -35280 154200 -188029 -194146 149828 -89755 -143117 142377 -218493
23633 -19215 -185452 141579 119071 130061 -133406 -54194 -33554 194609 -52424 -505262 257927
23621 130987 239176 -313817 -6435 84722 145317 -93886 3491 36782 -115892 8822 -91260
23609 11740 95293 124440 302278 -137174 31623 -120010 31717 -113461 107264 60583 -40209
23597 44225 15953 -103254 -182575 226609 280796 -204897 90164 110286 -431964 22967 -302122
23585 30210 -110591 -66150 73526 13502 -76538 96955 -69964 -83701 48086 -142202 -61692
23573 -28468 51747 35717 39118 -28671 217659 -270140 -55821 -218146 25351 -31164 94042
23561 -293008 73145 -28882 -172938 -13070 -89713 44348 83215 355597 93744 -17892 213917
23549 122792 94228 -189803 -157000 28125 201531 -64109 -181691 -155441 -40035 -263997 265435
23537 121107 139810 -16125 -94168 6185 -140587 67775 -115259 48599 -236546 -202478 145634
23525 -68328 -74283 -49178 -218081 -64234 -4820 -20503 -135399 -10420 -264975 233171 110331
23513 163809 40226 223701 282804 -130414 -7408 55258 -201040 323056 236920 -102127 149467
23501 -40823 37679 -426840 100350 -167656 -38163 -45580 -177161 -120079 6367 2830 21007
23490 21007 -111068 18687 147297 -397130 130122 153497 129716 227345 -220025 -125531 -36817
23478 -383059 355301 -83910 -130180 -338678 -190726 180020 173147 178515 -227900 -272426 3762
23466 109308 -71522 122611 -3083 8707 -99237 186160 -194046 137073 -221801 210212 -39112
23454 174729 -25015 -167377 -120346 208762 145605 -34649 -129037 79796 -131855 -167143 -363880
23443 -363880 68838 998 92581 126171 -101200 -60474 80011 139195 -54057 78604 112155 -286957
23430 -287019 38185 -41140 246368 46830 218228 57615 472114 36020 -13314 77479 -266396
23418 58870 381925 -109684 35322 -149248 -299750 -346 -128289 89746 196529 298214 -84304
23406 68671 -483439 189834 188194 -3260 -99081 -141266 55641 133733 -226917 68025 82984
23395 82984 -52045 25652 -63002 -4583 -173411 -246445 -29208 -131879 170036 -29983 17475
23383 67827 -79755 189398 223613 -140404 -343599 -31042 132267 265734 197642 107638 -218115
23371 -57266 -39037 -147389 9187 -216321 91224 -68814 -442007 -54242 128810 -18973 -113222
23360 -113222 -1285 -335273 -92975 -103072 -83067 42070 69802 70561 44501 247199 -22222 -136425
23348 -136425 47554 146395 -272339 -75754 91603 119557 7799 208282 -57644 4517 -193034
23336 -117480 16057 -443223 148937 -111361 -22736 -32980 -257893 -199000 -87560 -277302
23326 -277302 88081 151145 -19954 -200742 173510 -30306 181944 11663 379830 149787
23315 63363 -116830 282379 -213501 67243 135735 -97705 -174241 -169875 160090 -82249 -59700
23304 -59700 32314 -32683 -233565 73884 -211464 251909 179218 71354 -146126 78648 -84923
23292 103805 -116152 -32063 38911 -224988 99815 2752 -40479 218245 -64302 194237 -295042
23280 -57539 -74281 -190791 198112 -105419 -83543 2206 -201672 -195154 164451 -95929 66989
23268 155868 -243102 5062 -4773 403882 294272 -99039 90911 106834 254001 120604 -48235
23256 -81276 -293796 -11687 171683 -80136 -183698 -267708 233607 -12330 46408 183884 -9996
23244 -4422 -36439 -115798 -163004 -89099 -110611 288691 -61583 -343329 101541 -54547 172472
23232 369598 98957 337754 -115082 -165954 157625 -127127 -17684 -177367 -101610 -4610 213003
23220 -154299 -184325 43695 -82483 -135056 106531 -18794 70121 114378 98222 -69887 99053
23208 -57530 -83214 84770 70717 234809 132665 231282 -195198 -148497 -83181 5634 -212280
23196 -195825 315292 13078 -4229 -289031 -125870 -29526 -198826 108729 218537 -382135
23185 -76724 -191535 -301766 65779 -351660 228271 -69122 -76420 -195725 -92017 -289259 84457
23173 -193782 -51101 -323676 122603 -79644 199780 -164933 -67814 91147 56051 -56960 102137
23161 18798 -158626 -326093 -168663 -175379 271385 -16611 -65065 59640 -32627 40657 -74078
23149 161463 -199696 -50741 -71773 -216188 -54246 104791 171912 -398173 -191779 -269597
23139 -269597 138897 -12377 177033 64989 -264169 -99220 85796 -101975 -215649 -125397
23129 -125397 -173371 188395 -203818 -39755 -126457 196232 -205553 -135740 197440 443980
23119 443980 253326 216248 -30173 237557 78228 41146 11967 307047 138577 -228445
23108 -341368 -457320 -21725 -48264 -127910 139926 122372 170319 -30540 84257 -7838 -204589
23097 -204589 357661 240741 -44 128538 -108282 147780 330791 -301862 88997 -255555
23086 237427 -58484 -131503 59358 -116180 -108908 -41173 -232842 90242 116269 39292 -152818
23074 -156687 -11491 327461 -210883 -174185 -2821 105766 41372 247410 -9585 50300 -117164
23062 34173 190121 -69352 130488 -241501 137752 -180336 -58791 -45837 -12556 65414 -195641
23050 -51727 96120 -44468 -48186 -205468 -127554 140664 3868 -229008 89893 -59398 -30753
23039 -30753 -47888 30520 441464 -209926 -173261 -197176 47055 227356 31533 197370 236469
23028 236469 3472 -27808 123976 -147737 417130 371425 455050 -33392 51727 -258866 39495
23016 14645 111519 -96443 -311585 -176306 -178887 -73482 -271756 -89201 -90461 121991 167248
23005 167248 43563 -112092 3078 187202 26113 158641 89793 -103647 -170075 259541 -226222
22993 -34393 -291230 -64418 107277 -57882 -432665 -120343 -106390 -408498 -79684 -491723
22983 -491723 -142387 -168983 151737 176204 -173398 -179221 120204 -146232 -106343 -159724 41760
22971 239674 -187585 26840 -112125 -164228 -49078 18491 54439 120660 131236 38074 -108094
22959 60725 142840 88058 102608 117100 140547 3339 56341 -53480 -85239 36377 -121682 -427121
22947 -427121 -247653 -112935 26130 -114883 3595 -50849 -39282 28574 68336 114587 -202286
22935 47174 -86724 -22777 -56100 -44652 8223 217523 93473 170917 23192 229683 195442
22924 195442 50482 -69230 80934 117128 -116128 -173640 67846 218311 -163554 -109425 119941
22912 382357 118414 13554 -29819 -56682 8709 -141141 65400 -116447 -66408 -49094 -138264
22901 -138264 20786 -373701 53074 -51716 -45164 326134 -15465 -284354 -301515 41775 -71060
22889 -241937 260068 -10296 -15914 57474 223716 127675 -100934 -279029 183730 257361 -42439
22877 59741 -38970 -9681 -55085 -272300 -12141 176780 150271 3697 -161773 -261433 -37360
22865 -90585 -212587 110 -135647 -491300 407621 -439181 -42893 -19098 69768 70160 -201618
22853 -91683 -249457 -37628 274757 -156401 46335 -592 -279191 -187196 -63793 130896 171688
22842 171688 282826 -110854 -19118 -144429 40346 -95415 -292393 -79645 99672 -70850 -16413
22830 144361 -37629 2767 126486 -24884 -108647 -394491 -36832 109499 -276744 31206 -566837
22818 194189 164500 212649 -151471 4905 -104602 -22184 38163 253589 -217562 -54517 -139899
22807 -139899 90644 -87105 -347113 212220 10289 -88404 -62375 -121479 100944 142047 -122899
22795 -81354 116118 -65600 -27776 35577 -245052 -87033 -162707 -139029 -13176 -104590 -67627
22784 -67627 195817 -110510 -55693 -334624 -82592 384732 202063 203325 -13515 -207926 -20829
22772 46861 -267212 -198188 -151400 -14331 77467 -206746 -246727 56894 80933 40342 -152501
22760 -73430 -252828 30623 131108 31260 -121173 -70177 -62462 21123 83503 -9914 -56455
22749 -56455 -14975 147964 -245583 201344 116897 180010 -85096 -84641 -307398 -30423 -94915
22738 -94915 -186204 118291 65249 -194181 -44121 -35023 118450 -119188 123433 123730 203067
22727 203067 33620 278587 -34616 117028 -184801 -246295 -28593 108936 -179642 -288161
22717 -288161 318704 -192629 -76148 -79740 26862 -14053 -434327 -59586 -36373 -104932 124892
22705 -129219 -388486 58198 -270130 -25032 -35505 178424 -194413 85565 -46215 -119044 61645
22693 -34415 -190481 15237 102673 60722 118521 32581 -123672 7718 -21444 296259 -191267
22681 89722 -238036 -36014 222351 -390298 -298163 146312 -387296 68743 -465069 -145749
22670 50804 19750 49995 -140895 2239 -292806 -81980 -118783 -207470 119444 160232 -233027
22658 214642 -100108 39284 145958 216247 -19482 -255494 -160839 16067 -114306 -96022 298025
22646 33386 71808 28407 28172 -240760 -5900 116911 198421 -229210 249837 207146 -205805
22634 -159659 39506 -173174 -56580 -216236 -37339 156568 -156116 -158254 -109858 -180569 61333
22622 -42263 187357 50473 52374 -98856 55094 39698 -132355 145590 -160304 25062 153685
22611 153685 282470 -96287 -125397 135724 272684 79579 -167191 -25044 121051 -78245
22600 -137683 -496027 -104695 -356411 50159 -97134 -215286 34668 -189519 -86806 -67985
22590 -67985 75216 237154 69397 458300 -83632 -95246 171737 30897 137997 -107639 -202272
22579 -202272 -65192 -9020 -51576 100047 56949 124279 40955 -375328 -208199 126524 -112455
22567 148254 -174572 -31235 124852 363535 -32267 -125013 239440 -153071 18134 306517
22557 306517 -224705 -18922 7661 -136927 -40379 -192256 -142841 56786 -158791 134481 -35984
22545 -143773 254003 82288 -274086 -316914 203246 73506 -168038 -299994 -355266 38951
22534 16094 -14806 -105009 32879 96049 77741 41611 191909 -178428 268556 -231979 84040
22522 -141533 122226 -238571 105692 -121216 3569 -20974 -51657 -2450 -10696 -192046 -16319
22510 -53896 -40259 142852 37371 -247459 -48691 351870 41163 -15930 -105741 -24390 -133843
22499 -133843 -177764 -224963 105268 239385 150400 -106058 -43436 20742 -91051 124486 4169
22487 -97277 -115782 56862 -352882 -220664 -235667 -212562 -353071 303959 -89602 -25742 -46527
22476 -46527 -363245 -195979 150579 128710 -229921 -239004 17964 234585 -158196 -127126 89038
22464 235153 -48850 -302357 120612 -223974 20934 -123769 -59802 15842 -105862 189820
22453 -439246 64502 -214408 140304 136962 44769 -50195 149766 -338205 -261739 -211015 156654
22441 -183160 13755 104365 251257 -96394 113223 -212303 -131809 290694 -208874 106167
22430 -22124 -358674 16491 19199 -281315 -6124 -454638 -266045 -156695 -268838 -290232 -61357
22418 222687 68762 -37377 -72674 61556 20644 66281 -26219 151512 -436652 64207 -75318
22406 -383915 -58635 117370 -45319 -85533 -64731 114144 29684 -5537 -205267 -324867 235906
22394 -80892 -225449 -5999 -144462 27378 220246 313877 -211354 49074 15781 317305 115626
22382 -234610 -166479 119156 -158262 -258218 -208957 17160 -108381 -474 864 -180469 233668
22370 89396 161669 -188993 23452 -316404 -114594 37038 146838 127961 166329 253286 85021
22358 304715 -175792 -120881 21081 191618 -79355 -279076 -70401 131368 33143 49364 -433
22346 -226608 -16448 -121599 -6693 110266 -6087 138312 -34783 128131 264182 204003 38271
22334 -33461 -61077 320267 -501629 -99534 -159163 -227634 28346 52309 -160112 -136040 110159
22322 -96913 -30320 47601 163265 -66681 20838 -91492 -15683 160039 73529 -60446 68232
22310 -117282 -29333 -381122 -43112 58716 -210245 -128580 -199810 -30298 -116140 -24515 -155054
22299 -155054 71620 95622 73971 -90765 -274483 97963 -85442 -97648 173488 -58552 216474
22287 -100688 -179662 258638 151903 -26120 946 70791 40598 -166080 145376 -197293 519822
22275 181238 -81283 131713 -401751 -343636 -26512 -452918 -136872 -44995 24579 -149540
22264 -443679 72936 -231223 -6270 167280 -93783 -142672 16244 -74426 -355587 211710 -205687
22252 -95306 257416 25862 80323 -48515 -325952 -204413 -156147 -81818 -160939 -177851 -21280
22240 10060 209652 55306 -240349 228952 79608 -31865 -323405 218910 -94860 1162 336546
22229 336546 -170808 -12351 -143676 309630 122518 75606 114509 -243148 -37083 -122244
22219 -122244 -2942 69442 74236 208689 172900 -41973 185776 -41725 -482037 153371 -191403
22207 -234418 302546 142874 -149390 -32632 45564 -268479 38148 -246712 137204 130282
22197 130282 -219369 134555 151167 -232023 247012 -116270 -188052 -73260 167699 352581
22187 352581 132948 18449 135667 -146400 79741 -152961 -3623 113432 -62436 -246128
22177 -246128 76076 29455 2913 -235798 -90907 -119454 193045 -186578 -27568 50148 63085
22166 63085 133191 371 84293 162144 -114462 -46847 -143635 -40056 7266 100935 -146686 -17260
22153 1176 -42895 209447 258971 230731 -148624 -45888 -126353 -93805 90984 142014 72125
22142 72125 74706 -134489 197812 -167310 -13470 -135224 -261170 185150 -228655 -77083
22131 -148725 -122717 -123149 -155672 -302136 -189046 -18139 319476 -47866 123877 75633 -63152
22119 217173 353950 -417044 173796 359565 124632 103208 98360 -311724 -49558 -115137
22109 -115137 -179539 -103483 -75968 -134992 -192041 20465 73801 -140985 -231430 58767 -150446
22097 -80154 179960 35490 -26569 -81591 8328 -129968 -93685 -139693 -57479 -50066 -78545 -229404
22085 -229404 132950 -14191 -172781 257410 119110 -30582 -134223 129060 34256 95170
22075 95170 -63388 -585189 141710 -182538 77355 237311 -264625 -167876 -63860 18390 368720
22064 368720 -213833 13522 -110935 -21355 51139 -135320 -80137 257338 -219903 -194249
22054 -194249 -148312 96569 165631 13310 -24984 -253556 -95186 7628 -254618 -258969 -94317
22042 42072 -89971 -144002 -54105 67838 -39680 -227598 61695 184383 -253653 -72433 168348
22030 42221 -207172 -168784 -157672 -55133 125071 -79537 152565 165543 -74688 113233 -229306
22018 -11884 -168221 -274974 -232544 -116355 -11060 128844 -284750 -90220 -31084 -61429 -126582
22007 -126582 -171014 293051 -29794 -109325 -85407 -43390 -259956 -253639 -218147 -10493 142941
21995 23986 323816 74898 -146923 61344 -250094 -40157 156684 -119579 -62708 -123860 -332229
21984 -332229 33785 -265339 -79587 -47881 -126475 -47888 -1804 -44419 -96689 236534 -143496
21972 387570 180635 -221299 142361 82586 -157881 -270343 2744 -334832 31249 -240872
21961 -180619 -32044 88910 -112774 -87245 -75920 -237710 23125 -223956 170153 -195174
21950 -368319 -303225 -28783 19295 -75524 69565 126143 -73593 -28530 -24020 277602 68316
21938 41173 250206 219456 -225744 47418 -174468 -59236 -93113 107409 -167793 293433
21927 -335346 -57353 94523 73993 202763 -385929 24510 -127777 118069 260745 -128527
21916 179391 -390120 -156468 81099 -56791 -19728 -171512 -184871 201655 185194 -138826
21905 210267 84868 122070 9069 -7248 -120387 -4812 -396061 -3981 -120004 -34208 -218470
21894 -218470 -485650 108291 -17327 -147189 -111945 72406 -216372 251194 -196354 -193309
21884 -193309 18908 -25486 15561 192392 10406 -69224 -140820 -38225 352840 -239366 -201857
21873 -201857 -225475 138387 49291 71188 -363980 -538667 -67849 -295806 -217539 -252947 128768
21861 -28730 -155404 163423 -105644 -24711 216760 165904 -200610 72485 -106480 -7142 -79130
21850 -79130 -214088 -222518 216432 -206486 -99520 283700 123762 -7822 207555 117893 302862
21839 302862 -123915 -228568 308915 134589 281715 85547 -129339 222134 -332004 -9230
21828 38954 -133973 -248434 -90615 28756 -130789 -20845 -5620 -245064 -139915 182549 -102122
21816 71916 74567 -54758 39081 -115779 -100391 115428 33662 -248194 145779 -267111 -101336
21804 58377 -85772 -721 198129 -89271 92744 37103 -161841 46050 -14158 38755 -78760 -276291
21792 -276291 -196137 -24086 -68973 202224 44022 -214177 -72274 -93996 -25688 101082 77587
21781 77587 -201642 -241883 -149765 -105717 -228634 -80402 75467 25067 -59223 -150835 182785
21769 -82947 114 99147 -61130 -357419 218045 -77591 -123768 33698 -166351 -13504 -281303
21758 -281303 123466 108398 201900 2577 -180386 35617 -184384 -25590 -397028 -8543 278714
21746 -45095 164211 60753 135986 154041 -56620 53315 -328474 28670 -167139 -127666 75481
21734 421082 29643 60469 -172583 19632 -79105 -150491 -37726 93464 323005 116065 -36985
21722 -24839 -118424 -205107 -121312 315596 166548 -135399 187619 117288 159385 68958 146134
21711 146134 -70943 -53804 213497 -140149 -240171 -265995 51442 -47773 -129893 -155409 -43102
21699 129096 27605 -114343 -82732 18561 -112791 146857 -165349 -180603 -186965 -110924 25572
21687 366295 -113410 -159695 -15194 -128932 132015 -143005 152831 -405621 82066 -458238
21676 -168752 -270951 -27676 -222411 -334338 -276214 -112118 -351021 10878 107776 5193 178542
21665 178542 -169452 -85083 -130290 -145332 -174472 49645 -118762 22372 228877 37899 -207759
21653 -209725 -182075 -406404 -128915 139753 -265972 -69067 81908 -137805 -77859 -103976
21643 -103976 328612 -73463 -123176 -20655 -170721 -294229 -294396 -104272 161832 -85899 -165764
21632 -165764 -205603 -241924 -180218 -124969 -240403 -126847 10278 33013 -14832 146552 73078
21620 133059 106916 -17483 -43926 -60671 -199586 94685 -262612 -249504 17629 -65476 135828
21608 88929 327582 -424213 2593 174443 119275 69637 -191011 9640 -140771 18575 -142167
21596 -161320 -167961 77809 63217 -68725 133620 -139562 -115666 129052 -142496 -19370 -154788
21585 -154788 -237671 109444 -84281 42281 -2381 297028 88471 -30666 -421849 -25164 -104136
21574 -104136 -420193 -186900 -57490 -153820 -86043 158522 -302395 52191 -98122 -261410
21564 -261410 -36724 -201275 -34937 -82888 -162196 -128614 -50090 -75610 -146707 -252934 -112853
21552 -123710 43558 -167190 36116 88916 83643 28264 59844 153616 -97852 -56348 -304805
21541 -304805 141648 22269 77891 -79324 30736 -26502 34350 -289551 -263169 221057 -108281
21529 31109 129691 104638 147522 -218144 -36144 -144889 -206571 -161377 -175927 -108708 -64265
21518 -64265 300459 242547 -260128 64448 -436036 -200675 -459830 244845 -88692 -197837
21508 -197837 217055 177224 -289672 29408 -240780 85172 -253911 -49744 210135 139352
21498 139352 -26746 43955 -82523 179001 -16237 -350534 17680 -33813 -76034 -100833 -243636
21487 -243636 55968 148929 -33364 -196532 34446 -117887 -88871 143564 -205953 111960
21476 -291954 16030 255132 -104728 -177510 -59690 299713 -310360 -279625 -61744 -166402
21466 -166402 -102148 -293171 -29047 -111133 -82329 -194448 255533 -197117 -152229 -284018
21456 -284018 -210542 66946 192803 270263 217065 294121 16905 -204489 -138948 -42633 -117474
21445 -117474 -3993 -40569 138243 -328466 140714 141688 381484 117086 129398 152933 136829
21434 136829 178408 53351 160070 108224 -115070 -128717 -176484 -294319 -37263 -24527 -171616
21423 -171616 -158612 -80535 188895 43133 39373 -205342 -28870 -170183 5365 -148267 -102003
21412 -102003 -263782 283 158319 40357 -46526 4211 -137777 -487340 -28537 -67769 -73050
21401 -73050 141597 -260162 43960 215636 -179659 -135593 -199179 -181095 -224387 -93086 102191
21389 -241243 -441617 -119560 12842 -245 -206835 47945 29491 63828 142544 5869 -78968
21377 -117437 -3115 -110095 -487088 83520 219265 -150791 43916 102150 -135998 -99492 31764
21365 -139206 127961 -37839 -109679 288027 -193293 -66525 -249368 -144376 -57138 -163562
21355 -163562 -334394 -3043 -46890 70813 -121817 107678 269559 187160 -133336 -120638 -227894
21344 -227894 -185795 -209473 -198671 -135538 -67259 -119451 57123 -61717 9989 -116143 -71261
21333 -71261 -22678 -191894 -70822 -260175 -209469 -179015 83615 60245 202866 -97237 -141228
21322 -141228 169582 -69651 219441 -179265 -237306 164008 220515 106347 -117158 -78762
21312 -78762 111159 -365946 75943 -203253 -206394 65566 -20754 57096 -339450 -173638 121502
21300 220262 164850 -181018 -192489 -205254 224906 -90371 94026 60930 57126 -24889 96664
21288 103271 -4067 206584 144490 81904 175530 -78659 154456 -444421 -75771 -234368 100312
21276 -35936 159153 -99029 86919 -218422 -238762 -263440 -17528 -199611 23287 -61123 329427
21264 -236408 -379914 -112972 -139828 -95230 -257383 -136863 -103895 -222851 145194 169587
21254 169587 -253198 104577 34840 -318144 -12877 -58724 78266 -203331 -274146 234928
21243 327440 143867 -88739 325877 -110701 142978 -137388 -82943 -263029 -28526 78809
21232 -413412 90953 35035 461352 124953 17521 -19855 -171171 280608 -149464 -22242
21221 -94434 -200557 -28213 -163308 -135953 61204 19216 -58683 55860 380436 80032 -129578
21209 71346 -114435 44016 14530 -319867 -79223 173948 70913 -53814 -481816 8672 -355116
21197 180940 -123396 -59789 -1534 -195325 245312 -46325 96392 28459 -242026 -412863 -138670
21185 -35190 385112 -101502 47354 -210202 313816 -28834 -13307 -96753 59945 -117099 -186654
21174 -186654 -44868 5201 -69162 -138310 -73452 -425058 -38834 272914 60090 -41232 81462
21162 -31082 -86660 -219167 198509 -209621 -454832 -74536 39050 -82466 -55290 -95734 81517
21150 -311236 -116054 330431 -40451 -27582 -93505 -207300 26637 -172454 158647 -319622
21139 248869 -222572 -233167 -165810 225537 89282 127412 -114647 -60436 -1676 -151043 -166231
21128 -166231 66056 -38493 89348 -223128 -152205 -391080 -251200 -218273 -33056 102394 -21767
21116 -198333 -364461 128727 -172364 -129684 -152392 173485 -388387 79625 102400 -59563
21105 -55203 197575 123741 -12868 82848 -78395 196769 -20235 -78082 -272208 -241872 -43025
21093 -314656 71322 -96904 -36531 -47752 230347 -329665 -136533 -121725 -153175 35564 -245214
21081 -26202 25872 -220964 -142801 50339 -113002 -48814 250423 -206867 27063 -52600 -8888
21069 90811 -201007 -60480 -6152 -199511 2124 -56720 206179 49358 -76511 7010 36938 -142049
21056 136432 -248895 168435 -232360 -183834 -104974 191405 -215646 -52028 13690 -67594
21045 190380 -137493 15908 -76075 -383228 -131448 -75786 54814 221971 31238 -26392 -31198
21034 -31198 154765 40211 -105552 10155 -130161 -192171 -47584 -34340 -164222 9660 186601
21023 186601 -117704 -2502 139342 -188637 90714 111144 -49296 19817 -35221 -17179 4278
21011 -110658 71291 797 41334 -198257 -285959 -58019 121780 -322013 99256 -71943 139072
20999 -70271 -221842 -2230 -166713 -200978 -182855 -137887 -25352 -333365 209589 88762 337259
20988 337259 166124 -46593 -322774 82784 117074 -200687 53001 -88672 -180278 122285 -208345
20976 -38772 -99461 -311349 -138587 -60997 44926 -120913 -315770 -238990 -111770 85905 -145305
20964 321246 211566 -51956 -192585 1810 -5396 -16619 -72196 -47229 31154 150559 -309010
20952 -57030 8248 -102840 -265665 -2159 -25605 -26615 -355180 104709 -132279 -117616 50044
20940 29528 -118841 27630 -80152 -80272 143053 -108619 98510 -387542 -28587 -20585 85627
20928 -28278 41561 -121390 240129 -147311 -2475 23974 -249560 126007 -29737 -39685 -213942
20917 -213942 234418 -51864 -153826 45818 242915 -386172 -4089 39303 -132614 -39662 106707
20905 -296511 -394531 -22238 -251179 -173720 20845 -59314 111335 -42775 -10949 -152331 63967
20893 -9677 185798 34392 24079 -65506 14472 -79117 213718 33035 -36362 -370270 -37797
20881 -86254 -195402 -233082 180878 129311 1514 -121821 -378477 -242107 -394156 -85218 11182
20869 -171262 -292960 -110890 20548 -72012 -359783 -135923 -146150 -413887 117090 -27344
20858 -252030 -342423 30187 109096 3544 -80084 -268915 -56643 109089 155509 130785 124022
20847 124022 101778 37077 -221564 -17887 40002 -22626 56116 -40731 -96300 -142339 -258675
20836 -258675 -109045 176157 64188 -261192 -17919 -393960 -130664 -10554 -124241 233275
20825 -363422 -275660 67162 -111687 -23895 -198778 -243940 -51914 -16233 -166044 21941 -222175
20813 -13581 63965 1619 106520 155720 158926 63561 -12186 53878 -151873 -252671 -88758
20801 -21582 297010 206317 -232956 138874 -169680 -157412 69401 -107327 -198244 -97335 -188187
20790 -188187 -328554 -79934 -258237 -14242 -189754 -68995 -22135 2277 -142135 -33392 -66353
20779 -66353 -29451 478070 -53902 -83715 -96670 12294 231751 -76910 165814 -49205 102571
20767 -104070 109312 -15096 -204719 -18431 -242286 -110650 -93699 -213289 66015 7488 -13584
20755 -63330 -2741 -91399 9715 -58587 120228 -350399 59256 -51723 -133032 21350 -104876
20743 -2542 90142 116937 -173965 6651 -32406 196977 -82914 274378 70283 73249 -4263 156269
20730 263796 -211438 107673 110766 -16231 -139386 65208 -300656 -125470 54213 245301
20720 245301 88698 364307 -157956 -102620 214734 122899 -232134 103300 -84869 -245013
20710 -245013 172977 104298 19019 -239714 11544 44499 14051 -431421 108589 -113513
20699 -173817 28372 -249455 -282964 50213 -331928 28181 -116149 -160906 -122237 27122 -224813
20687 -203493 -198473 -503225 208073 -137786 -292268 167642 -112300 62033 -44589 -299551
20677 -299551 137367 -79766 20050 182659 -60737 -15941 -237755 -15047 181992 -75613 -34920
20665 -88946 -179285 17912 -262028 99688 92964 156665 69810 -71875 -85742 -31741 -55040 -30038
20653 -30038 -198600 -43416 115348 -133566 -186141 -290335 -85889 -347115 474782 121707
20642 -127628 301594 -8664 -175637 -151713 -493753 -131180 -226514 43557 -515981 39758 376262
20631 376262 -226413 -205794 -94291 -152055 -119795 21724 -48270 -18194 -103703 53331 40593
20620 40593 -67543 -289090 -50846 -174169 -233688 -429657 -355676 73746 61642 -16308 25841
20608 -150252 236671 163978 -39610 62327 -121202 137024 168806 131829 139743 417723 -408992
20596 -7472 -3775 -147473 -50761 -148145 167429 -405997 -171119 79075 118693 -397500 -18169
20584 -238824 -218311 -52488 -98295 121830 34523 375022 50541 275660 83715 168253 12265
20572 208693 -93018 106140 -64597 -16133 -114535 -130330 -248107 -132756 12108 63950 340841
20561 340841 87361 44807 -122328 -14524 -104497 -167666 -31060 79429 -158695 -331049 -67435
20549 -217305 125968 -97965 -116018 -197479 -158728 51212 15345 -309146 -112662 146555 -138391
20537 -115605 -8108 -226486 183052 -56309 -147043 -152378 -527259 7672 -111898 67254 -317641
20525 169793 -74696 82302 -15489 -333883 -17130 176019 27899 400678 -64929 17324 -96304
20513 205461 84758 -345493 122306 9353 37298 209988 73996 -339795 95349 -181339 -103286
20502 -103286 -326297 146213 115381 -139800 183539 16684 -85877 -58474 -101048 -99859 66863
20490 -52613 -98945 -172936 50640 -131382 58033 -515656 -41775 -221885 33911 70332 -351325
20478 42918 -165833 -122319 79879 -101974 -238637 -131565 5954 -241449 150266 -205272
20467 -283244 -117239 -273705 30596 1676 -59663 24745 -120113 389179 365251 -54201 -23536
20455 77147 -11068 31064 -47923 -150554 -247802 -293428 -217773 -229486 28703 -211364 -264476
20444 -264476 -181719 5095 177387 -418493 -18075 138673 1399 -133582 109219 -115766 -134397
20433 -134397 -167115 186870 167365 -105409 223190 -118236 -314857 44467 -5130 34436 -286227
20421 -123042 227159 43774 -19622 -115614 26252 46251 28216 6956 -9248 71323 24216 -105381
20408 -140587 196008 -110650 -222429 -251250 -63796 -216020 -22788 -115363 -73282 132894
20397 -177093 -53564 -232947 164795 -66462 -325523 -14840 161388 108002 -428182 -54580
20386 459848 -157334 -213680 -103152 125941 -148363 -247390 -11514 239343 -52897 90785
20375 212224 -175863 -173596 -49046 154246 -137390 48570 18577 -338465 -109611 -59995 -137155
20364 -137155 -36017 -304470 129743 -242393 221871 68013 178264 75582 -427816 -21773
20353 -165604 52047 -32103 133866 -143413 -77527 -167025 195824 -438264 -367738 -43385 -437472
20342 -437472 256895 166308 -74613 2477 -291892 -298231 -57595 -53652 -44762 -52010 -224805 -279361
20330 -279361 -244718 -327399 100285 35624 191154 -211514 24852 -7133 -59711 263292 221486
20319 221486 -90924 244099 -9488 -137552 618 120456 10264 -278500 170514 -450920 90106
20307 -103686 -245712 193402 -241444 -125360 -133089 -13903 -61624 -249685 -121599 -151054
20297 -151054 15807 7157 18924 134725 287880 -44410 -338241 249492 20781 -34516 -161242
20286 -161242 -126774 -202536 119885 -13845 -418949 -168017 49825 -118401 -112692 -344252 155662
20274 -391545 207581 -80410 -218507 -57189 -18172 -59135 38225 203191 -50428 -10363 -183281
20263 -183281 -83303 -159572 19029 -41882 -155867 32555 231152 151613 -233191 -186330 182817
20251 -403107 -130871 -175867 200106 -65197 42206 -103473 -311538 -70504 -48064 10245 -67843
20239 -61290 160804 -317507 -47925 -21063 105903 -96048 89675 -171294 -34514 -267793 -6994
20227 -125194 -278346 86448 -105760 278504 38795 132816 291350 -96621 -302679 49477
20216 -159 117362 -236044 8578 -104565 42806 -258740 -211538 -349661 -6553 10307 -50214
20204 -126468 50596 -60458 -65592 -27854 34532 -280701 -274341 133337 -146296 -272264 68329
20192 -47743 -163479 -226241 111922 -121399 -37370 217740 -49033 237380 -466943 -209572
20181 -226381 -12293 89085 208207 -64905 155733 -191562 -45048 -41453 -103332 -68168 134748
20169 103322 -66740 -69313 -39 -22060 252707 130771 65588 -41805 -69150 -92488 -138032 -100645
20157 -100645 -7722 -66888 -70691 -23336 -60500 -137639 190971 -135870 -242853 -196504 -138712
20146 -138712 -5348 -17961 -70708 -174617 -138663 134427 -139117 -314681 -69591 173368 205931
20135 205931 113218 106005 294950 -114658 290545 -134998 234400 -318138 -311427 -324403 101810
20123 -248632 -163278 281796 -94265 -93679 -51977 5996 23883 -29679 -262664 -129134 -237632
20112 -237632 8416 -253395 -315397 -141297 -156976 -193034 -111681 -103133 942 -4233 -141074 -223631
20100 -223631 85269 20516 -101543 90257 157108 -209717 -4786 95763 -96691 -54827 -166542
20089 -166542 95793 141769 -333985 289703 222683 224437 -102917 10557 -77308 -97377 19211
20077 -218229 -206506 151349 47612 -13092 262925 -32573 137618 -203610 -147996 -205704 -27614
20065 325702 -287407 -367843 -267276 -46609 15665 -155698 -15361 175000 186944 -207319
20054 -129823 54438 -95658 28160 -23060 40361 -91021 -193899 -271212 -4715 296622 -133494
20042 249259 6353 -122834 -3959 183074 -152804 -122553 -298244 -77085 -157966 74174 -4033
20030 11288 -298460 -161631 -147147 275248 296516 -215284 -155880 68008 -44919 -85422 -149606
20019 -149606 36957 -74661 -139307 -2508 -349039 138464 105031 30033 76789 -333483 -100027
20007 103519 -113733 -32700 -59251 -178536 -161067 140930 -148038 -182964 -258976 -57225 159065
19995 -3625 -193488 -411240 86197 -1384 -54650 -414867 229837 -173539 -127917 -110636 -256619
19984 -256619 46606 -79532 -109303 7805 148880 86872 141410 -69189 -61476 -17544 134964
19972 6224 249369 2450 30256 -187581 -23601 41158 66056 -149976 181697 -135358 -256229
19961 -256229 -85430 -93505 -49538 -202307 -257980 -318967 -216540 254491 -13521 -94470 36105
19949 -64864 -160209 -96762 52927 -177716 -257038 -119783 -149049 -122275 -221173 -34876 182265
19937 -152968 -281866 -25312 86088 -119109 105841 -65062 -284264 -24333 241664 258680
19927 258680 -70267 141956 167002 51111 92462 -154253 24563 -304596 -196043 -105291 20260
19915 2780 57535 -209885 -182134 57069 39427 -196077 -384214 219739 100609 43882 -258302
19903 176042 26138 23133 -144563 189244 -231982 -53106 -173285 -55913 125998 -137141
19892 -252941 154968 109899 5790 -176679 -54377 24468 -281482 -236487 83168 92253 -44522
19880 83385 160367 -338713 105166 -275274 -290995 -29057 -14051 46025 -202681 -193860 9274
19868 260863 -214903 -61592 45154 75617 173234 -348357 -153754 -252577 -245407 172489 -1336
19856 -101427 448609 -266164 267453 96039 -73863 337207 116810 -334176 -14459 78346
19845 33253 -605651 -120527 78384 110293 -30293 -99036 -268661 -299433 111343 128836 -226115
19833 93825 -371777 32569 144658 236413 101458 10048 -307421 101216 -198633 -74707
19822 26888 -12122 -248780 -44709 -326529 -128049 185141 -130700 -292963 87940 -249986
19811 -155436 -89528 46685 -335705 -163114 213722 -193599 -277745 -134411 -117531 125048
19800 -204217 103158 -131290 25143 -449223 -8164 -4867 -356233 -59918 2736 101580 14593
19788 -361097 -343784 13437 18217 -360883 218698 -77884 -126430 58943 -274441 -14022 -180455
19777 -180455 89184 -5140 33954 -33160 -57781 48590 183340 -152703 133678 377081 190247
19766 190247 -172909 226479 215258 212981 -82522 -153822 83578 -81806 -67703 -4705 48350
19754 -88805 -134699 -131753 648 113295 19692 74802 -30324 -249161 -7399 -8125 22792 -234151
19741 30971 -2727 -244791 -214111 -72314 -270568 380726 -121831 192565 -124506 -275156
19731 -275156 -158572 -193137 -15861 -6694 173994 -282241 74850 131798 -41970 178724 -207702
19719 40236 -75940 187444 -156508 15796 -167388 -186379 -292626 63396 -62333 -257646 -221865
19708 -221865 4310 -238434 -140961 -429773 26215 -4994 -519972 -11581 101135 6684 -228401
19696 -334634 -162103 -48764 -205960 -125426 -168960 -86255 -61612 -298623 159136 -192237
19685 -234858 -179390 -155243 289196 -261334 -23607 31572 -96331 -183498 -31334 -161122 -82084
19674 -82084 52008 -61139 -354875 -10137 85340 -294180 -259713 -17333 -165119 -108639 113186
19662 -339152 -169294 20007 -51517 -57871 -254993 -446160 20011 -148489 161458 -268549
19651 -207707 348551 -120894 -386585 -49935 -147810 -391225 -287216 -340240 -45698 66408
19640 1731 123676 127496 174315 -76881 -5118 -138862 23501 131862 201474 -19213 153785
19628 20670 -206947 -335426 -143427 8967 -135209 -269788 -124239 160879 120718 -157435
19617 345408 171988 -200420 98913 247876 -166077 95756 -356297 7494 21267 -126795
19606 -7127 121481 -14382 -264559 -131913 127876 36223 -59662 3681 55580 -234314 154157
19594 -389 -87832 73426 200594 -308655 -262723 178123 -92465 -2530 23296 119659 -219279
19582 -6539 150359 148023 -271167 -127933 193076 -369644 -10005 -10529 37572 -141868 -236814
19571 -236814 109107 69196 -305248 262189 -15177 -2357 3716 -697 82862 120319 97913 54491
19559 54491 -190316 -117129 93340 250 -221248 89407 -259722 54534 -55034 -233536 -322789
19548 -322789 -1273 -129905 -269372 -167509 215316 103355 14490 -81218 111024 63880
19538 63880 119057 -10110 -72640 22791 141521 65937 -126486 -214169 217531 183677 122048
19527 122048 31393 104264 -39997 -270726 -81414 -465240 212033 -102794 -492291 211191
19516 151813 -169437 -103307 193312 -96157 246317 -131707 12211 87578 -217635 -367147
19506 -367147 -68805 164013 -215228 -240204 -126288 184063 -271139 -390023 -220571 209371
19495 -347192 -95277 186329 18941 -45379 63810 -93420 -288113 -335695 -82644 -317123 -299137
19484 -299137 -164168 -7175 -322250 -258760 -208711 -204874 -241375 -285010 -19813 -49932 -225942
19473 -225942 119277 -279140 -11384 -167301 -201504 -9355 -186252 -35943 57754 78968 -132151
19461 176971 266997 -156035 -96924 -117733 -95205 -175483 -176358 -233752 10762 324767 -253131
19449 -459513 -14461 -375148 80129 -132222 87949 285920 -73978 -157114 -167857 -214292 -40427
19437 65307 -245463 104328 -590125 -94174 -98920 168149 35737 28835 -90054 167854 -152871
19425 -40960 -158833 -11776 2649 -82431 90845 125787 -114247 -40233 -283720 -169145 -212768
19414 -212768 -54444 256106 -21973 -55403 -271895 62001 -170444 -192527 -139950 -117908 94113
19402 70704 242693 104277 -122212 -348502 -44150 -574686 -29303 -290262 -53892 10720
19391 -52610 57954 204817 89125 -128755 -110979 29551 220174 -260861 -127081 260468
19380 -407025 56166 -146499 -6517 84572 -362525 -185565 -262423 34673 172934 16791 -193080
19368 312002 172620 -142453 48240 86126 -223841 159966 72571 15736 73566 -256747
19357 -101703 147825 31622 -84444 161106 -119700 -48693 -270793 -153779 19061 -73390
19346 62638 16868 269610 204862 137469 -59104 -278166 -451540 -68514 -72621 120891 26703
19334 82951 -36945 65793 -127573 172512 -28580 -25605 249270 -204601 -171225 -19845 2743
19322 180 123509 -198926 -23405 -4316 -99566 169467 -61768 -14619 -188994 -177755 154471
19310 -30404 -12309 -88985 -72822 157489 -74441 -61402 -147594 1214 -123475 -117631 -199229 145000
19297 64337 -135333 215360 -7885 -113791 -12495 -248352 -154364 22826 -9234 -54131 42670
19285 -69301 -53620 -63752 84511 108506 -223697 -104357 130923 -370559 -171889 -224312 49134
19273 246958 -162250 -160864 -129078 -97557 -46501 -155391 -436320 -147807 66293 -144773 -232466
19262 -232466 24366 -103823 -151220 61056 -89746 -164422 157422 320042 -45548 114706 41305
19250 -330032 -76535 14883 -287599 110372 -66096 222958 -74811 42105 135718 -118234 -147993
19239 -147993 -143038 166081 -148765 -45613 30214 -270057 58868 -249194 223153 -524201
19228 -102742 205356 68531 -217141 -98776 60944 -174503 -252591 26937 -25040 -1389 310760
19216 -249249 -97143 145352 -135422 -93352 154360 -33687 -95346 -244360 26236 -222570
19205 -235453 152726 -57201 -181132 -209123 -129868 -87908 -39672 -18034 -199170 197206 -160971
19193 184683 -56950 -207379 144723 -422139 118098 72427 160994 -186202 -36846 -194662
19183 -194662 -26815 69622 345213 180900 -348456 -30125 12856 59959 -120338 -82797 -114687
19172 -114687 68161 -1610 9463 -39452 -264204 -212547 -314028 -185582 -154052 -257216 -14224
19160 -70959 45072 -141883 102893 -145486 -104371 -226381 -520601 276394 -278172 91390
19149 -68609 79946 -260509 84144 -322556 21228 -18104 -75576 -221720 -283427 -143254 -410374
19138 -410374 -173600 -320911 36822 -40185 -129194 157472 78674 -12496 -27354 -187164 43346
19126 -20984 -213686 350912 -161168 1425 83558 -238766 -39839 12338 145837 -86237 -72525
19115 -72525 179530 7416 220080 127391 -43054 -419821 58743 -53532 56312 -133297 -291210
19104 -291210 214898 -81059 -348791 130004 -262245 377711 -234180 -307695 276788 84691
19093 250882 47245 205494 103634 38153 260451 -179770 -67921 -147382 70145 164750 -534481
19081 -50304 96717 353 176511 63534 -55087 -116614 341258 -207540 -124702 -161698 -72157
19069 -154809 179710 125475 117407 -41307 100535 -28518 165642 -62078 126741 26060 254654
19058 254654 -8824 95295 -282621 -107437 -226251 107649 134081 -71435 164378 -32201 31901
19046 -66728 -52584 125831 -158274 -78742 -433686 -357714 -155424 15410 189366 -146802
19035 -58829 -74880 59840 73512 168029 226606 238873 -335102 -6132 -78285 -56662 -100513 38916
19022 -236380 158679 95704 125273 117702 117973 240690 -65780 -355529 -137116 -142948 -30579
19010 -19850 -170633 -207252 -312994 48239 207940 154137 -13625 154901 112636 -116984 34724
18998 -217590 -173530 -139623 -68724 -160609 -134566 398804 -233484 -173039 -45990 -25978 -310590
18987 -310590 568517 -52655 -196487 103850 -183119 -40068 58953 93551 -122431 -114871 -164327
18976 -164327 -123545 -167063 -13228 20808 50465 -211862 55515 85382 107139 87381 -218843
18964 -22270 -312265 -104109 -174852 67986 -77832 -157338 -133017 -362063 150326 -93976 78395
18952 -295053 -70415 -177456 -187376 -175762 -37310 -64684 -313745 -219148 -393916 67783 -198377
18940 -15096 -76686 77400 10231 32080 -120481 52149 143768 -134135 -37671 103456 -244770
18928 170586 251436 42918 138394 13424 -142796 -257707 -196911 -389670 -433455 184975 -16594
18916 -162566 68988 -123833 -49520 -187500 -202457 125129 312722 67962 -11254 -126963
18906 -126963 394970 -86374 -261604 -60974 -80222 -260247 -79491 128658 -188926 36480
18895 550782 49233 184405 -120557 -57226 -340248 -404908 -320361 178226 200857 287081 -75825
18883 27608 -284831 -281710 -43594 45098 302617 400999 -70206 107365 -193476 -28102 -73245
18872 -73245 -494443 215658 191517 104917 -264659 -153290 -160609 -13446 269225 53340 292504
18861 292504 -21163 -106439 -151351 237302 217545 102593 -237255 -386122 -219417 227392
18850 -117198 361361 -140473 107541 45509 84135 -26760 -296940 -401508 -4468 222337
18839 -102973 -206106 78496 -48553 237702 110906 167907 -334772 -198915 80617 -119910
18828 30574 -239657 -256865 -226896 -38824 -88400 23119 227966 -62600 -3302 -146395 328351
18816 111696 -161042 155388 234460 116395 46670 211431 83973 250612 259495 -248286
18805 48481 -4440 -311870 -290277 -177331 -100259 -335002 -550146 -209353 50247 80390 151924
18794 151924 14900 -112426 51651 -157249 -485148 272526 191476 132962 -450031 96034
18783 316063 -199407 -202047 -61189 -222306 -269966 -224540 215607 145799 -214131 145783 -20681
18771 168266 -4965 -54331 -93669 -315470 80396 20026 -168553 129422 214590 -40793 372157
18759 -223652 -39396 -12265 -73027 4895 -43763 -113630 31581 -78633 120709 277136 114092
18747 364263 74325 -26407 95312 -48160 -156607 -247479 69656 110320 -141008 -384364 -314698
18736 -314698 131462 -24315 -85403 -22515 -271506 141914 -178420 -82626 -214183 -371698
18726 -371698 -95789 -129052 -362824 -253931 -299930 87197 177517 222707 -242367 -4402 -22714
18715 -22714 -48851 -26372 -169437 214423 384848 23122 270653 -126866 -117256 -126503 -194766
18704 -194766 -35723 -3425 -28252 104877 -222219 -332780 -173066 -254604 143190 -194395
18693 150223 -299529 -292595 -2290 -151132 -58567 -24741 -278049 71991 -52932 -66826 238517
18681 55863 -246737 98543 34064 -113678 -189421 255865 -110409 -53132 105400 -35359 -25428
18670 -25428 -97508 162713 -201781 -163363 -114163 119562 -3122 -192627 -248143 -63304 25777
18658 130260 95024 -60261 280585 -156657 -84053 42395 80048 -363975 -232770 128704
18647 -166134 343539 154452 -183511 -5166 -53975 8112 270415 -20990 2253 -293475 -222534
18636 -222534 -205743 -74177 79018 205995 179075 -146810 -267926 -64334 -211267 -73485 166168
18624 196031 -298456 -182241 -137428 128171 61191 65931 -107395 -127618 -9199 -148109 -19578
18612 -175647 -262080 -62083 22459 -88634 109045 -22123 55693 559093 -54009 344530 -214270
18600 -60677 -94851 195305 -3715 -212518 -155173 -49089 20706 168060 -159112 97918 65435
18589 65435 44527 -294386 -7684 -281097 -9171 -39834 -20574 -417971 294472 191223 104306
18578 104306 -5741 -184372 -157173 -98495 -96855 -139809 49090 93165 -510608 -50339 -102336
18567 -102336 -46144 -153307 -176675 -310055 -146329 417 -62382 -425088 -209379 58007 -265830
18555 -120710 -276575 -209458 72229 -240029 -130851 -88948 -78894 117762 -195658 -8299 135800
18543 -172667 71750 26949 -83019 96945 156946 15905 126549 162782 148966 184563 -8143
18531 -209033 62952 -139794 -259768 -109146 -49972 253623 -123706 81030 47962 62255
18521 62255 -120033 -166056 -9623 -66689 71706 -57969 30732 -31238 -345525 140424 155743
18510 155743 106062 211986 10611 -130148 -198837 36730 18821 -362715 232378 -166496
18499 -56618 -28673 130709 110758 -156894 -158298 107842 -83643 7960 -81493 68848 36134
18488 36134 -276093 -17069 20495 -33706 -58262 -169439 186445 75468 168198 -188184 256848
18476 130721 -103531 -155278 364390 -144686 -223132 -152429 -84464 -273073 116549 -273857
18465 -416570 228732 -16007 -297780 -140476 -387540 -13823 73730 46219 -490785 -59425
18454 -96874 -137928 -117403 21071 -142552 94244 55957 -148089 203792 -546546 1581 175738
18443 175738 233034 -214727 -99994 -192944 158762 -121242 -106366 16636 57813 -16260 -124666
18432 -124666 -114427 -118940 226332 -394908 330357 -97743 84651 -124534 -213086 252397 313051
18421 313051 -515916 34112 -38724 -89594 -89910 132907 -128061 -33903 66731 -174288 -186684
18410 -186684 -74074 -10790 -2300 -347542 77381 -57173 -15420 34943 212058 72962 50487
18399 50487 17100 -122824 -40575 53999 -136092 -73644 53005 163653 -83113 -252846 -48341
18387 126299 8745 -220439 34969 82823 -116776 53656 -280419 120197 237295 -3608 64143
18375 98626 -128015 -294538 -407969 106456 200442 -86938 -154398 -186604 57986 48380 -237610
18363 126692 38045 -317226 -78922 -367376 192522 217165 -468500 -104990 59153 -26551
18352 133904 -8831 139079 -176118 314400 -335064 63108 -175989 -136933 -165027 -11921 177253
18340 77468 -120668 -153225 794 -334382 63050 -152955 -206741 230248 122049 10098 -146992
18328 352483 -122051 87138 70887 -229129 16636 98032 166088 -278467 85571 -97029 157270
18316 -222024 -350290 -54421 -167097 -3692 -72604 166705 68154 -104216 -66065 -63489 -145364
18305 -145364 -422580 113126 -33920 -566874 73181 -71936 -88918 -37554 -180248 -186292 -15157
18293 -105851 39681 160873 39354 -413 -124455 142626 145788 178851 -92806 260137 -85892
18281 185125 -50874 225894 -161387 -5259 121143 185327 -165950 5191 -203615 103386 -147551
18269 -236173 -98168 12988 -140902 191060 71922 -109683 -69651 -259665 3948 -174644 -275339
18258 -275339 -161459 -139755 -61056 -52049 41454 216204 202754 -130178 233918 -212500 -117327
18247 -117327 16810 -45725 129099 -97666 -249148 33478 98158 -114285 15156 -256204 -221415
18236 -221415 -30990 -67273 -239985 -56733 197998 133839 124630 25398 -113619 -87919 -172948
18225 -172948 -326122 224432 71289 63358 -6827 34228 86449 152487 -18236 298228 -110648
18213 -90217 125261 105042 -103810 10292 -123897 -246226 -193948 180986 71918 -199111
18202 332304 -22344 78683 -49964 98665 73855 -83406 -293669 189361 -107487 -387608 63836
18190 -363973 -205463 135246 -110205 154758 -50851 -42855 162167 -46044 -510967 -34435
18179 -67806 -162930 -132385 -219504 -133378 -63965 -205481 268738 869 -67691 -94516 -117654 -150172
18167 -150172 33973 37616 -178178 98106 37048 -86602 -172352 -215272 -325216 -160853 -28961
18155 -55204 -183144 231227 -75462 -134700 -93919 -220783 224817 66161 -342301 87674 -107765
18143 -104781 134199 103375 52911 -117911 -170366 19390 172107 -140887 47552 -154377
18132 140122 -196948 -222293 -222053 -66911 -325654 7219 134201 251758 -114320 92290 -172351
18120 -98829 -377767 -88433 -128863 -255844 -125274 -155403 152018 163113 -3462 -97507 226822
18108 -386422 -90785 352399 74317 171453 221302 254808 64429 -12236 -56903 -93536 48250
18096 -3072 -115742 -159520 -298707 -126365 212987 171623 -87113 -188672 -140661 -112522 44958
18084 7268 13431 35906 -200177 193649 -3489 380895 -134316 52075 198977 -118934 -328495
18073 -328495 -262042 -301791 -182950 14989 76366 154187 -28569 73443 85880 148126 -168164
18061 -156828 13171 109414 163324 -157237 65731 -482869 16842 310669 -185905 75165 -97348
18049 -77919 101352 65016 -202134 31949 -68599 -177303 10349 284150 146244 404248
18039 404248 11873 -288589 182330 -66309 -270355 108549 211938 67280 -173652 -100297
18029 -100297 -463495 173180 -261346 -528717 -34819 288906 -242654 127280 -6949 -67912
18019 -67912 247615 -271796 -86243 51359 4112 -236458 152023 5801 134319 80849 -137963
18007 4865 -43900 40532 -243299 69506 -199511 -160673 5813 -106533 -147669 237230 96032
17995 61945 254514 81926 -15532 -119444 -148418 -127910 289135 23297 202922 -141350 -108920
17984 -108920 -390713 -41272 93556 27916 196386 139805 -33670 308659 18701 -529320 -137182
17972 70915 151057 -57549 328839 374181 1239 206351 -54043 71823 -113791 38668 -167279
17960 22480 1943 -27379 -438539 -201697 -59650 -17827 -44914 -199287 -351048 64961 208468
17949 208468 135745 -248793 2536 -13329 -439078 48483 17690 273385 274390 178049 -119661
17937 -238400 -42903 134950 -155291 -262225 -168430 116527 472129 87061 -323633 -9892
17926 -53715 80693 -22095 -404692 -1277 68933 4875 49420 -487 -181103 -69515 -16181 48286
17913 -69750 -90011 32355 222327 -169460 -149064 -20234 -106201 -175321 -172465 -61929 167332
17901 11466 132471 19546 -116926 -448750 112945 -58185 -116202 215399 174541 -178010
17890 94610 179214 32129 1834 -144062 -119000 -35566 -160192 98791 148024 -83820 -139309
17879 -139309 -334324 -80925 51335 -274694 17513 18835 -396906 88354 85490 163924 56467
17867 54665 -62008 -194613 -13196 298216 -108703 -47405 68126 -98408 279637 -119471 -69293
17856 -69293 110544 -137840 46512 -133715 40908 -161110 238387 -114507 -133189 -112450
17846 -112450 -214578 462595 -295525 137634 94851 -122205 71685 -242887 147807 -74089
17835 50641 176861 72047 70450 -132140 92932 111659 236137 -112634 176020 222199 -184545
17823 -108809 -92552 -165908 179250 387634 326496 -312180 114071 -142388 -58760 -185726
17813 -185726 -95469 -109074 -215763 204189 -468790 144867 391757 -257747 -24466 -169666
17803 -169666 -35126 -136892 -12290 118897 -300345 -236178 -397708 -153656 182337 66103
17792 137821 -48939 -195431 65269 -214063 46679 -81569 -61111 -44133 1455 61054 -110132
17780 5913 -294673 -69659 -235770 -75250 -114858 -48338 -157303 197828 -372998 -124635 -197135
17769 -197135 -389274 157239 -26258 56485 -316430 165225 -151816 185118 2159 -63739
17758 31097 69709 64887 -103949 55613 -271925 -206259 -220724 47136 115964 -316348 62616
17746 -67737 41050 -171740 60153 156025 -32078 -59123 -39741 56795 -213829 -98247 118844
17734 -67406 -155317 -12003 -12163 -75086 41412 45382 -50270 -6622 113315 -14846 -193445 291092
17721 -102636 -182 126308 -7135 -44798 10208 -131412 -204090 -104962 27106 -110040 117222
17709 -411150 -51854 -270206 36820 120866 100905 -248055 157069 -75043 401462 121599
17698 -216578 -190174 -289418 -287162 39275 208363 -104175 178040 62000 25495 162642 167935
17687 167935 -79223 138470 -117004 73874 -116025 -123528 244937 158827 177272 -7699 212007
17675 276863 41824 107363 136808 -66435 -169401 195028 -317727 -1466 11970 -37779 70532
17663 388862 33795 -107564 191313 -255984 133618 -238640 93546 -48404 -54837 421001
17652 -2291 -239593 -423487 -31605 108158 142158 -76371 -142748 -45990 182420 9311 172719
17641 172719 82330 -112526 138374 8643 67297 234929 -342680 -33801 251317 -163814
17630 156034 136959 -60 -53097 168999 64672 -240145 -9080 -98261 -126089 98846 -186838 9748
17617 -37047 -104837 155497 299983 68022 -105129 -64781 -187748 248830 -108699 -61196
17607 -61196 -16049 353033 52173 -113044 -300122 387749 -11452 -38220 43735 -14538 145909
17595 443506 34461 -76552 -170904 46744 217611 372525 -61504 -247562 176451 226101 68099
17583 234460 56019 -86558 -145209 -151195 54325 160167 -41319 129293 372741 256509 54089
17571 -46390 6045 19226 -122372 147908 141912 142361 172232 91786 -189511 162644 48052 269631
17559 269631 -143584 39360 -24607 133610 153574 60844 -140019 215576 -172620 -104355
17549 -104355 72088 458880 167810 110349 -42158 81371 127270 69336 -131014 -224696 -18559
17537 164649 -358561 -131592 63793 122231 -25968 -110958 -104100 -43015 144280 260183 78473
17525 -70678 63175 -94486 -84412 -21823 55544 37712 52617 -40859 -138792 -118565 380270
17513 35838 -72783 -321695 255246 36046 61213 -23831 187271 -364492 -16772 237555 -117882
17501 232135 -272244 378192 78251 -285943 94054 245764 -22536 161876 90266 48796
17491 48796 223470 -25342 23653 170274 -8292 -18757 251949 -82825 -237652 177789 105817
17480 105817 169630 184294 170345 -200036 215068 48903 -88689 95951 79998 196752 -129865
17468 105279 -88763 -29388 -69705 192757 140186 335368 359882 196187 81649 303737 70952
17456 47999 -146406 282143 117978 434447 456179 19103 340933 261268 232525 541842
17446 541842 268043 112263 -98292 269644 228189 173146 174376 320062 82564 225085 394539
17435 394539 449310 211159 -88111 305971 99081 123323 428318 321096 218806 -63574
17424 242480 -48818 360337 -16990 259794 145732 176677 410407 -27408 217899 412205
17414 412205 304244 195022 126477 -21130 -231972 139017 83072 178517 231878 182763 238301
17403 238301 -192923 -136294 137405 366224 238328 373958 85945 -190347 109849 243840
17393 243840 285493 562445 275688 454666 130973 211894 119602 98980 21022 277509
17383 277509 156709 99020 532278 -37869 268378 207248 12078 185046 -80252 410825
17372 -83486 144287 -82393 179803 218880 -4021 52972 359814 127493 470740 349079 11071
17360 124500 83238 293490 791510 33294 179929 159308 -168708 -29207 -49733 99917 196485
17349 196485 134152 3755 -26487 -26225 233441 34544 -34267 8961 55765 350580 -93387 146797
17336 176633 320875 -68228 30477 311044 -217656 210342 209228 275123 25612 -284355 118103
17324 25035 63527 120754 100125 287061 360871 138168 182631 287763 148168 373120 155032
17312 33761 216346 188977 -12193 6322 381058 -24776 356987 -115762 358283 -5826 151999
17300 228975 92992 271867 -65832 2669 186828 298537 152132 280533 29494 355699
17290 355699 47137 1707 217483 -32449 181714 24767 151274 190345 7809 125252 200301
17279 200301 354178 177822 -15363 119428 578927 -114651 242383 -79615 -2102 -85304
17269 -85304 53790 208498 157644 302309 167033 106735 61343 94565 357967 289121 251104
17258 251104 110949 180937 521176 214860 373267 378757 248466 36852 103050 206852
17248 206852 129482 219479 125972 338776 246496 178948 -182354 21375 404425 111716 85279
17237 85279 252498 465966 151228 326206 478511 24786 402927 315259 383661 -57437
17226 84657 230936 407396 196591 120098 109014 127977 379389 297513 278453 9909 192329
17215 192329 138022 -140411 268216 -3888 -126991 164401 449335 16718 289803 120380
17204 -49574 76 86013 246041 57937 217622 -9603 346159 409443 372001 248243 -185975
17192 229883 366570 192598 -94028 -59621 311989 138626 177252 216329 239150 321521 208617
17181 208617 369077 244796 576038 163999 231309 92202 299493 494802 307288 439273
17171 439273 33287 307994 291935 95367 262912 371600 -120873 238771 483352 307610
17161 307610 252917 287173 265006 12905 337926 162538 221434 58245 559408 337013 360326
17150 360326 43689 106040 478533 -104593 258202 219462 585477 357919 230833 754750
17140 754750 450816 16465 169343 388508 130729 168881 38327 516501 165097 189432
17130 189432 435546 500761 78425 422108 411323 388213 386728 424815 398121 269999 403835
17119 403835 449223 -16777 244256 626479 44982 283067 160559 512654 612887 541004
17109 541004 575517 330929 331445 226876 284770 182547 137483 308669 659824 92522 373264
17098 373264 734481 416088 256580 389633 328873 438352 111455 401651 512426 163190
17087 463864 261440 458710 383437 610584 301796 201727 563859 136371 174745 396949
17077 396949 562844 475220 337113 245076 468894 334434 405363 387783 287669 530835
17067 530835 494565 637668 761925 572989 764832 536155 345577 345025 645985 179422
17056 360850 424296 423338 737393 761799 318464 234449 614994 637534 207942 312854 609952
17045 609952 375088 334381 182772 425719 726706 430545 427295 398803 481540 799396
17035 799396 461343 581036 413333 504147 261974 97089 270259 857249 597463 478002
17025 478002 714261 651560 428997 630902 572775 816457 617643 533775 538571 359241
17015 359241 782011 455635 818272 802073 594993 1005086 716109 586438 631757 793402
17005 793402 623146 676973 505692 828062 629600 720038 817802 484836 492481 675729
16995 675729 799823 638781 681569 752970 509120 686787 720969 1006756 939092 436505
16984 962686 606233 574013 903381 958641 740194 1098338 1012056 685825 740916 948000
16974 948000 825708 884653 940690 980990 908867 833192 975920 823310 1018042 1112213 700121
16963 700121 850534 912909 769142 1038868 1167686 882584 995305 1040017 1334507 1109779
16953 1109779 1508405 763697 676975 1153944 1242862 632158 973101 914590 1237101 1336567
16943 1336567 744465 657659 736146 1256579 1381126 1333329 1242214 1319473 1182975 1179766 923957
16932 923957 1345868 1218393 1236681 1210827 1411231 1222815 1223614 1546843 1148875 1205231 1293488
16921 1293488 1328665 1178870 1466672 1296532 1551560 1396246 1380385 1424673 1737190 1612030
16911 1612030 1786940 1770225 1551622 1488104 1427706 1430021 1786413 1761908 1725873 1798345 1746212
16900 1746212 1406473 1747533 1654620 1637731 1848980 1642336 1891257 1969126 1795622 2106418
16890 2106418 2073424 1979640 2128407 2152444 2437118 2030698 2271191 2161880 2236229 2289059
16880 2289059 2030732 2160256 2547570 2176644 2174387 2451233 2600414 2563271 2523880 2290676
16870 2290676 2605302 2655072 2842076 2634989 2807697 2910479 2751117 2806755 2570177 2966124
16860 2966124 2805639 3171366 2900498 2936015 2674978 2814345 2909564 3345901 3102350 3095951
16850 3095951 3456956 3312921 3315438 3305613 3612023 3486921 3461007 3573158 3665541 3639051 4048387
16839 4048387 4025789 3786867 4245355 3909359 4125386 4358740 4509826 4577912 4966868 4563198
16829 4563198 4523499 4821339 4916206 5253429 4963614 5260907 5156245 5391487 5583132 5391168
16819 5391168 5614668 5728146 5975828 6153711 6227068 6092742 6417410 6114036 6573543 6530768
16809 6530768 6621636 6985113 7145210 6982465 7393100 7559015 7739913 7998997 8033755 8651248
16799 8651248 8200005 8261076 8677002 9123714 8998807 9639297 9693024 9825568 10172232 10661781
16789 10661781 10399812 11037031 11178903 11710914 11882027 12038167 12801230 12983284 13646845
16780 13646845 13963898 14046462 14654495 15240293 15484354 16259774 16726255 17574679 18080188
16771 18080188 18472436 19020900 20185924 20574474 21381028 22192175 22964254 23745161 24732975
16762 24732975 25510418 26484305 27993093 29404082 30544811 31610831 33017554 34457406
16754 34457406 36293016 38016265 39547823 41336273 43413073 45737063 48132798 50417693
16746 50417693 53213477 56142701 59258494 62559630 66410837 70022812 73638024 78068242
16738 78068242 82502183 87652926 92784554 98130079 104235756 110607838 116681770 123785102
16730 123785102 130788776 138135927 145495108 152798791 160209681 166925244 173830718 180125767
16722 180125767 185658808 189745296 193218751 195569142 196531539 196246072 194441611 191659866
16714 191659866 187962552 183110548 176839145 170694662 163542129 156557509 148773490 141215718
16706 141215718 134053468 126704464 119296471 112776174 106568798 99941301 94605608 88712160
16698 88712160 83683429 79233804 74359361 70191343 66576956 62795685 59646886 56306879
16690 56306879 53117939 50654801 47714506 45478227 43533887 41258755 39454162 37372131
16682 37372131 35901184 33943966 32785983 31350961 29715972 28414957 27241437 26495696
16674 26495696 25424652 24263341 23491151 22368432 21607596 20851853 20092202 19500903 18938577
16665 18938577 18308209 17582226 16645913 16249858 15821613 15366322 14709325 14081216 14000845
16656 14000845 13365577 13047296 12746739 11983506 11873296 11489696 11047235 10620005 10554613
16647 10554613 10392989 10127658 9536578 9387452 9499744 8979852 8564223 8520740 8484657 8219123
16637 8219123 8001705 7669524 7531730 7315074 7354429 7329430 6957428 6940178 6315548 6785165
16627 6785165 6109278 6298451 6094348 6057229 5770469 5827482 5300244 5107660 5564323 5187841
16617 5187841 4888956 4868320 4823673 4703272 4596827 4702339 4741440 4663693 4283349 4041812
16607 4041812 4282270 3967841 4256648 4291136 3491874 3763072 3599484 3564742 3505073 3430499
16597 3430499 3312343 3380934 3306695 3252992 3370226 3158367 3004135 3002260 3036586 2813354
16587 2813354 3151176 3319552 2848856 3005909 2820888 2653333 2959239 2587877 2549148 2599022
16577 2599022 2478188 2479552 2516430 2325295 2136626 2400586 2586780 2035281 1950947 2273326
16567 2273326 2188122 2250192 1871619 2107878 1882521 2071228 1815425 2428469 2097231 1876169
16557 1876169 1920877 2074237 1719480 1927935 1612825 1982223 1845332 1614492 1820473 1574063
16547 1574063 1660707 1664502 1688782 1476163 1574078 1618713 1824531 1612730 1246689 1436634
16537 1436634 1463331 1478962 1743989 1481203 1390389 1601130 1509916 1468049 1288776 1253855
16527 1253855 1287934 1275262 1250814 1540285 1209398 1243881 1045582 1077960 1389514 1519085
16517 1519085 1114774 1195286 1059191 1257959 1045379 1036164 1034151 957881 1320416 1172185
16507 1172185 603334 899697 1068386 1289134 775277 966427 963848 1177552 921047 944777
16497 944777 913665 904929 898032 825936 844591 691008 962961 754679 1024967 829588 986227
16486 986227 1191557 954256 510117 634272 687111 597803 937034 846935 610220 914071
16476 914071 644603 732523 777323 868408 549699 474827 754660 972207 767417 531447
16466 531447 615920 746945 659718 776412 831990 537948 854483 652211 670923 897320
16456 897320 748573 692097 369519 901539 879471 634518 615190 265026 811178 430776
16446 430776 619423 682123 526166 678091 677789 655607 462990 758191 495372 461870 403483
16435 403483 291471 587393 688283 424717 408863 291460 291173 825841 756366 461261
16425 461261 664584 462937 792768 659238 571893 320314 368757 558395 206959 309940
16415 309940 635330 242604 521440 654221 713343 565803 579419 565494 198352 171575
16405 171575 304201 459662 448319 336903 309385 449102 216935 426015 415728 598025
16395 598025 390378 537326 341208 550370 163923 335498 428435 502934 319738 392048
16385 392048 162528 413570 -72271 160527 243909 536843 349740 461070 151283 486583
16375 486583 135680 334090 402845 81188 282102 213209 392315 145070 173201 366575
16365 366575 241942 255738 362815 224247 89528 415050 200128 347535 430238 358498
16355 358498 320967 -100428 247244 118889 149832 397497 258194 494339 150354 -93433
16344 267160 408007 288142 254264 238807 186781 108809 234045 628766 213346 -61669
16333 173249 306947 423430 470752 221854 207573 212892 318133 296493 297625 240803 116017
16321 619066 571035 158429 148332 35121 288179 296344 336666 -155822 393083 162517 -52076
16309 141074 168373 533357 83079 173848 226165 547392 -32926 206636 55089 353164 136780
16297 285751 49757 64702 106303 81693 -82841 66721 192214 189533 135793 78478 13233
16285 444925 371766 -137986 143114 483402 265922 143230 258953 23525 154162 76061
16274 170023 188814 56238 -116466 207039 -48190 243357 207040 268321 -1416 25410 -164915
16262 -36691 228458 296233 112119 534 -36976 205330 24711 -45280 183898 -77035 -175297
16251 -175297 647618 188233 56305 115166 116432 62445 287514 353776 -195055 112920 127883
16240 127883 257313 286129 -154843 178794 -106076 302082 379612 268165 -176029 310401
16229 182452 187534 343071 360887 150607 -148907 151077 701363 -208450 15542 -15460
16218 -59110 131310 91108 -7490 -257369 -241419 266825 -12798 63258 -81965 10373 245851
16207 245851 -246124 162040 27611 164925 -50593 281712 182752 93171 -73767 223237
16196 123579 386470 -83341 113295 -71645 -8618 -86242 189574 460218 -53439 -24503 198617
16184 107589 106124 82510 -208658 312128 162509 126412 225537 -82954 13343 25388 -34335
16172 196069 -159923 -158186 -64987 -100143 91683 -155437 -106128 225472 212749 153632 -48139
16160 267493 246440 125917 191004 156636 -58308 10939 -2260 -264944 18998 21980 -92751
16148 -382723 -184032 -79237 52711 -317325 -23364 153820 129585 105697 84386 207803 -24601
16136 279777 -164023 192393 -136163 -76490 -218906 138309 -73406 133333 70604 -11107
16125 214385 188090 7754 -47768 44076 -127284 252672 -41718 251906 -1914 -67123 233822
16113 -43122 79019 -76073 192166 256458 -24695 119331 240616 -42081 -197795 172847 -161988
16101 21954 77430 259164 81023 21614 46211 -7212 161661 243370 187022 147865 -16844
16089 -58217 -17992 36099 -124792 -27661 -118104 84470 -171940 132091 172975 -198069 78595
16077 -74326 2287 -115107 -168073 150194 11923 -44423 160111 -184827 -293 -24579 22966
16065 206666 283821 -87520 139646 -37178 29342 84388 79184 -75857 -278481 -211866 21001
16053 -63301 87509 -53733 -246753 137304 58039 254375 131209 -12431 -121622 132082
16042 -274279 16454 -252528 57924 79427 -100685 -42803 -16922 -80318 -158648 -84554 -12936
16030 -211473 10190 147036 11776 -147699 -53041 103474 62358 -230751 99477 22751 -226574
16018 93706 13716 174270 -83371 9914 255626 94363 -157629 159235 153514 54805 -59439
16006 -68305 -33653 -92289 80954 -212662 -121896 -311412 -23002 -161427 -136219 -140201 -21471
15994 -111995 -152678 -44443 22067 -42885 -54613 -107279 -285901 172653 259873 238836 -114409
15982 231076 256127 66731 435988 441659 -61806 239168 135402 7753 74727 84522 14948
15970 -79258 70390 136158 398889 -64770 -10558 -253563 169293 -109706 -57280 233633 -193191
15958 362350 -111154 -108260 -67356 -195721 363277 47580 -132244 -122510 -82757 30392 -204789
15946 -38091 166387 -48217 105705 -30488 -156416 -45641 8933 -183506 -110709 -112423 184009
15934 -150579 -98447 -91106 24243 -57940 -268815 104761 -119990 -175482 -204579 -241362 111994
15922 -199379 -203132 -244094 48051 113545 314872 -261977 123036 93186 102907 -361620 -241349
15911 -241349 -325629 48973 -144956 -158324 -10969 -79031 219056 91056 70014 -283733 -49585
15899 -300842 -284734 188836 -101298 -91610 45389 18826 -158696 -80272 195355 -187082 -253145
15888 -253145 -214668 -77865 20416 112933 100197 -38805 232092 208983 -48930 -325542 56983
15876 -51963 -247872 180422 -40270 20563 23686 71654 -298537 253552 -203209 -17016 19417
15864 -359036 -15414 -39051 -9607 101135 -50935 87446 66292 -34614 -274004 216223 139993
15853 139993 22591 128652 -134616 70230 89572 -82407 -114670 228768 -19928 -49770 -16075
15841 -218007 -117514 154983 195849 280389 56652 120008 81496 -180092 -52025 -84516 297025
15829 85017 -215725 130431 -61246 -127924 19712 272103 -318882 166204 -78345 21146 -42777
15817 -113519 -188166 -72717 48588 127051 67483 -97345 92845 -352617 -166412 -290798 -70023
15805 32412 -29207 -114713 1527 -138367 255879 -19087 -93625 -284543 -216190 68090 127997
15794 127997 15773 -330479 -82201 98929 106235 -132708 -76270 237550 176764 -48886 106002
15782 88891 -135722 -505252 -194299 -162651 8867 3016 -56969 -145283 -271531 -173829 -208556
15771 -208556 -120906 166334 36691 -204541 -209727 -41721 -106382 -6666 295827 -5718 -49373
15760 -49373 13624 19289 325949 -23776 201611 237337 13670 -111209 293106 105240 61929
15749 61929 -183840 -30443 -181753 131441 -62991 -218914 91965 52018 -65241 -197875 -57065
15737 -62641 -214203 1268 351303 -159377 -51838 -197343 -385631 -171072 102879 -70604
15726 -120175 -161949 87010 274091 -185648 -14237 -223047 155881 -13068 -241751 -308239
15716 -308239 166162 -160217 -92557 -27225 -92103 -133699 -50362 6589 2207 -41106 -56021
15705 -56021 82927 -306918 -113017 -46668 -78877 -178674 31185 -168576 -68735 153528 124242
15694 124242 -126305 -163261 -74600 22089 89036 25898 21680 -139480 43658 258150 -72919
15682 -349288 -348114 -434378 193199 -65940 -269376 272714 -262533 -122966 -65119 -190245
15672 -190245 174525 236441 41712 194431 48830 -179211 41120 -154526 166988 -94701
15661 116993 225235 -150383 -247871 -8049 -9713 47535 45739 174176 -134252 325485 -5544
15649 -144884 38295 129245 -110599 73637 -51825 283030 -105962 191418 -248919 122119
15638 -48926 43870 -127456 -199619 -54030 203297 -168087 98200 -157176 -260319 -92717 10376
15626 83377 -186794 -25006 135139 -63519 -120784 65964 -45897 -342894 31900 340560 61224
15614 -74437 43297 -72030 -62647 -282404 187263 108164 158013 -102575 122949 268606 -109423
15602 -88458 -162493 -112802 -171882 -80080 141136 233768 88739 -188181 76986 48320 -124986
15590 -109715 169335 219263 176389 207537 -172322 -73440 102010 171832 218442 -80113 -6497
15578 -59986 -130417 253288 -163355 -75610 -26619 286584 -244458 -3914 -43255 -8476 2872
15566 180625 152870 -307694 -169695 -113320 -73811 164733 94745 -1099 148317 179748 -307627
15554 -258676 -208640 -74991 -126663 35371 -185879 -75351 -300756 -110149 18067 7341 -135396
15542 -307950 42211 172307 212833 -193186 -44295 138961 -39394 177847 -136473 143116
15531 22137 249803 -86177 -160395 -82995 153487 118498 124860 -28474 -237798 47287 -118365
15519 -246943 8113 63594 -389428 244603 -260916 33485 56844 74556 22887 -56038 63290
15507 372724 -114155 48729 -215165 128065 25317 -113117 35656 173983 94892 -57794
15496 -101026 23030 -12420 158594 -139035 -177949 -15751 -58090 -36067 70722 -42317 -115358
15485 -115358 105718 -176377 -115936 255997 -69579 165629 36907 -161616 -15797 74850
15474 158678 251520 -90651 -36889 -122197 -187836 7921 89313 -145016 212785 156117 -508987
15462 -60221 64359 57870 -9598 48272 -236637 81258 -249156 -59750 80975 1101 172445 54775
15449 28371 -158907 -228173 -538693 209157 -94239 -541265 836 -173749 -74947 109061 -27023
15437 35424 -51533 66001 -192746 -185862 -37047 346406 181417 -135028 162596 -114628 -59859
15426 -59859 -24781 -43726 -120493 26182 -59373 5532 -185466 -49863 50008 5279 143352 -135207
15413 102125 -180208 65524 -201257 -91699 25857 -56621 -84283 64161 -167655 -223206 177123
15401 -89059 -5504 -9021 -88519 -54205 52510 341646 -104845 78530 -29950 100253 160811
15390 160811 -149820 -217325 19450 102528 29544 280938 30710 20638 107217 -20367 -250900
15379 -250900 113805 -42327 -228992 -47760 -40333 214679 285502 40105 -144987 -380896 -194061
15368 -194061 45117 140570 -205452 -51827 -135817 -62688 -181746 -76705 145585 -37807 -50890
15357 -50890 37808 -180424 232188 39196 23385 -176458 -20189 111579 -51279 -58264 70075
15345 -104521 66051 221809 -175471 -142807 119843 18518 253452 151232 138750 -101381
15334 74598 165305 312168 -62260 290517 133632 -49581 -102719 -262369 -380053 42600 16107
15322 -44871 99189 65239 129611 -213291 64966 17030 -194794 170697 -120748 29431 -222789
15310 88878 107705 -10580 -145067 -214764 113552 269550 348942 -88061 323127 104764 7562
15298 -90218 -64769 186116 -82298 -177295 -67856 172234 496153 63902 50885 -82344 -146908
15287 -146908 -34855 -62078 -21902 131084 -127684 40540 60582 -74310 266088 -102318 -94066
15276 -94066 374322 82979 99588 -162404 -126914 89971 -60065 -109280 -17263 159551 272967
15265 272967 -200787 152489 85926 -62438 5225 260763 -176352 -35672 77249 13973 87409
15254 87409 217076 181772 120899 -33343 619549 712007 1522431 1104038 1243654 1664474
15244 1664474 951913 721932 93701 11945 209923 75347 -61211 71761 -78520 -50419 88465
15232 438964 -18041 -174898 32334 107781 64858 132830 -166086 285170 -31779 -88501 16105
15220 25322 -152349 226267 -310543 23666 2020 63206 -300549 -111852 270063 -24126 168788
15208 155952 167441 243288 -120280 -41844 224830 -18676 20512 -250169 351745 -233998
15197 206191 110595 443131 11077 184801 -31354 -69668 -117883 155291 79629 221160 82158
15185 224844 -243330 92203 -235765 276865 77981 -27723 120732 -211860 -216366 -51410 59671
15173 -192416 33426 107289 -35154 -6986 -268863 49963 -65686 112746 215522 318683 68430
15161 222401 -144034 -43398 -40291 129877 -30745 309136 48886 13823 2222 58927 173999
15150 173999 18010 37799 -223921 -101986 65046 180226 -113386 250871 92962 -41965
15139 63531 -231988 395522 151497 12875 -13312 297074 -41648 461543 -74550 -62240 260379
15127 132494 140288 159161 185891 247520 315593 24400 84354 -157473 -110875 -58516 371578
15115 153746 316681 180886 313178 -287533 110696 82288 192681 242769 182361 -192409
15104 192382 262656 121484 260857 446286 110383 82012 267613 -2897 -156579 -141600
15094 -141600 188817 -64351 -155528 110899 326692 80516 209004 -13856 -132226 66542
15083 207299 60974 84827 -240089 491893 338354 167757 19193 193960 -13367 363192
15072 179759 134142 227025 -206125 89979 1585 157199 100641 202903 -116806 261124 -84651
15060 -306405 -68048 216989 338973 258267 -37104 50955 323775 409190 21678 146766 52792
15048 42391 55717 73390 -141215 82629 -195441 -39467 199974 341374 101499 -18948 260752
15036 126070 210692 -93529 206675 85479 618341 129295 361128 387110 123418 211614
15026 211614 598183 408116 280085 198815 339092 -121462 38613 -20424 397628 -76793
15015 381603 190109 183266 279761 -29845 104128 -18902 170732 366280 494304 108694
15004 -151096 -125430 93446 86468 211397 114756 145526 89291 137634 474928 114428 589568
14993 589568 198677 293604 464487 341585 35594 292269 -42110 136466 95886 -24996
14982 241090 -3348 -110642 461195 143684 29335 235136 305386 169577 349783 142421
14971 201104 123328 -46197 498851 -17965 462204 455051 370474 170147 483403 50382 341559
14960 341559 428137 321132 338197 215002 406659 -54409 402956 325240 319473 -47751 151923
14948 12544 400506 330028 207900 247669 49402 98695 184275 202442 471577 458670 310851
14937 310851 253020 195962 368318 311997 598137 -22086 -6920 328579 -101838 224790 258246
14926 258246 505620 365252 388228 579411 212570 -143125 411681 205575 -21390 455475
14915 60533 218743 338128 230194 216381 410726 233926 152832 490623 231094 513796
14905 513796 317031 215913 213325 302479 424297 382157 359089 198401 214396 108667 31961
14893 158011 90097 259364 128453 70823 333224 414471 420889 427474 392861 199648 414347
14882 414347 598000 370296 776127 487175 223814 395216 461330 255959 447116 373906
14872 373906 276407 359513 249574 399199 332348 460147 305077 308623 295797 148810 325889
14861 325889 554547 172989 288326 189384 565573 427449 483157 448424 447044 360282 366507
14850 366507 207470 73341 359412 411707 466120 339765 296407 591457 352207 234732
14840 234732 408371 174168 165852 546425 573856 755675 443079 421849 209937 329610
14830 329610 679091 307105 271168 402457 479078 555518 459625 353111 647406 468932
14820 468932 410606 262866 410608 389521 234610 356193 324732 595978 503040 657132
14810 657132 416682 571529 569920 571196 604795 579015 119868 403455 266453 824803 461697
14799 461697 411266 583210 895643 446384 668090 526045 745224 355497 666042 400342
14789 400342 474188 450425 528843 670061 416603 243859 750993 656979 512877 690185
14779 690185 229687 547659 825263 621969 363661 115545 758485 761932 724571 418254
14769 418254 676799 898127 599193 428756 341874 300525 751065 476742 447505 598232
14759 598232 872416 1004691 951861 300182 566405 488444 937960 607454 938781 722902
14749 722902 729762 530429 487942 875438 461778 752588 412893 866739 558369 971352
14739 971352 886372 605355 938266 677907 508861 528518 1076545 811856 843679 828043
14729 828043 586106 746895 760953 617012 520647 811639 838309 923185 739815 972299
14719 972299 966165 613884 838969 579956 432866 643261 526811 1081232 718865 573625
14709 573625 820452 907436 959497 613320 861007 840435 1054829 950468 1176513 888716
14699 888716 1100387 787242 908315 877057 1067813 793758 564081 932640 1219644 1121758
14689 1121758 704374 624030 1084241 867016 1076736 598351 827502 819280 1140545 1054443
14679 1054443 1213968 898964 764110 644825 1058776 976253 1163575 1113167 1059605 1081835
14669 1081835 1303413 706950 985619 1097704 1210468 1033200 849260 975043 1039945 1015078
14659 1015078 900894 990664 1207992 1025875 1018725 1072298 1118192 952529 1350185 1227778
14649 1227778 1316771 1177107 1260801 958802 1520234 1127832 1362369 1204043 1327603 1307848
14639 1307848 1327019 1420842 1199726 1509045 1352203 1395953 1095842 1611324 1190366 1389884
14629 1389884 1238755 1117340 1312152 1576467 1470132 1373749 1761754 1851428 1501369 1426141
14619 1426141 1360508 1525563 1297292 1422277 1358775 1666220 1590264 1482668 1498961 1472349
14609 1472349 1887644 1275481 1410729 1896354 1654218 1805823 1739528 1669316 1570195 1216360
14599 1216360 1714839 1601072 1802899 1817830 1544396 1900176 1614372 1642637 1852446 1986101
14589 1986101 1559818 1420163 1882495 1822153 2112591 1799371 1988156 2042285 1816739 1809727
14579 1809727 1816514 2120398 1979830 2038865 2065511 2155157 2108190 2343204 2071142 2434036
14569 2434036 2156320 2470339 2579583 2693965 2671629 2381220 2558857 2631169 2413784 2530531
14559 2530531 2999320 3228974 2968281 3328549 3156529 3677336 4089924 4281438 4627765
14550 4627765 5720961 7699201 11692084 19339978 39633642 47568637 23731735 9985526
14541 5255450 3283104 2664910 2262884 1996462 2167830 2055912 2079901 2028106 2413918 2010306
14531 2010306 2185621 2165433 2120604 2125092 2535090 2421477 2347444 2331141 2523511 2724047
14521 2724047 2358927 2511566 2531923 2410671 2706405 2873165 2382785 2737796 2617952 2693819
14511 2693819 2905119 2746937 2809610 2941479 2909782 3094450 3087988 3125811 2978665 3029403
14501 3029403 3209763 3347410 2870159 3464008 3537299 3238283 3753115 3341581 3280161 3444681
14491 3444681 3042071 3601013 3656486 3849751 3629971 3686671 3622229 4011518 3839893 4058404
14481 4058404 3990365 4080929 4105513 4249743 4174528 4030762 4331676 4380755 4386482 4221200 4424582
14470 4424582 4664938 4316516 4824440 4633625 4256325 4584827 5097740 5289593 5007275
14461 5007275 5032392 4802000 4857934 5124657 5435088 5029163 5535607 5283572 5421285 5743857
14451 5743857 5496569 5812891 6055983 5779528 5478705 6037632 6067912 6139835 6032754 6185410
14441 6185410 6425489 6528480 6536738 6437711 6679980 6950810 7003545 6946832 6975660 7054995 6989844
14430 6989844 7279378 7561036 7382023 7415895 7669999 7768682 7844368 7896131 8291122 8269422
14420 8269422 8259812 8396995 8696677 8459871 8933497 8681164 9029854 9253342 9417038 9860423
14410 9860423 9803806 9620419 9577516 10226920 10394824 10361290 10536193 10691572 11041865 10799291
14400 10799291 11289711 11744397 11768053 11555190 11937035 12247859 12395523 12580555 12444552
14391 12444552 12996943 13201332 13531105 13664367 13723211 14088830 14124882 14407586 14679130 15494492
14381 15494492 15133576 15617323 15954567 16102841 16435472 16804136 17482423 17862901 17792720
14372 17792720 17900901 18596415 18617276 19205979 19400841 19851279 19958437 20731208 21298895
14363 21298895 21817942 21854455 22377015 22955680 23562008 23970829 24280315 25084110 26012262
14354 26012262 26230459 26892028 27581860 28394943 28785809 29333994 30566916 31093309 31718539
14345 31718539 32441159 33755321 34386495 35388163 36027856 37164097 37952760 39485133 40123394
14336 40123394 41534090 42470569 43951165 45297472 46520244 47953197 49571933 51234456
14328 51234456 52699496 54459895 56179813 58012256 60203910 61958542 64466477 66372030
14320 66372030 68506386 71452351 73758287 76771719 79596073 82319714 85715767 89138624
14312 89138624 92659485 96547999 100286111 104372793 109310455 113624238 118524421 123793986
14304 123793986 129400101 135092263 141358674 148139292 154886491 162269033 170194229 178270865
14296 178270865 186597915 196396283 205874371 216363718 226929539 238140537 249984179
14289 249984179 262228546 275007101 288345280 302096381 315620131 330089036 344733604
14282 344733604 359297691 373354199 387238545 400817064 413701706 425575565 436525084
14275 436525084 445763133 453446569 459038653 460369902 460131668 459600618 458570151 453797289
14267 453797289 448213069 441659985 433069917 422883744 411272256 398643269 384855917
14260 384855917 370748893 355617476 340653701 326069462 310982965 297062654 284183632
14253 284183632 270526897 257810160 245398877 233780270 222148837 211864963 201540444
14246 201540444 192049314 183148507 174958280 166881164 159091673 151797005 145090141 138742156
14238 138742156 133145987 127076159 121936071 116801065 111775910 107491264 103529730 99933290
14230 99933290 95684773 92080312 88441984 84994510 82126145 78958836 75898700 73596606
14222 73596606 70652458 68250248 66393906 64426370 62388592 59834388 58039250 56212491
14214 56212491 54674079 53088693 51619626 50200774 48440019 47133752 45399573 44785420
14206 44785420 43936795 42150820 40825072 39480475 38792678 37901609 36930983 36139312 35086395
14197 35086395 33990377 32969473 31999621 31681768 31016591 30288963 29237859 28837915 27922100
14188 27922100 27241517 26277921 26140680 25348843 24752565 24209001 23632718 23341846 22670746
14179 22670746 22388819 21544711 21565459 21270780 20447806 20262248 19633376 19233676 18973458
14170 18973458 18602450 18254398 17645221 17644677 17212952 16680456 16623794 16034514 15815451 15769888
14160 15769888 15750878 15196978 14903154 14473408 14501300 14066040 13475972 13794917 13481872 13008572
14150 13008572 13128167 12691948 12413629 12224260 12103623 12126587 11745474 11797845 11619455 11398608
14140 11398608 10899816 10844720 10661908 10393445 10370779 10302841 9984248 10301994 9873322 9692940
14130 9692940 9243367 9670600 9313805 9427780 9030457 8826311 9019098 8650668 8716929 8546144
14120 8546144 8505154 8247439 8131282 7985877 8227667 7926977 7705186 7819626 7417732 7525000
14110 7525000 7667143 7152393 7074142 7188161 7128503 6775096 6720403 6620657 6751097 6743713
14100 6743713 6458869 6347158 6765257 6133062 6107165 6200495 6181483 5936800 6027446 5857762
14090 5857762 5952551 5778118 5573633 5518933 5467837 5707570 5643294 5244255 5221603 5285467
14080 5285467 5060153 5118302 4638868 5464142 4905994 4988878 4904361 4732840 4825526 4839728
14070 4839728 4863204 4498997 4386361 4493256 4628928 4505362 4296053 4343867 4397271 4320248
14060 4320248 4486302 4540821 4425517 4620073 4328138 4401209 4018255 4327632 4148758 3989480
14050 3989480 3920154 3742991 3790666 3763228 4188399 3769363 3814566 3650356 3438186 3508918
14040 3508918 3758273 3598484 3127700 3430614 3372302 3307448 3268625 3367493 3325190 3228233
14030 3228233 3322043 3499623 3474718 3263574 3136472 3228906 3184504 3060970 3130979 2995325
14020 2995325 2570324 2877056 2742489 2909290 2607272 2825803 2665180 2549600 2628255 2814669
14010 2814669 2375492 2881235 2571216 2727891 2519930 2670591 2647420 2242239 2640000 2652286
14000 2652286 2422534 2385918 2742963 2463213 2214610 2312511 2730638 2274220 2613079 2743784
13990 2743784 2844204 3625412 6134795 12484219 31269650 48914525 27452651 14844466
13982 14844466 8962321 6490049 5662156 4727451 4306184 3758963 3351888 3666815 3121217
13973 3121217 2859369 2822354 2941079 2899056 2927102 2930841 2718621 2376563 2740931 2575673
13963 2575673 2181502 2564282 2435304 2517860 2505214 2417525 2565262 2414730 2427178 2020350
13953 2020350 2373131 2156053 2199063 1964635 1816183 2105189 2252078 2034951 2049320 2174799
13943 2174799 2138421 2021734 1988169 2130542 1867390 1902270 1788346 2017021 2069187 1583208
13933 1583208 2045041 2170752 1919225 1843203 1913263 1737614 1878106 1857514 1929602 1715001
13923 1715001 1923072 1887116 1610792 1910305 1725930 1811135 1585360 1521261 1467251 1549728
13913 1549728 1787355 1486017 1568882 1834745 1602572 1952609 1372118 1628679 1357866 1643171
13903 1643171 1589327 1480087 1370179 1603827 1715894 1392656 1239528 1375235 1461082 1411403
13893 1411403 1763687 1709440 1444611 1617629 1452744 1529752 1730405 1759715 1360171 1347890
13883 1347890 1162524 1002996 1820701 1408290 1311265 1363318 1539815 959981 1335488 1274469
13873 1274469 1183216 1386138 1388186 1029646 1400243 1391539 1203527 996528 1305783 1227644
13863 1227644 1248706 1433276 1306819 1455606 1161905 1320694 1275114 1078546 1223569 1332722
13853 1332722 1121233 929783 1117862 1304089 1165357 1180784 1079775 1005797 1276761 1125460
13843 1125460 1353819 980889 1110205 1019130 1192730 932115 800014 1062695 907367 881481
13833 881481 1168790 817304 1263787 1017496 1310198 1028232 1317501 728602 955432 1015945
13823 1015945 893673 1016567 1121844 901601 668056 858548 521996 773750 1015781
13814 1015781 1000497 690218 942491 835120 855401 878754 816792 396342 1066087 626401
13804 626401 628140 834425 1029537 983457 720528 1036950 802295 683223 704464 894497
13794 894497 624061 782515 868396 754664 740505 804442 945939 1191507 940311 830404
13784 830404 956239 969595 993439 966169 592705 787347 659735 721905 719824 798006 711167
13773 711167 720329 1243213 736696 869262 782503 778971 898472 629668 1146201 461633
13762 1029780 805265 534150 805224 725260 789311 553859 656602 727187 890206 856328
13752 856328 695360 604429 930191 688740 824043 568220 800566 816169 747870 733209
13742 733209 399683 581407 671426 617667 620758 297209 936629 684972 389425 539030
13732 539030 759352 887086 1003078 442990 338571 642330 580982 977514 819967 648766
13722 648766 901253 581563 761171 971916 601315 970912 800074 678749 899555 566397
13712 566397 509665 230516 531881 950241 718741 589012 667281 987858 738820 678192
13702 678192 537566 834219 641302 481358 638095 379221 531659 609744 388792 754249
13692 754249 621656 370563 385758 504529 499564 600212 527471 740677 429381 825244
13682 825244 716758 573679 686494 723724 560981 839881 587297 484848 618313 475774
13672 475774 853441 232928 648146 696765 376091 451978 577555 550773 538619 646494
13662 646494 465876 716283 599137 466982 370227 777977 668686 504785 610853 617110
13652 617110 377768 565194 344792 610350 439591 540336 102318 548781 593363 630266
13642 630266 426663 252739 304141 658747 430846 578127 399475 511606 212526 425106
13632 425106 171591 623188 791088 287570 502194 277622 321861 536333 263551 646921
13622 646921 530819 637407 478928 326301 396677 373722 304386 465766 292319 551231
13612 551231 496736 556082 207092 345839 556496 668475 395514 599621 425988 413040
13602 413040 551751 498367 371893 358597 353737 262907 757048 411536 283760 319515 649584
13591 649584 303414 305879 499507 210294 677211 629433 580926 53979 98967 257680 468533
13580 468533 321375 582516 297867 581746 156234 562007 306762 218343 111408 355472
13570 355472 357942 892674 553296 519859 633920 169393 357471 511273 384799 339677
13560 339677 395992 368389 488024 329165 381699 636203 366117 463265 458286 71318 233067
13549 233067 543979 164652 543812 228817 510011 649190 504179 160047 398971 637036
13539 637036 373670 355400 364634 421885 237242 594335 337916 469649 291097 519776
13529 519776 745876 380644 205489 283267 385250 471415 229780 473327 547139 228467
13518 107071 365736 557108 567585 401880 55636 379293 -62431 630890 354834 246842
13508 246842 142163 132637 74389 191587 352286 397580 -19654 219144 224398 197700 439873
13497 439873 189168 742182 48290 554303 121145 232468 212609 308714 141677 493304
13487 493304 210634 266167 232339 324667 221154 560781 -15419 95361 481754 106132
13476 352187 141319 181072 748685 698303 216411 -65182 46301 445897 -38313 99085 445604
13465 445604 321423 372949 281126 276729 215272 255708 44315 434037 278560 268968 50891
13453 89154 86688 250285 427002 445703 231628 153749 75540 199397 263753 635638 289416
13441 280071 250129 221190 266266 376095 473851 254952 322747 104262 347585 405237 269800
13430 269800 391665 368094 315467 225963 468033 550909 396538 73143 321609 250548 156604
13419 156604 -36708 296047 -80813 688178 297487 613911 386910 57700 -20121 299854
13408 173646 251490 -17276 95746 300286 303142 349603 -51736 312209 218554 582216 267091
13396 473024 479733 232801 310867 322948 116216 459266 252481 78657 252427 465302
13386 465302 284088 258218 -14095 60920 -10772 21644 200749 -1801 85741 128614 282153
13375 282153 317832 136987 370013 146688 269680 368745 535879 229551 471144 307344
13365 307344 300099 415162 380240 212340 67106 133036 468547 280815 175302 258734 430964
13354 430964 -172241 521644 139334 423682 494628 13042 56517 38880 193197 541831
13344 541831 401058 342920 215817 196714 351756 415054 229317 136762 468915 456956
13334 456956 139790 27107 245874 174705 191873 431309 268658 126720 189986 217121
13324 217121 26979 172302 343831 377371 270278 135490 229898 317893 300451 -137 196819
13312 237254 20042 211995 243682 52964 95466 556886 45148 163591 37432 83630 150533
13301 150533 96095 92690 9915 225657 127695 244039 641039 532729 95008 306616 170550
13290 170550 -202013 323453 362748 303925 374158 282250 138428 217236 129512 -96787 262334
13278 140744 319744 266822 288517 243287 270859 397777 22004 76657 245135 28999 133882
13267 133882 474424 -117078 -13508 158569 -116432 282491 24444 214967 346296 -36907
13256 302279 32127 117611 50279 170737 301568 -145569 313165 172416 94915 303529
13246 303529 -66512 350142 316140 57883 203214 337082 207920 -18378 29473 268367
13236 268367 10106 129214 55580 178863 121388 -62098 -10108 262520 -108626 214403
13225 199741 35496 73320 110417 12637 142519 65608 438373 367788 336262 143578 337449
13214 337449 162997 -108421 94463 206804 -90221 387736 41034 306517 -86160 -174127
13204 -174127 384787 5150 97887 69129 293314 53884 416638 351126 379481 352757 203700
13193 203700 63392 80870 184514 -63608 1871 55920 242726 111505 324577 1264 96492
13182 96492 71743 45049 9371 115598 465604 -64529 80543 32035 449627 28119 321558
13171 321558 310310 349828 284277 199009 184655 313747 -277950 80592 98832 -40492 301728
13159 33520 73736 207950 -126184 61896 -197752 350715 194099 -41734 85742 -69711 2440
13147 -104672 -11536 211607 -13674 177180 5747 -139355 80784 -63252 125787 -18803 81798
13135 -123124 552325 -149027 134038 332466 319361 90717 29984 301566 -175760 206421
13124 408174 -226912 349599 -37093 -94771 -140821 111533 -118920 -219969 210510 22495
13113 293182 -110778 114277 130556 94992 124815 -149264 93178 -242565 362651 162446
13102 61248 68571 51320 -217055 -58295 57253 466150 -59826 193033 -90271 60746 -169017
13090 108924 46751 68780 -112964 78076 286429 72234 -183676 86389 121071 -55491 234968
13078 -29849 389445 214871 208591 98230 139674 187364 195955 47540 56159 -85438 111564 5404
13065 420365 325664 100761 18864 200656 80445 -60549 135987 13128 -2752 -7676 325233
13053 183082 -17029 101235 -71867 102797 24586 -62965 226979 66623 94442 101072 104962
13042 104962 -64093 27644 4204 -38023 -100033 292722 -10616 123751 -91747 269790 561768
13031 561768 439694 324199 53459 345557 421352 338088 255674 56812 -35545 -76645 423341
13019 403729 184935 220381 -84002 313215 297573 304382 172679 178103 84619 61033 416469
13008 416469 295150 386339 369365 128868 102070 102870 -150087 -32529 482475 -54089 101791
12996 -159235 22692 201340 107145 -139033 -288226 331424 166695 477882 245215 216819
12986 216819 -38317 13342 192547 -170490 201694 83636 274127 160631 42498 -114329
12975 -186425 25072 351489 186858 97841 142271 -365 -216387 186990 181171 1415 86989
12964 86989 131430 272885 -25504 89470 133130 21446 47162 -210258 153954 -100226 23325
12952 -125622 26705 -35302 207995 59779 55432 159940 192990 228752 88875 -82883 335698
12940 -70685 215308 24474 334803 228368 307298 289479 -124677 121739 -99157 134794
12929 192701 -238162 -91016 204994 -25184 -28402 156638 222977 9324 160875 229021 4462
12917 -371510 227860 -68572 47591 175220 -189201 59346 211070 14473 -40143 -276905
12907 -276905 -53693 -238862 -87349 -48700 40150 100778 137716 189113 160419 276387 -31532
12895 -137510 196049 203820 250581 57054 196758 176428 206493 122627 -141700 -163895 -37090
12883 209350 271352 71133 -209372 -24391 50221 -42043 -24537 16603 96662 246733 139687
12872 139687 222719 119401 105320 26190 154131 20425 7499 128188 300192 -215212 141427
12860 196126 10928 195591 124448 199679 196204 51413 -6983 154105 -208685 158821 118344
12849 118344 -46378 49456 275716 223341 -349626 -114610 5554 66356 -24873 116992 -359120
12837 226206 -92320 159953 273846 -17233 223759 12166 248365 203357 -81521 75021 217232
12826 217232 86469 -24369 -92745 -111938 46876 -273070 22548 -77562 38633 109868 138011
12815 138011 -10980 112770 -287926 228645 56086 -90801 541975 -306844 -133895 522434
12804 6187 45762 194212 -209239 22523 61420 -133031 10557 239118 -157923 -227079 222458
12792 44258 440434 -23145 -102663 151769 264011 99532 343031 -63897 14655 40092 -91048
12780 -86461 312408 -244174 200195 265392 3843 -67734 145649 42855 209521 -161219 43811
12768 -87451 92521 34479 -22386 30372 166927 -121190 -168635 213509 94570 24999 275240
12757 275240 158093 -78684 195189 432440 -84147 -35259 -343248 -29116 33949 247848
12747 247848 136503 145844 183689 -99013 75802 -35122 -98932 -47066 -214917 46250 133728
12736 133728 344592 101017 158291 35166 -143330 -22120 49614 -210675 211821 100789
12725 -332643 60669 -147381 71893 425122 18150 38996 -108833 269675 18351 -1710 -100506
12714 -100506 366254 157458 79028 179674 237485 274005 86 140834 91685 216387 -1416
12702 280989 231772 -69851 33149 163867 327467 173858 96869 -184935 19634 156581
12692 156581 267264 224866 -86936 -18666 319594 395500 -52894 -154871 161775 2101 -56545
12680 248426 7536 -372906 -59025 -73140 -69285 306803 288809 73766 482303 183041 -9625
12668 394712 62133 -13409 143044 292974 -86512 -107209 209764 -169303 9523 -115871 185889
12656 82665 487298 -32198 130777 99237 -187256 10134 156204 284215 -124204 57937
12645 49655 -169079 13542 -13810 222196 -257824 136517 -65370 117272 -12010 -189828
12635 -189828 353135 319665 161414 -25367 162504 -21067 592687 160229 605234 230514
12624 192013 58491 109047 154428 434826 211357 252697 -112053 264346 416744 -56892
12613 232001 74005 59730 91904 -108541 -261547 78388 -168787 275979 212540 266703 278358
12602 278358 -188859 39178 26424 43586 203632 299344 -104286 80717 173884 161567 117719
12591 117719 290806 58684 31647 108956 60290 -18897 -234026 -193566 283487 223121 158755
12580 158755 366108 204723 118815 -157267 -183085 220841 168960 -90072 132012 442944
12570 442944 117436 329630 179305 -89214 84613 -66574 9736 29192 83385 353199 246648
12559 246648 -68964 -3361 457913 139913 143389 -39534 -6886 -169681 133910 13528 -45174
12547 -171762 -101238 254519 -230474 -107935 122304 -57528 86399 -234122 149728 -13783
12536 -35196 144860 16968 -97953 -174456 -83583 40603 13473 -85082 420272 -43894 -4634
12524 167949 -98157 152808 11676 -49431 14388 -148385 -30318 -236279 135656 117670 76986
12513 76986 -6552 -72614 -347898 175565 2566 -184546 19561 34388 -195511 207338 -32849
12501 -159192 92746 171981 -203638 274568 -232944 73119 305249 352938 212155 6898 -185765
12489 -161392 -13020 -28476 62056 -125182 -945 148297 123572 -89972 64244 -83969 98245
12477 38897 156303 -232799 -37339 -74665 -84210 165955 280236 -205588 -241922 -144379 414753
12465 -226843 -18807 4640 -298642 -68464 -9789 81578 -41224 144441 79869 42332 -146562
12453 -205994 -20829 134927 -111783 309179 -64023 -63008 86272 -153120 77746 163898 -87514
12441 296878 119195 -148998 14392 -62908 -36518 339694 88214 156123 -338884 -116697
12430 -63004 -52979 -182796 -57346 -77794 250371 -54273 96249 231823 206705 9308 -29733
12418 51910 27976 207730 -75559 -61269 -210369 166801 273806 -59595 -141984 15423 -180226
12406 -75753 -580 -141361 213768 278053 -104530 -244101 366298 146104 -130812 164692
12395 -348845 -196654 -16358 -322597 -71543 -2045 -221970 -59570 94720 16942 111646 -48985
12383 211362 12371 64963 15328 -55256 126717 66822 -204202 -159551 161098 224206 323432
12372 323432 129001 50233 158531 45851 -194628 55774 18367 251792 41446 85729 45306
12361 45306 2128 4138 147178 -255579 47145 -48864 -293224 331811 279633 76521 -69272
12349 228227 189740 -35621 245983 60461 -228519 100506 4971 177657 58855 62122 251806
12338 251806 -10286 42908 371820 85180 100197 53924 18546 6920 -897 237353 104981
12326 158611 111184 -31505 83937 -151888 103406 89715 223571 -303282 73890 -232189
12315 167812 92174 78581 27740 -4527 92751 -103850 221889 186707 -119770 -3731 -26248
12304 -26248 -15280 88487 -672259 44725 -26821 -369845 134181 -110259 447946 -65326 23762
12292 -110925 -307888 -35914 322625 28732 -72536 -179625 25060 -53723 168385 153861 210039
12281 210039 -310808 30117 182922 -45760 120093 73208 419726 -62127 607215 354313
12271 354313 303739 401110 -37120 -152404 -169445 385002 314808 -132449 -198443 -66131 27480
12259 203901 -286369 93455 128706 -118015 49776 323297 -11469 133678 217975 62962 119168
12248 119168 152982 87670 256085 258656 -113239 77234 247300 54588 146765 57296 -226638
12236 -104816 -150781 95452 -76062 -61669 257671 226403 -20629 287554 269017 319740 102675
12224 568496 470650 231180 149392 -14796 -32386 141721 132381 45844 391271 468278 261518
12213 261518 191677 -114888 217484 262448 -224856 -18425 85381 320273 98104 199860
12203 199860 37510 367000 -13588 17628 235871 40590 67332 374856 99410 56534 -4960
12191 142896 397554 413887 -65514 190045 226579 39088 17641 124143 2544 326649 386598
12180 386598 -63830 203058 36883 350741 153732 -2422 67096 228202 187394 169032 416788
12169 416788 137517 -13103 106026 91961 -216347 364109 172105 51888 2389 356956
12159 356956 21332 -110273 231523 18908 109415 245090 82535 -72388 -67265 -182661 134257
12147 87486 251661 67396 159699 212826 74899 191159 127090 86833 -369252 495497 -419639
12135 28058 -122113 -60681 107398 143056 132354 182017 -287314 -29480 18786 -149716 -78477
12124 -78477 211663 245566 122280 77544 -10716 189514 -74225 -86692 -167972 20603 18832
12113 18832 53498 150329 184727 -109223 -127703 114013 44235 212637 308158 -31497 -388820
12102 -388820 157422 -19443 162463 -21700 -123435 247943 158058 -202334 -123112 -234022
12092 -234022 83598 -293869 334578 48572 66389 -86974 95304 -122545 243349 -89568 -91426
12081 -91426 375868 -140102 80428 -137578 -105516 39484 214495 -117630 316141 488167
12071 488167 1254326 1423078 338330 168133 286209 -6568 109464 142761 -369770 11350
12060 -56430 38223 -29668 237557 46846 332177 99828 93715 76223 269703 144122 151324
12049 151324 -939 335847 272299 53410 -123748 112813 99913 -67645 170763 -127914 39877
12037 -36999 221535 -100292 -18866 -282017 -29402 18088 24156 1555 1398 -292058 128085
12025 48928 -107065 87789 24769 -134035 -220421 -61856 -252301 67446 27906 126279 126580
12014 126580 167055 202096 -77442 -52363 165972 50797 -306489 127938 44718 73787 -361885
12002 -243357 -94067 16294 159984 -60253 -201621 150086 -956 -171079 211001 68406 -171955
11990 -300375 -49618 15799 -44200 -169406 335328 -22108 -104397 -97576 10410 -114300 132
11978 -62038 29778 179722 113408 150844 -177812 -49756 -284254 50942 40974 118636 263063
11967 263063 -36402 -82240 -324556 66004 -182023 14314 46834 185190 -199865 -352166
11957 -352166 -59083 23282 -44441 -140446 70126 81879 157992 83382 65732 97033 -226816
11945 -218767 163516 48556 -50535 24568 9085 -3853 -9388 -208031 99532 215109 95705
11933 -271879 -46827 55978 320472 -267399 134632 47710 -197336 -318953 93414 587 -43341
11921 -416519 -286914 243129 -15416 -213505 108991 4472 -7281 -366400 -62025 393880 80703
11909 106935 -982 75522 316852 -614 60542 -372291 -139980 -96016 239595 312188 -60290
11897 84219 -50641 -202882 -325001 138292 -121941 108006 -186657 -82607 -262697 -338390
11887 -338390 -44650 54586 26398 -73871 -53773 -54375 -46701 65698 -291504 -65426 81274 27340
11874 266425 84253 -403473 120156 -180613 131148 -44742 33822 -42014 45396 274610
11864 274610 -114357 37108 108909 -91305 110223 175395 213951 -93979 -75844 -100998 147775
11852 -329652 -193023 -124776 -115496 120072 46602 -88573 -38509 -112177 -253456 -42123 102840
11840 -44140 -244811 110282 -319132 -31519 -38427 -72920 120863 -204408 13053 275842 131614
11828 -217980 365439 32968 -215484 151454 44911 -8210 -197428 154483 -41062 133416
11817 -18348 -69735 -35103 128019 49689 140615 -136425 -336825 -258925 1487 -116825 -85427
11806 -85427 194712 -12757 116411 85235 76695 -95423 186188 -248439 53495 258292 159839
11795 159839 -106635 40468 118997 -41722 -28750 254612 99241 -35098 108402 -136386 124954
11783 136339 162755 94682 54410 55066 -46133 279912 -143483 179126 -222088 -171473 249484
11771 -86946 -56861 94349 455648 -98005 -57110 174955 -116437 10168 71397 -231541 -63536
11759 -175107 -80434 133984 -302446 -285128 -113731 -113247 -21217 -46620 -43439 -330956 -184699
11748 -184699 -111836 181498 -216000 -134895 216727 -207485 60371 32858 62718 305721
11738 305721 35366 37589 57213 171574 -178965 -48862 -170832 -42004 52356 51098 168109
11727 168109 -201580 -366203 -102244 303965 97466 135071 -120255 -41212 26883 225741
11717 225741 317921 198707 421467 16492 348828 394172 126489 -81052 5158 542558 -33883
11705 -336387 99887 336911 -51606 156575 -91467 24412 82405 -49799 377764 137078 188417
11694 188417 201620 -45540 -383685 -46516 -149090 -193914 -123244 -316071 141905 -126535
11683 234440 295489 -208122 104281 -16171 -11644 -250870 42357 366963 192867 -108815
11672 -50447 -153575 -65466 -49237 118580 -412515 169546 115218 118425 -29257 -158336 332527
11660 118999 90132 235758 -82392 41328 18436 -131221 354141 -19536 292351 -9777 -12692
11649 -12692 249098 102812 -162565 -23571 190280 3209 153437 168387 -222483 -45769 44596
11637 -282 -250205 -144419 131604 -20164 -170839 257408 332937 187474 -14556 241313 -218264
11625 291470 237648 259676 88965 34341 49336 415114 291132 181177 -73342 -85038 -194936
11614 -194936 -134531 92157 87301 132576 -12088 70580 -138120 -95060 28932 273583 369339
11603 369339 38674 138355 -76809 -85083 39721 171365 190238 145882 47215 10496 -105474
11591 -114986 -55857 -3614 -184679 -7833 107505 83728 372218 -59154 116909 258994 151172
11580 151172 107272 33758 58793 368829 -190518 -257026 -7941 307674 67907 -94694 38858
11568 -247823 -21955 185696 307005 54492 6057 290999 76364 223974 -212973 142806
11557 34260 195030 105261 -425376 27489 -94501 417027 323679 302236 181291 -218599 147699
11545 295849 46198 99332 -294966 243526 -10750 -159131 213147 -295753 157330 29506
11534 34809 334253 1777 369271 256557 49231 -87346 301643 118427 -13561 -60404 103934
11522 -230565 161559 143008 1966 8713 -122463 -158955 300052 95703 231410 -67344 360772
11510 67588 206942 116288 40351 99093 182022 -50652 380336 84896 204737 363271 240918
11499 240918 256545 -74295 91289 33028 75610 324913 -13876 489228 421509 253900 18991
11487 256048 126573 145811 169858 -106968 173264 237792 -79525 -102684 120581 385374
11477 385374 154994 148222 61257 -128879 104524 -5201 -201380 173957 183186 133823 179894
11466 179894 390772 79408 214444 345466 86375 -74141 -14166 -123054 566780 111015
11455 7499 115554 123632 -27156 -124331 153579 -210343 344041 -37646 -4236 19854 438102
11444 438102 86063 -247231 -128094 103005 -112880 121649 -12270 -96603 274021 5394
11433 -56808 -204115 331533 -143618 -237442 -24105 99247 168831 65994 162329 51280 142181
11422 142181 244555 59687 91391 62015 -139489 117031 13753 381723 258426 69114
11411 202044 50819 -280312 60330 96658 228938 -181269 145399 55605 -46196 289060
11400 -60575 180334 286873 -226494 113780 144387 -135793 121147 -163754 -35808 -77314
11390 -77314 -278 -208608 -225930 -188899 187331 333323 142108 254463 -40803 -213011 212644
11378 348745 -193364 -64927 278287 107877 -86667 99553 -70059 -404400 104766 88935
11368 88935 -448131 87446 -134308 -15499 -274781 132992 33071 -286036 160904 -72669
11357 -69563 -5306 -245827 -234746 113268 110782 68291 121564 454934 218488 -296384 -236080
11346 -236080 53207 172717 23623 90606 -296932 98007 247115 -76613 -204605 -16146 -343027
11335 -343027 -14576 497344 57744 21275 107332 167917 -152505 -266058 226739 -83239 255896
11323 117811 171941 319837 238452 -168865 -24621 78605 -103222 -29076 -60779 168890 -183457
11311 51119 -48105 -27892 -105711 -99681 -291840 -325092 38328 -3280 5695 -74517 123152 -208460
11298 190259 165125 -62827 142381 -96546 -110419 175516 -261982 182561 -250877 -166326
11288 -166326 -38543 -88879 45065 -133006 115816 -341815 -83998 -41517 131449 -268702
11277 -78026 44545 85695 157077 -227885 135785 103846 109079 -101541 -65165 -320678 -971
11265 201093 -59710 -116895 -165984 -53380 -182567 -148913 -63399 232875 -482261 -295173 -193373
11254 -193373 -3417 -227147 293875 -141851 -176794 -231950 119854 -89041 -183666 -138416 -137586
11243 -137586 -149189 8952 -280679 -147390 34726 -158680 52452 -160346 -145386 133252 24316
11231 -161029 -132953 -125478 -82652 -80069 -35397 -121433 119919 -228372 142199 -162872 -124019
11220 -124019 -9665 -334129 57843 222408 50507 -133466 202027 -289561 81713 -150879
11209 66529 358319 13311 -229627 -68843 120565 -249744 -72780 4295 -92900 100193 -204226
11197 59880 -111238 113737 -145765 -7411 62962 268501 -182865 2088 -236157 40257 217471
11186 217471 144534 -115138 50419 183273 518184 -187172 -41758 165087 -198993 -95056
11175 218162 124601 50802 -94842 -184212 -7075 192417 -108173 -38510 -29475 29572 163967
11164 163967 -393222 -105273 31839 56610 68413 11252 -6982 -238073 -109947 64455 5880
11152 202618 83548 249894 -60699 -17434 -34701 198973 -206174 -69477 267470 -259030
11141 241484 394839 20745 -42852 201061 49161 66725 -58510 -3292 -150378 295417 15004
11129 -159423 -269596 69007 212936 294117 -129974 -23613 311520 -74208 23318 178680
11119 178680 -195218 135780 -54458 110075 208617 136648 164388 -227510 -51074 3480 65686
11108 65686 -117529 58096 132127 173063 20409 -2909 231862 358557 527530 383941 219492
11097 219492 27582 -48449 139434 308941 -24700 422758 286754 307380 209349 346461
11087 346461 -44040 35569 201640 529709 321570 360792 247404 554277 164535 283682
11077 283682 51104 515457 327821 355152 469553 285041 499111 203448 456355 283910
11067 283910 453223 293875 346490 280315 438511 415901 580997 443406 506873 429947
11057 429947 783097 389138 670861 647294 724462 751228 1011706 883523 1011688 1054142
11047 1054142 758377 707443 866528 601737 547078 413206 681797 521245 535335 806627
11037 806627 895084 851702 859355 431591 653503 654901 538909 659295 975811 780361 634326
11026 634326 692788 756055 900869 521359 615386 464704 748150 800285 677126 817714
11016 817714 480276 491507 604947 488802 467403 736061 555285 879151 469284 778024
11006 778024 800326 589911 327073 561633 635382 771883 957140 662852 582881 504781
10996 504781 794514 593509 530247 775303 945163 583797 776870 746114 650603 988340
10986 988340 1017856 883723 950937 1348744 1409325 1345889 1180452 1424278 1452848 1653878
10976 1653878 2038280 2275636 2336414 2459042 2728858 3268687 2848242 2895899 2387587 2256593
10966 2256593 2360065 1835394 1769428 1564679 1760595 1896936 1840818 2003301 1875995 1646203
10956 1646203 1967791 1774218 1752300 1526241 1244196 974672 1158848 953381 737540 644482
10946 644482 498429 517272 338570 350881 423689 633679 86966 461879 -108323 77085
10935 78265 15767 87515 66863 82837 171399 27335 189146 11204 152518 133415 17308
10923 106664 -108789 -225239 111008 30067 2353 75374 -18777 161566 227944 -90743 -86852
10912 -86852 103254 95176 222439 60938 169124 274723 74728 188036 -91070 286808 -95955
10900 454553 -145764 -376495 177196 -184692 216718 -28889 217193 -91415 -151167 -27453
10889 65488 -293051 137976 -270710 -31045 -288018 250307 -47037 139722 54946 334090
10879 334090 79735 -114513 69402 -201365 198833 27716 75167 189812 54241 -359141
10868 -51026 286993 -191154 350452 867 -296067 73561 178305 -299363 110652 -63243 -304672
10857 -304672 169167 23267 70158 255198 -233463 117742 140891 229250 169960 85490 -20853
10845 -256795 25303 48259 76901 -124807 -112564 -241567 182884 315822 221220 135841 197428
10834 197428 -414438 -20269 -410303 79436 -314168 30417 39445 -48222 269886 -112564 -292119
10823 -292119 -39298 -53162 -107715 125596 46256 247346 -124443 -134217 122641 280543 -143761
10811 -41136 126857 -422751 -12466 -74681 -271362 -118818 -184592 -103964 116264 -151114
10800 76954 73497 -87507 -85492 -131860 -287600 285461 436638 -77687 -198377 -209660 -161929
10789 -161929 -456383 -212381 -37923 -142692 -190896 13877 -37949 279550 -202344 -150260
10779 -150260 -97113 -47774 -189807 -21016 -22245 1602 68143 3491 183557 116942 4451 146674
10767 146674 71072 -244032 -284654 34532 114059 199668 -171775 -65140 -6 -364036 -306805 -35502
10754 -161005 21471 1811 -115790 76855 -35668 149329 -14616 -309434 -84141 186173 214774
10743 214774 29682 61541 27951 5372 57729 229834 -4183 -17646 113137 175504 187353
10732 187353 -457931 100248 102513 -235206 -55854 37492 62955 119676 50592 -92246 -317368
10721 -317368 305573 -84306 -88319 -99358 -19376 39308 10939 -322977 -162409 164158 42799
10709 127530 36008 -121385 106118 -235983 109478 -227425 4246 -64921 -322417 -9851 -170006
10698 -170006 243313 37774 -32774 -22377 -284430 -64983 -60045 -5622 27805 -12102 81879
10686 -48711 -270360 148081 -318395 -469822 -348259 -168763 178488 -367784 67798 17536
10675 402894 -1511 -95161 16572 -78298 107544 -62331 35321 8230 83040 -290132 139477
10663 -204389 -20907 -173450 63224 -46103 -148755 -587005 -215574 -273248 -157519 80497
10652 -82211 -248365 -110301 108327 33428 -92077 -210281 194283 -147854 -60355 -34180
10642 -34180 -285696 139582 -36978 35227 -156041 -160337 44733 -217742 385007 44113 -165724
10630 106314 187728 268716 -169804 -138235 -70911 -94649 -63969 -200430 15649 -21824 -457436
10619 -457436 -160879 -161217 -86031 -263093 -7984 -126847 -44900 -206315 -174028 -115223 -51457
10607 -123758 -309985 -6831 98271 73352 -206571 -173593 -183059 -43799 -115716 -45224 134760
10595 -205779 20528 63253 -3782 315613 219005 55387 -125761 119759 -229986 262315 -27609
10583 59097 -210289 -150545 205771 80960 -150949 34816 113027 -71041 11474 -344081 -214452
10572 -214452 223122 -222293 72833 -5732 123639 -86592 -72250 -139649 -23906 -98190 -169362
10561 -169362 -86325 -246319 200026 -2179 55491 66269 -99075 -51324 456353 79275 -18171
10549 -163944 -4264 151203 -66334 -187358 35291 41648 -159006 -10320 -247651 128962 -78224
10537 -197567 92944 -151078 373137 320165 145373 -32814 -112834 189736 -373558 -1449 246073
10525 -386111 251613 -252176 -25314 -100586 -201511 -17735 -18208 -287726 62454 75848 108510
10514 108510 49992 213951 -280815 -25713 -267424 -249271 -55462 173308 -409268 -233594
10504 -233594 135240 -128878 -129114 -151823 -17746 -214881 -259755 -234693 -378335 -24678 -3269
10492 118126 -87292 -5669 -18666 4308 91203 -142585 21984 -18670 6525 93999 151468 494769
10480 494769 442819 681318 308360 124266 357897 326731 -124437 186305 12960 83289
10470 83289 230545 -53224 -194106 5465 144068 100628 -97562 121787 -194443 -15924 -61088
10459 -61088 123086 31783 -104145 197683 -106281 31314 114583 82855 -21927 -474785 118856
10447 146931 541168 51130 -112263 29948 -50985 171265 64510 135640 75995 -85178 -50719
10436 -50719 166535 -186124 -119408 -208275 -205838 82097 211359 34857 -53109 -209576 154062
10424 187262 2415 -167152 -24309 39523 -198218 -125260 268012 -29641 320932 -76186 374409
10412 -16448 122450 -24719 -3261 -50524 269321 84865 -12829 -209714 277860 -17846 9662
10400 -87769 135687 -4996 137998 -114408 81867 362530 99446 281473 -119979 48669 153820
10389 153820 210999 202936 40345 -204503 268654 -55201 -132657 334512 -54573 142253 285242
10378 285242 194686 147619 311152 248540 600095 558816 267863 -783 62999 448572 252249
10367 252249 417801 480020 286979 273550 455957 151533 327229 436182 239223 19003
10356 -4878 316933 370708 376294 388822 278977 -87478 1001633 579408 414533 -154165 443787
10344 382181 626265 368808 72782 423206 382577 388898 89159 339703 272593 397496 343313
10333 343313 302744 -12785 134352 296536 135329 198697 200023 127449 -176670 35047 -39862
10321 170745 582460 -170340 274185 120945 119895 114615 317317 17188 -84237 295242 -35674
10309 255952 27773 127982 411085 283003 -88825 378015 -241108 -171581 4602 132396
10299 132396 15708 48170 -61734 -115242 -107274 135681 135331 439766 -136632 62573 -360471
10287 -213592 264468 101248 -80533 -210740 -276633 -77766 253996 -161317 -204789 -70097
10276 -182270 237460 -137857 -265988 57769 -133653 -290607 58087 -153410 82995 -126726
10265 -9682 -201904 63770 -177142 222666 565531 -120444 452843 505167 322919 209679
10255 209679 -55497 213180 379862 17861 -193385 66052 200221 -2996 -10205 33647 -117544
10243 178801 -133878 -173406 265023 138590 -192091 55882 -122588 -158324 -291222 -160132
10233 -160132 -262842 -43231 -322403 87987 -42635 -38013 21956 181235 66360 188458 -105461
10221 416368 -257894 150571 -51771 -143223 -5873 -90304 -301253 39076 134483 -238655 -35342
10209 149809 -7037 -17212 -234259 425926 -20778 -189358 37351 5899 377586 122519 -145178
10197 -186764 -107930 191094 39290 -159288 -261549 -231822 -171091 -51983 79645 51412 -125338
10185 137043 -259846 -397251 -220698 294658 -67156 72099 -346130 -309727 63132 78951
10175 78951 -38004 157614 116900 105978 -295578 -29403 -45536 -7263 41344 106791 87647
10164 87647 -9340 47192 107140 -13214 -45880 -16278 -227877 106336 8560 -23357 104798
10152 -53240 309898 -324171 -14219 -218319 90239 6818 50089 -223633 -118244 -123983 -152303
10141 -152303 -235437 -344530 -71483 211759 45679 -386667 100392 130057 380966 -148682
10130 -446618 114065 407948 -70974 -264023 -126577 -224737 -172590 -153731 -70720 173416
10119 -33037 -66376 -310797 41152 103 -5432 -70107 -349097 99735 14995 -65707 -84687 130600
10106 -63262 -149462 -190195 12906 -66399 -163218 42705 116192 151490 227533 -22929 -252317
10095 -252317 -176831 -9219 -166175 -112140 28457 146693 96582 -42363 -61437 101303 84767
10084 84767 -11696 53154 88055 -113586 238012 -214879 -97571 -53436 -46630 262933 -176178
10072 63158 38615 -126093 -62313 -218989 178563 127235 49827 40649 65504 58115 253344
10061 253344 -16233 194717 279963 450844 -50594 52715 -100387 -174702 -401748 -189856
10050 124030 -171233 -134718 124417 177973 6138 -25716 -85953 111589 -103361 -167792 187826
10038 -259558 -142671 -64001 -328634 25464 35351 -65987 -47655 -178259 26156 1470 -303181
10026 -110393 -70391 -61350 -181665 51786 -248646 102322 61593 -487515 -46220 -122884 142864
10014 168570 318584 78781 6033 -287327 -222512 -158045 -25040 4163 -247770 -225352 -73001
10002 -168512 -408482 -146903 168924 -57520 533 -4433 -299674 63025 -128453 -363440 -169329
9990 -148641 -32615 -172574 -24878 -359549 -266286 311742 -326646 -11330 -3418 -260369 139593
9978 29124 89757 -279817 -434491 200510 210543 -160910 122620 -150778 -179232 -309194
9968 -309194 -216855 -226706 38667 31794 -42834 23833 48008 -155286 -42528 -206700 417134
9956 -186506 -206152 -78413 77506 -107456 -125979 -22475 46998 -427965 24418 -273371 -49745
9944 -238900 -76697 -152252 100820 -53536 -135185 -241190 92088 -3387 142514 -30914 -172562
9933 -172562 -124083 192066 -108475 -39954 -370744 -109105 61671 -12154 -214740 -166761 -76411
9921 352238 -234212 -27123 -368657 -110268 -161391 149864 -206202 310958 5343 187624
9911 187624 -162641 -103611 -8135 202174 -93776 160013 152416 -256160 38335 28885 53315
9900 53315 223390 294917 -117024 -118168 -219186 -232250 -122569 -49601 -96231 17734 -166840
9888 222436 213016 49501 -135070 104831 -416667 194205 -2058 -122018 -59295 -71876 -224162
9877 -224162 37463 143437 -52416 -313961 38675 -103030 142447 -457261 -219442 -106610
9866 -77197 -47618 -150687 192077 137837 -71010 -233539 175672 190234 54502 -73016 81659
9854 333940 -140156 6527 108965 503803 -137813 190562 -161311 -289235 -95495 313625
9843 78942 2709 -88288 -2200 146139 158511 -216445 7435 -291118 -256361 65904 24036 -106129
9830 -46453 -175294 -306920 -111263 32043 -225788 129939 162339 137076 11789 200593 -200284
9818 -193296 -161463 50587 329960 289771 50395 -67838 21825 -126779 -257354 34134 -66063
9806 -14014 111567 11940 -20441 -264048 31359 -264043 -18974 -121628 -144851 -123847 -320932
9795 -320932 -23842 -166989 48168 -105102 -191892 -146850 -264311 -190237 -27798 -42926 203216
9783 32951 -53056 184215 -274767 79219 143123 -99335 -227509 -338364 -35906 -68629 8296
9771 105063 84430 39706 -104051 86474 -151422 -3079 -52704 -82559 76066 -97341 -187456
9760 -187456 -21724 141985 -48439 -138937 -19233 -150852 -246263 -184150 -127608 -246700 172093
9748 -203405 19697 -37091 85553 41805 -345552 3131 45863 -129968 -306766 105700 -75009
9736 -53269 13292 136529 -251936 -155800 248550 356522 -117451 -49125 -40085 -222791 -277019
9725 -277019 -72230 -250482 105537 -359989 -25974 -100954 156399 -516739 -360785 -93490
9714 -102642 -91513 -408823 9807 -381798 -36120 25637 66378 -207196 -370700 19263 -59899
9702 64764 -112215 22930 -158514 -194774 -163022 -45720 168394 -84400 -72071 -67604 -101483
9691 -101483 74764 -20310 -351549 -35925 58415 -55155 73025 -105110 65896 -363296 -134482
9679 -32045 -27249 -264003 -299631 -26766 -232065 139004 -101793 -82927 -44327 -372093 -79106
9667 -227036 -245053 232001 305175 -95294 -35711 -244010 -45432 -143834 -26623 -181464 -33560
9655 -386057 -112422 50970 -45625 246369 -254962 -231014 -192620 144917 -107289 238693
9644 -178103 -39816 30896 -323236 -98799 -149263 -214521 -33798 -472102 120295 55423 -217630
9632 -100839 95349 -105702 -55114 -206439 -110947 -193504 204745 -100986 -211880 -106899
9622 -106899 46584 -230210 93357 13500 217104 -300807 309958 30723 81823 -8793 -276255
9611 -276255 338776 -233239 -13601 56711 194779 -14665 -88606 299963 -117259 32266 -98459
9599 247695 -189672 -58790 -194860 87163 -64375 -136215 65729 -288843 319910 -184933 144862
9587 -159578 104875 201198 -84605 -136690 -131345 -189652 -314768 129847 40886 -56678 51757
9575 -5680 -22231 -20782 -177413 -119195 35678 63973 -282383 -15747 -147581 -117559 -63643 216588
9562 215140 -410817 -78610 131890 -36575 -130975 -118281 168690 -239337 75241 22909 -40878
9550 175925 -244479 217029 4723 18772 87157 -20245 -37192 -134883 -150693 -307040 -122990
9538 111565 -71179 -80319 -447883 -2567 -274518 91588 -148614 -207605 170963 -6741 63092
9526 -358598 73167 -137995 261562 225912 49947 21235 78830 72562 -458024 -136652 -75800
9515 -75800 6017 137994 4473 -29335 5956 -12074 192636 395319 164045 -359471 167438
9503 -42836 110823 -242046 -15286 -400945 341672 -147502 -87228 -206558 109916 24933
9492 -113649 -352948 135457 271735 -129943 5069 240670 56976 121312 143396 -354665 -387687
9481 -387687 -122084 70400 -376185 -73133 -257591 219896 -309921 -65985 142947 -95857
9470 96210 -39716 -78717 -225469 -184566 -130869 7195 -157202 -85302 -291369 -91744 -15607
9458 -111197 -63700 337899 -228518 155780 -166130 -16247 -194025 137924 -22463 -122217
9448 -122217 -312300 -199635 -264965 -45930 -33180 -204469 -55841 166568 1883 -86089 -28235
9436 -106863 -177681 -204630 -5710 20666 -316149 286176 -348432 69516 80312 111743 -22132
9424 -56932 -62995 73479 384094 223028 -304288 -85115 -343530 -1056 284277 -117148 -108376
9413 -108376 81246 -232935 -538467 215450 -66351 -265276 35189 -166709 15490 -135413
9402 295990 -261826 -151002 131356 -16144 301585 -236167 314825 9954 -200759 -49816
9391 -47694 -76212 72205 -104247 -227573 -127378 -86554 -333190 -151033 201858 -93754 210447
9379 -279690 -245692 158836 150108 -226715 -136300 -183180 -109462 -279202 242690 -388830 -170884
9367 194204 -103916 -61663 -165727 -156296 176744 -199247 143768 -20899 -97762 116054 182061
9356 182061 60678 -86670 -131711 370123 231100 -25525 -138148 -262283 -482792 -282568
9346 -282568 152723 60797 -7634 -230943 -246789 -137514 41450 -84557 -141161 -64503 -49273
9335 -49273 -100461 224289 -220548 67307 -21607 -57227 57736 334562 -142656 -76631 -310156
9324 -310156 -88004 180422 -384110 -159766 151506 133948 -156684 -148149 37213 -48434 -72275
9313 -72275 -129673 -155961 -58565 169042 153094 -211666 123802 -248947 -250241 -191723 141061
9301 -38310 -243626 -117795 -23267 107321 -114229 -17912 -285892 -226908 -12281 -179642 -247440
9290 -247440 -174317 245204 -167150 -345772 -10866 -235397 113708 24702 -70851 -132958 -25808
9278 -226878 293619 -139132 -22267 -36637 -16255 -76726 -37705 -152174 56459 -140267 -319063
9267 -319063 -43130 110209 160257 -169725 -275405 -154998 -116255 -29165 47627 -33536 76946
9255 53340 213888 -62017 -25876 95116 -190006 -236485 -46446 -81876 -259846 -241882 -77582
9243 -481825 -173384 -23644 -246216 -173622 122561 -169899 -204633 -159156 23010 160385 -35804
9231 -21797 149269 -17126 13452 -118190 67401 -408674 115099 -196513 99333 51314 -248177
9219 -15561 -300646 62705 120784 -223956 -201157 -226072 56681 -30258 303540 5015 -27349
9207 -95228 -154960 275130 -171879 -8586 -259488 -272424 -251152 -140567 -116916 -22659 -103055
9196 -103055 34745 -60783 -214499 155165 -11089 -409187 88007 273662 -188293 -201505 -241659
9185 -241659 26022 164862 -72811 114467 214544 -162817 241795 73945 31990 46295 -222531
9173 -288895 -51429 -257492 -119450 -137282 -222870 -181942 -231491 113430 -52342 -251772 100310
9161 -273965 62196 58958 -342381 63616 -139419 -54892 16405 154953 -164381 -7770 -166200
9150 -166200 -113135 74241 -218281 18383 258961 299913 -216864 -188886 -128980 201356 -368656
9138 -324284 -100494 -10162 -256932 -136497 -175184 -59191 245527 -86218 -233745 -20137 -29220
9127 -29220 -178863 -185735 52748 -50475 72083 110140 30362 -61134 -139843 -69585 -190139 -45910
9114 344162 337102 95357 -56424 -64021 -65529 143592 -120511 289795 145916 -17128 -118121
9103 -118121 -281736 -267308 -146309 196093 22622 41276 263811 -167916 -181650 17993 -283865
9091 -1495 -7751 131150 144047 -309522 116362 -72278 -97386 -115066 -324228 175197 303349
9080 303349 59347 -3137 331674 193367 -95733 -74531 -488152 120563 -222949 -279000 -103561
9068 -39802 -162240 60256 -141401 -46687 -118402 -218784 75229 -225176 9841 -224210 5904
9056 -80154 -18871 185370 -111421 67234 -83964 1270 -111601 13281 -302178 -272911 -338450
9045 -338450 84661 138755 145818 -3960 200319 38950 387333 -386127 -247293 178224 -54467
9033 84549 205147 -601311 159469 204810 146236 -91484 -332378 53755 185543 172845 12312
9021 27583 43438 -189171 -100823 -216372 100210 1948 139547 -60590 -220031 -83528 78223
9009 45801 156670 -215224 310688 -34308 -192556 -71806 -3675 -76116 -69622 -25338 -16441 163969
8996 93293 235744 -332674 88855 -54514 -82045 -101646 -145266 9015 -62519 -290743 -163709
8985 -163709 28794 226973 -20150 -61563 208418 162111 89682 -60440 -176127 -247567 -143475
8974 -143475 -291240 98617 -321994 -182145 105395 8901 -321371 -88780 -86159 -91288 145939
8962 -132906 -265540 -130841 -262068 298774 -231858 23067 106567 -188285 -248078 -359804
8952 -359804 107712 -137138 -99349 -223857 190172 245311 -369869 228119 -123947 -198706
8942 -198706 -84688 -108766 -48719 -217273 -97851 100566 150868 368712 323665 259630 -29012
8930 10671 207105 -83578 450298 27489 596901 545737 1015579 2367794 11148412 12298825
8920 12298825 3265422 1172328 637606 299770 105959 -117663 258705 114527 -235531
8910 180627 141663 283212 524364 169555 -79823 11996 -342289 -340458 104950 -160796 -107971
8899 -107971 -258808 227187 176704 -82930 -47763 116888 -71485 -41958 62093 11077 -107866
8887 -100096 294480 41421 -83362 67851 -225332 3848 131225 -224509 -264289 -164231 -338828
8876 -338828 -112759 -218232 14645 -92634 65960 314832 -66724 -169301 66691 94413 1097
8864 -8609 -88243 -175908 737 -185474 7718 34664 -24907 -258654 -589147 -213899 -335533 -67404
8851 -204202 -136296 -99809 159830 -313873 34106 -346495 -249640 -153201 140880 181033 101027
8840 101027 -172696 149585 166545 -22510 230849 220058 -78776 113970 -156512 -75221 134803
8828 -491132 321232 14400 -320081 -53510 -24608 -160932 -241147 64311 65383 -114015 69524
8816 107064 -331039 -187330 -313014 -25608 -154591 -188240 -204091 102812 13273 -179028
8805 -128338 98932 76088 -26114 80015 -112815 -42329 40865 -74965 170377 -381661 364389
8793 203979 139964 -288699 -207692 -395596 90099 -246073 5791 62740 13797 127668 44442
8781 115160 102796 63326 -367995 -26187 146023 195097 -62892 -165010 16691 157146 -117958
8769 -25596 -13667 -45504 122348 -58547 78902 -134020 231670 269123 -200177 -23032 264822
8757 -61014 -29893 -44919 20443 -93028 -330539 48601 291126 -99778 316146 47960 -65988
8745 -103737 211091 -219890 22801 -69909 30496 182860 11774 174995 -88393 99617 76656
8734 76656 308989 8337 -307170 -276072 33934 17667 -82494 49468 -124274 -39100 -245655
8723 -245655 -163214 -56441 -315680 11580 3019 -117145 -48213 303024 -142879 61862 -119137
8711 -198047 -71400 42920 -262374 -120958 -54993 -57349 -199549 223573 36744 -204959 34320
8699 219023 150660 201256 -401811 -32954 -104810 411637 -264773 104501 75321 -224038 -292211
8688 -292211 -91369 -23952 -165808 -40783 418657 23889 -115416 57666 -301002 -380857 -328395
8677 -328395 52635 12544 145606 28190 18396 113579 -15039 167245 -328287 97295 -188954
8665 128924 238340 -206398 101479 -206885 -200861 -95971 -249890 -305952 389528 -340808
8654 42268 -120481 -116684 80091 -2701 72283 38082 14022 76597 -87266 -277510 188109 -227095
8641 -246381 194 -231780 11410 -24400 -21273 32220 48213 -27041 -150439 171135 344307
8630 344307 26574 -325521 -482375 43527 -162769 -14233 -101133 72348 110070 -81129 -379282
8619 -379282 138609 -168720 -31966 -311729 -217026 326957 -154611 -96875 146820 48834
8608 -82043 108750 -66126 -88963 11241 -109294 49882 112858 -143333 -288411 166549 -303425
8596 -132697 220650 54549 -49480 253770 -79480 -147367 -10862 -177778 -419096 64189 -198032
8584 -198851 -73836 -166543 -187432 -149466 228948 -48797 -178677 138301 -228245 164325 -150631
8572 -42616 -50877 -161819 -67072 -126242 256964 196991 -161427 28126 3402 5566 -89034 -142070
8560 -142070 -114573 -17228 -111840 32097 205397 67248 -24017 -159174 -147808 -177444 -283659
8549 -283659 -308172 -318262 -314290 144323 -290308 138452 -223498 -70469 -163912 89902 -52065
8537 -113331 -151346 -198582 -28275 292019 35842 38305 -170938 -205656 -159414 -222406 136360
8525 -9973 124088 -55458 -93315 94614 109325 -384715 73159 51184 -65510 -100753 -235828
8514 -235828 -16093 -306748 116212 -241781 160682 23156 149309 -339110 -112617 194356
8503 -14571 115339 51117 97886 -323410 -46812 -60582 -270444 -114230 -65709 -59071 -208351
8492 -208351 -107189 37458 -98023 -82536 -70540 268434 -118564 127717 89743 197729 -37936
8480 187605 -135150 -79833 -199783 -268444 366078 -171502 30544 -82417 -155137 -70250 -110330
8469 -110330 -276943 -105116 -260652 -281043 -115814 -225534 250306 96762 -76469 -166561
8459 -166561 168821 -311667 -72134 -75225 -97358 421991 -205874 -28553 95034 453903 -402873
8447 322031 64452 206741 221965 217188 -347934 45487 -127841 -34275 -173767 4101 -222196
8435 -305755 -91395 -100080 -76594 149963 -99765 -41357 20570 -127073 -87758 225909 -257591
8423 -168961 -54303 -74998 108113 -81575 -107160 1451 -246649 -63900 -295895 -247268 -20630
8411 100601 -65000 -197553 -69115 -34767 121275 -24987 -71397 198491 147676 78526 -198063
8399 -17108 -164525 193298 -225981 -119522 291453 192165 -72221 56991 -214478 -4437 -183745
8388 -183745 -117921 1610 -238159 33038 -297776 -118373 -258308 -145105 150278 -15298 -92107
8377 -92107 -85545 26371 -193877 -204103 -329071 19385 -239143 165390 -108989 -380498 40141
8365 -31972 126294 -318176 -142038 -13162 -201024 -164851 237233 -31356 -252028 229913
8354 -4842 -211803 161034 -240513 -49444 105155 97959 -139861 93305 705 -128211 -138622
8343 -138622 -222406 135495 -80161 210110 -41943 -119369 -59248 -5116 -212333 -167169 2649
8331 11228 14303 65890 85198 139947 -436616 -193992 -19321 127667 -166071 102426 -120453
8319 2242 -226395 -165826 -97551 -202608 375025 17382 -69923 17665 -110217 -32357 -103076
8308 -103076 -200405 56202 72492 96713 49620 -112212 -6309 -68756 19261 78422 -247152
8296 -91177 -229236 75694 -66603 -101847 -279248 -173789 -183601 -315996 -260825 74594 -30516
8284 -166055 -19866 192183 -189522 -521 60205 -94054 61060 -593 207397 105155 -36227 384351
8271 -151817 235636 20656 -242824 115668 114697 160550 181990 -233275 -103456 -77445 104980
8259 -68546 -41046 -105221 -292786 -50955 -73969 31515 -321869 65285 -33392 -144100 48579
8247 -185582 -243176 -54373 -93299 -445421 -9945 291410 80452 261921 3389 -62282 103915
8235 22330 46251 36069 214303 -378122 8083 -80853 149373 -116654 -185455 -453178 59556
8223 -153423 -60823 -208442 166990 -220660 -133945 207317 -105069 99702 -46825 -54756 -13499
8211 -34397 -186935 30617 49316 14004 342963 -115694 -19477 174290 -67250 -89895 207389
8199 -167331 53498 -156696 -1093 152876 -179519 69462 62370 -74246 135 -14235 -117679 32132
8186 -102416 -61350 -139872 -97611 -336938 -283673 180078 -154635 -83027 -351553 -12882 -175322
8175 -175322 22890 -49949 -159150 -171654 -60535 22537 16219 -330176 -107064 217002 -73072
8163 34150 -324284 71634 34079 -234284 -69749 -183749 74918 229682 161356 247965 -54009
8151 159598 -240049 13627 -206071 97318 -5518 -94859 -434709 -97808 275296 2651 -368815
8139 -183713 -106698 -367577 -385158 -295914 -273616 302296 -284843 48899 -38843 -281009 401392
8127 -281134 -176946 358862 146530 310214 -485110 -222555 92746 -274010 -114295 147601
8116 168022 -86292 -32743 161647 83427 -133693 -4547 -246558 6350 -128637 -172633 -26794
8104 -170957 62776 -341779 -309718 -32210 -337232 -72688 81354 47630 -52320 190925 202484
8093 202484 -45120 -57971 -79136 -4800 44364 50392 -100692 54380 -81 51903 -172018 -126267
8081 -126267 -115882 -453273 218047 -56700 19758 -87527 165013 -176140 -163963 -4012 -74094
8070 -74094 125880 -161175 -65263 90260 -46930 -220770 19701 -10671 310361 -79128 -225379
8059 -225379 -188396 174827 -303765 -273982 -157811 12948 -108260 -86798 -49169 -83434 -133916
8048 -133916 -171002 -222504 -239651 -237835 -134222 -129546 -299940 -87708 -12458 347311 -12443
8036 -1250 -119474 -228742 -20094 -345182 -32008 -151171 100602 -102078 -177631 -223796 -126201
8025 -126201 85721 -223967 22023 -5850 -20649 34362 -168922 45944 30578 -40082 -105609
8014 -105609 189694 -114918 -110087 -63663 238055 -78710 -27142 98501 18654 63804 -215467
8002 634 -491533 53093 -217447 -360292 -260948 222753 -79112 -171864 44636 -140215 70251
7990 -459445 -202487 104576 -134310 108250 -613 -344905 -126188 -127579 152281 -30425 -176275
7979 -176275 -32558 -229875 -161312 -49799 -28015 -181935 152242 -286769 -17337 -119665 -50307
7967 -190899 -47762 -28951 62194 -34095 32531 -211437 -61815 244641 114333 -44660 113384
7955 -119892 -5700 17991 61086 70629 175352 21574 -42234 74004 18813 -189157 233161
7943 118872 22357 -249865 2257 280606 -213333 -184312 -253567 61597 68356 -53295 104098
7931 -264795 -258094 133200 175072 -148870 61538 -228816 -159639 -226985 -270874 105987 137604
7920 137604 -36858 78089 29127 32043 15461 -302985 -75049 -207765 -65137 13719 -226421
7908 -4200 -14742 41363 44156 -16337 93165 -193631 89627 44818 -151910 -59278 -74449 225201
7895 -308840 -283292 4344 61152 -119028 386429 -124880 39471 -121172 -106340 -164031 -228802
7884 -228802 -321241 149154 -191607 -406812 42942 59759 -184654 -98501 -99991 -104054 -147332
7873 -147332 -32326 45913 -1305 72021 -16339 -9706 -97671 -77311 125236 361803 -10755 -364475
7861 -364475 -257435 -241486 -159669 -278607 -205624 5967 -18359 -24620 -20535 -124582 38366 -291152
7848 -57590 -19973 -303672 78134 61581 241235 -212174 -125752 137255 -89689 104692 192403
7837 192403 -301005 -72532 -92922 91835 152787 109167 -224389 -75489 -68828 -267670 -41001
7825 21879 54857 -366352 105254 -6835 -91098 -101085 41477 45155 137085 127665 -131899 -133630
7813 -133630 -49962 -63710 132936 157683 -71777 -23988 -4894 -158570 -282309 91061 -367265
7801 -287696 313259 209042 54990 -201277 -137160 54412 138061 296276 -22233 -38536 -111297
7790 -111297 90863 28031 -66015 77455 25298 -190706 140177 -169391 -92126 -165322 75953
7778 -40501 -120778 217069 104027 -163389 135214 -276579 108723 71690 -128631 -191029
7768 -191029 -73899 -119601 -54161 116283 -113240 -56161 -448359 108546 74115 5939 67386
7757 67386 -13790 -44531 225641 250818 -295757 237957 309965 -432909 35764 -218686 -219304
7746 -219304 -39535 68216 -145069 14997 -70540 79535 -303898 26304 113268 -62259 14016
7734 381936 171659 30074 29956 -246489 70150 -6403 -229278 -12238 -55501 -289881 12361
7722 -231889 124688 -54942 67501 -143885 190374 188542 -36797 140102 80853 -102021 -184113
7711 -184113 194683 -109683 -64536 84461 -200699 -378638 -432566 -56769 23111 -156393 -98860
7700 -98860 104370 39842 111832 -379026 42664 208926 -325273 -350927 -65257 -48965 -172557
7689 -172557 56685 -146530 -41949 11526 -155497 273983 -65569 76904 -115384 73934 26817
7677 190645 -154914 69888 38994 14193 24047 -158107 4799 179928 -192077 142824 -30312
7665 -66950 -95412 -341888 128388 -95453 -116324 -272164 233047 -222679 50188 8935 -10690
7653 109636 -143359 -175828 117305 -83696 -124416 125301 -300947 -323674 108684 95641 48263
7642 48263 177701 -64645 -58146 -113475 -115879 -83815 143767 73139 -48975 121654 -238368
7630 -30567 -240599 -215366 -44210 -59032 15420 -135015 40218 -53264 -26501 27252 -198273
7618 -240874 97230 259794 -389383 -231467 -123788 200402 -255517 -262374 60746 77573 -21765
7606 -65726 214896 -196805 -54652 -69837 -182803 62115 27387 203720 207126 -83757 -60165
7595 -60165 -385254 -177817 64372 120104 -223127 124615 -164232 -97011 -220630 -63795 -121826
7584 -121826 53380 264683 242761 218874 -132601 140543 38674 20498 -119403 21764 22148
7573 22148 92456 -143909 309960 -242795 36974 -1398 -109680 30489 -189743 -88825 -117211
7562 -117211 -173953 -77720 -109705 -243789 -129240 35629 -392806 -70790 -287620 -96972 -28608
7550 -57673 -101309 76373 86299 -94949 -179796 -202136 103438 -160635 40522 102445 173249 -256732
7537 -74874 283306 -114458 55546 79757 263643 23401 -144753 144173 38100 73469 -185838
7525 -154676 26772 126607 -58273 -75475 -72335 -272684 229986 50067 68659 237397 71206
7513 272866 -49244 -185060 -461039 -25707 -12723 -480634 -7757 25079 -7494 -92225 -145673
7502 -145673 103276 -288815 339438 -6949 111390 32425 -168614 54932 -304560 -16216 319280
7490 47138 124968 -307595 46791 -148547 67022 79594 133341 -286842 -175989 -190990 -171269
7479 -171269 76369 -115906 -10939 -170862 -337712 150148 63802 -416884 -253280 -202603
7469 -202603 14590 -159025 -88786 36210 -181315 94802 -49195 217986 70046 -13560 -123010
7458 -123010 -80794 -104494 -77784 -95247 -45467 228181 -182270 -44464 31564 -424574 221490
7446 87009 -115762 -275601 145136 309523 6328 72072 -377757 167349 -76863 338668 -5004
7434 -15377 -196986 -23375 -16834 105763 -58432 -162795 -148995 -2936 273314 -65430 255876
7422 58037 -67476 -198228 -47433 -177461 -313430 62608 -49448 27321 75986 17412 -140597
7410 27828 91967 -249434 -102868 213813 -332099 184283 127680 176026 -166684 67680 -303615
7398 -196198 138678 41998 231920 340447 -43097 -50623 -2546 -233336 -323283 -128966 16557
7386 -86291 -66775 36043 42419 -96095 118763 189162 380019 282262 146700 -32218 -163947
7375 -163947 -125303 156196 215673 -217922 26474 53948 50352 -273076 -419876 201167 -368048
7363 129926 130825 77373 363520 91143 -25883 -146579 -30348 132554 242676 -189904 -91272
7351 -32817 -441504 -129877 11366 -65884 175677 62809 113043 -74386 97208 -286420 -2448
7339 -147826 242043 -24938 -68432 58692 276015 32097 -97514 212528 -327529 -114579 -260107
7328 -260107 45821 -5809 8729 -202077 -205174 -29303 -57705 -77714 4874 32386 71162 33023
7315 -31652 -3204 46077 -136280 -28285 -179425 162561 8206 -107380 -69647 27135 151372
7304 151372 290894 48566 413919 282221 -302233 -197708 -300890 -50254 -294045 -89232
7293 -257791 201291 -15948 124727 -216090 -78085 -144824 -221120 -38765 -264688 236719 -217517
7281 -32527 33192 19096 -65823 36101 -28201 412182 2452 127877 -72036 -41136 -12458 -50739
7269 -50739 -171424 129580 -35095 21193 109587 -23111 79548 -97350 972 293541 262416 -203337
7256 282621 -9291 -26704 85704 92204 -41523 -275855 965 -197314 -268962 -110654 32501 -215509
7243 -375474 -66725 -374743 257043 -56439 366270 -136498 205433 -193028 178564 266167
7233 266167 163723 -6435 -165431 -159167 -114897 -338135 237287 -49150 -163422 426557 215444
7222 215444 -56998 -89437 70956 -182770 201493 100076 -77411 -56980 -420126 -35904 176015
7210 54467 -370957 211223 -182306 -63133 276 123243 -369630 333612 38220 -38307 -78831
7199 -78831 -31506 156003 -105522 -123044 -67370 169323 28329 -68196 -281912 39414 -47774
7187 101966 83571 -86702 101844 175506 29818 -296573 -54270 -113475 -159587 -192427 -321058
7176 -321058 -113567 -182276 -180769 -56913 -14534 -23744 51319 -86299 -150936 38182 98047 80204
7164 80204 -177548 -182373 -85117 -243887 -16654 -43866 28319 15467 -165427 -172941 -232495 -42889
7151 -40427 -165068 36837 -66813 211305 73066 25468 -52124 -456 -116304 -77661 115087
7139 -274685 9775 -48788 -80051 -91273 148743 -453779 -249389 302079 -105397 286357 212231
7128 212231 -171285 -50586 15912 211028 -10815 -135317 251249 75211 -172087 -61923 -175174
7117 -175174 -141465 133305 129309 67946 -224060 -53585 -40780 -236329 -81213 -267817 -136370
7106 -136370 -83476 -30880 -163240 -442104 -48783 -22715 130494 -46547 109709 -166303 -9484
7094 47268 -248200 225428 -153824 268705 -124426 93504 -81743 -278318 -115631 343954
7083 -273814 -73220 -23512 -145375 151660 -290594 88013 180442 -7123 405412 271900 106401
7071 -175213 160116 366417 -100127 -335814 91644 -392219 -527029 160757 -79431 -106568
7061 -106568 -119251 -34842 -227141 -45348 -342462 308239 230986 -2086 230437 179747 -4617
7049 108786 3165 -147865 -18698 24940 -418164 250846 -187742 -253153 -282267 182481 -116301
7037 -15588 38807 -28263 66038 -145114 2179 -204209 -114526 64651 72015 65374 101224 -165785
7024 -22802 211086 -433294 81180 -31167 74189 -58615 35455 -2204 126406 110144 189842
7013 189842 -10984 -139195 -327999 -220790 371694 268900 -244496 181370 -216694 -29760
7002 -211158 28442 97662 -35327 -153025 -284469 447525 2229 -113394 98957 -279721 89849
6990 -79272 -212535 -357724 -169301 97040 -219007 -167425 82576 -197062 25183 598656 -97357
6978 -117052 -239198 -129646 289102 -99836 217145 4251 -95200 -10522 296168 69144 -213195
6966 -43714 7449 -49566 183173 -16930 346190 100672 -366968 67157 -178491 525142 92924
6954 335 57830 91595 39029 -9060 -144437 11005 -126424 -251607 39332 75487 100023 -52819
6941 42884 -168297 203906 -111598 -220938 131991 -145678 -289184 129283 -85156 101525
6930 -40402 -8576 183797 -315254 -27162 76930 -57587 300163 -11029 -13380 71585 97256 146174
6918 146174 -57800 -172003 6684 68012 55340 -324967 -105317 -505 84726 127185 -142619
6906 -63318 -64694 96499 243212 -32930 231491 -124994 156679 108093 -252132 -87367 -294387
6895 -294387 41136 26515 -381343 92395 221272 -227721 -89124 173897 106956 -133125 -194284
6884 -194284 -101839 -195912 -26033 -8856 114939 65018 -75212 -76451 63131 31590 -181538 112117
6871 -164589 32362 -166429 61038 -128068 -290278 52309 -231050 24351 -81908 -237437 60084
6859 192019 2113 307162 -112679 -448818 153220 -120240 -83888 381906 -19265 74505 16401
6847 54273 -118520 79937 180744 58444 -220378 -444085 41095 2693 71225 25495 -41449
6835 -179764 434704 -269220 177716 -58674 113882 -189203 -268025 215485 -30353 102753
6824 25746 -72222 -391570 -90059 6018 -349165 -97636 -83390 -231810 -108363 76656 85552
6813 85552 -316802 96373 -368544 -95716 -186383 113830 53413 -100668 -27766 -357945 151020
6801 -318844 83664 -130152 116512 -248357 -121625 4210 161114 -47347 121600 -156122
6790 -284363 -447699 154562 -93367 -233136 165785 -172209 -151170 -95534 -31790 -172774
6780 -172774 -215118 -8017 -96156 95910 37384 -187478 94818 123265 -2449 12577 -534658 203416
6767 -62106 125544 311554 286566 105786 -108067 -143424 -25177 -18220 -53881 -77161 -85419
6756 -85419 306357 141156 -273550 -181011 -59416 471419 139920 147372 181530 -115845 -356684
6745 -356684 121611 -385265 -295920 -290401 20573 -254823 -223347 -95897 24640 77603 -69265
6733 24849 34142 -64939 4336 379165 170048 -7278 123773 -187183 -258098 32560 104146 -297399
6720 64257 48983 178456 -164892 -104605 164833 83518 176479 57252 136760 44975 -47378
6708 -181592 -182151 138381 127444 98022 102250 -13519 136044 -14057 53741 155583 -235313
6696 60509 -11714 -130019 -42926 -56157 -13709 -34128 40372 103817 -56708 -199227 186408
6684 90059 -216527 -57840 -69266 217993 58597 -23354 55860 -378658 18870 -159693 -229535
6673 -229535 37505 99668 196922 257834 -146575 312694 234914 -22121 -246909 771 -151331
6661 258158 -151653 182784 54679 148175 77263 -127349 235181 271947 266699 122622 173759
6650 173759 19729 -40430 -182098 -76155 -231568 45313 184054 -143245 171079 -103381
6639 -108639 -193242 -272989 66979 143564 99455 -110049 -40975 -34580 22167 48648 55847 -110610
6626 52740 151992 -28095 -59603 -88219 -114682 -93497 -223341 -142298 -258214 -34038 20877
6614 -170427 285861 97636 -18886 -355883 -18283 -58759 -327990 -79032 -342079 -81536 184220
6602 -14635 -10725 21600 -81176 141847 -360948 97208 -31068 -86461 49632 204612 4121 9124
6590 9124 15370 -209784 -91965 -34971 -163422 -258251 -36456 101623 41509 -103850 -194333
6579 -194333 195145 2780 138283 -188582 -24120 -78826 -9434 47412 16606 -255317 -11603
6567 -81259 42978 135592 107060 -115891 -179363 -14788 132398 -366857 -5342 -197745 -52590
6555 29161 -275855 59484 345778 -107302 -199936 6728 156363 -21744 23027 95550 -126643
6543 239546 -258641 714 26005 -368087 104052 107002 12677 72927 235676 -112762 319456
6531 42939 -243222 -164400 208283 265430 48760 75532 109315 -146877 -36795 -87998 101804
6519 45733 35037 -5006 33402 162061 78784 77181 -209355 262876 181590 285521 161254
6508 161254 104373 -270525 -139081 -63909 52629 166696 -33010 -76331 -113244 272468 -108088
6496 -73675 165353 -133183 -253926 -400321 179042 -265773 -32445 39608 -137762 69527
6485 120104 22334 -405516 -272290 -191955 103142 82517 34861 -52590 -30751 -74761 -336123
6474 -336123 -115397 130559 -292279 239234 -185545 -77237 -25107 -42346 -115214 53418 -19719
6462 369941 46051 -85970 100194 -326191 164980 156007 -19076 -182204 66453 -276004 -170343
6451 -170343 13092 109169 -26922 -82578 116807 -280459 -11833 66816 84625 -18859 96675
6439 98251 175996 290769 -65486 -126164 -84495 -1201 99062 -212170 -155067 -220824 -98254 -254534
6427 -254534 -137676 56987 10863 -197045 -133443 -7099 -209454 299648 -380734 -154296 -46812
6415 -8140 -334418 -284436 -145515 201430 -246169 242421 -109082 240542 298139 -229617
6404 -12240 -47429 147551 149285 275762 -4818 395939 85434 -415886 133314 39851 -21710
6392 8151 114829 167105 119460 -330198 58922 -146946 -33116 -68849 -27298 157285 -182961
6380 -87513 106265 22604 14876 94338 31605 -347216 88635 86274 77957 -293316 -449619 -87216
6367 -152278 169793 -191747 157577 95298 -176501 -146389 -51482 -235247 28163 -93663 -101041
6356 -101041 -220350 3591 -4885 -74026 236592 -152687 136940 -13807 39412 -6997 -78714
6345 -78714 -340997 59923 -83002 -176586 -433385 -91703 -147415 -371953 -82153 15836 308535
6334 308535 -321818 38859 19589 -56192 -139824 206358 -200424 -170849 -103840 -41954 63241
6322 201088 40922 -156423 -172064 -314674 52078 174346 -43421 229550 -228960 -142261 101294
6310 -100559 183379 -142844 -273146 166007 -214033 -257544 223374 -46805 -301778 95401
6299 -35010 -119066 230384 25288 64984 -290622 -62621 -71251 84380 66840 -68288 -219322
6288 -219322 -9986 298118 -181643 103844 -179196 -354762 -85072 151714 -154040 -213089
6278 -213089 -93351 -147842 59682 276171 15682 87262 -208444 -119172 -203292 -67626 -234000
6267 -234000 239398 -65422 -198399 -70698 -8282 31407 -166736 35077 -328687 -39382 -19318
6255 451350 181404 -296016 193741 373082 -122320 -49742 -60140 -22332 263282 85910
6244 31731 -24645 121892 -14924 -206368 83343 -109587 -228156 173767 -138966 -77109 27119
6232 -68147 -175456 -21744 389062 -74599 230541 53958 -25953 -90871 -197434 -3716 239205
6220 163945 -16967 -57344 -8322 -60125 -65117 -235595 34135 -29539 -170483 -14807 -372476
6209 -372476 108082 70891 -132562 302011 -95810 24527 177886 -59794 320371 -121211
6198 -40098 319819 103366 113655 106576 -65379 213635 -11255 117937 -112315 -13373 -65443
6187 -65443 -71866 -63496 -66815 -92380 55780 32951 119712 37558 79349 439916 -103075 361955
6174 57685 8190 -55665 -18616 -246661 -158968 43043 -375512 17852 -172781 10205 7799 -229586
6161 214277 -84412 -103390 98261 49425 -188578 210053 167930 63990 -48271 36335 -195001
6149 -194553 -234875 -121362 74126 46081 98054 113317 128215 -135923 48901 -89981 19957
6137 -185287 202900 14013 14329 7756 170366 -104730 -77052 -37373 284149 50503 408827
6126 408827 243923 -158240 -115344 -363212 273294 -338765 -238262 265575 99887 99599 -319496
6114 -141461 229973 -130922 -100396 55097 -203149 -351150 -91246 108163 96169 -78321 219689
6102 -212329 34329 116538 -102477 -186526 -111675 -20918 68713 47995 -132136 -111640 56580
6090 -239181 259736 -124424 144328 35020 35694 331268 -78210 26161 130370 146738 -227392
6078 -67223 44761 -15685 354567 94591 131787 -142653 93209 88325 -147614 243850 25668
6066 -112457 -2779 -17556 132555 -13715 -141846 138384 -64419 -146650 237530 88037 -127808
6054 -296420 61875 -170505 -60981 68105 67896 -183140 -152322 -399627 -185755 -241045 -36603
6042 258369 211498 -337523 70058 1917 -42443 -195730 150175 -190267 70966 41252 171715
6031 171715 55985 -20531 110187 -114659 105363 -171612 129844 -160411 -78388 -105915
6021 -105915 231483 -197477 115294 -208691 40852 101835 126832 -251750 -140968 -95686
6011 -95686 -136630 90051 131643 -181404 193157 94739 93969 -211350 -84035 -237147 26315
5999 94203 45314 -102721 51236 -306666 -104888 23746 204723 -340497 429696 -436174
5988 201521 -145357 32302 176926 -190235 -158052 -105796 -252114 -311518 192027 114917 -76625
5976 -83532 -121343 15863 -437871 -70078 56664 190975 -120970 -229732 149805 196765 478312
5965 478312 57655 231316 112351 40540 -334312 47986 442 206159 107093 -158782 28869
5953 -299276 -161064 -385400 243389 -28291 46527 103628 -121601 138327 -279876 -14161
5942 184775 -305670 -81370 73096 481742 -66746 -151314 61443 -60882 -22721 120073 25178
5930 -116456 -464726 -74728 -125997 -36192 -326064 -108935 172314 -10512 41257 -279609 -205704
5919 -205704 -109646 -177736 125948 -86978 -79419 5243 -156237 -90699 -72712 -47988 184030
5907 -213528 -70668 -145643 -115650 31229 -43839 -82102 -124685 53343 251529 -11709 103 -67760
5894 92849 62081 -123105 -75540 -180542 268507 137456 -273522 -65346 -81389 -143317 -203468
5883 -203468 -190219 -8444 -101786 104433 135067 9801 -315056 -48576 333355 -189277 -94098
5871 -135063 -209865 24093 -218635 210840 -152310 216262 263863 -158190 136865 -100185
5860 -32074 -149878 -96659 -80066 48021 -66884 -177135 124466 21681 166713 153446 22378
5848 110982 -138791 -160231 63201 60513 175320 67697 299426 146755 -112707 311997 -94956
5836 201266 448866 -183632 -53326 -357904 171422 -97683 167998 71155 35306 -48652 57899
5824 105882 125549 -101708 49609 178765 -77854 -160181 -343756 356052 178371 -2499 -24440
5813 -24440 -29264 190761 -367425 378241 136955 397846 -37390 107646 -1185 394338 -3146
5801 115812 53800 669 4484 -10088 -267989 -146669 85613 431008 96636 -193805 -250409
5790 -250409 -85953 -79248 -247885 -58733 196912 -22859 -33085 -26284 -56588 -56922 123844 -180123
5777 -215096 -115664 -135887 101553 -117554 20334 121305 -152451 -101706 -240964 -228781 -201386
5766 -201386 -143761 -113010 -142975 205377 -110737 -2139 -264126 142468 -229238 -195671 -75532
5754 179711 7716 -394777 93774 118318 232236 -132525 -155514 -200423 293185 -96363 -88548
5743 -88548 42986 4056 237183 60331 86657 -121612 290757 175289 -191361 87976 205645
5732 205645 -276335 -223729 -317819 95600 -102263 -55182 -32379 50733 40696 -142780 -136202
5721 -136202 51634 -54415 -55594 -79875 83117 -92018 -43890 -44904 24724 -250226 -229706 226926
5708 75850 95562 -185259 -166284 -119673 141926 -41247 155145 74412 -133141 455636 -63995
5696 -405428 91148 -56119 225979 -4620 -243808 126293 -51895 -178395 375168 69647 439922
5685 439922 -72803 -33508 -174512 -36259 146251 170437 97832 196478 14992 -114962 -194657
5674 -194657 70609 -10849 132399 107801 -101945 99846 71764 118276 39877 -45129 37928
5662 66893 -26569 172339 36396 -113954 224131 -162922 407445 62623 133217 188935 58098
5650 158344 220815 182665 70804 12691 -41085 312373 -104491 -170270 253999 44230 -37507
5638 -17845 205928 125333 -190966 -299523 95276 -96040 -355648 213963 -31478 99704 233087
5627 233087 26147 99285 -231397 53705 231141 -27917 -152973 58110 95287 55319 -14348
5615 83657 190146 -146776 -6686 207005 205635 -196123 -315474 -210275 205125 -34248 -23194
5604 -23194 -96135 14309 -145242 13431 26703 64495 -102164 3749 32921 -103517 -8930 -112385
5592 -112385 138508 -273169 -53134 153269 -94651 59057 35464 -41005 47500 -61518 86069
5580 -293042 63521 -273995 139582 -300934 -140830 123493 -57623 -55422 84541 155004 -133440
5568 74170 -368868 22105 90497 394706 17213 -266871 69280 188375 42124 -50952 -296444
5557 -296444 160171 62238 -39518 -225484 129595 181976 -139266 -130487 737 16316 -17797
5545 -257949 -76141 -38215 -32214 -31074 -281131 -25004 -300694 73674 -39961 28419 160457
5534 160457 -4121 285412 6858 76732 140815 55129 25218 -112187 -301880 21880 47853
5523 47853 -89404 197605 65259 -18456 -17949 -198237 -210531 185824 -163049 41064 137953
5512 137953 72740 160704 -71226 162191 37303 -37662 -227843 84355 -194893 281904 88162
5500 178805 343062 101086 -83510 -87472 -292270 110542 15022 -88560 37288 -128875 65460
5488 158508 -291391 -51375 89698 -178104 -83745 -79648 346728 -139897 75486 228029 67610
5476 215912 211355 -45557 124757 -182619 36302 6766 644487 -103233 -104454 -16201 -33985
5465 -33985 29720 137112 -140852 -9602 -149657 65659 -130782 -75631 -285428 201052 -111884
5453 91039 -46239 30262 160828 -235447 119306 -7198 -126598 284391 19901 -178203 37212
5441 62039 -67083 -47468 -207127 -44118 158222 -1290 -99230 -257525 33172 279402 203240
5430 203240 -35527 -126216 -222715 91827 -2120 58843 85135 -116620 -205480 -104656 -101045 -168403
5418 -168403 -51063 -11886 -134134 -35295 -85230 -127932 144448 -188048 102667 -58992 218067
5406 -132363 -64133 93762 -328299 -32067 -110888 -180728 -42601 64518 18007 -16624 209581
5394 3308 397127 -127190 -211363 218723 10701 63423 101366 -214147 51953 384315 94355
5382 -125143 -11751 24041 41888 -156270 -156037 19356 65062 -175676 -47076 32933 75353 -154142
5369 201220 -171358 105719 264098 -265575 -164328 -61947 33481 240558 -84279 122643
5358 156775 -226022 -26916 262377 -30232 -111160 -86403 182826 54961 13745 -66022 262589
5346 265241 -44758 93292 42987 243883 108180 -158691 -94990 43208 -297325 89853 57532
5335 57532 -26727 148595 -42348 88761 48887 40082 -195362 12627 48970 -18800 3035 -68879
5322 128646 -432392 -273668 -309089 217396 -146071 294102 199549 -207064 27438 -51914
5311 -222036 315662 -233961 -177736 -45574 -66942 47369 82314 223829 -35511 -63188 53712
5299 -11927 20745 -20367 335227 37575 75911 116327 -285043 -3361 -305512 -217199 328912
5287 30195 297506 320471 40953 71711 -330215 -29384 -55569 -321011 154459 -154287 -282365
5276 -282365 300441 -90726 220698 -47379 788 14619 331335 105207 -5066 -208324 -195335
5265 -195335 71195 32460 -61314 -12071 154259 -96618 -163626 244337 -417234 -266064 94865
5253 40945 96228 322177 -274927 -308358 30240 340554 -207920 339951 84458 231162 70557
5241 360980 52283 -57532 -116758 -19254 226771 95806 -95208 -180052 -118931 -69050 86750
5229 -6546 202993 -118593 89107 -263367 -20672 -137834 -35601 -380272 292181 310900 48214
5217 -107145 152043 -261543 -258251 -203090 130423 262431 22317 -215066 105105 190169 -46863
5205 2882 -165786 39174 83685 -183896 256658 161382 36884 326288 10727 144627 -63713
5193 -29176 60253 -52875 252404 -88137 -155430 147565 -161122 194235 -92946 190967 -339219
5181 182236 20219 -15687 -282604 327446 81626 120426 -385676 48373 -55275 -349118 -106048
5169 -12695 13079 162043 -5882 -567015 475540 -218466 -89634 -123371 157783 -127379 -165957
5158 -165957 50671 12592 -333835 -56008 140813 136375 -11782 -182605 144517 163669 249345
5147 249345 -97834 -195051 -106600 116225 -102792 -68909 117730 139010 -221028 16286 218042
5136 218042 122293 -62199 -17943 -94612 11231 259876 99764 105339 -24516 4282 -136058 -115223
5124 -115223 -121486 -27489 -115582 209742 -68209 262312 -147324 39765 -206631 -424 28451
5112 97336 -316452 -113636 -324229 81401 105360 -5418 147174 -279927 164327 8064 73187
5101 73187 209377 -130070 227018 173119 -217703 189461 92673 -299826 -60605 -211288
5091 -211288 -56397 -72639 14452 -3738 17682 -73610 115664 305191 71639 72820 -96 38162
5078 243640 -118314 110187 112491 139916 -516530 57020 15296 -56248 -109460 -18768 211029
5066 55372 148124 -41667 55792 150753 -213560 -54636 -374111 223194 -211320 64135 -348946
5054 -160142 53736 5394 -285962 -180551 105969 327561 -118277 -74481 276725 -442561
5043 70789 -234068 -52645 -10754 -72898 55433 73853 200371 -49125 -135941 310377 101913
5031 87635 28410 -81202 127020 253020 79340 166013 5409 73726 202708 -261440 264943
5019 379249 -117696 -182144 -44594 189297 -76305 -33715 7629 -10795 -153609 -84003 250345
5007 106795 101258 -396983 99937 184440 18044 -69315 -342801 -295868 93247 -86719 -13787
4995 87824 308439 128757 -31127 -153262 -23750 22740 167735 83114 -8550 -97471 -3467
4983 -210067 -31091 -130475 226899 -53752 105945 82153 -40422 29826 166634 172841 -23669
4971 -171508 -104386 82226 78678 -6450 122765 56882 -10789 -249121 368276 25714 -92087
4959 -290464 70881 -15104 3588 -201247 269824 -197116 144888 257852 -59273 -34178 3449
4947 -11604 72026 26587 -302834 -188981 93494 -103505 -52007 -103126 109746 -124027 32688
4935 160723 101353 24051 -6948 -193465 -4595 171221 339752 -344750 -28272 273865 -37568
4923 134402 197832 110512 139460 114799 153805 -7270 -144729 58262 246921 -40790 -307149
4912 -307149 82324 82016 90751 -95621 315448 98455 -23980 14205 3071 -14746 -139326 46097
4899 67032 -154640 131207 38842 176497 -437834 -246878 220473 39250 -50709 -168327
4889 -168327 6240 -27826 61019 -13720 157722 99817 31902 60731 183788 258289 -160893
4877 -143438 -352543 -107198 -96141 106995 73360 52124 25929 1216 -228160 242170 -125652
4865 -155095 -18165 -116861 -350605 -173688 254557 42168 -143492 159295 -125166 13360
4854 204479 113955 17201 242034 59634 -27321 138720 41600 264056 -115596 32859 198246
4843 198246 88995 -11226 -24920 -92833 -255670 61219 -102576 -364638 -29276 41860 -139591
4831 71265 51104 139742 27364 6973 17729 221587 531137 177038 -143086 68991 90155
4820 90155 130158 -207542 217876 38917 -16861 140992 100737 -241840 -115508 -243463 -24330
4808 -129095 123341 -127639 96792 328348 -74609 -145425 -104152 -41901 29838 -228319 169164
4796 -34027 -20182 138845 -10276 124425 51009 6064 233338 52807 -187972 165650 141338
4785 141338 -452799 120435 -33073 -164119 -225473 178647 -111067 -184489 -113026 -276267
4775 -276267 -262653 160302 -137138 -109623 -193846 306790 183144 -189896 -155585 -92981 183979
4763 -318228 115138 -195258 -51551 -282000 54507 -62535 23598 99102 210456 -144419 -71512
4751 -151942 122843 -102392 106557 208816 -121598 86061 -268952 53420 207000 -356585
4740 -229451 -17608 305844 94241 293471 10310 148520 42921 -1415 318991 123613 36590
4728 -251969 -8872 -23698 -49970 -57888 320587 142368 41617 -151273 -53504 26716 3544 26189
4716 26189 -263420 174521 -40540 -144344 188782 -181455 -14241 104640 -26973 180410
4705 -106702 15833 77965 -165180 -375626 223335 -57000 70878 57131 -81141 837 -266389
4693 121793 259782 255904 -194786 208057 -387135 78651 42463 82292 180907 127521 30261
4681 -25442 -2061 149528 30988 -86772 -52061 188516 157616 215830 -32531 168402 -81022
4669 -20400 114040 -42407 384014 -114880 -55034 194517 35527 -57555 160798 195672 197826
4658 197826 -17642 -336670 102669 -62594 39580 13946 178977 -235003 106138 7755 -61924
4646 -48045 107802 181284 -332343 -107625 97688 121716 331001 -209777 197087 166541 137823
4635 137823 235370 35452 -327516 -88452 -62926 84073 -71882 -21041 -28722 -79362 -277872
4624 -277872 -43329 95449 -233985 4949 -108191 -34768 -138382 -19953 88483 -81339 168783
4612 91946 -144220 -129315 -27255 -45459 124655 42836 -51881 46788 -12118 -149594 300339
4600 35219 408814 -405318 -205160 245133 -181135 -21483 -77081 462879 -58860 -125760 -15182
4588 248265 -187501 110592 90087 -156543 -166188 -180911 82936 -97932 138693 67906 110940
4577 110940 144577 50394 132602 -258521 111833 -161873 -164092 -124336 -152768 -261428 -114139
4565 -293743 84132 -163688 -117513 94328 133609 -36516 -179310 -56320 135042 -143811 241922
4553 11737 -181526 -69269 37521 -98283 45534 -257753 149932 48003 58933 -284 -206167
4542 -206167 127052 116234 101602 319284 -7399 417291 332812 115478 53344 347726 -61596
4530 230012 -123245 -71611 184083 -13170 -9619 75657 300087 163626 -104271 -334122 -102899
$$ [...]
##END NTUPLES=NMR SPECTRUM
##END=
