
##TITLE=AC1378_MEXAH12190_7519188_bsWp4RNT6U
##JCAMPDX= 6.0         $$ Bruker NMR JCAMP-DX V2.0
##DATA TYPE= NMR SPECTRUM
##DATA CLASS= NTUPLES
##ORIGIN= BRUKER
##OWNER= Administrator
$$ 1.72 TOPSPIN		Version 2.1
$$ 2013-02-20 20:34:30.486 -0500  Administrator@X
$$ Compression mode = diff/dup
##.OBSERVE FREQUENCY= 400.02188249412
##.OBSERVE NUCLEUS= ^1H
##.ACQUISITION MODE= SIMULTANEOUS (DQD)
##.ACQUISITION SCHEME= undefined
##.AVERAGES= 64
##.DIGITISER RES= 22
##SPECTROMETER/DATA SYSTEM= spect
##.PULSE SEQUENCE= noesygpps1d.comp
##.SOLVENT NAME= COFFEE_meoh
##.SHIFT REFERENCE= INTERNAL, COFFEE_meoh, 1, 14.9609
##AUDIT TRAIL= $$ (NUMBER, WHEN, WHO, WHERE, PROCESS, VERSION, WHAT)
$$ ##TITLE= Audit trail, TOPSPIN		Version 2.1
$$ ##JCAMPDX= 5.01
$$ ##ORIGIN= Bruker BioSpin GmbH
$$ ##OWNER= Administrator
$$ $$ E:\/data/COFFEE/nmr/AC1378_MEXAH12190_7519188_bsWp4RNT6U/12/pdata/1/auditp.txt
$$ ##AUDIT TRAIL=  $$ (NUMBER, WHEN, WHO, WHERE, PROCESS, VERSION, WHAT)
(   1,<2013-02-20 20:34:24.330 -0500>,<Administrator>,<X>,<go>,<TOPSPIN 2.1>,
      <created by zg
	started at 2013-02-20 20:22:53.465 -0500,
	POWCHK enabled, PULCHK disabled,
       configuration hash MD5:
       86 BA 57 50 F2 9D 5C 9B 26 00 A9 28 5F 66 2E 89
       data hash MD5: 64K
       A8 FB 67 A2 84 25 EF D1 5C 9E 0F 45 4C 3A A2 5E>)
(   2,<2013-02-20 20:34:27.517 -0500>,<Administrator>,<X>,<proc1d>,<TOPSPIN 2.1>,
      <Start of raw data processing
       efp LB = 0.3 FT_mod = 6 PKNL = 1 PHC0 = 0 PHC1 = 0 SI = 128K 
       data hash MD5: 128K
       B0 35 3A D2 4E E4 10 A9 DE D3 6E 5F D3 D2 E7 B7>)
(   3,<2013-02-20 20:34:28.611 -0500>,<Administrator>,<X>,<proc1d>,<TOPSPIN 2.1>,
      <pk PHC0 = 250.1642 PHC1 = 0 
       data hash MD5: 128K
       D0 14 74 AF 57 45 A7 D7 E4 0D 0E 4D 43 0B AE 91>)
(   4,<2013-02-20 20:34:29.330 -0500>,<Administrator>,<X>,<proc1d>,<TOPSPIN 2.1>,
      <abs ABSG = 1 
       data hash MD5: 128K
       83 2E 49 59 22 DD 5D 33 EC 85 78 91 E5 7C 5D 5E>)
(   5,<2013-02-20 20:34:29.658 -0500>,<Administrator>,<X>,<proc1d>,<TOPSPIN 2.1>,
      <abs ABSG = 2 
       data hash MD5: 128K
       7C B9 B9 33 B5 7A EC 79 D6 22 83 3D 47 18 A7 A5>)
(   6,<2013-02-20 20:34:29.798 -0500>,<Administrator>,<X>,<proc1d>,<TOPSPIN 2.1>,
      <abs ABSG = 3 
       data hash MD5: 128K
       28 3C 8D 5F 81 9E 1A B4 D2 0A FA C4 6E 23 E5 43>)
(   7,<2013-02-20 20:34:29.986 -0500>,<Administrator>,<X>,<proc1d>,<TOPSPIN 2.1>,
      <abs ABSG = 4 
       data hash MD5: 128K
       72 1E 87 E3 17 D5 C9 60 6F C0 78 C3 E5 28 5A A1>)
(   8,<2013-02-20 20:34:30.173 -0500>,<Administrator>,<X>,<proc1d>,<TOPSPIN 2.1>,
      <abs ABSG = 5 
       data hash MD5: 128K
       58 00 70 AA 55 A8 07 78 C9 E3 87 C8 04 20 F0 07>)
$$ ##END=
$$ 
$$ $$ hash MD5
$$ $$ AC E8 14 F6 7D 17 F7 B0 3D 11 EC 8D 91 ED D6 5D
##$RELAX= 
##$RELAX= 
##$RELAX= 
##$RELAX= 
##$RELAX= 
##$RELAX= 
##$RELAX= 
##$RELAX= 
$$ Bruker specific parameters
$$ --------------------------
##$DU= <E:\>
##$EXPNO= 12
$$ [...]
150 150 150 150 150 150 150 150
##$TP07= 0
##$TPNAME0= <>
##$TPNAME1= <>
##$TPNAME2= <>
##$TPNAME3= <>
##$TPNAME4= <>
##$TPNAME5= <>
##$TPNAME6= <>
##$TPNAME7= <>
##$TPOAL= (0..7)
0.5 0.5 0.5 0.5 0.5 0.5 0.5 0.5
##$TPOFFS= (0..7)
0 0 0 0 0 0 0 0
##$TUNHIN= 0
##$TUNHOUT= 0
##$TUNXOUT= 0
##$USERA1= <user>
##$USERA2= <user>
##$USERA3= <user>
##$USERA4= <user>
##$USERA5= <user>
##$V9= 5
##$VALIST= <valist>
##$VCLIST= <CCCCCCCCCCCCCCC>
##$VD= 0
##$VDLIST= <DDDDDDDDDDDDDDD>
##$VPLIST= <PPPPPPPPPPPPPPP>
##$VTLIST= <TTTTTTTTTTTTTTT>
##$WBST= 1024
##$WBSW= 4
##$XGAIN= (0..3)
0 0 0 0
##$XL= 0
##$YL= 0
##$YMAX_a= 6240384
##$YMIN_a= -11210996
##$ZGOPTNS= <>
##$ZL1= 120
##$ZL2= 120
##$ZL3= 120
##$ZL4= 120
##$ABSF1= 14.9609
##$ABSF2= -5.597281
##$ABSG= 5
##$ABSL= 3
##$ALPHA= 0
##$AQORDER= 0
##$ASSFAC= 0
##$ASSFACI= 0
##$ASSFACX= 0
##$ASSWID= 0
##$AUNMP= <proc_prof1d_extract.lims>
##$AXLEFT= 0
##$AXNAME= <>
##$AXNUC= <1H>
##$AXRIGHT= 0
##$AXTYPE= 0
##$AXUNIT= <>
##$AZFE= 0.1
##$AZFW= 0.1
##$BCFW= 0
##$BC_mod= 0
##$BYTORDP= 0
##$COROFFS= 0
##$CY= 15
##$DATMOD= 1
##$DC= 0
##$DFILT= <>
##$DTYPP= 0
##$F1P= 0
##$F2P= 0
##$FCOR= 0.5
##$FTSIZE= 131072
##$FT_mod= 6
##$GAMMA= 0
##$GB= 0
##$INTBC= 1
##$INTSCL= 1
##$ISEN= 128
##$LB= 0.3
##$LEV0= 0
##$LPBIN= 0
##$MAXI= 10000
##$MC2= 0
##$MEAN= 0
##$ME_mod= 0
##$MI= 0
##$NCOEF= 0
##$NC_proc= -2
##$NLEV= 6
##$NOISF1= 0
##$NOISF2= 0
##$NSP= 0
##$NTH_PI= 0
##$NZP= 0
##$OFFSET= 14.9609
##$PC= 1
##$PHC0= 250.1642
##$PHC1= 0
##$PH_mod= 1
##$PKNL= yes
##$PPARMOD= 0
##$PPDIAG= 0
##$PPIPTYP= 0
##$PPMPNUM= 2147483647
##$PPRESOL= 1
##$PSCAL= 4
##$PSIGN= 0
##$PYNMP= <proc.py>
##$REVERSE= no
##$SF= 400.020009676438
##$SI= 131072
##$SIGF1= 0
##$SIGF2= 0
##$SINO= 400
##$SIOLD= 131072
##$SPECTYP= <>
##$SREGLST= <1H.CDCl3>
##$SSB= 0
##$STSI= 131072
##$STSR= 0
##$SW_p= 8223.68421052631
##$SYMM= 0
##$S_DEV= 0
##$TDeff= 65536
##$TDoff= 0
##$TI= <>
##$TILT= no
##$TM1= 0
##$TM2= 0
##$TOPLEV= 0
##$USERP1= <user>
##$USERP2= <user>
##$USERP3= <user>
##$USERP4= <user>
##$USERP5= <user>
##$WDW= 1
##$XDIM= 131072
##$YMAX_p= 423092605
##$YMIN_p= -11541
##$CURPLOT= <Network HP LaserJet P1505>
##$CURPRIN= <$Network HP LaserJet P1505>
##$DFORMAT= <normdp>
##$LAYOUT= <+/1D_H.xwp>
##$LFORMAT= <normlp>
##$PFORMAT= <normpl>
##$SURQMSG= 1
$$ End of Bruker specific parameters
$$ ---------------------------------
##NTUPLES= NMR SPECTRUM
##VAR_NAME=  FREQUENCY,     SPECTRUM/REAL,   SPECTRUM/IMAG
##SYMBOL=    X,             R,               I
##VAR_TYPE=  INDEPENDENT,   DEPENDENT,       DEPENDENT
##VAR_FORM=  AFFN,          ASDF,            ASDF
##VAR_DIM=   131072,        131072,          131072
##UNITS=     HZ,            ARBITRARY UNITS, ARBITRARY UNITS
##FACTOR=    0.0627417313425164, 1,          1
##FIRST=     8223.62146879497, -3061,        -62411
##LAST=      0,             -647,            -63243
##MIN=       0,             -11541,          0
##MAX=       8223.62146879497, 423092605,    0
$$ Real data points
##PAGE= N=1
##DATA TABLE= (X++(R..R)), XYDATA
$$ [...]
67924 88307 88232 88145 88402 89019 89515 89622 89788 90516 91550 92234 92410 92361 92061 91155 89642 87916 86163 84324
67906 84324 82647 81535 80731 79446 77603 76214 76083 76714 77028 76668 76067 75683 75718 76258 77131 77845 78166 78462
67888 78462 79025 79396 79002 78224 78058 78742 79380 79053 77760 76169 74970 74639 75275 76406 77329 77905 78660 79881
67870 79881 81065 81644 81939 82835 84567 86326 87154 86913 86244 85879 86181 87075 88050 88276 87122 84773 82153
67853 82153 80070 78572 77285 76131 75394 75151 75018 74555 73686 72656 71816 71481 71723 72190 72384 72243 72211 72601
67835 72601 73199 73681 74134 74870 75840 76595 76863 77007 77844 79957 83020 85895 87654 88552 89700 91732 94163
67818 94163 96186 97603 98708 99650 100346 100742 100705 99873 98023 95486 92824 90287 87919 85943 84493 83095
67802 83095 80987 78064 75088 72846 71449 70501 69661 68889 68394 68402 68805 69099 68854 68189 67515 66931 66212 65327
67784 65327 64563 64123 63940 63919 64029 64134 64080 63981 64083 64349 64571 64921 65874 67424 68814 69350 69177 69019 69401
67765 69401 70380 71819 73610 75695 78034 80449 82509 83801 84395 84758 85065 84927 84049 82864 82156 82145 82291
67748 82291 82004 81330 80863 81125 82049 83065 83670 83891 84104 84471 84772 84788 84611 84426 84081 83068 80920 77723
67730 77723 74264 71550 69973 69016 67963 66720 65639 64749 63696 62403 61247 60476 59998 59899 60552 61898
67714 61898 63177 63818 64146 64678 65132 64779 63563 62274 61641 61717 62115 62443 62531 62607 63159 64278 65275 65375 64703
67695 64703 64125 64213 64779 65357 65611 65335 64658 64252 64742 65759 66226 65762 65182 65301 65901 66346 66640 67208 68001
67676 68001 68498 68456 68114 67733 67405 67275 67484 67937 68444 69090 70084 71290 72278 72819 73007 72975 72856 72951 73512 74366
67656 74366 75176 76012 77116 78125 78188 77091 75653 74655 73940 73001 71998 71573 71915 72541 72873 72635 71874 71081
67638 71081 71093 72258 73684 73914 72541 70735 69944 70394 71108 71204 70885 71101 72384 74163 75441 76111 77162
67621 77162 79344 82040 83939 84508 84214 83515 82430 81080 79875 78937 78010 77277 77567 79336 81950 84468
67605 84468 86582 88274 89067 88465 86899 85453 84596 83750 82221 80052 77877 76298 75540 75401 75438 75376 75294
67588 75294 75198 74593 72943 70584 68687 68122 68622 69149 68889 67776 66319 65047 64025 62915 61597 60601
67572 60601 60658 61876 63671 65466 67093 68532 69637 70252 70331 69825 68729 67291 65932 64867 64070 63580
67556 63580 63488 63556 63317 62704 62189 62080 62090 61955 62031 62793 63999 64919 65338 65784 66677 67644 67948 67319 66126 64892
67536 64892 63865 63095 62635 62540 62716 62958 63197 63569 64117 64552 64493 63876 62958 61975 61067 60525 60776 61889 63260
67517 63260 63982 63544 62138 60423 59011 58075 57404 56871 56731 57234 58045 58433 58107 57569 57526 58189 59222 60071
67499 60071 60248 59683 59001 59123 60283 61680 62318 61879 60577 58622 56337 54443 53574 53577 53827 54144 54849 55934
67481 55934 56830 57224 57567 58422 59706 60922 61817 62423 62664 62356 61607 60881 60555 60594 60671 60546 60294 60160 60186
67462 60186 60011 59210 57868 56665 56317 57088 58855 61296 63774 65419 65808 65508 65494 65945 66057 65137 63474
67445 63474 61881 60758 60024 59705 60074 61185 62689 64237 65761 67238 68434 69059 69038 68507 67745 67154 67097
67428 67097 67568 68184 68669 69169 69881 70598 70887 70581 69875 69004 68144 67554 67478 67862 68379 68781 69018 69077 68916 68555
67408 68555 68003 67133 65889 64606 63804 63611 63694 63745 63692 63398 62625 61558 60949 61375 62561 63699 64234 64149 63734
67389 63734 63393 63470 63920 64291 64345 64492 65241 66358 67055 66993 66622 66371 66012 65152 64077 63623 64217 65360 66183
67370 66183 66330 66155 66161 66496 67028 67637 68211 68515 68423 68241 68392 68703 68421 67206 65745 64939 64755 64389 63525
67351 63525 62866 63228 64498 65752 66201 65758 64792 63634 62397 61128 59950 58986 58248 57718 57519 57775 58253
67334 58253 58444 58211 58156 59031 60830 62768 64168 65145 66376 68363 70938 73350 74870 75482 75896 76713 77685
67317 77685 78039 77422 76222 75030 74187 73859 74127 74796 75447 75870 76222 76647 77026 77270 77531 77895 78143 78100 77950
67298 77950 77934 77955 77860 77882 78355 79098 79554 79597 79747 80439 81398 81967 81830 81199 80452 79788 79214 78686 78195 77772 77426
67277 77426 77208 77277 77778 78492 78887 78718 78383 78280 78005 76870 75258 74695 76072 78365 79791 79928 79939 80807
67259 80807 82182 83193 83636 83819 83718 82937 81445 79834 78777 78488 78712 79012 79051 78857 78884 79631 81133 82921
67241 82921 84429 85272 85202 84202 82802 82003 82489 83862 84948 84959 84250 83808 84127 84774 84994 84480 83459 82271
67223 82271 81133 80195 79577 79296 79351 79870 80941 82340 83659 84751 85702 86364 86361 85812 85586 86336 87545 88060
67205 88060 87502 86665 86496 87136 88044 88690 88944 89096 89680 91021 92787 94130 94463 94015 93647 94184 95825 97912
67187 97912 99329 99429 98660 98010 97817 97511 96585 95386 94692 94838 95513 96215 96626 96715 96675 96705 96762 96667 96471 96437
67167 96437 96611 96763 96847 97179 97955 99013 100252 101850 103736 105323 106168 106518 106691 106346 105047 103270 102103
67150 102103 101979 102439 103135 104273 105822 107055 107417 107373 107867 109181 110798 112202 113358 114423 115383 116057
67134 116057 116319 116265 116302 117018 118720 121004 122863 123428 122646 121307 120399 120414 121215 122464 124020 125878 127866
67117 127866 129623 130918 131827 132516 132921 132838 132377 132164 132843 134311 135667 136169 136092 136364 137436 138860 139985
67100 139985 140640 140997 141226 141619 142668 144515 146496 147660 147729 147198 146626 146214 146091 146539 147690 149247 150670
67083 150670 151586 151987 152145 152384 152907 153860 155555 158285 161703 164685 166215 166377 166181 166481 167379 168610 170075
67066 170075 171904 174226 176958 179664 181739 183017 184090 185723 187984 190324 192372 194197 195800 196952
67052 196952 197743 198814 200727 203365 206142 208594 210602 212365 214292 216679 219305 221568 223127 224162
67038 224162 224965 225669 226497 227842 229807 232014 234179 236525 239322 242361 245277 248100 251042 253899 256226
67023 256226 258028 259787 261771 263769 265676 267910 270949 274697 278639 282517 286521 290776 294962 298678
67009 298678 302042 305593 309587 313690 317461 320808 323828 326595 329493 333343 338551 344273 349164 352965
66995 352965 356680 361041 365543 369418 372892 376917 382106 388426 395574 403025 409956 415783 420718 425429
66981 425429 430308 435525 441487 448528 456174 463389 469717 475685 481999 488815 495990 503506 511333 519274
66967 519274 527303 535759 544887 554350 563503 572087 580474 589349 599227 610087 621283 632056 642389
66954 642389 653194 665354 678668 692036 704619 716548 728492 740949 754159 768329 783497
66943 783497 799168 814525 829211 843798 859327 876425 894929 914122 933172 951563 969541
66932 969541 988140 1008381 1030272 1052866 1075430 1098250 1122055 1146993 1172564 1198393 1224591
66921 1224591 1251404 1278921 1307188 1336184 1365549 1394734 1423705 1453290 1484467 1517433 1551639
66910 1551639 1586624 1622467 1659375 1697189 1735497 1774015 1812685 1851541 1890802 1930984 1972558
66899 1972558 2015296 2058222 2100498 2142336 2184839 2228951 2274629 2320892 2366500 2410695 2453591
66888 2453591 2495907 2538118 2579849 2620299 2659217 2697121 2734519 2771298 2807071 2841658 2874844
66877 2874844 2905981 2934383 2960074 2983665 3005414 3024776 3041037 3054052 3064135 3071431 3075628 3076246
66865 3076246 3073092 3066503 3057185 3045637 3031693 3014817 2994951 2972798 2948975 2923120 2894316 2862399
66853 2862399 2828431 2793649 2758285 2721746 2683661 2644269 2603841 2562279 2519498 2475843 2431818
66842 2431818 2387595 2343070 2298253 2253345 2208558 2164096 2120158 2076642 2032986 1988708 1944109
66831 1944109 1900126 1857424 1815974 1775518 1736034 1697614 1660186 1623623 1587862 1552784 1518238
66820 1518238 1484382 1451734 1420607 1390645 1361163 1331771 1302483 1273403 1244653 1216546 1189514
66809 1189514 1163756 1139046 1114905 1090948 1067160 1043902 1021539 1000067 979261 959099 939731
66798 939731 920985 902336 883595 865270 847922 831487 815563 800101 785345 771247 757413
66787 757413 743546 729533 715206 700519 685954 672232 659462 647009 634386 621907 610158
66776 610158 599195 588598 578178 568234 559118 550805 543001 535450 527967 520239 511887 502839 493540
66763 493540 484555 476025 467754 459815 452716 446816 441829 437025 431726 425458 418095 410253 403223 397908
66749 397908 393814 389480 383965 377608 371452 366331 362484 359528 356639 353128 349032 344889 340905 336750
66735 336750 332318 328185 324906 322205 319295 315814 312006 308039 303733 299069 294539 290629 287204 283734
66721 283734 280063 276556 273402 270203 266543 262717 259424 256781 254102 250796 247093 243647 240783 238449
66707 238449 236613 235229 233906 232081 229545 226570 223549 220791 218584 217061 215925 214595 212725 210388
66693 210388 207779 204993 202165 199539 197291 195446 193959 192665 191191 189257 187112 185333 184071 182757
66679 182757 180755 178067 175249 172818 170929 169524 168577 168162 168263 168520 168352 167542 166599 166172 166144 165620 163846
66662 163846 160796 156839 152400 148183 145250 144310 145024 146326 147364 147900 147993 147656 146867 145588 143792 141618
66646 141618 139564 138324 138325 139459 141239 143127 144740 145796 145980 145001 142902 140198 137511 135065 132778
66631 132778 130837 129829 130059 130969 131495 130985 129640 128161 127180 126932 127262 127807 128191 128140 127596 126875 126588 127051
66613 127051 127773 127830 126908 125633 124707 124039 123059 121572 119888 118291 116880 115913 115730 116103 116127 115149 113584
66596 113584 112396 111853 111235 109892 108181 106998 106629 106489 105979 105170 104547 104463 105108 106620 108758 110655 111328
66579 111328 110514 108744 106719 104955 103896 103786 104299 104688 104499 103843 102955 101928 101063 100927 101673 102581 102680
66562 102680 101675 100019 98307 96897 95890 95133 94403 93822 93913 94932 96321 97151 97025 96268 95431 94920 94975
66545 94975 95552 96182 96279 95617 94409 93027 91893 91409 91623 92026 92024 91518 90756 89830 88784 87905 87344 86575 85052
66526 85052 83384 82896 83741 84371 83494 81799 80933 81343 82080 82384 82338 82054 81292 80268 79894 80603 81527 81482 80383
66507 80383 79134 78443 78345 78718 79519 80452 80962 80783 80169 79462 78754 78101 77667 77484 77336 77145 77176 77613 78154
66488 78154 78320 78034 77605 77266 77048 77060 77509 78359 79165 79414 78966 78151 77494 77292 77355 77196 76605 75972 75888 76469
66468 76469 77267 77778 77834 77496 76808 75826 74766 74017 73980 74808 76164 77291 77541 76920 76050 75551 75544 75739 75883
66449 75883 76065 76589 77544 78542 79097 79274 79680 80612 81475 81413 80349 79014 78075 77649 77647 78055 78770 79579 80491
66430 80491 81723 83183 84320 84724 84600 84377 84167 83908 83770 84013 84467 84532 83745 82224 80566 79395 78944
66413 78944 78914 78764 78223 77496 76942 76696 76614 76456 76044 75383 74746 74506 74797 75416 76003 76162 75477 73779 71571
66394 71571 69914 69609 70543 71910 72896 73113 72642 71928 71497 71584 72047 72620 73061 73047 72289 70928 69591 68846
66376 68846 68785 69200 69908 70758 71618 72551 73773 75164 76193 76571 76711 77150 77672 77460 76039 73817 71718
66359 71718 70493 70265 70487 70393 69694 68819 68384 68602 69352 70518 71905 73032 73408 73039 72358 71682 70928 69892
66341 69892 68582 67243 66166 65437 64869 64283 63842 63886 64416 65072 65678 66425 67372 68276 69162 70472 72218 73516
66323 73516 73604 72908 72419 72285 71821 70788 69759 69158 68712 68167 67920 68520 69934 71574 72825 73392 73406 73322
66305 73322 73405 73280 72288 70387 68328 66869 66176 66075 66437 67081 67712 68202 68696 69186 69304 68789 67948 67402
66287 67402 67533 68320 69465 70434 70595 69641 67933 66326 65647 66234 67730 69308 70316 70793 71238 71912 72713
66270 72713 73639 74921 76469 77648 77885 77255 76187 74917 73559 72469 72050 72243 72586 72747 72717 72513 72107
66253 72107 71697 71697 72153 72401 71606 69613 67066 64736 63048 62287 62803 64586 66796 68246 68476 68031 67569
66236 67569 67136 66571 66140 66247 66774 67279 67781 68771 70406 72167 73502 74358 74854 74829 74074 72819 71656 70982
66218 70982 70708 70514 70303 70396 71255 72925 74814 76145 76601 76392 75826 75055 74183 73355 72665 72161 71955 72124
66200 72124 72513 72912 73370 74034 74738 75125 75215 75434 75902 76140 75813 75413 75746 76826 77726 77636 76776 76061 75992 76202
66180 76202 76145 75950 76234 77125 77910 77872 77128 76386 76101 76239 76589 76912 76868 76314 75676 75621 76319 77275 77862 77742
66160 77742 76901 75682 74692 74257 74013 73488 72968 73197 74207 75051 74870 73732 72285 71192 71045 72178 74185
66143 74185 76096 77393 78398 79362 79737 78918 77295 75929 75383 75375 75478 75658 76083 76804 77789 79047 80563
66126 80563 82079 83023 82888 81873 80936 80813 81121 80904 79946 78937 78342 77925 77601 77896 79049 80354 81084
66109 81084 81570 82622 84229 85504 85762 85042 83749 82365 81440 81306 81713 82160 82515 83018 83757 84583 85441
66092 85441 86430 87548 88675 89739 90602 90999 90933 90978 91766 93184 94404 94671 93861 92393 90912 89899 89303
66075 89303 88699 88005 87740 88216 88868 88916 88442 88210 88587 89224 89702 89864 89503 88398 86787 85356 84577 84462
66057 84462 84936 85930 87010 87484 87155 86591 86460 86880 87579 88290 88809 89045 89219 89748 90692 91531 91666 90987 89848
66038 89848 88797 88383 88930 90218 91566 92412 92739 92945 93472 94532 95875 96782 96702 96059 96071 97486 99728
66021 99728 101601 102605 103216 104059 105252 106624 108133 109745 111079 111618 111385 111114 111512 112493 113456 114191 115087
66004 115087 116389 117750 118769 119597 120630 121945 123445 125350 128057 131580 135531 139555 143388 146623
65990 146623 148947 150694 152702 155478 158760 161945 164622 166613 167837 168340 168270 167721 166661 164975 162457
65975 162457 158916 154575 150190 146424 143203 140036 136839 133995 131678 129637 127677 125878 124249 122652
65961 122652 121203 120265 119885 119657 119353 119236 119541 120008 120244 120223 120151 120115 120103 120157 120267 120373 120670 121680 123747
65942 123747 126569 129419 131713 133307 134462 135627 137076 138670 140122 141456 142841 144088 144823 145242 146109
65927 146109 147701 149330 150357 151188 152677 154788 156510 157119 157076 157596 159588 163059 167310 171596 175678
65912 175678 179740 183888 187948 191750 195268 198347 200651 202153 203337 204618 205835 206628 207066 207534 208178
65897 208178 208854 209458 209950 210186 210087 209803 209351 208271 206157 203419 200965 199048 196930 193802 189530 184362
65881 184362 178455 172113 166081 161044 156909 153004 148968 145164 142137 139993 138428 137178 136212 135530 134931
65866 134931 134103 132960 131837 131256 131376 131727 131622 130896 130146 130149 131115 132626 134156 135399 136121 136058 135171 133818
65848 133818 132443 131215 130166 129543 129699 130616 131764 132515 132601 132174 131640 131443 131833 132727 133824 134894 135940
65831 135940 137112 138550 140192 141698 142674 143158 143749 145123 147460 150522 154090 158118 162569 167372 172481
65816 172481 177808 183223 188744 194393 199619 203248 204534 203952 202471 200357 197411 194049 191059 188241
65802 188241 184394 179073 173471 169017 165818 163089 160483 158268 156589 155263 154054 152687 150900 148958
65788 148958 147768 147899 148816 149658 150458 151934 154275 156900 159382 162016 165407 169986 175941 183173 191272
65773 191272 199844 208762 217743 225905 232288 236633 239137 239613 237601 233274 227487 220820 213236 204909
65759 204909 196695 189409 183125 177546 172592 168292 164570 161621 160179 160841 163260 166540 170425 175668
65745 175668 183044 192320 202526 213117 224492 237091 250211 262199 271914 279537 285690 290254 292592
65732 292592 292548 290451 286252 279494 270361 260040 249680 239467 229059 218454 207980 197818 188023
65719 188023 178845 170642 163505 157204 151400 145802 140362 135504 131822 129308 127121 124452 121355 118475
65705 118475 116210 114530 113391 112864 112948 113599 114818 116401 117767 118424 118550 118684 118969 119106 118986 118884 118987
65688 118987 119246 119749 120708 121893 122655 122830 123170 124476 126663 129042 131201 133118 134778 136322 138448 141979
65672 141979 146931 152574 158523 165205 173009 181588 190506 200175 211513 224773 239204 253844 268137
65659 268137 281697 294033 304788 314011 321854 328176 332682 335361 336528 336513 335536 333915 332198 330981
65645 330981 330659 331371 333093 335670 338713 341499 343104 342848 340691 337108 332455 326506 318611 308281 295588
65630 295588 281192 266081 251168 236912 223298 210237 197950 186835 177075 168496 160824 153935
65618 153935 147888 142809 138725 135401 132426 129615 127242 125635 124534 123155 120985 118264 115584 113346
65604 113346 111838 111492 112534 114411 116087 117007 117455 117791 117790 117108 116097 115633 116116 117093 117923 118444 118825 119131
65586 119131 119343 119626 120253 121336 122851 124829 127300 130096 132966 135883 139029 142548 146576 151532 158089
65571 158089 166640 176975 188599 201167 214453 228070 241494 254325 266264 276807 285246 291170
65559 291170 294793 296494 296104 292970 286931 278912 270256 261516 252254 241952 230756 219234 207889
65546 207889 197106 187260 178449 170341 162602 155425 149345 144657 141233 138752 136877 135361 134293 134097
65532 134097 134995 136669 138711 141107 143842 146314 147767 148152 147920 147062 145058 141792 137811 133584 129257
65517 129257 125309 122553 121078 119915 118310 116757 116230 116862 117936 118776 119070 118687 117748 116724 115977 115439
65501 115439 115098 115371 116444 117594 117919 117558 117515 118275 119249 119673 119559 119606 120520 122490 125093 127762 130522
65484 130522 134061 138765 143933 148429 151914 154875 157607 159785 161085 161676 161914 161957 161774 161173 159783 157371
65468 157371 154228 150925 147681 144345 140989 138047 135729 133721 131619 129411 127373 125681 124217 122663
65454 122663 120832 119035 117914 117633 117478 116638 115247 114215 114145 114878 115957 116982 117570 117576 117435 117766 118602
65437 118602 119495 120414 121858 123942 125993 127387 128361 129654 131702 134411 137406 140257 142641 144401 145302
65422 145302 144862 142895 140124 137690 135975 134450 132735 131127 129903 128823 127721 127009 127155 128070 129421
65407 129421 131089 132929 134524 135614 136399 136998 137054 136356 135537 135549 136614 138184 139822 141709 144310 147833
65391 147833 151898 155607 158123 159430 160266 161169 161869 161840 161008 159598 157695 155426 153246 151537 150162 148828
65375 148828 147713 147285 147705 148803 150421 152348 154134 155481 156677 158173 159864 161293 162443 163777 165562
65360 165562 167694 170248 173673 178244 183650 189342 195039 200809 206852 213231 219721 225994 232078 238350
65346 238350 244773 250433 254262 256072 256393 255485 253160 249621 245767 242304 238996 235111 230331 224906 219136
65331 219136 213053 206545 199565 192216 184745 177532 171105 166024 162562 160370 158681 157048 155687 154924
65317 154924 154551 154057 153229 152128 150624 148586 146525 145382 145387 145537 144583 142354 139877 138336 138103 138590 138814
65300 138814 138174 136862 135575 134857 134771 135124 135811 136912 138611 141054 144146 147466 150539 153164 155364 157096
65284 157096 158256 158947 159403 159566 159007 157477 155345 153311 151766 150557 149326 147892 146330 144827 143586
65269 143586 142854 142818 143252 143395 142527 140791 139149 138407 138502 138918 139330 139522 139028 137446 135031 132612 131024
65252 131024 130914 132744 136311 140352 143277 144425 144163 142855 140520 137584 135153 134018 133889 134008 134051 134035
65236 134035 133889 133656 133752 134435 135214 135374 134900 134398 134203 134092 133826 133471 133162 132953 132899 132928 132608 131504 129784
65217 129784 128105 126821 125743 124750 124181 124361 125106 125984 126770 127430 127947 128449 129204 130176 130841 130844 130610 130851
65199 130851 131556 132000 131812 131563 132078 133429 134840 135467 135125 134385 134023 134304 134820 135158 135566 136602 138166
65182 138166 139369 139566 139085 138693 138754 139290 140475 142409 144528 145855 146026 145702 145795 146535 147413 147833 147697 147422
65164 147422 147452 147755 148005 148331 149542 152237 155981 159808 163403 167174 171243 175054 178164 180890 183887
65149 183887 187508 191849 197042 203222 210463 218940 228847 240070 252351 265934 281520 299203 317834
65136 317834 335801 352141 366675 379528 391014 401642 411698 420927 428909 435458 440318 442865
65124 442865 442644 439987 435614 429837 422655 414408 405689 396642 386860 375965 363889 350634 336230
65111 336230 321003 305544 290441 276267 263610 252700 243083 234109 225610 217738 210349 203107 196066
65098 196066 189549 183494 177469 171423 165939 161661 158866 157509 157198 157132 156642 155876 155526 155895 156712 157740
65082 157740 158920 159944 160413 160552 161029 161916 162534 162586 162641 163076 163266 162403 160633 158830 157640 157149 157097 156909
65064 156909 155945 154252 152755 152329 152938 154007 155166 156094 156130 154863 152981 151857 152248 153806 155755 157560
65048 157560 158956 159869 160398 160560 160099 158897 157435 156388 155768 154981 153804 152768 152349 152174 151388 149571
65032 149571 146970 144029 141084 138493 136648 135632 135023 134330 133529 132913 132441 131697 130705 130332 131332 133232
65016 133232 134744 135273 135426 135942 136776 137520 138128 138798 139519 140231 141152 142535 144262 146077 148021 150263 152647
64999 152647 154777 156511 158073 159718 161524 163379 164968 165932 166254 166350 166537 166653 166486 166346 166795 167916
64983 167916 169225 170339 171404 172827 174779 176991 178909 180099 180565 180564 180115 178964 177102 174957 172826
64968 172826 170513 167839 165099 162589 160085 157311 154667 152837 151802 150883 149718 148593 147779 147135 146482
64953 146482 145847 145158 144178 142956 141921 141348 141064 140880 140914 141237 141511 141308 140645 139950 139582 139501 139336 138703 137558
64934 137558 136305 135475 135353 136020 137599 140112 143095 145726 147460 148351 148720 148739 148433 147810 146916 145944 145303
64917 145303 145294 145675 145835 145503 145014 144747 144663 144578 144669 145380 146923 149060 151373 153596 155723 157871 160132 162627
64899 162627 165622 169318 173437 177451 181530 186790 193917 201747 208049 211816 214047 216138 218384 220494
64885 220494 222680 225354 228224 230623 232569 234684 237013 238649 238696 237071 234244 230704 226936 223396 220135
64870 220135 216743 212980 209288 206364 204369 202896 201661 200901 200918 201420 201540 200613 198893 197326 196493 195871
64854 195871 194324 191297 187311 183263 179501 175772 171859 167976 164548 161828 159805 158292 157061 156000
64840 156000 155198 154782 154725 154934 155551 156843 158615 159978 160094 159108 158000 157449 157190 156653 155880 155437 155623 156167
64822 156167 156702 157127 157434 157595 157830 158714 160646 163357 166260 169245 172768 177096 181845 186515 191242 196625
64806 196625 202866 209482 216045 222852 230515 238920 246890 252982 256461 257464 256477 253904 250098 245478
64792 245478 240406 235006 229344 223782 218931 215029 211547 207731 203494 199473 196183 193565 191501 190275
64778 190275 190071 190366 190395 190104 190121 190887 192356 194467 197267 200464 203519 206426 209855 214253 219344 224838
64762 224838 230958 237803 244732 251078 257023 263059 268847 273416 276439 278620 280764 283031 285169 286927
64748 286927 288145 288885 289565 290488 291197 290805 288972 286058 282211 277062 270613 263770 257422 251431 245104
64733 245104 238425 232214 227136 223036 219333 215721 212390 209808 208364 208056 208422 208805 208782 208338 207744 207335
64717 207335 207357 207920 209022 210541 212179 213578 214668 215853 217659 220211 223209 226290 229077 230958 231266
64702 231266 229876 227321 224164 220588 216726 212985 209653 206492 203117 199650 196578 194014 191534 188828
64688 188828 186166 184059 182692 181836 181170 180538 180024 179935 180674 182399 184810 187439 190200 193519 197784 202825
64672 202825 208133 213584 219628 226707 234664 242895 250865 258297 264950 270493 274530 276615 276309 273499
64658 273499 268703 262955 257340 252551 248673 245255 241755 238097 234683 231747 229021 226234 223629 221623
64644 221623 220292 219645 220121 222122 225154 228141 230792 234100 239208 246167 254051 261977 269877 278463 288495
64629 288495 299837 311266 321500 330193 337466 342798 345316 345090 343127 339781 334250 326149 316573 306797
64615 306797 296802 286072 275207 265527 257358 249841 242397 235365 229068 223299 218046 213941 211502 210400
64601 210400 209811 209109 208067 206839 206056 206494 208308 210788 213147 215260 217453 219826 222146 224280 226463
64586 226463 229091 232325 235865 239164 241931 244409 247072 250151 253620 257470 261711 266114 270249 273772
64572 273772 276475 278160 278703 278210 276854 274645 271659 268298 264881 261118 256486 251103 245614 240170 234204
64557 234204 227500 220830 215087 210257 205756 201450 197790 195091 193174 191674 190348 189110 188068 187552
64543 187552 187805 188663 189710 190710 191729 192899 194247 195687 197004 197912 198319 198450 198549 198520 198035 196947 195412
64526 195412 193688 191982 190477 189361 188807 188906 189525 190210 190534 190671 191299 192641 193945 194428 194501 195369 197396
64509 197396 199578 200918 201712 202945 204844 206735 208237 209926 212642 216642 221690 227629 234433 241841
64495 241841 249304 256412 263174 269843 276525 282919 288301 291807 292977 292091 289806 286458 281972 276530
64481 276530 271035 266566 263442 261084 258751 256208 253670 251395 249350 247143 244214 240375 236178 232516
64467 232516 229748 227463 225237 223297 222172 221920 222141 222670 223870 226169 229579 233729 238075 241940 244646
64452 244646 245899 246005 245530 244828 244034 243401 243393 244389 246371 248992 251912 255081 258681 262769 267068 271286
64436 271286 275716 281263 288652 297718 307711 318262 329770 342873 357890 374935 394267 416325
64424 416325 441650 471031 505525 545963 592568 645391 705144 773226 850822 937992 1033331
64413 1033331 1133888 1235392 1333419 1425149 1510055 1588553 1660025 1722144 1771720 1805776 1822274
64402 1822274 1820743 1802685 1771015 1728655 1677416 1617817 1549511 1471961 1385482 1292206 1195881
64391 1195881 1100404 1008493 921679 841017 767353 701087 642197 590478 545548 506706 473181
64380 473181 444546 420598 400802 384115 369438 356044 343619 332210 322166 313791 306929 301109
64368 301109 296133 292144 288930 285611 281328 275989 270026 263678 257000 250371 244452 239582 235646 232562
64354 232562 230460 229262 228524 227968 227837 228463 229773 231558 234047 237763 242819 248637 254443 259773 264416
64339 264416 268051 270164 270322 268491 265065 260676 256030 251846 248727 246870 245949 245468 245278 245583 246498 247749
64323 247749 248833 249248 248664 247160 245383 244099 243486 243110 242655 242219 241735 240700 238926 237162 236372 236545
64307 236545 236684 235820 233656 230496 227093 224349 222468 220454 217135 212689 208513 205522 203343 201336 199560
64292 199560 198296 197371 196588 196273 196717 197458 197885 198314 199718 202322 205215 207550 209615 212407 216450 221423
64276 221423 226815 232557 238836 245445 251754 257465 263125 269479 276433 283084 288677 292967 295669 296310
64262 296310 295008 292752 290368 287716 284483 281318 279401 279114 279863 281113 282807 284651 285718 285073 282427
64247 282427 277984 272039 264923 257013 248640 240233 232598 226645 222601 219803 217486 215601 214632 214779 215551
64232 215551 216172 216260 216109 216299 217063 218132 219191 220228 221289 222159 222620 222833 223077 223241 222986 222331 221689 221268
64214 221268 220818 220006 218689 216760 214153 211135 208255 205863 203867 202057 200446 199279 198909 199664 201486
64199 201486 203642 205176 205782 206025 206684 208113 210253 212894 215841 219104 223038 228112 234543 242355 251636
64184 251636 262322 273883 285731 297862 310494 322986 333816 341758 346481 347799 345196 338580
64172 338580 328990 318015 306827 296028 285869 276173 266540 257144 248868 242148 236220 230169 224224
64159 224224 219285 215539 212450 209889 208259 207463 206693 205546 204691 205032 206679 208999 211343 213517 215845
64144 215845 218892 222847 227117 230825 233694 236109 238337 240221 241662 242833 243674 243699 242609 240718 238464
64129 238464 235901 232992 230132 227987 226929 226902 227660 228877 230211 231585 233340 235930 239577 244381 250508
64114 250508 257875 265769 273238 280007 286777 294480 303380 313029 322867 332632 342155 351012 358541 364131
64100 364131 367477 368746 368764 368889 370310 373324 377492 382489 388370 394955 401543 407640 413332 418316 421069
64085 421069 420030 415519 409475 403119 395820 386639 376069 365460 355369 345388 335350 325890 317767
64072 317767 311154 305593 300298 294605 288575 283112 279142 276760 275497 275161 275834 277172 278394 279087 279570
64057 279570 280321 281467 282918 284485 285814 286732 287836 290135 293805 297821 301274 304583 308961 315079 322853
64042 322853 332211 343288 355862 369255 382986 397035 411285 425076 437564 448297 457240 464331
64030 464331 469150 470928 468960 463287 455037 445947 437411 430018 423835 418831 415004 412424 411226 411305 411949
64015 411949 412015 410613 407433 402478 395853 387961 379521 371116 362949 355201 348272 342422 337500 333397 330410
64000 330410 328647 327342 325482 323118 321433 321293 322267 323407 324523 326226 328852 331856 334355 336045 337532
63985 337532 339876 343823 349296 355510 361625 367380 373198 379724 387252 395536 404081 412633 421420 430965
63971 430965 441733 453895 467260 481348 495672 510163 525338 541901 560186 580077 601431
63960 601431 624344 648994 675409 703587 733833 766885 803729 845441 893300 949015 1014612
63949 1014612 1091865 1181872 1285333 1403259 1537209 1688750 1858846 2047687 2254773 2478928
63939 2478928 2718450 2971387 3235399 3507189 3782326 4055739 4321908 4574296 4805246
63930 4805246 5007417 5175522 5306498 5398434 5450082 5461106 5431767 5362042 5251835 5102529
63920 5102529 4918006 4704078 4467446 4215288 3954778 3691979 3431164 3175520 2928262
63911 2928262 2692826 2472218 2268450 2082346 1913712 1762065 1627345 1509503 1407310
63902 1407310 1318323 1240449 1172836 1114662 1063891 1018218 976776 939836 907033 877024 848900
63891 848900 822865 799180 777301 756439 736252 716577 697176 678295 660964 646154 633931
63880 633931 623862 615963 610737 608484 609019 612027 617352 624980 634931 647090 660998 676029 691993
63867 691993 709331 728417 748916 770174 792040 814753 837991 860547 881201 899622 916179
63856 916179 931053 943761 953434 959349 961276 959513 954645 947170 937323 925246 911154 895150 876984
63843 876984 856331 833411 809055 783948 758040 731022 703209 675506 648470 621868 595358
63832 595358 569229 544174 520541 498139 476712 456327 437336 420104 404692 390733 377709
63821 377709 365496 354403 344548 335454 326527 317737 309503 302129 295680 290257 285904 282284 278843 275345
63807 275345 271958 268877 266225 264269 263237 262815 262235 261053 259450 257655 255500 252811 249882 247152 244617
63792 244617 241909 238898 235873 233122 230527 227758 224759 221992 220018 218820 217717 216124 214272 212910
63778 212910 212411 212555 213121 214192 215669 216915 217261 216688 215801 215269 215390 215957 216316 215773 214221 212293 210746
63761 210746 209817 209253 208772 208310 207977 207937 208233 208637 208886 209089 209612 210455 211085 211156 211005 211088 211272 211177 210977 211276
63741 211276 212268 213623 215302 217845 221542 225768 229551 232622 235507 238711 242134 245294 247865 249896
63727 249896 251680 253586 255948 259004 262861 267479 272655 278088 283561 289115 294878 300568 305311 308224
63713 308224 309277 309328 309219 309014 308287 306812 304624 301644 297775 293384 289209 285709 282859 280666 279360
63698 279360 278869 278562 277878 276924 276159 275878 276317 277860 280533 283583 286200 288575 291559 295288 298814 301323
63682 301323 303062 304718 306391 307697 308517 309042 309204 308664 307457 306230 305647 305827 306568 307822 309693 312075
63666 312075 314575 316820 318630 319902 320563 320747 320850 321091 321072 319963 317276 313329 308894 304487 300148 295801
63650 295801 291601 287819 284523 281553 278779 276239 273987 271984 270335 269449 269688 270831 272197 273436 274898
63635 274898 277025 279642 282241 284824 287999 292246 297522 303675 310829 318999 327649 335964 343583 350839
63621 350839 358333 366476 375435 385348 396422 408749 422156 436449 451959 469595 490053 512985
63609 512985 537281 562207 588039 615636 645766 678819 714598 751918 788553 821802 849171
63598 849171 868796 879920 883335 881022 874974 866511 856723 846880 837816 829239 820263 810353 799159
63585 799159 785660 768356 746616 721400 694435 666998 639619 612599 586544 562462 541314
63574 541314 523286 507643 493645 481473 471856 464925 460061 457002 456355 458586 462981 468176 473466
63561 473466 479152 485777 493533 502377 512207 522742 533475 544063 554829 566839 581384 599184
63549 599184 620017 643192 668491 696502 728102 763923 804475 850059 899509 948784 991595
63538 991595 1022378 1039055 1043066 1037331 1024740 1008257 991123 975911 963493 953407 945062 937999
63526 937999 931114 922484 910396 894067 873085 846772 814782 778129 739054 699841 662017 626372
63514 626372 593171 562346 533970 508522 486330 466906 449402 433659 420148 408734 398272
63503 398272 387820 377753 369155 362446 357074 352326 347972 344207 341268 339128 337361 335443 333312 331477
63489 331477 330404 330031 330037 330282 330724 331213 331752 332740 334548 336991 339586 342180 344942 347910 351079 354872
63473 354872 359882 365947 371881 376360 378824 379439 378585 376636 373953 370725 366919 362583 358064 353781 349916
63458 349916 346470 343491 341076 339248 338018 337420 337343 337439 337441 337568 338419 340495 343909 348514 354075 360325 367082
63441 367082 374501 383080 393260 405036 418116 432442 448405 466572 487420 511544 539800 572563
63429 572563 608393 643666 674137 697255 713127 723476 730071 734253 737488 741780 749329 761823
63417 761823 779937 803344 831279 863321 899661 940374 984323 1028823 1070422 1105883 1132631
63406 1132631 1148885 1154112 1149559 1138035 1122792 1106359 1090206 1075126 1061500 1049058 1036551 1022004
63394 1022004 1003570 980255 951967 919127 882524 843506 803910 765380 728739 694160 661868
63383 661868 632363 605968 582542 561847 543972 529105 517040 507272 499542 493984 490705 489541
63371 489541 490372 493351 498531 505509 513822 523640 535682 550349 567240 585652 605327 626562 649855
63358 649855 675722 704595 736523 771014 807550 846290 887748 931518 975599 1017237 1054140
63347 1054140 1084644 1107150 1120318 1124095 1120151 1110985 1098702 1084658 1069808 1054957 1040693 1027172
63335 1027172 1013783 998893 980303 956474 927466 894576 859306 822902 786549 751311 717651
63324 717651 685526 655281 628194 605793 588797 577012 570025 567421 568037 569256 567467 559618 544669
63311 544669 523970 500441 477211 456435 438742 423486 409699 397086 386182 377502 370766 365166
63299 365166 360248 356090 352608 349254 345730 342575 340493 339238 337726 335352 332693 330688 329423 328101
63285 328101 326007 323199 320284 317816 315929 314283 312287 309577 306470 303814 302239 301585 301230 300902 300946
63270 300946 301761 303201 304721 305937 306839 307568 308323 309495 311487 314174 316811 318820 320521 322778 326022
63255 326022 330002 334424 339298 344548 349787 354854 360170 366123 372387 378429 384487 391437 399737 409122
63241 409122 419415 430923 443680 457024 470557 485152 502314 522696 545775 570811 597429
63230 597429 625236 653559 681873 710121 738398 766669 794906 823121 851037 878154 904420
63219 904420 930478 956887 983501 1010020 1036829 1064585 1093007 1120618 1145791 1167566 1185241
63208 1185241 1197636 1203227 1200969 1190789 1173351 1149566 1120339 1086617 1049485 1010231 970311 931235
63196 931235 894327 860404 829689 802189 778247 758603 743851 733960 728416 726639 728079 732158
63184 732158 738518 747366 759202 774075 791353 810395 831238 854208 878889 903763 927185 948691
63172 948691 969181 989798 1010801 1031578 1051515 1070496 1088521 1105083 1119052 1129012 1133715 1132454
63160 1132454 1125206 1112312 1093951 1070104 1041070 1007772 971365 932810 893056 853360 814930
63149 814930 778285 743335 710137 679211 651078 625816 603274 583453 566400 551817 539051
63138 539051 527592 517447 508912 501986 496141 490806 485963 482059 479349 477581 476425 475866 476017 476781
63124 476781 478008 479785 482282 485489 489383 494171 499951 506231 512249 517734 523002 528194 532865 536462
63110 536462 538963 540853 542614 544364 545888 547009 547951 549144 550536 551430 551439 551280 551988 553465 554581 554811
63094 554811 554996 556123 558101 560255 562422 564806 567161 568885 569847 570434 570842 570892 570648 570630 571271 572584 574562
63077 574562 577454 581353 585878 590641 595802 601816 608793 616480 624839 634194 644694 655990 667742
63064 667742 680252 694239 710031 727369 746085 766658 789824 815932 844998 877269 913337
63053 913337 953646 998197 1046745 1098995 1154502 1212682 1273203 1336214 1401876 1469599 1537967
63042 1537967 1605560 1671909 1737532 1802962 1867852 1931298 1993045 2053996 2115384 2177755 2240973
63031 2240973 2304663 2367860 2428325 2482947 2528991 2564570 2587968 2597342 2591418 2570034 2533663 2482947
63019 2482947 2419065 2344051 2260277 2170056 2076333 1983231 1894874 1813454 1738959 1670921 1609880
63008 1609880 1557103 1513512 1479397 1454794 1439558 1432967 1433704 1440608 1453414 1472529 1497980 1528752
62996 1528752 1563234 1600123 1638580 1677802 1717003 1755966 1795105 1834681 1874240 1913113 1951100
62985 1951100 1988217 2023867 2056595 2084665 2106634 2121445 2128116 2125408 2111881 2086595 2049855 2002996
62973 2002996 1947316 1883628 1813088 1737930 1660876 1584018 1508622 1435656 1365982 1300220 1238966
62962 1238966 1182982 1132646 1087287 1045618 1006813 970790 937547 906874 878719 853196 829977
62951 829977 808182 787085 766556 746664 727296 708394 690166 672752 655935 639447 623316
62940 623316 607817 593360 580571 570001 561403 553613 545566 537311 529691 523204 517604 512540 508086
62927 508086 504463 501567 499067 496833 494994 493526 492051 490203 488115 486284 484969 483979 483108 482450 482014
62912 482014 481348 479914 477755 475416 473287 471383 469660 468046 466149 463444 459983 456469 453407 450584
62898 450584 447589 444440 441315 438080 434659 431637 429939 429860 430820 432068 433194 433924 433960 433364 432759 432720 433089
62881 433089 433235 432972 432845 433398 434432 435269 435630 435980 436912 438352 439542 439753 438923 437571 436156 434677 432959
62864 432959 431237 430152 430012 430291 430159 429437 428683 428337 428196 427899 427550 427508 427795 428067 428149 428303 428964 430311
62846 430311 432088 433739 434840 435486 436058 436564 436490 435512 434036 432740 431845 431197 430783 430662 430557 430089 429409
62829 429409 429134 429572 430436 431377 432388 433549 434796 436171 438018 440618 443743 446706 448921 450497 452366
62814 452366 455557 460137 465075 469521 473902 479257 485770 492666 499470 506463 513714 520533 526460 532226
62800 532226 539158 547887 558035 568962 580427 592741 606548 622278 639659 658000 677152 697800
62788 697800 720688 746118 774506 806845 844002 885955 932373 983779 1041527 1106704 1179557
62777 1179557 1259861 1347328 1441584 1542153 1648471 1759536 1873496 1987846 2099925 2206914
62767 2206914 2305506 2392114 2463557 2517350 2551563 2564998 2557623 2530467 2484968 2422742 2346017
62756 2346017 2257778 2161185 2059026 1953832 1848053 1743740 1642171 1543989 1449693 1359920
62746 1359920 1275369 1196619 1123960 1057404 996909 942501 893951 850384 810596 773971 740892
62735 740892 712054 687557 666837 649264 634418 621795 610588 600051 590020 580909 573179 566952
62723 566952 562182 558923 557092 556118 555342 555015 556502 560964 567986 575991 583979 592405 602274 613993 627530
62708 627530 643256 661960 684000 708963 736427 766832 801432 841501 887679 939913 997700
62697 997700 1060406 1127594 1199268 1275778 1357312 1443382 1532716 1623570 1714099 1802424 1886408
62686 1886408 1963354 2030092 2083601 2121806 2143759 2149017 2137037 2107452 2060943 1999619 1926515
62675 1926515 1844868 1757776 1667993 1577569 1487729 1399353 1313537 1231551 1154351 1082433 1016137
62664 1016137 955779 901380 852475 808414 768760 733280 701597 673079 647132 623493 602214
62653 602214 583392 566959 552610 539819 527966 516589 505612 495232 485571 476502 467857 459712
62641 459712 452420 446364 441666 438017 434839 431812 429288 427976 428086 428952 429596 429422 428256 426115 423321
62626 423321 420572 418417 416757 415203 413825 413103 413228 413897 414797 415809 416753 417503 418535 420843 425011 430683
62610 430683 437116 443871 450789 457785 465026 473021 482165 492439 503799 516596 531302 548040 566724
62597 566724 587606 611459 639362 672268 710474 753277 799414 848068 899217 952928 1008558
62586 1008558 1064763 1119837 1171840 1218802 1259075 1291215 1313501 1324290 1323295 1311870 1291563 1262882
62574 1262882 1226111 1182741 1135268 1085815 1035673 985874 937291 890220 844665 801152 760670
62563 760670 723773 690324 660090 632964 608585 586411 566391 549003 534457 522256 511591
62552 511591 501743 492153 482676 473851 466367 460221 454916 450467 447507 446252 446069 446267 446665 447129 447346
62537 447346 447425 448039 449450 451006 452105 453059 454372 455739 456572 457199 458700 461695 466027 471612 478827 487879
62521 487879 498444 510287 523887 540161 559757 582834 609355 639316 672789 709887 750782
62510 750782 795654 844456 896567 950692 1005259 1058936 1110647 1159144 1202846 1240167 1269793
62499 1269793 1290678 1302213 1304655 1299121 1286748 1268025 1243199 1213303 1180528 1147602 1116918 1090106
62487 1090106 1068103 1051422 1040302 1034705 1034403 1039371 1050021 1066763 1089302 1116718 1148246 1183446
62475 1183446 1221335 1259643 1295295 1325477 1348247 1362707 1369102 1368458 1361437 1347394 1324836 1292824
62463 1292824 1251846 1203651 1150628 1095200 1039213 983632 928876 875431 824051 775615 731077
62452 731077 691343 656794 626998 601273 579520 562048 548597 538034 529244 521975 516581 513257
62440 513257 511836 512060 513658 516196 519191 522460 526155 530323 534556 538186 540788 542334 542862 542165 539906
62425 539906 535973 530546 523828 515940 507114 497808 488493 479441 470787 462604 454833 447320 440123 433574
62411 433574 427847 422662 417663 412931 408783 405257 402145 399475 397426 395712 393564 390653 387677 385677
62397 385677 384976 385122 385725 386884 388757 391113 393534 395904 398458 401360 404366 406939 408655 409568 410223
62382 410223 411384 413657 417246 421912 427098 432281 437430 443175 450281 458840 468133 477396 486542 495921
62368 495921 505640 515615 526263 538572 553193 569807 587792 607257 629077 654082 682698 715320
62356 715320 752596 795151 843267 896873 955530 1018271 1083547 1149398 1213529 1273338 1326209
62345 1326209 1370011 1403369 1425682 1437233 1439181 1432991 1419745 1400169 1375130 1345469 1311234 1271800
62333 1271800 1227288 1179558 1131405 1084953 1041107 1000183 962459 928152 897341 870031 846015
62322 846015 824670 805123 786695 769030 751798 734498 716653 698051 678766 658980 638970
62311 638970 619330 601116 585343 571956 559538 546646 533460 521526 511749 503395 495435 488146
62299 488146 482567 478856 476088 473554 471383 469844 468817 468219 468273 469053 470251 471704 473703 476443 479528
62284 479528 482401 484954 487420 489915 492402 494905 497429 499910 502517 505789 510055 514901 519659 524373
62270 524373 529740 536013 542513 548629 554978 563101 574024 587490 602656 619256 637940 659757 685611
62257 685611 716072 751392 791608 836785 887229 943321 1005058 1071738 1141879 1213070 1281863
62246 1281863 1344329 1397294 1439251 1470169 1490611 1501128 1502163 1494110 1477336 1452249 1419311 1378966
62234 1378966 1331701 1278391 1220475 1159726 1097979 1037181 979378 926206 878344 835613 797576
62223 797576 763892 734363 708947 687691 670369 656300 644873 636086 630133 626486 623883 621363
62211 621363 618929 617038 615809 614922 613951 612511 610413 607996 606106 605317 605208 604659 602892 600086 597000
62196 597000 594200 591702 589245 586799 584750 583593 583564 584681 587047 590846 596007 602127 608874 616331 624875
62181 624875 634779 645934 657755 669277 679519 687928 694437 699223 702708 705773 709536 714629 721023
62168 721023 728894 739447 754468 775093 801318 832614 868618 909107 953677 1001624 1051924 1102973
62156 1102973 1152374 1197165 1234498 1262354 1279958 1287840 1287576 1281166 1270142 1254890 1234843 1209525
62144 1209525 1179470 1145927 1109787 1071286 1030985 990604 952396 917792 887109 860397 837885
62133 837885 819440 804281 791760 782075 775583 771594 768483 765123 761709 759041 757521 757240 758568 761956
62119 761956 767199 773503 780484 788676 798642 809786 820337 828406 832888 833526 830712 825486 819456 814253
62105 814253 810816 809047 807916 805806 801094 792972 782071 770250 759538 751187 745535 742481 741796 743075
62091 743075 745722 749224 753334 757920 762787 767789 773031 778753 785057 791904 799391 807834 817485 828278
62077 828278 840028 852895 867523 884564 903935 924667 945698 966790 988377 1010469 1032165
62066 1032165 1052566 1071872 1091139 1111214 1132499 1155655 1181738 1211210 1243209 1276024 1307908
62055 1307908 1337161 1361919 1380553 1392324 1397409 1396376 1389847 1378408 1362426 1341952 1317005 1287845
62043 1287845 1254726 1217553 1176176 1131097 1083625 1035268 987103 939731 893647 849615 808670
62032 808670 771645 738559 708607 680949 655435 632549 612794 596248 582468 570626 559970
62021 559970 550338 541977 534660 527408 519494 511329 503793 496903 489843 482247 474761 468183 462605 457659
62007 457659 453157 449249 446276 444692 444819 446496 449204 452641 456896 461984 467594 473447 479523 485755
61993 485755 491827 497506 502803 507536 511141 513287 514416 515179 515385 513897 509654 502651 493968 485013 476666
61978 476666 468954 461410 453784 446317 439393 433130 427451 422361 417937 414061 410278 406021 401114 396126
61964 396126 392077 389476 387748 385981 384166 383165 383294 383545 382678 380761 379097 378773 379756 381370 383201
61949 383201 385354 388145 391759 396128 401008 406228 411936 418599 426754 436681 448175 460666 473650
61936 473650 487081 501248 516274 531884 547630 563118 577982 591886 604707 616519 627292
61925 627292 636758 644671 650967 655544 658093 658353 656343 652176 645899 637829 628900 620322 612845 606587
61911 606587 601559 598129 596885 598173 601870 607620 615292 625136 637327 651328 665835 679387 690930
61898 690930 699836 705759 708655 708740 706232 701236 693998 685111 675352 665454 655996 647158 638425 628985 618798
61883 618798 609039 601072 595129 590294 585535 580308 574255 566916 557986 547697 536871 526674 518145
61870 518145 511544 506161 501056 496084 492004 489609 489007 489685 490948 492251 493553 495543 499263 505237 513116
61855 513116 522333 532884 545296 559990 576961 595938 616538 638197 660271 682480 705169 728849
61843 728849 753371 777700 800651 821744 841050 858248 872154 881350 885071 883310 876415 865089
61831 865089 850769 835489 821046 808394 797955 790270 786036 785598 788741 795066 804327 816126 829426
61818 829426 842626 854180 862940 867882 867895 862246 851174 835683 816778 795143 771551 747132 722960
61805 722960 699571 677095 655745 635989 618284 602711 588821 575845 563249 551160 540153
61794 540153 530603 522349 514974 508141 501661 495562 490200 485977 482778 479920 476859 473686 470752 468114
61780 468114 465647 463454 461820 460841 460321 459903 459197 458036 456775 456046 455962 455922 455520 455266 455864 457081 458012
61763 458012 458412 459115 460984 463973 467399 470737 473880 476967 480226 483861 487907 492231 496654 500809 503904
61748 503904 505008 503795 500876 497270 493678 490342 487295 484457 481543 478195 474405 470782 468169 466839
61734 466839 466139 465156 463701 462369 461596 461064 460309 459521 459297 459806 460682 461664 462897 464549 466489 468475 470378
61717 470378 472136 473678 474968 475982 476711 477277 477898 478541 478776 478237 477042 475451 473364 470627 467633 464985
61701 464985 462653 460070 457140 454488 452488 450683 448532 446248 444440 443265 442323 441150 439476 437200
61687 437200 434472 431664 428993 426283 423341 420368 417735 415488 413369 411226 409134 407156 405272 403490
61673 403490 401767 399834 397375 394452 391577 389216 387399 385924 384861 384541 385009 385707 386003 385967 386241 387077
61657 387077 387872 387997 387732 387944 388954 390254 391326 392209 393151 394161 395207 396485 398133 399928 401565 403094
61641 403094 404811 406859 409171 411702 414391 416932 418890 420145 421015 421778 422178 421600 419781 417175 414453
61626 414453 411771 408881 405873 403319 401436 399573 397016 394022 391454 389531 387568 385069 382514 380780
61612 380780 380154 380131 379887 378760 376499 373278 369386 364954 360156 355460 351199 346985 342221 337291 333552
61597 333552 331769 331144 330294 328636 326310 323326 319578 315455 311689 308587 305974 303850 302497 301883 301546
61582 301546 301219 301050 300945 300236 298425 295961 293779 292147 290496 288448 286582 285836 286388 287526 288571 289493
61566 289493 290432 291033 290717 289493 288077 287188 287007 287365 288098 289079 290120 291042 291771 292374 293136 294476 296470
61549 296470 298492 299680 299829 299509 299279 299163 299022 298987 299297 299956 300812 301751 302690 303608 304759 306532 308904
61532 308904 311243 312838 313456 313354 313045 313119 313886 314988 315639 315403 314469 313183 311784 310667 310299 310538 310561
61515 310561 309820 308593 307299 305883 304285 302916 302075 301404 300591 300105 300474 301238 301490 301186 300989 300995 300654 300020
61497 300020 300075 301453 303559 305350 306367 306691 306478 306004 305782 306128 306825 307481 308015 308509 308852 308827 308480 308191
61479 308191 308429 309488 311290 313349 315117 316459 317648 318875 320061 321214 322639 324478 326197 326901 326272
61464 326272 325039 324354 324714 325604 326160 325973 325095 323600 321637 319795 318771 318491 318158 317495 317390 318778 321333
61447 321333 323873 325726 327032 327932 328253 328023 327653 327480 327591 328084 329013 330110 331085 332249 334243 337067
61431 337067 339907 342077 343674 345153 346703 348185 349340 349948 350126 350470 351485 352889 353996 354843 356308
61416 356308 358950 362274 365361 367754 369462 370623 371487 372326 373037 373126 372303 370841 369253 367962 367319 367385
61400 367385 367488 366557 364266 361455 359213 357957 357570 357809 358215 358145 357391 356430 355750 355336 355054 354955 354867 354365
61382 354365 353692 354023 356062 358874 361003 362352 363991 366311 368401 369438 369759 370246 371331 372985 375137
61367 375137 377564 379638 380679 380584 379953 379596 379945 380922 382307 384101 386370 388826 391022 393080 395817 399809
61351 399809 404720 409970 415668 422360 430048 438038 445575 452110 457097 460305 462374 464460 467082 469809
61337 469809 472219 474612 477493 480810 484079 487002 489566 491695 493088 493410 492518 490640 488376 486422 485128
61322 485128 484381 483881 483428 482984 482673 482809 483717 485472 487916 490931 494622 499255 505120 512340 520589 529172
61306 529172 537727 546843 557606 570511 585025 600134 614824 627931 638063 644177 646231 645104
61294 645104 641996 637908 633391 628455 622702 615723 607419 598000 587814 577281 566834 556823 547462
61281 547462 538892 531166 524245 518104 512864 508697 505657 503779 503273 504352 506850 510251 514146 518414
61267 518414 522834 526772 529530 531021 532028 533775 537179 542374 548919 556489 565153 574816 584610 593285
61253 593285 600218 605670 610064 613442 615832 617655 619421 621172 622516 623045 622563 621135 619207 617495 616420
61238 616420 615723 614861 613684 612472 611418 610397 609264 608080 606970 605983 605180 604732 604877 605892 608022 611215
61222 611215 614971 618740 622607 627202 632801 638790 644342 649364 654367 659584 664776 669898 675327 681043
61208 681043 686121 689567 691462 692805 694353 696116 697914 699824 701935 704196 706839 710553 715927 723007
61194 723007 731658 742071 754516 768724 783789 798519 811678 822167 829452 833815 836012 836726 836506
61181 836506 835896 835191 834106 831991 828434 823489 817473 810800 803841 796693 789160 781136 772804 764298 755525
61166 755525 746668 738447 731278 724433 716703 707791 698386 688908 678969 668247 657239 646813 637518
61153 637518 629575 623120 618119 614332 611636 610158 609974 610957 612880 615213 616701 615729 611490 604577 596283
61138 596283 587658 579341 571779 565218 559686 555241 552012 549946 548866 548829 550020 552178 554723 557712 562169
61123 562169 569038 578194 588780 600123 611994 624475 638070 653647 671742 691989 713514 735679
61111 735679 758200 780907 803796 827042 850610 873945 896314 917199 936232 953154 968120
61100 968120 981588 993475 1002729 1008168 1009470 1006983 1000928 991317 978407 962796 945157 926175 906532
61087 906532 886616 866401 845779 824762 803312 781500 760029 740016 721900 705091 689011
61076 689011 673836 659881 647077 635584 626083 618724 612513 606535 601081 596734 593182 589987 587819
61063 587819 587619 588988 590679 592346 594581 597604 601252 605974 612410 620077 627849 635721 644687 654904
61049 654904 665500 676369 688605 702732 717952 733699 750624 769450 789994 811920 835430
61038 835430 860625 887174 915060 944740 976185 1008708 1042115 1076966 1113472 1151379 1191261
61027 1191261 1234470 1281248 1330128 1379708 1429676 1479746 1529361 1579321 1632204 1690243 1754215
61016 1754215 1825070 1904779 1994475 2093506 2201591 2320435 2452601 2601452 2774010 2981721
61006 2981721 3236666 3549208 3930665 4395099 4956957 5632782 6450610 7453732 8689839
60997 8689839 10200934 12025436 14182678 16604477 19054967 21150604 22530132 23062804
60989 23062804 22915063 22426018 21925894 21648616 21735282 22216175 22938027 23545796 23618867 22893881
60979 22893881 21393365 19365560 17118170 14892180 12832664 11011296 9448400 8129014
60971 8129014 7022999 6101306 5338262 4707927 4186177 3754951 3400144 3106800 2859911
60962 2859911 2648631 2466358 2307429 2166587 2040910 1929310 1830098 1741061 1661567 1592476
60952 1592476 1534040 1485415 1445738 1413815 1386941 1361759 1336392 1310700 1285003 1259995 1237259
60941 1237259 1218074 1201817 1186964 1173302 1161606 1151503 1141473 1130906 1120539 1110782 1101164 1091583
60929 1091583 1082602 1074239 1065831 1057280 1049155 1041335 1032890 1023573 1014140 1004894 995144 984483 973371
60916 973371 962009 949767 936268 922027 907632 893236 879244 866428 854828 843413 831400
60905 831400 819152 807401 796331 785801 775631 765386 754706 744235 735309 728279 721967 715191
60893 715191 707957 700721 693462 686182 679493 673891 668993 664137 659181 654136 648561 641915 634173 625648
60879 625648 616692 607916 600085 593290 586726 579665 572160 564472 556617 548984 542659 538371 535583 533235
60865 533235 530863 528418 525608 522232 518758 515785 513228 510707 508339 506399 504515 502037 499067 496281
60851 496281 493791 490981 487623 484452 482347 481378 480894 480198 478913 476993 474733 472704 471373 470557 469286
60836 469286 466497 462069 456984 452238 447845 443287 438594 434340 430752 427670 425384 424545 424982 425515 425444
60821 425444 425431 426357 428005 429544 430699 431675 432352 432359 431767 431088 430730 430858 431442 431990 431632 430039 428004 426589
60803 426589 425967 425604 425251 425136 425378 425742 425840 425170 423242 420149 416769 413924 411609 409457 407468 405716
60787 405716 403753 401073 397943 395025 392351 389389 385967 382487 379278 376413 374030 372236 370713 369030
60773 369030 367242 365684 364331 363025 362097 362018 362536 362941 363144 363738 365045 366948 369592 373278 377451 380792
60757 380792 382738 384140 386042 388488 390916 392943 394226 394282 393206 392142 392316 393759 395572 397248 399141
60742 399141 401657 404440 406486 406863 405312 402347 398810 395248 391681 387800 383184 377430 370514 363155
60728 363155 356535 351507 348270 346650 346217 346075 345192 343326 341194 339396 337615 335279 332620 330460 329169
60713 329169 328424 327942 327788 327812 327348 325910 323913 322326 321644 321490 321297 321109 321521 322947 325169 327621 329905
60696 329905 331947 333772 335326 336472 337099 337274 337370 337888 339078 340798 342786 344920 347087 349098 350975
60681 350975 353208 356418 360806 366044 371559 376792 381368 385344 389159 393102 396935 400320 403365 406389
60667 406389 409273 411489 412710 412938 412095 410034 407044 403864 400945 398118 395163 392310 389837 387515 384899
60652 384899 382043 379572 378024 377457 377742 378945 381171 384083 386862 388733 389435 389079 387748 385441 382321
60637 382321 378690 374744 370627 366663 363096 359621 355771 351917 349206 348060 347420 346136 344623 344289 345567
60622 345567 347385 348586 349060 349321 349693 350265 351112 352197 353315 354304 355099 355490 355202 354364 353670 353856 355064
60605 355064 356756 358136 358822 359229 360142 361678 363008 363431 363350 363689 364654 365733 366780 368285 370525 373078
60589 373078 375335 376953 377781 377881 377727 377835 378153 378284 378277 378553 379011 378982 378253 377426 377057 377181 377941 379872 383114
60570 383114 386975 390914 395440 401489 409310 418460 428564 439543 451280 463451 475510 486559 495480
60557 495480 501481 504335 504083 500943 495629 489240 482551 475938 470112 466170 464425 463927 463796 464447 466743
60542 466743 470468 474606 478979 484669 492792 503584 516835 532447 550133 568935 587421 604375
60530 604375 619167 631492 640828 646275 647200 644072 638346 631328 623459 614857 606091 597941 590612 583676
60516 583676 576753 569971 563865 559076 556103 555000 555270 556166 557051 557537 557601 557744 558849 561692 566753 574482
60500 574482 585386 599703 617390 638641 664074 694064 728170 765393 804740 845359 886550
60489 886550 927865 968811 1008114 1043689 1073651 1097057 1113507 1122555 1123876 1117490 1103301 1080901
60477 1080901 1050359 1012887 970279 924107 875951 827862 781817 738942 699863 665406 636109
60466 636109 611267 589313 569230 550985 534643 519810 506131 493711 482799 473398 465350 458475
60454 458475 452544 447321 442588 437996 433161 428178 423745 420358 417712 415350 413485 412523 412050 411159 409690
60439 409690 408337 407461 406578 405233 403650 402219 400898 399560 398513 398289 399050 400383 401582 402108 401974 401705
60423 401705 401736 401918 401778 401119 400090 398889 397730 396934 396687 396944 397824 399723 402515 405072 406331 406592 406987
60406 406987 407939 409016 410133 411765 413796 415266 415700 415821 416460 417539 418662 420005 421921 424143 426078
60391 426078 427584 428933 430286 431757 433730 436526 439857 443025 445640 447790 449619 451088 452228 453357
60377 453357 454966 457399 460580 464002 467092 469618 471624 473080 473960 474685 476006 478188 480557 482116 482496
60362 482496 482178 481966 482374 483363 484547 485731 487235 489517 492566 495969 499512 503386 507828 512990 519220
60347 519220 526939 536010 545587 554697 562667 568879 572699 573964 573090 570317 565318 558054 549718 542113
60333 542113 536045 530766 525153 519005 513023 507764 503025 498301 493523 489076 485145 481519 478162 475534
60319 475534 473943 472894 471673 470401 469849 470225 470844 471250 472084 474406 478548 484048 490523 498236 507819
60304 507819 519678 533681 549502 567310 587794 610971 634980 656602 673152 683520 687466 684683
60292 684683 675079 659513 639748 617827 595703 575020 556752 541141 528188 518015 510485 504827
60280 504827 500107 495960 492579 490058 488022 485844 483039 479544 475758 472184 468883 465481 461860 458546
60266 458546 456130 454452 452676 450122 446824 443344 440234 437721 435739 434194 433148 432712 432885 433633 434949
60251 434949 436520 437536 437296 436108 435162 435365 436632 438359 440149 441864 443344 444374 444776 444417 443435 442440
60235 442440 442071 442214 442131 441533 441034 441277 442162 443340 445014 447629 451026 454411 457091 458939 460290 461701
60219 461701 463668 466268 469210 472366 476024 480415 485347 490587 496295 502709 509679 516929 524533 532694
60205 532694 541225 549585 557393 564603 571335 577748 583892 589520 594359 598768 603655 609315 614798 618931
60191 618931 621577 623265 624048 623610 622334 621208 620487 619277 616773 613188 609031 604106 597894 590561 582955
60176 582955 575718 568969 562822 557693 553881 551147 548981 547060 545268 543386 541141 538547 535945 533556
60162 533556 531212 528708 526250 524288 523008 522218 521675 521295 521088 521146 521592 522345 523102 523890 525427 528345 532095
60145 532095 535254 537020 537848 538461 539001 539518 540616 542932 546333 550231 554448 559238 564652 570473 576703
60130 576703 583562 590884 597912 603789 608100 610911 612578 613570 614311 615026 615713 616217 616385 616339 616596 617739
60114 617739 619923 622805 625881 628665 630730 632060 633260 634903 636663 637654 637682 637469 637482 637259 636194 634254
60098 634254 631537 627818 623083 617960 613046 608379 604088 600922 599392 598871 598343 597644 597214 596994 596450 595517
60082 595517 594703 594329 594351 594872 596152 598089 600204 602003 602858 601801 598240 592902 587380 582590 578074 572755
60066 572755 566006 558132 550263 543644 538501 533708 527994 521291 514486 508271 502808 498130 494061 490044
60052 490044 485922 482681 481496 482151 483260 484053 484998 486704 489194 492427 496529 501192 505659 509664 513739
60037 513739 518322 523240 528241 533280 538001 541647 543875 545078 545628 545388 544213 542263 539569 535926 531493
60022 531493 526839 522087 516701 510449 503907 497691 491887 486604 482261 478794 475303 471095 466473 461966
60008 461966 457445 452717 448342 445007 442445 439793 436787 433890 431491 429650 428512 428264 428751 429652 430948
59993 430948 432695 434476 435696 436447 437527 439448 441873 444205 446410 449047 452642 457126 461815 465857
59979 465857 468721 470307 470830 470800 470919 471496 471914 471165 469038 466341 463837 461519 459170 457031 455481 454566
59963 454566 454311 455068 456968 459376 461466 463120 464760 466594 468607 471023 474025 477017 478904 479284 478863
59948 478863 478498 478276 477779 476881 475958 475421 475392 475766 476388 477030 477295 476793 475566 474166 473103 472318 471517 470888
59930 470888 470961 471747 472626 473392 474838 477812 482036 486341 489894 492840 495918 499893 505164 511488 518109
59915 518109 524482 530816 537655 545061 552479 559240 564862 568990 571475 572549 572692 572314 571677 570958 570063
59900 570063 568577 566233 563383 560680 558296 555749 552560 548869 545381 542854 541656 541683 542693 544700 547927
59885 547927 552370 557587 563019 568302 573274 577964 582747 588142 594224 600493 606549 612516 618529 624156
59871 624156 628784 632259 634682 635746 634896 632142 628238 623969 619636 615313 611177 607338 603567 599464
59857 599464 594913 590305 586301 583387 581604 580775 580856 581933 583965 586899 591096 597242 605546 615166 624493
59842 624493 631810 635809 636089 633564 629993 626787 624497 623481 624247 626511 628470 627973 624298 618268 610910
59827 610910 602837 594831 588000 582910 579089 575704 572361 569045 565741 562496 559528 557011 554837 552865
59813 552865 551294 550570 550854 551574 551562 549876 546662 542995 539731 536756 533621 530500 527908 525715 523203
59798 523203 520194 517390 515298 513434 511089 508457 506445 505510 505197 504791 504043 503201 502632 502566 503019 503812 504675
59781 504675 505411 505867 505795 504943 503509 502324 502252 503269 504475 505219 505936 507466 509783 511977 513484 514724
59765 514724 516289 518129 519950 521929 524439 527335 530095 532570 535045 537648 540247 542995 546423 550776
59751 550776 555640 560489 565356 570744 577002 583986 591172 597966 603995 609288 614217 619158 624176 628944
59737 628944 632954 635835 637546 638311 638371 637890 637078 636241 635608 635166 634710 633990 632805 631064 628827 626239 623475
59720 623475 620898 619114 618540 618857 619158 618700 617323 615215 612735 610475 608944 607918 606563 604591 602987
59705 602987 603153 605473 608976 612229 614387 615619 616851 618961 622006 625338 628495 631660 635158 638970
59691 638970 642935 646939 650577 653050 653821 653059 651217 648656 645967 644012 643030 642195 640635 638481 636284
59676 636284 633911 630812 627002 622953 618716 614009 609008 604197 599510 594462 589175 584421 580548 577120
59662 577120 573791 570808 568462 566747 565817 566144 567826 570224 572623 574921 577475 580633 584565 589156 593916
59647 593916 598275 602032 605177 607396 608195 607541 605774 602878 598481 592710 586396 580144 573789 567107 560529
59632 560529 554686 549598 544778 539958 535450 531882 529692 528627 527659 525695 522477 518603 514686 510903
59618 510903 507355 504292 501732 499253 496395 493007 489087 484731 480405 476847 474406 472785 471687 471386
59604 471386 472382 474672 477595 480285 482196 483393 484391 485523 486494 486804 486568 486526 487248 488656 490360 492031
59588 492031 493375 494194 494624 494983 495294 495262 494778 494052 493237 492263 491083 489651 487708 485080 482233 479986 478552
59571 478552 477340 475803 473964 472030 470043 468047 466133 464198 462161 460499 459926 460406 461099 461450 461706
59556 461706 462176 462688 463026 463227 463112 462281 461009 460452 461464 463721 466498 469691 473530 477836 482229 486781
59540 486781 492065 498767 507453 518289 530930 545412 563126 585399 610202 631393 642746 642590
59528 642590 633951 621082 607187 594674 585421 580017 577786 577977 580225 583677 586786 588563 589356 589897
59514 589897 590080 589120 586452 582041 576185 569449 562501 555588 548367 540588 532708 525458 518952 512676 506361
59499 506361 500457 495572 491720 488408 485308 482553 480382 478827 477818 477309 477074 476737 476304 476375 477425 479118
59483 479118 480880 482927 486019 490195 494514 498230 501632 505424 509888 514939 520470 526236 531845 537165
59469 537165 542318 547035 550519 552291 552651 552036 550551 548573 547180 547258 548591 550363 552191 554158 556319
59454 556319 558872 562467 567683 574378 582027 590335 599001 607317 614732 621544 628320 634809 640014 643089
59440 643089 643498 640661 634325 625358 615466 606084 597914 591228 585843 580959 575877 570950 567172 564807
59426 564807 563139 561658 560812 561396 563773 567882 573561 580691 589312 599609 611563 624866 639563 656306
59412 656306 675380 696084 718135 743070 772237 802728 826853 837128 831719 814818 792732 770536
59400 770536 751485 737637 730193 729782 736651 749902 765991 778513 780731 769487 747155 719771
59388 719771 692976 669328 648763 630682 615161 602655 593307 586728 582165 578947 576988 576733 578360
59375 578360 581227 584435 587635 590863 593863 596314 598653 601874 606312 611232 615892 620494 625710 631671
59361 631671 637870 643849 649627 655460 661462 667537 673666 680196 687621 695981 704644 712988 721150 729918
59347 729918 739978 751509 764288 777813 791459 804830 817900 830582 842422 853075 862704 871357
59335 871357 878253 882387 883677 882786 879863 874342 866097 856002 845010 833374 821157 808933 797415
59322 797415 786729 776460 766249 756087 746263 737297 729751 723862 719358 715598 711774 707215 701950
59309 701950 696929 693271 691245 690367 690367 691517 694008 697694 702668 709490 718592 729962 743556 759170
59295 759170 775202 787975 793268 788875 775690 756612 734752 712494 691494 672928 657385 644610
59283 644610 633807 624554 617310 612702 610445 609432 608817 608635 609425 611757 616130 622738 631124 640453 650305
59268 650305 660847 672203 684078 696038 707606 717999 726384 732698 737656 741606 743809 743295 740016
59255 740016 734780 728347 720998 712807 703912 694625 685536 677376 670589 665096 660587 656887 653979 651922
59241 651922 650852 650897 651963 653706 655726 657624 659073 660167 661608 664053 667302 670560 673443 676147 678560
59226 678560 679894 679515 677641 674931 671773 668202 664176 659683 654913 650485 647094 644851 643360 642504 642520
59211 642520 643061 642865 640906 637534 634035 631352 629553 628236 627048 625939 625168 624914 624835 624338 623362 622476
59195 622476 622042 621740 621118 620168 619131 618209 617735 618124 619278 620467 621172 621727 622803 624640 627089 630013
59179 630013 633268 636597 639860 643115 646265 649042 651524 654201 657262 660342 663340 666939 671825 677822
59165 677822 684262 690822 697556 704452 711457 718623 725785 732383 737945 742346 745244 745802 743596 739423
59151 739423 734578 729495 723625 716410 707846 698311 688380 678703 669612 660876 652111 643217 634248 625253
59137 625253 616638 609213 603345 598423 593618 588871 584576 580704 576916 573308 570405 568532 567740 568136 569727
59122 569727 572112 574908 578300 582634 587693 593052 598939 605967 614071 622559 631299 641057 652302 664222
59108 664222 675295 684459 691527 696878 701123 704923 708794 712980 717426 721807 725732 729078 731968 734235
59094 734235 735216 734466 732457 730131 727868 725394 722629 720110 718381 717327 716338 714887 712807 710113 706746
59079 706746 702510 697249 691019 683992 676263 667933 659309 650774 642492 634599 627566 621801 616881 611842
59065 611842 606444 601486 597547 594128 590525 586811 583330 579787 575732 571571 568256 566051 564296 562309
59051 562309 559930 557302 554645 552302 550593 549612 549362 549790 550460 550678 550393 550479 551519 552742 552858 551663
59035 551663 550081 548912 548341 548491 549639 551787 554666 558216 562652 568148 574837 582918 592273 602353
59021 602353 612975 624895 638817 654137 669405 683747 696989 708610 717635 723642 727056 728312
59009 728312 727429 724488 719871 714027 707614 701773 697509 694838 693230 692749 693909 696487 699421 702012 704361
58994 704361 706593 708580 710502 712725 714863 715882 715340 713666 711060 707179 702229 697254 692803 688349
58980 688349 683640 679692 677602 677175 677596 678806 681318 685196 690174 696449 704456 714008 724438 735496
58966 735496 747370 759866 772260 784088 795518 806708 817220 826338 833743 839634 844226 847286
58954 847286 848242 846678 842608 836231 827633 816898 804328 790314 775228 759699 744704 730860 717834
58941 717834 704984 692456 681035 671050 662223 654635 648992 645569 643585 642018 640543 639347 638556 638311
58927 638311 638937 640549 642662 644497 645505 645513 644744 643893 643685 644053 644055 642920 640921 639017 637925 637709 637917
58910 637917 637845 637055 635904 635358 636069 637936 640705 644638 650310 658034 667730 679138 691852 705337 719102
58895 719102 732833 746264 759094 771075 782116 792387 802468 813163 824876 837448 850948
58884 850948 866135 883394 901433 917926 931491 942335 950986 957348 961179 962526 961277 957057 950092
58871 950092 941448 931943 921405 909520 896851 884482 873149 863228 855033 848403 842288 835468 827650
58858 827650 819452 811433 803547 795469 787082 778591 770292 762193 753920 745215 736448 728296 720997 714371
58844 714371 708448 703411 698805 693568 687111 679797 672129 664105 655742 647499 639746 632346 625288 619136
58830 619136 614282 610152 605812 601101 596663 593093 590542 588938 588193 588290 589475 592178 596437 601593 606796
58815 606796 611616 616005 619987 623664 627241 630771 634059 636959 639502 641632 643106 643804 643797 643019 641282
58800 641282 638640 635360 631496 626977 622164 617692 613610 609297 604419 599333 594362 589391 584484 580209
58786 580209 576945 574475 572666 571907 572446 573888 575868 578640 582508 587184 592248 597778 603959 610381 616170
58771 616170 620451 622382 621251 617104 610974 604111 597266 590885 585295 580279 575067 569355 563902 559586
58757 559586 556333 553496 550891 548898 547889 548033 549350 551468 553638 555454 557236 559364 561538 563159
58743 563159 564102 564799 565857 567877 571282 575893 580989 586078 591364 597294 603928 610872 617426 622877 627182
58728 627182 631273 635966 640601 643690 644955 645640 646641 647536 647908 648307 649160 649857 649897 650053 651503 654415
58712 654415 658225 662591 667299 671871 676048 680051 683703 685943 685892 683777 680203 675257 668930 661556 653100
58697 653100 642859 630644 617446 604204 590869 577473 565039 554386 545034 536385 529025 523637
58685 523637 519498 515403 511261 507517 503787 499521 495289 491907 488857 485097 480963 477769 475905 474848
58671 474848 474709 476166 479027 482280 485594 489521 494364 500091 507161 516128 526473 536914 546636 555066
58657 555066 560847 562578 560522 556349 551236 545423 539334 533706 528619 523698 519146 515361 511787 507570
58643 507570 503243 500201 498543 496943 494725 492539 490895 489557 488621 488639 489317 489543 489146 489290 490651 492450
58627 492450 493771 494611 495149 495133 494557 493979 493699 493475 493371 493923 495192 496578 497899 499731 502473 505993 510335
58610 510335 515751 521837 527662 532906 537851 542163 544948 546319 547687 549993 552649 554644 555761 556322
58596 556322 556614 556877 557134 556898 555861 554796 554760 555542 556188 557029 559698 564845 571324 578122 585710 594791
58580 594791 604880 614871 624170 632728 640820 649124 658092 666878 673905 678898 683447 689211 696443 704633
58566 704633 713587 723502 734795 748193 764192 782300 801673 822404 845149 869461 893768 916974
58554 916974 938710 957907 972712 982339 987655 989524 987955 983348 977203 970879 964720 958848 953584
58541 953584 948611 942888 935821 927369 916750 902566 884777 865131 845061 824517 803462 782992
58529 782992 764111 746715 730705 716942 706242 698376 692718 688826 685832 682494 678568 675074 672578
58516 672578 670405 668040 666009 664616 663148 661157 659368 658482 658097 657532 656661 655359 653298 650910 649358
58501 649358 648907 648540 647724 647188 647345 647430 646929 646442 646290 645737 644522 643749 644322 645743 647390 649675 653071
58484 653071 657349 662643 669862 679096 689059 699141 710562 724418 740008 756265 773330 791336
58472 791336 808833 823813 835307 842948 846175 845040 840743 834297 825726 815454 805143 796099 788135
58459 788135 781029 775798 773474 773976 777185 783644 793074 803779 814726 826737 840312 853806 865069
58446 865069 873339 878155 878157 872689 863271 851888 839124 825326 811979 800267 789785 780342 773399
58433 773399 769868 768120 766333 765428 767380 771685 775892 779022 782413 787649 795327 805332 816776 828184
58419 828184 838832 849081 858564 865453 868727 869517 868819 865677 859379 851648 844485 837377 828862 819494
58405 819494 811032 803869 797492 792308 788802 785904 782390 778979 777070 776488 776437 777502 780588 784956 789358
58390 789358 793903 798806 802699 804478 805501 807538 809827 810627 810399 810837 811910 812590 813455 815818 819153
58375 819153 822142 825437 830740 837919 845613 853827 863321 873326 882559 891730 902307 913665 924226
58362 924226 934615 946762 960567 974291 987640 1001638 1015990 1029381 1041811 1053911 1064556
58351 1064556 1071963 1076635 1080549 1084121 1086641 1088832 1091974 1095277 1097215 1098830 1102635 1108816 1115600 1122738
58337 1122738 1131532 1141958 1152977 1165157 1179799 1196018 1211861 1227737 1245413 1264200 1281580
58326 1281580 1297157 1312527 1327600 1340498 1350814 1359548 1366264 1369785 1371455 1374149 1378230 1381803 1384604
58313 1384604 1388197 1392794 1397489 1403225 1411859 1422624 1433173 1443654 1456081 1470263 1484278 1498462
58301 1498462 1514832 1533005 1550779 1568293 1587395 1607372 1625812 1643294 1662685 1684044 1704856
58290 1704856 1725123 1747405 1771865 1796050 1819699 1845078 1872485 1899987 1927524 1956580 1986129
58279 1986129 2013863 2041087 2071174 2103568 2134845 2165349 2198904 2236104 2274022 2312697 2355599
58268 2355599 2403320 2453102 2504996 2561963 2623263 2684452 2744831 2808276 2875801 2944114 3012551
58257 3012551 3084469 3160346 3236342 3311093 3387260 3465239 3542279 3619030 3699840 3785424 3872542
58246 3872542 3961866 4058375 4162896 4271476 4384343 4506854 4640065 4779225 4923367 5077348
58236 5077348 5242620 5415466 5596303 5790883 5999998 6218129 6444809 6686968 6947631
58227 6947631 7223164 7514389 7828958 8169714 8532603 8919293 9339450 9797129 10287937
58218 10287937 10813502 11385289 12010264 12687162 13421149 14227163 15114500 16084364 17147644
58209 17147644 18328418 19645512 21109622 22744433 24591388 26689371 29073000 31798313
58201 31798313 34948189 38610370 42882997 47913734 53905343 61076054 69651069 79906266
58193 79906266 92190789 106915450 124581044 145818231 171299765 201535376 236694305
58186 236694305 276332615 318681933 359760500 393499705 413748947 417165687 404696281
58179 404696281 380457681 349231466 314713735 279333722 244810856 212467375 183188681
58172 183188681 157392374 135128237 116193007 100222082 86796416 75528103 66072834
58165 66072834 58113574 51375791 45647215 40759573 36563200 32934082 29785577 27050792
58157 27050792 24662331 22560384 20704617 19062603 17597581 16278794 15091016 14022005
58149 14022005 13051630 12163342 11354353 10623641 9960243 9352742 8799602 8300226 7845539
58140 7845539 7426826 7044660 6699793 6383451 6085236 5802935 5536797 5282207 5036069
58131 5036069 4803014 4587363 4385559 4193391 4013610 3849218 3696042 3549257 3411020
58122 3411020 3284579 3166726 3053061 2945198 2845990 2752806 2662039 2575469 2495834 2420666
58112 2420666 2346552 2275154 2209338 2147482 2086975 2029120 1975388 1923057 1869818 1818612 1772723
58101 1772723 1730039 1687162 1645228 1606468 1568867 1529481 1489703 1452213 1415901 1378693 1342343
58090 1342343 1309577 1279271 1249039 1219992 1194611 1172357 1151378 1132024 1114853 1097805 1079094
58079 1079094 1060285 1042972 1025300 1005398 985340 967823 951646 934293 916380 899766 883741
58068 883741 866892 850397 835849 822073 807518 793494 781701 770908 759431 748497 739774 731860
58056 731860 722597 712569 703060 692928 680860 668411 657462 646956 635502 624846 617228 611464
58044 611464 605176 598838 594090 590019 584676 578539 573145 568024 562187 556780 553015 549315 543759 537456
58030 537456 532204 526743 518793 509055 499715 490705 480899 471355 463721 456904 448909 440651 434440 429932
58016 429932 425071 419906 415966 412865 409005 404808 401934 400058 397562 394685 392934 392178 391247 390514 390942
58001 390942 391491 390574 389183 389520 391334 392664 393417 394990 396987 397539 396557 395662 395163 393933 391971 390333
57985 390333 388782 386163 382824 380114 377841 374761 371164 368381 366068 362619 358080 354168 351524 349302
57971 349302 347320 346323 346232 346162 346010 346120 345903 344713 343508 343608 344474 344773 344850 345928 347631 348565 348644 348537
57953 348537 347593 344780 341008 338055 335772 332797 329418 327167 326120 325108 324208 324581 326300 328722 332433
57938 332433 338300 345198 351305 357179 364855 374439 384340 394356 405493 416940 426343 433127 438650
57925 438650 442958 444370 442671 439840 437019 433262 427863 421536 414826 407628 400686 395285 391013 386049
57911 386049 380057 374635 370631 367304 364440 362898 362523 361821 360350 359274 358940 357987 355558 352375 349008
57896 349008 344973 340221 335670 331668 327674 324010 322171 322727 324439 325909 326738 326887 326529 326706 328481
57881 328481 331228 333337 334551 335840 337166 337437 336664 335913 335031 332796 329652 327861 328320 329423 329790 329976
57865 329976 330699 331457 331804 332171 332606 332439 331916 332464 334598 337223 339613 342353 345706 348817 351262 353659
57849 353659 356066 357444 357429 356986 356622 355591 353541 351319 349410 347139 344094 340771 337201 332594 327007
57834 327007 321755 317525 313686 310041 307488 306245 305137 303478 302046 301456 301267 301450 302901 305547 307661
57819 307661 308177 308173 309056 310767 312773 315263 318155 320253 320534 319237 316797 312914 307518 301466 295426 289242
57803 289242 283088 277958 274287 271342 268752 267258 267262 267970 268800 270260 272633 275170 277417 279909 282729
57788 282729 284835 285780 286743 288817 291570 294209 296839 299651 302216 304633 307999 312679 317370 321027 324412
57773 324412 328599 333172 337176 340693 344124 346819 347733 346751 344277 340217 334437 327581 320497 313428 306534
57758 306534 300437 295552 291495 287813 284612 282034 279876 278110 276974 276304 275785 275998 277901 281061 283882
57743 283882 285937 288459 292102 295979 299537 303515 308110 311972 314082 314988 315188 314009 311356 308775 307326
57728 307326 305972 303611 301256 300500 301034 301351 300930 300146 298961 297223 295495 294247 292940 291041 289054
57713 289054 287438 285557 282827 279831 277085 273880 269661 265385 262041 258938 255022 250922 248063 246606
57699 246606 245858 245885 247019 248440 248868 248268 247480 246744 245891 245352 245526 245710 245026 243878 243230 243022 242647 242349
57681 242349 242812 243914 245337 247871 252682 259734 268323 278771 292206 309023 328974 352625 381521
57668 381521 417106 460529 513115 575492 645592 717376 780997 824586 838565 820937 778536
57657 778536 722126 660504 599218 542316 492480 449912 413343 382311 357148 337170 320634
57646 320634 306490 294806 285575 278342 272857 268864 265465 261864 258482 256244 255045 254087 253287 253079
57632 253079 253220 253057 252708 252685 252703 252128 251300 251033 251082 250443 248976 247396 245823 243695 241034 238518 236339
57615 236339 234175 232213 231023 230477 229891 229104 228395 227583 226369 225326 225332 226144 226731 226847 227105 227642 227906 227727
57597 227727 227457 227094 226346 225416 224700 223858 222264 220201 218499 217159 215436 213129 210717 208410 206117 204178
57581 204178 203058 202597 202522 203270 205053 206584 206187 203945 201345 199066 196612 193992 192077 191063 190060
57566 190060 188538 186986 185853 184932 183959 182847 181302 179247 177530 177064 177399 177367 177068 177822 180057 182660
57550 182660 184680 186396 188340 190414 192358 194064 195092 194770 193085 190738 188284 186004 184581 184886 186928
57535 186928 189779 192544 194731 196001 196488 197119 198607 200359 201398 201943 202896 204189 205015 205348 205790 206099
57519 206099 205482 204205 203312 202767 201554 199709 198476 198121 197303 195187 192636 190663 189084 187442 186053
57504 186053 185362 185182 185167 185179 184832 183590 181689 180092 179218 178606 178025 177871 178231 178540 178504 178534 179061 180195 182086
57485 182086 184680 187200 188817 189734 190632 191409 191758 192585 195145 198835 201640 202859 203579 204199 203553 201174
57469 201174 198630 197631 198147 199180 200061 200243 199154 197127 195410 194590 194066 193508 193534 194348 195112 195376 195793
57452 195793 196657 197075 196522 195967 196405 197310 197614 197308 197148 197525 198387 199576 200592 200852 200695 201239 202747 204135
57434 204135 204634 204771 205041 204836 203589 201994 201178 201449 202549 204215 205824 206422 205875 205160 204917 204758 204520
57417 204520 204952 206282 207328 207090 206225 205884 206055 206145 206349 207219 208575 209973 211679 214077 216529 217827
57401 217827 217514 216086 214215 212412 211035 210099 209437 209338 210360 212244 213873 214732 215503 216803 218346 219954
57385 219954 222252 225606 229363 232971 236923 241710 246708 250941 254169 256450 257526 257516 257402 257890 258495
57370 258495 258454 257749 256506 254376 251395 248569 246641 245128 243425 241945 241185 240693 240058 240020 241299 243107
57354 243107 244151 244552 245480 247367 249651 251923 254172 256264 258172 260394 263175 265717 267084 267496 267826
57339 267826 268226 268270 268038 268034 268253 268249 267953 267659 267474 267474 268094 269634 271646 273421 274808 276011 277027 277816 278556
57320 278556 279233 279488 279385 279631 280536 281469 281894 282137 282539 282782 282781 283302 284835 286746 288461 290478 293225 295906
57302 295906 297664 299013 300839 302759 303888 304621 306257 309197 312772 316527 320535 324755 329134 333991
57288 333991 339427 344771 349534 354270 359498 364434 368040 370813 374329 379404 385748 392872 400184 406771
57274 406771 412377 418143 425152 432724 439375 444911 450204 455453 460218 464760 469673 474380 477657 479671
57260 479671 482000 485491 489475 493222 496823 500440 503963 507658 512033 516837 521238 525130 529249 533895
57246 533895 538634 543365 548575 554309 559912 565114 570473 576479 583010 589825 596803 603542 609518 614868
57232 614868 620374 626604 633569 641067 648676 655625 661527 667150 673681 681368 689665 698445 708131 718746
57218 718746 729795 741023 752423 763574 773889 783569 793543 804526 816824 830746 846277 862563
57206 862563 878700 894882 911855 929487 947018 964523 982893 1002340 1022131 1042027 1062823
57195 1062823 1085067 1108083 1130692 1152313 1173170 1193950 1215383 1237699 1260531 1283668 1307515
57184 1307515 1332334 1357623 1383024 1409276 1437293 1466794 1496829 1527198 1558166 1589268 1619751
57173 1619751 1649908 1680580 1711524 1741694 1771144 1801189 1832554 1864653 1896874 1929289 1961819
57162 1961819 1993961 2025723 2057782 2090356 2122899 2155242 2188090 2222088 2257183 2293134 2329849
57151 2329849 2367013 2404158 2441275 2478705 2516455 2554323 2592569 2631630 2671361 2711471 2752537
57140 2752537 2795540 2840494 2886606 2933694 2982321 3032554 3083739 3135529 3188066 3241166 3294460
57129 3294460 3348370 3403788 3460742 3518560 3577484 3638906 3703940 3773013 3847020 3927508 4015205
57118 4015205 4109457 4209649 4316301 4430428 4552687 4683591 4823963 4975066 5139064 5319447
57108 5319447 5520357 5745593 5999047 6285976 6613079 6987892 7419502 7920160 8505626
57099 8505626 9194712 10010174 10980335 12138953 13523649 15175065 17135983 19447891 22145821
57090 22145821 25254794 28787955 32743924 37103240 41825767 46848628 52083501 57415034
57082 57415034 62701260 67772481 72428861 76448302 79614929 81758011 82777065 82642681
57074 82642681 81385870 79090667 75888579 71946699 67450180 62585875 57529762 52437361
57066 52437361 47438550 42637488 38113929 33922973 30095687 26643174 23561362 20833810
57058 20833810 18434681 16333886 14501060 12905595 11516014 10302394 9239334 8305699
57050 8305699 7482928 6755303 6110735 5539301 5031463 4578857 4175675 3817387 3498686
57041 3498686 3214040 2959512 2732478 2530220 2350192 2190927 2051112 1928370 1820399
57032 1820399 1726645 1647496 1582661 1531975 1496942 1479747 1481566 1503623 1547985 1612620 1683949
57021 1683949 1737444 1749376 1709774 1625332 1512170 1386762 1261323 1143528 1037626 945112
57011 945112 865244 796147 736175 684311 639520 600484 566259 536532 510814 487940 466876
57000 466876 447385 429371 412155 395076 378257 362186 346941 332470 319099 307171 296637
56989 296637 287567 280560 276102 274123 274737 278717 286430 296758 307672 317234 323426 323952 317530 305205
56975 305205 289556 272763 255944 239782 224786 211133 199022 189140 182251 178507 177519 178783 181800
56962 181800 186328 192999 203191 217865 236954 260014 286421 314218 339585 358403 368199 368423
56950 368423 359810 344219 324301 302404 280001 258423 239247 223368 210474 200135 192674 188464
56938 188464 187264 188992 194346 203921 217523 235073 257242 284366 315337 348010 379465 405139
56926 405139 419309 418317 403116 377941 347250 314581 282800 253584 227002 202784 181503 163622
56914 163622 148341 134649 122784 113337 105640 98418 91496 85561 80751 76804 74054 72856 72396 71350
56900 71350 69515 67709 66489 66059 66920 69321 72472 75518 79047 84545 92772 103705 117538 134534
56886 134534 154316 176384 200629 225909 248640 264448 271272 269916 262237 250176 236065 222055
56874 222055 209098 197611 188877 184488 184624 188258 194942 205150 219096 236695 258742 286789 321732
56861 321732 363502 411993 466949 526522 586452 640438 680966 701265 698685 676550 641795 600896
56849 600896 558512 518520 483879 455458 432723 415834 405872 403241 407450 418523 437302 464478
56837 464478 500756 547843 607667 680408 764286 856446 951604 1039495 1106229 1140257 1137467 1101396
56825 1101396 1040390 964684 883828 804724 731477 666573 611256 565300 527998 499698 481298
56814 481298 472463 471768 478714 494194 518944 553081 597288 652509 717357 786453 851455 902892
56802 902892 931751 932146 904328 854642 791894 723901 656587 593987 537976 488938 447409 414240
56790 414240 389023 369751 354769 344214 339184 340496 348693 364151 386516 414689 447448 483034
56778 483034 517702 545811 562082 563563 549859 522924 486958 447036 406823 367827 330823 296940
56766 296940 267196 241936 221009 203726 188669 174641 161883 151325 142754 134964 127630 121545
56754 121545 116777 112182 107132 102294 98191 94397 90758 88060 86728 85980 84916 83498 81936 80189
56740 80189 78586 77888 78161 78501 78306 77896 77561 77103 76670 76914 77931 79079 80187 81775 83787 85383 86400
56723 86400 87688 89517 91032 91879 92989 94980 97020 98073 98184 97832 97102 96226 95876 96174 96414 96381 96812
56706 96812 97936 98792 98826 99011 100400 102528 104173 104887 104971 104783 104811 105602 106864 107449 106909 106269 106624 107825
56688 107825 109191 110557 111848 112478 111977 110621 108934 107275 106266 106635 108159 109705 110825 112233 114214
56673 114214 115860 116595 117247 118666 120404 121788 123305 125807 129016 131845 133668 134546 134783 134917 135523 136408
56657 136408 136641 135824 134607 133526 132261 130579 129017 128005 127104 125766 124056 122192 120246 118657 118006
56642 118006 117886 117143 115694 114843 115251 115983 116305 116981 118799 121090 122834 124188 125823 127711 129542 131466
56626 131466 133519 135165 136316 137823 140121 142262 143102 142544 140899 138172 134797 132000 130472 129690 129259
56611 129259 129697 131000 131774 130949 129128 127197 124942 122305 120619 121011 122578 123706 124253 124952 125612 125570
56595 125570 125288 125846 127296 128853 130207 131333 131613 130604 129314 129313 130782 132557 133812 134605 135071 135234
56579 135234 135461 136194 137335 138518 139632 140561 140943 140791 140775 141378 142452 144013 146416 149275 151434 152870
56563 152870 155331 160121 166493 173310 181059 190897 202854 216227 230562 244718 256067 262386 263947
56550 263947 262433 258760 253428 247898 243553 239838 235271 230057 225983 223866 222618 220841 218094 214622
56536 214622 210961 207749 205105 202384 199185 196047 193444 190887 187946 185299 183703 182683 181388 180022
56522 180022 179279 179120 179231 179900 181237 182271 182007 180709 179052 176889 174013 171237 169414 168206 167028
56507 167028 166231 166088 165666 164221 162689 162264 162447 162132 161630 161888 162569 162682 162366 162275 161997 160881 159728 159719
56489 159719 160353 160318 159760 159761 160197 160144 159949 160818 162628 164066 164687 165051 165158 164617 164022 164320 165127 165484 165841
56470 165841 167331 169457 170614 170776 171533 173545 175969 178358 181048 183504 184360 183533 182569 182515 182937 183219
56454 183219 183371 183399 183227 183250 183645 183473 181964 180334 180550 182491 184194 184834 185505 186979 188512 189228 189082
56437 189082 188194 186633 184979 183879 183089 182133 181464 181617 181786 180939 179817 179983 181340 182547 183423 184810
56421 184810 186355 186702 185830 185119 185118 185274 185723 187115 188703 188948 188149 188190 189500 190566 190744 191137 192192 192730
56403 192730 192158 191611 192135 193437 195001 196741 198132 198420 198085 198370 199134 198970 197616 196339 195748 195301 195249
56386 195249 196848 200146 203669 206771 210254 214165 217161 218715 219935 221493 222730 223454 224587 226271
56372 226271 227306 227272 227374 228442 229823 230926 232075 233229 233730 233947 235281 237832 239941 240699 241032 241655
56356 241655 241944 241641 241760 242906 244387 245739 247398 249280 250534 251327 252934 255387 257060 257307 257502 258611
56340 258611 259730 260002 260069 260624 261309 261987 263437 265949 268868 272168 276666 282044 286630 289862 293069 297127
56324 297127 301349 305338 309755 314380 317587 318746 319148 319709 319814 319244 319023 319386 319130 318005 317530 318406
56308 318406 319362 319633 320288 321983 323717 325054 327211 330597 333661 335716 338520 343446 349241 354283 358912
56293 358912 363863 368475 372281 376394 381552 386585 390542 394537 399737 405318 410203 415154 421408 428763
56279 428763 436552 444978 454053 462858 471198 480304 490677 501087 511025 522049 535210 549233 562869
56266 562869 577058 593117 610816 629939 651702 676824 704130 732845 764302 799674 838168
56255 838168 879464 925890 979986 1041697 1110070 1186000 1271227 1366216 1470952 1586078 1711332
56244 1711332 1844533 1983992 2130135 2282854 2439057 2594668 2746963 2892870 3027038
56235 3027038 3144121 3241392 3317006 3367640 3390334 3385265 3354504 3299640 3222786 3128225 3020570
56224 3020570 2902476 2775988 2644497 2511270 2377687 2244964 2115883 1992797 1875711
56215 1875711 1764438 1660734 1566016 1478949 1397700 1322759 1255087 1193351 1135581 1081839 1032722
56204 1032722 987020 943477 903228 867775 836138 806557 779353 755552 734354 714666 697430
56193 697430 683654 671776 659777 648275 638761 630464 621952 614244 609165 605968 602563 598830 595878
56180 595878 593381 590556 588400 587992 587923 586360 584319 583956 584958 585657 586362 588487 591647 594682 598369 603991
56164 603991 610370 615410 619580 624935 631785 639195 647506 657454 667993 677949 688585 701621 716143
56151 716143 730408 745382 763406 784756 808563 835759 868053 905447 947845 997597 1057381
56140 1057381 1127163 1206211 1295990 1397504 1507519 1620808 1733987 1843465 1942242 2023971
56130 2023971 2089325 2144376 2193950 2240281 2285847 2331948 2374954 2408532 2429502 2438337 2435719 2423113
56118 2423113 2405346 2387409 2368633 2343581 2307638 2257968 2191085 2104989 2003480 1894065 1782218
56107 1782218 1671500 1567461 1475901 1397712 1330103 1272286 1225415 1187975 1156446 1130092 1110256
56096 1110256 1095526 1082552 1071175 1063758 1059881 1056590 1053430 1052272 1052668 1052439 1052412 1055488 1061343 1067076
56082 1067076 1072594 1080183 1089266 1097021 1103827 1112708 1123649 1133895 1143530 1155163 1168334 1179951 1190154
56069 1190154 1202042 1215697 1228203 1239562 1252787 1268142 1283128 1298158 1316274 1337156 1357395
56058 1357395 1376755 1398106 1421155 1442507 1462127 1483414 1506592 1528326 1548112 1568746 1590326
56047 1590326 1610332 1629716 1652133 1676906 1699677 1720366 1743457 1770051 1796834 1823361 1852957
56036 1852957 1885676 1917691 1948448 1981272 2016492 2051427 2087498 2129484 2177198 2225877 2275094
56025 2275094 2328832 2386319 2441798 2494327 2548806 2606309 2662641 2717711 2776832 2841227 2906697
56014 2906697 2973164 3045822 3125253 3206296 3288429 3377198 3473646 3572711 3673792 3782061 3897506
56003 3897506 4013974 4131325 4256983 4393100 4533974 4678604 4833514 5000520 5174382
55994 5174382 5355353 5550877 5761826 5980797 6207319 6450631 6713995 6991126 7281919
55985 7281919 7596154 7937361 8299106 8681881 9097114 9549631 10033549 10550655 11114753
55976 11114753 11732600 12399814 13121275 13915215 14791351 15747200 16792749 17955421 19253900
55967 19253900 20693131 22293904 24100728 26152699 28478167 31130504 34199482 37780039
55959 37780039 41970486 46918523 52831432 59927056 68420242 78577480 90743999 105317572
55951 105317572 122774295 143739110 168923698 198907289 233950182 273770816 316872115
55944 316872115 359524306 395584031 418253507 423092605 410040502 382935952 347275714
55937 347275714 308119865 269183685 232807016 200187832 171690298 147207554 126431634
55930 126431634 108947527 94274058 81950462 71596478 62887146 55521863 49249818
55923 49249818 43889916 39296604 35330168 31876146 28861552 26228075 23910099 21853528
55915 21853528 20030950 18419815 16984876 15695943 14542458 13515470 12592742 11754705
55907 11754705 10997824 10318945 9701980 9132167 8608664 8131258 7688533 7270551 6880394
55898 6880394 6522191 6189530 5875649 5583621 5316633 5068829 4834845 4618221 4421702
55889 4421702 4239076 4064829 3902344 3754754 3617184 3485828 3365397 3259698 3163396 3070399
55879 3070399 2981718 2897732 2811478 2717737 2621302 2528823 2439647 2351571 2268027 2191923 2119069
55868 2119069 2045092 1972927 1906803 1844845 1784146 1727250 1677045 1630761 1585382 1543639 1508434
55857 1508434 1476377 1442891 1408896 1376736 1344463 1309994 1276307 1246608 1218484 1188328 1157443
55846 1157443 1128548 1100256 1070307 1040561 1013790 989023 964577 942028 922711 903997 883487
55835 883487 863295 846000 830015 813127 796835 782980 769818 755629 742555 732651 723778 713529
55823 713529 703512 695466 686786 674447 660047 646602 633523 619133 604987 593247 582555 570783
55811 570783 559249 550267 543145 536425 531258 528749 526749 523268 520291 520351 522019 522728 523366 525996 529552
55796 529552 531837 533483 535909 537615 536429 533388 530654 527669 523052 518099 514602 511237 505971 500172
55782 500172 496458 494110 490211 483775 475291 463975 449177 433176 419222 407974 398685 392157 389489
55769 389489 389689 391615 396384 404521 412495 415589 412952 406851 398674 388906 379350 371803 365591 359356
55755 359356 353945 350612 347997 344023 339224 334998 330085 322213 312076 302393 294062 286270 279285 273997
55741 273997 269611 264795 260216 257221 255107 252438 249832 248577 247706 245413 242267 240115 238803 236861
55727 236861 234399 232441 230382 226966 222774 219011 214921 209238 203152 198909 196470 194359 192781 192955
55713 192955 194428 196037 198538 203239 208997 213653 217557 222523 228048 231834 233443 234269 234410 232659 229148
55698 229148 224945 219519 211672 202608 194946 188933 182666 175849 170304 166835 164520 163062 163026 163843 164326
55683 164326 165060 167531 171140 173971 176292 180196 185793 190882 194616 198316 202259 204744 205043 204527 204096
55668 204096 203092 201448 200320 199794 198415 195860 193794 193221 193081 192381 191714 191767 192183 192740 194010 196101
55652 196101 198167 199740 201115 202168 202289 201690 201209 200678 199102 196516 193913 191289 187647 183092 178941
55637 178941 175490 171565 166649 161564 156657 151265 145480 140661 137478 135025 132465 130114 128411 127150
55623 127150 126123 125302 124172 122251 120310 119621 119868 119359 117433 115110 113209 111443 109604 108085 106878
55608 106878 105498 104076 103158 102334 100534 97782 95215 93371 91983 91323 92032 93532 94377 94291 94208 94234 93440
55591 93440 91799 90431 89631 88536 87119 86630 87463 88263 87790 86231 84270 82360 81279 81813 83469 84949
55575 84949 86121 87976 90427 92051 92443 93089 95250 98561 102270 106214 109955 112480 113513 113890 114165
55560 114165 114121 113924 114236 114818 114560 113304 112083 111209 109798 107619 105635 104166 102285 99678 97333 95702
55544 95702 93975 92015 91141 91943 93076 93435 93971 96016 99155 102127 104701 107254 109459 110778 111604 112729
55528 112729 114096 114991 115081 114611 113958 113409 112876 111643 109103 105917 103522 102308 101283 99699 97861 96086
55512 96086 94108 91947 90161 88729 86784 83914 80695 77616 74613 72011 70646 70552 70685 70406 70106 70023
55496 70023 69724 69225 69283 70049 70637 70489 69897 68808 66616 63735 61885 62032 63295 64579 65889 67328 68297
55479 68297 68609 69116 70260 71167 71071 70509 70293 70417 70789 71805 73322 74223 73915 73185 72746 72146 70928 69683
55461 69683 68889 67933 66313 64771 64138 64040 63759 63415 63304 63059 62512 62450 63451 64815 65609 65936 66258 66414
55443 66414 66248 66279 66758 66964 66426 65875 66044 66473 66542 66666 67311 67802 67319 66230 65269 64295 63185 63028 64860
55424 64860 67785 69839 70344 70093 69596 68569 67042 65702 65022 64885 65004 65026 64455 63206 61987 61477 61407
55407 61407 61055 60260 59352 58570 58138 58416 59279 59828 59375 58314 57448 56944 56483 55934 55341 54789 54701 55606 57206
55388 57206 58458 58999 59564 60518 61080 60712 60186 60395 61101 61739 62432 63225 63290 62023 60124 58561 57312 56140
55370 56140 55617 56138 56797 56584 55989 56177 57236 58528 60070 62149 64150 65157 65326 65413 65385 64799 64063 63991
55352 63991 64440 64658 64635 64800 64769 63826 62393 61626 61705 61890 62114 63035 64457 65149 64551 63537 63110 63318 63743
55333 63743 64181 64561 64865 65290 65945 66398 66111 65210 64264 63526 63014 63001 63643 64427 64768 64888 65361 66099 66607
55314 66607 66848 67035 66958 66460 66169 66708 67523 67568 66914 66522 66647 66645 66309 66262 66917 67970 68986 69644 69534 68579
55294 68579 67573 67379 67717 67687 67292 67356 68002 68409 68195 67934 68074 68322 68469 68940 70121 71720 73039 73488
55276 73488 72901 71856 71456 72139 72880 72334 70543 68722 67617 67006 66639 66641 66929 67183 67379 67568 67221 65796
55258 65796 63880 62784 62930 63587 64171 64778 65356 65468 65140 64989 65207 65280 65015 64997 65706 66926 68249 69417
55240 69417 69965 69315 67549 65449 63549 61832 60546 60490 62016 64361 66337 67315 67332 66762 66140 65912 66139
55223 66139 66591 67085 67429 67233 66293 64978 63787 62761 61852 61485 62021 62981 63622 64000 64662 65542 66143 66533
55205 66533 67107 67575 67364 66938 67431 68883 70104 70545 71014 72126 73242 73540 73177 72750 72444 72322 72654 73304
55187 73304 73446 72525 71057 69948 69429 69107 68660 68061 67394 66754 66164 65530 64961 65039 66245 68118 69565 70085
55169 70085 70184 70575 71475 72682 73735 74073 73622 73149 73372 73876 73700 72857 72338 72614 73098 73187 72867 72158 70938
55150 70938 69661 69310 70270 71909 73501 74787 75526 75427 74827 74565 74856 75090 74929 74720 74573 74007 72969 72266
55132 72266 72483 73241 73932 74443 74726 74551 74189 74541 75978 77704 78724 78796 78093 76717 75097 74134 74348 75416
55114 75416 76889 78638 80233 80807 80183 79407 79482 80240 80977 81483 81780 81539 80577 79453 78883 79026 79830 81450
55096 81450 83637 85337 85757 85465 85653 86556 87313 87201 86373 85467 84939 84775 84621 84293 84224 85027 86558 87940
55078 87940 88623 88786 88571 87771 86629 86072 86563 87451 88001 88362 88915 89395 89450 89443 89833 90249 89980 89022 87903
55059 87903 86854 85896 85390 85644 86222 86396 86188 86254 86824 87360 87277 86473 85152 83565 81984 80697 79994 80145
55041 80145 81139 82407 83268 83800 84695 86047 86923 86510 85125 83673 82666 82240 82522 83352 84080 84211 83887
55024 83887 83386 82690 82002 82028 83082 84466 85400 85996 86624 86945 86487 85718 85525 85914 86170 86118 86307 86999 87856
55005 87856 88619 89337 89885 90025 90061 90710 92130 93621 94528 94994 95652 96848 98286 99276 99347 98774 98296 98174
54987 98174 97852 96826 95427 94309 93597 93041 92656 92578 92546 92259 92099 92778 94271 95699 96346 96307 96064 95886
54969 95886 95723 95354 94645 93904 93830 94777 96176 97106 97288 97116 96905 96685 96657 97265 98574 100013 100907 101064 100721
54950 100721 100192 99685 99322 99169 99221 99384 99513 99531 99456 99242 98731 97984 97453 97442 97571 97255 96615 96323 96620 97164
54930 97164 97846 98939 100311 101333 101853 102459 103515 104778 106326 108850 112493 116380 120026 124280 129997
54915 129997 136615 143056 149280 155848 162413 167767 171092 172216 171027 167593 162634 156932 150528 143315
54901 143315 136096 130034 125331 121373 117986 115498 113735 111997 110050 108266 106826 105623 104859 104804 105078
54886 105078 105124 105279 106314 107918 108852 108824 109094 110759 113397 115947 118188 120805 124554 129787 136348 143609
54870 143609 150895 157971 164716 170388 173882 174849 173892 171566 167854 162810 157001 151009 145050 139332 134226
54855 134226 129783 125572 121301 117175 113466 110165 107240 104797 102816 101166 99954 99394 99193 98611 97357
54840 97357 95963 95056 94700 94603 94526 94278 93758 93218 93098 93396 93544 93119 92398 92084 92681 94166 95992 97447
54822 97447 98288 98888 99505 99710 99091 98169 97826 98019 97934 97471 97536 98610 99907 100468 100345 100155 100036 99666 98990
54803 98990 98365 98085 98092 98074 97730 97088 96582 96570 96819 96837 96622 96561 96659 96514 96157 96264 97266 98786 100239 101466
54783 101466 102476 103044 102985 102533 102152 102175 102800 104125 106008 108157 110441 112878 115301 117479 119575 122087
54767 122087 125255 128944 133116 137874 143009 148108 153248 159025 165630 172378 178342 182968 185907 186805
54753 186805 185616 182697 178357 172699 166121 159501 153556 148345 143571 139066 134811 130843 127331 124444
54739 124444 122046 119860 117929 116495 115504 114752 114409 114668 114940 114308 112966 112278 113030 114476 115618 116569
54723 116569 118009 120071 122596 125946 130646 136498 142863 149621 157100 165021 172160 177213 179638 179625 177574
54708 177574 173748 168297 161537 154168 147060 140777 135511 131390 128497 126539 124956 123536 122532 122029
54694 122029 121593 120815 119843 119100 118753 118629 118471 118072 117412 116698 116024 115075 113562 111885 110821 110542 110437 109985
54676 109985 109242 108449 107819 107759 108554 109620 109801 108658 106806 104866 102918 101257 100603 101019 101505 101326 100969
54659 100969 101094 101345 101088 100688 101060 102351 103865 104998 105501 105177 104123 103034 102523 102364 102016 101584 101553
54642 101553 101869 102120 102419 103298 104761 106205 107273 108070 108552 108420 107807 107474 108029 109287 110504 110927 110146
54625 110146 108275 105962 104085 103324 103906 105367 106513 106192 104545 103067 102920 103560 103612 102731 101867 101856 102533
54608 102533 103272 103762 104057 104307 104648 105129 105646 106045 106258 106252 106102 106253 107354 109547 112169 114371 115727 116067
54590 116067 115277 113687 112149 111217 110641 110148 110170 111170 112694 113884 114553 114995 115097 114601 114016 114266 115359
54573 115359 116255 116171 115276 114068 112831 111827 111303 111053 110623 110128 110222 111048 111845 111913 111448 111116 111228 111700 112404
54554 112404 113184 113734 113802 113471 113108 113075 113461 113960 114127 113927 113871 114406 115392 116477 117678 119149 120655 121853
54536 121853 122898 124172 125534 126463 126919 127338 127780 127761 127121 126330 125705 124895 123455 121529 119673 118359 117856
54519 117856 118139 118677 118688 117914 116876 116174 115799 115333 114538 113570 112805 112598 112996 113634 114146 114679 115686 117141
54501 117141 118293 118367 117266 115521 113781 112472 111685 111295 111215 111455 111804 111676 110694 109335 108603 109063 110454
54484 110454 112123 113470 114152 114343 114770 115978 117581 118695 119076 119248 119581 119916 120226 120897 122053 123221
54468 123221 123995 124533 125018 125203 124994 125043 126115 128046 129920 131210 132234 133385 134376 134543 133708 132407 131213
54451 131213 130103 128733 127213 126167 125896 125876 125417 124558 123957 124066 124761 125631 126257 126366 126054 125711 125450 124841
54433 124841 123644 122491 122227 122803 123433 123728 123909 124006 123663 122925 122476 122813 123751 124911 126150 127316 128173
54416 128173 128816 129589 130378 130591 130132 129790 130217 130963 131023 129986 128294 126657 125587 125246 125473 126101 127316
54399 127316 129391 131985 134183 135397 135829 135920 135868 135875 136260 136942 137330 137145 136944 137396 138404 139353 139926 140286
54381 140286 140705 141338 142109 142621 142466 141887 141694 142270 143124 143664 143902 143961 143501 142277 140884 140260 140656 141623
54363 141623 142794 144064 145203 145926 146326 146797 147528 148455 149593 151011 152629 154400 156562 159273 162128
54348 162128 164521 166361 167998 169499 170504 170719 170138 168789 166698 164120 161351 158332 154916 151535 149047
54333 149047 147737 146954 145973 144806 143902 143442 143265 143237 143267 143110 142471 141323 139907 138509 137486 137350 138331
54316 138331 139727 140179 139025 137181 136167 136310 136414 135343 133362 131573 130537 130058 129991 130487 131383 132042
54300 132042 132085 131821 131714 131769 131690 131374 131045 131064 131648 132527 132923 132313 131219 130768 131332 132208 132802 133483 134843
54281 134843 136639 138031 138531 138190 137218 135951 135042 135083 136025 137272 138287 138848 138887 138492 138000 137797 138056 138794
54263 138794 139934 141156 142020 142533 143231 144353 145348 145679 145700 146071 146596 146450 145499 144619 144525 145012 145611 146393
54245 146393 147635 149056 149909 149793 149047 148288 147722 147028 145938 144776 144164 144139 143925 142816 141001 139177 137682
54228 137682 136454 135626 135493 135880 136199 136303 136785 138148 140104 141983 143477 144615 145352 145634 145773 146273 147201
54211 147201 147983 147943 146949 145490 144220 143431 142888 142137 141048 140044 139682 140006 140439 140408 139939 139464 139161 138800
54193 138800 138275 137908 137989 138283 138357 138173 137951 137632 137000 136293 136091 136445 136685 136352 135815 135649 135921 136557 137936
54174 137936 140386 143241 145128 145343 144497 143727 143602 143897 144048 143653 142719 141650 140887 140492 140129 139480 138593
54157 138593 137813 137491 137749 138453 139313 140021 140313 140034 139263 138380 137824 137766 138108 138717 139441 139965 140004 139684 139401
54138 139401 139261 138996 138542 138249 138324 138488 138491 138603 139220 140212 141044 141383 141309 141096 141070 141472 142203 142813 142978 142834
54118 142834 142696 142718 143015 143714 144595 145049 144862 144795 145831 147992 150285 151736 152141 151924 151671 151747 152066 152229
54100 152229 152021 151609 151142 150529 149908 149919 151030 152775 154155 154598 154205 153334 152431 152008 152216 152572 152583 152508 152953
54081 152953 153909 154785 155344 155996 157128 158675 160436 162388 164643 167422 170966 175078 178942 181941 184575
54066 184575 188053 192999 199016 205265 210778 214336 214986 212904 209111 204312 198726 193128 188988 187001
54052 187001 186231 185309 183959 182807 182220 182053 182240 182922 184064 185456 187085 189072 191301 193467 195561 198001
54036 198001 201217 205265 209936 215073 220739 227063 233916 240788 247051 252364 256786 260633 264288 267973
54022 267973 271427 273960 275163 275541 276084 277216 278427 278947 278444 277020 274850 271994 268371 263920 258907
54007 258907 253960 249547 245535 241587 237796 234469 231440 228231 224902 222134 220301 219042 217904 216875
53993 216875 215984 214968 213781 213018 213317 214562 216052 217250 218032 218319 217918 216740 214943 212770 210379 207796
53977 207796 205006 202058 199083 196188 193452 191091 189399 188377 187621 186849 186286 186145 185986 185178 183913 183175
53961 183175 183595 184851 186261 187523 188807 190544 193128 196388 199384 201275 202389 203781 205718 207386
53947 207386 208308 209209 211063 213961 217417 221216 225396 229884 234700 240204 246599 253518 260533 267745 275405
53932 275405 283256 290719 297469 303373 308164 311716 314569 317740 322109 328203 336328 346540 358557 371871
53918 371871 385611 398072 406963 410806 410091 406709 402490 398558 395629 394165 394100 394889 395913 396665 396711
53903 396711 395807 394011 391397 387838 383358 378524 374119 370505 367520 364820 361981 358495 354050 348767
53889 348767 342877 336407 329503 322771 316755 311163 305191 298618 292119 286392 281412 276724 272101 267686
53875 267686 263667 260052 256647 253171 249456 245601 241847 238264 234639 230776 226919 223763 221815 220689
53861 220689 219293 216980 214282 212125 210553 208794 206529 204374 202919 201959 201006 200015 199205 198600 198149 197840
53845 197840 197349 196032 193778 191492 190238 190201 190849 191651 192174 191992 191217 190767 191416 192790 193939 194556 194887
53828 194887 194728 193514 191421 189510 188566 188519 189140 190533 192588 194563 195748 196214 196591 197363 198672 200507
53812 200507 202701 204798 206268 206981 207476 208683 211242 214970 219171 223481 228141 233345 238750 243919 248837
53797 248837 253614 258064 262069 265988 270090 273881 276651 278484 279991 281302 282138 282821 284149 286158 287873
53782 287873 288607 288656 288362 287315 285070 281980 278634 274975 270678 266041 261775 258070 254492 250734 246912
53767 246912 243117 239189 235040 230822 226648 222479 218472 215166 213029 211860 210844 209284 207222 205280
53753 205280 203997 203355 202970 202594 202350 202515 203155 203930 204232 203682 202540 201530 201164 201336 201535 201234 200079
53736 200079 198177 196437 196149 197731 200105 201765 202279 202327 202466 202515 202211 201872 202172 203576 206074 209169 212000
53719 212000 213831 214589 214779 214900 215188 215823 216934 218321 219558 220559 221694 223230 224990 226832 229168
53704 229168 232617 237148 241819 245531 248035 250080 252487 255173 257375 258822 260228 262478 265745 269701
53690 269701 274149 278926 283499 287220 289840 291311 291370 289934 287694 285596 283820 281964 280174 279192 279122
53675 279122 278982 277911 276182 274635 273617 272979 272683 272808 273066 272820 271685 269979 268507 267849 267746 267354
53659 267354 266298 265275 265307 266561 268322 269914 271057 271451 270729 269021 267002 265290 264231 264181 265272 266815
53643 266815 267736 267891 268276 269672 271771 273998 276395 279118 281682 283427 284403 285237 286417 288076 290136
53628 290136 292205 293712 294618 295693 297626 300228 302928 305671 308734 312009 315132 318208 321788 326099
53614 326099 330763 335279 339398 343056 346392 349897 354232 359726 366125 372768 379005 384591 389839 395184
53600 395184 400554 405327 408981 411444 412773 412956 412242 411176 409979 408301 405923 403332 401213 399682 398388
53585 398388 397042 395492 393629 391610 389829 388317 386568 384407 382568 381721 381286 379916 377118 373785 371199
53570 371199 370014 370096 370747 371098 370722 369943 369266 368678 367877 366995 366519 366636 367152 367980 369199 370665 372066 373369
53552 373369 374769 376201 377409 378511 380011 382153 384649 387088 389269 391134 392778 394622 397185 400621
53538 400621 404716 409316 414412 419876 425560 431590 438165 445045 451725 458181 465079 473166 482746 493708
53524 493708 505616 517753 529553 541162 553302 566562 581076 596758 613339 630259 647167
53513 647167 664636 683802 705064 727645 750670 774146 798600 824221 850766 877913 905238
53502 905238 932117 958127 983374 1008092 1032005 1054472 1075222 1094669 1113516 1132271 1151145
53491 1151145 1170163 1189288 1208474 1227646 1246676 1265475 1284089 1302598 1320953 1339072 1357133
53480 1357133 1375552 1394558 1413856 1432701 1450207 1465658 1478761 1489588 1498156 1504140 1507224 1507598
53468 1507598 1505752 1501801 1495423 1486512 1475485 1462757 1448334 1432308 1415487 1399097 1383849 1369492
53456 1369492 1355223 1340282 1324173 1306580 1287334 1266516 1244586 1222323 1200568 1179912 1160549
53445 1160549 1142256 1124525 1106964 1089813 1073968 1060281 1048872 1039309 1031361 1025313 1021503 1019728
53433 1019728 1019176 1018843 1018125 1017162 1016599 1016960 1018419 1021226 1025926 1032721 1040908 1049538 1058637 1069315 1082611
53418 1082611 1098609 1116663 1136021 1156080 1176572 1197784 1220315 1244439 1269945 1296756 1325309
53407 1325309 1356103 1389102 1423809 1459744 1496692 1534732 1574202 1615509 1658900 1704592 1753055
53396 1753055 1804703 1859063 1914690 1970281 2025782 2082111 2139911 2198764 2257502 2315098 2371284
53385 2371284 2426360 2480351 2532499 2581818 2628075 2671782 2713206 2751838 2786954 2818185 2845281
53374 2845281 2867835 2885648 2898979 2907973 2912136 2910814 2903883 2891420 2872942 2847511 2814619 2774597
53362 2774597 2728353 2677269 2623276 2568334 2513532 2458954 2404485 2350323 2296710 2243725 2191719
53351 2191719 2141676 2094723 2051338 2011113 1973040 1935890 1898543 1860279 1820841 1780282 1739012
53340 1739012 1698094 1659093 1623201 1590511 1560310 1531987 1505490 1481097 1459149 1440007 1423932
53329 1423932 1410729 1399558 1389125 1378020 1365066 1349813 1332874 1315539 1298795 1282789 1267323
53318 1267323 1252534 1238792 1226110 1214136 1202741 1192335 1183484 1176509 1171523 1168579 1167568 1168138 1169898
53305 1169898 1172617 1176222 1180777 1186595 1194136 1203641 1215049 1228375 1243941 1262034 1282458 1304572
53293 1304572 1327705 1351465 1375984 1401969 1430115 1460069 1490146 1518472 1544342 1568246 1590775
53282 1590775 1611874 1630992 1647481 1660934 1671506 1679867 1686381 1690338 1690444 1686257 1678704 1669055 1657697
53269 1657697 1644149 1627964 1609302 1588664 1566364 1542415 1516923 1490450 1463691 1436782 1409295
53258 1409295 1381107 1352795 1324761 1296397 1266927 1236894 1207956 1180988 1155150 1129161 1102867
53247 1102867 1077094 1052396 1028505 1004833 981062 957302 933896 911079 888736 866693 845216
53236 845216 824919 806123 788692 772621 758319 746047 735433 725884 717115 708958 700972 692706
53224 692706 684069 675101 665572 655210 644064 632130 618845 603614 586868 570027 554176 539207
53212 539207 524467 509833 495784 482687 470580 459586 450047 441930 434477 426842 418953 411290 403854
53199 403854 395928 387091 377855 368818 359710 350007 340249 331800 325185 319430 313377 307031 301210 296389
53185 296389 292364 288754 285376 282300 279789 277961 276370 274280 271579 269026 267280 266071 264698 263001
53171 263001 261365 260065 259068 258319 257767 257225 256571 255963 255560 255154 254368 253100 251523 249837 248286 247147
53155 247147 246413 245743 244994 244475 244292 243873 242677 241096 239998 239603 239447 239331 239578 240329 241244 241979 242384 242193
53137 242193 241220 240055 239852 241026 242651 243568 243645 243507 243385 242869 241730 240436 239685 239694 240119 240552 240961 241625
53119 241625 242768 244365 246278 248429 250695 252792 254427 255511 256085 256113 255556 254587 253544 252643 251806 250771
53103 250771 249332 247633 246161 245170 244084 241929 238670 235639 234157 233998 233777 232682 231261 230590 231201
53088 231201 232819 234613 235621 235400 234367 233259 232340 231507 230921 230871 231083 230950 230513 230407 230620 230214 228786
53071 228786 227427 227454 228689 229763 229871 229416 229014 228570 227569 225830 223732 221891 220754 220391 220624 221315
53055 221315 222344 223325 223739 223579 223560 224354 225847 227455 228867 230078 230934 231251 231286 231502 231821 231663 230900 230249
53037 230249 230429 231284 232074 232340 232141 231617 230744 229540 228230 227145 226548 226509 226792 226869 226263 224991 223678 223198
53019 223198 224121 226284 228786 230592 231398 231845 232682 233793 234390 234192 233955 234534 235717 236459 236205 235518 235288
53002 235288 235709 236244 236435 236397 236580 237216 238089 238761 238988 238885 238660 238324 237789 237185 236874 237115 237918 239216 240909
52983 240909 242666 244018 244845 245561 246590 247869 249054 250047 250993 251973 253010 254289 256021 258096 260198
52968 260198 262278 264564 266988 268924 269726 269449 268789 268355 268162 267898 267513 267236 266994 266165 264290 261851 259870
52951 259870 258675 257596 256029 254245 252820 251715 250460 248941 247473 246264 245362 244912 244960 245083 244792 244251
52935 244251 244032 244188 244193 243839 243520 243421 243088 242134 240806 239408 237636 235129 232422 230694 230492 231116 231474 231309
52917 231309 231365 232377 234072 235411 235742 235396 234979 234525 233820 233248 233540 234676 235809 236450 237034 237965 238758
52900 238758 238755 238225 238081 238706 239704 240663 241554 242275 242381 241590 240323 239439 239389 239747 239681 238930 238166 238151 238633 238521
52880 238521 237263 235581 234559 234460 234858 235569 236789 238445 240020 241197 242251 243679 245679 248042 250217
52865 250217 251458 251322 250241 249314 249271 249840 250278 250300 250214 250297 250435 250446 250505 250983 251839 252308 251355 248571 244630
52846 244630 240779 237769 235273 232409 228776 224942 221889 220103 219243 218628 217883 217103 216538 216213 215866 215221
52830 215221 214299 213440 212966 212947 213357 214281 215661 216930 217371 216970 216467 216306 215999 214931 213424 212446 212466 213162
52812 213162 214123 215193 216110 216477 216304 216123 216398 217170 218344 219799 221040 221307 220363 218812 217405 216419 215900
52795 215900 215919 216199 216039 215165 214283 214171 214477 214064 212431 210235 208436 207516 207552 208504 210116 211827 213060
52778 213060 213595 213635 213633 213980 214696 215459 216044 216531 216915 216768 215710 214132 213031 213032 213863 214824 215453 215612 215258
52759 215258 214397 213266 212400 212366 213285 214571 215329 215170 214548 214170 214286 214760 215576 216859 218483 220083 221541
52742 221541 223164 225230 227596 229848 231671 233073 234410 236207 238675 241335 243377 244520 245334 246604
52728 246604 248533 250655 252351 253272 253416 253031 252433 251747 250827 249462 247626 245459 243110 240826 239115 238517
52712 238517 238984 239606 239276 237702 235628 234056 233430 233600 234226 234921 235256 235055 234617 234372 234378 234513 235040 236409
52694 236409 238344 239698 239607 238528 237763 238107 239273 240444 241084 241185 241043 240866 240611 240213 239877 239899 240222 240478
52676 240478 240540 240643 240834 240696 239890 238613 237240 235842 234408 233173 232329 231691 231115 230961 231644 232916 234129
52659 234129 235083 236041 237025 237747 238327 239457 241598 244444 247368 250047 252420 254376 255699 256160 255525 253714
52643 253714 251078 248282 245786 243673 242052 241312 241702 242876 244116 244931 245269 245256 244975 244525 244167 244284 245151
52626 245151 246799 249086 251849 254847 257526 259098 259042 257503 255128 252657 250690 249507 248805 247790 245910
52611 245910 243474 241358 240169 239905 240249 240816 241226 241344 241493 242088 243029 243742 243881 243662 243518 243698 244291 245281
52593 245281 246402 247198 247439 247359 247394 247873 248999 250838 253144 255353 256939 257755 257947 257735 257445 257610 258697
52576 258697 260558 262324 263116 262912 262525 262581 262790 262521 261860 261537 261840 262186 261995 261427 260927 260518 259974 259265
52558 259265 258396 257194 255765 254712 254252 253508 251501 248612 246204 244834 243792 242527 241641 242068 243846
52543 243846 246150 248072 249060 248972 248117 247079 246286 245873 245865 246124 246190 245649 244723 244038 243797 243770 244077 245300 247503
52524 247503 249794 251208 251567 251221 250483 249697 249338 249623 250366 251457 253019 254804 256121 256855 257978 260421
52508 260421 263863 267343 270630 274185 277941 280962 282363 282007 280242 277551 274541 271749 269226 266671
52494 266671 264048 261722 259885 258239 256459 254661 253206 252235 251647 251393 251549 252070 252633 252819 252497 251958
52478 251958 251661 251866 252584 253728 255163 256681 258186 259856 261839 263830 265285 266108 266717 267338 267718 267765
52462 267765 268029 269134 271043 273281 275636 278171 280678 282573 283363 282960 281589 279661 277695 276033 274537
52447 274537 272710 270174 267002 263659 260726 258574 257148 256109 255224 254476 253843 253245 252802 252824 253356 253996
52431 253996 254385 254598 254805 254856 254562 254195 254319 255147 256368 257563 258545 259347 260180 261423 263422 266128 268966
52414 268966 271113 272030 271890 271524 271804 273101 275388 278664 282997 288377 294996 303485 314243 326432 338241
52399 338241 348178 355424 359019 357873 352159 343803 334796 325669 316335 307612 300756 295887 292064 288830
52385 288830 286683 285995 286420 287546 289298 291389 293068 293806 293868 293993 294857 296880 300108 304164 308683 313756
52369 313756 319599 325868 331848 337288 342471 347431 351672 354796 356825 357805 357624 356402 354554 352354 349977
52354 349977 348073 347561 348519 349888 350740 351348 352560 354577 356882 359118 361443 364118 367147 370369 373673
52339 373673 377148 381097 385799 391228 397190 403745 411151 419371 428060 437218 447381 458923 471621
52326 471621 485268 500342 517534 536879 557767 579700 602589 626419 651036 676217 701555
52315 701555 726268 749564 771377 792461 813592 834864 855921 876628 897255 917989 938533
52304 938533 958298 976901 994358 1010870 1026593 1041584 1055707 1068523 1079536 1088762 1096793 1103951
52292 1103951 1109480 1111923 1110374 1105148 1097311 1087826 1077220 1065758 1053816 1042131 1031592 1022599 1014774
52279 1014774 1007570 1001088 995994 992736 991228 991292 993022 996644 1002313 1010097 1019893 1031439 1044699 1060022
52265 1060022 1077333 1095289 1112054 1127224 1142310 1158887 1176738 1194232 1210130 1224474 1237968
52254 1237968 1251079 1263840 1276124 1287966 1299554 1310819 1321092 1329437 1335313 1338562 1338805 1335427
52242 1335427 1328420 1318724 1307380 1294730 1280778 1265855 1250464 1234790 1218888 1203102 1187868 1173334
52230 1173334 1159626 1147163 1136109 1125761 1115201 1104551 1094918 1087040 1080627 1075141 1070550 1066892
52218 1066892 1063683 1060406 1057380 1055572 1055509 1056786 1058775 1061399 1064892 1069022 1073107 1076992 1081595 1088043
52204 1088043 1096318 1105088 1112895 1119212 1124408 1129161 1134028 1139157 1144140 1148452 1152276 1156541 1161869 1167836
52190 1167836 1173646 1179128 1184559 1189777 1194151 1197384 1199774 1201523 1202237 1201267 1198217 1193016 1185846 1177168
52176 1177168 1167539 1157245 1146338 1135110 1124240 1114278 1105235 1096925 1089557 1083711 1079748 1077405 1076043
52163 1076043 1075216 1074953 1075505 1076924 1079045 1081922 1085989 1091454 1097563 1102816 1106098 1107460 1107715 1107502 1106921
52148 1106921 1105934 1104748 1103683 1102883 1102386 1102437 1103464 1105642 1108573 1111501 1113760 1114943 1114944 1114173 1113628 1114348 1116714
52131 1116714 1120541 1125861 1133181 1142872 1154738 1168511 1184463 1203220 1225187 1250411 1278709 1309491
52119 1309491 1341736 1374575 1407888 1441965 1476709 1511509 1545745 1578917 1610278 1638911 1664336
52108 1664336 1686746 1706485 1723592 1737948 1749550 1758471 1764777 1768688 1770652 1771198 1770891 1770380 1770011 1769197
52094 1769197 1766547 1761026 1752830 1742781 1731044 1716907 1699838 1680252 1659036 1636683 1613357 1589747
52082 1589747 1567379 1547799 1531586 1518377 1507725 1499650 1494331 1491622 1491184 1492993 1497417 1504730 1514690
52069 1514690 1526747 1540615 1556468 1574436 1593991 1614029 1633705 1653018 1672378 1691730 1710341
52058 1710341 1727350 1742238 1754849 1765430 1774703 1783392 1791369 1797634 1801358 1802588 1801681 1798503 1792616
52045 1792616 1783846 1772113 1756992 1738108 1715878 1691258 1664841 1636778 1607595 1578436 1550322
52034 1550322 1523657 1498576 1475222 1453505 1433137 1414217 1397259 1382319 1368548 1354991 1341469
52023 1341469 1328227 1315166 1301960 1288680 1275705 1263085 1250536 1238054 1226040 1214701 1203748
52012 1203748 1192790 1181668 1170253 1158255 1145495 1132095 1118148 1103392 1087456 1070258 1051889
52001 1051889 1032280 1011364 989569 967714 946179 924510 902195 879710 858465 839707 823756
51990 823756 810252 798676 788432 778770 769047 759008 748641 737887 726695 715173 703372 691042
51978 691042 677906 664101 650047 635984 621987 608323 595321 582895 570736 559164 549326 542240
51966 542240 537971 535976 535925 537873 541896 547840 555198 563017 570226 576363 581725 586508 590238 592362 592912
51951 592912 591970 588953 583323 575859 568299 561678 555855 550790 547238 545670 545504 546177 548324 553060 560582
51936 560582 570374 582381 596902 613300 629794 644747 657470 667657 674852 678775 679420 676423 669044
51923 669044 657360 642957 627806 612785 597839 583162 569393 556884 545577 535767 528290 523700
51911 523700 521706 521696 523519 527504 533864 542184 551342 559801 566132 569413 569360 566388 561663 556727 552577
51896 552577 549179 546053 542973 539606 534783 526987 515711 501893 486958 471983 457789 445089 434142
51883 434142 424761 416965 411189 407629 405830 405242 405754 407391 410012 413718 419053 426268 434708 443331 451461
51868 451461 458540 463700 466366 467095 467050 466630 465206 462194 457860 452991 448319 444334 441240 439006 437773
51853 437773 438143 440593 444618 448967 452796 456101 458974 461017 461708 460870 458450 454324 448703 442445 436492
51838 436492 431022 425479 419396 412985 406962 401965 398224 395717 394527 394894 396830 399826 403126 406175
51824 406175 408600 409919 409681 407964 405388 402478 399200 395326 391102 387332 384732 383324 382563 382115 382331
51809 382331 383708 385987 388238 389986 391753 394114 396574 397968 397769 396519 395024 393699 392678 392031 391637
51794 391637 391235 390719 390146 389387 388059 385860 382794 379064 375069 371461 368925 367809 368066 369296 370622
51779 370622 370922 369804 368252 367705 368514 369756 370450 370353 369741 369183 369650 372076 376557 382579 390074 399484
51763 399484 410536 421818 432085 441306 449942 457754 463884 467580 468343 465876 460492 453202 444885 435726
51749 435726 425910 416308 407842 400547 393956 388089 383359 379742 376837 374656 373667 374060 375609 378353 382833
51734 382833 389454 397978 407682 417702 427170 435331 441675 445903 447943 448249 447927 448315 450401 454454 459592
51719 459592 463522 463567 458841 451197 443476 437143 432193 428647 426865 426393 425716 423613 420122 415961 411733
51704 411733 407989 405378 404210 404286 405423 407662 410614 413139 414181 413688 412344 410674 408758 406674 404863
51689 404863 404046 404786 406875 409085 409837 408350 405017 400676 395895 391029 386498 382602 379299 376448 374138
51674 374138 372632 372147 372765 374335 376429 378792 381920 386808 393913 402761 412735 423749 435664 447444
51660 447444 457438 464376 467728 467356 463372 456355 447355 437695 428976 422950 420788 422372 426772 433362
51646 433362 441923 451488 459755 464283 464158 460161 453512 444967 435118 424867 415051 405812 396848 388310
51632 388310 381010 375509 371421 367920 364690 361982 359966 358587 358044 358871 361235 364479 367537 369633 370541
51617 370541 370496 370016 369490 368777 367525 366000 365096 365192 365541 365305 364803 364946 365658 365652 364001 361242 358697 357258
51599 357258 357214 358752 362006 366706 372211 377983 383960 390648 398912 409254 420770 430940 436944 437426
51585 437426 432974 425228 415976 406893 399289 393603 389515 386897 386365 388556 393245 399722 407918 418495
51571 418495 431768 446972 462835 478571 494231 510402 527706 546186 564861 582145 597044
51560 597044 610065 623016 638206 657764 683047 714087 749634 787864 826721 863370 894042
51549 894042 915438 926485 928326 922539 909806 890246 864371 833361 798711 761942 724538 687894
51537 687894 653259 621555 593093 567617 544870 525016 508182 493805 481032 469720 460404 453135
51525 453135 446935 440747 434441 428626 423894 420530 418441 416928 414967 412248 409648 408109 407364 406398 405002
51510 405002 404165 404843 406878 409310 411297 412522 412992 412699 411449 409021 405599 401918 398719 396162 394018
51495 394018 392217 390808 389506 387887 386133 385014 384844 384861 384048 382319 380509 379321 378615 377726 376225 374246
51479 374246 372148 369968 367339 364026 360380 357072 354385 352017 349560 346900 344131 341339 338618 336073
51465 336073 333716 331500 329468 327650 325859 323956 322347 321747 322279 323213 323850 324223 324642 325099 325635 326914
51449 326914 329683 333763 338160 342193 346069 350445 355926 363004 371957 382723 395201 409441 424835
51436 424835 439129 449163 453151 451938 447896 443196 439227 436657 435145 433314 429767 424078 416570 407662
51422 407662 398077 389198 382369 377824 374900 373056 372047 371347 370378 369389 369290 370414 372171 374108 376528
51407 376528 379696 383143 386210 388727 390704 391901 392233 392162 392118 391889 391119 390099 389525 389711 390583 392234 394998
51390 394998 399045 404361 410944 418559 426520 434303 442392 452131 464763 480956 501079 525406 554048
51377 554048 587099 624785 667092 713443 763191 816004 870735 923774 969546 1003420 1023994
51366 1023994 1032469 1030455 1018884 998494 970453 936200 896970 853631 807086 758839 711036 665658
51354 665658 623682 585276 550644 520205 493992 471511 452394 436649 423963 413344 403951 395850
51342 395850 389398 384195 379295 374297 369614 365623 362078 358532 354925 351539 348611 346205 344262 342568
51328 342568 340767 338568 335961 333157 330323 327528 324989 323228 322670 322991 323145 322377 321094 320378 320750 321801
51312 321801 323039 324570 326752 329562 332654 335679 338342 340407 342010 343675 345686 347629 348909 349533
51298 349533 349975 350379 350312 349299 347225 344209 340381 335989 331541 327684 324879 323135 322001 321017 320247 320234
51282 320234 321331 323361 326099 329725 334405 339659 344620 348823 352343 355196 357097 357874 357730 356973 355814
51267 355814 354559 353704 353633 354467 356256 359098 362865 366992 370670 373145 373869 372681 370100 367229 365023
51252 365023 363585 362265 360437 358023 355323 352476 349305 345748 342258 339523 337743 336438 335142 334039
51238 334039 333630 333910 334255 334092 333394 332497 331773 331524 331840 332385 332558 332045 331046 329874 328595 327231 326065
51221 326065 325421 325277 325370 325602 326031 326487 326501 325864 325088 325131 326579 329173 332133 334931 337682 340804 344390
51204 344390 348114 351783 355718 360292 365150 369261 371880 373238 374023 374410 373992 372560 370487 368242 365965
51189 365965 363761 361949 360619 359254 357307 354994 353016 351704 350933 350737 351236 351965 352064 351438 350988 351301
51173 351301 351820 351864 351771 352231 352968 353045 352345 351856 352377 353643 354913 355912 357003 358770 361526 364921 368035
51156 368035 370204 371614 372755 373531 373504 372827 372133 371486 370312 368603 367371 367472 368609 369922 370922 371346
51140 371346 370698 368726 366052 363663 361895 360401 358874 357248 355385 353208 351169 350026 350064 350922 352198
51125 352198 353779 355497 356939 357910 358807 360256 362448 364938 367057 368451 369300 370082 371158 372635 374592
51110 374592 377218 380550 384235 387769 390931 393808 396473 398804 400638 401980 403083 404366 406157 408394
51096 408394 410675 412647 414202 415261 415614 415166 414206 413263 412845 413318 414657 416109 416536 415514 413836 412508
51080 412508 411566 410402 409016 408184 408310 408786 408762 408079 407204 406654 406748 407595 409031 410786 412931 415936 420089
51063 420089 425151 430865 437604 446203 457274 470954 487140 505401 524410 541694 554571 561849
51051 561849 564905 567069 571763 580958 594810 611902 629536 644645 655641 663512 670258 676001 678335
51038 678335 674929 666138 654630 643129 633200 625499 619755 614265 606410 594457 578783 561261 543881
51025 543881 527998 514285 502853 493506 486231 481331 478931 478528 479335 481002 483816 488230 494395 502071
51011 502071 510752 519834 528774 537232 545089 552423 559480 566579 573930 581541 589376 597548 606292 615717
50997 615717 625676 635942 646489 657524 669119 680784 691568 700734 708373 715210 721848 728323 734332
50984 734332 739719 744701 749917 756375 765170 776927 791470 808068 825924 844345 862627 880165
50972 880165 896921 913833 932637 955133 982396 1014612 1051714 1094137 1142749 1197969 1259184
50961 1259184 1325305 1395740 1470468 1549143 1630487 1712743 1794531 1875032 1953419 2028294 2097682
50950 2097682 2159512 2212301 2255650 2290164 2316730 2335769 2347313 2351861 2350983 2346950 2341770 2336625
50938 2336625 2331890 2327207 2321470 2313177 2301333 2286100 2268532 2249701 2230111 2209581 2187257 2161799
50926 2161799 2131983 2097323 2057914 2013724 1964347 1909607 1850027 1786542 1720094 1651856 1583541
50915 1583541 1516949 1453168 1392459 1334878 1280766 1230654 1185033 1144180 1108002 1075973 1047443
50904 1047443 1022013 999430 979191 960535 942919 926314 911063 897579 886051 876107 866810 857375
50892 857375 848018 839808 833638 829568 827127 825777 824979 824333 823983 824558 826378 829015 831937 835314 839753
50877 839753 845461 852063 859134 866555 874460 883205 893330 905151 918373 932429 947286 963657 982334
50864 982334 1003467 1026548 1051042 1077127 1105899 1138657 1175825 1216805 1261166 1309702 1363952
50853 1363952 1424987 1493303 1569792 1655985 1752992 1860717 1978538 2106395 2244867 2394339
50843 2394339 2554390 2723793 2900825 3083667 3270675 3460125 3649445 3834635 4010432
50834 4010432 4170984 4310709 4425306 4512574 4572324 4605481 4613647 4599598 4567476 4521760 4466167
50823 4466167 4404100 4339946 4279127 4226518 4185112 4156077 4139289 4133170 4134343 4138068 4139171 4132542
50811 4132542 4113286 4077267 4021992 3946951 3853013 3741543 3613998 3472124 3318344 3155914
50801 3155914 2988648 2820360 2654570 2494620 2343707 2204315 2077556 1963280 1860959
50792 1860959 1770305 1691124 1622979 1565234 1517212 1478044 1446605 1421832 1402954 1389128 1379075
50781 1379075 1371457 1365466 1360599 1355905 1350018 1342143 1332631 1322400 1312081 1301816 1291407 1280348 1267993
50768 1267993 1254127 1239207 1223844 1208230 1192280 1176015 1159400 1142113 1123963 1105446 1087439
50757 1087439 1070345 1054020 1038602 1024993 1014317 1007073 1002844 1000710 999970 1000696 1003607 1009304 1017852
50744 1017852 1029280 1044133 1062990 1085613 1111302 1140198 1173662 1213133 1259081 1311231 1369280
50733 1369280 1433058 1502448 1577527 1658457 1744837 1835405 1928693 2023712 2119721 2215757 2310881
50722 2310881 2404666 2496899 2586816 2672991 2753750 2827090 2890164 2939392 2971497 2984464 2977776
50711 2977776 2952390 2910869 2857289 2796539 2733429 2672285 2616934 2570573 2535220 2511164 2497123
50700 2497123 2491227 2491969 2498086 2507563 2517082 2522728 2521043 2509264 2484983 2446240 2392224 2323770 2243167
50687 2243167 2153596 2058581 1961579 1865824 1774294 1689347 1612109 1542473 1480210 1425936 1380676
50676 1380676 1344722 1317518 1298578 1287773 1284606 1288003 1297220 1312256 1332774 1357117 1383082 1409330
50664 1409330 1435362 1460411 1483265 1503241 1520539 1535466 1548016 1558543 1568194 1578164 1588868 1600208
50652 1600208 1612220 1625046 1638678 1653222 1669132 1686701 1705680 1726137 1749430 1777530 1811256
50641 1811256 1849931 1892843 1940270 1992720 2049836 2110505 2173535 2237689 2301463 2363436 2422695
50630 2422695 2478622 2530568 2578167 2621793 2662461 2701414 2739578 2776095 2806269 2821727 2814538
50619 2814538 2782473 2730495 2667474 2601938 2540113 2485959 2441502 2407198 2382614 2367052 2359670
50608 2359670 2359469 2365315 2375633 2387979 2399274 2406630 2407680 2400216 2382148 2352152 2310024 2256371
50596 2256371 2192392 2120036 2041788 1960015 1876922 1795101 1717222 1644775 1577671 1515454 1458271
50585 1458271 1406359 1359378 1316935 1279105 1245671 1215444 1187209 1160973 1137424 1116526 1097607
50574 1097607 1080645 1066476 1055676 1048068 1043389 1041616 1042508 1045576 1050745 1058364 1068307 1079664 1091604
50561 1091604 1104112 1117744 1133174 1151136 1172142 1195890 1221455 1248414 1277344 1308829 1342336
50550 1342336 1376456 1410023 1442672 1474506 1505527 1535293 1562998 1588136 1611250 1633873 1657611
50539 1657611 1683518 1712350 1745005 1782415 1825305 1874286 1929947 1992645 2062445 2139442 2223893
50528 2223893 2315852 2415043 2521434 2635719 2758787 2890659 3030063 3174890 3322865 3471853
50518 3471853 3619766 3764153 3901886 4029386 4143252 4240505 4318301 4373830 4404894 4410566
50508 4410566 4391201 4348013 4282694 4197156 4093458 3974284 3843800 3707820 3572762 3444368
50498 3444368 3327327 3225554 3142109 3078810 3036342 3014882 3014355 3033972 3071695 3124203 3187090
50487 3187090 3254836 3320600 3376327 3413601 3425178 3406640 3357209 3279188 3176647 3054409 2917887
50476 2917887 2773062 2625712 2480191 2338987 2203694 2076232 1958706 1852142 1755915 1668800
50466 1668800 1590250 1520313 1458705 1404510 1356755 1314785 1278109 1246328 1219289 1196970 1179198
50455 1179198 1165821 1157020 1152930 1152812 1155104 1158405 1162058 1165730 1169093 1172231 1175949 1181305 1189062 1199692
50441 1199692 1213399 1229685 1247229 1264509 1280348 1293743 1303745 1310062 1313500 1315345 1316538 1317772
50429 1317772 1320043 1324328 1330814 1338945 1348327 1359159 1371736 1385933 1401409 1418068 1436149 1456000
50417 1456000 1477919 1502264 1529687 1561067 1597055 1637734 1683038 1733363 1789282 1850576 1916108
50406 1916108 1984847 2056401 2130114 2204214 2276526 2345660 2410933 2471493 2526209 2574208 2614680
50395 2614680 2646112 2666378 2673558 2666129 2642572 2601822 2544597 2473771 2393103 2305936 2215169 2123773
50383 2123773 2034848 1951440 1876542 1812772 1761599 1723088 1696732 1682359 1679978 1689013 1707937 1734432
50371 1734432 1765616 1798292 1829276 1855407 1873247 1879278 1870981 1847858 1811276 1763478 1706961 1644487
50359 1644487 1578973 1512959 1448093 1385269 1325182 1268682 1216465 1168433 1123612 1081039 1040736
50348 1040736 1003602 970372 941061 915447 893648 875952 862365 852622 846428 843469 843447 846439 852978
50335 852978 863388 877160 893274 910924 929419 947343 962368 972194 975667 973142 966268 957485
50323 957485 949199 942885 938954 937427 938416 941764 946671 952138 957665 963056 967713 970680 971612 971261 970697
50308 970697 970326 969972 969668 969919 971159 973364 976331 980066 984709 990152 995941 1001585 1007031 1012913 1020284
50293 1020284 1029936 1041945 1055897 1071354 1087872 1104887 1122221 1140814 1162434 1188575 1220271
50282 1220271 1258946 1305633 1357347 1404461 1434005 1437604 1416635 1379733 1336112 1291657 1249748
50271 1249748 1213137 1183763 1161566 1144722 1131210 1119788 1109674 1099983 1089842 1078936 1067649
50260 1067649 1056657 1046431 1037124 1028865 1022000 1016938 1013755 1012093 1011555 1012097 1013915 1017043 1021311 1026863
50246 1026863 1034494 1045231 1059489 1076813 1096566 1118660 1143371 1170425 1198518 1226046 1252196
50235 1252196 1277111 1301000 1323502 1344200 1363457 1382157 1400428 1416879 1429300 1435922 1435900 1428887
50223 1428887 1414591 1392854 1364039 1329380 1291024 1251524 1212942 1176416 1142616 1112390 1086641
50212 1086641 1065714 1049157 1035886 1024060 1011051 994456 973634 949979 925531 901745 879631
50201 879631 860142 843604 829165 815652 802934 791844 782802 775175 768081 761190 754499 747868 741148
50188 741148 734449 727867 721176 714095 706741 699488 692431 685314 678078 671236 665475 660875 656674 651951
50174 651951 646509 640935 635784 631000 626290 621808 618044 615108 612562 610104 608083 607143 607535 609047 611471
50159 611471 614811 618965 623485 627937 632466 637697 643958 650877 658118 666261 676379 688572 701404
50146 701404 713046 722597 729970 735084 737865 738872 739225 739732 740510 741452 742746 744939 748906 755813 766666
50131 766666 781822 801168 824631 852046 882649 915480 950453 988465 1030077 1074581 1120634
50120 1120634 1167248 1213733 1259221 1303054 1345509 1387612 1430124 1472924 1515156 1555521 1592365
50109 1592365 1623735 1647471 1661385 1663825 1654458 1634352 1605028 1567603 1523148 1473564 1421617 1370054
50097 1370054 1320828 1274846 1231958 1191351 1152652 1116851 1085776 1060445 1040154 1023209 1008240
50086 1008240 994752 982835 972765 964815 959240 956321 956248 958680 962474 966215 969303 972321 976145 980784
50072 980784 985242 988371 989657 989202 987290 984118 979796 974362 967792 960174 951966 943909 936430 929197
50058 929197 921477 912989 904213 895859 888391 882125 877387 874127 871635 869124 866644 865076 865171 866937 870055
50043 870055 874492 880430 887812 896233 905311 914975 925336 936352 947613 958527 968776 978577 988365
50030 988365 998230 1007755 1016462 1024241 1031230 1037358 1042119 1044855 1045239 1043548 1040469 1036602 1032131 1026949
50016 1026949 1021025 1014608 1008211 1002519 998096 994864 991927 988540 985586 985676 991070 1001393 1013951 1026529
50002 1026529 1039475 1054714 1073147 1093716 1114933 1136557 1159456 1184383 1211486 1240604 1271189
49991 1271189 1301679 1329412 1351503 1365758 1370824 1365932 1350868 1326107 1292806 1252665 1207741 1160047
49979 1160047 1111190 1062489 1015441 971653 932061 896494 864257 834990 808778 785839 766442
49968 766442 750798 738454 727887 717363 706309 695517 685918 677649 670406 664139 658943 654649 650971
49955 650971 648006 646184 645746 646592 648683 652317 657851 665325 674467 684951 696401 708094 718921 727888
49941 727888 734722 739906 744061 747460 750197 752570 754918 756891 757040 753348 744451 730619 713669 695791
49927 695791 678274 661335 645078 630193 617502 607118 598532 591397 585799 581713 578752 576632 575520
49914 575520 575623 576669 578091 579589 581273 583349 585908 588997 592808 597768 604336 612483 621377 629947
49900 629947 637946 646227 655759 666681 678536 690975 703671 715664 725471 732094 735654 736930 736508
49887 736508 734492 730735 725136 717833 709201 699610 689193 677957 666093 653918 641559 628976 616385
49874 616385 604368 593409 583623 575052 567989 562672 558823 555790 553142 550980 549706 549661 550930 553375
49860 553375 556853 561430 567263 574219 581801 589617 597736 606450 615883 626049 637061 648927 661222
49847 661222 673237 684303 693736 700712 704783 706473 706872 706567 705360 702968 699349 694133 686508 676225
49833 676225 664303 652262 640975 630730 622004 615414 611001 608247 606865 607052 608843 611728 615059
49820 615059 618502 621940 625412 629355 634515 641253 649170 657695 666809 676830 687521 697775 706359
49807 706359 712885 717948 722330 726212 729357 731888 734357 736671 737402 734933 729288 722285 715668 709596
49793 709596 703078 695202 685562 674045 660986 647384 634390 622625 612311 603817 597494 593024 589559
49780 589559 586644 584511 583261 582240 580632 578419 576407 575397 575576 576681 578476 581070 584863 590173
49766 590173 596820 604134 611511 618889 626533 634392 641890 648429 653919 658683 663025 667071 670852 674132
49752 674132 676059 675353 671167 663679 653764 642328 630217 618477 608169 599817 593340 588501 585089
49739 585089 582674 580645 578719 577072 575799 574529 572948 571422 570842 571988 575172 580188 586163 591736
49725 591736 595848 598563 600935 604171 609001 615587 623602 632528 642248 653420 666887 682725 700038
49712 700038 717467 733355 745499 751669 751079 745192 736600 727163 717446 707641 698291 689849 682175 675159
49698 675159 669794 667882 670120 674614 677722 676567 670751 661947 652310 643276 635362 628628 623284 619900
49684 619900 618937 620207 623110 627456 633595 641644 651134 661748 673932 688369 705290 724926 748131
49671 748131 775351 804568 830933 849124 856379 853690 844691 833520 823044 814407 807918 804242 804662
49658 804662 810381 821693 837294 853701 865502 867376 856917 835800 808325 779000 751117 726501
49646 726501 705691 688416 674312 663231 654832 648245 642567 637671 634206 632825 633537 635735 638622
49633 638622 641518 643865 645055 644445 641699 637042 630989 623884 615943 607655 599757 592732 586605 581310
49619 581310 576877 573130 569614 566098 562973 560870 560045 560303 561309 562737 564280 565755 567184 568712 570577
49604 570577 573120 576495 580214 583283 585038 585650 585708 585605 585481 585367 585026 583972 582090 580112 579087 579406
49588 579406 580624 582087 583449 584719 586174 588127 590474 592538 593726 594288 595068 596524 598385 600301 602374
49573 602374 604837 607521 609959 611968 613928 616546 620420 625766 632512 640628 650276 661495 673714 685704
49559 685704 696106 704065 709456 712656 714091 713886 711882 708002 702607 696528 690763 686070 682678 680310
49545 680310 678598 677536 677474 678618 680709 683212 685671 687802 689445 690648 691735 693127 695049 697452 700250
49530 700250 703761 708942 716966 728204 741763 756440 772131 789853 810308 832859 856000 878123
49518 878123 897520 912342 921441 925206 925184 923011 919992 917315 916017 916783 920147 926672 936421 948258
49504 948258 960101 969761 975240 974653 966785 951971 932062 909345 885753 862813 841689 823021
49492 823021 807061 793965 783548 774895 766834 758972 751846 746023 741561 738365 736390 735316 734641 734328
49478 734328 734845 736298 738036 739435 740488 741332 741729 741486 740892 740277 739585 738917 739067 740911 744462 749034
49462 749034 754047 759121 763672 767109 769461 771254 772835 774228 775534 776839 777676 777108 774572 770279 764800
49447 764800 758674 752473 746737 741534 736370 730858 725314 720544 717173 715272 714530 714633 715520 717316 720066
49432 720066 723656 728034 733377 739945 748027 758130 770820 786058 803148 821860 843220 868419
49420 868419 897311 928911 963049 999747 1036029 1064643 1077924 1073515 1055989 1033185 1011575 994567
49408 994567 983394 978241 978629 983532 991543 1001121 1010949 1020321 1029203 1037819 1046286 1054657 1063041 1071510
49394 1071510 1079924 1088030 1095666 1102761 1109228 1115053 1120347 1125018 1128287 1128806 1125602 1118906 1109872 1099500
49380 1099500 1088015 1075328 1061777 1048207 1035455 1024061 1014392 1006731 1001155 997527 995644 995257 995974
49367 995974 997508 1000010 1003836 1008765 1013874 1018433 1022540 1026347 1029018 1029185 1026511 1022123 1017205 1011669
49353 1011669 1004681 996157 987207 979120 972338 966555 961535 957559 955113 954257 954416 954813 955033 955030 954705 953796
49337 953796 952280 950539 948787 946503 942797 937385 930963 924617 919074 914611 911385 909580 909225 910069 911688
49322 911688 913757 916173 918949 922079 925613 929788 934848 940658 946743 952794 958955 965392 971922 978437
49308 978437 985516 994077 1004372 1015762 1027612 1039925 1052906 1066401 1080239 1094874 1110957 1127996
49296 1127996 1143631 1154523 1158214 1154502 1145364 1133551 1120997 1108328 1095634 1083394 1072427 1063154
49284 1063154 1055288 1048280 1041822 1035793 1029892 1023595 1016531 1008892 1001425 995013 990244 987338 986365 987394
49270 987394 990347 994700 999415 1003316 1005774 1007123 1008199 1009286 1009731 1008845 1006960 1005107 1003773 1002572 1001286
49255 1001286 1000678 1002095 1006832 1016075 1030608 1049812 1071524 1093736 1115980 1137957 1157046 1168696
49243 1168696 1169948 1161783 1147450 1129341 1108261 1085022 1061388 1039275 1019813 1003383 990037 979693
49231 979693 972363 968415 968204 971237 976038 981173 986192 991395 997032 1003172 1010133 1018421 1028063 1038342
49217 1038342 1048386 1057802 1066629 1075062 1083584 1093087 1104262 1116730 1129139 1140338 1150268 1159637 1169048
49204 1169048 1178713 1188771 1199497 1211171 1223991 1238104 1253537 1270005 1286862 1303353 1319032
49193 1319032 1334066 1349088 1364488 1379795 1394019 1406709 1418310 1429356 1439768 1449282 1458142 1466791
49181 1466791 1475234 1483439 1492315 1503530 1518114 1535781 1555868 1578512 1604611 1635102 1670679 1712042
49169 1712042 1759952 1814719 1875214 1937915 1996837 2045019 2076930 2090332 2086913 2071854 2052267
49158 2052267 2034491 2021779 2014341 2011313 2012131 2016159 2022107 2028570 2034723 2040149 2044559 2048163 2051844 2056400
49144 2056400 2062042 2069030 2078182 2090082 2104211 2119594 2135903 2153171 2170881 2188372 2206039 2225072
49132 2225072 2245870 2267529 2289105 2310555 2332178 2353878 2375430 2396913 2418407 2439542 2459752
49121 2459752 2478838 2497224 2515856 2535799 2557525 2580580 2604370 2629259 2656397 2686612 2720234
49110 2720234 2758285 2803138 2857686 2924566 3006742 3108129 3232024 3377112 3533865 3685786
49100 3685786 3818130 3929850 4037028 4159282 4297243 4422815 4495308 4491129 4420267 4315933
49090 4315933 4209076 4110306 4010825 3896443 3761138 3611117 3459613 3318984 3196359 3093997
49080 3093997 3011343 2946197 2895209 2854799 2822193 2795619 2773829 2755757 2740552 2727542 2716058
49069 2716058 2705491 2695539 2686232 2677555 2669156 2660563 2651675 2642863 2634445 2626219 2617699 2608756 2599786 2591170
49055 2591170 2582939 2575011 2567514 2560698 2554710 2549604 2545218 2540907 2535801 2529725 2523660 2518879 2515856 2514269
49041 2514269 2513820 2514548 2516694 2520802 2527754 2537933 2550256 2562624 2573382 2581873 2587735 2590654 2591144 2590704
49027 2590704 2590463 2590065 2588400 2585062 2580551 2575389 2569752 2563909 2558446 2553925 2550617 2548579 2547644 2547399 2547498
49012 2547498 2548076 2549592 2552205 2555566 2559292 2563419 2568292 2574115 2580777 2588006 2595544 2603118 2610293 2616553
48998 2616553 2621649 2625793 2629275 2631908 2633113 2632611 2630734 2627867 2623920 2618591 2611988 2604663 2597117 2589526
48984 2589526 2581868 2574125 2566445 2559275 2553206 2548493 2544828 2541840 2539670 2538722 2538914 2539488 2539657 2539198 2538417
48969 2538417 2537735 2537352 2537130 2536763 2536177 2535751 2536023 2537178 2538977 2541128 2543608 2546713 2550935 2556664 2563782 2571640
48953 2571640 2579719 2588252 2597971 2609372 2622571 2637775 2655418 2675696 2698307 2722751 2748585 2775277
48941 2775277 2802197 2829039 2856033 2883556 2911795 2941035 2972100 3006206 3044303 3086539 3132198
48930 3132198 3180123 3229492 3280385 3333452 3388987 3446581 3505723 3566296 3628146 3690562 3752782
48919 3752782 3814963 3878169 3943237 4009853 4076731 4142373 4205573 4265575 4322110 4375387 4426011
48908 4426011 4474773 4522240 4568229 4611774 4651866 4688358 4722001 4753638 4783548 4811515 4837189
48897 4837189 4860214 4880319 4897607 4912677 4926264 4938740 4950008 4959684 4967216 4971942 4973305 4971031
48885 4971031 4964928 4954623 4939825 4920897 4898865 4874616 4848236 4819310 4787785 4754283 4719538
48874 4719538 4683672 4646055 4605726 4561879 4514122 4462454 4407146 4348752 4288245 4226950 4166036
48863 4166036 4105986 4046765 3988658 3932636 3879671 3829844 3782539 3737570 3695713 3657897 3624106
48852 3624106 3593447 3565153 3539171 3515684 3494545 3475477 3458644 3444600 3433660 3425641 3420271 3417585
48840 3417585 3417768 3420908 3427110 3436518 3448881 3463298 3478822 3495285 3513154 3532634 3553365 3575038
48828 3575038 3597711 3621342 3645480 3669740 3694103 3718391 3741911 3764209 3785869 3807934 3830639
48817 3830639 3853350 3875670 3897943 3920467 3942833 3964349 3984768 4004308 4023266 4041941 4060749
48806 4060749 4080104 4100254 4121319 4143315 4166042 4189175 4212648 4236757 4261762 4287563 4313898
48795 4313898 4340601 4367381 4393519 4418106 4440575 4460839 4478955 4494871 4508574 4520334 4530665
48784 4530665 4539957 4548136 4554702 4559060 4560519 4557832 4549106 4532752 4508652 4478069 4442365 4402263 4358398
48771 4358398 4311877 4263722 4214046 4162378 4108698 4053690 3998015 3941818 3885202 3828761 3773320
48760 3773320 3719241 3666292 3614242 3563446 3514771 3469048 3426723 3387910 3352457 3319903 3289705
48749 3289705 3261886 3237244 3216514 3199361 3184630 3171549 3160305 3151434 3145171 3141633 3141077 3143589
$$ [...]
##END NTUPLES=NMR SPECTRUM
##END=
