
##TITLE=AC1380_BRAAH12192_7519276_5d18nrLGuU
##JCAMPDX= 6.0         $$ Bruker NMR JCAMP-DX V2.0
##DATA TYPE= NMR SPECTRUM
##DATA CLASS= NTUPLES
##ORIGIN= BRUKER
##OWNER= Administrator
$$ 1.72 TOPSPIN		Version 2.1
$$ 2013-02-20 19:45:23.828 -0500  Administrator@X
$$ Compression mode = diff/dup
##.OBSERVE FREQUENCY= 400.02188249412
##.OBSERVE NUCLEUS= ^1H
##.ACQUISITION MODE= SIMULTANEOUS (DQD)
##.ACQUISITION SCHEME= undefined
##.AVERAGES= 8
##.DIGITISER RES= 22
##SPECTROMETER/DATA SYSTEM= spect
##.PULSE SEQUENCE= zg30
##.SOLVENT NAME= COFFEE_meoh
##.SHIFT REFERENCE= INTERNAL, COFFEE_meoh, 1, 14.98509
##AUDIT TRAIL= $$ (NUMBER, WHEN, WHO, WHERE, PROCESS, VERSION, WHAT)
$$ ##TITLE= Audit trail, TOPSPIN		Version 2.1
$$ ##JCAMPDX= 5.01
$$ ##ORIGIN= Bruker BioSpin GmbH
$$ ##OWNER= Administrator
$$ $$ E:\/data/COFFEE/nmr/AC1380_BRAAH12192_7519276_5d18nrLGuU/10/pdata/1/auditp.txt
$$ ##AUDIT TRAIL=  $$ (NUMBER, WHEN, WHO, WHERE, PROCESS, VERSION, WHAT)
(   1,<2013-02-20 19:45:15.422 -0500>,<Administrator>,<X>,<go>,<TOPSPIN 2.1>,
      <created by zg
	started at 2013-02-20 19:44:09.297 -0500,
	POWCHK enabled, PULCHK disabled,
       configuration hash MD5:
       86 BA 57 50 F2 9D 5C 9B 26 00 A9 28 5F 66 2E 89
       data hash MD5: 64K
       44 B1 FC 46 A3 EA 0B 03 14 40 64 D1 AD 49 5B 93>)
(   2,<2013-02-20 19:45:18.562 -0500>,<Administrator>,<X>,<proc1d>,<TOPSPIN 2.1>,
      <Start of raw data processing
       efp LB = 0 FT_mod = 6 PKNL = 1 PHC0 = 0 PHC1 = 0 SI = 32K 
       data hash MD5: 32K
       11 29 18 68 5B 74 08 76 E3 4B A6 72 AB 5D C1 27>)
(   3,<2013-02-20 19:45:19.031 -0500>,<Administrator>,<X>,<proc1d>,<TOPSPIN 2.1>,
      <pk PHC0 = 71.13647 PHC1 = 0 
       data hash MD5: 32K
       78 01 68 6F 27 27 EE E1 53 35 E3 51 35 93 CE D4>)
(   4,<2013-02-20 19:45:19.297 -0500>,<Administrator>,<X>,<proc1d>,<TOPSPIN 2.1>,
      <abs ABSG = 1 
       data hash MD5: 32K
       89 4F 35 D8 14 69 E7 CA 20 FE 44 42 93 91 6B 01>)
(   5,<2013-02-20 19:45:19.453 -0500>,<Administrator>,<X>,<proc1d>,<TOPSPIN 2.1>,
      <abs ABSG = 2 
       data hash MD5: 32K
       4D 5F 50 89 63 E1 25 9B 70 94 BE 83 A1 89 0F F4>)
(   6,<2013-02-20 19:45:19.593 -0500>,<Administrator>,<X>,<proc1d>,<TOPSPIN 2.1>,
      <abs ABSG = 3 
       data hash MD5: 32K
       5C 95 42 CA FA B9 2C 44 07 F1 39 38 DD 53 66 5D>)
(   7,<2013-02-20 19:45:19.734 -0500>,<Administrator>,<X>,<proc1d>,<TOPSPIN 2.1>,
      <abs ABSG = 4 
       data hash MD5: 32K
       E5 55 E2 A7 94 A7 C4 A1 F5 B3 24 F6 86 4A A1 5B>)
(   8,<2013-02-20 19:45:19.875 -0500>,<Administrator>,<X>,<proc1d>,<TOPSPIN 2.1>,
      <abs ABSG = 5 
       data hash MD5: 32K
       9B EC B3 CD 04 18 4D AF 0A 17 4D A2 4B FC 27 F4>)
$$ ##END=
$$ 
$$ $$ hash MD5
$$ $$ 33 B5 66 3A 1E 69 14 DD AD AA 7A A8 27 65 0C 51
##$RELAX= 
##$RELAX= 
##$RELAX= 
##$RELAX= 
##$RELAX= 
##$RELAX= 
##$RELAX= 
$$ Bruker specific parameters
$$ --------------------------
##$DU= <E:\>
##$EXPNO= 10
##$NAME= <AC1380_BRAAH12192_7519276_5d18nrLGuU>
$$ [...]
##$TP= (0..7)
150 150 150 150 150 150 150 150
##$TP07= 0
##$TPNAME0= <>
##$TPNAME1= <>
##$TPNAME2= <>
##$TPNAME3= <>
##$TPNAME4= <>
##$TPNAME5= <>
##$TPNAME6= <>
##$TPNAME7= <>
##$TPOAL= (0..7)
0.5 0.5 0.5 0.5 0.5 0.5 0.5 0.5
##$TPOFFS= (0..7)
0 0 0 0 0 0 0 0
##$TUNHIN= 0
##$TUNHOUT= 0
##$TUNXOUT= 0
##$USERA1= <user>
##$USERA2= <user>
##$USERA3= <user>
##$USERA4= <user>
##$USERA5= <user>
##$V9= 5
##$VALIST= <valist>
##$VCLIST= <CCCCCCCCCCCCCCC>
##$VD= 0
##$VDLIST= <DDDDDDDDDDDDDDD>
##$VPLIST= <PPPPPPPPPPPPPPP>
##$VTLIST= <TTTTTTTTTTTTTTT>
##$WBST= 1024
##$WBSW= 4
##$XGAIN= (0..3)
0 0 0 0
##$XL= 0
##$YL= 0
##$YMAX_a= 553721
##$YMIN_a= -551504
##$ZGOPTNS= <>
##$ZL1= 120
##$ZL2= 120
##$ZL3= 120
##$ZL4= 120
##$ABSF1= 14.98509
##$ABSF2= -5.573092
##$ABSG= 5
##$ABSL= 3
##$ALPHA= 0
##$AQORDER= 0
##$ASSFAC= 0
##$ASSFACI= 0
##$ASSFACX= 0
##$ASSWID= 0
##$AUNMP= <proc_prof1d_extract_pilot.lims>
##$AXLEFT= 0
##$AXNAME= <>
##$AXNUC= <1H>
##$AXRIGHT= 0
##$AXTYPE= 0
##$AXUNIT= <>
##$AZFE= 0.1
##$AZFW= 0.1
##$BCFW= 0
##$BC_mod= 0
##$BYTORDP= 0
##$COROFFS= 0
##$CY= 15
##$DATMOD= 1
##$DC= 0
##$DFILT= <>
##$DTYPP= 0
##$F1P= 0
##$F2P= 0
##$FCOR= 0.5
##$FTSIZE= 32768
##$FT_mod= 6
##$GAMMA= 0
##$GB= 0
##$INTBC= 1
##$INTSCL= 1
##$ISEN= 128
##$LB= 0
##$LEV0= 0
##$LPBIN= 0
##$MAXI= 10000
##$MC2= 0
##$MEAN= 0
##$ME_mod= 0
##$MI= 0
##$NCOEF= 0
##$NC_proc= -8
##$NLEV= 6
##$NOISF1= 0
##$NOISF2= 0
##$NSP= 0
##$NTH_PI= 0
##$NZP= 0
##$OFFSET= 14.98509
##$PC= 1
##$PHC0= 71.13647
##$PHC1= 0
##$PH_mod= 1
##$PKNL= yes
##$PPARMOD= 0
##$PPDIAG= 0
##$PPIPTYP= 0
##$PPMPNUM= 2147483647
##$PPRESOL= 1
##$PSCAL= 4
##$PSIGN= 0
##$PYNMP= <proc.py>
##$REVERSE= no
##$SF= 400.02
##$SI= 32768
##$SIGF1= 0
##$SIGF2= 0
##$SINO= 400
##$SIOLD= 32768
##$SPECTYP= <>
##$SREGLST= <1H.CDCl3>
##$SSB= 0
##$STSI= 32768
##$STSR= 0
##$SW_p= 8223.68421052631
##$SYMM= 0
##$S_DEV= 0
##$TDeff= 65536
##$TDoff= 0
##$TI= <>
##$TILT= no
##$TM1= 0
##$TM2= 0
##$TOPLEV= 0
##$USERP1= <user>
##$USERP2= <user>
##$USERP3= <user>
##$USERP4= <user>
##$USERP5= <user>
##$WDW= 1
##$XDIM= 32768
##$YMAX_p= 459444166
##$YMIN_p= -730614
##$CURPLOT= <Network HP LaserJet P1505>
##$CURPRIN= <$Network HP LaserJet P1505>
##$DFORMAT= <normdp>
##$LAYOUT= <+/1D_H.xwp>
##$LFORMAT= <normlp>
##$PFORMAT= <normpl>
##$SURQMSG= 1
$$ End of Bruker specific parameters
$$ ---------------------------------
##NTUPLES= NMR SPECTRUM
##VAR_NAME=  FREQUENCY,     SPECTRUM/REAL,   SPECTRUM/IMAG
##SYMBOL=    X,             R,               I
##VAR_TYPE=  INDEPENDENT,   DEPENDENT,       DEPENDENT
##VAR_FORM=  AFFN,          ASDF,            ASDF
##VAR_DIM=   32768,         32768,           32768
##UNITS=     HZ,            ARBITRARY UNITS, ARBITRARY UNITS
##FACTOR=    0.250966925370066, 1,           1
##FIRST=     8223.43324360094, -197983,      -7389
##LAST=      0,             35625,           -89979
##MIN=       0,             -730614,         0
##MAX=       8223.43324360094, 459444166,    0
$$ Real data points
##PAGE= N=1
##DATA TABLE= (X++(R..R)), XYDATA
$$ [...]
19543B9685a35185A50468b446k22260A06616a0353o82j03502k17407i8677E1500
19531i5833d5981A09524a53620G2770i0498D66828C6266m203h6201G1137a08323
19519c5778j9518b960k02695f2965r7772A30373a36521k8575d1792B89063q1791
19508B07272c51533J44518B23099d65782a07693n2485M4868j0906B07644a8199
19497a79458B10188a11814b7049j16911o7899A4419J99907d5757m47722A63700
19486e21549A0604b86285A1888K21871b1848A9922a92182K5772H151J09369P8853
19475A96373b01330e3636h031l04647P0604R2984o0598A57918b40408O1260E7237
19463I586M5528c09943A99084D9755a31922n9723B74496C2343K8628a70644L3293
$$ plain form
19543 29685 -135185 150468 -2446 -224706 106616 -10353 -11035 -114537 -331944 -98677 51500
19531 -95833 -45981 109524 -153620 72770 -90498 466828 36266 32063 -86201 71137 -108323
19519 -35778 -55296 -2960 -205655 -62965 -160737 130373 -136521 -165096 -41792 289063 207272
19508 207272 -351533 -207015 223099 -465782 -107693 -160178 -115310 -126216 207644 -18199
19497 -179458 210188 -111814 -27049 -143960 -211859 14419 214326 -45757 -493479 163700
19486 -521549 10604 -286285 11888 233759 -21848 19922 -192182 -166410 8151 117520 196373
19475 196373 -201330 -53636 -8031 -312678 -242074 -149090 -209688 157918 -240408 -179148 57237
19463 9586 55114 -309943 199084 49755 -131922 -191645 274496 32343 60971 -170644 -137351
19452a37351b2577m55645K21706E2382g1954A33216c11711M8473f8942j13786
19442a82728b1878r9606b57j98813Q0945j52154I3594h8091a7468G6742J60073
19431B36815I9100J34682b39292I7386b75976J02216b3226I540g2773j13508k5003
19420b11284a03862H1075Q6306p1308g351k70507Q4877n2430h4420k00043E1955
19408a36411J1695c9025j11796q5582A87314a13002d603E1006h5960J8909l3398
19397a00449A72577P1887c13591a52675R577j54093m6424J54297A584a27419e9343
19385a68150C2957a62048C8959J29400c15999Q6627A37280H311c47858a16151
19374A4028L29143b8300j78537M2214P8202k4618r1977L7522j15732N0461L2939
$$ plain form
19452 -137351 -22577 -478222 -256516 52382 -71954 133216 -311711 -263238 -68942 -182728
19442 -182728 -21878 -121484 -257 -199070 -118125 -270279 93594 -88091 -17468 76742 236815
19431 236815 99100 233782 -239292 97386 -275976 -173760 -23226 9540 -72773 -186281 -211284
19420 -211284 -103862 81075 167381 96073 -7351 -277858 -192981 -245411 -84420 -284463 51955
19408 -136411 -124716 -39025 -150821 -236403 187314 -113002 -4603 51006 -85960 -67051 -100449
19397 -100449 172577 244464 -313591 -152675 -143098 -297191 -343615 -189318 1584 -127419 -59343
19385 -168150 32957 -162048 38959 168359 -315999 -229372 137280 8311 -347858 -116151
19374 14028 343171 -28300 -206837 -164623 -86421 -111039 -203016 -165494 -281226 -230765 -197826
19363a97826e0564j34010N1231C6543J26533n639p2116a93114j81008a60330g9556
19351h8097A42159k9111b97390a02295B53165k6040d6227B9758J04294a4757A49672
19339D8454J22027n7042B6766a59256C7623b19595g7711l14429a2068A8814c2076
19327A84251C1386g5572D1633g1361j25468A0669i1106j19735b6018q0499o9512
19316a76029Q3492H2685a67611g553A82069h3454j60131J4810H5263a10659O669
19305a03990A65723n2349b332q2995A05951a05657j26635B1887b4888r4209c8901
19293a88194A00567c9611k07876I3672a70160k32325Q353d9775m05409C55928
19282D2049e8362j56854M6529j57254Q4938D7449b7757B96797b892A02247c80846
$$ plain form
19363 -197826 -50564 -184574 -133343 36543 163076 157437 85321 -193114 -374122 -160330 -79556
19351 -88097 142159 113048 -297390 -102295 253165 227125 -46227 29758 134052 -14757 149672
19339 48454 170481 113439 26766 -159256 37623 -219595 -77711 -392140 -12068 18814 -32076
19327 184251 31386 -75572 41633 -71361 -196829 10669 -91106 -210841 -26018 -106517 -176029
19316 -176029 -92537 82685 -167611 -7553 182069 -83454 -243585 -228775 85263 -110659 -103990
19305 -103990 165723 113374 -2332 -85327 105951 -105657 -232292 21887 -24888 -119097 -38901
19293 -188194 100567 -39611 -247487 93672 -170160 -402485 -394132 -49775 -455184 355928
19282 42049 -58362 -215216 -168687 -325941 -241003 47449 -27757 296797 -2892 102247 -380846
19270a10885k17179I0624O2198b48756A3909J32007c59437L0401a31038m3971
19260a75009A51975b59708h6504B35469a87938g6213b3397A31320a72903m7612
19250b20515F6275J29855H1602a91940C67983a7428l3059q2411A11045C864J06104
19239A09968b02867I2946h837k60949a16095F5898c03612N6026f6275K1303j85349
19228b30321k98782d8568E9679L24460C4783a79095I8488K726C0379M2374c36994
19216g8011A04714b03198o5636l4775C3112c0520j96144j74842a55316b7556j51661
19205a79217B00440m5394B5572J67844C5782M5500c27704J23290k5723f213n3158
19194e9371I4192J81217C3858b83464l3203a15987C0976b32912R1620e8077F5489
$$ plain form
19270 -110885 -328064 90624 152822 -248756 13909 145916 -359437 -329036 -131038 -175009
19260 -175009 151975 -259708 -86504 235469 -187938 -76213 -23397 131320 -172903 -220515
19250 -220515 66275 196130 81602 -191940 367983 -17428 -50487 -132898 111045 3864 109968
19239 109968 -202867 92946 -8837 -269786 -116095 65898 -303612 -247586 -66275 -44972 -230321
19228 -230321 -529103 -48568 59679 384139 34783 -179095 98488 101214 30379 72753 -336994
19216 -78011 104714 -203198 -268834 -303609 33112 -30520 -226664 -401506 -155316 -27556 -179217
19205 -179217 200440 155046 25572 193416 35782 81282 -327704 -204414 -230137 -6213 -59371
19194 -59371 94192 275409 33858 -283464 -316667 -115987 30976 -232912 -141292 -58077 65489
19182g0974b8518H1119b16480L6649k53741A61178b35213R5841j15833B34117
19171g3345B14439j06655R299J3267c25353f7280C03479H856c08741R4802a06793
19159A15124B2660d67408f1969b8264l15391J56553h8410c5068l9509g754n8l7870
19147d5682M126A04750b27065H5017O4213e306r9869B4375J63273M1794H430O6214
19135G4644b64356B4815J30208c5099G6170J37246G1006K02253b44894Q4001b40
19123B6551K4742f5544F9530c45533J65207B64516A3456a36556l08718h730j2545
19112b1275A28677a24064K4381K1571J603J7340j2608M469k6115a804k13924o7393
19100b83121J29388A72490c04716c2084D7319c47497D1868c0896j34029g6693
$$ plain form
19182 -70974 -28518 81119 -216480 -179831 -433572 161178 -235213 -139372 -255205 234117
19171 -73345 214439 107784 117083 130350 -325353 -67280 303479 8856 -308741 -213939 -106793
19159 115124 22660 -467408 -61969 -28264 -343655 -187102 -88410 -35068 -74577 -7754 -7812 -45682
19147 -45682 -41556 104750 -227065 85017 149230 -5306 -105175 24375 187648 229442 8430 74644
19135 74644 -264356 24815 155023 -35099 76170 213416 71006 273259 -244894 -160893 -240
19123 26551 51293 -65544 69530 -345533 -180326 264516 13456 -136556 -445274 -8730 -21275
19112 -21275 128677 -124064 -99683 -78112 -76509 -59169 -71777 -67308 -93423 -1804 -215728 -283121
19100 -283121 -153733 172490 -304716 -32084 47319 -347497 41868 -30896 -164925 -76693
19089d7018n9850k76248B9101h0417J7094B03311I913R6447c49236L1894P9180
19078b38162p9408A56120i0328B0779N0616C3041b66117a2949o3000B36601J20792
19067C57393h9946q9130h9061K3979J2043B4751R9368f7625j0442j2592A79061
19055B6542O0360P4130d9390r244b5333j37107D9537b37704G0947a01577k02227
19044c03804h8974c1765I1206h6523k16573G5514a7063j42016m3489A79269J24295
19033C03564d3324B17419a44879j71735B18584a94765A27556e7658C47133d9523
19022C66565E9926a09713D31876h917o5813M501D5806N4081K5850a68493A1484
19010B51817I5087d060D8805a81960H5870k4818k4931a14932B89397a12663A10567
$$ plain form
19089 -47018 -106868 -383116 29101 -80417 -63323 203311 9913 106360 -349236 -317342 -238162
19078 -238162 -317570 156120 -90328 20779 71395 33041 -266117 -12949 -75949 236601 357393
19067 357393 -89946 -179076 -89061 -65082 -53039 24751 124119 -67625 -78067 -90659 179061
19055 26542 86902 161032 -49390 -58634 -25333 -162440 49537 -237704 70947 -101577 -303804
19044 -303804 -88974 -31765 91206 -86523 -303096 75514 -17063 -159079 -202568 179269 303564
19033 303564 -43324 217419 -144879 -316614 218584 -194765 127556 -57658 347133 -49523
19022 366565 59926 -109713 431876 -8917 -74730 -70229 45806 99887 125737 -168493 11484
19010 251817 95087 -4060 48805 -181960 85870 61052 36121 -114932 289397 -112663 110567
18998a69501A5819j140a68643E9293L6831l1336N1152J12074i8237k78794b3181
18986a7128C5070a79680F4486J62126a62994M9704D6153M7392a74299m3454P6005
18975a41748f6077C28223j30615c72723I3427h3989j43998q056J10795D47357
18964A38108h1696k03523a09806A61747i6142j9147D878a13338d6100H2567d2534
18952I0567M2490b87787f7611m60138b35044a060j98126D20550b30346A0286O7337
18941G7623K2023b8173F5696L8198j4717a90967b7298a66n9991o70457a8072k1890
18929c9962F5935J60085G7204e1587A37000a2880m7241A42786F4370b10395j8904
18918b29299P5993p0925P2082j3705N1393m26536a31138A00308b58258I3516b1089
$$ plain form
18998 -169501 15819 14679 -168643 59293 96124 64788 115940 228014 -98237 -377031 -23181
18986 -17128 35070 -179680 64486 226612 -162994 -113290 46153 93545 -174299 -217753 -141748
18975 -141748 -66077 328223 197608 -372723 93427 -83989 -227987 -236043 -125248 447357
18964 138108 -81696 -285219 -109806 161747 -96142 -115289 4878 -113338 -46100 82567 -42534
18952 90567 133057 -287787 -67611 -527749 -235044 -1060 -199186 420550 -230346 10286 77623
18941 77623 99646 -28173 65696 103894 89177 -190967 -27298 -166 -60157 -730614 -18072 -39962
18929 -39962 65935 226020 77204 -51587 137000 -12880 -60121 142786 64370 -210395 -229299
18918 -229299 -153306 -224231 -152149 -165854 -114461 -540997 -131138 100308 -258258 93516 -21089
18906a35779c3684H8459b24279Q738D0590b76840B46335a61437b4767E300c08442
18894a72288B16946b80395a05891A98480H7081J89618e5523j85363J2143A58316
18883b12450G6619a56561f4345A53273E5422g1720j30988G9711a04795c7943j19214
18872a57157K9738j50222B84487a92759a5773j09070l792p8091b2553B73841b09801
18860a93553j14347J47010F204c83921c6638p799j07783I219J90443q5466J84742
18849B98938h4133p266c9085A62532h4472b4229k58874C1891a55391M8848d5247
18837c71051e7179G3798a06337A54635R0809a55789b8157A29483b95276B51898
18826a32524A52796a75468e4672j26785B30729N0047a09626A1754J32894c16057
$$ plain form
18906 -135779 -33684 88459 -224279 -215541 40590 -276840 246335 -161437 -24767 5300 -308442
18894 -172288 216946 -280395 -105891 198480 87081 276699 -55523 -240886 -228743 158316
18883 -212450 76619 -156561 -64345 153273 55422 -71720 -202708 79711 -104795 -37943 -157157
18872 -157157 -127419 -277641 284487 -192759 -15773 -124843 -128635 -206726 -22553 273841 -209801
18860 -193553 -307900 -160890 6204 -383921 -36638 -44437 -152220 9219 199662 114196 298938
18849 298938 -84133 -91399 -39085 162532 -84472 -24229 -283103 31891 -155391 -106543 -45247
18837 -371051 -57179 73798 -106337 154635 245444 -155789 -28157 129483 -295276 251898
18826 -132524 152796 -175468 -54672 -181457 230729 280776 -109626 11754 144648 -316057
18815C9554K66228A41524a97884H0249a03464k95138a20311p3100C49949i5117
18804c68162A79733J45128i4396B02389A6734c75905G5894h060A02815J44183
18794B46998l3111b98577M0793r528Q1483p6714A72769f11754g3635m6999A47789
18782i3629B42850D6939b93620A70088a39848C35098a57227a5604l13690K3197
18772c06097A93096g2338H3082e2903B40032N463E3413b19280g2102r5911B4147
18760A03411e4652k46764A36120b6915F9642K0531J9527b88023j3044D6697f0542
18748B06100A440a38699j14963K5725M7417j48025J00245B69350b50727d057A67677
18736I8186b369o2331E3215a37697L1970k0637k50881e4904L64A16401d16831
$$ plain form
18815 39554 305782 141524 -197884 80249 -103464 -398602 -120311 -193411 349949 -95117
18804 -368162 179733 324861 -94396 202389 16734 -375905 75894 -8060 102815 246998
18794 246998 213887 -298577 -257784 -267312 -185829 -262543 172769 -611754 -73635 -120634 147789
18782 -93629 242850 46939 -293620 170088 -139848 335098 -157227 -15604 -329294 -306097
18772 -306097 193096 -72338 83082 -52903 240032 245495 53413 -219280 -72102 -168013 24147
18760 103411 -54652 -301416 136120 -26915 69642 90173 109700 -288023 -301067 46697 -60542
18748 206100 1440 -138699 -253662 -227937 -180520 -328545 -228300 269350 -250727 -4057 167677
18736 98186 -2369 -64700 53215 -137697 -105727 -126364 -377245 -54904 -54540 116401 -416831
18724A87674b40487m1512d8709A6285b31290H1328a05664A89351d5406a4412l3827
18713d8239J2745j11971K9012k35736g5714j45402I1272a52889P79B32772a65229
18701E1170a00977G8519k6585b14239M6435A60279a7037l1725j0836b2445C9191
18689b10722f0082B20812f4649D2487d9855q1630H0806C0968a16615k56024a31107
18677g554k97556c8724A55094i6921G2207K30811b40147J12048k94900J15910
18667c07089d6430n993A58387b66079N1595k49604a35255B0508L6895a94160G4944
18655A504J16391a72280M1806d1219j82672b971B4854g2738A15782N0728K19237
18644C85747g9469j55578J01352j11258K4236J01247I7388a06265j00079a01803
$$ plain form
18724 187674 -240487 -281999 -48709 16285 -231290 81328 -105664 189351 -45406 -14412 -48239
18713 -48239 -35494 -147465 -118453 -354189 -75714 -221116 91272 -152889 -152110 232772 -165229
18701 51170 -100977 78519 51934 -214239 -167804 160279 -17037 -48762 -59598 -22445 39191
18689 -210722 -60082 220812 -64649 42487 -49855 -131485 80806 30968 -116615 -372639 -131107
18677 -7554 -305110 -38724 155094 -96921 72207 303018 -240147 -128099 -422999 -307089
18667 -307089 -46430 -52423 158387 -266079 -214484 -464088 -135255 20508 57403 -194160 74944
18655 1504 117895 -172280 -130474 -41219 -223891 -2971 24854 -72738 115782 166510 385747
18644 385747 -79469 -235047 -133695 -244953 -220717 -119470 97388 -106265 -206344 -101803
18633f0368j20735f8245L3322p9251r8495H004c49227C58552c06013Q3540j37106
18622c59579a09796j6056B2041b5050j57223D159J33565a57232F9926d153l8423
18611d2576j10337A60480j7759l8610a33206I2K413K04494a87056N9797Q160L2569
18599h6530a875j85584d8679k17630J32402b6425E0452a42450k68465a45666A42904
18587a59292A06640g2806j5992j0240A99613G0546L8438d3400m59329G8744d5275
18575a74553E2248K98558b55373g434j57192B3681f4125A3615d8500l73553a15589
18563c13842A62846g7466k47237c1057m8192D833d4266B66685B0580b18979R7282
18552a21697G2382f4212H5066J46469d8518j02054j5498A08190h1241k4453F083
$$ plain form
18633 -60368 -181103 -68245 -34923 -114174 -212669 8004 -349227 358552 -306013 -222473 -359579
18622 -359579 -109796 -125852 22041 -25050 -182273 4159 137724 -157232 69926 -4153 -42576
18611 -42576 -152913 160480 142721 104111 -133206 92 2505 206999 -187056 -127259 -119099 -86530
18599 -86530 -1875 -187459 -48679 -266309 -133907 -26425 50452 -142450 -410915 -145666 142904
18587 -159292 106640 -72806 -88798 -99038 199613 70546 108984 -43400 -502729 78744 -45275
18575 -174553 52248 350806 -255373 -7434 -164626 23681 -64125 13615 -48500 -422053 -115589
18563 -313842 162846 -77466 -324703 -31057 -79249 4833 -44266 266685 20580 -218979 -121697
18552 -121697 72382 -64212 85066 231535 -48518 -150572 -166070 108190 -81241 -105694 6083
18540d41564F2204c99208a06847k52675E471a2910G0206g0284j85318i8827C42243
18528C34364j29971c47201c6915H4548L6736b03296N9313H3032B9120b5867k26323
18517b52190a03701j80320C6791b47510e9123C836e645r2063A51892A3492K8515
18506D2007b02315g5039B16593a3859D7485a47010o0780q970j6926B22279f7909
18494h3980j6099d1106q8805j85302i8108k13609B09252e5843n0690e2794q6440
18483a39234i984B52107i2157j59024q0984h5191f674m1713a9323B9924h1255
18471b37364a10408d1073I6135K334c87509C6989j0442N6118b78240H3233a21682
18459C6505C138K04843f2047A32474b18151m2388o6486F2631K7334d3422C11699
$$ plain form
18540 -441564 62204 -399208 -106847 -359522 5471 -12910 70206 -70284 -255602 -98827 342243
18528 334364 204393 -347201 -36915 84548 121284 -203296 -143983 83032 29120 -25867 -252190
18517 -252190 -103701 -284021 36791 -247510 -59123 3836 -5645 -97708 151892 13492 42007
18506 42007 -202315 -75039 216593 -13859 47485 -147010 -207790 -216760 -233686 222279 -67909
18494 -83980 -100079 -41106 -129911 -315213 -98108 -311717 209252 -55843 -106533 -52794 -139234
18483 -139234 -9984 252107 -92157 -251181 -332165 -85191 -6674 -48387 -19323 29924 -81255
18471 -237364 -110408 -41073 96135 98469 -387509 36989 26547 82665 -278240 83233 -121682
18459 36505 3138 207981 -62047 132474 -218151 -260539 -327025 62631 89965 -43422 311699
18447g3095A16345f0993G9846f8920k9067C83351j73553b7751A21308a34625K7473
18436a07152p7483A16145a45720A58977d7691H9368K1785a15526e7658G1450a68269
18424f7525q6082k22727A11807e1163j50025B5109Q8792l6530c3921j43486A04107
18412H0087J35851i9567j95016b4925j65064A29701M3533q345K5116b01916g8250
18400a76530H1553b14785R3864L1457d4594k2797k23209a45261B47351d0704o5892
18389a06596j17265b6187n7295K3919j07949o2802k45349K27307P3444O1324k39150
18378c52738f4811l63064A03827d7786k11856g9138l24862O26a9746Q931I0640
18366A48380M5349l2543h208l7408K577C22751i444I2004A5408f359k24381a10573
$$ plain form
18447 -73095 116345 -60993 79846 -68920 -97987 383351 209798 -27751 121308 -134625 -107152
18436 -107152 -184635 116145 -145720 158977 -47691 89368 111153 -115526 -57658 71450 -168269
18424 -67525 -153607 -376334 111807 -51163 -201188 25109 113901 77371 -33921 -177407 104107
18412 80087 215938 -99567 -294583 -24925 -189989 129701 173234 164889 190005 -201916 -78250
18400 -176530 81553 -214785 -120921 -89464 -44594 -67391 -290600 -145261 247351 -40704 -106596
18389 -106596 -223861 -26187 -83482 -59563 -167512 -230314 -475663 -248356 -174912 -113588 -352738
18378 -352738 -64811 -427875 103827 -47786 -259642 -79138 -404000 -403374 -19746 -10815 90640
18366 148380 193729 161186 -8208 -45616 -43039 322751 -9444 92004 15408 -6359 -230740 -110573
18353B2086a78632k3873A13690a52999L463l1596A14846h923k19192A58106M5085
18342B03191B4666J63953o1769i2925K8454F3094d4835j03750c0067G532Q935
18331A6467a62873b9829C03711q6915a89611B4756J61428k1010b10843P9255E44048
18319B25199a71168n3603C5963a88814h638G4808a05884a2616H029L94482h379
18307a8842r8269J1353j01510R9325H283J722d48359a12596j75975D1975c4349
18295B41347b06882C9946b49355f1261p9823q4131G454J9364a2056F449a78710
18283e6221A46480e5464k75645R5891P7226M6203F7674J00698c5442A81749q2290
18272I9459B9802N9493B8102a47735j73756k52826A11462l015C8112L4791a22027
$$ plain form
18353 22086 -178632 -202505 113690 -152999 -149536 -181132 114846 -8923 -228115 158106 203191
18342 203191 24666 188619 126850 -92925 -64471 63094 -44835 -148585 -30067 7532 16467
18331 16467 -162873 -29829 303711 216796 -189611 24756 186184 165174 -210843 -131588 544048
18319 225199 -171168 -224771 35963 -188814 -8638 74808 -105884 -12616 8029 402511 -8379
18307 -18842 -117111 -105758 -207268 -107943 8283 10005 -448359 -112596 -288571 41975 -34349
18295 241347 -206882 39946 -249355 -61261 -141084 -225215 7454 26818 -12056 6449 -178710
18283 -56221 146480 -55464 -331109 -235218 -157992 -111789 67674 168372 -35442 181749 99459
18272 99459 29802 89295 28102 -147735 -321491 -574317 111462 108447 38112 72903 -122027
18260H6763c6237l62053G3268J66802a07232B54648H2943a41684l4804A7040a96401
18248c2430k2133A46065B1661f2102o03b3966C5931J12323d4497a6192j49831
18237a66023N799A64570E9658G124K94084g8786b7981p0096A3860J46270e5898
18225a31708b1801F3996a94667q9099D3569a15247C25623b73907l2000A85012
18214a14160o2109B49605b3973j23411J5030j35961G6248a15343A46701c67359
18203e8230a0098C38152E707b61320P7487G7190B3195P7817J8642E9520n29a26179
18190i150J4A11599B9286b86472P6170A97612Q5162a06129d3010B144L53893a49359
18177a73818C3266a81046a1135A57875k2348D5991R8588c01026A8491i3023E9648
$$ plain form
18260 86763 -36237 -398290 73268 240070 -107232 254648 82943 -141684 -176488 17040 -196401
18248 -32430 -54563 146065 21661 -62102 -62705 -23966 35931 148254 -44497 -16192 -166023
18237 -166023 -160224 164570 59658 7124 301208 -78786 -27981 -98077 13860 160130 -55898
18225 -131708 -21801 63996 -194667 -283766 43569 -115247 325623 -273907 -305907 185012
18214 -114160 -176269 249605 -23973 -147384 -132354 -268315 76248 -115343 146701 -367359
18203 -58230 -10098 338152 5707 -261320 -183833 77190 23195 101012 119654 59520 58991 -126179
18190 -9150 -9136 111599 29286 -286472 -210302 197612 282774 -106129 -43010 2144 356037 -149359
18177 -173818 33266 -181046 -11135 157875 135527 45991 144579 -301026 18491 -93023 59648
18165F6284b51340e0729j20501N2604o3001A68979D7558g9225m2824K9341j97665
18154b90373e7872l67992P6833A25328j052d2657l314r7035e2168A19542D7821
18142G0324M5996m9686a70584N3283H0257J89239j31902b63849B29597j07283
18132A22314J47041h1268d379m4209n9150B22229c13148F5257i428m4546A86837
18120B66182F3742L76805j31059m6220a64471D21060f8429m71198A10342a29259
18109c70728I6898I191K29442E0119a0771A47253a18194K847J7225j02403I3503
18097C1616N1957A4140M0594O8607a67725A70137a23884B9407L59311h4669b5991
18085b41254j81367C7738a95345f9377j59995J08300c2987r8146r3406B95473
$$ plain form
18165 66284 -251340 -50729 -171230 -118626 -181627 168979 47558 -79225 -122049 -92708 -290373
18154 -290373 -57872 -425864 -349031 125328 124276 -42657 -45971 -143006 -52168 119542 47821
18142 70324 116320 66634 -170584 -117301 80257 269496 137594 -263849 229597 122314
18132 122314 269355 -81268 -4379 -48588 -107738 222229 -313148 65257 -9428 -53974 186837
18120 266182 63742 440547 309488 263268 -164471 421060 -68429 -539627 110342 -129259
18109 -370728 96898 9191 238633 50119 -10771 147253 -118194 -115347 -98122 -200525 93503
18097 31616 83573 14140 54734 123341 -167725 170137 -123884 29407 388718 -84669 -25991
18085 -241254 -422621 37738 -195345 -69377 -229372 -121072 -32987 -131133 -224539 295473
18074a55636j69328a08684r9860B3610a15447n5628j93062B44244b26805h1234
18063B247J16213B464N3101R1629c9063A4394c23o9344A88868b72926e2260F1792
18050b2988j02628o0018D71652a07208j43389B71779h0385B47400a70685F1807
18039d0190o3801q1566A96907D8397a05723B4774J20566J71373o8717g6965b5367
18027b19082B7196a13209A2690b00425B09448A5683b8043A5053J96544a42185
18016a21550E7232a42584L8298q748o8191A0888L6595h5468j31897A8862b8054
18004a06847A20760J9318a92213r8705J41976e7398I1268l5648a20498j5440C93306
17992c4506l4432r0553D6859O0639m4775P5513c08799f8023H0647i0669D06952
$$ plain form
18074 -155636 -324964 -108684 -208544 23610 -115447 -171075 -364137 244244 -226805 -81234
18063 2247 118460 2464 55565 147194 -39063 14394 -323 -69667 188868 -272926 -52260 61792
18050 -22988 -125616 -185634 471652 -107208 -250597 271779 -80385 247400 -170685 61807
18039 -40190 -103991 -185557 196907 48397 -105723 24774 145340 316713 247996 -76965 -25367
18027 -219082 27196 -113209 12690 -200425 209448 15683 -28043 15053 211597 -142185
18016 -121550 57232 -142584 -104286 -113034 -181225 10888 47483 -85468 -217365 18862 -28054
18004 -106847 120760 140078 -192213 -290918 -148942 -57398 91268 55620 -120498 -135938 393306
17992 -34506 -68938 -159491 46859 107498 62723 138236 -308799 -68023 80647 -90669 406952
17980e4116m7114M8992j01989A36635c546F1288M47501a86339k6660Q8025m7540
17969a72514I6884k1897b43401q7431B6205b45548R6846K0800A29497c98598A43277
17957c15132D40308b05044f3612o5974B5823a62900c5185B47423a36892p0210
17947b07102A04080m8492g8247J1855j14568g1719j1818j08202A32939J32463
17937B65402h3730A44488J2364Q5669n8483a1456j3743l30975B94660I5432h0943
17925g011j59848A4177b07882B18033g8975A57663L6986A5268a50068o2671A32946
17913A00672a04135b5004A84960a37326n3259g5487b6224I4214c0534G0281Q6794
17902A57075a29470A81223c12148r646A09860a2395H3509e0824I4796a59201A15748
$$ plain form
17980 -54116 -101230 -52238 -154227 136635 -3546 61288 508789 -186339 -212999 -124974 -172514
17969 -172514 96884 74987 -243401 -330832 26205 -245548 -148702 -127902 129497 -398598 143277
17957 -315132 440308 -205044 -63612 -129586 25823 -162900 -35185 247423 -136892 -207102
17947 -207102 104080 55588 -78247 -66392 -180960 -71719 -83537 -191739 132939 265402
17937 265402 -83730 144488 156852 242521 184038 -11456 -25199 -356174 294660 95432 -80943
17925 -7011 -166859 14177 -207882 218033 -78975 157663 194649 15268 -150068 -212739 132946
17913 100672 -104135 -25004 184960 -137326 -190585 -75487 -26224 94214 -30534 70281 157075
17902 157075 -129470 181223 -312148 -321794 109860 -12395 83509 -50824 94796 -159201 115748
17890A03063J29979C0807I311K38308g5249E0665g6839G6123d5968A77424J6129
17879A93553b2356o3707A05166J91564d6642a9275m7947A91030a92835A8870a18585
17867h9029B6460N5113b57122B59591i8896b9518k14747A92454L04126A1718a16105
17855A00357h3539k13828a35319B62247A83a51292B1692a95572P8136D1684K6650
17844F8334e3049p0406A74716i0953A8965a430A18622a62164C214b67708B55896
17832g6968A87000c29693J37399F0147l015b1658q6090H643a98291g0552K3541
17821d7011l25793J78534F7961b51641b1919j8168G6283g3547A55613l0626J0239
17810A35226K0710a81394N9037A42498B2674c84576G2442b12982O4530A7567c21797
$$ plain form
17890 103063 233042 30807 9311 247619 -75249 50665 -76839 76123 -45968 177424 193553
17879 193553 -22356 -86063 105166 296730 -46642 -19275 -67222 191030 -192835 18870 -118585
17867 -89029 26460 81573 -257122 259591 -98896 -29518 -244265 192454 496580 11718 -116105
17855 100357 -83539 -297367 -135319 262247 183 -151292 21692 -195572 -117436 41684 68334
17844 68334 -53049 -123455 174716 -90953 18965 -1430 118622 -162164 3214 -267708 255896
17832 -76968 187000 -329693 -192294 60147 57132 -21658 -107748 8643 -198291 -70552 -47011
17821 -47011 -372804 -194270 67961 -251641 -21919 -40087 76283 -73547 155613 124987 135226
17810 135226 155936 -181394 -122357 142498 22674 -384576 72442 -212982 -148452 17567 -321797
17798B62201K4614A24386N0047E139R2344h9424A71397g7827D54840a71172A74369
17786g5743k383A66029n9941f5983k5285l4108j29274n2596M383e7820B22814
17774A14648e8312M107j10325n8047B89318b8881j35854B49666H4386a6826C420
17762G3899i185B53973r1184L411M5570M7355b66740P648D86472b18459Q8376
17751a30083L8497m7587B05627L5919H8566L1231a547A05438c8449A61065E7959
17739C15882j54565g9329j24491e2030B65910b32538b5375B22520a41485d9099
17728A46392r412P0523H6812A575b13072O1699B8514c07549b6004H0809b19323
17716B37568g9223k85301A40548J91947d6738r1308N3240A00474d7843D1457K83040
$$ plain form
17798 262201 286815 124386 174433 5139 97483 -89424 171397 -77827 454840 -171172 174369
17786 -75743 -78126 166029 106088 -65983 -91268 -125376 -254650 -307246 -302863 -57820 222814
17774 114648 -58312 -54205 -164530 -222577 289318 -28881 -164735 249666 84386 -16826 3420
17762 73899 -9185 253973 162789 166200 211770 259125 -266740 -259092 486472 -218459 -130083
17751 -130083 -91586 -139173 205627 241546 88566 119797 -1547 105438 -38449 161065 57959
17739 315882 161317 -79329 -203820 -52030 265910 -232538 -25375 222520 -141485 -49099
17728 146392 136980 207503 86812 1575 -213072 -151373 28514 -307549 -26004 80809 -219323
17716 237568 -79223 -364524 140548 332495 -46738 -138046 -84806 100474 -47843 41457 324497
17705C24497C0549N5803l4705c1196C89317c22146F3094L4239b55887k4956F7021
17693B4844a31230G8660J54735G1917c456o95A93244j6554k1997m5233f0705C362
17680F0212J21471A2521c17B30735N0576b18361C70382c32353H2896b57923g4729
17668A69764d0276D9822o084e5469k03261A36259n570i3870k84951I9592a30711
17656b24890F6366a8888A42401a73347Q3918a8605f763A48609M7642f2284R321
17645e2963Q796E30566B589J33215D4140a55107H1753a57632O5766m7785j77132
17634c16783C1964O0392R1326h5452A82095e2224a9772E6568R7409J3429K8028
17623A95434b83747A9522h5812p7815m1298b9372j18547A98912G3156J83693D4466
$$ plain form
17705 324497 30549 86352 51647 -31196 389317 -322146 63094 97333 -255887 -280843 67021
17693 24844 -131230 78660 233395 71917 -3456 -4151 193244 176690 154693 109460 -60705 3362
17680 60212 181683 12521 -317 230735 281311 -218361 370382 -332353 82896 -257923 -74729
17668 169764 -40276 49822 43738 -55469 -258730 136259 130689 -93870 -378821 99592 -130711
17656 -224890 66366 -18888 142401 -173347 -89429 -18605 -6763 148609 196251 -62284 -52963
17645 -52963 -44167 530566 2589 135804 44140 -155107 81753 -157632 -91866 -139651 -316783
17634 -316783 31964 92356 183682 -85452 182095 -52224 -19772 56568 153977 167406 195434
17623 195434 -283747 19522 -85812 -163627 -204925 -29372 -147919 198912 73156 256849 44466
17611A12228Q930e6244A87508a0249k6170q3125G6711l6892a33249A52271c93243
17599e039p1185B54737a06877k1304e3597B90261a57575k5336M2437K4047A21661
17587H8978b1004A10974a38827C99218I2636J27851J1058g7837A79508e8593G2155
17575A58109O230N2265I7862a82547c7164p3566N3654A09993K5991b4323A77794
17563a23408d3825A88537a69516B64271J66309f4900B79443b17781c0838A54204
17552b6569C5300J5755A4397P2529K0827h4412m5471e5634o7677C13394b97117
17540A49214J0137k1671g6984n927A6507i2761B75465a51632A31000f3765B11190
17528a9386n134G0667M6345i2060C01616B482h2767A31061c15420a07689H0332
$$ plain form
17611 112228 121158 -56244 187508 -10249 -36419 -119544 76711 39819 -133249 152271 -393243
17599 -5039 -76224 254737 -106877 -128181 -53597 290261 -157575 -182911 -140474 -116427 121661
17587 88978 -21004 110974 -138827 399218 92636 220487 231545 -77837 179508 -58593 72155
17575 158109 164339 216604 97862 -182547 -37164 -110730 -57076 109993 135984 -24323 177794
17563 -123408 -43825 188537 -169516 264271 430580 -64900 279443 -217781 -30838 154204
17552 -26569 35300 51055 14397 86926 107753 -84412 -129883 -55634 -123311 313394 -297117
17540 149214 159351 137680 -76984 -82911 16507 -92761 275465 -151632 131000 -63765 211190
17528 -19386 -24520 70667 117012 -92060 301616 2482 -82767 131061 -315420 -107689 80332
17516e0284A81529L9571J70743a50115C91556A38828a56407a5246C69584G719
17505B20289I381Q6971C2148K06591H336L6697K39156r8283C0695h1610B26658
17493B62736a03811B37768J6177l0459I4263K82208A69665K80901A37238M4871
17483A82109j3500K81077A38527I26J50796J18842a92817D5828N3991m3135K6257
17472H2941P8841K5406E2738M50004A09585j6033a48889D05819a954A91404b7852
17460B72107r4923l3998K26574j50707p2452J04711n1161M06831A21243C1087
17449B29721l6985C8305J98061J68209o5300l2590j05516K0396b6419A60027o4567
17438I5460K40411j02408J2509c8844k10774f4298j1645E56647B55903H6123O5373
$$ plain form
17516 -50284 181529 221100 391843 -150115 391556 138828 -156407 -15246 369584 7719
17505 220289 9381 96352 32148 238739 8336 45033 284189 185906 30695 -81610 226658
17493 262736 -103811 237768 253945 223486 94263 376471 169665 450566 137238 182109
17483 182109 168609 449686 138527 926 151722 270564 -192817 45828 99819 56684 82941
17472 82941 161782 187188 52738 502742 109585 93552 -148889 405819 -1954 191404 -27852
17460 272107 177184 143186 369760 219053 146601 251312 200151 606982 121243 31087
17449 229721 192736 38305 236366 404575 339275 306685 201169 221565 -26419 160027 95460
17438 95460 335871 233463 245972 -38844 -249618 -64298 -75943 556647 255903 86123 151496
17427A51496k7233g8446F8006L85896j28883r5285o1883J81071o8730K54349H4705
17415B20002o4831k0296K40126I1078a14131B13713G3955L30408A19028P1541
17405A90569p2298B6122N2356J0302l7203a7894B70217C7722J08945J45786K227
17394B94680K32607A89610o8499j8851K23990k5080q8597J87779c09399B4116
17383b22226D10240a3918C06099a05617A98199L306a19543C08074b7854E01780
17372a77295A00601K6976E0906i2994A61704L91374B51158g5224H1441K52946
17362C34387a62792A82024C6062j1517K22214A11014N5622G7006b45684A73247
17351H2051M31827a11647A92555b56809A5545J17299L1979F7207K75783m3180
$$ plain form
17427 151496 124263 -78446 68006 453902 325019 229734 167851 348922 280192 534541 84705
17415 220002 155171 134875 375001 91078 -114131 213713 73955 404363 119028 190569
17405 190569 118271 26122 78478 88780 51577 -17894 270217 37722 146667 292453 294680
17394 294680 527287 189610 121111 102260 326250 301170 212573 400352 -309399 24116
17383 -222226 410240 -13918 306099 -105617 198199 201505 -119543 308074 -27854 501780
17372 -177295 100601 127577 50906 -92994 161704 553078 251158 -75224 81441 334387
17362 334387 -162792 182024 36062 24545 246759 111014 166636 77006 -245684 173247
17351 82051 513878 -111647 192555 -256809 15545 132844 164823 67207 342990 299810
17341B99810o7113H3704J09133J42666G8462b10466C38962l3170m2225A1960R0967
17330A02927b7299A60247m146k4945K35597A20789K33494A15926k2494R6449A1874
17318D7303J03758J08663J43542G4928M9981c04984b2670A29159F3885d0907E5728
17306A03832d6253K0211E4445M8799K99149f0818G6910P0848k172O822J74919
17295C27327h543E01992A02925J24140o8850B5220O3706K90333l3907b8055E3011
17283A13435l9931K89036D317N41789a728A15077r603j9521J71990A17948j1681
17272A06267M36421A31426K8430g8633B47300L3430o1954l5399M17130a0899B49731
17260d2253m9568B37484H1285l6164f8153A79073J2535l694K542j0100l3656a72310
$$ plain form
17341 299810 232697 83704 192837 335503 78462 -210466 338962 305792 263567 11960 102927
17330 102927 -27299 160247 156101 131156 366753 120789 354283 115926 93432 189881 11874
17318 47303 151061 259724 403266 74928 124909 -304984 -22670 129159 63885 -40907 55728
17306 103832 -46253 -26042 54445 103244 402393 -60818 76910 147758 145586 152408 327327
17295 327327 -8543 501992 102925 227065 158215 25220 88926 379259 345352 -28055 53011
17283 113435 73504 362540 4317 546106 -1728 115077 105474 85953 257943 117948 106267
17272 106267 542688 131426 159856 -78633 247300 280730 218776 183377 600507 -10899 249731
17260 -42253 -91821 237484 81285 45121 -68153 179073 191608 187914 190456 180356 146700 -172310
17247B79363d7592B62287Q3016q1818A6206P6080K65410a17190A13889C7940L57621
17236C95561I8674Q1299K43085l7625I3411J06494J3205J78032E8049K42582E5545
17224A39994K45867b3195C97914j60154M5218J51610l9512A74773J6935J21168
17214C12876r8483R124k8619J56706B1372K04378k808b7724A25546D5129a04729
17202g5984A37412L31861d8545A88147e748p1456A63237N2757J79316o6580j19580
17191B09150j1963N7549l1006K36553J14391A57099d3523B42676C2399J86447
17181B18846J29037q0702f7493A21692k9375M94179j92826o8991A49823L39788
17171D89611A49866J58552o7549J91358j6522o5691o5343b75673B11258K31733
$$ plain form
17247 279363 -47592 262287 345303 263485 16206 92286 357696 -117190 113889 37940 395561
17236 395561 98674 179973 423058 385433 93411 199905 213110 391142 58049 300631 55545
17224 139994 385861 -23195 397914 237760 282978 434588 395076 174773 191708 312876
17214 312876 214393 223517 194898 351604 21372 225750 222942 -27724 125546 45129 -104729
17202 -75984 137412 469273 -48545 188147 -5748 -77204 163237 215994 395310 328730 209150
17191 209150 197187 254736 223730 460283 574674 157099 -43523 242676 32399 218846
17181 218846 347883 267181 -67493 121692 92317 586496 393670 324679 149823 489611
17171 489611 149866 308418 240869 432227 415705 350014 284671 -275673 211258 442991
17161D42991j91713D2021A5353K73734J53521j31449N4260H573J95932F8136L14099
17150C82235o2756Q7664A50462K25797O8850K1589j89331F1024K83028J05770
17140D49822Q0786A69436J1426K38002m1937K14177B89240J3979Q9571L0950H0823
17128D68977k27878J01419j49398L94119B16080o7939R8129k8618J43241N3742
17118D14635j23122K77844k09309o6942M4992A00240O71993C77136J4947p9335
17108C12748J29811j44898Q5810P4007K92381a2171C82402o5286J7866L18956
17098F53938B24889L25935l5846j24302j43110M45791j44031n5643j35445A55217
17087E59695N7626k58405R9153J24531B31101K35601M3757k5382J87756k21123
$$ plain form
17161 442991 251278 42021 15353 289087 442608 311159 365419 8573 204505 68136 382235
17150 382235 319479 407143 150462 376259 445109 466698 277367 61024 344052 449822
17140 449822 530608 169436 180862 418864 376927 591104 289240 303219 392790 423740 80823
17128 468977 241099 342518 193120 587239 216080 148141 246270 217652 360893 414635
17118 414635 291513 569357 360048 293106 338098 100240 772233 377136 392083 312748
17108 312748 442559 297661 383471 457478 749859 -12171 382402 317116 334982 653938
17098 653938 224889 550824 514978 390676 247566 693357 549326 493683 358238 155217
17087 559695 617321 358916 458069 582600 231101 466702 510459 485077 672833 451710
17077D51710J30646O3820A90210K68704J60325j62024K29367l19151l3578K02128
17067E35981J70713j31669J38716K31656C63988A79616K69391P1699E0385L32350
17057C82735l9667l185j2593J10651K28730k27157J87231l8881A03159N28282
17047F31441O1487j08622j92951K62570l0951j63426J69477j0978k07243p7651
17037C33153K42376j92253J20878L3567O0230B57736J17752K85788J5102O0621
17027G36999l66358L96418k15278j42870K86785p9026K10239l14414q8625J29529
17017E53399k3935L06799l51032M54853D39857J10768M0928k12685M51209p9444
17007G50633J03817l03511J72642C42961M80982j00561K47317j2394o0850D27471
$$ plain form
17077 451710 582356 646176 190210 458914 619239 457215 686582 367431 333853 535981
17067 535981 706694 575025 713741 945397 363988 179616 449007 520706 50385 382735
17057 382735 343068 339883 327290 437941 666671 439514 626745 587864 103159 631441
17047 631441 692928 584306 391355 653925 622974 459548 629025 618047 410804 333153
17037 333153 575529 383276 504154 537721 597951 257736 375488 661276 676378 736999
17027 736999 370641 767059 551781 408911 695696 616670 826909 512495 423870 553399
17017 553399 529464 836263 485231 940084 439857 550625 591553 378868 830077 750633
17007 750633 854450 550939 723581 342961 823943 723382 970699 958305 897455 427471
16996H95435J08350l23912J14113j04006j12546P7590k58937L96835p221j73469
16986F12232K98426J8554l38849K65365K11790q2665k21269K40170k27955J60419
16976I36218J1750j52053J33585J7392k27242J77573j14727J99583m18089L71078
16966I35068J4982k06281J60730j46551j42715J91609M80694k71918p7811L9417
16956I77224m947L50203l28178k17918M20072k81642J76672m5258M8962p9277
16946A015913N3302m1711L32159j90297q0439o5678j12838J25280J41312l7942
16936A139061J19958O3145l5544j49035J33532k89476L99056N371l85776L80034
16926A380326K13064l88102J79378K22110j97269l2978k67066O39063l04723R5971
$$ plain form
16996 895435 1003785 679873 793986 689980 577434 655024 396087 792922 785701 612232
16986 612232 910658 929212 590363 855728 1067518 984853 763584 1003754 775799 936218
16976 936218 947968 795915 929500 946892 719650 897223 782496 982079 563990 935068
16966 935068 950050 743769 904499 757948 615233 806842 1287536 1015618 937807 977224
16956 977224 972277 1322480 994302 776384 1196456 914814 1091486 1046228 1095190 1015913
16946 1015913 1069215 1027504 1359663 1169366 1088927 1023249 910411 1035691 1177003 1139061
16936 1139061 1259019 1322164 1286620 1137585 1271117 981641 1380697 1386068 1000292 1380326
16926 1380326 1593390 1205288 1384666 1606776 1409507 1376529 1109463 1748526 1443803 1539774
16916A539774P6543l03454J09051J3227O4658J7984K15755k04512L38104j42630
16906A724500l73235L62517l56803M38658m18652J92269N4049K54733k78858q661
16896A590517r7104Q9602K39150N02096n48503J48383j7110J44693R6494j83695
16886A964523m8138L5130q3998o0707L84919M8428k23490K39267k71489M0956
16876B025401M89934k69662L08066k08560J65100N9973j27049K74842j19720k89313
16866B309012M66626j89846p7476J4677L29130j7878j42055J38938J41155j5764
16856B956519K18221j37681r7430J52615j34805l1017Q423K10429J99835j98485
16846C146624K30042q3700K60757N1458K40299p0170K98520k44559q3463J95356
$$ plain form
16916 1539774 1616317 1312863 1421914 1435141 1499799 1517783 1733538 1529026 1867130 1724500
16906 1724500 1351265 1713782 1356979 1795637 1376985 1569254 1623303 1878036 1599178 1590517
16896 1590517 1493413 1583015 1822165 2324261 1775758 1924141 1907031 2051724 2148218 1964523
16886 1964523 1916385 1951515 1867517 1806810 2191729 2240157 2016667 2255934 1984445 2025401
16876 2025401 2515335 2245673 2553739 2345179 2510279 2570252 2443203 2718045 2598325 2309012
16866 2309012 2775638 2585792 2508316 2522993 2852123 2834245 2692190 2831128 2972283 2956519
16856 2956519 3174740 3037059 2939629 3092244 2957439 2926422 2934845 3145274 3345109 3146624
16846 3146624 3376666 3292966 3553723 3605181 3845480 3775310 4073830 3829271 3745808 3941164
16836C941164K71773j52301L8023O8533l9272L08230J86434m7273O8869K0248
16826D664428R9906K05323J12838k70907L99707j82213K12755L91466k07126L47990
16816E774167L8699M8997J32603j43261R179M39322N5367L44374J67962j05330
16806F762079p2897K91759K78809r817L53053J6538L67460J88395J51570J71601
16796H498550K64869R5375M06546J87613Q6213L25142j00317M71284L25282J96486
16786A0757043J95039M04036K33152N45641K81278M23894P35132R3837K90744
16777A3959796N53437J62832P20370O01573J43581N46560Q19320M50646P20471
16768A8678586N22970R23571O68749L05691J219852N59756O96322Q55665R79654
$$ plain form
16836 3941164 4212937 4060636 4098659 4167192 4127920 4436150 4622584 4575311 4644180 4664428
16826 4664428 4764334 4969657 5082495 4811588 5211295 5029082 5241837 5633303 5426177 5774167
16816 5774167 5812866 5861863 5994466 5851205 5860384 6299706 6355073 6699447 6867409 6762079
16806 6762079 6689182 6980941 7259750 7249933 7602986 7619524 7986984 8175379 8326949 8498550
16796 8498550 8763419 8858794 9265340 9452953 9539166 9864308 9763991 10235275 10560557 10757043
16786 10757043 10952082 11356118 11589270 12134911 12416189 12840083 13575215 13669052 13959796
16777 13959796 14513233 14676065 15396435 15998008 16141589 16688149 17507469 17958115 18678586
16768 18678586 19201556 20125127 20793876 21099567 22319419 22879175 23575497 24431162 25410816
16759B5410816J260756J208030R85309J050632J546518J112060J567007J131804
16751C5272932K077746J464300K014039J878820K041963K429154K241471K873025
16743E2293450K492766L044179K893560L558198L421647L520262M440816M338657
16735H0003535M443479N064639M988007N692821N960702O369892O773523O559222
16727A25855820O813045P432055P277646P011892P175702P070332O271208N638665
16719A80546365N201393M041930K708572J949196M31006p62953k199307k940158
16711A88976044m436196n116010n986618o533277p034383p253356p643933p330150
16703A37642121p570809o968500p196230o499941o409981n960893n774420n408337
$$ plain form
16759 25410816 26671572 27879602 28864911 29915543 31462061 32574121 34141128 35272932
16751 35272932 37350678 38814978 40829017 42707837 44749800 47178954 49420425 52293450
16743 52293450 54786216 57830395 60723955 64282153 67703800 71224062 75664878 80003535
16735 80003535 84447014 89511653 94499660 100192481 106153183 112523075 119296598 125855820
16727 125855820 132668865 140100920 147378566 154390458 161566160 168636492 174907700 180546365
16719 180546365 185747758 189789688 192498260 194447456 194878462 194115509 191916202 188976044
16711 188976044 184539848 179423838 173437220 166903943 159869560 152616204 144972271 137642121
16703 137642121 130071312 123102812 115906582 109406641 102996660 97035767 91261347 85853010
16695H5853010n031279m327685m749852m007438l755797l770613l195756k813579
16687E4201011k980905k726052k432759k375371k274674j404713k391597j839238
16679C5775702j393875j683623j402254j618699j023911j400392j017148j217816
16671B5017984r52129p11761j334400o50900o96974r63645n86145r42256m59913
16662A7719861o12229j025266K71335j045031m88341r47348K0316l36146l28583
16653A3228568m97900n04944p9185m05887o25042m11519Q0954r34745N7380k73487
16643I634193j89315j51019r7731l68424j14387j82440m82241j27920m018j57799
16633G758899m04421n96677m8696J29521k73565j36904L4466k84648k04270l7315
$$ plain form
16695 85853010 80821731 76494046 71744194 67736756 63980959 60210346 57014590 54201011
16687 54201011 51220106 48494054 46061295 43685924 41411250 40006537 37614940 35775702
16679 35775702 34381827 32698204 31295950 29677251 28653340 27252948 26235800 25017984
16671 25017984 24065855 23354094 22019694 21368794 20671820 19708175 19122030 18179774 17719861
16662 17719861 17107632 16082366 16353701 15308670 14820329 13872981 13893297 13557151 13228568
16653 13228568 12730668 12225724 12146539 11740652 11115610 10704091 10785045 9850300 9907680 9634193
16643 9634193 9444878 9293859 9196128 8827704 8713317 8530877 8048636 7920716 7916698 7758899
16633 7758899 7354478 6757801 6709105 6838626 6565061 6428157 6462623 6177975 5973705 5936390
16623E936390q7028M9856l91197q6940k55661q5039O2554m65477K76539M3962
16613D997959m75670K36640l16623l59932J98616q4896J83906l48085r2365Q1553
16603D021103m27354J38173M9980l79936M7446K0804O9246m78606K32113k08382
16593C084587J23431J10303j17988o3425l96480K72074K19406l56509K76031o38911
16583B512519M03611k52697l1181L16094m96614j22860r957r8644k8757L18911
16573B510425l80227J26307P5311j04637K9575K09071n42560K86346k81977o7079
16563A860555M4836L93392j33826J520j98026P7892p0555j0601j87740K2223J44802
16552A944472j4124P2284m27416J21643j11393j19130J69888j080R107k57846
$$ plain form
16623 5936390 5849362 5899218 5508021 5421081 5165420 5080381 5142935 4677458 4953997 4997959
16613 4997959 4522289 4758929 4442306 4082374 4280990 4196094 4380000 4031915 3939550 4021103
16603 4021103 3593749 3731922 3781902 3401966 3449412 3470216 3539462 3060856 3292969 3084587
16593 3084587 3208018 3318321 3200333 3136908 2740428 3012502 3231908 2875399 3151430 2512519
16583 2512519 2916130 2663433 2632252 2948346 2451732 2328872 2318915 2220271 2191514 2510425
16573 2510425 2130198 2256505 2331816 2227179 2256754 2465825 1923265 2209611 1927634 1860555
16563 1860555 1905391 2298783 2164957 2166477 1968451 2046343 1975788 1965187 1777447 1799670 1944472
16552 1944472 1930348 2002632 1575216 1696859 1585466 1466336 1636224 1635144 1644251 1386405
16542A386405K23323J385j41841j4146Q6417J22140l10835l4296q8799L6819L30477
16531A597049l15714J06624j81681p1001Q8750L11199l95202L80236k1036k63144
16521A236080j22634k3384L56677m80130l5172J08890M2105o0881J80156n9672
16511A142035p2354l6560J03052j14298j90415R0830k80372N64583k30749L6488
16501A012240j56381J71929j85051K48091Q528j79564q4005K55617j87658l50563
16491E53183K16508J78419K69917n42168n5867N73033m38188R3658K04967j00385
16481I53077k61010J93981L6359k87147M9442O50r8995k13758O8950L70516O2110
16470H74175k38382l4721k695L09033k48565k28442K35999K57827m61427P7068
$$ plain form
16542 1386405 1609728 1611113 1469272 1455126 1541543 1663683 1352848 1318552 1229753 1266572 1597049
16531 1597049 1281335 1387959 1206278 1135277 1224027 1535226 1140024 1520260 1499224 1236080
16521 1236080 1113446 1090062 1446739 966609 931437 1040327 1082432 1021551 1201707 1142035
16511 1142035 1069681 1033121 1136173 1021875 831460 922290 641918 1206501 975752 1012240
16501 1012240 855859 1027788 842737 1090828 1099356 919792 835787 1091404 903746 553183
16491 553183 769691 948110 1218027 675859 619992 1193025 754837 848495 1053462 953077
16481 953077 692067 886048 922407 635260 684702 685352 586357 372599 441549 812065 874175
16470 874175 635793 601072 598377 907410 658845 430403 666402 924229 462802 539870
16460E39870R6134J69859k42900L49149m2416j58171M9226k87658M1603l7431
16450D77265O5851o1023J40696k06360J40920L9494J1760J15732k88385O4177
16440E00127n9363M0317n7084j0448L29907k78254L1971J60347k08797K6814n8846
16429D16691K28913j99328j15421K40447j19025J77385r2886j71685J9733N6048
16419D40872I5424M18543B32364J33380J44724o1403Q967j57643j01353M21696
16409F20732j20942R5615j06502j48361H0374L94818n1756l7861R7021j34652
16399C47944K7338I4806K80399L3798q5892O4834K19061J20028j99877k19702
16389C07455M6347j56297L5513J93882C6701O7353J60657K50061k31692A27381
$$ plain form
16460 539870 636004 805863 562963 912112 869696 711525 760751 473093 514696 477265
16450 477265 543116 482093 622789 416429 557349 596843 608603 724335 435950 500127
16440 500127 440764 481081 423997 413549 743456 465202 497173 657520 448723 475537 416691
16429 416691 645604 446276 330855 571302 452277 629662 536776 365091 384824 440872
16419 440872 95424 513967 232364 365744 510468 449065 458032 300389 199036 620732
16409 620732 499790 595405 488903 340542 80374 475192 423436 385575 482596 347944
16399 347944 375282 94806 375205 409003 323111 387945 607006 727034 527157 307455
16389 307455 353802 197505 233018 426900 36701 104054 264711 514772 283080 127381
16378C55664j30702J26058m6943L24872B95428K3101k516J11690r3179q5837J30944
16367C79631j56531k6239R3817j33823E4267J76056b2471A69126L42254A08095
16356D26220r136j55204H0418l839A559g4153C38381A09770L57198j73092Q0641
16345C74517K36761B7374K2911L69677k08764J05299A46172K73643j63424J5824
16335B72215n2251J8474H0017J91042H6083J02855K00874A84554K17350j83689
16325B18215l1433Q3756H6038J98013d0996A13590a4469I3059L0593F564J67293
16314A73857D5344K82058h5047C45066j08265a6692A36214b718A07936J29909
16304B37845B0957O6203J0169J43973I0257L93181A39659K42855I2957N42416
$$ plain form
16378 355664 224962 351020 304077 628949 295428 318529 316013 427703 334524 248687 379631
16367 379631 223100 196861 290678 156855 54267 230323 -22471 169126 511380 108095
16356 426220 417084 261880 80418 76579 1559 -74153 338381 109770 466968 293876 374517
16345 374517 611278 27374 50285 419962 211198 316497 146172 419815 256391 272215
16335 272215 219964 238438 80017 271059 86083 188938 389812 184554 401904 218215
16325 218215 186782 270538 86038 284051 -40996 113590 -14469 93059 123652 6564 173857
16314 173857 45344 327402 -85047 345066 236801 -16692 136214 -2718 107936 237845
16304 237845 20957 87160 97329 241302 90257 483438 139659 382514 92957 635373
16294F35373k5318B40686l4616Q7055I5100k9162J07035J89961j15363l4782J30507
16283C43296L3774J31849j55690j07646A13647j8533J27493J3548A1238M640K45656
16272B61534o5731D0710N8755b10711e4531A47165b5159I2538a55240m388k49722
16261d09350d8194H1175J04399i2075F1345K39742J3286M384a41775d4087H2048
16249a73949H5995b12041A65691i5339p5277A66706l0911A276N2278M41K03100
16238B57095d16375A86826M4447q6999c8525B12199G3728Q4815K2860k3759N6358
16227B14002D0295f1084D7200J16966C8837K40614N2572j07916j7728H5036K91459
16216C76495a05214A70989E3034R6927a28996D37473A61482C7949K36853e4469
$$ plain form
16294 635373 610055 240686 206070 293125 95100 65938 172973 362934 247571 212789 343296
16283 343296 377070 508919 353229 245583 113647 95114 222607 236155 11238 15878 261534
16272 261534 195803 40710 99465 -210711 -54531 147165 -25159 92538 -155240 -159628 -409350
16261 -409350 -48194 81175 185574 -92075 61345 301087 314373 318757 -141775 -44087 82048
16249 -173949 85995 -212041 165691 -95339 -170616 166706 135795 1276 53554 53995 257095
16238 257095 -416375 186826 231273 144274 -38525 212199 73728 158543 181403 157644 214002
16227 214002 40295 -61084 47200 164166 38837 279451 332023 224107 206379 85036 376495
16216 376495 -105214 170989 53034 149961 -128996 437473 161482 37949 274802 -54469
16205A21319A7595J18946l4151C1925K4536P2904i195k70852B66475a34681B89126
16193e7885A10174C942R4036a06922p9999I5944a78079B04102b5777n4446m5073
16182a25296A80133H6802a05179A82051q9394b1546j21313B88476j19534d0736
16171H1042K52513G2539J84993b45626D15354i3513A51300J45692B294b3275B06219
16159A40266a22945A84079c4619B01482D6948Q0735J79102a74031A47903a44286
16148a56801B38607b5552k35792a2459k1152j34768K8816A74664k6622e65928
16137A91273b60098H3508C5849a1723j02638b3368m9259K1077B91166o1032a31655
16125D4999L96207I7201J92272b06196A62231N9837l5979a48370D9230J23787
$$ plain form
16205 121319 17595 136541 102390 31925 56461 129365 -9195 -280047 266475 -134681 289126
16193 -57885 110174 3942 97978 -106922 -186921 95944 -178079 204102 -25777 -80223 -125296
16182 -125296 180133 86802 -105179 182051 92657 -21546 -142859 288476 168942 -40736
16171 81042 333555 72539 257532 -245626 415354 -93513 151300 296992 2294 -23275 206219
16159 140266 -122945 184079 -34619 201482 46948 127683 306785 -174031 147903 -144286
16148 -156801 238607 -25552 -261344 -12459 -33611 -168379 -139563 174664 148042 -565928
16137 191273 -260098 83508 35849 -11723 -114361 -23368 -72627 -51550 291166 230134 -131655
16125 44999 441206 97201 289473 -206196 162231 222068 186089 -148370 49230 173017
16115A73017E8110M1083b75803d2755H1187a08006J3745k9569K2717D40713H4935
16103I3733a52569E0175K33226j36745J04529D3018a22752D8496Q7061b49624
16092A09940C502O6508P8759b62207d8683j74171N8574e0590l29621c8158G2195
16080a84466c5044G7057J80258B1652r370a28645B96945B6037b8825D4606d621
16068i1907k91681c4091A0473c8735j96045B9473i1533L5708K5151c546k06306
16057b09852e3006C45407A48055P4262G7339a12838A92963a39023j53103J11880
16047a80246j1067G1607A542N0422e3073m4196k8301e4731G1693a19984B5307
16035b98139o4787H8014J14712K8687b32891C8233i863A52633B7142K40575F3267
$$ plain form
16115 173017 58110 99193 -275803 -42755 81187 -108006 -94261 -123830 -101113 440713 84935
16103 93733 -152569 50175 283401 146656 251185 43018 -122752 48496 135557 -249624
16092 109940 3502 70010 148769 -262207 -48683 -222854 -164280 -50590 -380211 -38158 72195
16080 -184466 -35044 77057 257315 21652 12282 -128645 296945 26037 -28825 44606 -4621
16068 -91907 -383588 -34091 10473 -38735 -234780 29473 -91533 -55825 -30674 -3546 -209852
16057 -209852 -53006 345407 148055 222317 77339 -112838 192963 -139023 -292126 -180246
16047 -180246 -191313 71607 1542 51964 -53073 -97269 -125570 -54731 71693 -119984 25307
16035 -298139 -362926 88014 202726 231413 -232891 38233 -9863 152633 27142 267717 63267
16023a7248A12996N5508c8014B988c3007j75965O2136m4250G294L42760b33405
16011H0213b95530f9055A03463b91089g6668m2491A64528b17319A10126b95039
16000B2427J5597Q9991o0844R0852a45756L6075G3242a77881A86487p9725h9649
15988B26257G5302f8203p6593d9558A20935Q2654O2234a80855B08120J38416c45624
15976D10768A7444b11049P4305A99379a29085B9699a65625d7895n0914k72989
15966c71798h4217r7935f6216k27933R7336F7444K42107a56558A46625k0065a82792
15954a91231f9065q4008K5432a5769N310C0495i5970J8011k2787m7972c6844A27699
15941A30375a74772j87710J31995A56180B5369J912c78795d4528j36723e2164
$$ plain form
16023 -17248 112996 168504 -38014 2988 -33007 -208972 -146836 -191086 7294 350054 -233405
16011 80213 -295530 -69055 103463 -291089 -76668 -119159 164528 -217319 110126 -295039
16000 22427 38024 128015 67171 158023 -145756 -109681 73242 -177881 186487 106762 -89649
15988 226257 75302 -68203 -144796 -49558 120935 203589 265823 -180855 208120 346536 -345624
15976 410768 17444 -211049 -136744 199379 -129085 29699 -165625 -47895 -98809 -371798
15966 -371798 -84217 -182152 -66216 -294149 -196813 67444 309551 -156558 146625 126560 -182792
15954 -191231 -69065 -153073 -127641 -15769 -10459 30495 -95970 -77959 -100746 -148718 -36844 127699
15941 130375 -174772 -362482 -230487 156180 25369 27281 -378795 -44528 -181251 -52164
15930a90215B53998a26690Q165M2032m2416c2179p7105B06601H0379a43602e0784
15918h9356A31170A3227J84358B1253L91192C3634J38425J39561G872K2337L62532
15907C92741d953B03451c6084B2056D865r28c9735r0706D6894g2423L1598m10760
15895d51585b5072j34582E86M6246Q663a93127a2335A0738b40351k2456d2123
15883d1218n6044o6912n5249B96836B0307d0799k81441e8225a9142n1378l41970
15872d12490a72125D006g6319H8255q329J34323J07066j41640b8468D1631c63377
15860B62121b20118D9371K76758g2757B31619a40438a4435A04196a12264d9785
15849A12261D2446b24002O6841f9911B4282L4832c03293J01366A08072a5106q8067
$$ plain form
15930 -190215 253998 -126690 -118525 -76493 -118909 -32179 -109284 206601 80379 -143602 -50784
15918 -89356 131170 13227 197585 21253 412445 33634 172059 311620 7872 30209 392741
15907 392741 -4953 203451 -36084 22056 4865 3937 -39735 -130441 46894 -72423 -40825 -451585
15895 -451585 -25072 -159654 586 46832 55495 -193127 -12335 10738 -240351 -262807 -42123
15883 -41218 -97262 -164174 -219423 296836 20307 -40799 -322240 -58225 -19142 -70520 -412490
15872 -412490 -172125 4006 -76319 88255 79926 214249 321315 179675 -28468 41631 -363377
15860 262121 -220118 49371 326129 -72757 231619 -140438 -14435 104196 -112264 -49785
15849 112261 42446 -224002 -157161 -69911 24282 59114 -303293 -201927 108072 -15106 -103173
15838a03173A59554p9141g0630A20509e7210A35113c08945h0912n7783L4521C9342
15826G8174b31297Q690Q1380l8963K2199M0457n9929M2431d0634k7391B3161M2818
15814F5979L9614m1904J34415c3424a2081A1777K8635K76957a10907l7344j144
15803a49395C4265b53659A00165J65444E621K8290J0967a99744O8915L4278k4020
15792a20571B8417M4343a23184M7068A31131M5142a92730l21433A66289a13501
15781A70292b47582h5082g909k54131D3633J33456M9962c06800a4650I136g4873
15769A52456O91b53185c9971j31309K2122m5642O4981F580K02822a47332N6137
15758i1195k22789B59651a59214C72463j10983i7059A54795d5928D23356B2933
$$ plain form
15838 -103173 159554 80413 -70630 120509 -57210 135113 -308945 -80912 -138695 -104174 39342
15826 78174 -231297 -222607 -141227 -180190 -157991 -117534 -177463 -135032 -40634 -68025 23161 65979
15814 65979 105593 63689 198104 -33424 -12081 11777 40412 317369 -110907 -148251 -149395
15803 -149395 34265 -253659 100165 265609 5621 33911 44878 -199744 -130829 -96551 -120571
15792 -120571 28417 72760 -123184 -76116 131131 176273 -192730 -514163 166289 -113501
15781 170292 -247582 -85082 -7909 -262040 43633 177089 227051 -306800 -14650 9136 -74873
15769 152456 153147 -253185 -39971 -171280 -149158 -194800 -129819 6580 209402 -147332 -91195
15758 -91195 -313984 259651 -159214 372463 261480 -97059 154795 -45928 423356 22933
15747B08664a7120C57621a18075E9880K85484c86094A40406O4776a00820E9654
15736c038p2622C4199a67030A38634o8391e8256h146k02653H8726g7170k95421
15725c72591a77113D4638b61870e0510G6614a85423k2494A87794a42434d3317
15714b53227g6316p9228E3383a54638A97695E5621c15694P7583i7214j01442A31707
15702g8747c6944l7880B6066A0704d6994B54338a71042J1704A12643c1056C91654
15690A23309D3359J51194h3604G3035c02949a6193A92453f5068k568A19991Q5009
15679B05000g2778K9102D4161c4365q5213B8418K94255j654i0403B803K18704
15668B21507A05233a09417j00697j04031N2398j79129F9639b57663C1010b96243
$$ plain form
15747 208664 -17120 357621 -118075 59880 345364 -386094 140406 205182 -100820 59654
15736 -3038 -75660 34199 -167030 138634 70243 -58256 -8146 -210799 88726 -77170 -372591
15725 -372591 -177113 44638 -261870 -50510 76614 -185423 -207917 187794 -142434 -43317
15714 -253227 -76316 -155544 53383 -154638 197695 55621 -315694 -238111 -97214 -198656 131707
15702 -78747 -36944 -74824 26066 10704 -46994 254338 -171042 -159338 112643 -31056 391654
15690 123309 43359 194553 -83604 73035 -302949 -16193 192453 -65068 -67636 119991 205000
15679 205000 -72778 -43676 44161 -34365 -119578 28418 322673 321019 -90403 2803 221507
15668 221507 105233 -109417 -210114 -314145 -261747 -440876 69639 -257663 31010 -296243
15657E3379A3528b6938k27755J24680k79578c9741j6550j21275e0453A45271g922
15645E9094a62616J764A07379a16393N4190A5605a91729c6683A90282M6515h1773
15633B12730c62149b3693j8089A21927b30814a10534I5348J33901n2347K0967
15623A97869b76475c2537e691r3207o9149f5256A8450a02385B27992F3817K22425
15612B86242i006C8870a4545A89964c6103M068A08870f1110l2915M4724k08977
15601b58278C9724b05107k48410a75665A63454b10349k09746a21884J2496J6912
15591i2476E5107a7861A44874P9780b28295A3594a36791C62223j64071l2311g5149
15579B4620a61509C7767J16561l8588a25792a0344k62269a05014A72811a62690
$$ plain form
15657 53379 13528 -26938 -254693 -130013 -409591 -39741 -56291 -177566 -50453 145271 -7922
15645 59094 -162616 -160852 107379 -116393 -62203 15605 -191729 -36683 190282 236797 -81773
15633 212730 -362149 -23693 -41782 121927 -230814 -110534 95348 229249 176902 197869
15623 197869 -276475 -32537 -5691 -98898 -168047 -65256 18450 -102385 227992 63817 286242
15612 286242 -9006 38870 -14545 189964 -36103 -32035 108870 -61110 -94025 -49301 -258278
15601 -258278 39724 -205107 -453517 -175665 163454 -210349 -420095 -121884 -109388 -92476
15591 -92476 55107 -17861 144874 224654 -228295 13594 -136791 362223 198152 165841 -75149
15579 24620 -161509 37767 154328 115740 -125792 -10344 -272613 -105014 172811 -162690
15568B26905a09615A75134g180A09528M3976G3452J18637g3162r2400P5696q5587
15557a75453q959D1350a23118D8508e7469B76896F6952a8242I5797b20299J06992
15546a13307m2928L4842A49033P4923a6142B74844b44834A34189i9553j1088j14204
15535b24845e1330I4442a17328j67174c4189k11714a4263A99075c7775B84241
15524e8257E259g9449C2918L45008A48497O1762a20633k10998a47780H4955i9051
15512b74711B58328b9359n1705j63087N4773A26284P4282c3728j96103d0898l30865
15501c71763b2791A58306a27284j39087R9692I7180b68095O629J14227k36005
15491c83244d3695A70091C7279a16401b5410A53161g4201b9156g157D1942L0484
$$ plain form
15568 226905 -109615 175134 -7180 109528 153504 73452 192089 -73162 -165562 -89866 -175453
15557 -175453 -184412 41350 -123118 48508 -57469 276896 66952 -18242 95797 -220299 -113307
15546 -113307 -156235 -121393 149033 223956 -16142 274844 -244834 134189 -99553 -110641 -224845
15535 -224845 -51330 94442 -117328 -284502 -34189 -245903 -14263 199075 -37775 284241
15524 -58257 5259 -79449 32918 377926 148497 210259 -120633 -331631 -147780 84955 -99051
15512 -274711 258328 -29359 -81064 -244151 -189378 126284 200566 -33728 -229831 -40898 -371763
15501 -371763 -22791 158306 -127284 -266371 -166679 97180 -268095 -261466 -147239 -383244
15491 -383244 -43695 170091 37279 -116401 -25410 153161 -74201 -29156 -7157 41942 72426
15480G2426f661C00844f6799j40403C30486B6656b46187A23495J84528a67154
15469A48980a32279m7607O7307n155B15076q8400a94743A70258e9814N997j859
15458e5676k7546L0864B50456a51578A08560P0656a66050r3351B0554J09614J22739
15447B52907h0298C98058c33302a01779p7761A6681c21694I234g151j17340A97979
15435b83405c6520I3529a49837g2712j68968E9336o942a0541k5942D6279b10911
15423A40572a65065E1758a0223A40776K2633e4118a5314j12472k27739a64124
15412b36929i4429k07469E2035N42386c04093I4134b15115E0306h0315A17915
15401c27549A72007G160b31351R6069N0342E6318K39487b35162C4065b85790A34023
$$ plain form
15480 72426 -6661 300844 -66799 -207202 330486 26656 -246187 123495 308023 -167154
15469 148980 -132279 -179886 -112579 -117734 215076 126676 -194743 170258 -59814 -53817 -55676
15458 -55676 -83222 -52358 250456 -151578 108560 179216 -166050 -259401 20554 130168 252907
15447 252907 -80298 398058 -333302 -101779 -179540 16681 -321694 9234 -7151 -124491 197979
15435 -283405 -36520 93529 -149837 -72712 -241680 59336 52394 -10541 -36483 46279 -210911
15423 140572 -165065 51758 -10223 140776 163409 -54118 -15314 -127786 -355525 -164124
15412 -236929 -94429 -301898 52035 594421 -304093 94134 -215115 50306 -80315 117915
15401 -327549 172007 7160 -231351 -135282 -84940 56318 295805 -235162 34065 -285790 134023
15389E1073M881c5713A6210J41761b12725k744d7838B889N2438k5801J38883g5327
15376a44329H8667O2602c21400E0727J12804a8434A4908b8435o6401C96848j94626
15365B02222b14839c2667l19407F2512e7285k2752D08158A48103a58365j362B00302
15353a61488o8759a04942j01605B67113d17493a00617A73413q2435J78778D3189
15342b12177K6688A19736a37393A41196a92413P4224B75827E3711O2652a51492
15331A60511k7363E5582j7501O2152a6171C7784K17866I3961J25417J10542A17866
15319A52235B7097b0291b91F9342J16367a27514A7448J56944L2609b49232f3884
15307A16269C8447j2688K38377a3750j07093A48997p3216R1931c7531C52385i7810
$$ plain form
15389 51073 55954 -35713 16210 157971 -212725 -215469 -47838 2889 55327 29526 168409 -75327
15376 -144329 88667 151269 -321400 50727 163531 -18434 14908 -28435 -94836 396848 202222
15365 202222 -214839 -32667 -352074 62512 -57285 -80037 408158 148103 -158365 -159727 200302
15353 -161488 -230247 -104942 -206547 267113 -417493 -100617 173413 90978 269756 43189
15342 -212177 -185489 119736 -137393 141196 -192413 -118189 275827 53711 116363 -151492
15331 160511 133148 55582 38081 100233 -16171 37784 255650 93961 219378 329920 117866
15319 152235 27097 -20291 -291 69342 185709 -127514 17448 174392 207001 -249232 -63884
15307 116269 38447 25759 264136 -13750 -120843 148997 75781 167712 -37531 352385 -97810
15295A60610M1675m178c2399F9923b180J52B86447H9549i750C50014I7957a25068
15282b5498j62956C01193c5178N992D39706j66700d0815o3283j84700e4544l7175
15271i1719B20052b5392A00382A719J16643g9382C74282j60024J06132e5100q2229
15260a37329c8239A50611p048J35044A38008J21199A26933Q9162j01121M8957
15250A63931J76199L15367Q49939J0935o7403J36254o92616l01340j55978B11528
15239B87066K9390j53428b1826k23421A52580e7517j5749k46288A11614O6O3387
15228A75067h2863C49025b85054B24435B6787a88542H7683i4804k3769A33068
15217b89382a5444q6700G2224C2381a9519N035D2778K33718q3542j2371R4267
$$ plain form
15295 160610 202285 198107 -32399 69923 -2180 -2028 286447 89549 -9750 350014 97957 -125068
15282 -25498 -188454 301193 -35178 -29186 439706 273006 -40815 -104098 -288798 -54544 -91719
15271 -91719 220052 -25392 100382 1719 118362 -79382 374282 214258 320390 -55100 -137329
15260 -137329 -38239 150611 143563 278607 138008 259207 126933 216095 114974 163931
15250 163931 340130 655497 1505436 1516371 1448968 1585222 892606 591266 435288 211528
15239 287066 316456 163028 -21826 -245247 152580 -57517 -73266 -319554 111614 111680 175067
15228 175067 -82863 349025 -285054 224435 26787 -188542 87683 -94804 -118573 133068
15217 -289382 -15444 -102144 72224 32381 -19519 -14484 42778 276496 192954 180583 274850
15206B74850f9478B77068b48928D64847A3768L1951M5177a7759A93469a7212C96113
15194A77246p9131j8372J0189A8403J28931b77086D11205A29303e0905k7338A16087
15182A43878J8129g0862C97264a2350m5608A26212c7542n5854C7999g0783C4773
15170b28683B14607K9848D9260J15290i8089I6109M743i5797a2450j22542B02725
15158G0960J58023O3803I4739M9640a04214B69944j31986K2159D4898N377K8512
15147G8787C1040a20109B72402E093J53184h4830k9317A78518q4771F632J02659
15136A09291J20022b38834G2749a67115F5304B1142J9607c738I4676Q9539a01660
15124A40630k192J4724M2418I3090J19687o8060f8821A88070A7940K18261r1496
$$ plain form
15206 274850 -69478 277068 -248928 464847 13768 45719 90896 -17759 193469 -17212 396113
15194 177246 98115 79743 89932 18403 147334 -277086 411205 129303 -50905 -78243 116087
15182 143878 162007 -70862 397264 -12350 -57958 126212 -37542 -93396 37999 -70783 34773
15170 -228683 214607 244455 49260 164550 -98089 96109 100852 -95797 -12450 -134992 202725
15158 70960 228983 292786 94739 144379 -104214 269944 137958 160117 44898 50275 78787
15147 78787 31040 -120109 272402 5093 158277 -84830 -114147 178518 93747 6632 109291
15136 109291 229313 -238834 72749 -167115 65304 21142 40749 -3738 94676 184215 -101660
15124 140630 138438 153162 195580 93090 212777 144717 -68821 188070 17940 236201 144705
15113A44705A1040b05450A90090h8718C07177l1914q3702l1669b45353e9067F6798
15101D20107b45488c6216J5134C13792H8076P4181A9730N15900C4421J38129l7208
15090A35342l0499l1347a79434A89211r2602a44244A11485J06567Q0448r8031
15080B00469J78273A4552M8654i3035A65066R5622N1569L04533A24547n194Q0954
15069B00307e3233I1197J84545A4047R1531f794F2134R8012L33508E2421b6525
15057B89491m0946P4751n4285n5089J48842c0276A69614M5183k6585o0633J62974
15046B90553G3564M86474j87820A75247K11297g1930k6220C36826G0443K25741
15036B96184F1398J51843N1068j15083J05450A11408e461A24162A7899K5756K58592
$$ plain form
15113 144705 11040 -205450 190090 -88718 307177 275263 191561 159892 -245353 -59067 66798
15101 420107 -245488 -36216 -21082 313792 88076 162257 19730 535630 34421 172550 135342
15090 135342 104843 73496 -179434 189211 96609 -144244 111485 218052 298500 200469
15080 200469 378742 14552 63206 -93035 165066 260688 312257 616790 124547 119353 200307
15069 200307 -53233 91197 275742 14047 105578 -6794 62134 160146 493654 52421 -26525
15057 289491 248545 323296 269011 213922 362764 -30276 169614 214797 188212 127579 290553
15046 290553 73564 560038 372218 175247 386544 -71930 -98150 336826 70443 296184
15036 296184 61398 213241 264309 149226 254676 111408 -5461 124162 17899 43655 302247
15025C02247p3897a22008B9596J91143k8294F8227M31646H6100J98428D8385L32789
15014C81174I3281K81854j6857f1958A32605P1495R8125l1622k1320F7279L4610
15003A01889Q9042m4041d15817B87882m7746J32200n454j24244J79823L9892B20130
14991E45726B53696A24152J92111P0986j19242j24516D9189R4101e2955A73116
14980F47654H8661Q5674R5546K3187j05212K3142n4983M48810A56406J58470o9099
14969B45777K8246l1597r6528L26893j86363m3524I9687J18720K51709l6487k2458
14958D11171r7150A4398J44578K51246k00393K08603A38135J40870K00625m9957
14948D29673j53358k5297K28797j52717A52609K66714j50313J41368R1358A23223
$$ plain form
15025 302247 228350 -122008 29596 220739 192445 68227 499873 86100 284528 48385 381174
15014 381174 93281 375135 358278 -61958 132605 204100 302225 270603 249283 67279 101889
15003 101889 190931 146890 -415817 287882 240136 372336 366882 242638 422461 462353 220130
14991 545726 253696 124152 316263 387249 268007 143491 49189 143290 -52955 173116
14980 647654 88661 174335 269881 293068 187856 210998 156015 604825 156406 314876 245777
14969 245777 274023 242426 145898 472791 286428 242904 99687 218407 470116 433629 411171
14958 411171 314021 14398 158976 410222 209829 418432 138135 279005 479630 429673
14948 429673 276315 251018 479815 327098 152609 419323 269010 410378 501736 123223
14937C56595o0386p6207a2357A52118J78960M7558n7798f0642C26221j18845N00291
14926G07667C12525r6944J76170K20411k80105C1357L86880A80891J37992P1628
14916C90511p5942q4698c1639C27481R9571J9495A14630M10932k3666j66071l092
14905C32733m5584L09151j47518P1958k10586k1677O8089A53167P7208L18363
14895E48738j77081J88543j85202j0223j19069Q8260l6862J5751k3925P595r278
14884B87247M9239o409J5598n1718J09244j23615K4614J80435j20406l1927L4273
14873C66575A71925M18883j38564A94831O0092l9486J92457A79750Q4765J17650
14863C82165Q1467j16590J15043J56216J3723j46639M1816j76279L04222j27006
$$ plain form
14937 356595 296209 220002 -12357 152118 331078 378636 320838 -60642 326221 207376 707667
14926 707667 312525 215581 391751 612162 332057 31357 418237 180891 318883 390511
14916 390511 314569 229871 -31639 327481 427052 446547 114630 525562 501896 335825 332733
14905 332733 287149 596300 448782 520740 310154 288477 356566 153167 230375 548738
14895 548738 371657 560200 374998 364775 245706 333966 297104 312855 288930 296525 287247
14884 287247 336486 330077 345675 293957 403201 279586 304200 484635 364229 332302 366575
14873 366575 171925 590808 452244 194831 254923 215437 407894 179750 264515 382165
14863 382165 463632 347042 462085 618301 632024 485385 527201 350922 655144 528138
14853E28138m7792o6324o0740A60828N72274j46576P0744k86245J87455O4938
14843F23418j83175j81906M47529o3005C06823K76782M1542B94175K31588j05860
14833D19903P9969m7503A25723O04872k74050k9035H3283M20244A89922K9893
14823B19815M92012B17551K07867H9361J13646m2025J17010l2006J30402K91786
14813F68174j95033M5849m0228j0450k19720K00938Q1681k10720J21745B00216
14802F71496j75032J60164j68513q8977O9797k2994J00843J2561J1083r3684L43198
14791H19942j77863A95045M12387B49107O78991l24192r3868j65350N66240C78538
14780E53662j19542J09170P4650O4208C17366K03388k01752M08810l4522j62496
$$ plain form
14853 528138 480346 414022 353282 160828 733102 586526 657270 371025 558480 623418
14843 623418 440243 258337 705866 642861 306823 583605 625147 294175 525763 419903
14833 419903 499872 452369 125723 730595 456545 427510 83283 503527 189922 219815
14823 219815 711827 217551 425418 89361 203007 160982 277992 245986 376388 668174
14813 668174 473141 518990 478762 468312 248592 449530 531211 320491 442236 200216
14802 671496 496464 656628 488115 399138 468935 445941 546784 559345 570428 476744 819942
14791 819942 642079 195045 607432 249107 928098 603906 510038 344688 910928 378538
14780 553662 434120 543290 617940 682148 317366 520754 319002 727812 693290 530794
14770E30794j00689Q7259Q0309j31k67573M83693M6242k89428J48990j12399J83592
14759G90659k14991J65760P0112k80533K36407j02134Q4165o2650M26671k16141
14749H97325k65711N0254J6009r4401k8442J60708j39235L52960j73428k30101
14739E45938O7246L20595m23162L85844k14598K83541j19003j84713J4383K32486
14729I08557l48549M30920j25569k20116q6797K79262l47172N15517L9733k28851
14719H16935k70837J3976L05479P2981J46373j10360o2003j34398L8716P1910
14709H88772P6863j2622l37024J37849J92501J63979j18188k02155L04470L6220
14699A130665k89182K5445J42481N5334k85347K16552m32076L50383j69542J15625
$$ plain form
14770 530794 430105 517364 597673 597542 329969 813662 859904 570476 719466 607067 790659
14759 790659 575668 741428 811540 531007 767414 665280 749445 686795 1113466 897325
14749 897325 631614 681868 697877 603476 575034 735742 596507 949467 776039 545938
14739 545938 613184 933779 510617 896461 681863 965404 846401 661688 676071 908557
14729 908557 560008 990928 865359 645243 558446 837708 490536 1006053 1045786 816935
14719 816935 546098 560074 865553 938534 1084907 974547 912544 778146 816862 888772
14709 888772 965635 953013 615989 753838 946339 1110318 992130 789975 1094445 1130665
14699 1130665 841483 866928 1009409 1064743 779396 995948 563872 914255 744713 860338
14689H60338M2132L4326J2820o0833L2253R6562J20469k34003j65849K46487l8800
14678I45902q3687K47947o4507J79347k31919o3441J84816k99123J60519K2805
14668I98659J63303k63212j6293K24997j54471j22874J70934L85989k98483k37301
14658H51248K3632J72433J80956Q75j92839m1020Q7268J99444k22189k61903L04708
14647A102613K21186r6884J57378O6519j79026K42604k65499j62111J80676k7961
14637A239495K91080k93311K52672J65389n52915L55945j71224M19672k93679
14628A413124j0120N9379R050K24355l68281j52325K63612K5438k9122K07469
14618A642579k39035L09912M8340j09216j20146J13069k64432L97548j89093q235
$$ plain form
14689 860338 902470 936796 949616 888783 921036 1017598 1138067 904064 738215 984702 945902
14678 945902 862215 1110162 1045655 1225002 993083 929642 1114458 815335 975854 998659
14668 998659 1161962 898750 882457 1107454 952983 830109 1001043 1387032 1088549 851248
14658 851248 874880 1047313 1228269 1229144 1036305 995285 1082553 1281997 1059808 797905 1102613
14647 1102613 1323799 1226915 1384293 1450812 1271786 1514390 1248891 1086780 1267456 1239495
14637 1239495 1530575 1237264 1489936 1655325 1102410 1458355 1287131 1706803 1413124
14628 1413124 1403004 1462383 1471433 1695788 1327507 1175182 1438794 1464232 1435110 1642579
14618 1642579 1403544 1713456 1761796 1652580 1532434 1645503 1381071 1778619 1589526 1581291
14608A581291L05638j87018O2773n1170j71166R1182J22655J71840J9840N4588
14598B000453q28265N74159q0806n9167J27128j19034J04596L24151p9837m30242
14588A533136J60048M311L53689J19578J8769m42929L69564j98520j02493J72999
14578A988152k61250K90321J30407K98331o21784L52018J09199l40002K37838
14569B183230K97423k1208R9548N4070r8585j1853L30665N0672k04136L15741
14559B995567j87587K77743j94036L14629L55736J4758K66576N21668L82351J255444
14549F002849J549164L591630Q992503K0335441O52525j6493000A1622637n795868
14541E826769k139068p33514m61702k21493k82579J50626K5533J30813j26568
$$ plain form
14608 1581291 1886929 1699911 1762684 1711514 1540348 1631530 1754185 1926025 1945865 2000453
14598 2000453 1172188 1746347 1665541 1606374 1733502 1614468 1719064 2043215 1963378 1533136
14588 1533136 1693184 1697495 2051184 2170762 2189531 1746602 2116166 1917646 1815153 1988152
14578 1988152 1726902 2017223 2147630 2445961 1824177 2176195 2285394 1945392 2183230
14569 2183230 2480653 2459445 2558993 2613063 2514478 2502625 2833290 2883962 2679826 2995567
14559 2995567 2807980 3085723 2891687 3206316 3562052 3576810 3843386 4365054 4747405 6002849
14549 6002849 7552013 11143643 20136146 40471587 41124112 24631112 11622637 5826769
14541 5826769 3687701 2954187 2492485 2270992 1988413 2139039 2164572 2295385 2168817
14532B168817K606R2360j66923j79248N17552l5516m9028L6113L33659o8152m37390
14521B214850L05573J65012J9876K78314j41895k44351J27009r5427L95663j49299
14511B875325j72269K30852j7897k0054K1473K8049K89071j61307K75268R6272
14501C444783n08855o1627P18745l93848Q5848j00693N32637n72370O31955k68333
14491C508242k18174M04062Q2482j49375j44896J15193R1592L4460L27194l56960
14481C693820N16422l59205K12041j5716P4415P390K282j45927L30034j1784k01150
14470D102622K33669j34267K16353j12589K61064J4243M2436M12601l31551J99726
14460D904307m77845N35252J47677N6903j7919j8424K09341J52235K3209k13596
$$ plain form
14532 2168817 2171423 2263783 2096860 1917612 2435164 2399648 2350620 2386733 2720392 2652240 2214850
14521 2214850 2520423 2685435 2705311 2983625 2841730 2597379 2724388 2628961 3024624 2875325
14511 2875325 2703056 2933908 2916011 2895957 2917430 2945479 3234550 3073243 3348511 3444783
14501 3444783 2935928 2874301 3593046 3199198 3285046 3184353 3716990 3144620 3776575 3508242
14491 3508242 3290068 3694130 3776612 3627237 3482341 3597534 3689126 3723586 4050780 3693820
14481 3693820 4210242 3851037 4063078 4047362 4121777 4129167 4131449 3985522 4315556 4303772 4102622
14470 4102622 4336291 4202024 4418377 4305788 4566852 4581095 4623531 5036132 4704581 4904307
14460 4904307 4426462 4961714 5109391 5166294 5148375 5129951 5339292 5491527 5514736 5301140
14450E301140N40196M6310k15336k395K45369N9242K13115r5297J39863l27634
14440E904573J42103N15305j17751j05199J39295J47087q5705K06837L47514l92620
14430F701439N07260l05610N15351j56757J17268L02069P6985L32432j95632K01852
14420H096657M0449M11419J05918M0109J44131o961L33021k4071J1422q021N33723
14409I677796l46984L97198L06171k90856K16088L20563K20925K41794j52843
14400A0589852M54075J44558L81213j18274K66299L59029J97185K33712n4696
14391A2452953L78688j38258O91766J05282K57752K113N32259J74637J99205J85189
14381A4841586O73818j90000K24802K84345O06595J23567M32022L58689J45752
$$ plain form
14450 5301140 5841336 5887646 5672310 5669915 5915284 5974526 6187641 6092344 6232207 5904573
14440 5904573 6046676 6561981 6444230 6339031 6478326 6625413 6539708 6746545 7094059 6701439
14430 6701439 7208699 6903089 7418440 7261683 7378951 7681020 7758005 8090437 7894805 8096657
14420 8096657 8137106 8548525 8654443 8694552 8838683 8831722 9164743 9140672 9152094 9144073 9677796
14409 9677796 9330812 9728010 10034181 9743325 9959413 10279976 10500901 10742695 10589852
14400 10589852 11043927 11188485 11569698 11451424 11717723 12076752 12273937 12507649 12452953
14391 12452953 12831641 12693383 13385149 13490431 13748183 13750296 14282555 14457192 14656397 14841586
14381 14841586 15515404 15325404 15550206 15834551 16441146 16564713 16996735 17355424 17501176
14372A7501176N48136M87685K79639J6481N61096M29751N73643M61478O8931M75594
14362B1403610M78274N35799O62421K89598N68119M08097Q16650J66753Q96689
14353B6226010P13655M65612R48991M54778Q90758N07225P79565Q10016Q18355
14344C2614965P19909P68855Q94777J190393R38944J068652J004999R65425J244401
14335D1411320J188869R78774J692936J062908J358389J661721J535215J006670
14327E1896802K235207J537146J724315K004574K068843J988002K182861K213153
14319F7850903K671348K580562K662504K362754L292938K605132L378434L613820
14311I1018395L544196L676257M275933M479610M261361M642674M952138N545749
$$ plain form
14372 17501176 18049312 18536997 18816636 18833117 19394213 19823964 20397607 20859085 20928016 21403610
14362 21403610 21881884 22417683 23080104 23369702 23937821 24345918 25162568 25329321 26226010
14353 26226010 26939665 27405277 28354268 28809046 29699804 30207029 30986594 31796610 32614965
14344 32614965 33334874 34103729 34998506 36188899 37127843 38196495 39201494 40166919 41411320
14335 41411320 42600189 43578963 45271899 46334807 47693196 49354917 50890132 51896802
14327 51896802 54132009 55669155 57393470 59398044 61466887 63454889 65637750 67850903
14319 67850903 70522251 73102813 75765317 78128071 81421009 84026141 87404575 91018395
14311 91018395 94562591 98238848 102514781 106994391 111255752 115898426 120850564 126396313
14303A26396313N319961O162647O072227O577715O935899P245115P742035Q433623
14295A80885535Q560420R384597R555505R897143J1049392J1024540J1522988
14288B51880120J2292387J2694888J3093601J3581309J4002722J4192314J4557415
14281C46294756J3994272J4416561J3968272J3471895J2730188J1980707J0623300
14274D37479951R466643P535039M169867P92666j012937k772904j253022l857184
14266D50548119m241361o479947q313353j0998920j2335478j3720972j4278178
14259C80179910j4593082j5226964j5433622j5398462j4503561j3820100j3815181
14252B77388938j3433614j2784682j2345373j1508601j1155990j0594265j0166950
$$ plain form
14303 126396313 131716274 137878921 143951148 150528863 157464762 164709877 172451912 180885535
14295 180885535 189445955 198830552 208386057 218283200 229332592 240357132 251880120
14288 251880120 264172507 276867395 289960996 303542305 317545027 331737341 346294756
14281 346294756 360289028 374705589 388673861 402145756 414875944 426856651 437479951
14274 437479951 446946594 454481633 458651500 459444166 458431229 455658325 454405303 450548119
14266 450548119 446306758 439826811 431513458 420514538 408179060 394458088 380179910
14259 380179910 365586828 350359864 334926242 319527780 305024219 291204119 277388938
14252 277388938 263955324 251170642 238825269 227316668 216160678 205566413 195399463
14245A95399463r162227q618348q192652q033676p079196p385370o651624n825081
14237A34451289n841803n244571n772051m883475m899266m029486l906334l963896
14229I5910407m233892l021388l696343l256061l172874l025915k266277k869001
14221G0368656j943996k265255k317524k222199k272667k317720j530673j383363
14213E4115259j206601j962304j877753j487175j491774j190132p86908j285330
14205D2827282j231170q90525j542664j137890o73449j007829j013635j082568
14197C4247552p50848r67468o23131n33726j208683o65239o83017r22304n51725
14188B7341411n71535p00920n19649p78492l27575l59075m03497o35480r26228
$$ plain form
14245 195399463 186237236 177618888 169426236 161392560 154313364 146927994 140276370 134451289
14237 134451289 128609486 123364915 117592864 112709389 107810123 103780637 99874303 95910407
14229 95910407 91676515 88655127 84958784 81702723 78529849 75503934 73237657 70368656
14221 70368656 68424660 66159405 63841881 61619682 59347015 57029295 55498622 54115259
14213 54115259 52908658 50946354 49068601 47581426 46089652 44899520 44112612 42827282
14205 42827282 41596112 40705587 39162923 38025033 37351584 36343755 35330120 34247552
14197 34247552 33496704 32529236 31906105 31372379 30163696 29498457 28815440 27893136 27341411
14188 27341411 26769876 26068956 25549307 24770815 24443240 24084165 23680668 23045188 22118960
14179B2118960l86022k79812o33507k89128l54983p50870j8808n42417k82551
14170A8580862k11101l33237m65373l89481l78673K4788n57972j75503k01673
14161A5892637j02665n99679l12431m29797m67959K5809r2146j31914l33983k18018
14151A3229854j68708j12588n73058K16320m13597l95314m04352K90204k16819
14142A1451942l62366J61464p8159m06468J44338n35916j40345l31362J74528
14133A0077656l42631J46438m61908j14548p1549k25464J88604l97677j87K82352
14123I081086o77840J70139j07450M6720k98973R1537l88523l61157O95141k99433
14113G951247k48161l07563O2638k69933k34773J88802j12133J26626k91498Q0283
$$ plain form
14179 22118960 21732938 21453126 20819619 20530491 20175508 19424638 19405830 18863413 18580862
14170 18580862 18369761 18036524 17571151 17181670 16802997 16827785 16269813 16094310 15892637
14161 15892637 15789972 15190293 14877862 14448065 13980106 14005915 13913769 13781855 13447872 13229854
14151 13229854 13061146 12948558 12375500 12591820 12178223 11782909 11378557 11668761 11451942
14142 11451942 11089576 11251040 11172881 10766413 10910751 10374835 10234490 9903128 10077656
14133 10077656 9735025 9881463 9419555 9305007 9233458 9007994 9196598 8798921 8798734 9081086
14123 9081086 8403246 8573385 8465935 8512655 8213682 8305219 7916696 7555539 8250680 7951247
14113 7951247 7703086 7395523 7458161 7188228 6953455 7142257 7030124 7156750 6865252 6945535
14103F945535k26809J31605k22103k78989k37945K85270l31075P4453J5951J01141
14093F257034n05590J47539k6442l44863J54883J52521k92910j40573O6518j33021
14083E335096m03k25373J57065k59230J38332Q4829l18128J35424l1115l07448
14073D709049J75779l34627r1751L54912j00323L8278m79549K83043k49017o1130
14063D244664K51060l35397K55874l93473K57681o2745j11192O191m5046m0979
14053D026638J32683l19228K42017l07571j43742J26273R9761Q6010l94197K17182
14043C765826l20596O1628K70854l15773k11252r4242J84659k70067K35610K49788
14033C556435k44787N3172j25775j54593J76968n0571R3914m06234k706k49348
$$ plain form
14103 6945535 6718726 6850331 6628228 6349239 6111294 6396564 6065489 6139942 6155893 6257034
14093 6257034 5751444 5898983 5872541 5527678 5682561 5835082 5542172 5401599 5468117 5335096
14083 5335096 5334693 5109320 5266385 5007155 5145487 5230316 4912188 5047612 5016497 4709049
14073 4709049 4884828 4550201 4458450 4813362 4713039 4751317 4271768 4554811 4305794 4244664
14063 4244664 4495724 4160327 4416201 4022728 4280409 4217664 4106472 4112663 4067617 4026638
14053 4026638 4159321 3840093 4082110 3774539 3630797 3757070 3856831 3942841 3548644 3765826
14043 3765826 3445230 3506858 3777712 3461939 3250687 3156445 3341104 3071037 3306647 3556435
14033 3556435 3311648 3364820 3239045 3084452 3261420 3210849 3304763 2898529 2895823 2646475
14023B646475L52621O0459j02290m13454M32652o7218J64999m44633p5152o153
14013B548306K84753j08559m3730k08086O5408P2390K85022l02926j30156K46248
14003B708670K625k70827l07875M1070N2194K09716j97714J64247k69557j22953
13993B009596K10846L08987l06532O02181P77111K447200P078050K0755888P942027
13984D1825354j3872934j2466934n922773l033072j323997o15490n45320j45230
13976C899604m70710k86657k85597J39814k71231L3209j45581j1213l1437l26963
13966B243238L03528r6901l60954L64079o0935k65999k7369L13063l72384M37131
13956B476497m00026j01159L65712l44497L60922n08793O01559l11362J00567
$$ plain form
14023 2646475 2999096 3059555 2957265 2543811 2976463 2909245 3074244 2629611 2554459 2548306
14013 2548306 2833059 2724500 2680770 2472684 2538092 2610482 2895504 2592578 2462422 2708670
14003 2708670 2711295 2440468 2132593 2173663 2225857 2435573 2237859 2402106 2132549 2009596
13993 2009596 2220442 2529429 2222897 2825078 3602189 6049389 13127439 33883327 41825354
13984 41825354 27952420 15485486 9562713 6529641 5205644 4590154 4044834 3899604
13976 3899604 3428894 3142237 2856640 2996454 2725223 2758432 2612851 2601638 2570201 2243238
13966 2243238 2546766 2449865 2088911 2452990 2392055 2126056 2098687 2411750 2039366 2476497
13956 2476497 2076471 1975312 2341024 1996527 2357449 1848656 2450215 2138853 2239420
13947B239420k55555P6825l79263J37945j47637J76370j39470K89195k86402J70178
13937A881606J82358k84277L83711l37958N2374p319k07808L38176r7870k12509
13927A690484k63517K31615j39934K08878L7200J05519l9196l95267J92391l68755
13917A259418J72020K05972j46561M03631k32281j31547r1673K6950P4258K29724
13907A769911k62793L0917n2087O7398l24800o4193R2605J94897k13836j8201
13897A219818o3549j03907J62389K28782j60026K9054K27918k14611K37864m01215
13887A162517J79418l62150O6893L57216J33134l85156Q0358J16213j01168j93067
13877A054208m5949N4130J96254p2730l9126J6306l3204n9082j2519K37241k61956
$$ plain form
13947 2239420 1983865 2060690 1681427 1819372 1671735 1848105 1708635 1997830 1711428 1881606
13937 1881606 2063964 1779687 2163398 1825440 1877814 1870495 1662687 2000863 1902993 1690484
13927 1690484 1426967 1658582 1518648 1727526 1764726 1870245 1831049 1435782 1628173 1259418
13917 1259418 1431438 1637410 1490849 1894480 1662199 1530652 1438979 1465929 1540187 1769911
13907 1769911 1507118 1538035 1485948 1553346 1228546 1164353 1256958 1451855 1238019 1219818
13897 1219818 1156269 1052362 1214751 1443533 1283507 1312561 1540479 1325868 1563732 1162517
13887 1162517 1341935 979785 1046678 1403894 1537028 1151872 1232230 1348443 1247275 1054208
13877 1054208 1008259 1062389 1258643 1185913 1146787 1163093 1129889 1070807 1058288 1295529 1033573
13866A033573p112k9798N56454l22067K07650k52767K60693k66487j43119J99131
13856A236151R1099l19700O7535J1232J62341j93326j28049J68335o511j6525
13846A072582K3620J51482o7692k494q0425k72838O4218J40814j70767J19737
13836I78237K06311j90322j74212J67090j44937K48961J06578q9105n34511K81507
13826H55597J5189L1626n9395L60469j96700o6040j95269L69963j75530o3939
13816H75971j06547j8414j47948K69068l2401k34697J0128K26733Q1112L07464
13806A230469k41122j62982l54045N67949L5147k7019j14213m8149M4916k13465
13796G17486K98276m16843J36000k3179j08417J87041j69558K19342j46470J67447
$$ plain form
13866 1033573 1026461 996663 1553117 1231050 1438700 1185933 1446626 1180139 1037020 1236151
13856 1236151 1327250 1007550 1075085 1086317 1248658 1055332 927283 1095618 1089107 1072582
13846 1072582 1096202 1247684 1179992 1177498 1097073 824235 888453 1029267 858500 978237
13836 978237 1184548 994226 820014 987104 842167 1091128 1197706 1108601 574090 855597
13826 855597 870786 902412 843017 1203486 1006786 940746 745477 1115440 939910 875971
13816 875971 769424 751010 603062 872130 839729 605032 615160 841893 923005 1230469
13806 1230469 989347 826365 472320 1040269 1075416 1048397 934184 886035 930951 717486
13796 717486 1015762 598919 734919 711740 603323 790364 620806 840148 693678 861125
13786H61125J75133j32536p4440K9430k33014M28221M4736l08120n5152N3981
13776G89364k59312J92199n0162r3801J58707J18458q2504J50836j66894q2975
13766F73916N69727C55365O83223l90620J48976O2757l00485K04957L9278C19255
13755E86246j54773L95577j62849N7584K96168D38477L42917k43660K13890J03432
13745H55056m14503M20097l72496K30018j23330J09445k29680p4600K17398K16676
13735H34081C71072K73821n9547N3958j18640o7572J64507J47282k70971K60963
13725G54873L83367D75834m0527q3034K58073l509J72110l09829L22556N1753
13715H43427j06534k37196o2529K19104k7381K7306P3453l8121O8097m3525j45517
$$ plain form
13786 861125 1036258 903722 829282 858712 625698 1053919 1098655 790535 735383 789364
13776 789364 530052 722251 672089 578288 736995 855453 772949 923785 756891 673916
13766 673916 1243643 355365 1038588 647968 796944 859701 559216 764173 803451 319255
13755 586246 431473 827050 664201 721785 1017953 438477 781394 537734 751624 855056
13745 855056 440553 860650 488154 718172 594842 704287 474607 400007 617405 834081
13735 834081 371072 644893 585346 639304 520664 453092 617599 764881 493910 754873
13725 754873 1138240 475834 435307 352273 610346 606837 778947 469118 791674 843427
13715 843427 736893 499697 437168 656272 628891 656197 729650 691529 759626 716101 570584
13704E70584m0835j15197J98728k8214l6933J5661q6783K24799o8685O5198K01710
13693I00033j50840k91212J67411j3473j17490k17871p9787M48006J53365l72825
13683D25317o0815K45542q9779P4862J09901k90071j75856N14305k23331m0639
13673D89436R3194j61702R7723N464J8057J96867k30464J35788J71421j49511
13663F66273p5873J6490A25053M03729o1018p3793J63737B59831K53839R2247
13653F05917B85939N5410j01630E4333M59706j86058K6415K7208j05063L11167
13643E87708A86868L02512M8688j7212k42013J02703Q2272j39144K53630j75786
13633D02518M8794l8454R1576j81261J67911q9849K34441j4791j59628m6059j76853
$$ plain form
13704 570584 529749 414552 613280 585066 548133 563794 477011 701810 633125 698323 900033
13693 900033 749193 457981 625392 611919 494429 276558 196771 644777 798142 425317
13683 425317 364502 610044 520265 595127 705028 414957 239101 753406 530075 489436
13673 489436 582630 420928 518651 524115 542172 739039 508575 644363 815784 666273
13663 666273 590400 606890 125053 528782 467764 393971 557708 259831 513670 605917
13653 605917 285939 341349 239719 54333 514039 327981 354396 381604 276541 587708
13643 587708 186868 489380 538068 520856 278843 381546 463818 324674 578304 402518
13633 402518 451312 412858 504434 323173 491084 401235 635676 620885 461257 415198 238345
13622B38345L96304k95586K46756k69861J69520j40813J00881J62850B72557K70398
13612E42955J99415B44795m9302K551J57768q2778n5072N79169C24947J37910
13602D62857Q9589k29061Q792M123J51783n1677j31169M51539A65233J54045J03231
13591D22509A06910J77645P539a6935G23062l07233j73022R0989j12739K69256
13581D90313J5748J33592k85973j21788F2427K09208Q8617A35578a70891A41608
13570B48860J40166l7984B0952J87123M49473k81804j48228N0319J67746j72726
13560B72855j16177J35148J3877J49872A83212E6194K31326K32577j31002N2362
13550D41457A02365M72608K2755B87489A24670K30006Q0682O4477A62455J16890
$$ plain form
13622 238345 634649 339063 585819 315958 485478 344665 445546 608396 272557 542955
13612 542955 742370 244795 195493 198044 355812 273034 217962 797131 324947 462857
13602 462857 552446 323385 332177 336300 488083 436406 305237 756776 165233 319278 422509
13591 422509 106910 284555 292094 -16935 723062 415829 242807 333796 221057 490313
13581 490313 506061 639653 353680 231892 62427 271635 360252 135578 -170891 141608
13570 248860 389026 351042 20952 208075 657548 375744 227516 277835 445581 272855
13560 272855 156678 291826 305703 455575 183212 56194 287520 520097 389095 441457
13550 441457 102365 574973 597728 287489 124670 354676 435358 499835 162455 279345
13540B79345f9214B62580P7408J31496q2643q0637J61386i7024M4470D49968j01463
13529C48505P5849q0061d3978E19234A14973K95161A54841O6711J53382G6547
13518C39019j20870K27879j90835K06872B26499j04168P8791M68021j59004B529
13507C87605D3284P9468K8653J1505J31188C5594M7481K81866j71482R7788j24084
13496A67163L05989B15681P4305J02938j74309J15399P7756K0926P6513H9156
13485A56872N53656a01083B28383N0709n3999E3351J86392K6165A14267Q8761
13475B03028m1448E5586K53323K76719H3861R3177M9105d282C4186J80883n368
13464B09701L8846C3704K12604j14868K12895d9332E16463j50907j01265K6358
$$ plain form
13540 279345 -69214 262580 339988 471484 388841 308204 469590 -97024 -52554 449968 348505
13529 348505 424354 344293 -43978 519234 114973 410134 154841 221552 374934 76547
13518 339019 218149 446028 255193 462065 226499 122331 201122 669143 510139 2529
13507 387605 43284 122752 151405 162910 294098 35594 83075 364941 193459 291247 167163
13496 167163 473152 215681 289986 392924 218615 334014 411770 432696 509209 89156
13485 156872 710528 -101083 228383 279092 225093 53351 239743 265908 114267 203028
13475 203028 161580 55586 308909 585628 83861 177038 226143 -4282 34186 215069 209701
13464 209701 248547 33704 246308 131440 344335 -49332 516463 365556 264291 290649
13454B90649J1797K56469c0208B47232K69461n2675A32450L14035j50735k5905
13444B69845J61771E0929J0027Q0791J91026q0178h2577B30904N7040J14207j86883
13433B15268M1324J6213j11697J08225J29575O7896B32609H7368K29925H7603
13422A29569O7616J86644A85409J44432p1343J22025j85595J5860j03734N599
13412A12653M12453j47735A82928R9147p3954P8191K76055k48904J2130a01369
13401A42351D5912J21197J24246b37678A60393O5755J0598M8244G7920J78615
13391B56535A7762L40352f2294D40176j43618A31050A9254K92624n165p2546K98842
13380E33009G2135i2729E16528A99307K61345a86275A37203o0389A4430J13244
$$ plain form
13454 290649 302446 558915 -30208 247232 516693 464018 132450 446485 295750 269845
13444 269845 431616 50929 60956 141747 332773 252595 -82577 230904 287944 402151 215268
13433 215268 256592 272805 161108 269333 398908 466804 232609 87368 317293 87603
13422 129569 197185 383829 185409 329841 258498 380523 194928 210788 107054 112653
13412 112653 525106 377371 182928 282075 208121 286312 562367 313463 325593 -101369
13401 142351 45912 167109 291355 -237678 160393 226148 236746 284990 77920 256535
13391 256535 17762 358114 -62294 440176 296558 131050 19254 311878 306713 234167 533009
13380 533009 72135 -92729 516528 199307 460652 -186275 137203 76814 14430 127674
13370A27674J78809r1950J50111A16632L21288A65995M21218B67551I1958K92950
13360C84908A06669M06440G6595K2244P1576K93385F8654O6540J2404r993M0604
13349A78209o9903L20584A37358I370K69963a17393C02445r724j28836K21728
13339C85613m3398J48724q436k12722A26228J3644O7735K19842a760D85174B23290
13327A71321J65365p9687L81199h2335B72062I9413L69926B20095e6205I2906
13316D14377k2932a3587I0860m5109K48837o1330J11254j17490K51367k19614
13306B58775D03a29883C66777c0299j12812B78894A35956K68406r6134J2699b1095
13294C81487L3096R4166B25031a41068C2960M17420B354K23761Q0199J31164a8541
$$ plain form
13370 127674 306483 214533 364644 116632 437920 165995 587213 267551 91958 384908
13360 384908 106669 513109 76595 98839 170415 463800 68654 135194 147598 137605 178209
13349 178209 108306 428890 137358 9370 279333 -117393 302445 292721 163885 385613
13339 385613 342215 490939 482503 269781 126228 139872 207607 427449 -1760 485174 223290
13327 171321 336686 256999 638198 -82335 272062 99413 469339 220095 -56205 92906
13316 414377 391445 -13587 90860 45751 294588 233258 344512 227022 478389 258775
13306 258775 403 -129883 366777 -30299 -143111 278894 135956 404362 308228 320927 -21095
13294 381487 414583 508749 225031 -141068 32960 450380 2354 226115 306314 437478 -18541
13282i3637B867L18701j46762f984m9519C88999r35G7248K60916m9200b6399G2490
13269I6348d5120B72882n7897B4959J16295l9347J35025q3256D7807k2194g1386
13257a94877C81837b4151C01098H0769K56310A0735K30223J2190m4615m2350J1556
13246A77739m8462M9614A1490L96077A99437B6518K01208J00234A05952O6487
13236A72439p7892e902A89694m8888J09332J74414A67156e5885H5811J5175n766
13225I5220D4866l646a3933b433A23111b01992M3456C1580a46731j27522I9953
13213A43917K4495D7843R0816Q3616k778a24092C47446n8274a1389k4962H5860
13201a272A72963l0310Q7557K801E5917K1957J68046D6482J96111I6029b06593
$$ plain form
13282 -93637 2867 321568 174806 -6984 -56503 388999 388064 77248 338164 288964 -26399 72490
13269 96348 -45120 272882 214985 24959 141254 101907 236932 153676 47807 25613 -71386
13257 -194877 381837 -24151 301098 80769 337079 10735 240958 253148 208533 166183 177739
13246 177739 129277 178891 11490 407567 199437 26518 227726 327960 105952 172439
13236 172439 94547 -5902 189694 140806 250138 424552 167156 -55885 85811 100986 95220
13225 95220 44866 41220 -13933 -2433 123111 -201992 -158536 31580 -146731 -274253 99953
13213 143917 168412 47843 138659 222275 219497 -124092 347446 289172 -11389 -36351 85860
13201 -1272 172963 142653 230210 233011 55917 77874 245920 46482 242593 96029 -206593
13189C64836A27592K7563J10365b1600A66729G4252d8354B83677d1829A81975
13178E3380j1847J04665n1276A6107L21743e1776A87183H575N0974N0263Q5017
13167A94829G8778O0028J74512b7774j9556C66917I4848K08117n4892p5180l4558
13156A38335j8954m0492J38530D3341J4554a23747C43367E7328a4702D8948a8510
13144A76805P3448F2813J49713k3093Q7209o5731a04903B46047j08422A7529K9322
13133D6851J49291E2736L45127A94554E9504E393a15838A44199Q2819B8109J7345
13122D5454j1086Q4122P7339a32487B23764k047j9681a16116M4389p080F7630
13110C2190g4102F8110J87248A11670J53722a62738A46283L9939E5076b0733C51810
$$ plain form
13189 364836 127592 155155 265520 -21600 166729 74252 -48354 283677 -41829 181975
13178 53380 41533 146198 94922 16107 337850 -51776 187183 8575 59549 109812 194829
13167 194829 78778 138806 313318 -27774 -47330 366917 94848 302965 248073 172893 138335
13156 138335 119381 78889 217419 43341 57895 -123747 343367 57328 -14702 48948 -18510
13144 176805 250253 62813 212526 189433 276642 210911 -104903 246047 137625 17529 46851
13133 46851 196142 52736 397863 194554 59504 5393 -115838 144199 227018 28109 45454
13122 45454 34368 118490 195829 -132487 223764 221717 202036 -116116 -71727 -78807 67630
13110 32190 -74102 68110 255358 111670 265392 -162738 146283 186222 55076 -20733 351810
13098B40724j12483J07121A15535J81062F8645Q5069A7573K9460O4515b37605
13087A65339E38J35078l4627L39542h7453B91186j11858f0305A7068L96652a99891
13075B59020r9641P4384C9364P3503D6280a18755K6894A88698h8137A27809i6205
13063a92050A38443P7580f3952C5577a35776A88192K5157J37661B6114b6436j78734
13052b05170F2583M05083A44560c6668B86614A2284L93207F6238k0737J3590e509
13040A52196B7513a485D05255A15822g8925l59728B61947K3128L456j27179j4528
13029A46824j1886J32881G9048J05947J3146P2088A27869A7838J10613L5381a8710
13017A30059a623A41382c1880A45122m90B1424O9240M1732l2277B9565b96547
$$ plain form
13098 240724 128241 235362 115535 296597 68645 153714 17573 47033 111548 -237605
13087 165339 538 135616 100989 440531 -87453 291186 179328 -60305 17068 413720 -199891
13075 259020 159379 233763 39364 112867 46280 -118755 -91861 188698 -88137 127809 -96205
13063 -192050 138443 216023 -63952 35577 -135776 188192 213349 351010 26114 -26436 -205170
13052 -205170 62583 467666 144560 -36668 286614 12284 405491 66238 45501 59091 -5509
13040 152196 27513 -1485 405255 115822 -78925 -438653 261947 285075 288531 161352 146824
13029 146824 134938 267819 79048 184995 198141 270229 127869 17838 128451 163832 -18710
13017 130059 -1623 141382 -31880 145122 144632 21424 90664 132396 100119 29565 -296547
13005D17582d14326g7076C7626J68946J50272a36378Q049l2076B36696h0412B10902
12993b78244B72457j491A25023j3233c91197A15039L1804J72189b65905a5334
12982B14846c17411a53551M5318H8605f355A57604b69657A09502c03255c5461
12971A20079a37959B81172j03559K6769l552i2315B676L4620c2872j23429A5732
12959d3300L659B94793c36218B87664q5295a1226j93461q731B65636A14202Q1291
12948A95493b97958H4236a51252a3726m1267a9115D51335B7667O7716l357c3371
12936A99634A788a00639B40776J92295A4329K74453H4142J50972a90545b6267
12925B0645J41955A3363a4019j11384B46407a17505A15878E173g2792p8689H7320
$$ plain form
13005 417582 -414326 -77076 37626 206572 356844 -136378 -128329 -160405 236696 -80412 210902
12993 -278244 272457 270966 125023 111790 -391197 115039 146843 319032 -265905 -15334
12982 214846 -317411 -153551 -108233 88605 -6355 157604 -269657 109502 -303255 -35461
12971 120079 -137959 281172 177613 204382 200830 -92315 2676 37296 -32872 -156301 15732
12959 -43300 -39641 294793 -336218 287664 202369 -11226 -204687 -213418 265636 114202 195493
12948 195493 -297958 84236 -151252 -13726 -54993 -19115 451335 27667 95383 92026 -33371
12936 199634 1788 -100639 240776 433071 14329 288782 84142 235114 -190545 -26267
12925 20645 162600 13363 -14019 -125403 246407 -117505 115878 5173 -72792 -151481 87320
12913A77307k9520Q2214I2188a3194j74602A36994L039a65672n8980h2958I858
12901E8389g6174I9549J39610D7686b6797j97701A80520a82603C3862P5062d6774
12889a65815D3715J81077b1071A4147J14510a15314H6858a00996A22413K17652
12879C40065A43919c87018E4839a54284A02981a08997D6358c6641m4099B14221
12868E7511j0728J89029a53564B71891G0402J79728q8296k5916e1613l0419C14961
12856A53259Q424C6495L7620a80181a036j49792B53363a08792D23810c8869F2896
12844a46323a0713G4799K73585A57450d8722D67274D7136b79543C33417l7414
12834B96003b84488C218J75897a91344g1242j74967B23594a79355k2360C99582
$$ plain form
12913 177307 147787 230001 92188 -13194 -187796 136994 140033 -165672 -224652 -82958 9858
12901 58389 -76174 99549 239159 47686 -26797 -224498 180520 -182603 33862 108924 -46774
12889 -165815 43715 224792 -21071 14147 128657 -115314 86858 -100996 122413 340065
12879 340065 143919 -387018 54839 -154284 102981 -108997 46358 -36641 -80740 214221
12868 57511 46783 235812 -153564 271891 70402 250130 161834 135918 -51613 -82032 314961
12856 153259 161683 36495 74115 -180181 -1036 -150828 253363 -108792 423810 -38869 62896
12844 -146323 -10713 74799 348384 157450 -48722 467274 47136 -279543 333417 296003
12834 296003 -284488 3218 179115 -191344 -71242 -246209 223594 -179355 -201715 399582
12823g7511B800b75148A40864m5384J54238r8390a72266h1654B01269k596c36708
12811C70763A27771b92855E9049f9329a7123A16775j2498A0272N7433a25812D06244
12799b38715b592A16049l5522d1049j28159a050j75173A44896J38860F5405b51602
12787A30340Q5319A01571b2913A04131L8975e6260F7147J98503k5516D6596c11636
12775c30512B28272h8045j51142f2020H1856l6896a2313I2192a78043B49288d14482
12763b01237h1295M690A28800a24425J6226A27060a26651D61300a78529f3819
12752I6496b5301J2089C2036a13463b798F9559c08192B11374b20617p3327a6361
12740A07275l348k956M2282l5942C8318b881A20317b53607D20475A31397e440
$$ plain form
12823 -77511 2800 -275148 140864 95480 249718 151328 -172266 -81654 201269 198673 -336708
12811 370763 127771 -292855 59049 -69329 -17123 116775 104277 10272 67705 -125812 406244
12799 -238715 -2592 116049 80527 -41049 -169208 -1050 -176223 144896 283756 65405 -251602
12787 130340 215659 101571 -22913 104131 143106 -56260 67147 265650 240134 46596 -311636
12775 -330512 228272 -88045 -239187 -62020 81856 44960 -12313 92192 -178043 249288 -414482
12763 -201237 -81295 -76605 128800 -124425 -108199 127060 -126651 461300 -178529 -63819
12752 96496 -25301 -13212 32036 -113463 -2798 69559 -308192 211374 -220617 -293944 -16361
12740 107275 103927 100971 143253 107311 38318 -2881 120317 -253607 420475 131397 -5440
12728B98285r9548D6251N7141A0282a10377E3299a17848g235l20741E8572L02539
12717C61111b2245A42798b4672e148j0643m0367F7540K52691j38679M05653D2080
12705B23693q7192l9921m0526J87672k8701R5166N3720B0268J8253a78817A19594
12693a89703F4080c3354C7197b9721e025A21879c56619H4047p258b11245C6690
12681a69609C02508j48093K37140j00871a21854B08996F7685K20419a39109D9822
12670B19753f3686B8925d1860A60570d380A51191h6719C57504B7124J63148J93172
12659C83444J7100j33614E4172J86462L37178A10831g210A91737M9242m8N4106
12648B95037D2053b6863A36618B4525h5768d2840K0995A904a80694A07743h0143
$$ plain form
12728 298285 198737 46251 103392 10282 -110377 53299 -117848 -7235 -327976 58572 361111
12717 361111 -22245 142798 -24672 -5148 -15791 -56158 67540 320231 181552 587205 42080
12705 223693 136501 96580 56054 243726 215025 310191 363911 20268 38521 -178817 119594
12693 -189703 64080 -33354 37197 -29721 -5025 121879 -356619 84047 76789 -211245 36690
12681 -169609 302508 154415 391555 290684 -121854 208996 67685 288104 -139109 49822
12670 219753 -63686 28925 -41860 160570 -4380 151191 -86719 357504 27124 190272 383444
12659 383444 400544 266930 54172 240634 577812 110831 -7210 191737 240979 240931 295037
12648 295037 42053 -26863 136618 24525 -85768 -42840 -21845 1904 -180694 107743 -80143
12636D22884j84862C4331J14484l4298J165d5507D1073J78329L1978I1762K80099
12625C71861D3028c1647B63756o9611D9392p935R6261j4941r166J76900E9567
12613a7039I1524N6597a67798M5918E05016c51785B03108N2397J339e3560k06067
12602b59627B27052C8971M21877k02388E3237B5386N5341K12074b57180B02829
12591i6968A91018e3321J7097A77414b6975j40409A62916L8510i516A95758a64587
12579e2525D60792c0013m8531A89801B6941L4210N27833g4208N504n4580B15511
12567D8289E40K73043B4643a66293A65553R2796m669A01149J17022G2315b93923
12555A02172b82523a25342A1626b58759A01815J72273h9928a6891j83102m7827
$$ plain form
12636 422884 238022 34331 148815 114517 115682 -45507 41073 219402 251380 91762 371861
12625 371861 43028 -31647 263756 194145 49392 41457 137718 122777 113611 290511 59567
12613 -17039 91524 148121 -167798 -121880 505016 -351785 203108 255505 256844 -53560 -259627
12602 -259627 227052 38971 460848 258460 53237 25386 80727 292801 -257180 202829
12591 -96968 191018 -53321 -36224 177414 -26975 -167384 162916 201426 -9516 195758 -164587
12579 -52525 460792 -30013 -78544 189801 26941 61151 588984 -74208 -68704 -123284 215511
12567 48289 540 273583 24643 -166293 165553 258349 253680 101149 218171 72315 -293923
12555 102172 -282523 -125342 11626 -258759 101815 274088 -89928 -16891 -199993 -247820
12545b47820R2242j8327E1794d113l4544j02782A12864l4797K21061A39147a5958
12533A26558J41301B9816b20195C4345K66757J09665c965B00559n5871J000J29719
12522B75407p1848J28469b05600O1526G7574l6568J75764E2506b959B23186J28228
12511C51414A26211c23980c8034E14977C5045e314n0426A33877a04120B03487
12500I0572J26622J08516j33232E6007a6828A49662o053F6120d2084G4666k9757
12489D4909a58571C22657a00972D56502b05263E4598O9621J51743b20799N797
12479b15002A83675O7779j19117f7312A27313l8097a79486h3832M1863A89880
12468B35672E3973b09991m1408J06361I1021J84788j20649o9005K13674H8453
$$ plain form
12545 -247820 -155578 -173905 51794 -4113 -38657 -141439 112864 78067 299128 139147 -15958
12533 126558 267859 29816 -220195 34345 301102 410767 -3965 200559 144688 145688 275407
12522 275407 203559 332028 -205600 -144074 77574 41006 216770 52506 -2959 223186 351414
12511 351414 126211 -323980 -38034 514977 35045 -5314 -55740 133877 -104120 203487
12500 90572 217194 325710 192478 56007 -16828 149662 143609 66120 -42084 74666 44909
12489 44909 -158571 322657 -100972 456502 -205263 54598 124219 275962 -220799 -215002
12479 -215002 183675 251454 132337 -67312 127313 89216 -179486 -83832 -41969 189880
12468 235672 53973 -209991 -251399 -145038 91021 275809 155160 86155 299829 88453
12457b06177C02213c69840a11459A52919J42333a54239N9446B24339a60524n7807
12447b18331c7358r5980C8667J19475c28665J23958A12020d29096B9a67035L0034
12436a37001D9135c924B60189a1935j78147A50060g0522H5249g8862j93011i7448
12424C13108A0274Q938J13334K302E4232d78989a26735p4737P2745b8706o447
12413c5153a4886A74301A0722a01980L6531k65763J18037d1219m8361j31378A27230
12401c5420B46940b29083M7077j15530g6143A29760L115f9587k1252j76607B04078
12389A01469e5724o3932A52855k8596a03190C80013a05858j55712E695b2498Q878
12378a3620g7C0354J69498H4320J05836e6397B46694a25807B33091B4668a16362
$$ plain form
12457 -206177 302213 -369840 -111459 152919 295252 -154239 -94793 224339 -160524 -218331
12447 -218331 -37358 -133338 38667 158142 -328665 -204707 112020 -429096 29 -167035 -137001
12436 -137001 49135 -3924 260189 -11935 -190082 150060 -70522 85249 -78862 -271873 -97448
12424 313108 10274 19212 132546 134848 54232 -478989 -126735 -201472 -128727 -28706 -35153
12413 -35153 -14886 174301 10722 -101980 -65449 -331212 -213175 -41219 -89580 -220958 127230
12401 -35420 246940 -229083 -182006 -297536 -76143 129760 132875 -69587 -90839 -267446 204078
12389 101469 -55724 -119656 152855 124259 -103190 380013 -105858 -261570 5695 -22498 -13620
12378 -13620 -77 30354 199852 84320 190156 -56397 246694 -125807 233091 24668 -116362
12366a14810k4146a7471l08574A94283K66116b60148B04789Q7680j09443l4253
12356A48773b87006A46719E8391a88506N8420A1851K4690J13884m2136K2251C4285
12344B97680a23939j7840C5136L7783a12289H0042l0891a92591A51471B5939J6932
12333D2871M7772e54440A73854a1299k88263h0157I280K13815o4631a39892B23607
12321C16854i4589L9616B61780B8124J53961a74585B36172d8349D0416A3814E09
12309B16187H4562f494A30717n1743J82189o3247J10451A47401f7878K2619A79646
12297C66633a63645N8839B51351A16804b23300m3009F713L56429c45340D8741
12286B92336J80340I9931R3797e9599k91168A53121Q9209a40255B34173B0691
$$ plain form
12366 -114810 -138956 -17471 -326045 194283 460399 -260148 204789 292469 183026 148773
12356 148773 -287006 146719 58391 -188506 -130086 11851 36541 150425 108289 130540 34285
12344 297680 -123939 -141779 35136 72919 -112289 80042 49151 -192591 151471 25939 42871
12333 42871 90643 -554440 173854 -11299 -299562 -80157 9280 223095 158464 -139892 223607
12321 316854 -94589 -54973 261780 28124 182085 -174585 236172 -48349 40416 13814 509
12309 216187 84562 -6494 130717 78974 261163 197916 308367 147401 -67878 -45259 179646
12297 366633 -163645 -104806 251351 116804 -223300 -266309 6713 363142 -345340 48741
12286 292336 472676 99931 193728 -59599 -350767 153121 242330 -140255 234173 20691
12275C4041J48047J69626K02534I0295K01530J98201j74214k0550A13399p300
12265A06099l4434P1800j738J44176G5989K00637A8746J33065C6305K25663j74
12254B61794j27408j8921g335J723B70651f7221K8713k41775A09638m0351K50449
12243C19736i6969A85512f389j33873A81994a86821I6243D4884a199C11804E5307
12231A97755b2822F2174K50444J39062A1130M41059B4372P265Q2088J60157L02401
12220E76283c6369r34B49815q4483A9221K75187M0669A28350a18857A60583J89654
12209C50237A36459B2059a06093A19235n2529K26312j15117J47796O015A09214
12198B30952E3636d0903C17868j21831R4327N6061a08273B8900e3212F35076C3424
$$ plain form
12275 34041 182088 351714 554248 90295 291825 490026 315812 295262 113399 106099
12265 106099 71665 143465 141727 285903 75989 276626 18746 151811 36305 261968 261794
12254 261794 134386 115465 -7335 -5612 270651 -67221 -38508 -280283 109638 69287 319736
12243 319736 -96969 185512 -6389 -140262 181994 -186821 96243 44884 -1199 311804 55307
12231 197755 -22822 62174 312618 451680 11130 452189 24372 31637 113725 273882 576283
12220 576283 -36369 -37303 249815 165332 19221 294408 335077 128350 -118857 160583 350237
12209 350237 136459 22059 -106093 119235 66706 293018 177901 325697 331712 109214
12198 230952 53636 -40903 317868 196037 290364 346425 -108273 28900 -53212 635076 33424
12186A02218K56619A28361l6274a9305C42608j26857F921J66917J08178q1812
12176B00204J04378m770C1364J70668n5030e9966K3262H2080Q1807K49639j27244
12165B86282m5876a10636A29591a36370H3519K0385A0363h5545C52301a12444
12154I4130K72522a66618j79612B00213a18662M7778A20852J35138a37580F6430
12143B03378b03877C41738j11034f2025H7746K53031b73814e7731q0721r744A85481
12131A76458h1482j04351b6071A43143D364i280m1236A68151m3570K79744D9916
12119b4057A48521b83263Q4461D7147A0626a24061B90119a73278h5079D40483
12108C50277h9857j43307A28825M4284D4136b24191F9237c5245A92249p0543J39004
$$ plain form
12186 102218 358837 128361 92087 -19305 342608 215751 6921 173838 282016 200204
12176 200204 304582 299812 31364 202032 147002 -59966 -36704 82080 163887 413526 286282
12165 286282 240406 -110636 129591 -136370 83519 103904 10363 -85545 352301 -112444
12154 94130 366652 -166618 -346230 200213 -118662 -70884 120852 255990 -137580 66430
12143 203378 -203877 341738 230704 -62025 87746 340777 -273814 -57731 -138452 -148196 185481
12131 176458 -81482 -185833 -26071 143143 4364 -9280 -50516 168151 124581 404325 49916
12119 -24057 148521 -283263 -198802 47147 10626 -124061 290119 -173278 -85079 440483
12108 350277 -89857 -233164 128825 173109 44136 -224191 69237 -35245 192249 121706 260710
12097B60710a61115F4746L8159a62078j13612a17674J1500j66284E8719b06899
12086A22773J7164j8031J6515a38295A53442B4557J89030e1513n8405c8875j42711
12075a81586M1729e2994C72478N31140Q95573H97594l69856j38189A48996m3530
12065A05466n0366i5202A18621h8752D0384K99961a69705B73009f5752B13847
12054b36387F0986h1983B88802b36738o7959A07890d9740A92963k3476A3870J47953
12043A61823n7273b83716j22864F4962g2389j4842O545A71426a88543B14691i338
12031c53207P5087a33132B65644D7997a00745I578a82060C0289Q7560i1010A41594
12019A09272j0192a43162A03457I043h4118B0135b5220D7760b3846B9507b16524
$$ plain form
12097 260710 -161115 64746 102905 -162078 -275690 -117674 -106174 -272458 58719 -206899
12086 122773 139937 121906 138421 -138295 153442 24557 213587 -51513 -109918 -38875 -181586
12075 -181586 -139857 -52994 372478 903618 1799191 897594 527738 389549 148996 105466
12065 105466 55100 -95202 118621 -88752 40384 340345 -169705 273009 -65752 213847
12054 -236387 60986 -81983 288802 -236738 -304697 107890 -49740 192963 169487 13870 161823
12043 161823 104550 -283716 -406580 64962 -72389 -87231 -80686 171426 -188543 214691 -9338
12031 -353207 -278120 -133132 265644 47997 -100745 9578 -182060 30289 117849 -91010 141594
12019 109272 99080 -143162 103457 9043 -84118 20135 -25220 47760 -23846 29507 -216524
12007g782j33355A51380p2876M0648b84198d0996I1886l8554P4018k6830d9103
11995d3728E3229f8348A03873h235A13697b07339B36388G1483Q1455e2223k1762
11984g3985H2414A1765J03422g5129m1731B29952a39810I5907N8750a88232A05896
11972h2260j44210A67195p7766J59832h7915p4973O3053D2979R1914b16327A62984
11960I4048h9309c1853j28254g433P75A21089g5248A10056b13091A04604J2374
11949A16978a1370A83004a06428j53714a09338j8574B03317c73069d2192A49573
11938b438A30523a50812A46640a56282C4902a07621M378A27038F2976P095k0540
11927D9531J48560P1273B3029J6741L70662a08385B9247K07241a39082d2733J5481
$$ plain form
12007 -7782 -141137 151380 78504 119152 -284198 -40996 91886 53332 127350 100520 -49103
11995 -43728 53229 -68348 103873 -8235 113697 -207339 236388 71483 152938 -52223 -73985
11984 -73985 82414 11765 115187 -75129 -116860 229952 -139810 95907 154657 -188232 105896
11972 -82260 -226470 167195 89429 249261 -87915 -162888 -99835 42979 134893 -216327 162984
11960 94048 -89309 -31853 -160107 -7433 -6658 121089 -75248 110056 -213091 104604 116978
11949 116978 -11370 183004 -106428 -260142 -109338 -127912 203317 -373069 -42192 149573
11938 -2438 130523 -150812 146640 -156282 34902 -107621 -103243 127038 62976 70071 49531
11927 49531 198091 269364 23029 39770 410432 -108385 29247 236488 -139082 -42733 -27252
11916b7252l61718b9567C4063a3883k81442A35273a1332m5099k3753l80334a65674
11904i8515A65732G3720a00114F4576f7852L1395l32515m3993f0926j29725K8623
11893a62028j21117e4373D729h4773B69531a76263q8712j94406b28633K2386j2778
11882b19025R9042k9879b1487l07221C1730O8092L27645h8297A22724f9494B19208
11870a19050K9528C9804e5383A45052b4828Q311C3104c4619A08296O9854b19700
11858a53003k6518A57942D318P8544h2473B01218B2240a8788C4703a05396B6142
11846B1666a6593p6496A93885e9495E5587a86990B19J50427a51569a6538l148
11835a9686B10006a81595j7599f4062A2703J64383j2173l6459h8907B94246r5721
$$ plain form
11916 -27252 -388970 -29567 34063 -13883 -295325 135273 -11332 -56431 -80184 -460518 -165674
11904 -98515 165732 73720 -100114 64576 -67852 -36457 -368972 -412965 -60926 -190651 -162028
11893 -162028 -283145 -54373 4729 -84773 269531 -176263 -264975 -459381 -228633 -206247 -219025
11882 -219025 -119983 -149862 -21487 -328708 31730 99822 427467 -88297 122724 -69494 219208
11870 -119050 -89522 39804 -55383 145052 -24828 -16517 33104 -34619 108296 178150 -219700
11858 -153003 -179521 157942 4318 82862 -82473 201218 22240 -18788 34703 -105396 26142
11846 21666 -16593 -93089 193885 -59495 55587 -186990 219 150646 -151569 -16538 -19686
11835 -19686 210006 -181595 -199194 -64062 12703 177086 164913 128454 -88907 294246 198525
11824A98525a78445B11846h3446j2302j10632A3305g9271j63062b6686j39509
11814a66195C6622c39053B82666b39194C60341a76321A42517a31428j13706E5614
11803B9651a45518A9608a1909k80583J35509I4253l371j1411B8831b99824g0381
11791A45871F8754i3763A0683J84632c73386A82192b19358B19535e1211k32758
11781b83969B10681m1466o6730k7953b25304A28953J98835e3030B2293a10251
11770B15919h491C05901j01276A4611b45106j36814a35704B2927J2675K16733
11760B52335L5095A0379K74335A9144K91403b68704F8444O9867J32811C1277e022
11748a87660g7474a8525A67440a84063b3920r575l28404G5882C0053a32869C7931
$$ plain form
11824 198525 -178445 211846 -83446 -95748 -206380 13305 -79271 -242333 -26686 -166195
11814 -166195 36622 -339053 282666 -239194 360341 -176321 142517 -131428 -245134 55614
11803 29651 -145518 19608 -11909 -292492 -156983 94253 90882 79471 28831 -299824 -70381
11791 145871 68754 -93763 10683 195315 -373386 182192 -219358 219535 -51211 -283969
11781 -283969 210681 169215 102485 74532 -225304 128953 327788 -53030 22293 -110251
11770 215919 -8491 305901 204625 14611 -245106 -381920 -135704 22927 35602 252335
11760 252335 287430 10379 284714 19144 310547 -268704 68444 138311 271122 31277 -5022
11748 -187660 -77474 -18525 167440 -184063 -23920 -33495 -361899 75882 30053 -132869 37931
11736a27924m3172A27067l2961g3607D5391J76671b57994D0842a52695O1851j42250
11725b33094H0310i0155j5661B47383H8230K52327b33389p1480a3567E1294b04151
11713G7441c02190P3280f1941B25957c34272a09005C44020Q8559h2459A36186
11702a71998A93473J37579b13216j17178B18977b09752C21169J13334b47999a7333
11691D3404a15702K0395r58A00532D2304A6930a89416B58085a28019K5582D1690
11679b74827A08224h71B8821g0278B52823a50290A02955J9743a00541D883b9056
11667a01907A31236A913a40612F3461d4310C35892A31441E2475f2070q0844e4948
11655B47346J57331j55643q6295J61204A48797N3069J70493A20977a94439O0870
$$ plain form
11736 -127924 -171096 127067 94106 -73607 45391 222062 -257994 40842 -152695 -90844 -233094
11725 -233094 80310 -90155 -105816 247383 88230 340557 -233389 -304869 -13567 51294 -204151
11713 77441 -302190 -228910 -61941 225957 -334272 -109005 344020 432579 -82459 136186
11702 -171998 193473 331052 -213216 -330394 218977 -209752 321169 434503 -247999 -17333
11691 43404 -115702 -95307 -96265 100532 42304 16930 -189416 258085 -128019 -102437 41690
11679 -274827 108224 -871 28821 -70278 252823 -150290 102955 122698 -100541 4883 -29056
11667 -101907 131236 1913 -140612 63461 -44310 335892 131441 52475 -62070 -142914 -54948
11655 247346 404677 249034 162739 323943 148797 201866 372359 120977 -194439 -133569
11645a33569k05776C39175b9084E9098R6734J96981A23925j2450b55933A52842
11634A96222C0019c55761A77878b13239d7968C26200J30129f6299E5075M9846
11624A04921M04422B8161a98871b3541B30036B5458b49326d9923A09545j0058
11614I9487A3725A596c0794A29903a18445A05846B9337a62701A5004a34044M1699
11603i2345o0339a1033m31973G0864K68169a11009K1297D54399B1468i5711c0502
11591a7183o1573H1076L8433J33790b20620C23832j24679J95506A06100g0886
11580B46015A07787k5209k2076a35573G6714j8916L77488r3061J3236j54037l3723
11569A67701f4647D47326c6942j71892Q4783A0517K68313M6889d7689A6775R3829
$$ plain form
11645 -133569 -339345 339175 -29084 59098 155832 352813 123925 111475 -255933 152842
11634 196222 30019 -355761 177878 -213239 -47968 326200 456329 -66299 55075 104921
11624 104921 509343 28161 -198871 -23541 230036 25458 -249326 -49923 109545 99487
11614 99487 13725 1596 -30794 129903 -118445 105846 29337 -162701 15004 -134044 -92345
11603 -92345 -152684 -11033 -443006 70864 339033 -111009 -89712 454399 21468 -95711 -30502
11591 -17183 -78756 81076 119509 253299 -220620 323832 199153 394659 106100 -70886
11580 246015 107787 82578 60502 -135573 76714 57798 435286 342225 355461 201424 167701
11569 167701 -64647 447326 -36942 -208834 -124051 10517 278830 325719 -47689 16775 110604
11558A10604J37281E8687a34653q96C52319I0161K93680p2759a65540k1881B67716
11546A15445J61574G4827P9103b69135C85664i1408l3682c9638B91134b75057
11535A04549L7851K55488n2367b10378B7474J57903a38474h664B85336G2193k7727
11524D4466J8936c8180F6229J36016l8719m9546M32844A17608b26011C9154P3077
11513A12231E4640a02388A21164b6225A94900q1466N987L78943B30297A11496
11502A38903L9781l2587K77631H7954i0735B50902f0370A52744P2463r276E1936
11490A52605a76199F804L6099a38998L9671B8198c04441N4355C70129G2459H257
11478I7772M94201B33873D0143O6192I448M032i2308G6726L6644K24722A05525
$$ plain form
11558 110604 247885 58687 -134653 -135549 352319 90161 383841 311082 -165540 -187421 267716
11546 115445 277019 74827 153930 -269135 385664 -91408 -125090 -39638 291134 -275057
11535 104549 142400 397888 345521 -210378 27474 185377 -138474 -8664 285336 72193 44466
11524 44466 63402 -38180 66229 202245 163526 113980 546824 117608 -226011 39154 112231
11513 112231 54640 -102388 121164 -26225 194900 113434 119421 498364 230297 111496
11502 138903 178684 146097 423728 87954 -90735 250902 -60370 152744 225207 215931 51936
11490 152605 -176199 6804 42903 -138998 -99327 28198 -304441 -250086 370129 72459 8257
11478 97772 591973 233873 40143 106335 9448 13480 -92308 76726 113370 338092 105525
11466A55571J33892j32330J08421a53950C68547K0528a39230A35683J4366l4152
11456A15897O5284l7239J98266A7401G722e3788H1007a20982A95018q8298E177
11444C4082J59657o3012K18314a45029A95781b1674a872A1706a22073C10497c36335
11432B11474F6889R2389J24759H2574a76252b2657B21560J4076B0347b27065O9751
11421a57314A00750D9206L17918i2128b6475J1814A75903H880K8616M7728a47980
11409A3455b09306A52917i3976H8437h5087a4038A60195G6685Q4342b69843A69752
11397D5080J7686i7380M0013i34l86937B19913b7913A13346n0533K03184h9849
11385g1322B27873G2728c4202C72640a08811d5845A37949q236f8044E8524R5990
$$ plain form
11466 155571 289463 157133 265554 -153950 368547 389075 -139230 135683 150049 115897
11456 115897 181181 143942 342208 17401 7722 -53788 81007 -120982 195018 106720 5177
11444 34082 193739 130727 349041 -145029 195781 -21674 -1872 11706 -122073 310497 -336335
11432 211474 66889 159278 284037 82574 -176252 -22657 221560 235636 20347 -227065 -157314
11421 -157314 100750 49206 367124 -92128 -26475 -14661 175903 8880 37496 85224 -147980
11409 13455 -209306 152917 -93976 88437 -85087 -14038 160195 76685 161027 -269843 169752
11397 45080 62766 -97380 -57367 -934 -387871 219913 -27913 113346 62813 265997 -89849
11385 -71322 227873 72728 -34202 372640 -108811 -45845 137949 129713 -68044 58524 154514
11374A54514K15042G8896a84218g7449A58767M3391o406e9947A15861E1507L0535
11363H2042J44590c8724F5969O8262a27330D26198I088L5596b13887B67136b441
11351I1696e3065C49514a66929A15044b3714p3554A91150b05395q1216J36225
11341a50386B73207b12322a4635q4369B3440a03316j03835j8464D4133A1883a34192
11329A88351k6181h4471A18475h3018I7085d02863H1929J40521k6843b87247h7676
11317A20310a22306b3126j85017N7557A4451J217c6687J3255j08084j20691j024
11306b53231a00610D5034K809L4607a90641E9582a40074f5496j11108J8746K6185
11295a31673G2963L2047o267J08063m5476C5339b19129R9610k169q3315r7726
$$ plain form
11374 154514 369556 78896 -184218 -77449 158767 202158 195752 -59947 115861 51507 82042
11363 82042 226632 -38724 65969 134231 -127330 426198 9088 44684 -213887 267136 -2441
11351 91696 -53065 349514 -166929 115044 -23714 -97268 191150 -205395 -286611 -150386
11341 -150386 273207 -212322 -14635 -99004 23440 -103316 -207151 -225615 44133 11883 -134192
11329 188351 162170 -84471 118475 -83018 97085 -402863 81929 222450 195607 -287247 -87676
11317 120310 -122306 -23126 -208143 -150586 14451 15668 -36687 -23432 -131516 -252207 -253231
11306 -253231 -100610 45034 47843 82450 -190641 59582 -140074 -65496 -176604 -157858 -131673
11295 -131673 72963 105010 98743 206806 161330 35339 -219129 -119519 -121688 -205003 -302729
11284c02729B23601b40753a0242k5778C05133b234C2206Q3925L64184A79671E7433
11272b19084l3965a3130j76721G5501g8909A91294a80880A53197g6755j14538
11262a91293H7242J83602c3531D05690e5412A72372C1054K58760B5107M32197
11252D57304b20952G2113a0350j28963F7123a42328F2584a41643E6164f09679
11241A88859E9694k5687a29003A06930b29482J06917B08181J53934b10967A5886
11230c54699B16426J30434b45946J08202A42961d54627a81885b2867A11345a30217
11219A5067f9283j77164p1h5197B06494h4090r6732A44527d3916m4024E4614K7763
11207H2377c62044J41391M7005F8908h1106n8765K749j38328E7252J03758i8925
$$ plain form
11284 -302729 223601 -240753 -10242 -36020 305133 -2234 32206 116131 480315 179671 57433
11272 -219084 -253049 -13130 -189851 75501 -78909 191294 -180880 153197 -76755 -191293
11262 -191293 87242 270844 -33531 405690 -55412 172372 31054 289814 25107 457304
11252 457304 -220952 72113 -10350 -139313 67123 -142328 62584 -141643 56164 -609679
11241 188859 59694 34007 -129003 106930 -229482 -122565 208181 362115 -210967 15886
11230 -354699 216426 346860 -245946 -137744 142961 -454627 -181885 -22867 111345 -130217
11219 15067 -69283 -246447 -246518 -85197 206494 -84090 -180822 144527 -43916 -87940 54614 82377
11207 82377 -362044 -220653 -173648 68908 -81106 -139871 -137122 -275450 57252 161010 -98925
11195B83264c6109E2755a45417b9450j74319a8590k39031R595C04053c49295b231
11183b78671B14006a33623k62538C9962a4927F1352b767k866p1262J3362A61170
11171F5692i808l49339b6802E05785a03351o3275j40813n4674B70792e2387B6739
11159B3921J96927b1851A42837a21460B79778a69479a8755k49469a18658K1644
11149i7014A48200m8240K5266C5200a2796o173F6678d4606j98628N8706d6010
11137A18718K08858c89525a92391F00480a181F1062a03249B71135j24985K23871
11127C70021b67759C0867J09596n5559b05167A01987b09921H116K02205a80263
11116a52695B54953f316H8943c9199B40092j05426C1005K61298A16365N4200M4179
$$ plain form
11195 283264 -36109 52755 -145417 -29450 -203769 -18590 -257621 -248026 304053 -349295 -2231
11183 -278671 214006 -133623 -396161 39962 -14927 61352 -2767 -5633 -76895 -63533 161170
11171 65692 -9808 -359147 -26802 505785 -103351 -166626 -307439 -362113 270792 -52387 26739
11159 23921 220848 -21851 142837 -121460 279778 -169479 -18755 -268224 -118658 -97014
11149 -97014 148200 99960 125226 35200 -12796 -18969 66678 -44606 -243234 -184528 -46010
11137 118718 327576 -389525 -192391 600480 -1181 61062 -103249 271135 146150 370021
11127 370021 -267759 30867 140463 84904 -205167 101987 -209921 8116 210321 -180263
11116 -152695 254953 -6316 88943 -39199 240092 134666 31005 292303 116365 170565 214744
11105B14744a81361A45688J50261A12743M67048a260C25545L0474E2040m451K92612
11094C40201a9998p9778B62414K28610j63822P6655A40308J8853k3601O4274L41154
11083E40988B3143g6581c2543C63677K20768j98884p8938j04252c963F03315K4863
11072F28178j50247A29253M4533J68160j28706J85978A08831O34653l30045M7187
11062D60626r7493J89788M0343n3490k36663M43569J05764J8575j76930J74481
11052H68570r6030o0372o6579N53529l35158P4009p6109l94958J15194M59385
11042A041481k7707j00322n3459j79762K4658j38552L25885N5365m10236K70487
11032H07838j91363K47098l56666q1079K60224J1986L46061C13381M99313l4463
$$ plain form
11105 214744 -181361 145688 295949 112743 579791 -1260 325545 356019 52040 47589 340201
11094 340201 -19998 -99776 262414 491024 327202 403857 140308 159161 135560 199834 540988
11083 540988 23143 -76581 -32543 363677 584445 385561 306623 202371 -3963 603315 628178
11072 628178 477931 129253 173786 341946 213240 399218 108831 743484 413439 460626
11062 460626 363133 552921 593264 539774 303111 746680 852444 871019 694089 868570
11052 868570 772540 712168 645589 1199118 863960 937969 861860 466902 582096 1041481
11042 1041481 1013774 913452 859993 680231 704889 566337 892222 947587 537351 807838
11032 807838 616475 863573 506907 425828 686052 698038 1044099 313381 812694 778231
11022G78231n3322o0966J7673L13833j95852l63482N26370m58477K25134j19344
11012F09798P7965j32091K16820k43686J56950k33171M72769j39430j16189P7034
11002G46769C17139M19412k4884q9860j1607J42439J08639j49907K8557k81499
10992D58429O3004L71496O1032l39744M07848k1788R9305l75337K91777K36678
10982A252700j43486Q3372O41031k04244J479Q7859L08744N6817O92486Q410K92537
10971C077705K43196J74044m11861p5621l37093m04408R6132p42397L35145l17354
10961A637488L96018j20551J2902K62567j89148q5936l69893j59871l18493N16132
10951A581215j96820k71347l73291k65652J66030k48541J99987j90982A50292
$$ plain form
11022 778231 724909 663943 681616 995449 799597 436115 962485 504008 729142 609798
11012 609798 687763 555672 772492 528806 685756 452585 925354 785924 669735 746769
11002 746769 317139 736551 711667 621807 610200 752639 861278 711371 739928 458429
10992 458429 521433 892929 953961 614217 1022065 1000277 1099582 724245 1016022 1252700
10982 1252700 1109214 1192586 1833617 1629373 1630852 1718711 2027455 2084272 2776758 2785168 3077705
10971 3077705 3320901 3494945 3083084 3007463 2670370 2265962 2362094 1619697 1954842 1637488
10961 1637488 2033506 1912955 1925857 2188424 1999276 1913340 1543447 1383576 1065083 1581215
10951 1581215 1384395 1113048 739757 474105 640135 391594 591581 400599 150292
10941D0813L56650D1822K15088K45441k09674g4334C4615M9216a7679D94071d3117
10929a39506j15238F0946A5721K63480B1972c0446p2671b324n0418J6123B67326
10917E25674a6841B86273b02046O9136L1226j34474e9662A32573c31408a61943
10906g201m07156B2216M1208b51457A05438Q7692g2415k30829A19635i8545q750
10895a07295B16007a70646M6233e8484j98563J7463B45530o8272c5670j11740
10885a47410B6621c97767A46324b61899I279c6507q3250j18977h4458d1594C18635
10873A17564J30105O7031d0418m620j4337A18755N9506a77599I0850Q795a61713
10861B25832b8174j10636B7151b67315h9934k43055N4583H5014i5305H9892a59422
$$ plain form
10941 40813 397463 41822 256910 502351 292677 -74334 34615 83831 -17679 494071 -43117
10929 -139506 -254744 60946 15721 279201 21972 -30446 -103117 -2324 -52742 -36619 267326
10917 525674 -16841 286273 -202046 -132910 -101684 -236158 -59662 132573 -331408 -161943
10906 -7201 -414357 22216 63424 -251457 105438 193130 -72415 -303244 119635 -98545 -107295
10895 -107295 216007 -170646 -124413 -58484 -257047 -239584 245530 177258 -35670 -147410
10885 -147410 26621 -397767 146324 -261899 9279 -36507 -119757 -238734 -84458 -41594 318635
10873 117564 247669 314700 -40418 -45038 -59375 118755 178261 -177599 90850 99645 -161713
10861 225832 -28174 -138810 27151 -267315 -89934 -332989 -278406 85014 -95305 89892 -159422
10849a76693k5760G2711B1804a1901A96252a05662r035j37747A24235a21388b4896
10837E3937a22816K8364A34279O2184N6807b29205A28319a89915A04786d34326
10826i4237A45688b24013d3959J7942A93614a8351h78k3235A11913a61545B95746
10814b78125l7579a41538N1132A54653h6633l04887h0272H2957i4564j5880C39091
10802a58018A0853j390b74202a9096l10856J41499A16256e045j27420h258p089
10791a5347A73115A1026a6770A12804a28343L4722E5930b00623B08335g0456j10955
10780a81411D2055N2187b1111j27057D1992L9409a23259D0380L9409b24430D8983
10768B41688b27059J1123d2240B03040c0064a3020H5282f1762B105K66601H0030
$$ plain form
10849 -176693 -202453 72711 21804 -11901 196252 -105662 -114697 -252444 124235 -121388 -24896
10837 53937 -122816 -94452 134279 196463 253270 -229205 128319 -189915 104786 -434326
10826 -94237 145688 -224013 -43959 -26017 193614 -18351 -878 -24113 111913 -161545 295746
10814 -278125 -315704 -141538 -90406 154653 -86633 -391520 -80272 82957 -94564 -110444 339091
10802 -158018 10853 9463 -274202 -19096 -329952 -188453 116256 -5045 -132465 -8258 -15347
10791 -15347 173115 11026 -16770 112804 -128343 -93621 55930 -200623 208335 -70456 -181411
10780 -181411 42055 94242 -21111 -148168 41992 81401 -123259 40380 79789 -224430 48983
10768 241688 -227059 -215936 -42240 203040 -30064 -13020 85282 -61762 2105 268706 80030
10756c28249a04270J7718K9396A2655a36415K633q4870J4709q7412b7461A36554
10744B18042a87753j7698B30318a94520F9193a58168C8815K20934f1174j52793
10734b13967b6043F0916J19084E0935L9821a65728D0658J67827a15832B2151L6953
10723E9104e1268J2205E28935a49837C3097a33805b5490A23215a84603B26869
10712a00741j46039Q5374o8431A22052m9243a18780N8833O771A02588B2176h4206
10700C06818b49584J16919A08704b46690J16430B98823c34260a34961E7856a20300
10689c2477l47367I4870D5293g948C8193A7667a41324l60962B9158b26905A70082
10677F2852k3362a02859d5111J7066k47942C88371a96147R5308I4484d8968m3769
$$ plain form
10756 -328249 -104270 -86552 -57156 12655 -136415 -133782 -218652 -203943 -291355 -27461 136554
10744 218042 -187753 -205451 230318 -194520 69193 -158168 38815 259749 -61174 -213967
10734 -213967 -26043 60916 180000 50935 90756 -165728 40658 208485 -115832 22151 59104
10723 59104 -51268 -39063 528935 -149837 33097 -133805 -25490 123215 -184603 226869
10712 -100741 -246780 -161406 -229837 122052 72809 -118780 -59947 -53176 102588 22176 -84206
10700 306818 -249584 -132665 108704 -246690 -130260 298823 -334260 -134961 57856 -120300
10689 -32477 -379844 94870 45293 -7948 38193 17667 -141324 -502286 29158 -226905 170082
10677 62852 39490 -102859 -45111 -28045 -275987 388371 -196147 -100839 94484 -48968 -92737
10666i2737J4963j17297O345l4143A08418B6691J76236d8011l90626C49651a16925
10654c21382a51787r909j6524e6307k33131i2197K9667L0767A80624a58455J0900
10643a47555A45713Q5333a67715L661A31323N9603e43360a82844p7620N3190c5296
10631c0531H632j28b00012H1521a09716A41830a7309A31447c03786m4730f3211
10619c8362B77063d89957a35j58816D2016a74112a1050j22380A4331a8143j60431
10608a78574m1117M7623M5494L3279o9659B59338b11560L8164d135j49110E4544
10596b0110B31338c63565a41584l19515K29489H315O8021K02952a57261k0424
10586a77685M9087E4052a75226M9998b6240A32074a37016J9521E1670c39464A92687
$$ plain form
10666 -92737 -77774 -195071 -188726 -222869 108418 26691 202927 -48011 -438637 349651 -116925
10654 -321382 -151787 -161696 -178220 -56307 -289438 -92197 -62530 -31763 180624 -158455 -147555
10643 -147555 145713 231046 -167715 -164054 131323 190926 -543360 -182844 -260464 -207274 -35296
10631 -30531 8632 8504 -200012 81521 -109716 141830 -17309 131447 -303786 -348516 -63211
10619 -38362 277063 -489957 -135 -158951 42016 -174112 -11050 -133430 14331 -18143 -178574
10608 -178574 -219691 -172068 -126574 -93295 -162954 259338 -211560 -173396 -4135 -153245 54544
10596 -20110 231338 -363565 -141584 -461099 -231610 8315 76336 279288 -157261 -177685
10586 -177685 -128598 54052 -175226 -125228 -26240 132074 -137016 -117495 51670 -339464 192687
10574B914c2528n6196c7482l34123F6571b42703k6056g1441A79817c06487A31790
10562A78374a9339M529k4105j24210D0479c4967l34144b8024B70779m9407b08899
10550B35135N6682A20641A9540b97211A15982h2705m3561j29902J02748A71247
10539a78285j98003a35403A15914a57973J391A03198F99K1438J17816M7296G9880
10527B11017i564A31443i5863G1559a37k66456K6194a7705E4817J8139b19677
10515B8281c8702F0170d9229H8079a38827A65984O8879i9456F6209J3526d6364
10503f3348C2720N0344C1358a97321C17372c44655a66186G6142a39994F3719J28849
10492A92568R283d18920A5746J43053D0248J09391J37174b4490B5296K08767j8174
$$ plain form
10574 2914 -32528 -88724 -37482 -371605 66571 -242703 -268759 -71441 179817 -306487 131790
10562 178374 -19339 -14810 -38915 -163125 40479 -34967 -369111 -28024 270779 221372 -208899
10550 235135 291817 120641 19540 -297211 115982 -82705 -126266 -256168 -153420 171247
10539 -178285 -376288 -135403 115914 -157973 -156582 103198 699 22137 139953 187249 79880
10527 211017 -9564 131443 -95863 71559 -137 -266593 -240399 -17705 54817 72956 -219677
10515 28281 -38702 60170 -49229 88079 -138827 165984 234863 -99456 66209 79735 -46364
10503 -63348 32720 83064 31358 -197321 317372 -344655 -166186 76142 -139994 63719 192568
10492 192568 201851 -418920 15746 158799 40248 149639 286813 -24490 25296 234063 215889
10481B15889K0605M7717L22379B05660h7205D591K8348R7219B6786J11669a33458
10469a94015j47924E8980c11845B20895A0435L45651j61882a5200k78694B98867
10458b08893B6288b8705l4730I8205J961B1686b87872B19070r6744a2874j09839
10447a22713C8435J25891J45441b00081L898b6150C636K92429g6975C7227b5901
10435D30285I6346J3386i633A52298b53273a02711A18482D971e2137B44269l5498
10424B08771a017j68960k58646a41980m2608c7061D9485a08009A13220N00o131
10413A07589d791A7674A490c2119k65853A10933K9217E704b75765C6118b86795
10401b41004O3822D0483b41813L0709J3419E4467J1075J96462B944O1239R424
$$ plain form
10481 215889 236494 284211 606590 205660 -87205 4591 32939 130158 26786 138455 -133458
10469 -194015 -341939 58980 -311845 220895 10435 356086 194204 -15200 -293894 298867
10458 -208893 26288 -28705 -63435 98205 100166 21686 -287872 219070 122326 -12874 -122713
10447 -122713 38435 164326 309767 -200081 -196183 -26150 3636 296065 -76975 37227 -25901
10435 430285 96346 109732 -9633 152298 -253273 -102711 118482 4971 -52137 244269 208771
10424 208771 -1017 -169977 -428623 -141980 -184588 -37061 49485 -108009 113220 113720 107589
10413 107589 -4791 17674 1490 -32119 -297972 110933 140150 5704 -275765 36118 -286795
10401 -241004 -177182 40483 -241813 -211104 -197685 54467 65542 262004 2944 64183 73607
10390G3607b9858I528a43804D9863K34163p7313b12808A44648a10554A33575C135
10378E59260K3560k25136j12014j20243D9457L88712A28016K14554k8293M3752
10368C58029k8569p4674Q6951J35964j03745P8094p5954j14510R7104C0791K81349
10357C12140J3208h2823A3143g0174C00266L5510K55564m3938J8587k48032n7051
10346B60906j03968J73187K32248j52429j67575A18344K21085a42093A97408L85182
10336E82590B19050K1076E7698J91858a91563B93772g7545A7235J50595J23414
10326B91244p2278L0933k3177J86417j8650j14878B3285N1964N0423a59733F4481
10314g9802C41006a10695A69885b09201A00623C259Q9781b63656a3292q5931E6913
$$ plain form
10390 73607 -29858 9528 -143804 49863 284026 206713 -212808 144648 -110554 133575 3135
10378 559260 582820 357684 245670 125427 49457 438169 128016 342570 314277 358029
10368 358029 329460 254786 341737 477701 373956 452050 376096 261586 358690 30791 312140
10357 312140 325348 -82823 13143 -70174 300266 335776 591340 547402 565989 317957 260906
10346 260906 156938 330125 562373 409944 242369 118344 339429 -142093 197408 582590
10336 582590 219050 240126 57698 249556 -191563 293772 -77545 17235 167830 291244
10326 291244 218966 249899 226722 413139 394489 279611 23285 75249 125672 -159733 64481
10314 -79802 341006 -110695 169885 -209201 100623 3259 93040 -263656 -13292 -99223 56913
10302C64707c37845A28187E401J90690b96138F0197g9654b0512E8396a12954I3082
10290a26117c6787G5287P2480o4345a76201g4301A27577b84670B95584j08113
10280A87471b30524G8299a47674p2715C7093m774c8239j30896K0601m0021A66361
10268b2212C59097I1665J37286A08314b75216A21532M0030E0059M28535B22407
10257A96324L45674j2791A80498J37286j0380G7236b7876j11131C55692A67577
10246E1525b32803n1402a3547k97500G0986c70224g1405q6119e3607H5180C6540
10234g5559a8827n8760B17165m6319A8754b73459a21295d7829a4114k6973A07112
10222D864O3791g3259l3096n5740r766j44356E0623a32017l1615M0873l2474H260
$$ plain form
10302 364707 -337845 128187 5401 196091 -296138 60197 -79654 -20512 58396 -112954 93082
10290 -126117 -36787 75287 147767 83422 -176201 -74301 127577 -284670 295584 187471
10280 187471 -230524 78299 -147674 -220389 37093 32319 -38239 -169135 -148534 -188555 166361
10268 -22212 359097 91665 228951 108314 -275216 121532 161562 50059 478594 222407
10257 196324 541998 529207 180498 317784 307404 77236 -27876 -139007 355692 167577
10246 51525 -232803 -284205 -13547 -311047 70986 -370224 -71405 -157524 -53607 85180 36540
10234 -75559 -18827 -77587 217165 170846 18754 -273459 -121295 -47829 -14114 -41087 107112
10222 4864 68655 -73259 -106355 -162095 -171861 -316217 50623 -132017 -163632 -122759 -155233 8260
10209A0474a0076D546J90943m0258b03708i1576d2082j95449A49646C4500a88622
10197d27228J52827f2638n5199B29121E07a17877C052N6848O0712R0584a03542
10185E9644M627b90127J13762O7128A95591a04004B034N18291B6818a93489e0579
10173b90911D9006b60486j7514M8122B04775b25519B03767l4018c42126A4391
10162a14446E8821K43885A36434C2916i8683b4296n9986j03326i434B23493d29872
10150d3879B05127a87370e3222j7420o6096q5388D6562c0850l35510C9567f4174
10138b03932B3836c91054a73427a3548p2507L9745p8309M5191p5556g0001r0873
10127a60874L1304C25472d30874B8334a35830I0315b33608A99033a47078C56280
$$ plain form
10209 10474 -10076 4546 195489 155231 -203708 -91576 -42082 -237531 149646 34500 -188622
10197 -427228 -274401 -62638 -117837 229121 507 -117877 3052 59900 120612 211196 -103542
10185 59644 64271 -290127 -176365 -109237 195591 -104004 2034 520325 26818 -193489 -50579
10173 -290911 49006 -260486 -278000 -229878 204775 -225519 203767 169749 -342126 14391
10162 -114446 58821 302706 136434 32916 -98683 -24296 -84282 -187608 -9434 223493 -429872
10150 -43879 205127 -187370 -53222 -70642 -136738 -222126 46562 -30850 -366360 39567 -64174
10138 -203932 23836 -391054 -173427 -13548 -86055 -46310 -124619 -79428 -154984 -70001 -160874
10127 -160874 -129570 325472 -430874 28334 -135830 90315 -233608 199033 -147078 356280
10116A04378b96011J27165A49800m499i250k12905g8564l2794K7842A1964L7572
10105D9536J8002a12642r80D1428a00580n2295j07276K1460E5564D920K37668
10094B42588i6405k64021J18654d8877A62660a7518G2252N9818m1027a52893j07972
10083b60865A14400b53286J24750q5891A14637g4822k6162K5080j25733b011n12550
10072e14561a78100g8847A02092b38442o0201c6945C188d69487A21788O1429J61311
10061C44528c5397k37520J02908F3793J18337n7033a04057A10526a18112e0606
10050b95931e5350q7585o3580p5306c3549A11047l3683a14914o3836k47927q3502
10039e10179f0691A5637J62821b68859j85d7265Q721q6711m65635A17291k9327
$$ plain form
10116 104378 -296011 -168846 149800 145301 -9250 -222155 -78564 -111358 -83516 11964 49536
10105 49536 67538 -112642 -113622 41428 -100580 -152875 -260151 -238691 55564 4920 242588
10094 242588 -96405 -360426 -241772 -48877 162660 -17518 72252 132070 91043 -152893 -260865
10083 -260865 114400 -253286 -128536 -214427 114637 -74822 -100984 -75904 -201637 -2011 -514561
10072 -514561 -178100 -78847 102092 -238442 -298643 -36945 3188 -469487 121788 183217 344528
10061 344528 -35397 -272917 -170009 63793 182130 125097 -104057 110526 -118112 -50606
10050 -295931 -55350 -142935 -206515 -281821 -33549 111047 77364 -114914 -178750 -426677 -510179
10039 -510179 -60691 15637 178458 -268859 -269044 -47265 -38544 -125255 -590890 117291 87964
10028H7964J26826i1223E4356J3093J31472K6539f9628H6667J501b44950a07571
10016a39761C46460i6305k24530J33638K8956O8618J0974a7877j99927J01713
10006a16091L743C2296a6449B79023a05755g930j14074j9498B12404E9717c54864
9994f2241C62597E4354b00203B8824b41281c6558j93588A7082J38975m0645j1582
9983A03830m2051f6459b8489B4171P1879a60651j04564B93827a30725q1177K3821
9972a88081j2356k9753M0220A14397a41262k82098A6480J9243a12016j15458f5422
9960b04928j11269f0238l9321l04810I8776b76577a14241G7099J64600b42632
9949A20478a38990c3980q2136b5740k9583A0256M378a34223K1593b7463A3533
$$ plain form
10028 87964 214790 -91223 54356 67449 198921 225460 -69628 86667 88168 -244950 -107571
10016 -139761 346460 -96305 -320835 -187197 -158241 -89623 -78649 -17877 -217804 -116091
10006 -116091 -112348 32296 -16449 279023 -105755 -7930 -122004 -141502 212404 59717 -354864
9994 -62241 362597 54354 -200203 28824 -241281 -36558 -230146 17082 156057 115412 103830
9983 103830 61779 -66459 -28489 24171 96050 -160651 -265215 293827 -130725 -211902 -188081
9972 -188081 -200437 -230190 -189970 114397 -141262 -423360 16480 35723 -112016 -227474 -65422
9960 -204928 -316197 -60238 -99559 -404369 98776 -276577 -114241 77099 241699 -242632
9949 120478 -138990 -33980 -116116 -25740 -55323 10256 14634 -134223 -112630 -27463 13533
9937A66860c3184k77264B75886b45744G5339M3237E5501b06215R9094G3541b64900
9925b00188D6968K65188a76782A19299J14179k2815A01903j3840a77019A66158
9914I9236b62336r8322J0016a57991o8009M0563e4019j17385M1611A96150a02227
9902c8771F2094J06518a03134r2800P4772B04385E4983j0960a5549j75698r5865
9891b87112L4665i9860j05391q1736a9977B0880L5135d8243r4509L7824m0592
9880a45520r6477p0233a08598f869A05532a3970j30670D1810a13224I1683l538
9869H8145a70306L509f1658D7493K9725g996j10771m9091e1704k7303n4125A97136
9856B07410m4213K5028a21887B5081b95457A6060b18895j23041B26387b66288
$$ plain form
9937 166860 -33184 -310448 275886 -245744 75339 118576 55501 -206215 -107121 73541 -264900
9925 -200188 46968 312156 -176782 119299 233478 210663 101903 88063 -177019 166158
9914 99236 -262336 -360658 -350642 -157991 -226000 -185437 -54019 -171404 -129793 196150 -102227
9902 -38771 62094 168612 -103134 -195934 -121162 204385 54983 44023 -15549 -191247 -287112
9891 -287112 -252447 -99860 -205251 -286987 -19977 20880 56015 -48243 -142752 -104928 -145520
9880 -145520 -241997 -312230 -108598 -6869 105532 -13970 -144640 41810 -113224 91683 88145
9869 88145 -170306 -166797 -61658 47493 77218 -7996 -118767 -167858 -51704 -79007 -133132 197136
9856 207410 163197 188225 -121887 25081 -295457 16060 -218895 -341936 226387 -266288
9845a84548r1052B66444a65971A12582N3976d8319k36181l6712a05826k22n4148
9834a60196A05542b01499C6939d46613F8935l1976J91970I4842K4753b86524N4308
9823b32216b1611j08263C9917P5940J59306C4475c523l51690A17290b76754e4146
9811E9962J89681b8146B00645p5623a36720H1000c2601k30700A04557J14721q857
9800B10421f424r8213F5641a13710L947D3261a72503e7473k91129b1311j00273
9789a21584A90033b99682j8029B1447i2401J6778j37016p9444a00534L269j08990
9778b06255R4465k00120A59161M5504b65663e216A36943b7294D2805c58584a69864
9766e2443C12165c2827r9058j44809A18400J51410b9335J2701j25011J6657p5660
$$ plain form
9845 -184548 -275600 266444 -165971 112582 166558 -48319 -284500 -321212 -105826 -106048 -160196
9834 -160196 105542 -201499 36939 -446613 68935 36959 228929 94842 119595 -286524 -232216
9823 -232216 -21611 -129874 39917 115857 275163 34475 -3523 -355213 117290 -276754 -54146
9811 59962 249643 -28146 200645 125022 -136720 81000 -32601 -263301 104557 219278 210421
9800 210421 -6424 -104637 65641 -113710 -109763 43261 -172503 -57473 -348602 -21311 -121584
9789 -121584 190033 -299682 -317711 21447 -92401 -75623 -212639 -292083 -100534 -97265 -206255
9778 -206255 -111790 -311910 159161 204665 -265663 -5216 136943 -27294 42805 -358584 -169864
9766 -52443 312165 -32827 -131885 -276694 118400 269810 -29335 -16634 -141645 -124988 -200648
9755b00648J6494l0367O0867N3498m0028j25891A09116a64372j7993c0226E3618
9743d9962a2551E6109Q6807a72768k81113f3099A7468h9160j14732A1627J05071
9732A16698b23827B01665Q5682g0804B7812a79719A14612c17854d0054j36003
9722a76057J0119q7612H9482a36719e7601f232B76002b48193i9831j20789j70908
9711c91528b5868j44279P6055m6775j10020G284c27960a47619f6128K6706o9126
9700a08548k01831B10444e9641a6713l49580J40367I6840a30786j40834a15831
9689a68364a9433k65402B4680c17121h5553B67134A01134b40992j27395h8388
9678A03015L2912g1531a2743j14679K3084A34358c68654a51396H464J87244a35256
$$ plain form
9755 -200648 -184154 -214521 -153654 -100156 -140184 -266075 109116 -164372 -182365 -30226 53618
9743 -49962 -12551 56109 142916 -172768 -453881 -63099 17468 -89160 -203892 11627 116698
9732 116698 -223827 201665 287347 -70804 27812 -179719 114612 -317854 -40054 -176057
9722 -176057 -165938 -253550 89482 -136719 -57601 -6232 276002 -248193 -99831 -220620 -391528
9711 -391528 -25868 -170147 -94092 -140867 -250887 7284 -327960 -147619 -66128 -39422 -108548
9700 -108548 -310379 210444 -59641 -16713 -366293 -225926 96840 -130786 -271620 -115831
9689 -168364 -19433 -284835 24680 -317121 -85553 267134 101134 -240992 -368387 -88388
9678 103015 135927 -71531 -12743 -127422 -104338 134358 -368654 -151396 8464 195708 -135256
9666D6265g114A70745b71944I6534p257C333b41489A3449J56105l4167a8701n4166
9654g2867A74283D3947b15384B14857a71323j92218I4847c33697B3805b0315j6656
9643c6971J1403k18805M4370Q4223j43537A55187a30623a2033A72834o8811M7949
9632A51972e4262C8044a20790B10349C1004a18765J8930A10773c1299B58685c86191
9620i0253j34727n85k18162f9940l43582a6182F0575M768E920L06642a04007o4003
9608a68010q6118g0914L1382p0255E783a233n2178k7983B4562b17906f8484A18538
9595a5238l08290M4876a36532n3529e400C31116a79617B21583o8524b08659N9761
9584a48898p0692J9743i537H2725b02808b2975A3221a56498b0770l31196m956
$$ plain form
9666 46265 -7114 170745 -271944 96534 89277 3333 -241489 13449 169554 135387 -18701 -72867
9654 -72867 174283 43947 -215384 214857 -171323 -363541 94847 -333697 23805 -20315 -36971
9643 -36971 -25568 -244373 -200003 -115780 -259317 155187 -130623 -12033 172834 104023 151972
9632 151972 -54262 38044 -120790 210349 31004 -118765 -99835 110773 -31299 258685 -386191
9620 -90253 -224980 -225565 -443727 -69940 -413522 -16182 60575 65343 5920 312562 -104007 -168010
9608 -168010 -254128 -70914 -39532 -109787 5783 -1233 -53411 -81394 24562 -217906 -68484 118538
9595 -15238 -323528 -278652 -136532 -190061 -5400 331116 -179617 221583 153059 -208659 -148898
9584 -148898 -219590 -199847 -9537 82725 -202808 -22975 13221 -156498 -20770 -351966 -356922
9573c56922B33480a32182o5335A69823a08849A18977c86383A4835a73278B37868
9562B440a96736h834p3050k30611a16698j47363B41416I8727a32825E2537a18161
9550c84425b9134E5010a69661j70664j57013a80689f5536A26013b09734r1859
9540c01593A28231E0379O254g5370j36724o9347A07302A4467J54082a69773c9734
9528a58431A02219K22678a1871H3117b57624A15787c55992a45137D3302i517j97412
9517b06929C9156a98454B4821L20059j57539a07114H8547B3451j0308M7187k9707
9506C0623a54829A16770a80151h6537b8034k29622c3979A3300a10673j31259b2112
9494F43b73351a16619r2054R8534J6000A14569b412B3928A1714d58391A82529
$$ plain form
9573 -356922 233480 -132182 -197517 169823 -108849 118977 -386383 14835 -173278 237868
9562 2440 -196736 -8834 -81884 -312495 -116698 -264061 241416 98727 -132825 52537 -118161
9550 -384425 -29134 55010 -169661 -340325 -497338 -180689 -65536 126013 -209734 -301593
9540 -301593 128231 50379 56633 -75370 -212094 -281441 107302 14467 168549 -169773 -39734
9528 -158431 102219 324897 -11871 83117 -257624 115787 -355992 -145137 43302 -9517 -206929
9517 -206929 39156 -198454 24821 344880 187341 -107114 88547 23451 13143 60330 30623
9506 30623 -154829 116770 -180151 -86537 -28034 -257656 -33979 13300 -110673 -241932 -22112
9494 643 -273351 -116619 -208673 -110139 -94139 114569 -2412 23928 11714 -458391 182529
9482c548A09769K431f6742l4989D80366e5650B58297B0650a01628j74871e1812
9470a5101C7530f4465j59073n6780d9259j81385i0097j04816N9417B18453H2324
9458c73030i0335j57094A02068d2103H1481N8897K765n4524e7290j80911j65763
9447d03964G479a06024a2074I2789a30209H0637b67935c5096j62163a4975G7866
9435a39625j78177J28468B69861E8354e3200A67030M6939b7441k75033P5739A5492
9423a78472B835J5971a53605A38852a50912E2117d5863D3919c1869A01737d40146
9411F3962d0829F4438i7522j69861J22807A21865g1622q20k3531a3708G2010i5332
9398D3815e6617A7335J57031K68579e8537n9936d2859k01424i2413j46115F149
$$ plain form
9482 -3548 109769 112200 -66742 -101731 480366 -55650 258297 20650 -101628 -276499 -51812
9470 -15101 37530 -64465 -223538 -280318 -49259 -230644 -90097 -194913 -135496 218453 82324
9458 -373030 -90335 -247429 102068 -42103 81481 140378 143143 88619 -57290 -238201 -403964
9447 -403964 7479 -106024 -12074 92789 -130209 80637 -267935 -35096 -197259 -14975 77866
9435 -139625 -317802 -189334 269861 58354 -53200 167030 213969 -27441 -302474 -226735 15492
9423 -178472 2835 18806 -153605 138852 -150912 52117 -45863 43919 -31869 101737 -440146
9411 63962 -40829 64438 -97522 -267383 -144576 121865 -71622 -72442 -95973 -13708 72010 -95332
9398 43815 -56617 17335 174366 442945 -58537 -118473 -42859 -244283 -92413 -238528 6149
9386a33742M9655j03660B37525o7445P640a77670j1456A44580b04270d8602p7672
9375a26274j58871i1098l8496M2202k59181B4065J7889K05056E3489b05174j49286
9364c54460a07555k61652B54763b10417a03979A54205c7328F699a45205M5439
9354i9766J1988k35053A71157c57901B6837L9346a18982a2693A18899d7593j0710
9343e8303A72559a46992I0565J88845d51831J41014F722a83540j30804a45696
9332d00168G9133a39152k24490J64700j25389F0864M1216B4312b25453K4773A9439
9320a41009D171a39268o4241g3374G7368b68255p269P4316I73b98594e0513n4065
9308a04578B04772Q5517A02961O1116B3892b61389E2514f5504l40364g7696J0913
$$ plain form
9386 -133742 -84087 -187747 237525 170080 177720 -177670 -189126 144580 -204270 -48602 -126274
9375 -126274 -285145 -91098 -129594 -87392 -346573 24065 41954 247010 53489 -205174 -354460
9364 -354460 -107555 -369207 254763 -210417 -103979 154205 -37328 6699 -145205 -99766
9354 -99766 -87778 -322831 171157 -357901 26837 66183 -118982 -12693 118899 -47593 -58303
9343 -58303 172559 -146992 90565 279410 -451831 -310817 6722 -183540 -314344 -145696
9332 -400168 79133 -139152 -363642 -198942 -324331 60864 102080 24312 -225453 -200680 19439
9320 -141009 4171 -139268 -203509 -73374 77368 -268255 -275524 -201208 973 -298594 -50513 -104578
9308 -104578 204772 290289 102961 164077 23892 -261389 52514 -65504 -405868 -77696 -66783
9297f6783H3209J6311J43296A2916a55180P5715G7214K0359b27523d1991A10970
9285f4863A74347G1811M1160l6476i8145J4524B49338i0624A02139R4182a95602
9273d9805q9227M4399j80860C05209a42007K0263b0909j81649P5393e8282A3748
9261E941f9670K040l00744A27960d93832a31967j16923a4724A20557n0015j6309
9250E4233A3324m589c1140C0897d77682b24474A4691L44838d0829j21882n8601
9239b21312p8177R6839f054m3248C1595g0198B20647f758m897l86702j4221J74028
9227b38550d9606p6969A8910c53499M9495A28941d550l56589c2495l5086F0382
9215A69237d6084m6870K4471B18826B0375J15387I848Q1258C2514J4289b24176
$$ plain form
9297 -66783 83209 99520 242816 12916 -155180 -79465 77214 97573 -227523 -41991 110970
9285 -64863 174347 71811 112971 76495 -98145 -83621 249338 -90624 102139 196321 -195602
9273 -49805 -139032 -94633 -275493 305209 -142007 -121744 -20909 -202558 -127165 -58282 13748
9261 5941 -69670 -67630 -368374 127960 -493832 -131967 -248890 -14724 120557 70542 54233
9250 54233 13324 8735 -31140 30897 -477682 -224474 14691 359529 -40829 -162711 -221312
9239 -221312 -299489 -202650 -6054 -49302 31595 -70198 220647 -6758 -11655 -398357 -412578 -238550
9227 -238550 -49606 -126575 18910 -353499 -304004 128941 -4550 -361139 -32495 -67581 60382
9215 169237 -46084 -92954 -68483 218826 20375 135762 9848 91106 32514 46803 -224176
9203a18999B28486d17758A64231l6480g0625H1498e03659b05099H267f8622L300
9192f5322K2894j585K0025j66813A38844a64564D483a51577N1592n0975A45778
9180c27374e1137o1318l135A90351a48752B60111b69707C7916a23802M1511n0987
9169a33278B34715a29889k01491O6660L4392a14409q1087N8716k2022A08626a31966
9157F3842l236a49702e7023n8973A31484K92154B282N8851h7418j77887A50478
9145h7381l50133B53502b38829h9236G0418a7367j51086O4504j8989A49198k9633
9134A19565a59192A24395a52811k72537a30398G3777b88032D29222a15223k73339
9124c88562a62794j67108a47076E6736b04858A10281a88732N7425j29994A34124
$$ plain form
9203 -118999 228486 -417758 164231 127751 -70625 81498 -503659 -205099 8267 -68622 -65322
9192 -65322 -42428 -44013 -23988 -190801 138844 -164564 4483 -151577 -99985 -150960 145778
9180 -327374 -51137 -112455 -115590 190351 -148752 260111 -269707 37916 -123802 -82291 -133278
9169 -133278 234715 -129889 -331380 -264720 -230328 -114409 -195496 -136780 -158802 108626 -131966
9157 63842 60606 -149702 -57023 -115996 131484 423638 2282 61133 -87418 -265305 150478
9145 -87381 -437514 253502 -238829 -89236 70418 -17367 -168453 -103949 -122938 149198 119565
9134 119565 -159192 124395 -152811 -425348 -130398 73777 -288032 429222 -115223 -388562
9124 -388562 -162794 -329902 -147076 56736 -204858 110281 -188732 -131307 -261301 134124
9113a72285J2013J1860c6691j73040l5926F3834a20654o4694C7357c04416a16410
9101C8540d7626B20466a59494g9626B00976E3171L2061a36357j15667l9358i9959
9089i4494j34126A40515c40702c63l30307F7567c1741A01125b68513i9918r4139
9078a94057B4984a40954A70333A4605g6213q5638C75358a1293p5476k84698J52222
9067b19245b964H6995a20494k15546e5772K3075k77256q2742a72911c0051p1288
9056a01339B41882b31608a15212d4307A58549C9711L7411a07658A95485I3262
9045D21290A66162d16506C91783E8747c69793P1586J04650e2286j48000o1411
9035b61697k7677A04938D6520c1244n1346o7116j53785J37468b4197B274O4134
$$ plain form
9113 -172285 -160272 -148412 -36691 -209731 -245657 63834 -120654 -185348 37357 -304416 -116410
9101 38540 -47626 220466 -159494 -79626 200976 53171 85232 -136357 -252024 -291382 -99959
9089 -94494 -228620 140515 -340702 -363 -330670 67567 -31741 101125 -268513 -99918 -194057
9078 -194057 24984 -140954 170333 14605 -76213 -161851 375358 -11293 -86769 -371467 -219245
9067 -219245 -2964 86995 -120494 -336040 -55772 -32697 -309953 -392695 -172911 -30051 -101339
9056 -101339 241882 -231608 -115212 -44307 158549 39711 77122 -107658 195485 93262
9045 421290 166162 -416506 391783 58747 -369793 -298207 -193557 -52286 -200286 -261697
9035 -261697 -289374 104938 46520 -31244 -82590 -149706 -303491 -166023 -24197 2274 66408
9024F6408K62833a24086j28317R3716P3066K6987B20968a26226A94363A9630J23967
9013A43597b59906J03762L083D08524a01900j35166C0735J70991r2089b83559
9002a43696k61645A69127A1750b10071Q8678F0523Q1579b03531o7453N2774N0676
8991a67534n162m3490k2013M5605O0415k2034a3116j5217C00291P5782a44476
8979g9835n4773k5194D1317q055a08300d7829e910A04969a11813k31459G1442
8967a44418A71825g5655l47686A14799c6415C5982e8536j40869d6396j53330j61975
8956c61701a20435D1770R7532c2375n4484Q827A61356J02088c1402H0492L4857
8945A15349J06656c44195D38495c42430i2330c0390A86429A0663b84789G0034
$$ plain form
9024 66408 329241 -124086 -252403 -158687 -85621 -58634 220968 -126226 194363 19630 143597
9013 143597 -259906 -156144 -153061 408524 -101900 -237066 30735 201726 109637 -283559
9002 -143696 -405341 169127 11750 -210071 -121393 60523 142102 -203531 -270984 -218210 -167534
8991 -167534 -172696 -216186 -238199 -192594 -132179 -154213 -13116 -28333 300291 376073 -144476
8979 -79835 -134608 -159802 41317 33262 -108300 -47829 -5910 104969 -111813 -343272 71442
8967 -144418 171825 -75655 -423341 114799 -36415 35982 -58536 -199405 -46396 -199726 -361701
8956 -361701 -120435 41770 139302 -32375 -86859 -78032 161356 263444 -31402 80492 115349
8945 115349 222005 -344195 438495 -342430 -92330 -30390 186429 10663 -284789 70034
8934D32662B0694c28768a31945e2558A39105d3628j42282i1897E5282M17651P49349
8923A222282J447385J1469260m091144D004120A400419D61267N2154j19326M7445
8914D41540A68124P0483j14658N9715a41784a2133B54091j10623E6649A8071K2048
8903D0119R3291m7344a38047r9599f8830k84020A57493a07596m8898n2754B27631
$$ plain form
8934 432662 20694 -328768 -131945 -52558 139105 -43628 -185910 -91897 55282 472933 1222282
8923 1222282 2669667 14138927 10047783 4004120 1400419 461267 513421 394095 441540
8914 441540 168124 238607 123949 183664 -141784 -12133 254091 143468 56649 18071 40119
8903 40119 133410 86066 -138047 -237646 -68830 -352850 157493 -107596 -156494 -209248 227631
$$ [...]
##END NTUPLES=NMR SPECTRUM
##END=
