
##TITLE=AC1381_PERAH12193_7518968_igSGzbUJ3o
##JCAMPDX= 6.0         $$ Bruker NMR JCAMP-DX V2.0
##DATA TYPE= NMR SPECTRUM
##DATA CLASS= NTUPLES
##ORIGIN= BRUKER
##OWNER= Administrator
$$ 1.72 TOPSPIN		Version 2.1
$$ 2013-02-21 01:48:51.267 -0500  Administrator@X
$$ Compression mode = diff/dup
##.OBSERVE FREQUENCY= 400.02188249412
##.OBSERVE NUCLEUS= ^1H
##.ACQUISITION MODE= SIMULTANEOUS (DQD)
##.ACQUISITION SCHEME= undefined
##.AVERAGES= 8
##.DIGITISER RES= 22
##SPECTROMETER/DATA SYSTEM= spect
##.PULSE SEQUENCE= zg30
##.SOLVENT NAME= COFFEE_meoh
##.SHIFT REFERENCE= INTERNAL, COFFEE_meoh, 1, 14.98509
##AUDIT TRAIL= $$ (NUMBER, WHEN, WHO, WHERE, PROCESS, VERSION, WHAT)
$$ ##TITLE= Audit trail, TOPSPIN		Version 2.1
$$ ##JCAMPDX= 5.01
$$ ##ORIGIN= Bruker BioSpin GmbH
$$ ##OWNER= Administrator
$$ $$ E:\/data/COFFEE/nmr/AC1381_PERAH12193_7518968_igSGzbUJ3o/10/pdata/1/auditp.txt
$$ ##AUDIT TRAIL=  $$ (NUMBER, WHEN, WHO, WHERE, PROCESS, VERSION, WHAT)
(   1,<2013-02-21 01:48:43.135 -0500>,<Administrator>,<X>,<go>,<TOPSPIN 2.1>,
      <created by zg
	started at 2013-02-21 01:47:37.260 -0500,
	POWCHK enabled, PULCHK disabled,
       configuration hash MD5:
       86 BA 57 50 F2 9D 5C 9B 26 00 A9 28 5F 66 2E 89
       data hash MD5: 64K
       B0 EA 65 A4 94 6F 44 CF 76 9C C0 1E 90 EC 3F AF>)
(   2,<2013-02-21 01:48:46.213 -0500>,<Administrator>,<X>,<proc1d>,<TOPSPIN 2.1>,
      <Start of raw data processing
       efp LB = 0 FT_mod = 6 PKNL = 1 PHC0 = 0 PHC1 = 0 SI = 32K 
       data hash MD5: 32K
       C6 CD 2E 66 34 6A 2D 86 C8 23 39 F4 1A 7C 81 D5>)
(   3,<2013-02-21 01:48:46.673 -0500>,<Administrator>,<X>,<proc1d>,<TOPSPIN 2.1>,
      <pk PHC0 = 67.47803 PHC1 = 0 
       data hash MD5: 32K
       7D 5D 69 CF 74 8D 4F AE E5 8A DD 1F 9F 4A 90 7F>)
(   4,<2013-02-21 01:48:46.933 -0500>,<Administrator>,<X>,<proc1d>,<TOPSPIN 2.1>,
      <abs ABSG = 1 
       data hash MD5: 32K
       D4 FF 1F D2 53 A4 15 C0 4D EC 7F 79 1B F3 63 78>)
(   5,<2013-02-21 01:48:47.086 -0500>,<Administrator>,<X>,<proc1d>,<TOPSPIN 2.1>,
      <abs ABSG = 2 
       data hash MD5: 32K
       CF 86 11 04 71 BF 4B 56 E4 13 D6 06 3D 4A 93 62>)
(   6,<2013-02-21 01:48:47.224 -0500>,<Administrator>,<X>,<proc1d>,<TOPSPIN 2.1>,
      <abs ABSG = 3 
       data hash MD5: 32K
       F9 4B DE 34 E9 58 DD 08 26 65 0A AA 58 C8 63 63>)
(   7,<2013-02-21 01:48:47.377 -0500>,<Administrator>,<X>,<proc1d>,<TOPSPIN 2.1>,
      <abs ABSG = 4 
       data hash MD5: 32K
       54 75 D7 D0 73 0E D0 9F 72 0B 3B 54 C4 EB B8 CE>)
(   8,<2013-02-21 01:48:47.515 -0500>,<Administrator>,<X>,<proc1d>,<TOPSPIN 2.1>,
      <abs ABSG = 5 
       data hash MD5: 32K
       F4 03 A7 F9 54 25 72 FD D0 82 12 42 FD 94 9C A0>)
$$ ##END=
$$ 
$$ $$ hash MD5
$$ $$ F0 06 80 06 D2 9D 41 49 40 23 E7 2E 3F B3 EE 2D
##$RELAX= 
##$RELAX= 
##$RELAX= 
##$RELAX= 
##$RELAX= 
##$RELAX= 
##$RELAX= 
$$ Bruker specific parameters
$$ --------------------------
##$DU= <E:\>
##$EXPNO= 10
##$NAME= <AC1381_PERAH12193_7518968_igSGzbUJ3o>
$$ [...]
##$TP= (0..7)
150 150 150 150 150 150 150 150
##$TP07= 0
##$TPNAME0= <>
##$TPNAME1= <>
##$TPNAME2= <>
##$TPNAME3= <>
##$TPNAME4= <>
##$TPNAME5= <>
##$TPNAME6= <>
##$TPNAME7= <>
##$TPOAL= (0..7)
0.5 0.5 0.5 0.5 0.5 0.5 0.5 0.5
##$TPOFFS= (0..7)
0 0 0 0 0 0 0 0
##$TUNHIN= 0
##$TUNHOUT= 0
##$TUNXOUT= 0
##$USERA1= <user>
##$USERA2= <user>
##$USERA3= <user>
##$USERA4= <user>
##$USERA5= <user>
##$V9= 5
##$VALIST= <valist>
##$VCLIST= <CCCCCCCCCCCCCCC>
##$VD= 0
##$VDLIST= <DDDDDDDDDDDDDDD>
##$VPLIST= <PPPPPPPPPPPPPPP>
##$VTLIST= <TTTTTTTTTTTTTTT>
##$WBST= 1024
##$WBSW= 4
##$XGAIN= (0..3)
0 0 0 0
##$XL= 0
##$YL= 0
##$YMAX_a= 563487
##$YMIN_a= -561121
##$ZGOPTNS= <>
##$ZL1= 120
##$ZL2= 120
##$ZL3= 120
##$ZL4= 120
##$ABSF1= 14.98509
##$ABSF2= -5.573092
##$ABSG= 5
##$ABSL= 3
##$ALPHA= 0
##$AQORDER= 0
##$ASSFAC= 0
##$ASSFACI= 0
##$ASSFACX= 0
##$ASSWID= 0
##$AUNMP= <proc_prof1d_extract_pilot.lims>
##$AXLEFT= 0
##$AXNAME= <>
##$AXNUC= <1H>
##$AXRIGHT= 0
##$AXTYPE= 0
##$AXUNIT= <>
##$AZFE= 0.1
##$AZFW= 0.1
##$BCFW= 0
##$BC_mod= 0
##$BYTORDP= 0
##$COROFFS= 0
##$CY= 15
##$DATMOD= 1
##$DC= 0
##$DFILT= <>
##$DTYPP= 0
##$F1P= 0
##$F2P= 0
##$FCOR= 0.5
##$FTSIZE= 32768
##$FT_mod= 6
##$GAMMA= 0
##$GB= 0
##$INTBC= 1
##$INTSCL= 1
##$ISEN= 128
##$LB= 0
##$LEV0= 0
##$LPBIN= 0
##$MAXI= 10000
##$MC2= 0
##$MEAN= 0
##$ME_mod= 0
##$MI= 0
##$NCOEF= 0
##$NC_proc= -8
##$NLEV= 6
##$NOISF1= 0
##$NOISF2= 0
##$NSP= 0
##$NTH_PI= 0
##$NZP= 0
##$OFFSET= 14.98509
##$PC= 1
##$PHC0= 67.47803
##$PHC1= 0
##$PH_mod= 1
##$PKNL= yes
##$PPARMOD= 0
##$PPDIAG= 0
##$PPIPTYP= 0
##$PPMPNUM= 2147483647
##$PPRESOL= 1
##$PSCAL= 4
##$PSIGN= 0
##$PYNMP= <proc.py>
##$REVERSE= no
##$SF= 400.02
##$SI= 32768
##$SIGF1= 0
##$SIGF2= 0
##$SINO= 400
##$SIOLD= 32768
##$SPECTYP= <>
##$SREGLST= <1H.CDCl3>
##$SSB= 0
##$STSI= 32768
##$STSR= 0
##$SW_p= 8223.68421052631
##$SYMM= 0
##$S_DEV= 0
##$TDeff= 65536
##$TDoff= 0
##$TI= <>
##$TILT= no
##$TM1= 0
##$TM2= 0
##$TOPLEV= 0
##$USERP1= <user>
##$USERP2= <user>
##$USERP3= <user>
##$USERP4= <user>
##$USERP5= <user>
##$WDW= 1
##$XDIM= 32768
##$YMAX_p= 466916158
##$YMIN_p= -695932
##$CURPLOT= <Network HP LaserJet P1505>
##$CURPRIN= <$Network HP LaserJet P1505>
##$DFORMAT= <normdp>
##$LAYOUT= <+/1D_H.xwp>
##$LFORMAT= <normlp>
##$PFORMAT= <normpl>
##$SURQMSG= 1
$$ End of Bruker specific parameters
$$ ---------------------------------
##NTUPLES= NMR SPECTRUM
##VAR_NAME=  FREQUENCY,     SPECTRUM/REAL,   SPECTRUM/IMAG
##SYMBOL=    X,             R,               I
##VAR_TYPE=  INDEPENDENT,   DEPENDENT,       DEPENDENT
##VAR_FORM=  AFFN,          ASDF,            ASDF
##VAR_DIM=   32768,         32768,           32768
##UNITS=     HZ,            ARBITRARY UNITS, ARBITRARY UNITS
##FACTOR=    0.250966925370066, 1,           1
##FIRST=     8223.43324360094, -75770,       116493
##LAST=      0,             -45072,          61073
##MIN=       0,             -695932,         0
##MAX=       8223.43324360094, 466916158,    0
$$ Real data points
##PAGE= N=1
##DATA TABLE= (X++(R..R)), XYDATA
$$ [...]
19538e00114A14767i1742B40583b94034A67105b6948A16223O0980I354L2788a01284
19526a8828j48930B12287F9197a65512d6179D0196b32093h2386B16158a15748
19515A47404A601J9414N597a71484k47889a36953D15825j19899a4384p458j80594
19504b02436a00684I5340d68476a22605p8275N4543A08816m2993b00538i2514
19493A71050a13740k56920c8634l17579L612A39991i8342A87984f4189D4547i6022
19481b37680i3896o6911H2001a18891b0189l10555a30382C76790c9155j83137
19471b22292J8126J4500q715B9704J04809i2586o3433A67314f0391n0833c7428
19459a26687L9549j36828K4048i2192Q245k26583A36939i7802F5566b17731A81843
$$ plain form
19538 -500114 114767 -91742 240583 -294034 167105 -26948 116223 177203 9354 42142 -101284
19526 -18828 -167758 212287 69197 -165512 -46179 40196 -232093 -82386 216158 -115748
19515 147404 1601 21015 26612 -171484 -419373 -136953 415825 295926 -14384 -21842 -202436
19504 -202436 -100684 95340 -468476 -122605 -200880 -146337 108816 65823 -200538 -92514
19493 171050 -113740 -370660 -38634 -356213 -352601 139991 -98342 187984 -64189 44547 -96022
19481 -237680 -93896 -160807 82001 -118891 -20189 -330744 -130382 376790 -39155 -222292
19471 -222292 -204166 -189666 -198381 29704 134513 -92586 -156019 167314 -60391 -111224 -37428
19459 -126687 -87138 -223966 -199918 -92192 -83947 -310530 136939 -97802 65566 -217731 181843
19447a78457d2118A10063a38154l0138d1566A76942f0513k20189r1645J52383
19437b19964G6175b08998g3834A0059K985h4628A47251d46409a91312a0233D4694
19425a80123j10601a21638n647d7858r4743B8510c4857k41340N6176B64917H46
19413a15031B1746m728K50151c25935a04568m9567A39498Q4375I7802F127a24029
19401a96280j04590i5674d1963k77483J14199F4891a78497G510a35719r6915A72137
19389a81444f0004p9945d8345p8582r1227b2656G5609J91285a28819G2778b51592
19377c8916j08835D7449j4679a16267j2306k2290L6511A07100b04582j28367P1017
19366b61932g7812B35842f176E5956b42692a16656j88635g7575b6643q1243A53926
$$ plain form
19447 -178457 -42118 110063 -138154 -168292 -41566 176942 -60513 -280702 -372347 -219964
19437 -219964 76175 -208998 -73834 10059 13044 -84628 147251 -446409 -191312 -10233 44694
19425 -180123 -290724 -121638 -127285 -47858 -142601 28510 -34857 -276197 -220021 264917 846
19413 -115031 21746 17018 267169 -325935 -104568 -154135 139498 223873 97802 6127 -124029
19401 -196280 -300870 -95674 -41963 -319446 -205247 64891 -178497 7510 -135719 -232634 172137
19389 -181444 -60004 -139949 -48345 -126927 -218154 -22656 75609 266894 -128819 72778 -251592
19377 -38916 -147751 47449 32770 -116267 -128573 -150863 -114352 107100 -204582 -332949 -261932
19366 -261932 -77812 235842 -6176 55956 -242692 -116656 -305291 -77575 -26643 -107886 153926
19354A4316a34447n3416j70137N9002f082k6919F3512j0990a97769a8928e836
19342A4875g004k58817b2713q9485N5012A91533a51526B29840F626M9116P5044
19331A30786f3331A88422H090b16310K0165A01446b5459j50307B1682Q8446M3259
19320A53387c02190C22468i1414j21941j36594a28704I9242b0274A91720m7758
19310A43962J6398d02525a93186H9412N6008G311a45832O5715B4455a11818B7977
19298a19200J6903B03821b94115a13714i553q4834j48197a6685l52376a64996
19287b6087r6058j49558A56158d9233k45120h756j6167j57543A99064k3863a33957
19275a44207k1877e9115B09496A145a7500C2419C011P6386a94208A45908e2998
$$ plain form
19354 14316 -134447 -187863 -358000 -298998 -6082 -33001 63512 52522 -197769 -18928 -5836
19342 14875 -7004 -265821 -22713 -112198 -57186 191533 -151526 229840 6626 55742 130786
19331 130786 -63331 188422 8090 -216310 -196145 101446 -25459 -175766 21682 110128 153387
19320 153387 -302190 322468 -91414 -213355 -349949 -128704 99242 -20274 191720 143962
19310 143962 160360 -402525 -193186 89412 145420 7311 -145832 -80117 24455 -111818 27977
19298 -119200 -102297 203821 -294115 -113714 -9553 -94387 -242584 -16685 -369061 -164996
19287 -26087 -122145 -271703 156158 -49233 -294353 -8756 -24923 -182466 199064 175201 -133957
19275 -144207 -166084 -59115 209496 1145 -17500 32419 3011 79397 -194208 145908 -52998
19263b10037g0726q481J1345F3754c06507a01078l662H190a43152j88012i860
19251c45434Q3771Q0424a4847k10618E0002a13002k57256A90305g461F3636b67062
19239I5778A3968J57723n8486n4437a03791K7785A94249a4830o3845C025a71691
19227b13638N8046J1272A43921a29748j8758k0522a745j84334k196D8850c6242
19215a19973A21258a53415B14926A9451d4704j76890M0373j40043a25723j43965
19205b69688f7948m30220A03130a06177H2695J634C7985a55721l2250j74928A61425
19193c12942e0537m0895E8148i5143B8532e9585j01951N2135k26383B7715e8331
19181A62984d606m6873k18613j26545B27690c36047B09279a92576n6857k00912
$$ plain form
19263 -210037 -70726 -79207 -67862 63754 -306507 -101078 -104740 8190 -143152 -331164 -9860
19251 -345434 -261663 -181239 -14847 -225465 50002 -113002 -370258 190305 -7461 63636 -267062
19239 95778 13968 171691 113205 58768 -103791 -76006 194249 -14830 -78675 3025 -171691
19227 -213638 -155592 -144320 143921 -129748 -148506 -169028 -1745 -186079 -188275 48850 -36242
19215 -119973 121258 -153415 214926 19451 -44704 -221594 -181221 -321264 -125723 -269688
19205 -269688 -67948 -498168 103130 -106177 82695 84329 37985 -155721 -187971 -362899 161425
19193 -312942 -50537 -91432 58148 -95143 28532 -59585 -161536 -109401 -335784 27715 -58331
19181 162984 -4606 -51479 -270092 -396637 227690 -336047 209279 -192576 -249433 -450345
19171d50345A03744a40230A82543M4499g5277j2518n7510j3890j39421A10770
19160a80024g2146j3423j07022H2095b44972A4724c52570e8339C13087d630k75453
19149b80083L5981C4730b76948B1734c9927l04610A85657a8330k47583I2661i4532
19137b58837B00074g4207A50234K32589p3061A05202a17396n8153j04995A8660
19126I7251J03547f1950C66024c2638D3221e01466a44583A5322K2275J1110h8676
19114A4027L07703c81007A49635j1441j0759K28436r3778a5046m0154I7672a03505
19102a24429L2909E1004a73277g0466e139q9491A41432b72477P7939o3432a05279
19090a88064C840i4053j31107P6616F406J21845a33125C61326b42658B48368c8865
$$ plain form
19171 -450345 103744 -140230 182543 227042 -75277 -87795 -145305 -159195 -298616 110770
19160 -180024 -72146 -85569 -192591 82095 -244972 14724 -352570 -58339 313087 -4630 -280083
19149 -280083 -244102 34730 -276948 21734 -39927 -344537 185657 -18330 -265913 92661 -94532
19137 -258837 200074 -74207 150234 382823 309762 105202 -117396 -175549 -280544 18660
19126 97251 200798 -61950 366024 -32638 43221 -501466 -144583 15322 37597 48707 -88676
19114 14027 321730 -381007 149635 138194 127435 355871 262093 -15046 -55200 97672 -103505
19102 -124429 -91520 51004 -173277 -70466 -5139 -94630 141432 -272477 -194538 -257970 -105279
19090 -188064 3840 -94053 -225160 -148544 6406 128251 -133125 361326 -242658 248368 -38865
19078c805l65715R9987f512j62954K1882A33137k0626g5836q301A44079l6864
19067A07215a57991L7000A54951D6582N2923f8427j08464A35405M3084c22179
19056a50625O6782n4444A3041a62281F391b08989K7672Q3527c2342H1500a84059
19044B11191l5392f1789p5789I6642l67a30781E4939d29289B27664j09591a94108
19032i4489E733h8315E2701J64419k6117q1969j775J86891b34822f8515b8613
19020B14977J12067a90866A46896b74116K5025B14662a15935B52177d0741A4100
19009B1295f4183j2883l00015J18365d0452A06229K6500b19947N65R7750A8588
18997C05669a69048B5990M1965c73290a85588Q3417A3830J45038a03257j9188
$$ plain form
19078 -3805 -369520 -269533 -6512 -169466 -147584 133137 112511 -75836 -84137 144079 107215
19067 107215 -157991 -120991 154951 46582 99505 -68427 -176891 135405 178489 -322179
19056 -150625 -83843 -138287 13041 -162281 6391 -208989 -181317 -97790 -32342 81500 -184059
19044 211191 175799 -61789 -137578 96642 96275 -130781 54939 -429289 227664 118073 -194108
19032 -94489 5733 -88315 52701 217120 191003 109034 107259 294150 -234822 -68515 -28613
19020 214977 327044 -190866 146896 -274116 -249091 214662 -115935 252177 -40741 14100
19009 21295 -64183 -77066 -377081 -258716 -40452 106229 132729 -219947 -219382 -121632 18588
18997 305669 -169048 25990 67955 -373290 -185588 -102171 13830 158868 -103257 -122445
18987a22445r2522A44987b2479C114L1571f3039B1821c47222a3210k41460h5284
18975B56325c68468a15445l23474K18736h0442C11014a26867Q247G8492d55325
18964F4234k7553a83822g759j44829c4388l10116B62208a60185k1582Q9009L1334
18953f1424D7651a80888d7499n7857N2516k4326E4619b06351D8098b06304A90686
18941a0861j14723B17006j02964f1860I9344j9875h4688j06042g6121A30484a09513
18929I3455b26706F4680a59795A4825f0121j92537J25741j41724f0173K1281I8898
18917c47271a21250j03264Q9490D6847a08512q9580a9406n3519D5489k1461a95844
18905a3318C31434b99995a41724M2080G2439D741g4447A64769H335c71888A6117
$$ plain form
18987 -122445 -214967 144987 -22479 3114 34685 -63039 21821 -347222 -13210 -254670 -85284
18975 256325 -368468 -115445 -438919 -220183 -80442 311014 -126867 -118620 78492 -455325
18964 64234 36681 -183822 -7759 -152588 -34388 -344504 262208 -160185 -181767 -92758 -61424
18953 -61424 47651 -180888 -47499 -105356 -52840 -77166 54619 -206351 48098 -206304 190686
18941 -10861 -125584 217006 114042 -61860 99344 79469 -84688 -190730 -76121 130484 -109513
18929 93455 -226706 64680 -159795 14825 -60121 -252658 -126917 -268641 -60173 -38892 98898
18917 -347271 -121250 -224514 -135024 46847 -108512 -198092 -19406 -72925 45489 24028 -195844
18905 -13318 331434 -299995 -141724 -99644 72439 4741 -74447 164769 8335 -371888 16117
18893i2038b026A18675d40131M6800B2865c47314B46071a57278A64224a0495j39690
18882a50185H382L51418H9902b06041B00622h9667C4397a02382M3428o0682j1721
18871a31357m8517M2314d7754p4995I1356R0724D551J69986g6188j96015d6101
18859F7300d0531m4006q0310F0489d5324B1331c17014h964A01850J34680a03657
18847d5518A51798b19075Q8647A19951K20674D5205i7637b8995j50178f3252p9212
18836a42464j47322A25718e511A58459b61447O79A12603a97459A98691a71167
18825d8048I8672a98328l2770J00377A5050g0847j05467F9585M3701h8276A24093
18813C23009A31451c59088a03077d2056A52204P3879A03381J02233H8348O0215
$$ plain form
18893 -92038 -2026 118675 -440131 -393331 22865 -347314 246071 -157278 164224 -10495 -150185
18882 -150185 8382 359800 89902 -206041 200622 -89667 34397 -102382 -58954 -119636 -131357
18871 -131357 -179874 -137560 -47754 -122749 91356 182080 4551 174537 -76188 -272203 -46101
18859 67300 -40531 -84537 -164847 60489 -45324 21331 -317014 -8964 101850 236530 -103657
18847 -45518 151798 -219075 -130428 119951 340625 45205 -97637 -28995 -179173 -63252 -142464
18836 -142464 -289786 125718 -5511 158459 -261447 -260768 112603 -197459 198691 -171167
18825 -48048 98672 -198328 -231098 -130721 15050 -70847 -176314 69585 113286 -88276 124093
18813 323009 131451 -359088 -103077 -42056 152204 226083 103381 205614 88348 148563
18803A48563L0475J3322a23632C1531c61665A59508c47300k77610D2806b44394
18792d3548A52895K4507d0565k46053a18860J0379d4593I1676l5676J72888A09304
18780A2852a95010B34742p1469E3110h4809B53202j14338a46420J0527A52826
18769b22545A3612N1469f0074k3666D4426a82691H6703J19092M57153A66435a52181
18757C14915a0796j22057f3170l38259g3891C7439K23585r3850i6612l465c5307
18745a45064c8695j28219C6729b8657k14021Q8591k9451A9941b5203A40940b18125
18733d5111a1029A77745c2310j43343E0923J50473a59278k42917d4664o7992o8893
18722a81549N1333q5343A05640a46823j0082q504O8615A281b45704g2749j20601
$$ plain form
18803 148563 179038 192360 -123632 31531 -361665 159508 -347300 -624910 42806 -244394
18792 -43548 152895 177402 -40565 -286618 -118860 -108481 -44593 91676 56000 228888 109304
18780 12852 -195010 234742 163273 53110 -84809 253202 138864 -146420 -135893 152826
18769 -222545 13612 65081 -60074 -83740 44426 -182691 86703 205795 662948 166435 -152181
18757 314915 -10796 -132853 -63170 -401429 -73891 37439 261024 167174 -96612 -100077 -35307
18745 -145064 -38695 -166914 36729 -28657 -242678 -154087 -183538 19941 -25203 140940 -218125
18733 -45111 -11029 177745 -32310 -175653 50923 201396 -159278 -402195 -44664 -112656 -181549
18722 -181549 -130216 -215559 105640 -146823 -156905 -165409 -96794 1281 -245704 -72749 -193350
18711a93350B94283h2376A40167e4973l07706J67390P7210A19611Q891b74694
18700C7109a73479j90256e6809K1034A06282g0694m8144j04063J8477i9822c7443
18688a82774c8188j38755D1723i5133c9800k21666J0301c9440j4588j80587I5902
18676A2895J10754h5560A62413a5513k8180o6181B7117a01160k3058A4354K00614
18665B14968b31111a01860F6260a24355A52097l0365k3098P7416a73550k3891
18655a97441k19926K00296b5287j01139p5393A7529K67195A06233M8507k4775
18645A29965b21571A71682i0935A39864g9285c8420j01522D41725b12159a0402
18634c23333J59435b1643r2154A43999B6768a59168o460j4992j61688b1455j69137
$$ plain form
18711 -193350 294283 -82376 140167 -54973 -362679 -195289 -118079 119611 128502 -274694
18700 37109 -173479 -363735 -56809 -35775 106282 -70694 -118838 -222901 -204424 -99822 -37443
18688 -182774 -38188 -176943 41723 -95133 -39800 -261466 -251165 -39440 -54028 -234615 95902
18676 12895 123649 -85560 162413 -15513 -43693 -109874 27117 -101160 -124218 14354 214968
18665 214968 -231111 -101860 66260 -124355 152097 121732 98634 176050 -173550 -197441
18655 -197441 -417367 -217071 -25287 -126426 -201819 17529 284724 106233 154740 129965
18645 129965 -221571 171682 -90935 139864 -79285 -38420 -139942 441725 -212159 -10402
18634 -323333 -163898 -21643 -113797 143999 26768 -159168 -165628 -180620 -342308 -21455 -190592
18623a90592A20361c95446A21514g9122l5205A88932K35404b59094a27781E1233
18612a17202A92481e2007I1225C5877d0222k49716A39947B3476a80927A12777
18601a50392K4027e2092o9296d9878J9266H7451h7343n1024j82j59671H6139a48214
18588d6329l6332E2323K3377c22635b1662j55059D656K9070J47291a76258d406
18576a85641A91906a35152A49708d4710p99E0810a24841k14818d4316A0844a03805
18564B03064e9897A47788h1183j79383M2778f0433A86399o7276a33708B9970h1381
18552A2381M0643b77977J07277e0664R352a7398D9163c45389J67360j9135B03451
18540f3247D32318d0356A49310a10667f158C88391b87002h3673k32275J49403
$$ plain form
18623 -190592 120361 -395446 121514 -79122 -114327 188932 424336 -259094 -127781 51233
18612 -117202 192481 -52007 91225 35877 -40222 -289938 139947 23476 -180927 112777
18601 -150392 -126365 -52092 -121388 -49878 -30612 87451 -87343 -138367 -138549 -298220 86139 -148214
18588 -46329 -82661 52323 75700 -322635 -21662 -176721 4656 33726 181017 -176258 -4406
18576 -185641 191906 -135152 149708 -44710 -45509 50810 -124841 -339659 -44316 10844 -103805
18564 203064 -59897 147788 -81183 -260566 -217788 -60433 186399 119123 -133708 29970 -81381
18552 12381 53024 -277977 -170700 -50664 -41312 -17398 49163 -345389 -178029 -197164 203451
18540 -63247 432318 -40356 149310 -110667 -6158 388391 -287002 -83673 -315948 -166545
18530a66545C60773a61398k87639H2834c09921J46293p0882j95766F4882a00265
18519I8709b06978A08504b11558H4372J5418C6350j3789d4988j8294g641j46066
18508a53707H5337b83378a0535B46311c20575H2553b58956j34611b6081k53882
18498b79963A00850b1092r1485A92519c62898j68040b61997b2683A52449c364
18487B3628a37682k52998e9155k28344A39686M182b49349f7928L1515J723M461
18476c0229m75612a17507c7982k11159b3848A23221a73388A199c32772I4833c4206
18464G6655C0182a46729O6553k30150a0444H4211b5130A63068e8287A83589b21356
18452C5003a37401e179H8405a08289A73017J45699B5839b6271E7792K8462K2998
$$ plain form
18530 -166545 360773 -161398 -449037 82834 -309921 -163628 -234510 -430276 64882 -100265
18519 98709 -206978 108504 -211558 84372 99790 36350 22561 -44988 -63282 -7641 -153707
18508 -153707 85337 -283378 -10535 246311 -320575 82553 -258956 -393567 -26081 -279963
18498 -279963 100850 -21092 -112577 192519 -362898 -530938 -261997 -22683 152449 -3364
18487 23628 -137682 -390680 -59155 -287499 139686 143868 -249349 -67928 -36413 -34690 -30229
18476 -30229 -505841 -117507 -37982 -249141 -23848 123221 -173388 1199 -332772 94833 -34206
18464 76655 30182 -146729 -80176 -310326 -10444 84211 -25130 163068 -58287 183589 -221356
18452 35003 -137401 -5179 88405 -108289 173017 318716 25839 -26271 57792 86254 109252
18441A09252b4910J0171G2090P1219E0954c24499i6828J5350l6996d8328D6252
18429d2040B39745A06470c24763K5311d6640q1672B9964a759j00972A50110i8200
18417F8861b58112j57289C6499h8534k36385A96627a59809E233M12859b3775p1537
18406i5312B52194j7277i8016F5016M4537C9051K823J16201J60125c41910e3160
18394i2531J8875l40708B39206A5713N153i6108A00219b00909G9201a10801A05610
18382C26291A10088B1725J65285b6616J0332j73026B33792b37059P428D8731K40827
18371B89558a36757j18479L9012A23379b99439A61928E6570J95678J80842e7169
18360h3625K5213I6241a35850p1931B08847N587c8204A60039a99557d7356B408
$$ plain form
18441 109252 -24910 -14739 72090 143309 50954 -324499 -96828 -81478 -118474 -48328 46252
18429 -42040 239745 106470 -324763 -299452 -46640 -128312 29964 -1759 -102731 150110 -98200
18417 68861 -258112 -415401 36499 -88534 -324919 196627 -159809 5233 418092 -23775 -95312
18406 -95312 252194 234917 -98016 65016 109553 39051 41874 158075 318200 -341910 -53160
18394 -92531 -73656 -414364 239206 15713 20866 -96108 100219 -200909 79201 -110801 105610
18382 326291 110088 21725 187010 -26616 -16284 -189310 233792 -237059 -229631 48731 289558
18371 289558 -136757 -255236 -216224 123379 -299439 161928 56570 252248 433090 -57169
18360 -83625 -58412 96241 -135850 -207781 208847 214434 -38204 160039 -199557 -47356 2408
18348g3203F4526a81826j16616C42978a07900D5023c180B78416b27960c0234j39937
18337a70171j8676G9078c84569A44650c86427d9616E5254a75856P8832a7646A22287
18325b9766A4563J6202a52439B84613G3785a46841p9041L3123A31022a47488k89464
18314d36952J57812E8204b51372a5599F4392b23202C5980a77242B86973b74962
18303a07392B62996a10555E4852a50350d9075E13531G8579d0701G1407a98864
18292e3690l61977G9198J6451a01379E5134J34072a35934m251f0704j26734A61811
18280a76478A54171a23928M3612A81134M0016a5001A52792c72269f4644b4232
18269E8189b95522B1069P3447l2918J60474k5677A6040a20705p6054G766M3606
$$ plain form
18348 -73203 64526 -181826 -298442 342978 -107900 45023 -3180 278416 -227960 -30234 -170171
18337 -170171 -188847 79078 -384569 144650 -386427 -49616 55254 -175856 -97024 -17646 122287
18325 -29766 14563 30765 -152439 284613 73785 -146841 -225882 -192759 131022 -147488 -436952
18314 -436952 -279140 58204 -251372 -15599 64392 -223202 35980 -177242 286973 -274962
18303 -107392 262996 -110555 54852 -150350 -49075 513531 78579 -40701 71407 -198864
18292 -53690 -415667 79198 95649 -101379 55134 189206 -135934 -140185 -60704 -187438 161811
18280 -176478 154171 -123928 -80316 181134 221150 -15001 152792 -372269 -64644 -24232
18269 58189 -295522 21069 94516 61598 222072 196395 16040 -120705 -196759 7766 51372
18258E1372B2974b23666K3528B97176a74245o0759C0291h6105k97208e739E0336
18246h6527A15305a4263j40393j6889j12916d6807k90879J59355A56191D8599
18235A28135j6566F162a32845P967h768p8022j8847A97257a82305A51010G0475
18223I774Q6449a2433q9551b9343j61160n3693f5146b5320D9016b76516B01167
18211e9297j70136A261O4839L6950M8670b07273P6905j98036Q5070a1783j19184
18200a30967p3557Q8884d0182F4945a13846o6596H1648B8007b29196I7300c0478
18188a31231b9177B5716J1320C566i858j5560F7364J1399P7815M4872C6633J03440
18176A40073J08297c02937n255J38791K4360A37597A6899a07487j18029M4582
$$ plain form
18258 51372 22974 -223666 -200138 297176 -174245 -235004 30291 -86105 -383313 -5739 50336
18246 -86527 115305 -14263 -154656 -171545 -284461 -46807 -337686 -178331 156191 48599
18235 128135 111569 6162 -132845 -124878 -8768 -86790 -105637 197257 -182305 151010 70475
18223 9774 96223 -12433 -101984 -29343 -190503 -244196 -65146 -25320 49016 -276516 201167
18211 -59297 -229433 1261 66100 103050 151720 -207273 -130368 -328404 -243334 -11783 -130967
18200 -130967 -204524 -115640 -40182 64945 -113846 -180442 81648 28007 -229196 97300 -30478
18188 -131231 -29177 25716 37036 3566 -9858 -25418 67364 78763 156578 201450 36633 140073
18176 140073 248370 -302937 -308192 -169401 -145041 137597 16899 -107487 -225516 -180934
18166a80934G1327c9375o1088n5628K1508M8972A24518L4244b62935B8710J05488
18155A34198f5259k98634J41505A42417b91116H690a36842C4526b0117o6328e829
18143G0512a04925d298A17093b29580L7845j8824P0054N6338B76759i0346D7738
18131A0254a81945A96868D9490a04927j8069A755K19689B5453b0284g050I4667
18119a07627B49796c4788A30876a93188I3994a14560A70748n689C2752h5623c0070
18107A60116a6337A18271a34722D722K2895i91C3748K84045a60947g5530C2459
18095B00134d7516k8135f095A95107E2839c12267B70284g0832r7340A46769A2092
18083E9701a00859E3524b74656H0076L7638b80602a8839B6270a9320o7532k29722
$$ plain form
18166 -180934 71327 -39375 -100463 -156091 -134583 -85611 124518 158762 -262935 28710 134198
18155 134198 -65259 -363893 -222388 142417 -291116 8690 -136842 34526 -20117 -86445 -5829
18143 70512 -104925 -4298 117093 -229580 -191735 -210559 -140505 -84167 276759 -90346 47738
18131 10254 -181945 196868 49490 -104927 -122996 1755 221444 25453 -20284 -7050 94667
18119 -107627 249796 -34788 130876 -193188 93994 -114560 170748 165059 32752 -85623 -30070
18107 160116 -16337 118271 -134722 4722 27617 -991 33748 317793 -160947 -75530 32459
18095 200134 -47516 -75651 -6095 195107 52839 -312267 270284 -70832 -168172 146769 12092
18083 59701 -100859 53524 -274656 80076 117714 -280602 -18839 26270 -19320 -86852 -316574
18072c16574A77283k1346E7264a45399B25448r1448N1036c4186j47657A6625a54094
18060c49308i22l32838g2108b7325H6605a61605l4186a900o7330j24582A27720
18048a39130f7303A14094g1620K5758E6466b67260h1781K225m9321B3718b82050
18036A2654a95883B8702f9100j64846A0376a9942L806A3738K4255a18980B4700
18024c14261a31285N0262I1831O5204E7822h3737b7445B10759b57242O5044f2940
18012a57156B4921b78026A19805b879A9308J02807a40396n9696d9444J0268l88369
18001d27545B20094A07251J95504A44813c92717C02b79290J13434D2171Q2081
17991A24252E4453a26708j5975j8162e6251D6173N9352m3901K36712a09518c4489
$$ plain form
18072 -316574 177283 155937 57264 -145399 225448 134000 185036 -34186 -181843 16625 -154094
18060 -349308 -922 -333760 -72108 -27325 86605 -161605 -195791 -1900 -69230 -193812 127720
18048 -139130 -67303 114094 -71620 -45862 56466 -267260 -81781 -79556 -128877 23718 -282050
18036 12654 -195883 28702 -69100 -233946 10376 -19942 -16136 13738 37993 -118980 24700
18024 -314261 -131285 -81023 91831 157035 57822 -83737 -27445 210759 -257242 -192198 -62940
18012 -157156 24921 -278026 119805 -2879 19308 122115 -140396 -200092 -49444 -39176 -427545
18001 -427545 220094 107251 302755 144813 -392717 302 -279290 -165856 42171 124252
17991 124252 54453 -126708 -142683 -160845 -56251 46173 105525 61624 298336 -109518 -34489
17979e2868l27934A72472d9940k1473a8424l0881n1375A51851F7634a57575c1120
17967c80069B82694H053K16948b37716J12733G191e3173A4144J06547Q8944j0329
17956A99306Q7070j10728c21353a10215e0285k80446f9194D1897d7273B70260
17945a56906F6575b9306k42477m4701A45683O898a29166O2919D2178b75563g7965
17933a63241A384J13072L7776k2263k424c4582j50240A80617J11250j20480b15053
17921a82904I6684C3867L03311H1407i5188I47a16304A65295g7011I0286a05763
17909E9530J83397c74406d8837k19188O7468E0645a52941j04386A59351d1158
17898C93861j92000e1903O695f585p0993j4355H5543a11477k3841A32373b3603
$$ plain form
17979 -52868 -380802 172472 -49940 -71413 -18424 -49305 -100680 151851 67634 -157575 -31120
17967 -380069 282694 8053 225001 -237716 -124983 7191 -53173 14144 120691 209635 199306
17956 199306 286376 175648 -321353 -110215 -50285 -330731 -69194 41897 -47273 270260
17945 -156906 66575 -29306 -271783 -316484 145683 152581 -129166 -66247 42178 -275563 -77965
17933 -163241 1384 114456 152232 129969 127545 -34582 -184822 180617 291867 171387 -215053
17921 -182904 96684 33867 337178 81407 -95188 947 -116304 165295 -77011 90286 -105763
17909 59530 242927 -374406 -48837 -268025 -200557 50645 -152941 -257327 159351 -41158
17898 393861 201861 -51903 -45208 -6585 -77578 -91933 85543 -111477 -135318 132373 -23603
17886a2704B87376a35799B18126a98330F8127N8662J28458A07215a44909B82855
17875a27006d3060j24125b5062k22942h9466C42418m9620G2883c7141j39608g7726
17863h0368j17089I5851J04617c42286l9209H5080b57052I1009f7180j91895b0923
17851b76513F2044a15567L0952j0123K2530A91553M487J233K3156p5326E1936
17839A77520E8303n754k5430P1829b65426f7108A51994a82979B4936d2253A57738
17827B8993j3213e2266j2569l36280a12451I9439M9997l7536a5193D8561J97150
17816B45711H351c51263H5853a12861k22357K2642H3399J1636a10641b7193n8338
17805h5531j8943B19000K2705b87893J43576A6983m68a52753M7403c4529c973
$$ plain form
17886 -12704 287376 -135799 218126 -198330 68127 126789 255247 107215 -144909 282855
17875 -127006 -43060 -167185 -25062 -248004 -89466 342418 292798 72883 -37141 -176749 -77726
17863 -80368 -197457 95851 200468 -342286 -381495 85080 -257052 91009 -67180 -259075 -20923
17851 -276513 62044 -115567 -84615 -94738 -72208 191553 196040 197273 220429 145103 51936
17839 177520 58303 52549 27119 98948 -265426 -67108 151994 -182979 24936 -42253 157738
17827 28993 15780 -52266 -64835 -401115 -112451 99439 149436 111900 -15193 48561 245711
17816 245711 8351 -351263 85853 -112861 -335218 -312576 83399 95035 -110641 -27193 -85531
17805 -85531 -104474 219000 241705 -287893 -144317 16983 16515 -152753 -105350 -34529 -3973
17793g2508A77151b21536H9248B9216d1388k324j18647A58068A357J40967L21442
17782D63766D2417b57509G4692a28190l8898D6440Q838L1961A9767b4943l3205
17771e8148j18381A59893p9001P7054g4552J9802A19831a52309b0493j26532K3304
17760a23721j08484Q8328K2310B04899r5871d5608B03134a76027Q227A03465a65056
17748a44207b718C8020e4959b5754m4532A79786i8935B7862J19343a85982j08632
17737b94614g1987A8167J8897g4323E1322J68930c68395A74429D137J65286p748
17726A61675E5124d41427A22524M0846g2910B43955a56004f7952j29171F5807
17715d3352A06163a74188c2297A0814R0696a3999A59044L9899B3030M0126K65254
$$ plain form
17793 -72508 177151 -221536 89248 29216 -41388 -43712 -162359 158068 1357 142324 463766
17782 463766 42417 -257509 74692 -128190 -167088 46440 55278 87239 19767 -24943 -58148
17771 -58148 -176529 159893 80892 157946 -74552 -54750 119831 -152309 -20493 -147025 -123721
17760 -123721 -232205 -143877 -121567 204899 109028 -45608 203134 -176027 -167800 103465 -165056
17748 -144207 -2718 38020 -54959 -25754 -70286 179786 -98935 27862 147205 -185982 -294614
17737 -294614 -71987 18167 37064 -74323 51322 220252 -368395 174429 4137 169423 161675
17726 161675 55124 -441427 122524 163370 -72910 243955 -156004 -67952 -197123 65807
17715 -43352 106163 -174188 -32297 10814 101510 -13999 159044 198943 23030 63156 328410
17704C28410f9459q6836f8144a6309C48937A52155D4483b60084m1554Q8440B99339
17692A90883G8190l4622b70589a17470o1173b6905I9154b88335H2862d8034j88777
17681b36811g0508k3703j08035B62120D0585b10059j4909A00121h1271B52396
17670d6485A52187a78373P6957k57008C48898e9168E5443a11776E7151J48572
17660B05723B5962a52731G7522J03014N9117E8493a32238A39009F8322a61614
17649a9436m3649D42421f0155C24330J39570j12563j37322l3609O9142C930K31565
17638B35495B8617e1577B47921b07968B3886g7334m6944M368I7774J93899j33510
17627A58163d6430j15331C2455K004b4540A61011P6948j3900a14524C07247j40764
$$ plain form
17704 328410 -69459 -156295 -68144 -16309 348937 152155 44483 -260084 -301638 -213198 299339
17692 190883 78190 43568 -270589 -117470 -178643 -26905 99154 -288335 82862 -48034 -236811
17681 -236811 -70508 -94211 -202246 262120 40585 -210059 -224968 100121 -81271 252396
17670 -46485 152187 -178373 -101416 -358424 348898 -59168 55443 -111776 57151 205723
17660 205723 25962 -152731 77522 180536 239653 58493 -132238 139009 68322 -161614
17649 -19436 -63085 442421 -60155 324330 463900 351337 214015 180406 249548 3930 235495
17638 235495 28617 -51577 247921 -207968 23886 -77334 -124278 -119910 97774 291673 158163
17627 158163 -46430 -161761 32455 34459 -24540 161011 237959 224059 -114524 307247 166483
17616A66483a3726B22091A3346J34759M8281a50163j00715A20066M9070a55430
17605b50171k8578C59054C1224L8498c7860C54334o2436g76k30987B7034N6088
17594H3122J28725I9854K13155c8759B0486R1838g7670C5616K08773C076L09387
17583C12463j32098b01354A24675K99046b25745f7312B33137a8027k00963J01768
17573a17222j05443R077A88504h8986G6716k4717M5803r249J19319n6292a28407
17561a90696A20381d27292A91383R4678l5171f940j01272A85364M388H8610f2971
17549D3864a09142B8397L8638M3283c8210E2773M3748J95409g1563B40139F2421
17537c53428b6417i954A74319D9873a57476D2826J58204a80065A54313o6952N9073
$$ plain form
17616 166483 -13726 222091 13346 148105 196386 -150163 -250878 120066 169136 -155430
17605 -250171 -278749 359054 31224 69722 -37860 354334 291898 -776 -231763 27034 83122
17594 83122 211847 99854 313009 -38759 20486 112324 -77670 35616 244389 3076 312463
17583 312463 180365 -201354 124675 423721 -225745 -67312 233137 -18027 -218990 -117222
17573 -117222 -222665 -213588 188504 -88986 76716 51999 97802 88553 207872 151580 -128407
17561 -190696 120381 -427292 191383 286061 250890 -6940 -108212 185364 189752 88610 -62971
17549 43864 -109142 28397 67035 110318 -38210 52773 96521 291930 -71563 240139 62421
17537 -353428 -26417 -9954 174319 49873 -157476 42826 201030 -180065 154313 87361 146434
17526A46434R8970a47795G2564c9269D2574J09860K78575A27895c46121c632j56752
17515a60384D45285B03807G7803L537C0916d744A65185o6104k1100b21527A10158
17503B43811A19059a51100C56718B5673h587B20553a35823B4999a29480A02919
17492a8419A16559m9776K68876b65426a7562I248c2947A27132O0183G2403L5076
17481A07479b07713A75809B1138L63429j87996G7680A7482a24l5649A12117N1588
17470A63705G847K2282N8133K46452d1841A71147j0882a27445A14969o364c5623
17458a1287l87129B32791C1572g8886C01357b0489C59633J49282k38685Q0842
17448C51072l2655J3348N996r554n4779J8004C9179K31960o7720J51419A35495
$$ plain form
17526 146434 245404 -147795 72564 -39269 42574 152434 431009 127895 -346121 -3632 -160384
17515 -160384 445285 203807 77803 81340 30916 -4744 165185 99081 77981 -221527 110158
17503 243811 119059 -151100 356718 25673 -8587 220553 -135823 24999 -129480 102919
17492 -18419 116559 66783 335659 -265426 -17562 9248 -32947 127132 187315 72403 107479
17481 107479 -207713 175809 21138 384567 196571 77680 17482 -124 -35773 112117 163705
17470 163705 7847 30129 88262 334714 -41841 171147 160265 -127445 114969 108605 -35623
17458 -11287 -398416 232791 31572 -78886 301357 -20489 359633 508915 270230 351072
17448 351072 318417 331765 337761 328207 273428 291432 39179 271139 203419 354838 135495
17436C09094J61823c0873A06679b27103C24522J85238A1198J63715A2727L2700
17426D5427L24971A56408K58350C2136K55803a117B89720L44763A50987J12649
17416B63636J04429J04630L7881B26705a67829C36745J03006j23372a71566C87611
17405B36268p4024L32472j51990A04865f8774B58764a02895C19970r2011L4259
17395B62218A00576J73836K00111j18540A48489o228M21329B4537J58293j2457
17385A70373A9449O2506k3768L76465j09514j05830C7019P7025J93837B8050c7195
17373A33416c8733C22083q5677N0510J0947o8037K25137A66266J05987p9043J18802
17362C12012A7333O7934a1214B80080a37488B28588I0714j1920i9454B7645J28497
$$ plain form
17436 309094 470917 -30873 106679 -227103 324522 509760 11198 174913 12727 45427
17426 45427 370398 156408 414758 32136 287939 -1117 289720 634483 150987 263636
17416 263636 368065 472695 510576 226705 -167829 336745 439751 316379 -171566 387611
17405 236268 162244 494716 342726 104865 -68774 258764 -102895 319970 227959 262218
17395 262218 100576 274412 474523 355983 148489 142261 563590 24537 182830 170373
17385 170373 19449 81955 58187 434652 325138 219308 37019 114044 307881 28050 -37195
17373 133416 -38733 322083 236406 286916 297863 229826 454963 166266 272253 193210 312012
17362 312012 17333 85267 -11214 280080 -137488 228588 90714 78794 -99454 27645 156142
17351A56142D008J37705K44519i8479N9a4202A10789J20719o7714j1122O7391
17340B20063a56207A30729J69723A11027L42283g8950A60025m6650D4881C204
17329C09532d02416A00832a4105D74843p8011j32451D4103M7983J93596j29228
17319A56454M1946J11378o2603Q7699A58356b63400A81686p6989h4182F3664J18853
17308A82517n9647K11115A1047J46276K10897a3588C15493A12227o534M8795K79091
17297D33579d3812a1989E31h0167E58624B45560H434K89774F1083J68144j06986
17286A22241l1014J15575I9187I993J30905M06886c2102B51764B4062J14480a31416
17274A38183f8106R489C65950g5685B61011a37712c5681q0881c947B55595J50709
$$ plain form
17351 156142 4008 141713 386232 -98479 -98420 -14202 110789 231508 163794 152672 220063
17340 220063 -156207 130729 300452 111027 453310 -78950 160025 113375 44881 3204
17329 309532 -402416 100832 -14105 474843 396832 264381 44103 92086 285682 156454
17319 156454 198400 309778 247175 334874 158356 -263400 181686 104697 -84182 63664 182517
17308 182517 122870 333985 11047 157323 368220 -13588 315493 112227 105693 154488 433579
17297 433579 -43812 -11989 531 -80167 558624 245560 8434 298208 61083 229227 122241
17286 122241 91227 206802 99187 9993 140898 547784 -32102 251764 24062 138542 -131416
17274 138183 -68106 -58617 365950 -75685 261011 -137712 -35681 -116562 -3947 255595 406304
17263D06304A77575k580K15076A59957Q5342Q9757A18640J52014n4687A04762
17252B08357O5246b1451B09469P4151I3040J44639N1780H0631N6181e1043B35147
17240A79298M66603g7751I7757D6997K06578J5856K17802A06287a42083H0552
17229A67009g407C26537j26564j4448D9995L37246c9127F11204A26531M393C5356
17217D92595A79330J73937N7588A46109K90685g3904B49151K7793m0095L13872
17207E50721j87217r522J25624A81898L0695J44205j03459J7903M2986A18884
17196A67872J03976r5464K980P3324J87832j68310l7733j10629K2503D8661K06797
17185B55458K48823k45948a54318b3712B31335g8064A38559a8752A65185K25253
$$ plain form
17263 406304 177575 174995 390071 159957 245299 335056 118640 270654 215967 104762
17252 208357 273603 -21451 209469 283620 93040 237679 289459 80631 136812 -51043 235147
17240 179298 645901 -77751 97757 46997 253575 269431 487233 106287 -142083 80552
17229 167009 -7407 326537 199973 185525 49995 387241 -39127 611204 126531 130924 35356
17217 492595 179330 353267 410855 146109 436794 -73904 249151 276944 236849 550721
17207 550721 363504 353982 479606 181898 212593 356798 253339 271242 314228 118884
17196 167872 271848 176384 179364 252688 440520 272210 234477 123848 146351 48661 255458
17185 255458 504281 258333 -154318 -23712 231335 -78064 138559 -18752 165185 390438
17175C90438J7089A29780o1540L62620k7120j54415F0714K56943k4258K18359
17165E11758A90485M5857K20186k17188J92121p3783J07783j24424A39410K00239
17155C39649G6728K75706j67853J05533C6239J65988J27732r8688C5157M49032
17145D84189h59D51230A14427d5618H3497L22371Q2020j67043j04326E0975K6698
17134G7673J35712J78766J80057k06287j58519J05158J93080j84908j24713K77890
17124D73909k08602P525m5721K84335C5082K11522Q9313l8962K52566k41135j5480
17113B92906R7531r9841J9629K05893k57033P8465o4929L38681j57468j72901
17103B80933j40017J19906H6083M33822j06802j0352M77884l01638B38852N13383
$$ plain form
17175 390438 407527 129780 68240 430860 403740 249325 60714 317657 293399 511758
17165 511758 190485 236342 456528 239340 431461 357678 465461 341037 139410 339649
17155 339649 76728 352434 184581 290114 36239 202227 329959 231271 35157 484189
17145 484189 -859 451230 114427 -45618 83497 405868 487888 320845 216519 50975 77673
17134 77673 213385 392151 572208 365921 207402 312560 505640 320732 196019 473909
17124 473909 265307 272832 227111 511446 35082 246604 335917 296955 549521 308386 292906
17113 292906 390437 290596 310225 516118 259085 337550 272621 611302 453834 280933
17103 280933 140916 260822 86083 519905 413103 402751 880635 578997 238852 752235
17093G52235l09989m634l2156P235j54166L34141k05488J3650p3964K95218B24031
17081A50917K13321N4279n0434m953J72876K712k56780C1511J37344K28178l2837
17070C64196J76987j72461R3767j37908K27937K8863j29721j70083J39610K89685
17060G10872o1257B78233L54791k28283J82673J50770C65586J91601J30311k15726
17050D71772J48035k36788K98510j04373P7791J48038B64550K80860J1361J46100
17040G02871j52850M1957R9754l20729L48745j25762l2581j73744L55268l50091
17030C92838N11268C45568K22353J06014k32752J64761j3960R3038K49085l90014
17020E44093J40905k28267K90354O0064J3756j09966k03685O6779J35748l9437
$$ plain form
17093 752235 442246 437612 405456 412691 258525 592666 387178 400828 326864 622082 224031
17081 150917 364238 418517 368083 363130 536006 538718 281938 31511 168855 397033 364196
17070 364196 541183 368722 462489 324581 552518 581381 451660 281577 421187 710872
17060 710872 649615 278233 633024 404741 587414 738184 365586 557187 687498 471772
17050 471772 619807 383019 681529 577156 654947 802985 264550 545410 556771 702871
17040 702871 550021 591978 691732 371003 719748 593986 561405 387661 742929 392838
17030 392838 904106 345568 567921 673935 441183 605944 591984 685022 934107 544093
17020 544093 684998 456731 747085 807149 820905 710939 507254 574033 709781 670344
17010F70344K13365j09385k66505M21260l23278K06133l03733K33697J12360p803
17000H46455k51981K09211J42020l68785J49133K57353k66101j17831M95263k60996
16990H33741j35905J39947P0642k28984J39676L89476j06437l75873N77571k21595
16980A082259l50228J75957k49339L29324K9650j33408k08084K16593j11997J99706
16970I80433k33711J11464k56816L56992l74424K62539J14383Q1678k36704M01146
16960A206980n14191K69784L1692j59477L33831l05437L08726r3707J4795o3423
16950A029573j1775K46280k01881J24353p2951k0012J88903j26970L00944k56316
16940A200148K27278j80230J44780o60j22548K18343j40814m80214L08222O1580
$$ plain form
17010 670344 883709 774324 507819 929079 605801 811934 508201 741898 854258 846455
17000 846455 594474 803685 945705 576920 726053 983406 717305 599474 1094737 833741
16990 833741 697836 837783 908425 679441 819117 1208593 1102156 726283 1303854 1082259
16980 1082259 732031 907988 658649 987973 1017623 884215 676131 892724 780727 980433
16970 980433 746722 858186 601370 958362 583938 846477 960860 1042538 805834 1206980
16960 1206980 692789 962573 994265 834788 1168619 863182 1171908 1078201 1092996 1029573
16950 1029573 1017798 1264078 1062197 1186550 1113599 1093587 1282490 1155520 1456464 1200148
16940 1200148 1427426 1247196 1391976 1391316 1268768 1487111 1346297 866083 1174305 1235885
16930A235885P5713o4595K09170M7238P5323m32761L93812L2800j65702K42500
16920A649383k11468j05426j71431J78519J59761J48189p5003l99648J27905K14669
16910A515450m7646L57538m43342L9244K94780r9392J74957l17581J59205O2111
16900A695324l8786O4512K73827n16129N04129k46393N63139o25386L53507O7586
16890B095330k86831J62434K58641l57516L43229j89505J7577j63695K5036M15839
16880B320539j16152n2033Q2414o1487L76615j34160n9517J86136J3298k81479
16870B274174M51575K27753j83375K21315l14608K4858p6882K57614J16584q0557
16860B918451o3662K2397J32426j12529K72545j70982J25855k1901J32855L3448
$$ plain form
16930 1235885 1311598 1247003 1456173 1503411 1578734 1145973 1539785 1572585 1406883 1649383
16920 1649383 1437915 1332489 1161058 1339577 1499338 1647527 1572524 1172876 1300781 1515450
16910 1515450 1467804 1825342 1382000 1421244 1716024 1616632 1791589 1474008 1633213 1695324
16900 1695324 1656538 1721050 1994877 1478748 1982877 1736484 2299623 1674237 2027744 2095330
16890 2095330 1808499 1970933 2229574 1872058 2215287 2025782 2043359 1879664 1904700 2320539
16880 2320539 2204387 2152354 2234768 2173281 2549896 2415736 2356219 2542355 2555653 2274174
16870 2274174 2725749 2953502 2770127 2991442 2676834 2701692 2624810 2882424 2999008 2918451
16860 2918451 2854789 2877186 3009612 2897083 3169628 2998646 3124501 3102600 3235455 3268903
16850C268903N4872r0764J92894K46741l88164O33612k72098m0425o9062K64474
16840C800983l1288J58662K37761m0825J55511K3169l9871N4108P0829J62105
16830D551144O2682Q8253K31886o9626l27217N26917R2635j74074O6690L70424
16820E419714J16866l6549O203M59772j16635o9454L15026K22974n9304O45038
16810F903651k77566J01052M09348k25071K07733Q3889M80540o4931P07757m80697
16800G845705N19244K95373k4569J8007O53138J82446k6477M33808K10963J30276
16790A0237914O48626p5459L35072L90204J80482R6726O46533L30653M34217J40289
16780A3365257P58152M35246J98784M95884R56074J43608N63022Q17885J96160
$$ plain form
16850 3268903 3323775 3233011 3425905 3672646 3284482 3918094 3645996 3605571 3536509 3800983
16840 3800983 3769695 3928357 4166118 4125293 4280804 4303973 4264102 4318210 4389039 4551144
16830 4551144 4613826 4702079 4933965 4864339 4537122 5064039 5156674 4982600 5049290 5419714
16820 5419714 5536580 5500031 5506234 5966006 5849371 5779917 6094943 6317917 6258613 6903651
16810 6903651 6626085 6727137 7136485 6911414 7119147 7203036 7683576 7618645 8326402 7845705
16800 7845705 8364949 8660322 8635753 8653760 9306898 9489344 9462867 9896675 10107638 10237914
16790 10237914 10886540 10811081 11146153 11536357 11716839 11813565 12460098 12790751 13224968 13365257
16780 13365257 14123409 14558655 14757439 15253323 16209397 16353005 16916027 17733912 17930072
16771A7930072P12595N57865R09608N02704J003701L66515J042263J029854Q48028
16762B4903205R29042J248020J066956J347270J132075J337406J129303J648784
16754C4742061J263503K082196J491976K002368J749198K881205J938292K624380
16746E0775179K223805L248657K623962L492524L923139L173326M044517M363273
16738G7868382M726857M437940M986209O019429N611761O359661O679215O594466
16730A23283920P131200P559280P271239P509341P470751P401599O881375O865037
16722A81373742N589074M900889L886901K573587J513793Q174j504127k683844
16714A95658189l440208n208720n752918o463765p135996p352602p729465p516930
$$ plain form
16771 17930072 18642667 19200532 20110140 20612844 21616545 21983060 23025323 24055177 24903205
16762 24903205 25832247 27080267 28147223 29494493 30626568 31963974 33093277 34742061
16754 34742061 36005564 38087760 39579736 41582104 43331302 46212507 48150799 50775179
16746 50775179 52998984 56247641 58871603 62364127 66287266 69460592 73505109 77868382
16738 77868382 82595239 87033179 92019388 98038817 103650578 110010239 116689454 123283920
16730 123283920 130415120 137974400 145245639 152754980 160225731 167627330 174508705 181373742
16722 181373742 186962816 191863705 195750606 198324193 199837986 199846160 198342033 195658189
16714 195658189 192217981 187009261 181256343 174792578 167656582 160303980 152574515 145057585
16706A45057585p895484p535439p388881o959621o586632o550045o034161n792649
16698I0314673n254831m742160m746841m119215l923509l722800l344990l472753
16690E6987574l279891k448868k869701k398115k136115k128731k117959k052512
16682C7555682j797073j479527j627204j482726j078946j269980j364633j021154
16674B6434439j150197j146641q99729o66221r80957r18143m95382r61273o62828
16665A8553068m62258n60332n34861n82210p43733n45574p04707l77371p8041
16656A3963981n88923k90799l98257n53551m43372k45251k37896l43797j44914
16647A0717221k09069m16972l19221n39088k44391J34201j92549n10498l3215
$$ plain form
16706 145057585 137162101 129626662 122237781 115278160 108691528 102141483 96107322 90314673
16698 90314673 85059842 80317682 75570841 71451626 67528117 63805317 60460327 56987574
16690 56987574 53707683 51258815 48389114 45990999 43854884 41726153 39608194 37555682
16682 37555682 35758609 34279082 32651878 31169152 30090206 28820226 27455593 26434439
16674 26434439 25284242 24137601 23237872 22571651 21590694 20672551 20177169 19215896 18553068
16665 18553068 18090810 17530478 16995617 16413407 15669674 15124100 14419393 14042022 13963981
16656 13963981 13375058 13084259 12686002 12132451 11689079 11443828 11205932 10862135 10717221
16647 10717221 10508152 10091180 9771959 9232871 8988480 9122681 8930132 8419634 8386419
16638H386419k96900l68811J88403m88104j98227L4479m92509J45607m04506r0572
16628F415279p355R5068p76777j00640k2241r1461K11267m32697N485l79125j67472
16617D749331O49986m82861j12416l53485J75535j96796j89912L58456l53449
16608D244389k20626J6929j0091m7083j45743J25845m68233J05197Q7339n097
16598C682826k91559L46747j68326m82716J00547K03722l28270J25181J53673
16589C341825p43073K78253j35136m3881l8924L49054m21791J25425j49157M95049
16579C057644m53612k07263R6010M8695j74023J7166j57948N1758j91146J17984
16569B205265J39256l09768l6204O9825j82366M56956m93433K9863K00702r9383
$$ plain form
16638 8386419 8089519 7720708 7909111 7421007 7222780 7257259 6764750 6910357 6505851 6415279
16628 6415279 6407924 6502992 5726215 5625575 5603334 5511873 5723140 5290443 5295928 4916803 4749331
16617 4749331 5399317 4916456 4804040 4450555 4626090 4429294 4239382 4597838 4244389
16608 4244389 4023763 4040692 4030601 3983518 3837775 3963620 3495387 3600584 3687923 3682826
16598 3682826 3391267 3738014 3569688 3086972 3187519 3391241 3062971 3188152 3341825
16589 3341825 2598752 2877005 2741869 2697988 2659064 3008118 2586327 2711752 2562595 3057644
16579 3057644 2604032 2396769 2492779 2541474 2367451 2384617 2226669 2278427 2087281 2205265
16569 2205265 2344521 2034753 1998549 2068374 1886008 2342964 1849531 1879394 2080096 1980713
16559A980713r1416J10660j91938J61310j46339M48458m37077k57658J26327L20231
16549B023271m63121K65604J05653j45712m7663M2709l78421L34061l84434o196
16539A345751l11180L88007J08937M338j84690L5415k95894L17024m30681O1341
16529A038368K31589K03216k50419J36485j60872L1680J09461o0297n7403m7525
16519A174283K87993k27146j58373K13786N0921J55051m03221j00214K21923N4638
16509A269641J3140j76877j25852K34825k95475O7326k39243J35298J59162j6072
16499A025873L1704r0921j55855J32174l6827J86063p9773L0527k01992K4442
16489H65415L99846l86695l2755K86801n32759K61423J82378j63590L9150k13371
$$ plain form
16559 1980713 1889297 1999957 1808019 1969329 1822990 2271448 1834371 1576713 1703040 2023271
16549 2023271 1560150 1825754 1931407 1785695 1738032 1780741 1402320 1736381 1351947 1345751
16539 1345751 1034571 1422578 1531515 1535853 1351163 1386578 1090684 1407708 977027 1038368
16529 1038368 1269957 1473173 1222754 1359239 1198367 1230047 1339508 1279211 1221808 1174283
16519 1174283 1462276 1235130 1076757 1290543 1341464 1496515 1093294 993080 1215003 1269641
16509 1269641 1282781 1105904 980052 1214877 919402 986728 747485 882783 1041945 1025873
16499 1025873 1057577 966656 810801 942975 906148 1092211 1012438 1042965 840973 865415
16489 865415 1265261 878566 845811 1132612 599853 861276 1043654 880064 919214 705843
16479G05843K35296p536j32460R8758l31513L34317r1874k1516K47401l41738
16469F94978k36969K08882J0305P8198l7462C05267M82111j77996N8081n7890
16459F09573r638j94872J12226M39572D31955J81506j16215L04052j19576k71678
16449D10044J48106j38152K89909J10196j68275m203k16507O2699B15257M59315
16439F74572J31917k77282j0513O4575j0639m8243j79204M58191k88333n9544
16429D55497J03740j10146N648M4073L4018J62896j20879j62516q4665m9085K42169
16418E20750K22376k73281m1954K13028L16409m28598j96866J436L2904N53200
16408I19404l78028j04785J7105O0034B11991L38056j89366J62853A04317L61873
$$ plain form
16479 705843 941139 933603 801143 899901 568388 902705 810831 789315 1036716 694978
16469 694978 458009 666891 677196 755394 717932 305267 787378 609382 667463 609573
16459 609573 599935 405063 517289 956861 431955 613461 497246 801298 681722 410044
16449 410044 558150 419998 709907 820103 651828 647625 431118 493817 215257 674572
16439 674572 806489 529207 518694 583269 572630 524387 345183 803374 515041 455497
16429 455497 559237 449091 454739 498812 532830 695726 574847 412331 327666 278581 520750
16418 520750 743126 469845 427891 640919 957328 528730 331864 333300 366204 919404
16408 919404 541376 436591 453696 513730 211991 550047 360681 523534 104317 466190
16398D66190A49837L37427j17159j75502J4540C9696L09852K26029q915k81361
16388B85301L59262B09205K08034j43170o9302l5772E1201K67820m0061m0766
16378B38194J30545A40372J71218j07263P9974J1837l4017P815Q1148J00464a55887
16366B30978J81610K27537E0750M59890A52900J7587P5539j175L27733B49855
16355C30506q8869H1818J40561j03797M35213k39263j18509K7308J4595N4500
16345B92426J05613G9846R3720J44812A45558J48966J81766f1041D58696B28308
16334A53702J16063I2318m519C4314L81945G3200L8516J44328q3379L22030A21674
16322D32556A89575L04116B23185A10994L11946k06282m3199l6047N1114p9563
$$ plain form
16398 466190 149837 487264 370105 194603 209143 39696 349548 575577 566662 285301
16388 285301 644563 209205 417239 274069 204767 168995 51201 319021 278960 238194
16378 238194 368739 140372 311590 204327 284301 296138 262121 269936 351084 451548 -155887
16366 230978 412588 640125 50750 510640 152900 170487 246026 244851 572584 249855
16355 330506 241637 81818 222379 118582 553795 314532 196023 223331 237926 292426
16345 292426 398039 79846 173566 318378 145558 294524 476290 -61041 458696 228308
16334 153702 269765 92318 87799 34314 416259 73200 111716 256044 172665 494695 121674
16322 432556 189575 493691 223185 110994 422940 216658 173459 137412 188526 108963
16312A08963Q3730G7737e0136A66780K74654B11269b6663C1074L7137A8735M6164
16301F4899J77023a3238b899C25607Q758R0822a9346A97036J67965D215L71504
16290C75719J16836A72735G3510K76989a29931N9819B30250b4155I9468J2083
16280A11551K43861a5433B10792l4798I885K55609o2660F1089J8216a68768A7330
16268C26380j13453J45799F6715K97987j18756L19959k20437A06309R4786o5440
16258A35655J5190D5090J68708p7549K04612a85003C14986B6205L05847h2065
16247A89558K24326A05376N20015B37801L6696n6030O6026J56447A32307n715
16237A26592D782J67236F9828L38013A82296b19218R8982d9691I5531L71863A22755
$$ plain form
16312 108963 192693 77737 -50136 166780 441434 211269 -26663 31074 68211 18735 64899
16301 64899 241922 -13238 -2899 325607 334365 425187 -19346 197036 365001 4215 375719
16290 375719 492555 172735 73510 350499 -129931 -70112 230250 -24155 99468 111551
16280 111551 355412 -15433 210792 175994 9885 265494 202834 61089 79305 -168768 17330
16268 326380 212927 358726 66715 364702 245946 565905 345468 106309 201095 135655
16258 135655 150845 45090 213798 136249 340861 -185003 314986 26205 332052 -82065
16247 189558 413884 105376 625391 237801 274497 218467 284493 440940 132307 126592
16237 126592 4782 172018 69828 407841 182296 -219218 -120236 -49691 95531 467394 122755
16225b36660A87450H4676a05810B26704j9298g7082A1928h1517D38491j24671
16215C13820J06441a98791A47843k9195n4687e8581A91355J10548b7262q5226
16205a12488A56895G4709a09450n5653E1714J09563k4960k7143d0606A50357k9449
16194A20908M6808F5792J49399l6922J01207b72776J02494P7768A69742M882A5387
16182B31730N0012i8332A36456a9373A06176i1700p2448A92005b67815d510A29382
16170I3718l4349L499b03163E7235b11919D7056b7884j0497A0908c529G8785K74837
16158C53622A30504h2529B76835h2387q4105C25127m1782I5065b40786k15676
16148d56462B20465a95081A64272m1660c2003q5758A25521c09104c6233A0587
$$ plain form
16225 -236660 187450 84676 -105810 226704 207406 -77082 11928 -81517 438491 313820
16215 313820 420261 -198791 147843 118648 63961 -58581 191355 301903 -27262 -112488
16205 -112488 156895 74709 -109450 -165103 51714 161277 136317 109174 -40606 150357 120908
16194 120908 167716 65792 215191 178269 279476 -272776 -170282 -92514 169742 174624 15387
16182 231730 281742 -98332 136456 -19373 106176 -91700 -164148 192005 -267815 -4510 129382
16170 93718 59369 62868 -203163 57235 -211919 47056 -27884 -38381 10908 -3529 78785 353622
16158 353622 130504 -82529 276835 -82387 -166492 325127 283345 95065 -240786 -456462
16148 -456462 220465 -195081 164272 122612 -32003 -117761 125521 -309104 -36233 10587
16137A63543f6608j27901A0583K4267K5184a00786r937m8055L2151e2739l35120
16126c87859A81855B74J49161D2866a976j85242Q5543m6508E5289b84871B29854
16114A1308b93836J1255g5531j14990l78225c021q7268j06002j10516A05026K29906
16103C34932b5076E3139L5617g076o4527j7146B33859J02687a58664j69081a00203
16091A27723J25165a45409E1654e8581D2523e4627j84454A28188a94854E4011
16080a09953F8903a56820P6712F3207a10079d4106B457L57360j59718B9073a00505
16068C13686c3851j80067k3316B47333j05498G0668a7876k07728A20959b02217
16057i1253A50602C7651q019K18638C6370b49283N2987A84816b77345A00268a97865
$$ plain form
16137 163543 -66608 -194509 10583 34850 60034 -100786 -110723 -158778 -126627 -52739 -387859
16126 -387859 181855 274 149435 42866 -1976 -187218 -101675 -148183 55289 -284871 229854
16114 11308 -293836 -282581 -75531 -190521 -568746 -3021 -90289 -196291 -306807 105026 334932
16103 334932 -25076 53139 88756 -7076 -71603 -88749 233859 336546 -158664 -327745 -100203
16091 127723 252888 -145409 51654 -58581 42523 -54627 -239081 128188 -194854 54011
16080 -109953 68903 -156820 -80108 63207 -110079 -44106 2457 359817 200099 29073 -100505
16068 313686 -33851 -213918 -237234 247333 141835 70668 -17876 -225604 120959 -202217
16057 -91253 150602 37651 29632 248270 36370 -249283 -196296 184816 -277345 100268 -197865
16045d5704B6461J18270J29515a57585A5742J62596i2416L6610j77192K9349l0583
16034b34232a0582B52050a1189A58880F6749J00543q3349M6968j7365J89221C6221
16022B24923a48958N2811G133J33725k9101O7889b1358j32427n9337c6198A71861
16010c17866a7001A25034K9858J2670F645h2064A49587a94154H2962b90137A20894
15998C38690a78592C23653i6891B70349J2162a96377k2052A10496a1527H0535
15987A75232a59408B22661A6884J93779E5937L949J62454I2201h4070A40278J98971
15976C39249F8747K34724A9489J24723d4763A40824a63777A39618c36577R6485
15966b40092D15399M9625I3871J9390J10714a49770C5597c24414H2957e3107o6064
$$ plain form
16045 -45704 26461 144731 274246 -157585 15742 178338 -92416 -55806 -232998 -203649 -234232
16034 -234232 -10582 252050 -11189 158880 66749 167292 83943 130911 113546 302767 36221
16022 224923 -148958 -96147 7133 140858 111757 179646 -21358 -153785 -213122 -36198 171861
16010 -317866 -17001 125034 154892 167562 6645 -82064 149587 -194154 82962 -290137 120894
15998 338690 -178592 323653 -96891 270349 282511 -196377 -218429 110496 -11527 80535
15987 175232 -159408 222661 16884 210663 55937 59886 222340 92201 -84070 140278 339249
15976 339249 68747 303471 19489 144212 -44763 140824 -163777 139618 -336577 -240092
15966 -240092 415399 465024 93871 113261 223975 -149770 35597 -324414 82957 -53107 -119171
15955a19171H789b2447j68613d178j63825A6514a78727Q8298H3391Q2270c8466
15943b55016J14217f3503H11g282k15166j38411J27720R6204A371J66882n6590
15932A11663c78843g2244F5137b01657Q7967H4685J40018n1919c88069G7434e4309
15920a2970C79443b75006h8508p0025P5465c8030j46176L4689b1199A61540b94960
15908A0070J42299e7176A14574a29671H0847a75609N3339d4719A17876c67084
15897B52639c3664B3053J8957b07732N6472H288J22408b34921o8106A21724b04679
15885B46984C6073d5229F3854a68113A50256d1303B3988c28913a56873B77616
15874d00808a65163C0939f7617j89042i2772B03126B0806R093O6112C3959i2379
$$ plain form
15955 -119171 8789 -22447 -191060 -4178 -168003 16514 -178727 -90429 83391 165661 -38466
15943 -255016 -140799 -63503 811 -7282 -222448 -360859 -233139 -136935 1371 168253 111663
15932 111663 -378843 -72244 65137 -201657 -113690 84685 224703 172784 -388069 77434 -54309
15920 -12970 379443 -275006 -88508 -158533 -83068 -38030 -184206 -149517 -21199 161540 -294960
15908 10070 152369 -57176 114574 -129671 80847 -175609 -122270 -44719 117876 -367084
15897 252639 -33664 23053 42010 -207732 -151260 8288 130696 -234921 -303027 121724 -204679
15885 246984 36073 -45229 63854 -168113 150256 -41303 23988 -328913 -156873 277616
15874 -400808 -165163 30939 -67617 -256659 -92772 203126 20806 29899 96011 33959 -92379
15862b04086J0805Q8051K2098J4261a320l41584d4659B38721I8380N8440F6267
15850H7899a24173o3731C3050c700m5344n840A9777g0032o5565E6351K26506I9120
15837b96537B1436a21524C03257E6486b6331p607R752E5605d177j8609n0852j45819
15825b19457m671g3290A57096B8457b13299b7829k8898F3840J56143a90981C8510
15813B63681a30888K4507j18838c769B02028h7057M3335j34348B1588M8518j8822
15802E1284J66039J3947b78142j86687d4968A16678a0542l70886a49740P4474
15792g5266D4369J5821a83978O3377A03033R5099a87513O1108G8062b15191N2620
15781a62571N7596d7338R419j40080A27169J92922l7188A28808d7777r9224B1168
$$ plain form
15862 -204086 -193281 -105230 -83132 -68871 -1320 -342904 -44659 238721 98380 156820 66267
15850 87899 -124173 -187904 33050 -3700 -49044 -54884 19777 -70032 -135597 56351 282857 99120
15837 -296537 21436 -121524 303257 56486 -26331 -33938 -24186 55605 -4177 -22786 -73638 -219457
15825 -219457 -224128 -73290 157096 28457 -213299 -27829 -56727 63840 219983 -190981 38510
15813 263681 -130888 -106381 -225219 -3769 202028 -87057 -43722 -178070 21588 70106 51284
15802 51284 217323 231270 -278142 -464829 -44968 116678 -10542 -381428 -149740 -75266
15792 -75266 44369 60190 -183978 -120601 103033 198132 -187513 -126405 78062 -215191 -162571
15781 -162571 -104975 -47338 -37919 -177999 127169 320091 282903 128808 -47777 -147001 21168
15769c7789A146e1610a1751j03322j35726j95130a18286B6698a52024k41617A1298
15757e4250B7627g8243F3439a10033L3250j055j38750f7330j39262A1053C031
15745a9426j44438C5272a9169B77034a51620g3442A37742a73425B12266b7710
15734f6538j4036B93407D707M5950c8892j14315H9669a55902e810j45131G3649
15722b04058A31351K023a16293A01854a72072N6691k594r2761j840C5651J58475
15711A94126c27192Q1000o6621b2956E4006j0097e7193J1282j3241A49399i6751
15699h4732A83243R708a42684n1013O0509k26929e2651D3447L86542F5195b73551
15687b9152j5164k95493B94977A43270a75182C5745L27575a4302j97576P0619
$$ plain form
15769 -37789 1146 -51610 -11751 -115073 -250799 -445929 -118286 26698 -152024 -393641 11298
15757 -54250 27627 -78243 63439 -110033 -76783 -77838 -216588 -67330 -206592 11053 3031
15745 -19426 -163864 35272 -19169 277034 -151620 -73442 137742 -173425 212266 -27710
15734 -66538 -80574 293407 4707 50657 -38892 -153207 89669 -155902 -5810 -150941 73649
15722 -204058 131351 133374 -116293 101854 -172072 -115381 -117975 -210736 -212576 35651 194126
15711 194126 -327192 -246192 -312813 -22956 54006 43909 -57193 -45911 -59152 149399 -96751
15699 -84732 183243 192951 -142684 -193697 -133188 -360117 -52651 43447 429989 65195 -273551
15687 -29152 -44316 -339809 294977 143270 -175182 35745 363320 -14302 -211878 -141259
15677a41259C25128j13708p1328c2305k025G6490h5579C98562A06714b56029P2943
15666a83086Q6537G0117B3560f0003B84223b41315A113J31045f1237F1034a29323
15654b0273k0056a2336l91007j47891b57296C50461a89022C26007G1132N0560
15644A21692R1406b11451j38739H3693a62986N6755F1724O5908D6294J55500D426
15632a34096c5799p9454B01714J18454b14906G3964d3121m3471q084A71108b45696
15620b63600F3789a02713A88199g9646j08453B1356J1895b31593A45933k8518
15610A17415c41074b5211m860a2695B90957N201i4741n1622l0634B46146i6137
15598c22358A80904J88431F9720P7914C5637R9705K70951f4746j33857A03866
$$ plain form
15677 -141259 325128 211420 140092 -32305 -34330 76490 -85579 398562 106714 -256029 -183086
15666 -183086 -96549 70117 23560 -60003 284223 -241315 1113 132158 -61237 61034 -129323
15654 -20273 -40329 -12336 -403343 -551234 -257296 350461 -189022 326007 71132 121692
15644 121692 213098 -211451 -350190 83693 -162986 -106231 61724 127632 46294 201794 4426
15632 -134096 -35799 -115253 201714 320168 -214906 73964 -43121 -86592 -94676 171108 -245696
15620 -263600 63789 -102713 188199 -79646 -188099 21356 33251 -231593 145933 117415
15610 117415 -341074 -25211 -30071 -12695 290957 296158 -94741 -146363 -176997 246146 -96137
15598 -322358 180904 369335 69720 147634 35637 135342 406293 -64746 -198603 103866
15587f9547k9286A94055a57046A89596m0983c9489J6481E6685B1379d12388A95032
15575a38607G1655J09721j9342K6577c61036J44894g8624I5208a05403o5310A42247
15563c73867a16330H6024B0551d8907A16590M6093c9821j35870r3227A43059p1505
15552G1554L1978g7999n1450j71252B24594a42593F9969J23728a48584m3617B72156
15540A39603A9766J17625M9964b01551Q5357e0414m62331G6438L375J16348c17311
15528A1544b8330A01410F262P5832a30884G46b35473o01d7207Q219r9948r5760
15516b34696E5243K62551E8848J94539i007j10735k61403g6108A12844c35479
15505d33308A3852a35476m061q2087g0083a9155o6575H1823K036b24242G5738
$$ plain form
15587 -69547 -98833 194055 -157046 189596 148613 -39489 -23008 56685 21379 -412388 195032
15575 -138607 71655 181376 162034 188611 -361036 -216142 -78624 95208 -105403 -170713 142247
15563 -373867 -116330 86024 20551 -48907 116590 162683 -39821 -175691 -268918 143059 71554
15552 71554 103532 -77999 -129449 -300701 224594 -142593 69969 193697 -148584 -192201 272156
15540 139603 19766 137391 187355 -201551 -116194 -50414 -512745 76438 79813 196161 -317311
15528 11544 -28330 101410 6262 82094 -130884 746 -235473 -236074 -47207 -38988 -138936 -234696
15516 -234696 55243 317794 58848 253387 -9007 -119742 -381145 -76108 112844 -335479
15505 -433308 13852 -135476 -139537 -221624 -70083 -19155 -85730 81823 83859 -224242 75738
15493c35693a8530A4417L4969b52070h9916r6313c2380m9625L4630n1196q9412
15482a87983L5819d7974b2840A5690b37181B1223o125N4710R4595a38029N9280
15471g8749b5513A06964A8264c8841q2139e1428j2928C8687g7899k8657A28349
15459G6036k828F307i0122r6843D7837J70715I2412J36236a6394k78116C86O4671
15447F5057L12763b384E527P8008h9030p6187J2061A21824b24880A0345g417k18097
15435b25514b6877j73469D7765b87200A04123b26129L5602A36605B598e6579p149
15424f3728l7174A69539j8960J3831b38288r5526e2372I0531D0608b04382f9501
15412A27790a79913Q0854M4178j62238n9874A29519h4196B66408G9305d9940o0747
$$ plain form
15493 -335693 -18530 14417 49386 -252070 -89916 -186229 -32380 -82005 -47375 -98571 -187983
15482 -187983 -152164 -47974 -22840 15690 -237181 21223 15098 69808 164403 -138029 -78749
15471 -78749 -25513 106964 18264 -38841 -120980 -51428 -64356 38687 -77899 -106556 128349
15459 76036 73208 6307 -90122 -186965 47837 218552 92412 228648 -16394 -294510 386 65057
15447 65057 377820 -2384 5527 83535 -89030 -165217 -153156 121824 -224880 10345 -7417 -225514
15435 -225514 -26877 -200346 47765 -287200 104123 -226129 -190527 136605 2598 -56579 -63728
15424 -63728 -100902 169539 150579 164410 -238288 -333814 -52372 90531 40608 -204382 -69501
15412 127790 -179913 -99059 -54881 -217119 -276993 129519 -84196 266408 79305 -49940 -110687
15401a10687n4436B22827h1221B11129K03104h396A85137h7149E9518g7661j75388
15390b53049j0255k25722B8612K857b70168D8719J52697l5954b89599c1090j47829
15379a78919b7261H3488M7601R4019a04741q8527B02434b99251A74228a77379
15368g8672B28091D2046J48839N6493E1351Q7606m2015a99890c6875C0361R8831
15357A29192e7629A36421a262A51423f7377B03972c54287I3467c94969D7571Q8092
15346A35663C4470P181N2276J55424j19184m0222c9700A52095a34426A50119c2464
15334b85843C60029I8599J7615B9088J24287o7102k628b75868I4278a34947b7000
15322A53472J4372B9126O2847A4475b04159N206A15137K7799a51918A81830J5503
$$ plain form
15401 -110687 -165123 222827 -81221 211129 414233 -8396 185137 -87149 59518 -77661 -253049
15390 -253049 -263304 -489026 28612 31469 -270168 48719 201416 165462 -289599 -31090 -178919
15379 -178919 -27261 83488 131089 225108 -104741 -193268 202434 -299251 174228 -177379
15368 -78672 228091 42046 190885 247378 51351 138957 96942 -199890 -36875 30361 129192
15357 129192 -57629 136421 -1262 151423 -67377 203972 -354287 93467 -394969 47571 135663
15346 135663 34470 41651 93927 249351 130167 89945 -39700 152095 -134426 150119 -32464
15334 -285843 360029 98599 116214 29088 153375 86273 83645 -275868 94278 -134947 -27000
15322 153472 167844 29126 91973 14475 -204159 -198953 115137 142936 -151918 181830 197333
15311A97333b28923O3415K4565m3787A53485g0798A0285a12906d2115B63675a56238
15299B46298b42928D0896a41277F668c7943k89518i930p7159r9690A36158b39089
15287d7085j86622d7062D8511D88Q4630O6550N7840l3348N3397a37701d8403B20963
15274a20710h972n4147E462L7725a27658E7724M5778M236c7944B81749a2977k40978
15262b53955g8010A18925D8183h6264D17956A13414l1235a36277C65010q8297
15252B76713b1788k2718A1036M54258Q00472M2266j93805N10897G16470A74705
15241D94404A76289E1828n174L1078L76529A19529l3582a18115o8399N2887j23038
15230b56665B20773K00417F1125K04773A23193k910d7899m9365p438o2268A82226
$$ plain form
15311 197333 -228923 -165508 -140943 -184730 153485 -70798 10285 -112906 -42115 263675 -156238
15299 246298 -242928 40896 -141277 6668 -37943 -327461 -9930 -87089 -186779 136158 -239089
15287 -47085 -233707 -47062 48511 488 85118 151668 209508 176160 229557 -137701 -48403 220963
15274 -120710 -8972 -63119 5462 43187 -127658 57724 103502 107738 -37944 281749 -12977 -253955
15262 -253955 -78010 118925 48183 -86264 417956 113414 82179 -136277 365010 276713
15252 276713 -21788 -44506 11036 465294 1265766 1308032 1114227 1625124 716470 174705
15241 494404 176289 51828 46654 77732 454261 119529 85947 -118115 -186514 -133627 -256665
15230 -256665 220773 421190 61125 265898 123193 120283 -47899 -97264 -104702 -166970 182226
15218B19203i488A32628j678N2100b38203g1654h994l3893j32334H7559J51429
15207B38988o5616h1699A10749P5913c32169A23432R949c5879A48678a44995B99760
15195a96008B95323J05574A16534b49582C26416B0973e359B492J91889F1230J58878
15184B20108p7033M9698L2022n1634a51280A00123M11322H2127L84962A7347a26997
15172i4726A75761q3531j3210R6503b1171H4733e211C9029J69190r5916l2945
15161G9358Q1159l3476J76457O4718C3522c35j77397a4098k40439C8719h9895
15149b14747A31299d4680m2728D0143b3048B76502G7745J49300a10501A69846
15138a80491c3419A61593c4880B07757m86J93646C6178K86580A5717J56949R1092
$$ plain form
15218 219203 -9488 132628 130950 183050 -238203 -71654 -8994 -42887 -175221 87559 238988
15207 238988 173372 -81699 110749 186662 -332169 123432 133381 -35879 148678 -144995 299760
15195 -196008 295323 400897 116534 -249582 326416 20973 -5359 2492 194381 61230 220108
15184 220108 143075 192773 224795 173161 -151280 100123 511445 82127 467089 17347 -126997
15172 -94726 175761 92230 79020 175523 -21171 84733 -5211 39029 208219 112303 79358
15161 79358 160517 127041 303498 368216 33522 -335 -177732 -14098 -254537 38719 -89895
15149 -214747 131299 -44680 -87408 40143 -23048 276502 77745 227045 -110501 169846
15138 -180491 -33419 161593 -34880 207757 207271 400917 36178 322758 15717 172666 263758
15127B63758j11895b0418G2100J10586g1900C50076H5881P8785J695J13348q1624
15116A98085a54538A31029E724L68120A31584J6439K75146a56530A29285b04737
15105A64325R7945I0324C5951J19026J0169K58745A19882Q6355R8387j29996k2368
15094A52260l569K80799g5578K4501N056F9386K93499c8828F4538L9404f1337
15082A73425k1966D1962Q4292J9297b48257D30123a70821B97354J66980f2840
15071A70551B3225Q0610o062L31481q4203Q4182k0088n5302a56940B28998o2134
15060A66864g4268A8485P4887L95416A03781a40134B29808D8790J59428K14939
15050D23157j73540i6042C36648j67037D1856K49328a05369B30130R8552j23004
$$ plain form
15127 263758 151863 -20418 72100 182686 -71900 350076 85881 164666 166361 279709 198085
15116 198085 -154538 131029 5724 373844 131584 148023 423169 -156530 129285 -204737
15105 164325 262270 90324 35951 154977 165146 423891 119882 206237 304624 174628 152260
15094 152260 148691 429490 -75578 -51077 -46021 69386 362885 -38828 64538 103942 -61337
15082 173425 151459 41962 126254 145551 -248257 430123 -170821 297354 464334 -62840
15071 170551 23225 103835 97773 429254 345051 429233 409145 353843 -156940 228998 166864
15060 166864 -74268 18485 93372 488788 103781 -140134 229808 48790 208218 423157
15050 423157 249617 -96042 336648 169611 41856 291184 -105369 230130 328682 205678
15040B05678J10747A35742N8515L2264m0786K0941L160G6242J37091A1603J14692
15029A26295J86113G5485P7456J63182n1772j27451P4779J89400C0165B603J36982
15018A39585o8388K1873J56177L2571a02162G3488K3403L3791L7663b06454A80028
15006C69096O5495b65073A82508R7394K603J46492j50121j03079m9184a33214
14995A6191g1639C57509A47775a7045A67159e9856G46361A20117J66049J84608
14985D70774k16060r6316K61376H2980J51154J18348L070A7466K78877q6932F49
14973B5850L55124j02141A36104J91682A36041K46991j20379A01361L00355g5549
14962B48862K4367n0494K97741k44818p7597L8808h5844C02827N4025L03594d0328
$$ plain form
15040 205678 316425 135742 194257 226521 185735 206676 209836 76242 213333 11603 126295
15029 126295 312408 75485 152941 316123 264351 136900 211679 401079 30165 2603 139585
15018 139585 71197 93070 249247 281818 -102162 73488 96891 130682 168345 -206454 180028
15006 369096 434591 -265073 182508 279902 282505 428997 278876 175797 126613 -133214
14995 16191 -71639 357509 147775 -17045 167159 -59856 746361 120117 286166 470774
14985 470774 254714 158398 419774 82980 234134 352482 355552 17466 296343 209411 649
14973 25850 380974 278833 136104 327786 136041 383032 262653 101361 401716 -75549
14962 248862 273229 222735 520476 275658 198061 236869 -85844 302827 356852 660446 -40328
14950A94314L43351k47812K10963a57394A79851O7426r0815C9683K47834A05772
14939D03683j50349j15504f6157A61478J95046j20274J62371J01572k08581J22271
14929D13883p9695K29907j19028f9626A83012R5859K77359E4805J86910L5950
14919B77665c5191C36154O5523J6632I3524B8636L11022M1988Q5828a6288E45739
14907A58843L49446J93422k60005P3718A54494J22003M946k2114K59060k09139
14897C09250L11629k75240A20176J06951l891J23558l4210N47377m27282M5195
14887D77874r9389j75407j9443J47700J05656B04863M69173C25883K71021k49831
14877C47073Q4230j1962q2841q2041J85376j14984J65915A60731M24805B70899
$$ plain form
14950 194314 537665 289853 500816 -157394 179851 247277 156462 39683 287517 105772
14939 403683 253334 137830 -66157 161478 356524 236250 398621 500193 291612 413883
14929 413883 334188 564095 445067 -69626 183012 278871 556230 54805 241715 277665
14919 277665 -35191 336154 401677 418309 93524 28636 339658 381646 467474 -16288 545739
14907 158843 508289 701711 441706 515424 154494 276497 281443 259329 518389 309250
14897 309250 620879 345639 120176 227127 223236 346794 312584 859961 432679 477874
14887 477874 378485 203078 183635 331335 436991 204863 674036 325883 596904 347073
14877 347073 431303 419341 336500 254459 439835 324851 490766 160731 585536 270899
14866A74610P5221K84157j607m3676m9870j94913i4486F15435j58773M04364B95284
14854E78473k68771O5413H4718K00665J41699Q8903j19089L40000B07524M0206
14844B47730J15817R048m0666O6389K80422j98065K05857o5798B79230N5702J90465
14833E25397A35398K02107K79309j17283K44513J65763D28370K64962l25727m0258
14823C27347J52157j23756L81931j62039j79696J42811k10435K52355k25912j10731
14813B44032J19628J09095L57781B08920K52163k1834R2701K213J00146B84721
14802E67574n2888A37080L02686J79851k55819L8167N5741K26020k90357K96471
14792F89840j54536A22502N00187L031L45030D57610J61888B44160M08103J7453
$$ plain form
14866 174610 249831 533988 532381 488705 438835 243922 -94486 615435 456662 861026 295284
14854 578473 309702 375115 84718 285383 427082 515985 396896 736896 207524 247730
14844 247730 363547 372595 331929 398318 678740 480675 686532 620734 279230 334932 525397
14833 525397 135398 337505 616814 499531 744044 909807 428370 693332 367605 327347
14823 327347 479504 355748 737679 575640 395944 538755 328320 580675 354763 244032
14813 244032 363660 472755 830536 208920 461083 439249 531950 534163 634309 284721
14802 567574 514686 137080 439766 619617 363798 401965 457706 683726 393369 689840
14792 689840 535304 122502 622689 625720 970750 457610 619498 244160 652263 669716
14782F69716k0034J68152k70308J09804o4184j60606K59835K3008L1082k2224
14772G24241k05033r0894J75812K64071l54473J92713k91085O31055m79781J16407
14762F83033l17531L23614j89092J44995J22158q578J3661j64425k09972J82172
14752E80035K76687l73424m5487l0207K92927J75279R7809m33195K37720K18194
14742I96338j92292M420l23244L03364L26667n03401o7109J91101M2542K37023
14732A015409o7721l34436L55272k49938M89084r2263l56937J13150K63502j80494
14722I54628j73743O49456o95999l8726L02483k09133J95713j08543j60406k49455
14712D66275K66344J60215J3553q070K29774m22066J22746j56540J57660r7147
$$ plain form
14782 669716 649682 817834 547526 657330 593146 432540 692375 715383 746465 724241
14772 724241 519208 428314 604126 868197 513724 706437 415352 1046407 566626 683033
14762 683033 365502 689116 500024 645019 767177 758599 772260 607835 397863 580035
14752 580035 856722 483298 437811 407604 700531 875810 973619 540424 778144 996338
14742 996338 804046 808466 485222 788586 1115253 611852 544743 735844 778386 1015409
14732 1015409 947688 613252 968524 718586 1207670 1115407 758470 871620 1135122 954628
14722 954628 780885 1430341 734342 695616 998099 788966 984679 876136 715730 466275
14712 466275 732619 892834 906387 898317 1128091 706025 828771 672231 829891 732744
14702G32744K15596j55869J41151R5667l16000K51212J15373j63057q6762J42907
14692I72962J91659l09445L96260n23675M23752l93836J17532l4267K9923K43809
14682A114674R0101k28666L01567l00133N124j06131K31285J34585k52988L11960
14672A301378k04555l5455j75844N00773n07696J0586K57664K3017K87717k05600
14662A251985k06933J72098J79811m42503M73242m35560Q1101M9056J14303p486
14652A229114L8708l66823L69223K19627M8972L1173l65174J28194j90497O79375
14642A821892l14140P505o34987L81496j83869r1545J34578J4577K26387K0716
14632A382610k21101J20290J43137k14877j42655K29655M35936l67653r9487J97918
$$ plain form
14702 732744 948340 792471 933622 1029289 713289 964501 1079874 916817 830055 972962
14692 972962 1164621 855176 1251436 727761 1151513 757677 875209 840942 870865 1114674
14682 1114674 1204775 976109 1277676 977543 982667 876536 1107821 1242406 989418 1301378
14672 1301378 1096823 1061368 885524 1386297 878601 889187 1146851 1169868 1457585 1251985
14662 1251985 1045052 1217150 1396961 954458 1427700 992140 1073241 1122297 1236600 1229114
14652 1229114 1267822 900999 1270222 1489849 1538821 1569994 1204820 1333014 1142517 1821892
14642 1821892 1507752 1515257 880270 1261766 1077897 986352 1120930 1135507 1361894 1382610
14632 1382610 1161509 1281799 1424936 1210059 1067404 1297059 1732995 1365342 1265855 1463773
14622A463773O9034j52385Q2471k59403M88067l25364J21716j78142L49785M4726
14612A704278Q3026m1822j52475K03814n2872j22980L6718j36383K27194j13640
14602A634858o9829p0495K6282N27409m09503J93653p038r063l8883J27988J75882
14591B081261l05347n0152N50334n92793J440L24184Q3053j1074k17199L24234
14581B187941J11849n23784M55302n74585M72465R4277Q2733n2588k00966L69607
14571B422251k92621M41898l53976M41002n87854M88178q4830M1185J98689Q8551
14561B802473L9774J26048L1264K63682l04618K81429R3566L33768K23555N54696
14551D445637J99723J290862J338515M007165Q017572J9643933R166893k2146352
$$ plain form
14622 1463773 1532807 1380422 1462893 1203490 1691557 1366193 1487909 1309767 1659552 1704278
14612 1704278 1787304 1745482 1593007 1796821 1743949 1620969 1657687 1521304 1748498 1634858
14602 1634858 1565029 1494534 1520816 2048225 1638722 1832375 1825337 1816274 1777391 1905379 2081261
14591 2081261 1775914 1725762 2276096 1683303 1684743 2008927 2091980 2080906 1863707 2187941
14581 2187941 2299790 1776006 2231308 1656723 2129188 2223465 2306198 2253610 2052644 2422251
14571 2422251 2129630 2571528 2217552 2658554 2070700 2558878 2474048 2515233 2713922 2802473
14561 2802473 2842247 2968295 2999559 3263241 2958623 3240052 3333618 3667386 3890941 4445637
14551 4445637 4645360 5936222 7274737 11281902 19299474 38943407 48110300 25963948
14543B5963948A1338873E258484k174120l49766m76583k61116n4256K3363N8214
14534B024220J0479K92646j68099m0507L58410m40393K60662R1839R8036J05765
14524B593058l27880M08608M29999l90373R7202O5273j44526O8947K76636j68341
14514B908603j69248j556J79509l6464M57243k09188j0299k57912q306K01674
14504C054056m2437K21216j92242L38040j88245P2038p172L38809j69009J10278
14494C535332J16752j09032K25987m58614J57986K53607L1707m7383k0746J03342
14484C788938J89989k00041L62492P8449k41140J30122K55731j62883J631K35852
14474D439140l1889K10888J2545j1678k6851J6255M39284m08653J82204P4512
$$ plain form
14543 25963948 11338873 5258484 3084364 2734598 2258015 1996899 1942643 1966006 2024220
14534 2024220 2034699 2327345 2159246 2118739 2477149 2036756 2297418 2389257 2487293 2593058
14524 2593058 2265178 2673786 3103785 2713412 2810614 2875887 2731361 2800308 3076944 2908603
14514 2908603 2739355 2737799 2917308 2880844 3338087 3128899 3118600 2860688 2852382 3054056
14504 3054056 3011619 3232835 3040593 3378633 3190388 3262426 3255254 3594063 3425054 3535332
14494 3535332 3652084 3543052 3769039 3310425 3468411 3722018 3753725 3706342 3685596 3788938
14484 3788938 3978927 3778886 4141378 4219827 3978687 4108809 4364540 4201657 4203288 4439140
14474 4439140 4407251 4618139 4630684 4619006 4592155 4608410 5047694 4639041 4821245 4895757
14464D895757J27397j67264K13383l07006M39757n07067O83104j38653l1703K30384
14454E438089N7274K1118K83240m53978M25273J36617Q4363j04565K67668k114
14444F152985O1590q1174K40949k49515L73008R0202K52002k4803K03853k91561
14434F727536K41145j76827M15310q8613L3315M26483J03209M5450K45899J08805
14424H081712o3643K22588L0616L94732j8207R6424m4524J07405L22667Q6038
14414I215808J67656N70979l77445J71162N5217J52685L20428P808K87164k19445
14404A0352017M57522R4849P5054M25179K1033K82153L00282l09976N55199J30571
14394A2383883J04176K67135P8169O22295j23709k03420N88486J87258L68686
$$ plain form
14464 4895757 5023154 4855890 5069273 4762267 5202024 4694957 5378061 5239408 5207705 5438089
14454 5438089 5495363 5516481 5799721 5345743 5771016 5907633 5991996 5887431 6155099 6152985
14444 6152985 6214575 6133401 6374350 6124835 6497843 6588045 6840047 6815244 7019097 6727536
14434 6727536 6968681 6791854 7207164 7118551 7151866 7578349 7681558 7727008 7972907 8081712
14424 8081712 8018069 8240657 8271273 8666005 8647798 8744222 8699698 8807103 9129770 9215808
14414 9215808 9383464 9954443 9576998 9748160 9803377 9956062 10276490 10284298 10571462 10352017
14404 10352017 10809539 10904388 10979442 11404621 11425654 11707807 12008089 11698113 12253312 12383883
14394 12383883 12488059 12755194 12833363 13455658 13331949 13128529 13717015 13904273 14272959
14385A4272959R1073M51149P2150N83252K72563J43458J78207n8611O57375K33736
14375A6897311n5101R32396J92893K41790L79595O28226P2743K61088N97931N96161
14365B0745033L26259J90996L49750M92333P79758O41120L4742R44680N26029
14356B5030700N35369J49189Q91311N98278P14731R74438L20813N72086J056727
14347C0843642N59595P14496J039382R46946Q34724P56021J016050P49705J456627
14338C8917188R09064J194147J035817J762178J494337O32575J592952J196861
14330D8735119J587566J712981J710237J731651K033421J667136K223690J758506
14322F3160307K642697K225394K048155K498027K809668K839706K910687L255808
$$ plain form
14385 14272959 14364032 14815181 14887331 15470583 15743146 15886604 16064811 16006200 16663575 16897311
14375 16897311 16842210 17774606 17967499 18209289 18588884 19217110 19289853 19550941 20148872 20745033
14365 20745033 21071292 21262288 21612038 22104371 22884129 23525249 23559991 24504671 25030700
14356 25030700 25566069 25715258 26606569 27204847 27919578 28894016 29214829 29786915 30843642
14347 30843642 31403237 32117733 33157115 34104061 34938785 35694806 36710856 37460561 38917188
14338 38917188 39826252 41020399 42056216 43818394 45312731 45945306 47538258 48735119
14330 48735119 50322685 52035666 53745903 55477554 57510975 59178111 61401801 63160307
14322 63160307 65803004 68028398 70076553 72574580 75384248 78223954 81134641 84390449
14314H4390449L210424L489962L906757L722137L998442L946761M364945M994099
14306A16023976M694934N206256O130920N800593O047352O683187P044827P330885
14298A64962930P928198P981036Q949147R501944R677491J0176517J0727014J1320763
14290B41225040J1813236J2576404J2732913J3378441J3813474J4271639J4108391
14283C33919538J4736291J4621577J4454983J4455504J3691237J2855517J2349255
14276D31083902J1060850R451798P766861N571785J807270J73692j436522k409720
14268D63069916m437345n276007n585862q123274j0911588j2113293j3680858
14261D02941689j4410971j5220657j5023150j5305817j5416076j5165503j3951219
$$ plain form
14314 84390449 87600873 91090835 94997592 98719729 102718171 106664932 111029877 116023976
14306 116023976 120718910 125925166 132056086 137856679 143904031 150587218 157632045 164962930
14298 164962930 172891128 180872164 189821311 199323255 209000746 219177263 229904277 241225040
14290 241225040 253038276 265614680 278347593 291726034 305539508 319811147 333919538
14283 333919538 348655829 363277406 377732389 392187893 405879130 418734647 431083902
14276 431083902 442144752 451596550 459363411 464935196 466742466 466916158 465479636 463069916
14268 463069916 458632571 453356564 447770702 439647428 428735840 416622547 402941689
14261 402941689 388530718 373310061 358286911 342981094 327565018 312399515 298448296
14254B98448296j3528799j3855402j2838525j2432991j1851063j1231262j0895375
14247B11814879j0162684r649036r029847q163984q163301p784821p571815o280348
14239A45009043o486164n984900n130912n840501m967567m905237m578199m274175
14231A02841388l560721l890162l815256l855614l086766l043454l015455k961570
14223G5612390k347734k769799k634386j881824k187201j929727k160371k018948
14215E7682400j627384j360514j498968j879317j732993j353639j744413j137353
14207D5347819o77157j084908j547209j461075j213483r62947o87686o19003j001521
14198C6092830j353511j198578o84341n76927r24079m35320q60363q07870o36470
$$ plain form
14254 298448296 284919497 271064095 258225570 245792579 233941516 222710254 211814879
14247 211814879 201652195 192003159 182973312 174809328 166646027 158861206 151289391 145009043
14239 145009043 138522879 132537979 127407067 121566566 116598999 111693762 107115563 102841388
14231 102841388 99280667 95390505 91575249 87719635 84632869 81589415 78573960 75612390
14223 75612390 73264656 70494857 67860471 65978647 63791446 61861719 59701348 57682400
14215 57682400 56055016 54694502 53195534 51316217 49583224 48229585 46485172 45347819
14207 45347819 44670662 43585754 42038545 40577470 39363987 38401040 37713354 37094351 36092830
14198 36092830 34739319 33540741 32856400 32279473 31355394 30920074 30059711 29251841 28615371
14189B8615371r68121n09627o22217n28170o73786m58623o50089o79285p3743
14180B3451710q44059k46125q40399k32088l59286o43039R0350o53836n77137
14171A9146091l90273n35661L7202n62107l75257J06988l44977k76385o92460
14162A6113161m07127R4760n31998l84005j78365m60326K3734j83921l03048N3107
14152A3835972l92104l61654p3520o42455J62212j25946j93144m43979q6424n78278
14142A1100680K58305m6399m79987j61069k08461L20269k59063j46273j71268
14133A0206734l36155m96003J07027K6993J78737p37924m7552J52898j50330k21150
14123H683275K97710m42962j40684j29553q523l39753k86877M03742l81939m7957
$$ plain form
14189 28615371 27647250 27137623 26515406 25987236 25313450 24854827 24204738 23525453 23451710
14180 23451710 22607651 22361526 21521127 21289039 20929753 20286714 20377064 19723228 19146091
14171 19146091 18755818 18220157 18257359 17695252 17319995 17426983 17082006 16805621 16113161
14162 16113161 15706034 15800794 15268796 14884791 14706426 14246100 14269834 14085913 13782865 13835972
14152 13835972 13443868 13082214 13008694 12366239 12528451 12402505 12209361 11765382 11678958 11100680
14142 11100680 11358985 11312586 10832599 10671530 10463069 10783338 10524275 10378002 10206734
14133 10206734 9870579 9374576 9481603 9508596 9687333 8949409 8901857 9054755 8904425 8683275
14123 8683275 8980985 8538023 8397339 8267786 8259263 7919510 7632633 8036375 7654436 7606479
14113G606479J36716k71538J76256p14157M34600j58881k32363k97415P3159J97254
14103F950110l35773j36820k13518L60462k52855Q4913k76244K76410k95148j96586
14093E964951J46094k14145k6334j17727K724j3476k78475K12997k49470j10841
14083E316298J11243p9083L46820m13755n9408k1027j5479n48985M83643l44694
14073D775573j07785J94855J13306o9828m2370k26441o1512q2859q5650p4660
14063D332629J75423j85089j41114K00940j5181J94463m02114J09853Q144M3311
14053D321265n05049M1354J84180k61081j40545J92706k9475j37976J0574o2660
14043C613293M335J14871j25812k77721J40677J4645J0443j81860M2731k68342
$$ plain form
14113 7606479 7743195 7471657 7647913 6933756 7368356 7209475 6977112 6679697 6752856 6950110
14103 6950110 6614337 6477517 6263999 6624461 6371606 6456519 6180275 6456685 6161537 5964951
14093 5964951 6111045 5896900 5870566 5752839 5755563 5742087 5463612 5676609 5427139 5316298
14083 5316298 5427541 5348458 5695278 5281523 5222115 5201088 5185609 4636624 5120267 4775573
14073 4775573 4667788 4862643 4975949 4906121 4863751 4637310 4575798 4492939 4407289 4332629
14063 4332629 4508052 4322963 4181849 4382789 4367608 4562071 4159957 4269810 4277954 4321265
14053 4321265 3816216 3857570 4041750 3780669 3640124 3832830 3803355 3665379 3675953 3613293
14043 3613293 3617628 3732499 3606687 3328966 3469643 3484288 3494731 3312871 3355602 3087260
14033C087260M07179k05165L08451j57632j72970j14338m32485J89339J80876
14024C090515l6982m71478M20574o2484l38464J85099J69806k16421l08278L43970
14014B775857L890K75040m10550j18589K30251J4306m21371J36756J0935L11534
14004B808059m26198o2518J48448J6963P2553l44682J69049Q4833k76498l30859
13994A859150K88201L03489o2539M37150n6755J261269J733506O284023J8192099
13985C0239593J8367149j9519756j3699918n995589k604849j582313o39250m81888
13977D083179o20178p512J64899o38397q4445m6699N9986L6364j92235J84764
13967B939726l98680j23194J07400k6904J03201j28747r6661k40423K90274j25859
$$ plain form
14033 3087260 3494439 3289274 3597725 3440093 3267123 3152785 2720300 2909639 3090515
14024 3090515 3053533 2582055 3002629 2940145 2601681 2786780 2956586 2740165 2431887 2775857
14014 2775857 2779747 3054787 2644237 2525648 2755899 2770205 2348834 2485590 2496525 2808059
14004 2808059 2381861 2319343 2467791 2484754 2557307 2212625 2381674 2466507 2190009 1859150
13994 1859150 2147351 2450840 2388301 2825451 2768696 4029965 5763471 12047494 30239593
13985 30239593 48606742 29086986 15387068 9391479 6786630 5204317 4565067 4083179
13977 4083179 3463001 3455489 3620388 2981991 2897546 2850847 2910833 2947197 2754962 2939726
13967 2939726 2541046 2417852 2525252 2498348 2601549 2472802 2376141 2135718 2425992 2300133
13957B300133n2979n2231j84846K20650m09105P7694K64623J02258k76678K13724
13947B203243k16442J95520k21441j84324N08535k53708l26317L34001j89644
13938A849423L431J45150n66587K67926j2246k51330k209N15379l01079l2790
13928A615068M0024K51094j75192l8714j30265K48199j14788J74560k08041j88151
13918A473794J32819K60249j59825k26259O0584m7840k32053R7594N51386m65343
13908A445106J11151j42079l8375L02082p5843K64578j03451o95862K78847J97664
13898A543818o1035l15616J74869k62124L82602J50146q7608l25625O7651q912
13888A258166k96315M38416l22896k8025N39144l08949J07280j32297J31072k40706
$$ plain form
13957 2300133 2247154 2194923 2010077 2230727 1821622 1899316 2163939 2266197 1989519 2203243
13947 2203243 1986801 2182321 1960880 1776556 2285091 2031383 1705066 2039067 1849423
13938 1849423 1852854 1998004 1431417 1699343 1687097 1435767 1433558 1948937 1647858 1615068
13928 1615068 1655092 1906186 1730994 1692280 1562015 1810214 1695426 1869986 1661945 1473794
13918 1473794 1606613 1866862 1707037 1480778 1541362 1493522 1261469 1359063 1910449 1445106
13908 1445106 1556257 1414178 1375803 1677885 1602042 1866620 1763169 1067307 1346154 1543818
13898 1543818 1482783 1167167 1342036 1079912 1462514 1612660 1525052 1199427 1267078 1258166
13888 1258166 961851 1400267 1077371 1049346 1588490 1279541 1386821 1254524 1385596 1144890
13878A144890q7068J55546r9149K24014l90924K88721j51967n336J47637j84103
13868A042261M44857n60553L66616k09871J15777n0288N4668l223m5742k57797
13858H96705m6893K3585M97384m35853K39608J67467k14328J60407j68248J34508
13848A254342j58451k01939L30013m30823Q6682K79979k15399J34931k02810J85572
13838A062097N3136j558P1391j47793j38366j086j8327K19388j85975K2063L97064
13827A332034o4495n15058J40779R2349J89399j12643j72066K53343n5706j08795
13817I79141r8654J60372k77406l3856K56348k1383M96173o47149R6897k48342
13807F62141M58741j244k44473k38484N14443l29109M0117j31718l274L86026
$$ plain form
13878 1144890 1057822 1213368 1114219 1338233 947309 1236030 1084063 1078727 1226364 1042261
13868 1042261 1487118 926565 1293181 1083310 1199087 1148799 1203467 1200244 1154502 896705
13858 896705 849812 873397 1370781 934928 1174536 1342003 1127675 1288082 1119834 1254342
13848 1254342 1095891 893952 1223965 793142 879824 1159803 944404 1079335 876525 1062097
13838 1062097 1115233 1113675 1185066 1037273 898907 897821 879494 1098882 912907 934970 1332034
13827 1332034 1267539 752481 893260 985609 1175008 1062365 890299 1143642 1087936 979141
13817 979141 880487 1040859 763453 729597 985945 964562 1460735 813586 910483 662141
13807 662141 1120882 1119638 875165 636681 1151124 822015 862132 730414 727140 1113166
13797A113166k24863M1386J83015j28266l8152K18133k81186L5241l48865p6564
13787D93045N09517m7127k19554j29677K77566r5465n4670K93035j69955j15586
13777G41129R6977r2840j19876J77605J14238K0660Q2826M9854L4717j85820j65306
13766G54164K39518l87149L02934j00968q6545K37007l30190K23975l66745p6798
13756D09203L21865L1864j00540Q1387l9328J04208o0177J61123o9687k86981
13746E52937N7431L51909l55126J49425M54042E73841J63999R7970p0134k35853
13736E29823p456L93392m16940J30699I0792L78371m7745M92234C60401K29525
13726E89926M7383J05899C38583L07650K5239j27269J48856k42494o5499o0779
$$ plain form
13797 1113166 888303 929689 1112704 984438 946286 1164419 883233 918474 569609 493045
13787 493045 1002562 955435 735881 606204 883770 788305 733635 1026670 856715 741129
13777 741129 838106 745266 625390 802995 917233 937893 1020719 1070573 1105290 919470 754164
13766 754164 993682 606533 909467 808499 721954 958961 628771 852746 486001 409203
13756 409203 731068 762932 662392 743779 704451 808659 748482 909605 839918 552937
13746 552937 610368 962277 607151 756576 1210618 573841 737840 835810 765676 529823
13736 529823 522367 915759 498819 629518 90792 469163 421418 913652 360401 589926
13726 589926 637309 743208 338583 646233 671472 544203 693059 450565 385066 324287
13716C24287M57788j87229J13907k10209M05429B93492K78490J82999k03278L3275
13706E84978l8360k09272J26558l3262j00739J70445L0537j33063J51769J70993
13696G20584m4246k74592Q4925J09981K2355k08645J14702q7317L09208k77180
13686D69775P1702k9400n423J43113P3311j51692j55149p0932K20716J54860k88277
13675D32604K45062k70913R2707j64796L0057M91623l65194j33846K65538k10441
13665D12401L42418j94973p0732J39780k51280J17058J0513J25012B48054O7474
13655C15528L65643l17797l2424j7845L9303O2573R1037B23614Q5585J04282M89
13644D13970j09492J91546J10098A90272M82785l18779J94931j08699J5307p2943
$$ plain form
13716 324287 782075 594846 708753 498544 903973 293492 571982 754981 551703 584978
13706 584978 546618 337346 463904 430642 329903 500348 530885 397822 549591 720584
13696 720584 676338 401746 486671 596652 619007 410362 525064 437747 746955 469775
13686 469775 541477 512077 506654 649767 723078 571386 416237 345305 566021 720881 432604
13675 432604 677666 406753 499460 334664 364721 856344 491150 357304 622842 412401
13665 412401 754819 559846 489114 628894 377614 494672 505185 630197 248054 315528
13655 315528 681171 363374 330950 313105 352408 414981 506018 223614 309199 413481 413970
13644 413970 304478 496024 606122 190272 673057 354278 549209 440510 455817 382874
13634C82874p352L51077l42245j07225j8841Q3123J09025K69169k43755E6243
13623B88916M75862k58354j76626Q0656J94089q2285J75897B44725N11923B49104
13612C34636n0919I3809L79762L4894j56284j38176J68016p1925J59812L7178
13602E07086j35722l6780j20398O1337f4709D16134l1834A65253O3417L29203
13592E57873A76101L57945J03294k47414r3632k4949L22497B53230G1181K5254
13582I6435L18786k6699q2120K41590B73339N3846H6205J20361J35578J25632
13572D67776k27762L6458F9774K73924m2886M19973C51076o922J66582O3826n6856
13561E17706r5885j6833j19645J31794B08188R5114q755L78761k98891j54299
$$ plain form
13634 382874 375522 726599 384354 277129 258288 341411 450436 719605 475850 56243
13623 288916 764778 506424 329798 410454 604543 522258 698155 244725 756648 249104
13612 334636 283717 93809 473571 508465 352181 214005 382021 310096 469908 507086
13602 507086 371364 334584 214186 275523 -64709 416134 384300 165253 228670 557873
13592 557873 176101 534046 637340 389926 296294 271345 593842 253230 71181 96435
13582 96435 415221 388522 306402 547992 273339 327185 86205 206566 342144 467776
13572 467776 240014 276472 69774 343698 300812 720785 351076 344154 510736 574562 517706
13561 517706 421821 404988 285343 417137 208188 303302 294547 673308 374417 220118
13551B20118K73560j39183K900I5132Q9266n7390K51354j30498r9545J41507M5442
13540C35268o6310E6334N46458A60366l8018M63568A7664K66014K4540K36057
13530E44275A99124K3559L42085B41634N29L4234J01596j04537L80744A8328K77650
13519B95978J92916B03634J28685K92117B01229K60451l9876j25928J52332l0913
13509D17295K1028k09513K03783j17314I6480O9432L33233A95068J56734A03173
13498A04693M18500a82389C37346p2377A19967K32531k1297J6960l5667A10911
13487C92935n5331P2251l6726j69915j3720J22452f8490A93395Q2270e5770o3016
13476a18786D83224A87745R0683Q3228q1728L5410J8476J30096m1793N2334i928
$$ plain form
13551 220118 493678 354495 357395 95132 184398 127008 378362 247864 148319 289826 335268
13540 335268 268958 56334 602792 160366 122348 585916 17664 283678 308218 544275
13530 544275 199124 222683 564768 241634 242163 276397 377993 273456 654200 18328 295978
13519 295978 488894 203634 332319 624436 201229 461680 421804 295876 448208 417295
13509 417295 438323 228810 432593 315279 96480 165912 499145 195068 351802 103173
13498 104693 523193 -182389 337346 264969 119967 352498 331201 348161 312494 110911
13487 392935 337604 409855 373129 203214 189494 311946 -68490 193395 275665 -55770 -118786
13476 -118786 483224 187745 278428 361656 279928 315338 333814 463910 422117 474451 -9928
13464D20556j3551A06443L9179G63K42401I3026J52583J5916J07918j44007O7307
13453B92743J07796J0261G3900A9082I210J75304l1884J4510p465J63414j7771
13442C05318j28256K0967J14887I1891J9496J78895k2753K01397I235J06769J06432
13431B22436J70286m06J46980j36623j2869J47226k00806L86839B26344O1873
13421B88217F2783l29L29262f531A91359E5154M14566a58572B83502a12667A44646
13409C71026G1467K5887P5224E5810g1510C60191A48879J76903A46837K87222
13399D34059G2754K10364r8963F6338a08515B9123J58198E3802J15918c5432A86787
13387A70643N5102J9680q9411c30026A07467L27909j50804A03887e1346m1085
$$ plain form
13464 420556 407005 106443 145622 763 243164 93026 245609 261525 369443 225436 292743
13453 292743 400539 410800 73900 19082 9210 184514 152630 167140 159675 323089 305318
13442 305318 177062 198029 312916 91891 111387 290282 267529 468926 9235 116004 222436
13431 222436 392722 392316 539296 402673 389804 537030 336224 723063 226344 288217
13421 288217 62783 62454 391716 -6531 191359 55154 469720 -158572 283502 -112667 144646
13409 371026 71467 97354 172578 55810 -71510 360191 148879 325782 146837 434059
13399 434059 72754 283118 184155 66338 -108515 29123 187321 53802 169720 -35432 186787
13387 170643 225745 245425 156014 -330026 107467 435376 284572 103887 -51346 -92431
13377i2431G9493e0634A84382J2086R587H7717Q3778J52827m3397O352A02717
13365B60812j12688K62112m7246j30591C8708J61627J62847j60893C6733K91801
13355C28534j03410P4446j18394j8229J7320J49701M4713D8978J26397D5115L20993
13344C66108j77361R1298Q3081a28397E89557A39013q55c728C23473r0864j0002
13333B22607P4215A20490L70659B11476B7698K25448j22321L71328k01992q3712
13323B16449H4381K55984R4625R3075B32205L21182j75110j48712J10424A15750
13312a230A40799c617B26343O609J59072A31598J93847j36076c5451B01731f0276
13300A96676p7815F551a64601A31652J27204q7172h3338F4232Q8845l4606n3438
$$ plain form
13377 -92431 79493 -50634 184382 196468 206055 87717 171495 324322 280925 287277 102717
13365 260812 148124 410236 362990 232399 38708 200335 363182 202289 36733 328534
13355 328534 225124 299570 181176 162947 180267 329968 374681 48978 175375 45115 366108
13344 366108 188747 280045 363126 -128397 589557 139013 138158 -3728 323473 232609 222607
13333 222607 296822 120490 491149 211476 27698 253146 130825 502153 300161 216449
13323 216449 84381 340365 434990 528065 232205 553387 378277 229565 339989 115750
13312 -1230 140799 -3617 226343 232952 392024 131598 325445 189369 -35451 201731 -60276
13300 196676 118861 6551 -164601 131652 258856 171684 -83338 64232 153077 118471 65033
13289F5033R4078J01813Q9001F3965J81513j04274b26105B44916C9579K13880
13279B53459A09748O1827M0667H4597e7181D14342a01417B11855J69387j67135
13269B14107j2517c4927B64180Q4965B0509K62698a25368b5569B0219J31378j5939
13258A35658R0585m2226M012f478B70603m4237I0004l12J54526L03794B54941
13246a70440a1591A14778n0080Q9174J23271j2167r1932G8985L35046E2105J6166
13235F8271M0410a3219B11227C0676J34851Q5757C0346O8492K43095J21729A45511
13223E2961P5370J02029d4896I3526j1512a34042f3611B71895d4537B03435B8007
13211A42225L9084O5345L8717r7702J90223A48118A8514M02358e2197A629e1335
$$ plain form
13289 65033 159111 260924 349925 63965 245478 141204 -226105 244916 39579 253459
13279 253459 109748 171575 212242 84597 -57181 414342 -101417 211855 381242 214107
13269 214107 201590 -34927 264180 349145 20509 283207 -125368 -25569 20219 151597 135658
13258 135658 226243 184017 188029 -6478 270603 226366 90004 89692 244218 548012 254941
13246 -170440 -11591 114778 64698 153872 277143 264976 173044 78985 414031 52105 68271
13235 68271 108681 -13219 211227 30676 165527 251284 30346 98838 341933 463662 145511
13223 52961 128331 230360 -44896 93526 82014 -134042 -63611 271895 -44537 203435 28007
13211 142225 181309 246654 285371 187669 377892 148118 18514 420872 -52197 1629 -51335
13199C40388G2667O2331K211J10011a21576j32977C39429j04182j06075e0933
13188F5O94556E9239k0470J67082K0316P5440n4512D8684K82471j63357m0121
13177A27677g5279E5108B1172O35013l09287A50927j6209b29851i513A22132D4327
13165A92201a2930A53218b34694a1917A95265m0711c2696B79482R643e702k86
13154e988j51885e7105A31238F1411J02266K333N5320J5896f6494G12281B03891
13142e3771A36399B0335K07050J14552F6782b20008B09606m6740d3821C13952
13131A76685B6359c84467a57618B71980K8184a29155c2928k0612A36962j3124
13121A23838K50666A21560i4576B10229K16987C4980K71395A07238K51063b2293
$$ plain form
13199 340388 72667 134998 137209 247220 -121576 -254553 339429 235247 129172 -50933
13188 65 694621 59239 38769 205851 226167 301607 247095 48684 331155 167798 127677
13177 127677 -75279 55108 21172 656185 346898 150927 134718 -229851 -9513 122132 44327
13165 192201 -12930 153218 -234694 -11917 195265 154554 -32696 279482 289125 -5702 -5988
13154 -5988 -157873 -57105 131238 61411 163677 166010 221330 237226 -66494 712281 203891
13142 -53771 136399 20335 227385 341937 66782 -220008 209606 162866 -43821 313952
13131 176685 26359 -384467 -157618 271980 300164 -129155 -32928 -53540 136962 123838
13121 123838 374504 121560 -94576 210229 427216 34980 306375 107238 358301 -22293
13110C23960e2518J1737C48902a72168B28879J21761R1464C2568Q0513j423O8325
13099A79983F6685r082J05028A1013K67512g2443D6703a01690m8633M4927D9615
13087a53825j01971C09657M8930c1624D8276P2553D2606J52923a61845B55369
13076G0550Q8147K5371G3597A8434f2168C12361N59j5527E679M5005J38586e5556
13063C74977j57827b75784G878K38283G685L34431A44633b8996B41686I195a28132
13051B67408E4356a53878a0270E9513a45741F4339c6998o8930A97895e7594F3879
13039A49646D4108b09017I6559K55662I1341b19793B06169A00403J15290f8565
13028F2547Q3067J00557F6514k4445K53381I3840b548B85956q1209m3553J5461
$$ plain form
13110 323960 -52518 -40781 348902 -172168 228879 350640 442104 32568 113081 111658 179983
13099 179983 66685 57603 162631 11013 278525 -72443 46703 -101690 -150323 -105396 49615
13087 -153825 -255796 309657 358587 -31624 48276 120829 42606 195529 -161845 255369
13076 70550 158697 184068 73597 18434 -62168 312361 312920 297393 5679 50684 189270 -55556
13063 374977 217150 -275784 7878 246161 7685 342116 144633 -28996 241686 9195 -128132
13051 267408 54356 -153878 -10270 59513 -145741 64339 -36998 -105928 197895 -57594 63879
13039 149646 44108 -209017 96559 352221 91341 -219793 206169 100403 215693 -68565
13028 62547 145614 246171 66514 42069 295450 93840 -2548 285956 204747 161194 176655
13017A76655E9778K49706A47676J28782n1167n9546D8702K9314b1286B79808B1593
13005H0720K52021J6668H4386J92598e0667A91914F2880b4441F5022K5264b51093
12993A7850f8096r6495A21952C4862N1743M40106A51769c24537b4054r5604G7010
12981A28885J50339A20916c7761G8608O8331a04123D29804h0421L7363F6766b20921
12969A22687R9939I4914K26190j00838O2704q3006a63132g5524I9907J19931b41090
12957B05548j01716a60049H5536Q4213b5019k70644b6563m2379F8839c2351A86662
12945D3177c6263p0291B69115B5292J7802K42012c4433g663C21481F7911O7406
12934A35317c26532B6284b58813Q8688B28841i0900b9963l1341M692A71458J11557
$$ plain form
13017 176655 59778 309484 147676 276458 225291 165745 48702 78016 -21286 279808 21593
13005 80720 332741 349409 84386 276984 -50667 191914 62880 -24441 65022 90286 -251093
12993 17850 -68096 -164591 121952 34862 86605 526711 151769 -324537 -24054 -119658 77010
12981 128885 279224 120916 -37761 78608 146939 -104123 429804 -80421 -43058 66766 -220921
12969 122687 222626 94914 321104 220266 282970 199964 -163132 -75524 99907 219838 -241090
12957 205548 103832 -160049 85536 169749 -25019 -295663 -26563 -68942 68839 -32351 186662
12945 43177 -36263 -106554 269115 25292 43094 285106 -34433 -7663 321481 67911 135317
12934 135317 -326532 26284 -258813 -170125 228841 -90900 -29963 -61304 -56612 171458 283015
12923B83015C9458M8426J1975J8270k9452b9751A60241h7341A08497f3868E0434
12911E2840L34024A39282k2646M3845b9167J2849B55877a72685b5345j55248B018
12899a39572O4196c3260F0728K1962K52100H7205i4845A01006J73112A30671N2353
12888A83024E3444Q7813B3093a05466B35501i6237C089L13627b78822A51791F138
12876B16154a69326A38377b2745A36660g6656p7199A28249a99257F1280F736b67302
12864A25960j4308J22272d5150j78006O5580H4963P795a57458E8538J01473a62243
12852D4532b00222E9771O9567J07911a52781A14133h934B56280j18663a39860
12841b27971A07348K78693o8074A32641C3338g9927A86161a66996A69522p1220
$$ plain form
12923 283015 39458 87884 99859 118129 88677 -29751 160241 -87341 108497 -63868 50434
12911 52840 386864 139282 116636 160481 -29167 -16318 255877 -172685 -25345 -180593 2018
12899 -139572 -75376 -33260 60728 82690 334790 87205 -94845 101006 274118 130671 183024
12888 183024 53444 141257 23093 -105466 235501 -96237 3089 316716 -278822 151791 6138
12876 216154 -169326 138377 -22745 136660 -76656 -153855 128249 -199257 61280 6736 -267302
12864 125960 111652 233924 -45150 -223156 -157576 84963 92758 -157458 58538 160011 -162243
12852 44532 -200222 59771 129338 237249 -152781 114133 -8934 256280 137617 -139860
12841 -227971 107348 386041 317967 132641 33338 -79927 186161 -166996 169522 98302
12831I8302a5609k75580A91999l0512a09331c046j94147C65394j44566a50189
12820b40984B07567J15151F1909b1551o0123A02586K1148E853h9715j09300Q5803
12809a13212M193B16963a1931l7364C17832b82126A27497B0141G240a44065B52428
12797a6734A15241D1056b92493R7521b5087A06292a59144A8063b05037C54253
12786a17224C6811a89992j12199B10421l3224c68186A52555J7680a98755N7203
12776a41552A25694b79662B68586a50456C36902e656j90758f9381K5829B02318
12765i2280o6881c7704p5099D4585J30307e6541j12481b4598l5943k60286j1069
12754c31896d9806I4690h7093r884p0987G6580B2898J86208H8765K82318i442
$$ plain form
12831 98302 -15609 -291189 191999 161487 -109331 -3046 -197193 365394 220828 -150189
12820 -240984 207567 322718 61909 -21551 -81674 102586 123734 5853 -89715 -199015 -113212
12809 -113212 -109019 216963 -11931 -49295 317832 -282126 127497 20141 7240 -144065 252428
12797 -16734 115241 41056 -292493 -194972 -25087 106292 -159144 18063 -205037 354253
12786 -117224 36811 -189992 -302191 210421 177197 -368186 152555 170235 -198755 -141552
12776 -141552 125694 -279662 268586 -150456 336902 -5656 -196414 -69381 -43552 202318
12765 -92280 -159161 -37704 -112803 44585 174892 -56541 -169022 -24598 -60541 -320827 -331896
12754 -331896 -49806 94690 -87093 -96977 -167964 76580 22898 209106 88765 371083 -9442
12742b23094D7850K19534c44198J29103D4348h486A72798b52239B87773A34256
12731C42573A484R2616P0384a93320E4613J57805a66373A90456J2971A00655A1563
12719b06367B40964r5384n3406J4230a53841B9442f3600B58099k9943o2713K27238
12708C92681k9778A62781C1370K16594p3750P9017H6281J34241f5899A30350P784
12697A38134a6880A7877J38338h91j21492N3424K7506O669A38562J29556a86640
12685H8965C7293b64551H7195l8152J64527B9241K59398b15955A31549a69910
12674A55685c5725C37331o9938b5062B37407l9140a30237f4154B43810D5148J20474
12663A65622a97780l0340e1568C69162D2189N3616K25396h8278b3172B80740C2425
$$ plain form
12742 -223094 47850 267384 -344198 -215095 44348 -8486 172798 -252239 287773 134256
12731 342573 1484 94100 164484 -193320 54613 212418 -166373 190456 203427 100655 11563
12719 -206367 240964 145580 92174 106404 -153841 29442 -63600 258099 228156 165443 392681
12708 392681 362903 162781 31370 247964 174214 253231 86281 220522 -65899 130350 138134
12697 138134 -16880 17877 156215 -891 -122383 -68959 -41453 -34784 138562 268118 -186640
12685 88965 37293 -264551 87195 49043 213570 29241 288639 -215955 131549 -169910
12674 155685 -35725 337331 267393 -25062 237407 198267 -130237 -64154 243810 45148 165622
12663 165622 -197780 -228120 -51568 369162 42189 95805 321201 -88278 -23172 280740 32425
12651a53238b4481C67285m6428j32749K22151f0552k090A59375n6990a35832D3695
12639E9522I36a3155B67283A5247i0992C07113H7905G176J94795D4524K74589
12628C19113l4057I3314J56360j19108d0284H1158A3879K22429J64575A98339
12617A60233B6705K26803k8670a06794A51548d7891I4653K62052a35155L0231
12607a04924l07024F1453c86120a5175B86456g6117A700L8300Q688J58285D8317
12595A91804P8342E2100k630a89353C43542h1677A98987a6286A48303A8927a38579
12583i9933r610l18736G3794j8474J63382b37200A80608p5829b9490q5281A05362
12571a4929j76982I8248b3246F1088K1974a6484A10168N8739B4399R6054m7846
$$ plain form
12651 -153238 -24481 367285 320857 188108 410259 -60552 -62642 159375 102385 -135832 43695
12639 59522 936 -13155 267283 15247 -90992 307113 87905 7176 201971 44524 319113
12628 319113 285056 93314 249674 130566 -40284 81158 13879 236308 400883 198339
12617 160233 26705 253508 224838 -106794 151548 -47891 94653 356705 -135155 -104924
12607 -104924 -411948 61453 -386120 -15175 286456 -76117 1700 40000 48688 206973 48317
12595 191804 270146 52100 49470 -189353 343542 -81677 198987 -16286 148303 18927 -138579
12583 -99933 -109543 -428279 73794 55320 218702 -237200 180608 104779 -29490 -114771 105362
12571 -14929 -191911 98248 -23246 61088 83062 -16484 110168 168907 24399 120453 72607
12560G2607J5000J34764J348d2894F5147J66208G3282B0664e5181A47549L5283
12549A82832R665M2994a98175f6408b3064B32786m7521C5676J85656b33269J14117
12538a19152A70330a94724E0976a36465B04778a20577b9025C59409A4472a66632
12527E63371b3028H1688K08200a32402C04687e2815m5931A02532R8128c6739B41365
12515C5981e51148a53175o4221A69146F3343a18864D6026L69663A51054Q9671
12505B40725F6065c7542o469C32912a1087j5811j91781h0209D551h6400j2110
12494i8510K6728C30826f5686K979H7110e6055D5664L038K19529a05632j22185
12483b27817B88151j20996m7549J64996h1859D941a14750c0457j99059l31320
$$ plain form
12560 72607 87607 222371 223719 -42894 65147 231355 73282 20664 -55181 147549 182832
12549 182832 192497 235491 -198175 -66408 -23064 232786 185265 35676 221332 -233269 -119152
12538 -119152 170330 -194724 50976 -136465 204778 -120577 -29025 359409 14472 -166632
12527 563371 -23028 81688 289888 -132402 304687 -52815 -98746 102532 200660 -36739 241365
12515 35981 -551148 -153175 -217396 169146 63343 -118864 46026 415689 151054 240725
12505 240725 66065 -37542 -44011 332912 -11087 -26898 -218679 -80209 4551 -86400 -98510
12494 -98510 -71782 330826 -65686 -62707 87110 -56055 45664 48702 268231 -105632 -227817
12483 -227817 288151 167155 119606 284602 -81859 4941 -114750 -30457 -229516 -560836
12473e60836A2126J02362B7198J65165b69334e1873F7653J47727b0636A50570
12462a19997e6215p3635B25934E2650a26551d8759l4448A30923A4406O7374B7621
12450H1182J14310a43508f3189m5583G0074a31037A27861c73454Q3822A69460
12439C5077i8393b8378A84291d8780C02114B8130J94907D7567c7701A17548g2930
12427b63107a11278j00478a00950j70023A00455b83597G8710j1742a11945I0159
12416A46042a13395H4527L8865b18664q2573C05867B3699L9660J61990b22146
12405a4287j17008A7201M4427f3483C6397d5664A71846c37361A20868O9761G5645
12393f7399b4122j21602H134f646o7817B31349b2010j41789l34814C46121A17523
$$ plain form
12473 -560836 12126 114488 27198 192363 -269334 -51873 67653 215380 -20636 150570
12462 -119997 -56215 -129850 225934 52650 -126551 -48759 -83207 130923 14406 81780 27621
12450 81182 195492 -143508 -63189 -108772 70074 -131037 127861 -373454 -289632 169460
12439 35077 -98393 -28378 184291 -48780 302114 28130 223037 47567 -37701 117548 -72930
12427 -263107 -111278 -211756 -100950 -270973 100455 -283597 78710 66968 -111945 90159
12416 146042 -113395 84527 123392 -218664 -301237 305867 23699 63359 225349 -222146
12405 -14287 -131295 17201 61628 -63483 36397 -45664 171846 -337361 120868 190629 75645
12393 -67399 -24122 -145724 8134 -6646 -74463 231349 -22010 -163799 -498613 346121 117523
12381B87702j03850B9405J53305J54552c8433k0017E6211J03854a83486a0156
12370a79436A30622e8141l0529k63352D52614d2412j18560b4356A44634F3594
12359e9560o8551G702c7803A49913b4358O204j38072J3370B6071K33684d096k76781
12347b80877c2292G1935b1687j21891p5085A87245d7289G5650a00182I6088e0608
12335A49812i8260D0903i9278B06392A4986a0817D3203b9135j238B07296c11741
12323D0251b6220E7432J7626b25009e5007B40914j05806d13783A28083R1017a13566
12311C27989a43856B53486j17589n3963c01479g8864D7707J63555a33303j10932
12301b44235i058A00764l2057J10716c5710d926I0072J26586a57001H4895a12900
$$ plain form
12381 287702 183852 29405 182710 337262 -38433 -58450 56211 160065 -183486 -10156
12370 -179436 130622 -58141 -88670 -352022 452614 -42412 -160972 -24356 144634 63594
12359 -59560 -128111 7702 -37803 149913 -24358 -18154 -156226 -142856 26071 259755 -4096 -280877
12347 -280877 -32292 71935 -21687 -143578 -218663 187245 -47289 75650 -100182 96088 -50608
12335 149812 -98260 40903 -99278 206392 14986 -10817 43203 -29135 -30373 207296 -311741
12323 40251 -26220 57432 75058 -225009 -55007 240914 135108 -413783 128083 219100 -113566
12311 327989 -143856 253486 135897 81934 -301479 -78864 47707 211262 -133303 -244235
12301 -244235 -9058 100764 68707 179423 -35710 -4926 90072 216658 -157001 84895 -112900
12289c88526A84633J90595a91185C08307I4279K4093a99787H9504R6715K38533
12279D24752A33585n4236b28881C7184L24382E0888K60550J44426j72085p8153
12269B05626R8768A42651o2071a62153E46232A69854C98J97634N8145r5649J21513
12258B82041A26410a06020B96931c20502B06973J5298d7564C2276O7544K97590
12248C97410C1114a1178C2284f4173B07233l0902o3836b90294c9076B68603F6370
12236I0738f9067j0959C18209A08496K05823f95A15447L43109j36529p3481k292
12225B46254L18243c574C52329j696l1175n7458a16921E586K81248E8294R2697
12214A50991f0258B48379f7805F0070K14346b73661F4753K05895e8490C16904
$$ plain form
12289 -388526 184633 375228 -191185 308307 94279 118372 -199787 89504 186219 424752
12279 424752 133585 79349 -228881 37184 361566 50888 311438 455864 283779 205626
12269 205626 304394 142651 80580 -162153 546232 169854 398 198032 256177 160528 282041
12258 282041 126410 -106020 296931 -320502 206973 222271 -47564 32276 99820 397410
12248 397410 31114 -11178 32284 -64173 207233 176331 112495 -290294 -39076 268603 66370
12236 90738 -69067 -80026 318209 108496 314319 -695 115447 458556 322027 248546 246254
12225 246254 564497 -3574 352329 350633 319458 262000 -116921 5586 286834 58294 150991
12214 150991 -60258 248379 -67805 60070 274416 -273661 64753 270648 -58490 316904
12203F5039b26554A3878J23507k6232J74461J23024E7099K17793n3530n7354o1782
12192A02226K70745E6256J72567c237A48118P3516a08612E5375L3942K95909a51547
12180h5357B64300a1312G4141K4447O4445J29160C5192M227K23340j802h822I8860
12167A87368Q2022R465p3905a68753F5021P2694a7507A40334M17545c43993B0495
12155b78746J39355e2367C65671c5580o2201k1654d1684n0883B7820j0621b19521
12143B1064a0048m3043j78958i5839A45522f0459A52804j1299h0202A17423a5740
12131A36113A5714a44779A81744b03777M1683l2575O7537a6200k59647B53975
12120B5402b72947a8748B11686f8830A54247a7749k16885p0192B66307n4255b90552
$$ plain form
12203 65039 -226554 13878 137385 111153 285614 408638 57099 274892 221362 164008 102226
12192 102226 372971 56256 228823 -3237 148118 221634 -108612 55375 89317 385226 -151547
12180 -85357 264300 -11312 74141 98588 163033 292193 35192 39419 262759 260957 -8822 98860
12167 187368 269390 278855 204950 -168753 65021 137715 -17507 140334 557879 -343993 20495
12155 -278746 -139391 -52367 365671 -35580 -97781 -119435 -41684 -92567 27820 17199 -219521
12143 21064 -10048 -53091 -232049 -95839 145522 -60459 152804 141505 -80202 117423 -15740
12131 136113 15714 -144779 181744 -203777 -162094 -194669 -127132 -16200 -275847 253975
12120 25402 -272947 -18748 211686 -68830 154247 -17749 -234634 -304826 266307 212052 -290552
12108f7360A44642a81775A61187N1966J03926d3773A56627a43172E9628M22683
12098D82311a24996c0119D6786J96750r8798M3663c39900F8598a08285K307l2530
12087a38508B50972K8142b56309D3403P1956C0134a65723A26929e8832j9326I0265
12075h2533j00199A25259J87743b0911F47571J183111H64286k83818A12901e2750
12064A26342e1392B25348F9644J82837a86470I8199L5162K36275d6226A62705
12053b98363I6f825A69015a89454g0701J931D5237K00815a36978L3745E5368c73995
12040a61135A01978m6588a08307j23009a10943J8974J1398n1866A56574m317b92104
12028E5073a60472A18033a64705c3470A38319J65751B4349h8273j49517D3364
$$ plain form
12108 -67360 144642 -181775 161187 213153 317079 -43773 156627 -143172 59628 482311
12098 482311 -124996 -30119 46786 243536 144738 188401 -339900 68598 -108285 -105978 -138508
12087 -138508 250972 279114 -256309 43403 115359 30134 -165723 126929 -58832 -78158 90265
12075 -82533 -182732 125259 313002 -20911 647571 1830682 864286 580468 112901 -52750
12064 126342 -51392 225348 69644 252481 -186470 98199 133361 369636 -46226 162705
12053 -298363 96 -6825 169015 -189454 -70701 -68770 45237 246052 -136978 -103233 55368 -373995
12040 -161135 101978 55390 -108307 -231316 -110943 -91969 -80571 -132437 156574 152257 -292104
12028 55073 -160472 118033 -164705 -33470 138319 304070 24349 -88273 -237790 43364
12017c8248G5215L1795J5088d8788G0997a91861B27380C1947J31393a97082A75391
12005e5314A62911J1904a84056h1054R851D08725I585J55382a0450H4947M3652
11994A28599K38577h0703A15974L1964a61832I6939h8624C1759N9729a66196C5493
11982F3100J371K29663b7393j8007n0506j57893J13977d4956k36854a26156N4558
11971g1598r8338f9883A55730h0034L0205A39522K10225b73509a17601b5481J0251
11960a5230E2221R873d044j09297e5066A05603a2290C2350a03233K8884k6740
11949a01089d3397k23665D34004A22645a26459b109j91662D39074c3323H3763
11938b65456n5455D2661J11784a42908B8421K16118c4258A64573b7473C31640
$$ plain form
12017 -38248 75215 107010 122098 -48788 70997 -191861 227380 31947 163340 -197082 175391
12005 -55314 162911 174815 -184056 -81054 -71203 408725 9585 164967 -10450 84947 128599
11994 128599 367176 -80703 115974 147938 -161832 96939 -88624 31759 91488 -166196 35493
11982 63100 64471 294134 -27393 -45400 -95906 -253799 -139822 -44956 -281810 -126156 -71598
11971 -71598 -169936 -69883 155730 -80034 -49829 139522 349747 -273509 -117601 -25481 -15230
11960 -15230 52221 62094 -4044 -113341 -55066 105603 -12290 32350 -103233 -74349 -101089
11949 -101089 -43397 -267062 434004 122645 -126459 -2109 -193771 439074 -33323 83763
11938 -265456 -320911 42661 154445 -142908 28421 244539 -34258 164573 -27473 331640
11927e6587K2020l76580a71019g6952A13903J92711l8377H8151P7332J9503m614
11916A80372a06916B35060d00553J47960e0381j70330B33792d62915c4080B00501
11905b9102k30296G2027H811b7044H7793l2565g6050C3576d2320o082A61260e6510
11892a74218A88310n7106b81539G6636K4693i8249j71714b4681p0599C68709b6196
11880B32004D6661b61798c132H0501O6108a09824c5685j13113K6566A4448Q7355
11869A01803K8274d9210l76139A63246F3301e9180B06916a77506j49580A62778
11858a75988b8563n2574j48681C07264a66503E8525B533K16907F0045a47171C14680
11846A19958l4882b42889a4589B64532b65170a02814r0251H1095B8429B575J13739
$$ plain form
11927 -56587 -34567 -411147 -171019 -76952 113903 306614 268237 88151 165483 184986 180372
11916 180372 -106916 235060 -400553 -252593 -50381 -220711 233792 -462915 -34080 200501
11905 -29102 -259398 72027 8811 -27044 87793 55228 -76050 33576 -42320 -48402 161260 -56510
11892 -174218 188310 131204 -281539 76636 101329 -98249 -269963 -24681 -95280 368709 -26196
11880 232004 46661 -261798 -3132 80501 146609 -109824 -35685 -148798 -122232 14448 101803
11869 101803 130077 -49210 -425349 163246 63301 -59180 206916 -177506 -327086 162778
11858 -175988 -28563 -81137 -229818 307264 -166503 58525 2533 219440 60045 -147171 314680
11846 119958 85076 -242889 -14589 264532 -265170 -102814 -193065 81095 28429 2575 116314
11835A16314b02212C06160b76516B8538J53304B9920K84739i0578l6386o0893
11825a87857A17118d45008D2989b88157A93739c4966C25211I066a7554l886o753
11814b8193j36479e7055B41068a80884G4823f8952A00708h0000j4139o1636B15864
11802f6977K1050F8283e8750l18274E4956K71632p915r5575b03321B69274H3996
11790c21042e0514H5392a87779A67857l8505r428k139d7625A24725A0870K05388
11779B16258C5789e96369a09158j8658k541F112J02575b5290B7985c4097j45282
11768a79379M4117C10748d49535e6836j82356O4373c9593H9014b88985P7070b6951
11756H1190f9953j28375H6605d74975A31983a05850j30919A99321O0146k3445
$$ plain form
11835 116314 -202212 306160 -276516 28538 181842 29920 314659 -90578 -126964 -187857
11825 -187857 117118 -445008 42989 -288157 193739 -34966 325211 9066 -17554 -21440 -28193
11814 -28193 -164672 -57055 241068 -180884 74823 -68952 100708 -80000 -94139 -155775 215864
11802 -66977 -45927 68283 -58750 -377024 54956 326588 318673 223098 -203321 269274 83996
11790 -321042 -50514 85392 -187779 167857 129352 119924 117785 -47625 124725 10870 216258
11779 216258 35789 -596369 -109158 -127816 -130357 6112 108687 -25290 27985 -34097 -179379
11768 -179379 -135262 310748 -449535 -56836 -239192 -174819 -39593 89014 -288985 -211915 -26951
11756 81190 -69953 -198328 86605 -474975 131983 -105850 -236769 199321 259467 236022
11746B36022A3389K2848K61573j26784o4011k1990d1813l89704D2304a41371j82481
11735c23852J50749E18511i2764C15081c4810C43720a04906p1019f8568l873j3691
11724h6132A77158G1075J27367q5353a96214B4777a95909E20a77071G4487A9512
11712a32270L2909C81054F5678J47779a03599c6281F6345a3285A10906L15308
11702D26214G6463J84951q2791k9587l4123g7031j9830A71091b20520a3752A93250
11690f4577A40687e1781B40114n5800o3392J6253m5332g5425C64188D2414K881
11679D5295Q475j5130J28678q3064K33550a09713M3583B34141o5446L0501o7019
11668A32177J69925A32530a09196k26956h7559G7056i7289C9983b5604A75174
$$ plain form
11746 236022 13389 36237 297810 171026 107015 85025 -41813 -431517 42304 -141371 -323852
11735 -323852 -173103 518511 -92764 315081 -34810 343720 -104906 -175925 -68568 -72441 -86132
11724 -86132 177158 71075 198442 113089 -196214 24777 -195909 520 -177071 74487 19512
11712 -132270 -99361 381054 65678 213457 -103599 -36281 66345 -13285 110906 426214
11702 426214 76463 261414 178623 149036 114913 -77031 -96861 171091 -220520 -13752 193250
11690 -64577 140687 -51781 240114 184314 120922 137175 91843 -75425 364188 42414 45295
11679 45295 53770 38640 167318 84254 317804 -109713 -66130 234141 168695 199196 132177
11668 132177 302102 132530 -109196 -336152 -87559 77056 -97289 39983 -25604 175174
11657B7193K6493O8792B9561K22618b69780D6292P9745a30871A13772h2552A38505
11645A00788R7144F8671j9550d2227c984j3453j01609B05377b9319A11221a77447
11633B20954b04739O6727a1778r1141A79728a84178B3927J443Q4015q14b01036
11621a17965C5147f9349b3005B56060b53784i1661G0737J57277j10916p619k8445
11610H1034K087J96034C5700P0354j0920a61308j03095A20224D9605N52175b65590
11598I050c1834C07637b3409F183M8031c6230E1337G345L48454A39552J30092
11587B69644o6193K3874a30937E34092A08548h8057c1436k33528B18299j400N14
11576B17413B3237a11428k1401E4831a06877b1346G0695O8949a72778C68250c8679
$$ plain form
11657 27193 53686 122478 29561 252179 -269780 46292 126037 -130871 113772 -82552 138505
11645 100788 197932 68671 49121 -42227 -3984 -17437 -119046 205377 -29319 111221 -177447
11633 220954 -204739 -138012 -11778 -102919 179728 -184178 23927 25370 109385 108571 -201036
11621 -117965 35147 -69349 -23005 256060 -253784 -91661 70737 228014 117098 109479 81034
11610 81034 83121 279155 35700 106054 95134 -161308 -264403 120224 49605 601780 -265590
11598 9050 -31834 307637 -23409 6183 54214 -36230 51337 7345 355799 139552 269644
11587 269644 203451 227325 -130937 534092 108548 -88057 -31436 -264964 218299 216899 217413
11576 217413 23237 -111428 -132829 54831 -106877 -21346 70695 139644 -172778 368250 -38679
11564A06488A8810d1370F3591J15683c1526A17552D7339e3372j48472A87055f945
11552I650i4248c0784A30489B913a1217F330J48932G5255N5451g5253B14094G7725
11539b5028D92787A91672o7615J09545f6396B19422J12141j43452K5545g3811
11528a6542o3954j05498B46027r2500A5039K66773j37144B8900I691J24362g2797
11516B35653C2545a04556B04896a71618C71639C6088M4846j7033J35139k2519
11506A76521D7246L31330J3762j53825J92576j48944D6832K38044A00717M3405
11496A44122M9013m2254E1758J08610J9889c9139C21742j50583c7939A77207L7520
11485B14727C8739J40328c4106B11261P42I8945B0004q795M1411A4065L51322
$$ plain form
11564 106488 18810 -41370 63591 179274 -31526 117552 47339 -53372 -201844 187055 -6945
11552 9650 -94248 -30784 130489 2913 -11217 6330 155262 75255 130706 -75253 214094 77725
11539 -25028 492787 191672 124057 233602 -66396 219422 331563 188111 213656 -73811
11528 -16542 -80496 -185994 246027 153527 15039 281812 144668 28900 9691 134053 -72797
11516 235653 32545 -104556 204896 -171618 371639 36088 80934 63901 199040 176521
11506 176521 47246 378576 392338 238513 431089 282145 46832 284876 100717 144122
11496 144122 193135 150881 51758 160368 180257 -39139 321742 171159 -37939 177207 214727
11485 214727 38739 179067 -34106 211261 212003 98945 20004 11209 52620 14065 365387
11474C65387A30258b3092I5030J35920A13563Q8914q4843J08940L15247a8877
11463f9853A94776F6031J08050J40105a53672B65287e7181A54957B6427J58506
11453A84933J54654q0660A4091J66066a0400r002m0416B09144a93104B24560d5674
11441b30953G5423b06525a7016j12969B92335b59267B17697b54371c4040C3317
11430B9011a6354d600k15317A98682n652h7233A0138R416b78846q7811a52015
11418G1364i3094a2035r5687b5634j22474A55894o9140B8379N153J10374a42451
11406b14365a4000k5019G2941G351P7005b7467B61357h9318B80258E3586c0989
11394a45756a7396q1666I1175O1182A2935b0579H6632k0857R5592f3580A28848
$$ plain form
11474 365387 130258 -23092 95030 230950 113563 202477 117634 226574 541821 -18877
11463 -69853 194776 66031 174081 314186 -153672 265287 -57181 154957 26427 184933
11453 184933 339587 258927 14091 180157 -10400 -19402 -59818 209144 -193104 224560 -45674
11441 -230953 75423 -206525 -17016 -129985 292335 -259267 217697 -254371 -34040 33317
11430 29011 -16354 -4600 -219917 198682 193030 -87233 10138 19554 -278846 -366657 -152015
11418 71364 -93094 -12035 -107722 -25634 -148108 155894 86754 28379 33532 143906 -142451
11406 -214365 -14000 -39019 72941 7351 84356 -27467 261357 -89318 280258 53586 -30989
11394 -145756 -17396 -99062 91175 152357 12935 -20579 86632 65775 161367 -63580 128848
11382C03578p0668n800J03009a31825A61106n6771C5806f4579b8702B00638C5663
11370f3213l24886E1375f8876p068H7042K1532a49758A86749a65375l354H2754
11358c6860B18708b2889q6867j34993B1467b1749B00373a07153b3056A96407i2342
11346c20792A37480e2780A90727a44494B28979M0516g2901F3209n06a41511D5367
11334A54870G6526a07570j66004A09759r151d5375B90451a42440G7371a55287
11323F510K8517K66553R7513A46926Q6746c491I6409O4364d8890C54450n2991
11312C01459k5745a40016O8618F2168L36069A33701l7077j1108O1498b01846N5097
11301a46749B88480J8594d4023B07032k9892B6825i2700C2950a30920l60032B96092
$$ plain form
11382 303578 232910 227110 330119 -131825 161106 104335 35806 -64579 -28702 200638 35663
11370 -63213 -388099 51375 -68876 -75944 87042 108574 -149758 186749 -165375 -168729 82754
11358 -36860 218708 -22889 -109756 -244749 21467 -21749 200373 -107153 -23056 196407 -92342
11346 -320792 137480 -52780 190727 -144494 228979 269495 -72901 63209 62703 -141511 45367
11334 154870 76526 -107570 -273574 109759 100608 -45375 290451 -142440 77371 -155287
11323 6510 35027 301580 399093 146926 233672 -3491 96409 160773 -48890 354450 301459
11312 301459 275714 -140016 -71398 62168 398237 133701 96624 85516 147014 -201846 -146749
11301 -146749 288480 307074 -44023 207032 177140 26825 -92700 32950 -130920 -490952 296092
11289a41577O6574A3052P0108c2066k2469D71L9954f3440j92323b7194A34009
11277b50258R3038p7021C7798Q3763b31184c8319n5549c8173J086A4376b30717
11265A43115d08002a5900j0734B19138o8461b06413H4372e2874J7605k7803l2269
11254i5341I976Q2382j093b15854g1037j8894k30877a01701A01080a6346l9780
11243e6126A71967p7482b46478a08502m6649f9335q0621J057C1591d8625G6540
11231B4398i9846C76130b36929h5425p5616B13687i772m60162a75936g0716j20746
11220a91462O4491k6934I119a02427j59962j3833A0482L3065h6576j46387k73276
11209e06239d4629j07385A75063b27444D8487P3416O217m8492d74842J08731J66708
$$ plain form
11289 -141577 -75003 13052 83160 -32066 -54535 471 40425 -63440 -255763 -27194 134009
11277 -250258 -157220 -234241 37798 121561 -231184 -38319 -93868 -38173 -37087 14376 -230717
11265 143115 -408002 -15900 -26634 219138 150677 -206413 84372 -52874 -35269 -63072 -95341
11254 -95341 9976 92358 91265 -215854 -71037 -89931 -320808 -101701 101080 -16346 -56126
11243 -56126 171967 94485 -246478 -108502 -155151 -69335 -149956 -148899 31591 -48625 76540
11231 24398 -99846 376130 -236929 -85425 -161041 213687 -9772 -469934 -175936 -70716 -191462
11220 -191462 -126971 -153905 9119 -102427 -262389 -276222 10482 43547 -86576 -232963 -506239
11209 -506239 -44629 -152014 175063 -227444 48487 121903 128120 79628 -474842 -366111 -199403
11198a99403A24846a1861B03882o9914o152a10806j45727C40293j20115b12143
11187b07962A26296a74536l72816a30936l4251P1819A8424J29289g424j63791
11177a71215j19271b5939j19379b2196r4043G9870h7857A34577k4390k4202a23630
11165a44202c9129j89486g4977j45786g3380m8341n2070d3187J160C404a97630
11153b38490b7624j03154G099c950k11257J3024q7624i3209j56979I1461A6791
11141a05373j4127A31789c8989A60429a85015o7157Q1030B41918A06795K50391
11131C57186A03854h6890A12578M31119A13532M4902m4071a8899A20010D0242
11120G8082K4998k8849J03889j4598a7734b513j07908A09211a32376A6042L67344
$$ plain form
11198 -199403 124846 -11861 203882 133968 127816 -110806 -256533 340293 220178 -212143
11187 -207962 126296 -174536 -547352 -130936 -165187 -93368 18424 147713 -7424 -171215
11177 -171215 -290486 -25939 -145318 -22196 -116239 79870 -87857 134577 110187 85985 -123630
11165 -144202 -39129 -228615 -74977 -220763 -73380 -121721 -173791 -43187 -42027 3404 -197630
11153 -238490 -27624 -130778 7099 -3950 -215207 -202183 -289807 -93209 -250188 91461 16791
11141 -105373 -119500 131789 -38989 160429 -185015 -252172 -171142 241918 106795 357186
11131 357186 103854 -86890 112578 543697 113532 158434 114363 -18899 120010 40242
11120 78082 103080 74231 178120 163522 -17734 -2513 -110421 109211 -132376 16042 383386
11109C83386A5291J0071a03050C73653A16606N67771l15630h2203E49970F3039
11098D03315A92878j6464n711k7402L39657q0831A90681N2572a50953B39786J07214
11087C47000H8988l4783A5646J78284J76406j18614b0989E64950j87834q5938
11077B91178q5314M6567J42117j87289K12510A45390K98676J85945k85496p0878
11067B73637K08246J71230k03008o1915K91889L773j26987A56562L56562J8779
11057E31903B48931M85982K74M5948K41167l65916K34208p141J71380k75334n8052
11046G21447J0299Q9374M4273q547l63065k090j1995j02357L48497k817k0654
11035G02365j19648j88744K78764j02355J27083J23887C38255K85825J88751j95084
$$ plain form
11109 383386 15291 25362 -103050 373653 116606 684377 368747 -82203 549970 63039
11098 403315 192878 176414 170703 143301 482958 402127 190681 243253 -150953 239786 347000
11087 347000 88988 54205 15646 193930 370336 251722 -20989 564950 377116 291178
11077 291178 205864 252431 394548 207259 419769 145390 444066 630011 344515 273637
11067 273637 481883 653113 450105 388190 680079 683852 556865 156562 513124 531903
11057 531903 248931 734913 735187 781135 1022302 656386 890594 883453 1054833 779499 721447
11046 721447 731746 821120 865393 856846 493781 491691 479696 377339 725836 723019 702365
11035 702365 582717 393973 672737 570382 697465 821352 338255 624080 812831 617747
11025F17747J80837l8530N0038P6914j64918k08738K31410k15523J90630j51879
11015E67988M9966L57086l26467j03284L56077k21185J01073L7817k2359j3720
11005G82992j36707K80050k68325k3668p7675L01204k35906L81975l87366Q1683
10995F98257L49366k80815J77282j1012k21298P1854J3435k12282M86894K75671
10985A347352j43409l71295J78223O2758l2000L11739j6091J19710J43270P2862
10975A673119M60346N59736m2844N79926m40669K01496j86432m4040m88019K82059
10965B554678o17138l83528J47429L5440L76635k39854j37700j25681R5231M03175
10955B108687j94190j64631j38666k23324N7221m69610j89800l02298Q6437k64480
$$ plain form
11025 617747 798584 760054 810092 887006 722088 513350 744760 529237 719867 567988
11015 567988 617954 975040 648573 545289 901366 680181 781254 819071 796712 782992
11005 782992 646285 926335 658010 634342 556667 857871 621965 1003940 616574 698257
10995 698257 1047623 766808 944090 933078 711780 783634 797069 584787 1071681 1347352
10985 1347352 1203943 832648 1010871 1073629 1041629 1353368 1337277 1456987 1600257 1673119
10975 1673119 2133465 2693201 2650357 3230283 2789614 2991110 2804678 2760638 2272619 2554678
10965 2554678 1937540 1554012 1701441 1736881 2113516 1873662 1735962 1610281 1705512 2108687
10955 2108687 1914497 1749866 1611200 1387876 1445097 975487 785687 483389 569826 305346
10945C05346J11501j35198G8709O25055A83768J73764A39141O6803F7423L8640
10935A06063j972l2367B2119J23064a3376B41457r1322f2080D2599J7008K99406
10924C59013F6882g949A94935R4134a93520G4311A1716a70226H2872i4639a9304
10912b59307A52143c73485h9666I9042a68304d3998k1176A50987K5555K4780b98233
10900b46827C6553J04585m7656b8180B16362h0132A41033g2762j025j37398L6579
10889a74606d890o8108b8715j55794F2875D177K11230a64934A48546N1834N6348
10878B56728q4795f6861r9648B23302e0544l7910D02220g5593A03257A7975a70855
10866d9059k96648J35238i8491A0207a08038l1748k10781D8595b66098g4937F8882
$$ plain form
10945 305346 416847 281649 78709 703764 183768 357532 139141 205944 67423 106063
10935 106063 104091 71724 22119 145183 -13376 241457 150135 -62080 42599 59607 359013
10924 359013 66882 -7949 194935 289069 -193520 74311 11716 -170226 82872 -94639 -19304
10912 -259307 152143 -373485 -89666 99042 -168304 -43998 -65174 150987 176542 201322 -298233
10900 -246827 36553 141138 93482 -28180 216362 -80132 141033 -72762 -73787 -211185 -174606
10889 -174606 -4890 -72998 -28715 -184509 62875 4177 215407 -164934 148546 200380 256728
10878 256728 171933 -66861 -166509 223302 -50544 -88454 402220 -75593 103257 17975 -170855
10866 -49059 -345707 -210469 -98491 10207 -108038 -139786 -350567 48595 -266098 -74937 68882
10854b67299H3024c1798j7098j19511B43471c10134a063D835J074b3253r832N44
10842c2541A29099J6273a07089o1156E036a56697B84489a06708A1684a05592A12269
10830B33441b44357I8497P2887b12525I7726J5768g8223k14070C6210b82033h4082
10818b83738B69168d9259a7835E495b04679m1198A62019C5620b81539E3415j5484
10807C7931b33722g24j24775F7471J14287c26268A68643f7165m20220A98371b03681
10795h2161l7182l08j7375L9596n0136A24019i9742k07101P2445A9103a92864
10783c223D9487N3909H062c23450c0316B1839b79588p1716G614a46572q0545C4678
10770b28643P0246f8116k8221d5422n2516H2006a60387P1773I9171a0164A72099
$$ plain form
10854 -267299 83024 -31798 -48896 -168407 243471 -310134 -1063 4835 5909 -23253 -33085 -32541
10842 -32541 129099 145372 -107089 -168245 5036 -156697 284489 -106708 11684 -105592 112269
10830 233441 -244357 98497 171384 -212525 97726 113494 -78223 -292293 36210 -282033 -84082
10818 -283738 269168 -49259 -17835 5495 -204679 -245877 162019 35620 -281539 53415 37931
10807 37931 -233722 -724 -125499 67471 181758 -326268 168643 -67165 -487385 198371 -203681
10795 -82161 -119343 -119651 -137026 -97430 -147566 124019 -99742 -306843 -234398 19103 -192864
10783 -3223 49487 103396 8062 -323450 -30316 21839 -279588 -351304 7614 -146572 -227117 34678
10770 -228643 -158397 -68116 -96337 -45422 -97938 82006 -160387 -88614 99171 -10164 172099
10758i4814A1096a61907b4155r4113l4539Q901j84832h3902L2724r2808I3624
10746G6586P811R3414J16068A28095L9828j5298e5462j41084M0373A98765a40063
10734b6010k00028e2350k61022a5472B02256b5170e561k68097O7095m470B07748
10722c89303B75074J00258I9301a54820A03856a98926c4296B68386a97611j26424
10712c24035O0471F2248b1691D3387g2295F7427b13277c2517A11106b48769A0256
10700B28023K5364K32565j88147a17248B57344J60333a93729H0903k8118a88850
10689D5627J62282B7775f3671A77228N394f0687j44331A72669j5798J74592h2948
10677a03161C18785h7151k91631G284L5863A5996a81033j27356A22652j5614g8579
$$ plain form
10758 -94814 11096 -161907 -24155 -118268 -152807 -143906 -328738 -83902 -51178 -143986 93624
10746 76586 84397 177811 293879 128095 167923 152625 -55462 -196546 -156173 198765 -140063
10734 -26010 -226038 -52350 -313372 -15472 202256 -25170 -5561 -273658 -206563 -211033 207748
10722 -389303 275074 375332 99301 -154820 103856 -198926 -34296 268386 -197611 -324035
10712 -324035 -263564 62248 -21691 43387 -72295 67427 -213277 -32517 111106 -248769 10256
10700 228023 253387 485952 297805 -117248 257344 417677 -193729 80903 52785 -188850
10689 45627 207909 27775 -63671 177228 182622 -60687 -205018 172669 156871 331463 -82948
10677 -103161 318785 -87151 -378782 7284 43147 15996 -181033 -308389 122652 107038 -78579
10665a53198G1970b00020l9129J19362k58077H3384d0911r1334F3928a70668K9611
10654a41057B3937L1596c1292A36353a83972n6852J03997H5619c21375a48297
10643B0946e3312E0032J49769c25811K3246c1190k43278M7358A87488J7701c1013
10631H0724a15769l1892P0229l9881C35250a34695k5208r4048g1481k93417J76406
10620a88492f4626A78701n6536a47889n4335P3102k5207M4627G8584c51140a16766
10608c0583l2775p9948l18262b11069m703i667o9209A41026n7741c6712E2959
10596A08365C0659a27641j12045Q7721r1080Q5182N6189G1468J7803O4279a23116
10584b208H048J6558a36238C5357f7712j8726b5366H2505f7959j42356l6339J00328
$$ plain form
10665 -153198 71970 -200020 -239149 -119787 -377864 83384 -40911 -132245 63928 -170668 -141057
10654 -141057 23937 55533 -31292 136353 -183972 -240824 -136827 85619 -321375 -148297
10643 20946 -53312 50032 199801 -325811 -302565 -31190 -274468 -227110 187488 205189 -31013
10631 80724 -115769 -147661 -77432 -117313 335250 -134695 -159903 -253951 -71481 -364898 -188492
10620 -188492 -64626 178701 122165 -147889 -202224 -129122 -154329 -109702 78584 -351140 -116766
10608 -30583 -63358 -143306 -461568 -211069 -215772 -9667 -78876 141026 83285 -36712 52959
10596 108365 30659 -127641 -239686 -151965 -243045 -157863 -101674 71468 89271 153550 -123116
10584 -2208 8048 24606 -136238 35357 -67712 -86438 -25366 82505 -67959 -210315 -246654 -146326
10572a46326l5328c4454j12669L6031k40606c3240F1803a35350B11684K0555c35353
10560D660J26711a40419A63848a61847H0705a66009B38302r6686d7438m293j10046
10549a61777A7760J92353d4157C1891J4210c0909j97143c5500H8247Q5778B4653
10537C2718b48433G5094J32667a2030E5163a00455M1440K1231j51327k7343A02393
10525a57945p5783R3562a9818j12858F8355L2673a05869j7782o8611c5690j93667
10514b29357A55812c12123B19840b23096a689j23908k47026J57231b6353I3404
10503b54120L4250b0744k52363N9854R4505e8722A46790C346b41245A99656A159
10491A91761q8124E288N6473d46971g9212Q141C7555a16034B78997K58949B47935
$$ plain form
10572 -146326 -181654 -34454 -147123 -111092 -351698 -33240 61803 -135350 211684 232239 -335353
10560 4660 131371 -140419 163848 -161847 80705 -166009 238302 141616 -47438 -51731 -161777
10549 -161777 17760 210113 -44157 31891 46101 -30909 -228052 -35500 88247 174025 24653
10537 32718 -248433 75094 207761 -12030 55163 -100455 -59015 -37784 -189111 -216454 102393
10525 -157945 -233728 -140166 -19818 -132676 68355 101028 -105869 -123651 -192262 -35690 -229357
10514 -229357 155812 -312123 219840 -223096 -1689 -125597 -372623 -215392 -26353 93404
10503 -254120 -219870 -20744 -273107 -213253 -118748 -58722 146790 3346 -241245 199656 1159
10491 191761 103637 5288 61761 -446971 -79212 -71071 37555 -116034 278997 537946 247935
10479F27678n6284k45889o3361J49358j24832N3274D1134c930D19736j54944d5756
10467A0035a92548R2091G4405O1194h8055l5152l11804f8929j29415D1386O7467
10456A08853a02884A26023a28503e95r1749o945l0574e1319L546H7136K95970
10445C83106G724b40188a13065E41b5915k53668H9503b93875a18676A81330g0074
10433c29789b629j77704E3953K34554G4486l2039J16232a52202D5812h4459m6394
10422a30853A68693a2607C14569a61331G0113K8706a25508A31210F5288j2431
10412E2857R6662g2813c96j77509c6320n7694j4774A0959a8789g121j29609B72600
10399f7463A73869d7846H8058L016a9376n1916n2516j02124B82367d1682A8431
$$ plain form
10479 627678 571394 325505 262144 411502 286670 339944 41134 -3930 419736 264792 -45756
10467 10035 -192548 -100457 74405 135599 -88055 -123207 -435011 -68929 -198344 41386 108853
10456 108853 -102884 126023 -128503 -595 -92344 -99289 -129863 -51319 -47773 87136 383106
10445 383106 7724 -240188 -113065 541 -25915 -279583 89503 -293875 -118676 181330 -70074
10433 -329789 -2629 -180333 53953 288507 74486 42447 158679 -152202 45812 -84459 -130853
10422 -130853 168693 -12607 314569 -161331 70113 98819 -125508 131210 65288 52857
10412 52857 149519 -72813 -396 -177905 -36320 -94014 -108788 10959 -18789 -7121 -136730 272600
10399 -67463 173869 -47846 88058 91074 -19376 -71292 -123808 -225932 282367 -41682 18431
10387A9496J76002a18756o8365A23789a10768A89593J49571A23141J25956q822
10377B40275A13585A274J5454K63486A03260P6862J88701b9968C50030A69016
10366H42174k11035P676Q3117j38391A76161D8141g6654B9212J6242M11043k20086
10355B36411B458L4533M48428a00017F00431n8321k52906Q5176A0333L2384M81803
10344E24520j21659J10643N6490B29530D4297K0013M32197B17930p5398K02872
10334C45404F1070J11373J26610B7440b31806g3265E4768J15313G3762e7756B72306
10322D00908Q824q6622i2382A84380N5096R2538E902L26573A04067c10232A75955
10310a22353j0651e9372j8504D52735b18805B8248L24418g7738A98384D2787b72070
$$ plain form
10387 19496 195498 -118756 -187121 123789 -110768 189593 339164 123141 249097 240275
10377 240275 113585 1274 16728 280214 103260 180122 368823 -29968 350030 169016
10366 842174 631139 638815 721932 583541 176161 48141 -76654 29212 45454 456497 236411
10355 236411 2458 36991 485419 -100017 600431 542110 289204 374380 10333 42717 524520
10344 524520 402861 513504 569994 229530 44297 64310 496507 217930 142532 345404
10334 345404 61070 172443 299053 27440 -231806 -73265 54768 170081 73762 -57756 272306
10322 400908 409732 323110 -92382 184380 239476 332014 5902 332475 104067 -310232 175955
10310 -122353 -133004 -59372 -77876 452735 -218805 28248 352666 -77738 198384 42787 -272070
10298b48170J0110b0828C21257a15962A68322d79673C5644a92609f4102j07822
10288a71924m1958a4564A66716i7860E2264a6008k07776Q0799j47228A89731L1886
10277B21617n0350b8438I9252f2057B15434o7615a04317C10739f2030A5393a51995
10265C20152o5037C7528L7736B4495N85815k42552j28697J29894M3744A43510
10254B72855I4257J53857n2095F04J89893c16989a07159H9578a76054J9686b6698
10242a68386A2303J80799b20003e6241o1999d2174k72339a33367K2527o3678e1241
10230A37341a45635c9119f482o1221D7281R7167o9788k8514f2503l43785A29255
10218e1001G8828j1100B6550M3697a08731r6387J5523B63922i79B30938b69405
$$ plain form
10298 -248170 -238060 -20828 321257 -115962 168322 -479673 35644 -192609 -64102 -171924
10288 -171924 -213882 -14564 166716 -97860 52264 -16008 -223784 -142985 -290213 189731 221617
10277 221617 171267 -28438 99252 -62057 215434 147819 -104317 310739 -62030 15393 -151995
10265 320152 255115 37528 75264 24495 610310 367758 239061 368955 412699 143510
10254 272855 94257 248114 196019 604 190497 -316989 -107159 89578 -176054 -156368 -26698
10242 -168386 12303 193102 -220003 -56241 -118240 -42174 -314513 -133367 -110840 -174518 -51241
10230 137341 -145635 -39119 -6482 -67703 47281 144448 74660 46146 -62503 -406288 129255
10218 -51001 78828 67728 26550 70247 -108731 -205118 -189595 263922 -979 230938 -269405
10206b09997A74507c87640B01249a35596H8213c42317d7682I0747d9174A65740
10195d3446H1706L5411C2012c05223o7434C32426j21222d23858E2765b69042A7361
10183b17322C01129c04637E1950a96866h5887j25734A15552A3020K10950H0106
10172e0350j06995A07290a29189c7962k00166C356J33274b39249N7910A2291L0485
10161D2776J6849a61639A84346i0129K6014B70709b08712F7399J31383f6939m10006
10150d76945A41794i2445j10499g5717J8836j52183d6884j89946b4020l50128
10140c74148a41534B77639h9996A30011b87014A0147a85966j13254I1904h9235
10129a26974c4310B97598c51788C94641A64976D1845d8468B90474A00362h9238
$$ plain form
10206 -209997 174507 -387640 201249 -135596 88213 -342317 -47682 90747 -49174 165740
10195 -43446 81706 117117 32012 -305223 -372657 332426 211204 -423858 52765 -269042 17361
10183 -217322 301129 -304637 51950 -196866 -85887 -211621 115552 13020 223970 80106
10172 -50350 -157345 107290 -129189 -37962 -238128 3356 136630 -239249 -181339 12291 42776
10161 42776 59625 -161639 184346 -90129 -64115 270709 -208712 67399 198782 -66939 -476945
10150 -476945 141794 -92445 -202944 -75717 -56881 -209064 -46884 -236830 -24020 -374148
10140 -374148 -141534 277639 -89996 130011 -287014 10147 -185966 -299220 91904 -89235
10129 -126974 -34310 297598 -351788 394641 164976 41845 -48468 290474 100362 -89238
10118B5094c44568f4169k93133f590m39064C00827a06499A02349a4190j50544
10108a64734l962A18306g3812A33404b0250l9923K4091k17741E2432b30693Q3255
10097a47438A6943O2863c29022A2177f4874K2452l8617L1954k31198j0864h823
10085H9637c55055C6681A1880c12443J39154P4588A28268c11764G8189c64841
10074h9003C7671M8943c2024I2966k6607a41933f608q156j32913j32542H0997
10062E1723L1027a66249k2932A81433a3299C50866j70067C2906c08753J51666
10052a57087b7513k4427k17864H5485b8590m5488j3027j13652A21265j5457b50338
10040a37202L4956n1560E172b49470H487a78916j65415A8413a446q750j49529
$$ plain form
10118 25094 -344568 -64169 -357302 -6590 -445654 300827 -106499 102349 -14190 -164734
10108 -164734 -168696 118306 -73812 133404 -20250 -60173 -36082 -253823 52432 -230693 -147438
10097 -147438 16943 79806 -329022 12177 -64874 -42422 -81039 -49085 -280283 -291147 -8823
10085 89637 -355055 36681 11880 -312443 -173289 -98701 128268 -311764 78189 -364841
10074 -89003 37671 86614 -32024 92966 66359 -141933 -6608 -14764 -147677 -280219 80997
10062 51723 82750 -166249 -189181 181433 -13299 350866 180799 32906 -308753 -157087
10052 -157087 -27513 -51940 -269804 85485 -28590 -74078 -87105 -200757 121265 105808 -250338
10040 -137202 -102246 -153806 5172 -249470 8487 -178916 -344331 18413 -1446 -10196 -159725
10029a59725O6401r2188H8327a09979B64769f8969l56672I9767P6807Q9049a02728
10017F01d9818F0322c74063A27134d459j41597G0193a36586c9996j47930c5679
10005d67809R6048a23576j10749A12844a79570A02219O0111a53246a258A89448
9994A00795c01721A11097a24800l4981p1105l7356Q3559l0175C5797c08135C5278
9982a52092F3943a68184A69333d0566D254f9599B95079D0892k0035J93579a70666
9970i5259k85676i992k76696A49727b99878I4555b76725i4847G868N6698P392
9959G1958h6970A23132J46836C1995d7764n7003N1877A00460c4314l32A28962
9947A40346g0333r1782A11288a81987O3553r7921a5730p3691E708a62277H1385
$$ plain form
10029 -159725 -93324 -185512 88327 -109979 264769 -68969 -425641 99767 176574 265623 -102728
10017 601 -49818 60322 -374063 127134 -4459 -146056 70193 -136586 -39996 -187926 -35679
10005 -467809 -371761 -123576 -234325 112844 -179570 102219 162330 -153246 -1258 189448
9994 100795 -301721 111097 -124800 -159781 -230886 -268242 -184683 -214858 35797 -308135 35278
9982 -152092 63943 -168184 169333 -40566 4254 -69599 295079 40892 20857 214436 -170666
9970 -95259 -380935 -9992 -286688 149727 -299878 94555 -276725 -94847 7868 64566 71958
9959 71958 -86970 123132 269968 31995 -47764 -104767 -52890 100460 -34314 -34646 128962
9947 140346 -70333 -162115 111288 -181987 -118434 -216355 -15730 -89421 5708 -162277 81385
9935d9530j0489A32334l5342c37123A87324a03743J0688B56305c33868N9305J12561
9924a62002C4683p80N0035N1482M6401K8213b32058j58456f3934j30521A22472
9912A56822c1238m2565j15770g0709A69332b01108N8922l1438C0959b94737B2912
9900A81030b44384A20398a17417b8675m14516J90616k45820K06985C9522J29883
9890A69405J9762j8344e6818n7035B5674a30918j07228A5388b48194d8271a5532
9878b46298A00614a94500a0402G7870J85657n2617c19400h7970p9159N0776E5091
9866d7776A02231b40268R4315n1436l7190B26410a59103j75933d6602F7871c37909
9854G2330b48146A00115M2486b3826B37907d2450k6643E6704a78560e1329k4243
$$ plain form
9935 -49530 -60019 132334 96992 -337123 187324 -103743 -93055 256305 -333868 -274563 -162002
9924 -162002 34683 33903 83938 135420 181821 210034 -232058 -390514 -63934 -194455 122472
9912 156822 -31238 -73803 -189573 -70709 169332 -201108 -142186 -173624 30959 -294737 22912
9900 181030 -244384 120398 -117417 -28675 -443191 -252575 -498395 -291410 39522 169405
9890 169405 189167 170823 -56818 -113853 25674 -130918 -238146 15388 -248194 -48271 -15532
9878 -246298 100614 -194500 -10402 77870 263527 210910 -319400 -87970 -167129 -116353 55091
9866 -47776 102231 -240268 -145953 -197389 -234579 226410 -159103 -335036 -46602 67871 -337909
9854 72330 -248146 100115 142601 -23826 237907 -42450 -69093 56704 -178560 -51329 -75572
9843g5572k10509a38637a7719r6941d6409A09619A8526Q9274D019J27315O5848
9832A97182b58382J1527H2468c87184k12340h8623n0108m9112j84020o0553F3804
9820a49303e2971A44923a72053j18501E1638a38745A08370a54027e4387l026B7140
9808B3781b33521M7704j20396a15971p5256c8673k55057C77876a19762e0235A75194
9796C66309j76496d64695a91471g089k82816k9032f1304j18328l603j54240J31424
9785b06051L5333A09603R3961I6086h2355A08177l4061a69926k09495c3129a1771
9773G6731B5845J6654A0989J31950h6141m5322C40965f7190J0189j20072Q5686
9762i1387j39945c863G978e3778a3435m1387k5177k51006A56454A2739J5084a42992
$$ plain form
9843 -75572 -286081 -138637 -17719 -114660 -46409 109619 18526 107800 4019 131334 197182
9832 197182 -258382 -246855 82468 -387184 -599524 -88623 -138731 -187843 -371863 -432416 63804
9820 -149303 -52971 144923 -172053 -290554 51638 -138745 108370 -154027 -54387 -57413 27140
9808 23781 -233521 -185817 -306213 -115971 -191227 -38673 -293730 377876 -119762 -50235 175194
9796 366309 189813 -464695 -191471 -7089 -289905 -318937 -61304 -179632 -183235 -337475 -206051
9785 -206051 -170718 109603 203564 96086 -82355 108177 74116 -169926 -379421 -33129 -11771
9773 76731 25845 42499 10989 142939 -86141 -131463 340965 -67190 -57001 -177073 -91387
9762 -91387 -231332 -3863 7978 -53778 -13435 -54822 -79999 -331005 156454 12739 27823 -142992
9749a19201B9216b74373c5342G5549d1502k70835L8055j35569E6203c07106G2731
9737a8822A34431J2122a91670m8883i3879l822M4566k30191M2245l5370J30890
9726a45561l6307p9518N3893L261a8702G622b49292C3236a85373h323k8256j28881
9714a65460K9036l81159A09712a28172A9102b26204B4026K275J16309c55358f2900
9702e5008o2729i113j48306f4535j23422B02251j2426r2708b80930A75217O9717
9691B44934a34528m902O1787B13577b34734a07704E8191i9281I6810a91837e1853
9679B19954a32709B13288f6513I6747O1429J53273F2968c2774I8669a39288b9893
9667A41579a51328b5028C02896a03256n4091o6010j01449B16615b87554P2324
$$ plain form
9749 -119201 29216 -274373 -35342 75549 -41502 -312337 -274282 -409851 56203 -307106 72731
9737 -18822 134431 146553 -191670 -240553 -93879 -97701 -53135 -283326 -241081 -276451 -145561
9726 -145561 -181868 -261386 -207493 -204232 -18702 7622 -249292 33236 -185373 -8323 -36579 -165460
9714 -165460 -136424 -517583 109712 -128172 19102 -226204 24026 26301 142610 -355358 -62900
9702 -55008 -117737 -9113 -157419 -64535 -187957 202251 189825 97117 -280930 175217 244934
9691 244934 -134528 -139430 -77643 213577 -234734 -107704 58191 -99281 96810 -191837 -51853
9679 219954 -132709 213288 -66513 96747 158176 311449 62968 -32774 98669 -139288 -29893
9667 141579 -151328 -25028 302896 -103256 -157347 -223357 -324806 216615 -287554 -215230
9657b15230q049I3941J0226O360O4859a56080a6854A06194a69610n0932D1944
9645G374d99184a45031e2455k70137H3339d2990F6811P2237g6170r1956n0186
9634b18312A46890a41442A12924k8443L37870a24939j4971j37011L0952j99025
9624d44994H9398a01330K0345j44783g0138I7725J33266D4402k0195a3335A41696
9612B38813c6683o0997L382f385A7213a60718n1873e6932A66423I278a86732d7859
9599c36765b0615m3182k40197D6118a68174b2829l486C4178a42640K9420b9252
9587d44704a17308A33342B5244a74690P2861j05471D9837Q3226a74084j02356
9577b76440i0202M4756A86455a70897e3402j57373G0169a88395R3664A41103d67930
$$ plain form
9657 -215230 -223279 93941 104167 110527 175386 -156080 -16854 106194 -169610 -220542 41944
9645 7374 -499184 -145031 -52455 -322592 83339 -42990 66811 139048 -76170 -168126 -218312
9634 -218312 146890 -141442 112924 84481 422351 -124939 -139910 -276921 -245969 -444994
9624 -444994 89398 -101330 -80985 -225768 -70138 97725 230991 44402 24207 -13335 141696
9612 238813 -36683 -97680 -94298 -6385 17213 -160718 -212591 -56932 166423 9278 -186732 -47859
9599 -336765 -20615 -63797 -303994 46118 -168174 -22829 -26315 34178 -142640 -113220 -29252
9587 -444704 -117308 133342 25244 -174690 -101829 -207300 49837 133063 -174084 -276440
9577 -276440 -90202 -45446 186455 -170897 -53402 -210775 70169 -188395 -94731 141103 -467930
9565e8942A01527K1995c43106a03967a2972j06163k24179b0995l4060k02583H568
9553H8533M1905b69109a1281I8700a43561k1126e3880k61647e2767F8063f5305
9541a80151B74067e7187F9511b52306h0153B24438a04751a2074D0896L7614k9594
9530D8916K29465b26854p4702N2118a17657k22720j2667A08448J4672a14821G1853
9518a22347j73107A16648B3604J55912E4284c5605j71553l4770d7120k5111j02168
9507a74399g7464A7499f5748k32690F1819A3912J28207a32484j12020F4010a73351
9495b01168j59647h8457I1988a85312k28740a80417B07556B5804a23022j62537
9485b85559a25673k06106E4657J70198D0174n746a70473h5146D806d1548k00207
$$ plain form
9565 -58942 101527 123522 -343106 -103967 -12972 -119135 -343314 -20995 -55055 -257638 8568
9553 88533 130438 -269109 -11281 98700 -143561 -164687 -53880 -315527 -52767 68063 -65305
9541 -180151 274067 -57187 69511 -252306 -80153 224438 -104751 -12074 40896 78510 48916
9530 48916 278381 -226854 -301556 -249438 -117657 -340377 -353044 108448 123120 -114821 71853
9518 -122347 -295454 116648 23604 179516 54284 -35605 -207158 -241928 -47120 -72231 -174399
9507 -174399 -77464 17499 -65748 -298438 61819 13912 142119 -132484 -244504 64010 -173351
9495 -201168 -360815 -88457 91988 -185312 -414052 -180417 207556 25804 -123022 -285559
9485 -285559 -125673 -331779 54657 224855 40174 34428 -170473 -85146 4806 -41548 -241755
9474b41755F1952b10322A01655c04696c9778A49724b03772f120l2275j40587H914
9462c42906A63766d39924A1506b84103h7730j73325e3354q7528j759m6939C36113
9450d1989q83o8284F4087c13148A26228c19597g7427J2149m2159J1104j96413
9439b92746E7642Q6422a64477l0670B7264d0344j35531c6141G4958b55469P2428
9428a83041j99127F1042a75303a1357k43614I8795A2135a77759M6333l6671f5133
9416A18476a42460Q405B45937C4589j7165a23115l2712A92106a42244F4011g3582
9404A87281n3322L19043d2467C02460m2409j00178C1242a47448K359B54088i4618
9392B60083H7857c3144l9626K5929j19141e8467j35773B80021a22541g666E6986
$$ plain form
9474 -241755 61952 -210322 101655 -304696 -39778 149724 -203772 -6120 -38395 -178982 8914
9462 -342906 163766 -439924 11506 -284103 -87730 -261055 -53354 -140882 -142641 -189580 336113
9450 -41989 -42872 -111156 64087 -313148 126228 -319597 -77427 -65278 -107437 -96333 -292746
9439 -292746 57642 144064 -164477 -195147 27264 -40344 -175875 -36141 74958 -255469 -183041
9428 -183041 -382168 61042 -175303 -11357 -254971 98795 12135 -177759 -131426 -168097 -65133
9416 118476 -142460 -134055 245937 34589 17424 -123115 -155827 192106 -142244 64011 -73582
9404 187281 133959 453002 -42467 302460 260051 159873 31242 -147448 -145089 254088 -94618
9392 260083 87857 -33144 -72770 -46841 -165982 -58467 -194240 280021 -122541 -7666 56986
9380A22986f6184H6023a37334K7480C5579i9356r7791B0286b28132I9713J847
9369A01560J19638g0160j3424n657E1294f1634j5702q6519B9244b47172A87062
9357B0840q750a55597j54723A54468Hc54192F2964a10088d3374j05727B8836L25997
9345C54833a23548A23366b29833i2247A41809K0871c29851J10118Q5929A71096
9334g481I9000a70911O6278M1438k17289E501e7767k77415C3132K5438K22349
9323B80919a62287f1535J8873d527k3804j46774A51636j8195b72001a33499m9250
9312a82749h277b669n4677j48987b1136m6546A53196a15219b1141j31632e1292
9300a24483j51921a23721m9137A40076g7015j44976J04641q6694G5111J53768
$$ plain form
9380 122986 -66184 86023 -137334 -109854 35579 -99356 -197147 20286 -228132 99713 101560
9369 101560 221198 -70160 -83584 -89241 51294 -61634 -77336 -163855 29244 -247172 187062
9357 20840 12090 -155597 -310320 154468 8 -354192 62964 -110088 -43374 -149101 28836 354833
9345 354833 -123548 123366 -229833 -92247 141809 162680 -329851 -219733 -133804 171096
9334 -7481 99000 -170911 -104633 -63195 -280484 5501 -57767 -335182 33132 58570 280919
9323 280919 -162287 -61535 -42662 -4527 -28331 -175105 151636 133441 -272001 -133499 -182749
9312 -182749 -8277 -2669 -57346 -206333 -21136 -67682 153196 -115219 -21141 -152773 -51292
9300 -124483 -276404 -123721 -172858 140076 -77015 -221991 -117350 -204044 75111 228879
9290B28879d2963m50006C31034c29419P3408N6200B32511D5484c0589j9054b4133
9278B6171b5519l55495J50600A11202a57367j45650a9055j20766j7684B9278b2559
9266A3047i3242j37629I6615c00085i7070J1105A00496K57957a65721j00531H7774
9254a26039D1518M2397H413J81679e6301m3476c0762F3633J27210c1641k28816
9243b60457j3484A39114n2417a72952A89705a72278D7038b96613A3066a57286
9232b90257q6112H6232e2797l7346k33922a15519l1974M0132o1604B64591b0959
9220b8614j20042A12895R4575a32572A8045b65990M0824A83475f4144A48903i9401
9208i3204k28370d1467o3713c0371o9309p7400E43g4220j39705E4391a70322h0205
$$ plain form
9290 228879 -42963 -492969 331034 -329419 -256011 -199811 232511 45484 -30589 -49643 -24133
9278 26171 -25519 -381014 -230414 111202 -157367 -303017 -19055 -139821 -157505 29278 -22559
9266 13047 -93242 -230871 96615 -300085 -97070 -85965 100496 358453 -165721 -266252 87774
9254 -126039 41518 83915 8413 190092 -56301 -99777 -30762 63633 190843 -31641 -260457
9243 -260457 -273941 139114 86697 -172952 189705 -172278 47038 -296613 13066 -157286
9232 -290257 -376369 86232 -52797 -90143 -324065 -115519 -147493 -107361 -168965 264591 -20959
9220 -28614 -148656 112895 207470 -132572 18045 -265990 -225166 183475 -64144 148903 -99401
9208 -93204 -321574 -41467 -105180 -30371 -99680 -177080 543 -74220 -213925 54391 -170322 -80205
9195b7413j03269B72470e6924j20237h2498B23629g5207q6566l3353A64260i5178
9183b46847d6188j93342C0538a61996e9041C5724L7215J28835e15769A89627a99998
9171A66718b85315J26236k9546A2670a02543m9477f0812b5253k24312j59021d7465
9159A40692m8793a62807J4013D6216f4184A33368b29309k8027G0912a65567l3561
9148a99128j02007J46566k9359C5465a37208B38546a2807n8380o6405k11013J39399
9137b09206D9905a13670o3112Q3955j065L5999o2903H3279a80152j32706P8656
9126b34202j80742a70773o300P1577A98226d5392j8251f147H9670b01381k12785
9115d14166C1117b96395O7854B54805H3686b05488N9188M1329j13837c7848p2922
$$ plain form
9195 -27413 -130682 272470 -56924 -177161 -82498 223629 -75207 -161773 -195126 164260 -95178
9183 -246847 -46188 -239530 30538 -161996 -59041 35724 72939 201774 -515769 189627 -199998
9171 166718 -285315 -159079 -188625 12670 -102543 -152020 -60812 -25253 -249565 -408586 -47465
9159 140692 91899 -162807 -148794 46216 -64184 133368 -229309 -257336 70912 -165567 -199128
9148 -199128 -301135 -154569 -183928 35465 -137208 238546 -12807 -71187 -137592 -348605 -209206
9137 -209206 49905 -113670 -176782 -92827 -93892 -57893 -120796 83279 -180152 -312858 -234202
9126 -234202 -414944 -170773 -177073 -105496 198226 -45392 -63643 -6147 89670 -201381 -414166
9115 -414166 31117 -296395 -228541 254805 83686 -205488 -146300 -104971 -218808 -37848 -110770
9104a10770r8642R2557b1778d531A71430a04202k07188L1784O3526D4252b16566
9092a9479r9151I5009e25769a08806p8146A65274b05729R2270I0342d1948H1627
9080C22355c24402a0008j61052P7941A07574a04817a9804B79498n8537b344A45934
9068C0149M9965j7145M2002b12061A06765q819a14712p0213H7244a22137m69880
9057e92017A0139f5172j51500n3444h5943D56699a26407C95775A15576L9285D5902
9045C5814A1814a60733c6470l5151q2364H7527K40962l3823i098p2764B469J25699
9033A28168A7253a02665c1089j24497B62800p4079b01909c0700J2379A54573B0134
9021b50490Q5781d9049a2675o9023k9620A8395a06215C7611L6576c1528k75157
$$ plain form
9104 -110770 -209412 -116855 -21778 -4531 171430 -104202 -311390 -279606 -216080 44252 -216566
9092 -19479 -118630 95009 -525769 -108806 -186952 165274 -205729 -113459 90342 -41948 81627
9080 322355 -324402 -10008 -171060 -93119 107574 -104817 -19804 279498 220961 -2344 145934
9068 30149 80114 62969 104971 -212061 106765 97946 -114712 -184925 87244 -122137 -592017
9057 -592017 10139 -65172 -216672 -270116 -85943 456699 -126407 395775 115576 154861 45902
9045 35814 11814 -160733 -36470 -71621 -153985 87527 328489 294666 -9098 -81862 2469 128168
9033 128168 17253 -102665 -31089 -155586 262800 188721 -201909 -30700 -18321 154573 20134
9021 -250490 -164709 -49049 -12675 -81698 -111318 18395 -106215 37611 74187 -31528 -306685
9010c06685B67847H1285f20B11127A8762a11385o2445g2889B99260g8746J8871
8999e9875A54559I043J53152a14898A49457a20329e6304q7426L8777B32340b63426
8987F4876R9652k8856B0271Q9976c1667C8661J7376a05374c3891A8716a10012
8975i2464B12145a23510J4559f38C82955A11354e7225n3304a203k2868j65054
8964a89125N0504A18701a70424A38372c0235j87874Q9985j18235H5995a59979
8953h3470L366O488j55123a09485j6697H7740a9663A23343a30465J707B09255
8941a75631O8449k35819c8148q4853B91284A06171J51134j7866i7636E5157e070
8929B06956F4019a10931B55521k3385K26388N5783J689457P550384K042462C462752
$$ plain form
9010 -306685 267847 81285 -620 211127 18762 -111385 -173830 -72889 299260 -78746 -59875
8999 -59875 154559 9043 162195 -114898 149457 -120329 -56304 -143730 -104953 232340 -263426
8987 64876 164528 135672 20271 110247 -31667 38661 56037 -105374 -33891 18716 -110012
8975 -92464 212145 -123510 -108951 -638 382955 111354 -57225 -110529 -1203 -24071 -189125
8964 -189125 -138621 118701 -170424 138372 -30235 -218109 -128124 -246359 85995 -159979
8953 -83470 -80104 -73616 -228739 -109485 -126182 87740 -19663 123343 -130465 -128758 209255
8941 -175631 -107182 -343001 -38148 -123001 291284 106171 257305 239439 -97636 55157 -5070
8929 206956 64019 -110931 255521 232136 458524 514307 2203764 9754148 11796610 3462752
8918A358484o52450k39968A55044a10590B70283A05788b5877k6844A48494a00710
8907D58959H6066h0809q3559P8661k65221f8317I437i7577H8418l1712b47675
8895a51773A6036a57738F9036L7215b05855m091A2957l582f2983N787C51162a67604
8882i5533m9252E546c31815g4763A85388a1232k6855H5446b43017I4180b49555
8870a95730b6276k13500g682l76157a73255b3512m9198B8190J97643B798R9056
$$ plain form
8918 1358484 706034 466066 155044 -110590 270283 105788 -25877 -52721 148494 -100710
8907 458959 86066 -80809 -164368 -85707 -350928 -68317 9437 -97577 88418 56706 -247675
8895 -151773 16036 -157738 69036 106251 -205855 -209946 12957 9375 -62983 -57196 351162 -167604
8882 -95533 -144785 5546 -331815 -74763 185388 -11232 -38087 85446 -243017 94180 -249555
8870 -195730 -26276 -239776 -7682 -383839 -173255 -23512 -72710 28190 225833 2798 101854
$$ [...]
##END NTUPLES=NMR SPECTRUM
##END=
