
##TITLE=AC1381_PERAH12193_7518968_igSGzbUJ3o
##JCAMPDX= 6.0         $$ Bruker NMR JCAMP-DX V2.0
##DATA TYPE= NMR SPECTRUM
##DATA CLASS= NTUPLES
##ORIGIN= BRUKER
##OWNER= Administrator
$$ 1.72 TOPSPIN		Version 2.1
$$ 2013-02-21 02:01:55.189 -0500  Administrator@X
$$ Compression mode = diff/dup
##.OBSERVE FREQUENCY= 400.02188249412
##.OBSERVE NUCLEUS= ^1H
##.ACQUISITION MODE= SIMULTANEOUS (DQD)
##.ACQUISITION SCHEME= undefined
##.AVERAGES= 64
##.DIGITISER RES= 22
##SPECTROMETER/DATA SYSTEM= spect
##.PULSE SEQUENCE= noesygpps1d.comp
##.SOLVENT NAME= COFFEE_meoh
##.SHIFT REFERENCE= INTERNAL, COFFEE_meoh, 1, 14.96093
##AUDIT TRAIL= $$ (NUMBER, WHEN, WHO, WHERE, PROCESS, VERSION, WHAT)
$$ ##TITLE= Audit trail, TOPSPIN		Version 2.1
$$ ##JCAMPDX= 5.01
$$ ##ORIGIN= Bruker BioSpin GmbH
$$ ##OWNER= Administrator
$$ $$ E:\/data/COFFEE/nmr/AC1381_PERAH12193_7518968_igSGzbUJ3o/12/pdata/1/auditp.txt
$$ ##AUDIT TRAIL=  $$ (NUMBER, WHEN, WHO, WHERE, PROCESS, VERSION, WHAT)
(   1,<2013-02-21 02:01:49.126 -0500>,<Administrator>,<X>,<go>,<TOPSPIN 2.1>,
      <created by zg
	started at 2013-02-21 01:50:18.621 -0500,
	POWCHK enabled, PULCHK disabled,
       configuration hash MD5:
       86 BA 57 50 F2 9D 5C 9B 26 00 A9 28 5F 66 2E 89
       data hash MD5: 64K
       42 96 22 F7 0F 35 D4 F6 89 5F F4 78 7D 1F 1A C3>)
(   2,<2013-02-21 02:01:52.298 -0500>,<Administrator>,<X>,<proc1d>,<TOPSPIN 2.1>,
      <Start of raw data processing
       efp LB = 0.3 FT_mod = 6 PKNL = 1 PHC0 = 0 PHC1 = 0 SI = 128K 
       data hash MD5: 128K
       37 8B 43 58 A0 E6 30 9B 77 54 73 3E F6 0B 4B 25>)
(   3,<2013-02-21 02:01:53.423 -0500>,<Administrator>,<X>,<proc1d>,<TOPSPIN 2.1>,
      <pk PHC0 = 249.906 PHC1 = 0 
       data hash MD5: 128K
       B1 0D 89 17 79 B9 68 94 EC 3F 26 CA 4C E7 99 12>)
(   4,<2013-02-21 02:01:54.095 -0500>,<Administrator>,<X>,<proc1d>,<TOPSPIN 2.1>,
      <abs ABSG = 1 
       data hash MD5: 128K
       9B BB 2A 6C D5 DC AD EF 21 2D 49 D2 1E 8C 45 A8>)
(   5,<2013-02-21 02:01:54.298 -0500>,<Administrator>,<X>,<proc1d>,<TOPSPIN 2.1>,
      <abs ABSG = 2 
       data hash MD5: 128K
       05 D8 E3 72 83 CB 7E B6 71 D9 56 D6 A8 A4 68 74>)
(   6,<2013-02-21 02:01:54.501 -0500>,<Administrator>,<X>,<proc1d>,<TOPSPIN 2.1>,
      <abs ABSG = 3 
       data hash MD5: 128K
       8E 89 49 2C 5A 9F FE C3 EC CA 67 8F 09 71 E0 93>)
(   7,<2013-02-21 02:01:54.673 -0500>,<Administrator>,<X>,<proc1d>,<TOPSPIN 2.1>,
      <abs ABSG = 4 
       data hash MD5: 128K
       E3 20 86 46 BC 71 0E 34 D7 68 C7 50 E5 B1 8B 43>)
(   8,<2013-02-21 02:01:54.860 -0500>,<Administrator>,<X>,<proc1d>,<TOPSPIN 2.1>,
      <abs ABSG = 5 
       data hash MD5: 128K
       A9 E2 17 A5 1B FC FD 47 4D EA 62 CB 82 51 39 7F>)
$$ ##END=
$$ 
$$ $$ hash MD5
$$ $$ 2B FB E5 D2 43 99 A2 C4 09 4E 74 0F AE CF 19 FA
##$RELAX= 
##$RELAX= 
##$RELAX= 
##$RELAX= 
##$RELAX= 
##$RELAX= 
##$RELAX= 
##$RELAX= 
$$ Bruker specific parameters
$$ --------------------------
##$DU= <E:\>
##$EXPNO= 12
$$ [...]
150 150 150 150 150 150 150 150
##$TP07= 0
##$TPNAME0= <>
##$TPNAME1= <>
##$TPNAME2= <>
##$TPNAME3= <>
##$TPNAME4= <>
##$TPNAME5= <>
##$TPNAME6= <>
##$TPNAME7= <>
##$TPOAL= (0..7)
0.5 0.5 0.5 0.5 0.5 0.5 0.5 0.5
##$TPOFFS= (0..7)
0 0 0 0 0 0 0 0
##$TUNHIN= 0
##$TUNHOUT= 0
##$TUNXOUT= 0
##$USERA1= <user>
##$USERA2= <user>
##$USERA3= <user>
##$USERA4= <user>
##$USERA5= <user>
##$V9= 5
##$VALIST= <valist>
##$VCLIST= <CCCCCCCCCCCCCCC>
##$VD= 0
##$VDLIST= <DDDDDDDDDDDDDDD>
##$VPLIST= <PPPPPPPPPPPPPPP>
##$VTLIST= <TTTTTTTTTTTTTTT>
##$WBST= 1024
##$WBSW= 4
##$XGAIN= (0..3)
0 0 0 0
##$XL= 0
##$YL= 0
##$YMAX_a= 6242451
##$YMIN_a= -10983435
##$ZGOPTNS= <>
##$ZL1= 120
##$ZL2= 120
##$ZL3= 120
##$ZL4= 120
##$ABSF1= 14.96093
##$ABSF2= -5.597252
##$ABSG= 5
##$ABSL= 3
##$ALPHA= 0
##$AQORDER= 0
##$ASSFAC= 0
##$ASSFACI= 0
##$ASSFACX= 0
##$ASSWID= 0
##$AUNMP= <proc_prof1d_extract.lims>
##$AXLEFT= 0
##$AXNAME= <>
##$AXNUC= <1H>
##$AXRIGHT= 0
##$AXTYPE= 0
##$AXUNIT= <>
##$AZFE= 0.1
##$AZFW= 0.1
##$BCFW= 0
##$BC_mod= 0
##$BYTORDP= 0
##$COROFFS= 0
##$CY= 15
##$DATMOD= 1
##$DC= 0
##$DFILT= <>
##$DTYPP= 0
##$F1P= 0
##$F2P= 0
##$FCOR= 0.5
##$FTSIZE= 131072
##$FT_mod= 6
##$GAMMA= 0
##$GB= 0
##$INTBC= 1
##$INTSCL= 1
##$ISEN= 128
##$LB= 0.3
##$LEV0= 0
##$LPBIN= 0
##$MAXI= 10000
##$MC2= 0
##$MEAN= 0
##$ME_mod= 0
##$MI= 0
##$NCOEF= 0
##$NC_proc= -2
##$NLEV= 6
##$NOISF1= 0
##$NOISF2= 0
##$NSP= 0
##$NTH_PI= 0
##$NZP= 0
##$OFFSET= 14.96093
##$PC= 1
##$PHC0= 249.906
##$PHC1= 0
##$PH_mod= 1
##$PKNL= yes
##$PPARMOD= 0
##$PPDIAG= 0
##$PPIPTYP= 0
##$PPMPNUM= 2147483647
##$PPRESOL= 1
##$PSCAL= 4
##$PSIGN= 0
##$PYNMP= <proc.py>
##$REVERSE= no
##$SF= 400.020009664183
##$SI= 131072
##$SIGF1= 0
##$SIGF2= 0
##$SINO= 400
##$SIOLD= 131072
##$SPECTYP= <>
##$SREGLST= <1H.CDCl3>
##$SSB= 0
##$STSI= 131072
##$STSR= 0
##$SW_p= 8223.68421052631
##$SYMM= 0
##$S_DEV= 0
##$TDeff= 65536
##$TDoff= 0
##$TI= <>
##$TILT= no
##$TM1= 0
##$TM2= 0
##$TOPLEV= 0
##$USERP1= <user>
##$USERP2= <user>
##$USERP3= <user>
##$USERP4= <user>
##$USERP5= <user>
##$WDW= 1
##$XDIM= 131072
##$YMAX_p= 437164586
##$YMIN_p= -11947
##$CURPLOT= <Network HP LaserJet P1505>
##$CURPRIN= <$Network HP LaserJet P1505>
##$DFORMAT= <normdp>
##$LAYOUT= <+/1D_H.xwp>
##$LFORMAT= <normlp>
##$PFORMAT= <normpl>
##$SURQMSG= 1
$$ End of Bruker specific parameters
$$ ---------------------------------
##NTUPLES= NMR SPECTRUM
##VAR_NAME=  FREQUENCY,     SPECTRUM/REAL,   SPECTRUM/IMAG
##SYMBOL=    X,             R,               I
##VAR_TYPE=  INDEPENDENT,   DEPENDENT,       DEPENDENT
##VAR_FORM=  AFFN,          ASDF,            ASDF
##VAR_DIM=   131072,        131072,          131072
##UNITS=     HZ,            ARBITRARY UNITS, ARBITRARY UNITS
##FACTOR=    0.0627417313425164, 1,          1
##FIRST=     8223.62146879497, 557,          -65321
##LAST=      0,             2335,            -65512
##MIN=       0,             -11947,          0
##MAX=       8223.62146879497, 437164586,    0
$$ Real data points
##PAGE= N=1
##DATA TABLE= (X++(R..R)), XYDATA
$$ [...]
63905A768248j46141j29002j12609r7324q3523p1603o1771n3674m6418l9363l2913
63894H93907k8037k5003k3085k1660k0934k1141k1599k1275k0063j8753j7784
63883F54573j6726j5120j3144j1175r215p123n051l167j236J167M069P138J0124
63870E95114J2947J5438J7426J9030K0553K2031K3135K3564K3338K2703K1994
63859H17273K1513K1157K0275J8324J5654J3105J0767P808L818m02l858o627r378
63846I29429j2143j4445j6426j8795k1637k4111k5634k6606k7608k8602k9264
63835F84158k9555k9481k8764k7285k5454k3735k2101k0389j8811j7632j6700
63824D24251j5748j4844j4035j2975j1526j0306r888r738q853p324o255o081n943
$$ plain form
63905 1768248 1622107 1493105 1380496 1283172 1199649 1128046 1066275 1012601 966183 926820 893907
63894 893907 865870 840867 817782 796122 775188 754047 732448 711173 691110 672357 654573
63883 654573 637847 622727 609583 598408 589193 582070 577019 573852 572616 573783 577852 584990 595114
63870 595114 608061 623499 640925 659955 680508 702539 725674 749238 772576 795279 817273
63859 817273 838786 859943 880218 898542 914196 927301 938068 945876 949694 949292 945434 938807 929429
63846 929429 917286 902841 886415 867620 845983 821872 796238 769632 742024 713422 684158
63835 684158 654603 625122 596358 569073 543619 519884 497783 477394 458583 440951 424251
63824 424251 408503 393659 379624 366649 355123 344817 334929 325191 316338 309014 302759 296678 290735
63811B90735n088l921l191k903k686k663l160l847l929l049j586j93N26J53j146
63796B54052k420k735k187j741j987k539k715k393j960j782j960k367k653k439
63782B22174j709r76q04j170j478j215n40j50n03j208j280k39J216J858J314M15
63766B15705O1J22r5o67r03m42J86L25M9j58k01l46o37q30q62q58p22k37M03O72
63746B10565M88L50N61P99P59O80Q36J012R58R27J256J730K023K360L041L642
63730B31987L454K680K265K600L175L630M231N020N435N228N050N498O192O406
63716B92851O089N637N080M163K939J626J47j547l004l767m106m514m710m021
63702B92863k715j999k369k884k477j320l07K12N77J034J448J698J874K131K599
$$ plain form
63811 290735 285647 281726 278535 275632 272946 270283 267123 263276 259347 256298 254712 254519 255045 255198 254052
63796 254052 251632 248897 246710 244969 242982 240443 237728 235335 233375 231593 229633 227266 224613 222174
63782 222174 220465 219489 218685 217515 216037 214822 214282 214132 213629 212421 211141 210902 212118 213976 215290 215705
63766 215705 215766 215888 215793 215126 214223 213781 213967 214292 214341 214183 213982 213636 212999 212169 211307 210449 209727 209490 209893 210565
63746 210565 211053 211403 211964 212763 213522 214202 215038 216050 217008 217935 219191 220921 222944 225304 228345 231987
63730 231987 235441 238121 240386 242986 246161 249791 254022 259042 264477 269705 274755 280253 286445 292851
63716 292851 298940 304577 309657 313820 316759 318385 318532 316985 313981 310214 306108 301594 296884 292863
63702 292863 290148 288149 285780 282896 280419 279099 278792 279004 279581 280615 282063 283761 285635 287766 290365
63687B90365L314L994M124L574K862K471K188J596R74R79J526J703J017M6m62
63672C20271n33n54m36J71J041J494J284Q94Q21J038J206J095O56l5p61j439k341
63655C23872l718n118n653n161m531m497m574l830k341j173r56j214j256j052
63641B78798r49r22o39J7Q53J684K516L406M282M928N054M606M049M117N047O252
63625C23099P027P378P832Q567R166R365R550J0220J1258J2168J2906J3971J5652
63612D58159J7660J9694K1960K4643K7250K9130L0543L2516L5372L7989L8825
63601G73741L7304L3828K8908K2828J5925Q653J499m831r293j1274j1377j0922
63589H74989j0683j0583j0640j1489j3640j6780k0188k3438k6264k8081k8294
$$ plain form
63687 290365 293679 297673 301797 305371 308233 310704 312892 314488 315462 316441 317967 319670 320687 320733 320271
63672 320271 319738 319184 318748 318919 319960 321454 322738 323632 324453 325491 326697 327792 328448 328413 327652 326213 323872
63655 323872 320154 315036 309383 304222 299691 295194 290620 286790 284449 283276 282320 281106 279850 278798
63641 278798 277849 276927 276288 276305 277158 278842 281358 284764 289046 293974 299028 303634 307683 311800 316847 323099
63625 323099 330126 337504 345336 353903 363069 372434 381984 392204 403462 415630 428536 442507 458159
63612 458159 475819 495513 517473 542116 569366 598496 629039 661555 696927 734916 773741
63601 773741 811045 844873 873781 896609 912534 921187 922686 917855 908562 897288 885911 874989
63589 874989 864306 853723 843083 831594 817954 801174 780986 757548 731284 703203 674909
63578F74909k7083k5390k3961k2585k0522j7571j4463j2092j0468q732o227l207
63566D82608l84J912L701M850N243N326N873P025Q093Q507Q540Q886R843J1212
63552E71235J2710J4269J6119J8723K2356K6697L1079L5306L9815M4828M9516
63541H82653N2154N0905M4661L3848K0665Q013k283j0000j5330j7913j7538j5172
63529A014663j2473j0485r377r269j0533j3278j7080k1447k6114l0730l4618l7092
63517G82167l7975l7626l6564l4993l2751k9747k6444k3662k1778k0361j8667
63506D61599j6415j3910j1624r851q564p544o764o468o635o504n268l315j965
63493C56772j759j836j466j315k235l503l447j675M43J554J685J590J630J791
$$ plain form
63578 674909 647826 622436 598475 575890 555368 537797 523334 511242 500774 492042 485815 482608
63566 482608 482224 484136 487837 492687 497930 503256 509129 516154 524247 532754 541294 550180 560023 571235
63552 571235 583945 598214 614333 633056 655412 682109 713188 748494 788309 833137 882653
63541 882653 934807 985712 1030373 1064221 1084886 1092899 1090616 1080616 1065286 1047373 1029835 1014663
63529 1014663 1002190 991705 982328 973059 962526 949248 932168 910721 884607 853877 819259 782167
63517 782167 744192 706566 670002 635009 602258 572511 546067 522405 500627 480266 461599
63506 461599 445184 431274 419650 409799 401235 393691 386927 380459 373824 367320 362052 358737 356772
63493 356772 355013 353177 351711 350396 348161 344658 341211 339536 339979 341533 343218 344808 346438 348229
63479C48229K197L024M098M977N362N262M881M413L942L424K778J886N77j177
63465C93873k887l825l867l751m156m863n197m944m363l558k483j341m77J18O57
63450C48936J111J332J454J740K160K699L740N526P507Q934R935J1156J2575J3570
63436D32375J4215J5547J8301K2178K6458L0596L3868L5277L4193L0654K4988
63425G18650J7905J1010O171L954L466M046O171J0185J5262K0469K6024L2471
63413H75784L9146M4470M7361M7489M4494L8106K9100J9183R733J200o211j1908
63401A177947j5318j6526j6296j5557j4954j4790j5434j7640k2024k7985l3661
63390I67762l7357l8883l9105l8609l7345l5338l3052l0857k8626k5986k2846
$$ plain form
63479 348229 350426 353450 357548 362525 367887 373149 378030 382443 386385 389809 392587 394473 395050 393873
63465 393873 390986 387161 383294 379543 375387 370524 365327 360383 356020 352462 349979 348638 348161 348279 348936
63450 348936 350047 351379 352833 354573 356733 359432 363172 368698 376205 385139 395074 406230 418805 432375
63436 432375 446590 462137 480438 502616 529074 559670 593538 628815 663008 693662 718650
63425 718650 736555 747565 753736 757690 761156 765202 771373 781558 796820 817289 843313 875784
63413 875784 914930 959400 1006761 1054250 1098744 1136850 1165950 1185133 1194866 1196066 1189855 1177947
63401 1177947 1162629 1146103 1129807 1114250 1099296 1084506 1069072 1051432 1029408 1001423 967762
63390 967762 930405 891522 852417 813808 776463 741125 708073 677216 648590 622604 599758
63379E99758j9515j6449j3783j1257q648o219m282k468m9K922N524P273Q733J0398
63365E51938J1848J2767J3941J6179J8840K0687K1912K3983K7504L1489L4950
63354G86038L7957M0721M2817M3928M4335M3892M1231L5129K6257J6730Q061L79
63342A167475o523j2191j5848j7175j6519j4723j2993j2588j4309j8097k3098
63331A003411k8040l1752l3790l4638l5093l5283l4558l2418k9218k5707k2132
63320F60782j8188j3721q984m375n67J079r00o385j3063j8277k1194k2580k2907
63307E10720k1776j9238j6408j4275j2724j1319j0218r585q801p183n146l760
63295C70287l334l282l223l363l750l972l847l709l759l683l240k776k726k933
$$ plain form
63379 599758 580243 563794 550011 538754 530106 523887 519605 517137 517088 520010 525534 532807 541540 551938
63365 551938 563786 576553 590494 606673 625513 646200 668112 692095 719599 751088 786038
63354 786038 823995 864716 907533 951461 995796 1039688 1080919 1116048 1142305 1159035 1167096 1167475
63342 1167475 1160952 1148761 1132913 1115738 1099219 1084496 1071503 1058915 1044606 1026509 1003411
63331 1003411 975371 943619 909829 875191 840098 804815 770257 737839 708621 682914 660782
63320 660782 642594 628873 619889 615514 614947 616026 615126 608741 595678 577401 556207 533627 510720
63307 510720 488944 469706 453298 439023 426299 414980 404762 395177 386376 379193 374047 370287
63295 370287 366953 363671 360448 357085 353335 349363 345516 341807 338048 334365 331125 328349 325623 322690
63281C22690k870k402j990k114k653k952k523j577p38k61J59P35J187J243J180
63266C07114J391J752J892J799J650J378R89R96J751K553K437J761J993L602N283
63251C38341N755N412N381N836O181O359O864P637Q022P952Q290R681J1744J3775
63237D47230J5637J7523J9272K0581K1677K3145K5061K6749K7654K8003K8340
63226G00872K8709K8679K8058K7153K6279K5456K4706K4300K4536K5473K6919
63215I91140K8431K9283K8811K7029K4484K1385J7301J1978N905m48p393j5288
63203A162618k3325k9908l4216l6733l8264l9077l9066l8086l5946l2639k8674
63192G86684k4791k1158j7405j3446r702o395l197J60L473O468R146J1516J3463
$$ plain form
63281 322690 319820 317418 315428 313314 310661 307709 305186 303609 302871 302610 302769 303504 304691 305934 307114
63266 307114 308505 310257 312149 313948 315598 316976 317965 318961 320712 323265 325702 327463 329456 333058 338341
63251 338341 344096 349508 354889 360725 366906 373265 380129 387766 395788 403740 412030 421711 433455 447230
63237 447230 462867 480390 499662 520243 541920 565065 590126 616875 644529 672532 700872
63226 700872 729581 758260 786318 813471 839750 865206 889912 914212 938748 964221 991140
63215 991140 1019571 1048854 1077665 1104694 1129178 1150563 1167864 1179842 1185747 1185299 1177906 1162618
63203 1162618 1139293 1109385 1075169 1038436 1000172 961095 922029 883943 847997 815358 786684
63192 786684 761893 740735 723330 709884 700182 693787 690590 690750 694223 700691 709837 721353 734816
63179G34816J5102J6709J8162J8993J9155J9154J9183J8870J8190J7756J7712
63168I33802J7200J5651J3765J2351J0779P747L216j555n834j0080j4777j9611
63156I62654k4126k8280l1841l4053l4471l3696l2699l1705l0273k8140k5559
63145F27811k2862k0179j7567j5162j3109j1471j0265r458q937q522q011p161
63133D75107n770l919k095q63l96l22j13M54J243K057K769L268L434L364L363
63118D81581L603L884M001M066M271M507M552M475M402M064L142K042J628K037
63104E32255K426K156J604J412J507J484J402J546J667J192J69o38n87K62J441
63089E49298K450K835K292R66m84j258r35J79J217J570J636K358L869N173N470
$$ plain form
63179 734816 749918 766627 784789 803782 822937 842091 861274 880144 898334 916090 933802
63168 933802 951002 966653 980418 992769 1003548 1011295 1014511 1012956 1007122 997042 982265 962654
63156 962654 938528 910248 878407 844354 809883 776187 743488 711783 681510 653370 627811
63145 627811 604949 584770 567203 552041 538932 527461 517196 507738 498801 490279 482268 475107
63133 475107 469337 465418 463323 462460 462064 461742 461629 462083 463326 465383 468152 471420 474854 478218 481581
63118 481581 485184 489068 493069 497135 501406 505913 510465 514940 519342 523406 526548 528590 530218 532255
63104 532255 534681 536837 538441 539853 541360 542844 544246 545792 547459 548651 548820 548182 547595 547857 549298
63089 549298 551748 554583 556875 557841 557357 556099 555164 555343 556560 558130 559766 562124 565993 571166 576636
63074E76636N236N377N895O143O126O613P966R597J0786J1482J2192J3445J5395
63061F92889J7597J9326K0500K2039K4762K8252L1567L4788L8833M3750M8333
63050A022636N1810N4844N8316O1896O4643O6326O7405O8036O7909O6960O5646
63039A716427O4498O3737O3319O3072O2860O2775O3028O3479O3517O2451N9742
63028B408905N4797M7086L6755K4703J1614k654j8267l4389m9532o2801p4205
63017B342012q3753r0786r4449r4512r1636q6857q0950p4174o6581n8400m9980
63006A469934m1514l3083k4940j7295r896k361N016J1385J6421K0643K4397K7275
62994A445982K8998L0143L1347L2375L2720L2648L2771L2950L2484L1148K9193
$$ plain form
63074 576636 581872 587249 593144 599287 605413 612026 619992 629589 640375 651857 664049 677494 692889
63061 692889 710486 729812 750312 772351 797113 825365 856932 891720 930553 974303 1022636
63050 1022636 1074446 1129290 1187606 1249502 1314145 1380471 1447876 1515912 1583821 1650781 1716427
63039 1716427 1780925 1844662 1907981 1971053 2033913 2096688 2159716 2223195 2286712 2349163 2408905
63028 2408905 2463702 2510788 2547543 2572246 2583860 2581206 2562939 2528550 2479018 2416217 2342012
63017 2342012 2258259 2167473 2073024 1978512 1886876 1800019 1719069 1644895 1578314 1519914 1469934
63006 1469934 1428420 1395337 1370397 1353102 1343206 1340845 1345861 1357246 1373667 1394310 1418707 1445982
62994 1445982 1474980 1505123 1536470 1568845 1601565 1634213 1666984 1699934 1732418 1763566 1792759
62983A792759K6532K2799J8131J2922O859q04r931j9472k8808l8082m6874n3802
62971A682229n8161o1004o3572o5381o4908o1837n7619n3799n0685m7743m4613
62960A052907m1403l8321l5354l2326k9245k6507k4541k3145k1608j9728j8266
62949G42463j7959j8435j8619j8001j6926j5831j4783j3808j3075j2599j2159
62938E70268j1670j1267j0948j0454r607q568p609o880o301n515m109k234q26
62925D74280o84j371j664j128n96q42j517j822j669j559j694j811j738j500j108
62910D53577p22q56j819l011l432k924k311k209k358k338k282k429k514k181j659
62895D20532j419j351r28j29M50M64K56K43L42L45L86O12O69P5r96j756j694j031
$$ plain form
62983 1792759 1819291 1842090 1860221 1873143 1880002 1879198 1869267 1849795 1820987 1782905 1736031 1682229
62971 1682229 1624068 1563064 1499492 1434111 1369203 1307366 1249747 1195948 1145263 1097520 1052907
62960 1052907 1011504 973183 937829 905503 876258 849751 825210 802065 780457 760729 742463
62949 742463 724504 706069 687450 669449 652523 636692 621909 608101 595026 582427 570268
62938 570268 558598 547331 536383 525929 516322 507754 500145 493265 486964 481449 477340 475106 474280
62925 474280 473596 472225 470561 469433 468837 467995 466478 464656 462987 461428 459734 457923 456185 454685 453577
62910 453577 452855 451999 450180 447169 443737 440813 438502 436293 433935 431597 429315 426886 424372 422191 420532
62895 420532 419113 417762 416834 416705 417155 417619 417875 418118 418460 418805 419191 419803 420472 420547 419551 417795 416101 415070
62877D15070k21N53J204J464J190P20M74L74Ko65j119j048p67p36r48j072r81
62860D13494p70m50L2N37Q57J001J046Q01P6p34q62j37P42J132J213J439J682
62843D21099J460P96K52J51K57K41K9l58q79j345j544j527j433j129m71P7j38
62826D15538q78j028o7J245K110K789L724M310L725K570K344L281M042L813L453
62811D50971L904M618M563L992M029M940N959O686P526Q654R559R966J0360J1185
62797E46912J2175J2955J3686J4653J5638J6336J7016J8181J9811K1541K3508
62786G32412K6445L0808L6230M1879M7127N1901N6758O2641P0103P8583Q6789
62775A321676R3914J00213J06144J11333J14693J15381J13212J08157R9868Q7994
$$ plain form
62877 415070 414849 415402 416606 418070 419260 419980 420454 420828 420830 420165 419046 417998 417231 416495 415547 414475 413494
62860 413494 412724 412274 412306 412843 413700 414701 415747 416548 416624 415890 415028 414891 415633 416765 417978 419417 421099
62843 421099 422559 423355 423607 423758 424015 424256 424285 423927 423048 421703 420159 418632 417199 416070 415599 415676 415538
62826 415538 414660 413632 413565 414810 416920 419709 423433 427743 431468 434038 436382 439663 443705 447518 450971
62811 450971 454875 459493 464056 468048 472077 477017 482976 489662 497188 505842 515401 525367 535727 546912
62797 546912 559087 572042 585728 600381 616019 632355 649371 667552 687363 708904 732412
62786 732412 758857 789665 825895 867774 914901 966802 1023560 1086201 1156304 1234887 1321676
62775 1321676 1415590 1515803 1621947 1733280 1847973 1963354 2076566 2184723 2284591 2372585
62765B372585P2822N5310L6387J6496m066k4450m3342n9836p3948q5954r5541
62754B166463j02018j05330j06273j05619j03486r9802r4990q9715q4231p8416
62744A196583p2364o6488o0992n5659n0306m5146m0498l6341l2428k8671k5269
62733F82421k2469k0360j8811j7464j5810j3511j0770q283o660n872n323m468
62721E32620l257j985q68R6R69J826K878M368O200P878R004R764J0756J2414J4778
62706F07441J7672K0856K4080K7287L0723L4631L8762M2609M6151N0017N4632
62695I94861N9573O4094O8009P1619P4825P6935P7315P5824P2355O6458N7799
62684A759667M6759L4178K0599O171q700k3063l5966m7078n6573o4568p0892p5338
$$ plain form
62765 2372585 2445407 2500717 2537104 2553600 2549534 2525084 2481742 2421906 2347958 2262004 2166463
62754 2166463 2064445 1959115 1852842 1747223 1643737 1543935 1448945 1359230 1274999 1196583
62744 1196583 1124219 1057731 996739 941080 890774 845628 805130 768789 736361 707690 682421
62733 682421 659952 639592 620781 603317 587507 573996 563226 554943 548283 542411 537088 532620
62721 532620 529363 527378 526510 526606 527575 529401 532279 536647 542847 550725 559729 569493 580249 592663 607441
62706 607441 625113 645969 670049 697336 728059 762690 801452 844061 890212 940229 994861
62695 994861 1054434 1118528 1186537 1258156 1332981 1409916 1487231 1563055 1635410 1701868 1759667
62684 1759667 1806426 1840604 1861203 1867374 1858674 1835611 1799645 1752567 1695994 1631426 1560534 1485196
62672A485196p7852p8460p7206p4334p0422o6159o1896n7510n2792m7895m3246
62661G77424l9073l5201l1403k7756k4512k1769j9514j7749j6352j4871j2972
62650E16252j1042r945r939j0263j0066r322q507p718o718n621m811m224l356
62637D14720k119j096o18k13N86J383J396N90k65o73r21j453k108k319j817r13
62621D04160r2M73R25J340J502J249R41J231K336L784N015N900O494O746O785
62606D48789P158Q221R543J0491J1264J2665J4919J7393J9654K2066K5035K8296
62594F35494L1457L4738L8641M3096M7517N1470N4786N7083N7668N6039N2196
62583A160185M6497L9387L1238K2202J2306J869q400j7932k6716l4756m1432m5940
$$ plain form
62672 1485196 1407344 1328884 1251678 1177344 1106922 1040763 978867 921357 868565 820670 777424
62661 777424 738351 703150 671747 643991 619479 597710 578196 560447 544095 529224 516252
62650 516252 505210 495265 485326 475063 464997 455675 447168 439450 432732 427111 422300 418076 414720
62637 414720 412601 411505 410887 410674 411260 412643 414039 414629 414364 413691 412770 411317 409209 406890 405073 404160
62621 404160 404068 404541 405466 406806 408308 409557 410498 411729 414065 417849 422864 428764 435258 442004 448789
62606 448789 455947 464168 473711 484202 495466 508131 523050 540443 560097 582163 607198 635494
62594 635494 666951 701689 740330 783426 830943 882413 937199 994282 1051950 1107989 1160185
62583 1160185 1206682 1246069 1277307 1299509 1311815 1313684 1305284 1287352 1260636 1225880 1184448 1138508
62571A138508m8327m9472m9957m9530m7974m5832m3861m2073l9799l6593l2698
62560F52392k8760k5343k2685k0608j8631j6360j3801j1296r234p954p620p928
62548D62172q065p312n705l935k597j757j237r92j016j057p43JP84J164J133J064
62532D31902J117R78L78l18l39O08K034L340M485N842P573R487J1310J2918J4429
62517E05744J6229J8781K2137K5732K8921L1597L4122L6733L9334M1730M3746
62506H44806M5083M5365M4312M1835L8029L3219K7784K1751J4811P064n95p254
62494A156210j2857j7703k1368k3009k2659k1255j9184j5842j1025n784j125L414
62482I87813Q871J4978K0269K4019K7140L0858L5097L8459L9412L7338L2702K6489
$$ plain form
62571 1138508 1090181 1040709 990752 941222 893248 847416 803555 761482 721683 685090 652392
62560 652392 623632 598289 575604 554996 536365 520005 506204 494908 485674 477720 470100 462172
62548 462172 454107 446795 441090 437155 434558 432801 431564 430572 429556 428499 427756 427757 428541 429705 430838 431902
62532 431902 433019 433997 434375 434057 433718 434326 436360 439700 444185 450027 457600 467087 478397 491315 505744
62517 505744 521973 540754 562891 588623 617544 649141 683263 719996 759330 801060 844806
62506 844806 889889 935254 979566 1021401 1059430 1092649 1120433 1142184 1156995 1164059 1163464 1156210
62494 1156210 1143353 1125650 1104282 1081273 1058614 1037359 1018175 1002333 991308 985524 984399 987813
62482 987813 996684 1011662 1031931 1055950 1083090 1113948 1149045 1187504 1226916 1264254 1296956 1323445
62470A323445J9413J1715L600m542j2591k0936k9759l8319m5440n0569n3922n5800
62458A046295n6389n6006n4927n2887m9470m4965m0296l5989l1830k7610k3571
62447E72355j9904j6388j2885r713p296n712m732l899k617p07J024J512Q79N20
62433D92437J388K926L990M052L090J103j475l560m484m881n702o808p411p542
62419D67123p949q626q566p278n602m618m358m163l775l524l612l729l474k940
62405C94909k653k864l055k500j307m73n93r49l89J137K522K857K305J686J607
62390C92240K087K643K707K205J668J597J935K370K798L078K858K238K171L415
62376D26010N344O761P577Q647J0038J0788J0573J0297J0572J0828J0699J1142
$$ plain form
62470 1323445 1342858 1354573 1358173 1353631 1341040 1320104 1290345 1252026 1206586 1156017 1102095 1046295
62458 1046295 989906 933900 878973 826086 776616 731651 691355 655366 623536 595926 572355
62447 572355 552451 536063 523178 513465 506169 500457 495725 491826 489209 488502 489526 491038 491917 492437
62433 492437 493825 496751 500741 504793 507883 508986 507511 503951 499467 494586 488884 482076 474665 467123
62419 467123 459174 450548 441982 434704 429102 424484 420126 415963 412188 408664 405052 401323 397849 394909
62405 394909 392256 389392 386337 383837 382530 382057 381464 380515 380126 381263 383785 386642 388947 390633 392240
62390 392240 394327 396970 399677 401882 403550 405147 407082 409452 412250 415328 418186 420424 422595 426010
62376 426010 431354 438115 445692 454339 464377 475165 485738 496035 506607 517435 528134 539276
62364E39276J3106J5892J8097J9694K1987K5626K9880L3941L8050M2886M8583
62353H47018N4674O0576O5680O9243P0474O8851O4286N7104M7861L7221K5984
62342A468972J5080N148l921j2604k0823k7864l3438l8215m2854m6995m9736n0766
62330A161984n0389m8763m5892m2186l8289l4355l0292k6637k4336k3471k2914
62319G74460k1708k0114j8963j8470j8301j8247j8303j8263j7863j7186j6429
62308E70613j5441j3942j2214j0977j0438r929q735o914n065l579k540k045k162
62295D66632k540k559j959j027j05P37J395J635J592J926K986M090M319L797L506
62280D84425L861M278M288M249M541M763M369L635L313L668M417N415O677P898
$$ plain form
62364 539276 552382 568274 586371 606065 628052 653678 683558 717499 755549 798435 847018
62353 847018 901692 962268 1027948 1097191 1167665 1236516 1300802 1357906 1405767 1442988 1468972
62342 1468972 1484052 1489200 1485279 1472675 1451852 1423988 1390550 1352335 1309481 1262486 1212750 1161984
62330 1161984 1111595 1062832 1016940 974754 936465 902110 871818 845181 820845 797374 774460
62319 774460 752752 732638 713675 695205 676904 658657 640354 622091 604228 587042 570613
62308 570613 555172 541230 529016 518039 507601 497672 488937 482023 476958 473379 470839 468794 466632
62295 466632 464092 461533 459574 458547 458442 459179 460574 462209 463801 465727 468713 472803 477122 480919 484425
62280 484425 488286 492564 496852 501101 505642 510405 514774 518409 521722 525390 529807 535222 541899 549797
62266E49797Q663R194J0264J2198J4522J6744J9016K1775K5193K9291L4273M0272
62254G91202M6946N3605N9736O5137O9562P2438P2943P0402O4631N6041M5429
62243A468072L3674K1637J0151j53r210j7524k5684l3849m1721m8896n5077n9941
62231A241479o3031o4032o3155o1074n8290n4712n0060m4615l9170l4207k9509
62220F79624k4772k0273j6579j3828j1642r635p655n612l481j461J03J100J758
62207E67647K343K926L418L647L357K393R76k79p41k21R25K034K566K398J776
62192E95165R97L14M7M61J410K326K829L139L693M601N719P010Q431R567R830
62177F55539R042P578N918M399L331L013L492M572O167Q515J1907J6316K1340
$$ plain form
62266 549797 558460 567654 577918 590116 604638 621382 640398 662173 687366 716657 750930 791202
62254 791202 838148 891753 951489 1016626 1086188 1158626 1231569 1301971 1366602 1422643 1468072
62243 1468072 1501746 1523383 1533534 1533381 1524171 1506647 1480963 1447114 1405393 1356497 1301420 1241479
62231 1241479 1178448 1114416 1051261 990187 931897 877185 827125 782510 743340 709133 679624
62220 679624 654852 634579 618000 604172 592530 582895 575240 569628 566147 564686 564789 565889 567647
62207 567647 569990 572916 576334 579981 583338 585731 586707 586428 585687 585466 586391 588425 590991 593389 595165
62192 595165 596162 596476 596523 596984 598394 600720 603549 606688 610381 614982 620701 627711 636142 645709 655539
62177 655539 664581 672159 678077 682476 685807 688820 692312 696884 703051 711566 723473 739789 761129
62164G61129K6491L1575L6751M2045M6864N0246N1692N1404M9559M5799L9778
62153A233333L1863K2904J3610M615l328r810j5342k0786k6312l1388l5661l9197
62141A124501m1922m3447m3500m2081l9188l5003l0241k5716k1575j7577j4039
62130G70212j1616j0026q012n049k264j042j257j471n41J521L913N840P135Q429
62116G55772J0366J2508J3370J1898Q507M479Q63j706k798k542j802j449j724
62103H05742k576m159o366q381r425r615r456q774o981m221j432P50K425L784
62089G41315M756N404O085O881P437P545P526P843Q608R608J0513J1102J1566
62076H46189J2572J4637J7437K0094K2083K3407K4036K3812K3016K2371K2236
$$ plain form
62164 761129 787620 819195 855946 897991 944855 995101 1046793 1098197 1147756 1193555 1233333
62153 1233333 1265196 1288100 1301710 1306325 1302997 1293187 1277845 1257059 1230747 1199359 1163698 1124501
62141 1124501 1082579 1039132 995632 953551 914363 879360 849119 823403 801828 784251 770212
62130 770212 758596 748570 740558 735509 733245 732203 730946 729475 728934 730455 734368 740208 747343 755772
62116 755772 766138 778646 792016 803914 812421 816900 817763 816057 813259 810717 808915 807466 805742
62103 805742 803166 799007 792641 784260 774835 765220 755764 746990 740009 735788 734356 735106 737531 741315
62089 741315 746071 751475 757560 764441 771878 779423 786949 794792 803400 813008 823521 834623 846189
62076 846189 858761 873398 890835 910929 933012 956419 980455 1004267 1027283 1049654 1071890
62065A071890K2352K2651K3705K5969K8990L1840L4047L5628L6397L5751L3120
62054A402340K8397K1988J4706P408N10o085j2416j8030k2550k6436l0741l5959
62042A323132m1404m5886m8796n0430n1317n1473n0384m7787m4243m0732l7631
62031H13049l4504l1051k7796k5360k3391k0933j7877j5259j3845j3112j2164
62020E77757j1080j0537j0487j0094r016p906p380p260p201p334p726p779o840
62007D67117n105l270j607q7R23R67M66M94J509L001M468N883O937O884N666M383
61991D98629L930L787K912J308j62j135k049l225m468n609o691p489p548o865
61977D65325o049n585n384n199n034m911m598l873k866j995j645j955k707l355
$$ plain form
62065 1071890 1094242 1116893 1140598 1166567 1195557 1227397 1261444 1297072 1333469 1369220 1402340
62054 1402340 1430737 1452725 1467431 1474839 1475349 1469264 1456848 1438818 1416268 1389832 1359091 1323132
62042 1323132 1281728 1235842 1187046 1136616 1085299 1033826 983442 935655 891412 850680 813049
62031 813049 778545 747494 719698 694338 670947 650014 632137 616878 603033 589921 577757
62020 577757 566677 556140 545653 535559 526543 518637 511257 503997 496796 489462 481736 473957 467117
62007 467117 462012 458742 457135 457048 457971 458938 459404 459898 461407 464408 468876 474759 481696 488580 494246 498629
61991 498629 502559 506346 509258 510566 510404 509269 507220 503995 499527 493918 487227 479738 472190 465325
61977 465325 459276 453691 448307 443108 438074 433163 428565 424692 421826 419831 418186 416231 413524 410169
61963D10169l346k567j385l37J75N4l11k42N70J636K189K015J518J176J298K095
61947D14707L385M413M600M478N173O882Q603R609J0388J1732J3566J5318J6858
61934E29712J8310J9290J9201J8143J6847J5675J4392J3039J2170J1850J1100
61923F99729Q998N969L219J088j268m311p139q651r096r621j0414j0329q540n740
61909F43894l131q86J657M710P791J0534J2918J4607J4919J3713J1747R753P657
61896G49883M990J732j693m926p768j0008j1561j2709j3795j4661j4689j3541
61884F51254j1708j0191r605r657r603r189q885r107r569r777r837j0203j0730
61871E23193j0625r501p839o184m533k830j495q55m56L97J638K653L402M601O684
$$ plain form
61963 410169 406823 404256 402871 402534 402709 402763 402452 402210 402780 404416 406605 408620 410138 411314 412612 414707
61947 414707 418092 422505 427105 431583 436756 443638 452241 461850 472238 483970 497536 512854 529712
61934 529712 548022 567312 586513 604656 621503 637178 651570 664609 676779 688629 699729
61923 699729 708727 714696 717915 719003 717735 713424 706285 697634 688538 678917 668503 658174 649634 643894
61909 643894 640763 639877 641534 646244 654035 664569 677487 692094 707013 720726 732473 742226 749883
61896 749883 754873 756605 754912 749986 742218 732210 720649 707940 694145 679484 664795 651254
61884 651254 639546 629355 619750 610093 600490 591301 582416 573309 563740 553963 544126 533923 523193
61871 523193 512568 503067 495228 489044 484511 481681 480186 479331 478875 479272 480910 483563 486965 491566 498250
61856D98250R070J0857J1847J2687J4136J6539J9748K3295K6553K9042L0730L1960
61844G34714L2931L3352L2694L0814K8076K4798K0832J5914J0265M543p34n405
61832I62794r364j2356j4150j4674j3916j1930r055n819k543Q04M221P451J0154
61819H91617J2079J2948J2377J0179O500J657m016j0046j5825k0898k5073k8182
61807H43317k9992l0533l0199k9360k8058k6287k4228k2082j9866j7644j5740
61796E69328j4471j3741j3081j2032j0495q861p742p271o776n552l964l157l532
61783D58653m153m015l253k555k015j296n59l51o46q16n54k08p0J20O55J305J523
61766D41765J100L93O2M73J365K135K558K998L742M499M809M684M432M160L859
$$ plain form
61856 498250 507320 518177 530024 542711 556847 573386 593134 616429 642982 672024 702754 734714
61844 734714 767645 800997 833691 864505 892581 917379 938211 954125 964390 968933 968199 962794
61832 962794 953430 941074 926924 912250 898334 886404 877349 871530 868987 869791 874012 881463 891617
61819 891617 903696 916644 929021 939200 945700 947357 943341 933295 917470 896572 871499 843317
61807 843317 813325 782792 752593 723233 695175 668888 644660 622578 602712 585068 569328
61796 569328 554857 541116 528035 516003 505508 496647 488905 481634 474858 469306 465342 462185 458653
61783 458653 454500 450485 447232 444677 442662 441366 440807 440456 439810 438994 438440 438232 438162 438282 438937 440242 441765
61766 441765 442865 443258 443320 443793 445158 447293 449851 452849 456591 461090 465899 470583 475015 479175 483034
61751D83034L682L644L321K418J381P85L28p54k348l457l611l423l510l635l400
61736D74455l016k849k747k360j782j336j014n87o1M16Q61J343J708J790J748
61721D66569J857K125K388K621K892L127L194L032K609J888J083O12N71N17Q4
61706D95169n01q81j211j873k782l495l870m110m217l979l488l181l227l343l273
61691D51738l069k826k601k635l110l546l059j589l24l75j406k094j770r44m46
61676D21944o21j307k010k030j042K43N85l01j290j280n72k98p97j348j365j118
61660D07393j038j015p15k56r4m03q32q42j33J045J955J983J368J015J379J857
61644D12667J654R78Q06J580K705L347L285K796K129J373O50J34j06j81k85n89
$$ plain form
61751 483034 486716 490360 493681 496099 497480 498265 498593 497839 495491 492034 488423 485000 481490 477855 474455
61736 474455 471439 468590 465843 463483 461701 460365 459351 458764 458703 459119 459980 461323 463031 464821 466569
61721 466569 468426 470551 472939 475560 478452 481579 484773 487805 490414 492302 493385 493997 494568 495085 495169
61706 495169 494668 493787 492576 490703 487921 484426 480556 476446 472229 468250 464762 461581 458354 455011 451738
61691 451738 448669 445843 443242 440607 437497 433951 430892 429303 428979 428604 427198 425104 423334 422390 421944
61676 421944 421323 420016 418006 415976 414934 415177 415762 415461 414171 412891 412319 412021 411224 409876 408511 407393
61660 407393 406355 405340 404625 404369 404275 403872 403040 402198 402065 403110 405065 407048 408416 409431 410810 412667
61644 412667 414321 415299 416105 417685 420390 423737 427022 429818 431947 433320 433970 434104 433998 433817 433532 432943
61628D32943j064j465j651j835k383l258l913l784k825j503m41j9j96o29j044
61613D06933j420j723j768j593j729k633l856m439m176l891m235m819m989m934
61599C60728n298n983o099n211l987l372l501l773l712l398l128k961k695k202
61585C05408j605j111p41l40J09L23J8p35j490j821j675j318j043r35r36j061
61569B91047j370j732j773j274m99R7L87N19M76N5o22j025q54l74K9L37O95J030
61551B85149J253J501J828J908J475Q85P43J045J167P20j5o03q90q56m15M04J332
61534B96631K083K510K503K039J409J016Q61N36j17p09q71p82q17r96j123j192
61518C02981j295j346j235j079r44n66J67P30M99k15m29J57O94L75n07j024p77
$$ plain form
61628 432943 431879 430414 428763 426928 424545 421287 417374 413590 410765 409262 408821 408802 408606 407977 406933
61613 406933 405513 403790 402022 400429 398700 396067 392211 387772 383596 379705 375470 370651 365662 360728
61599 360728 355430 349447 343348 338137 334150 330778 327277 323504 319792 316394 313266 310305 307610 305408
61585 305408 303803 302692 301951 301611 301720 302043 302061 301326 299836 298015 296340 295022 293979 293044 292108 291047
61569 291047 289677 287945 286172 284898 284399 284496 284883 285402 285878 285933 285311 284286 283432 283058 283087 283424 284119 285149
61551 285149 286402 287903 289731 291639 293114 293999 294742 295787 296954 297674 297659 297056 296166 295310 294895 295299 296631
61534 296631 298714 301224 303727 305766 307175 308191 309052 309588 309471 308762 307891 307109 306292 305296 304173 302981
61518 302981 301686 300340 299105 298026 297082 296516 296683 297413 297912 297697 297268 297425 298119 298494 297987 296963 296186
61501B96186j06N05P66N74P9l38m73n21n99l67M26J231J219M27k77m03l92p02
61483B97235j029q22j28N72J022J232J112O21J88M43J414K357K509J865J077P61
61467C10429R56J163Q95K64j87j85p3k61n83n65j83Q0m5k49j19K75N29M07O8j73
61447C12443j48J11M77Q53J157J329J367J336J276J143J010J171J777K500K903
61432C30705L082L458L866L616K625J777J647J532N68q36j466r58L1R89J927K649
61416C55212K746K398K289K492K379J857J692K178K480J871P57j95j075k082k618
61401C72381j999o89K08K91q5p80j894k970l158k250r31L1K66l25j381j889j093
61384C53733L17Q27O9p28m92L64Q74R36J043J231J115O83L20J46L4K10J099K444
$$ plain form
61501 296186 296080 296585 297351 297925 298004 297666 297193 296672 296073 295706 296132 297363 298582 299009 298732 298329 297937 297235
61483 297235 296206 295384 295256 295828 296850 298082 299194 299815 300003 300446 301860 304217 306726 308591 309668 310429
61467 310429 311385 312548 313443 313707 313520 313335 313262 313001 312418 311853 311670 311750 311705 311456 311337 311612 312141 312548 312616 312443
61447 312443 312295 312406 312883 313736 314893 316222 317589 318925 320201 321344 322354 323525 325302 327802 330705
61432 330705 333787 337245 341111 344727 347352 349129 350776 352308 352876 352040 350574 349616 349647 350636 352563 355212
61416 355212 357958 360356 362645 365137 367516 369373 371065 373243 375723 377594 378351 378156 377081 374999 372381
61401 372381 370382 369693 369901 370192 370107 369327 367433 364463 361305 359055 358124 358155 358421 358096 356715 354826 353733
61384 353733 354050 354877 354946 354218 353726 354090 354964 355900 356943 358174 359289 359972 360292 360438 360472 360682 361781 364225
61366C64225L267L009K239J779J541Q70j70o11P8J197J764J826K114K765L239
61351C89132L448M107N621P409Q726R472R668Q832O764M446L263L414L902M017
61337D72221L986M112M160L882L503L279L027K455J597O80j80r23j469j847k194
61322D96289k492k595k505k358k084j472n59L45J131J977K922L769M446N109N824
61307E07747O590P655R298J1165J2434J2789J2679J2375J1440R502O968M503K254
61294F27399O1j992l714n228o672p847q565r081r680j0085r835r067q366p940
61280E29388p426o573n568m704m006l274k218n90J429L075L590L069K422K409
61266E11023K889L106K568J604J134J812L391N036O272P377Q709R936J0267R312
$$ plain form
61366 364225 367492 370501 372740 374519 376060 376930 376760 376149 376227 377424 379188 381014 383128 385893 389132
61351 389132 392580 396687 402308 409717 418443 427915 437583 446415 453179 457625 460888 464302 468204 472221
61337 472221 476207 480319 484479 488361 491864 495143 498170 500625 502222 502902 502722 501799 500330 498483 496289
61322 496289 493797 491202 488697 486339 484255 482783 482224 482569 483700 485677 488599 492368 496814 501923 507747
61307 507747 514337 521992 531290 542455 554889 567678 580357 592732 604172 613674 620642 625145 627399
61294 627399 627460 625468 621754 616526 609854 602007 593442 584361 574681 564596 554761 545694 537328 529388
61280 529388 521962 515389 509821 505117 501111 497837 495619 495029 496458 499533 503123 506192 508614 511023
61266 511023 513912 517018 519586 521190 522324 524136 527527 532563 538835 546212 554921 564857 575124 584436
61252E84436P497N734M696M303L845K911K113K327L179L057J171j144j955j181
61238F20989n36j197k469k990k475j782j732k300k823k788k322j840j299j43J711
61223E96004L264L470K611K002K342L037L336L348L618M209M743N013N151N224
61209F47372N022M306L140J888R30L12j12k78J21J048J922K340K750L929N984
61194F80674Q337J0566J2646J4434J5529J5678J4861J2967J0031O714L957K054
61182H08448O99j30j39K98J09j090k490l393m138n124n733n291m433m462n558
61167G67573o714p292p701q428r325j0108j0863j1635j2088j1953j1465j1040
61155F48961j0723j0165r031p327n468l993k941j715J14J961K720K099Q33n45
$$ plain form
61252 584436 591933 597667 602363 606666 610511 613422 615535 617862 621041 624098 625269 624125 622170 620989
61238 620989 620453 619256 616787 613797 611322 609540 607808 605508 602685 599897 597575 595735 594436 594293 596004
61223 596004 599268 602738 605349 607351 609693 612730 616066 619414 623032 627241 631984 636997 642148 647372
61209 647372 652394 656700 659840 661728 662658 662970 662858 662580 662701 663749 665671 668011 670761 674690 680674
61194 680674 689011 699577 712223 726657 742186 757864 772725 785692 795723 802437 806394 808448
61182 808448 809147 809017 808878 809176 809285 808195 805705 802312 798174 793050 787317 782026 777593 773131 767573
61167 767573 760859 753567 745866 737438 728113 718005 707142 695507 683419 671466 660001 648961
61155 648961 638238 628073 619042 611715 606247 602254 599313 597598 597712 599673 602393 604492 605325 604780
61141F04780k402n012p550q785q507p552o519n284l860k892k814l011k444q80
61127E37268J065K917M711O387P480P891Q338R519J1139J2321J2876J3551J5013
61114F50476J7073J9108K0747K1976K2877K3505K3820K3635K2839K1734K0772
61103H88562J9902J8636J6870J5111J3538J1451Q138L937k06l951p648j1334j4374
61090I58632j6321j7513j8537j9560k0453k1202k1816k2073k1702k0776j9651
61079G39028j8578j7554j6516j5416j4143j2627j1027r702q813q126p275o144
61067E93107m923l846l023k391j702o16Q74K202K776K800L124M121N239N929O486
61052F10157P454Q663R592J0352J1450J2698J3383J3547J4242J6063J8334K0125
$$ plain form
61141 604780 602378 597366 589816 581031 572524 564972 558453 553169 549309 546417 543603 540592 538148 537268
61127 537268 538333 541250 545961 552348 559828 567719 576057 585576 596715 609036 621912 635463 650476
61114 650476 667549 686657 707404 729380 752257 775762 799582 823217 846056 867790 888562
61103 888562 908464 927100 943970 959081 972619 984070 992208 996145 995939 991988 984340 973006 958632
61090 958632 942311 924798 906261 886701 866248 845046 823230 801157 779455 758679 739028
61079 739028 720450 702896 686380 670964 656821 644194 633167 623465 614652 606526 599251 593107
61067 593107 588184 584338 581315 578924 577222 576606 577480 579682 582458 585258 588382 592503 597742 603671 610157
61052 610157 617611 626274 635866 646218 657668 670366 683749 697296 711538 727601 745935 766060
61040G66060K1353K2423K3494K4748K6710K9515L2308L4121L5045L5944L7292
61029A089013L9001M1065M3572M6177M8157M9083M9090M8702M8817N0481N4153
61018A607311N9389O5692P3157Q1811R0847R9494J08155J18023J30081J45640
61008B579600J67288J97863K38659K89982L53230M31046N26075O42422P89331
60999F215496R81217J231399J542306J892906K222849K426595K383089K025295
60991B0921152J404992O90281Q4573k70894l38784j65105J51969M71686O27156
60982B3577026M85352K5699o35129j306301j824825k117688k195641k111974j928249
60973A1968270j698089j460288j237008j037876q65965p20423n97332m92666m05150
$$ plain form
61040 766060 787413 809836 833330 858078 884788 914303 946611 980732 1015777 1051721 1089013
61029 1089013 1128014 1169079 1212651 1258828 1306985 1356068 1405158 1453860 1502677 1553158 1607311
61018 1607311 1666700 1732392 1805549 1887360 1978207 2077701 2185856 2303879 2433960 2579600
61008 2579600 2746888 2944751 3183410 3473392 3826622 4257668 4783743 5426165 6215496
60999 6215496 7196713 8428112 9970418 11863324 14086173 16512768 18895857 20921152
60991 20921152 22326144 23016425 23100998 22830104 22491320 22326215 22478184 22949870 23577026
60982 23577026 24062378 24088077 23452948 22146647 20321822 18204134 16008493 13896519 11968270
60973 11968270 10270181 8809893 7572885 6535009 5669044 4948621 4351289 3858623 3453473
60964C453473l34836k79693k35774k00306j72464j51144j34025j19260j06355
60955A719616r4976q4207p3558o3407n3991m5083l7145l1548k8966k8372k8181
60944A150182k7700k6856k5442k3310k0801j8364j6176j4514j3904j4324j4840
60933I33951j4600j3787j3036j2366j1341r957q627p432o025m296k615j305k78
60920H28286P31J865L230N024P320R770J1772J3077J4191J5839J7964J9578J9932
60907I68579J9527J9489K0217K1101K1489K1160J9809J6917J2554P789L773O39
60895A153043k285n483q841j2017j4827j7247j9269k0785k1638k1887k2008k2546
60883I64210k3507k4334k4561k4228k3604k2838k2010k1191k0310j9168j7692
$$ plain form
60964 3453473 3118637 2838944 2603170 2402864 2230400 2079256 1945231 1825971 1719616
60955 1719616 1624640 1540433 1466875 1403468 1349477 1304394 1267249 1235701 1206735 1178363 1150182
60944 1150182 1122482 1095626 1070184 1046874 1026073 1007709 991533 977019 963115 948791 933951
60933 933951 919351 905564 892528 880162 868821 858864 850237 842805 836780 832484 829869 828564 828286
60920 828286 829017 830882 834112 839136 846456 856226 867998 881075 895266 911105 929069 948647 968579
60907 968579 988106 1007595 1027812 1048913 1070402 1091562 1111371 1128288 1140842 1148631 1152404 1153043
60895 1153043 1150758 1145275 1136434 1124417 1109590 1092343 1073074 1052289 1030651 1008764 986756 964210
60883 964210 940703 916369 891808 867580 843976 821138 799128 777937 757627 738459 720767
60872G20767j5956j4005j1999j0486r957j0075r868q913p802p144o790o358n957
60859E95457n822n688n190m566m403m855n599o364o987p168o720n995n567n482
60845E15051n304m820m307m063m053m155m356m688n199n946o857p633p989p866
60831D37815p247o036m426l082k517k405k017j225n96n11o21l17O37J966L063
60816D12481L336K714J836J416J484J570J471J415J477J398J090Q51Q71R43Q42
60801D35195O18L87J43p6j89l66q97j602j873j505j090j216j746k238k674l237
60785D17634l698l683l338l132l092k868k588k904l939m845m827m159l653l546
60771C67362l449l173k918k676k120j256n43j36M69J565K473K308J273N26P95
$$ plain form
60872 720767 704811 690806 678807 668321 658364 648289 638421 629508 621706 614562 607772 601414 595457
60859 595457 589635 583947 578757 574191 569788 564933 559334 552970 545983 538815 532095 526100 520533 515051
60845 515051 509747 504927 500620 496557 492504 488349 483993 479305 474106 468160 461303 453670 445681 437815
60831 437815 430568 424532 420106 417024 414507 412102 410085 408860 408264 407753 407132 406815 407452 409418 412481
60816 412481 415817 418531 420367 421783 423267 424837 426308 427723 429200 430598 431688 432539 433410 434353 435195
60801 435195 435813 436200 436343 436267 436078 435712 434815 433213 431340 429835 428745 427529 425783 423545 420871 417634
60785 417634 413936 410253 406915 403783 400691 397823 395235 392331 388392 383547 378720 374561 370908 367362
60771 367362 363913 360740 357822 355146 353026 351770 351227 351091 351560 353125 355598 357906 359179 359705 360500
60756C60500J705K499K885K883K479J841J491J824K535K961K885K784L226M241
60742C96739N267N615M987L586J778k69k460m480n915o677o928o696n957n110
60728C73480m778m954m909m244l522l454l958m380m251l478k237j160j060j945
60714C25150k765k715k257k172k198j595o10k09n29p74o02m58l83K15J250J590
60698C10938O51n74q55l13J00P6J02M78J021J556K057K361K214J617R02O07J213
60681C24151K687M171M699M345M122M569N137N321N506O067O473O106N353M986
60667C93693M868M227K946J651P12Pm56n87p74j520k527k961k676k313k196k004
60651C90090j684j699k060k025j228l20L0K1P7K3m53j057j390j758k700l932m600
$$ plain form
60756 360500 362205 364704 367589 370472 372951 374792 376283 378107 380642 383603 386488 389272 392498 396739
60742 396739 402006 407621 412608 416194 417972 417703 415243 410763 404848 398171 391243 384547 378590 373480
60728 373480 368702 363748 358839 354595 351073 347619 343661 339281 335030 331552 329315 328155 327095 325150
60714 325150 322385 319670 317413 315241 313043 311448 310838 310629 310100 309326 308724 308266 307883 308098 309348 310938
60698 310938 311589 311015 310160 309847 309947 310023 310125 310603 311624 313180 315237 317598 319812 321429 322331 322938 324151
60681 324151 326838 331009 335708 340053 344175 348744 353881 359202 364708 370775 377248 383354 388707 393693
60667 393693 398561 402788 405734 407385 408097 408104 407648 407061 406287 404767 402240 399279 396603 394290 392094 390090
60651 390090 388406 386707 384647 382622 381394 381074 381104 381125 381202 381225 380772 379715 378325 376567 373867 369935 365335
60634C65335m474m157m047l831l222k557k259k092j550p53m79j061j664j067Q14
60619C32936K571K778J558K82j28j5n6j51K59J108J564J038q8q64o84K12J048
60602C43368J226Q69O01P77J087J002N17J50L29R89J792K465K864K912K631K146
60586C65725J542P49k76j271j716j313m20J62K3l91k80N05J315J603J686K296
60570C69939L630N189O477P507Q453R222R655R958J0589J1584J2237J1658R604
60557D85702O674L681R46j663m115n927o589o186n339m532l619k128K0K234L761
60542D62920M476M997O049P787R840J1875J3855J5747J7245J7948J7618J6156
60530F06513J3499R773N524J500j818m378o319p709q519q656q079p053o234o142
$$ plain form
60634 365335 360861 356704 352657 348826 345604 343047 340788 338696 337146 336393 335914 334853 333189 332122 332936
60619 332936 335507 338285 339843 340125 339997 339982 339926 339775 340034 341142 342706 343744 343656 342792 342108 342320 343368
60602 343368 344594 345463 346064 346841 347928 348930 349447 349597 349926 350915 352707 355172 358036 360948 363579 365725
60586 365725 367267 368016 367740 366469 364753 363440 363020 363182 363205 362814 362534 363039 364354 365957 367643 369939
60570 369939 373569 378758 385235 392742 401195 410417 420072 430030 440619 452203 464440 476098 485702
60557 485702 492376 496057 497003 495340 491225 485298 478709 472523 467184 462652 459033 456905 456925 459159 462920
60542 462920 467396 472393 478442 486229 496069 507944 521799 537546 554791 572739 590357 606513
60530 606513 620012 629785 635309 636809 634991 630613 624294 616585 608066 599410 591331 584278 578044 571902
60516E71902o499o352n124l295j824j133r27p62m30K21J325K783M256N627P228
60501E66996R442J2219J5246J8424K2013K6171L0570L4523L7598M0071M2591M5276
60489I01140M7268M7431M5281M0942L4345K5230J4060K238r082j9822l0074l8936
60477A060021m5108m8430m9865m9997m8454m5089m0858l6944l3542l0119k6502
60466F05113k3150k0467j8304j6149j3701j1270r627r136r076q357o964o038o221
60453D46653o659o237n066m019l344k712k201k207k482k385k101k482l442l675
60439C97641k455p66L3j25m43n62n92l57L15Q59N24l89p66k80J57k25j022j417
60421C90130j325j209j215j128r10o94l35M58J526K286K475K449K559K644K370
$$ plain form
60516 571902 565403 559051 553927 550632 548808 547675 546748 545986 545556 545777 547102 549885 554141 559768 566996
60501 566996 576438 588657 603903 622327 644340 670511 701081 735604 773202 813273 855864 901140
60489 901140 948408 995839 1041120 1082062 1116407 1141637 1155697 1157935 1148853 1129031 1098957 1060021
60477 1060021 1014913 966483 916618 866621 818167 773078 732220 695276 661734 631615 605113
60466 605113 581963 561496 543192 527043 513342 502072 492445 483309 474233 465876 458912 452874 446653
60453 446653 439994 433757 428691 424672 421328 418616 416415 414208 411726 409341 407240 404758 401316 397641
60439 397641 395186 394420 394453 394328 393885 393323 392731 392374 392689 393548 394072 393683 392917 392637 392794 392569 391547 390130
60421 390130 388805 387596 386381 385253 384343 383649 383314 383772 385298 387584 390059 392508 395067 397711 400081
60406D00081J788J198O30n5o04m72L96J261J422J098J076J643K281K430K143J847
60390D18163J769J912K303K904L343L116K207J230P89Q35Q98R02J359K567L901
60375D48198M310L491K283J715J985K537K895L009K916K442J493M22j62N7Q20
60360D78411J593K080K360K545K542K348K371L057M264N386O258P365Q983J0556
60346E40119J1377J1407J0915R743P627N012K720Q07j397m087o564q237r272r862
60332E60308r687q602p315o622o365n788m730l813l521l624l584l184k629k292
60318D88552k368k630k632k219j629r99j21J091K276L201M309O164Q580J0871
60304E12446J2865J5136J8180K1751K5038K7110K7193K4926K0524J4510P315o30
$$ plain form
60406 400081 401869 403067 403697 403642 403038 402566 402962 404223 405645 406743 407819 409462 411743 414173 416316 418163
60390 418163 419932 421844 424147 427051 430394 433510 435717 436947 437736 438571 439469 440371 441730 444297 448198
60375 448198 452508 455999 458282 459997 461982 464519 467414 470423 473339 475781 477274 477696 477534 477591 478411
60360 478411 480004 482084 484444 486989 489531 491879 494250 497307 501571 506957 513215 520580 529563 540119
60346 540119 551496 562903 573818 583561 591188 596200 598920 599727 598330 594243 587679 579442 570170 560308
60332 560308 550621 542019 534704 528082 521717 515929 511199 507386 503865 500241 496657 493473 490844 488552
60318 488552 486184 483554 480922 478703 477074 476075 475954 477045 479321 482522 486831 492995 501575 512446
60304 512446 525311 540447 558627 580378 605416 632526 659719 684645 705169 719679 726994 726364
60292G26364q563j5509k0780k4079k5288k4473k2099j8883j5458j2365j0121q800
60280E19946p802o555n290m601m406m059l462l219l573m009m108m041l946l591
60266D57284l068k992l528l915l577k970k688k433j710r09o96p91m55J45K15k41
60250D27671m04j39k20q69j169m76O04J219J369J414J257Q10N91R74J394J136
60234D35162N31M97J142J707J743J511J250R34Q29J437K619L420L155K171J298
60219D59406R96J232J789K342K656K897L435M210M797N240O165P682Q838Q778
60205E20463P927P317P167O910O352N923N755N487N100N106N508N340L875J805
60191F00035N47O05J181J296P49m3p31j292j956k960m237n299n643n371n171n527
$$ plain form
60292 726364 717801 702292 681512 657433 632145 607672 585573 566690 551232 538867 528746 519946
60280 519946 512144 505589 500299 495698 491292 487233 483771 480552 476979 472970 468862 464821 460875 457284
60266 457284 454216 451224 447696 443781 440204 437234 434546 432113 430403 429494 428798 428007 427552 427697 427912 427671
60250 427671 427267 427128 426908 426039 424870 424394 424998 426217 427586 429000 430257 431067 431658 432632 434026 435162
60234 435162 435693 436190 437332 439039 440782 442293 443543 444477 445306 446743 449362 452782 455937 458108 459406
60219 459406 460402 461634 463423 465765 468421 471318 474753 478963 483760 489000 495165 502847 511685 520463
60205 520463 528390 535707 542874 549784 556136 562059 567814 573301 578401 583507 589015 594355 598230 600035
60191 600035 600582 601187 602368 603664 604413 604370 603639 602347 600391 597431 593194 587895 582252 576881 571710 566183
60175E66183o073n976m883l336k200j854k015k213k240k160k101k141k317k568
60161E24106k675k374j623p30j48p0k82m39m37l83j85M87J576K262J779N99J32
60144E21595J013K254K569K024J761K309L077L518L946M886O146P061P306P126
60130E76591O890O708O416N743M662L539K759K188J404M64m3R2K85Jm52m40J08
60113F16915Q13J511K197K522K072J164O88J041J683J852J300J99j152k310k852
60098F27643k798k616k632k765k915l140l195k489r81L17M31k38l39O85J996K674
60082F09638K833L087L406L247K510J692J058K68r86k423l535m226m800n537o553
60067E99679p851r188r989r845r004q115p491o955o376n974n973o289o624o611
$$ plain form
60175 566183 560110 554134 549251 545915 543715 541861 539846 537633 535393 533233 531132 528991 526674 524106
60161 524106 521431 519057 517434 516704 516556 516486 516204 515765 515328 514945 514760 515247 516823 519085 520864 521463 521595
60144 521595 522608 524862 527431 529455 531216 533525 536602 540120 544066 548952 555098 562159 569465 576591
60130 576591 583481 590189 596605 602348 607010 610549 613308 615496 616900 617364 617321 617413 617698 617699 617247 616807 616915
60113 616915 617728 619239 621436 623958 626030 627194 627882 628923 630606 632458 633758 633957 632805 630495 627643
60098 627643 624845 622229 619597 616832 613917 610777 607582 605093 604112 604429 604860 604622 604283 604968 606964 609638
60082 609638 612471 615558 618964 622211 624721 626413 627471 627739 626753 624330 620795 616569 611769 606232 599679
60067 599679 591828 582640 572651 562806 553802 545687 538196 531241 524865 518891 512918 506629 500005 493394
60053D93394n805m023j852l66j5q1L86J442K396K823K913K962L085L455M347N728
60037E10789P034P544O939N537M035L005K399J682N60n98j291j693k456l780n101
60022E34605n883o324o967p791q054p160n531m370m404n033m956l666j891o07
60008D61968n0k1n35j613k755l299l256l162l193l017k529k089j866j497o78L59
59992D32767J185J600J574J221J038J708L255M788N374N023M430M038L646K879
59978D74526J707N33j04n9J80o9r61k054k936l514l692l285k447j663j059k07
59962D54896J046K083K325K064J968K178K473K940L666M036L210J345m28j371
59948D82431j754j998j955j408o93k20J59P88J462J562Q58k07j030j356j293j086
$$ plain form
60053 493394 487589 483566 481714 481348 481333 481252 481638 483080 485476 488299 491212 494174 497259 500714 505061 510789
60037 510789 517823 525367 532306 537843 541878 544883 547282 548964 549524 548926 547635 545942 543486 539706 534605
60022 534605 528722 522398 515431 507640 499586 492426 486895 482525 478121 473088 468132 464466 462575 461968
60008 461968 461918 461897 461362 459749 456994 453695 450439 447277 444084 441067 438538 436449 434583 433086 432408 432767
59992 432767 433952 435552 437126 438347 439385 441093 444348 449136 454510 459533 463963 468001 471647 474526
59978 474526 476233 476766 476662 476603 476783 476714 475753 473699 470763 467249 463557 460272 457825 456162 455103 454896
59962 454896 455942 458025 460350 462414 464382 466560 469033 471973 475639 479675 482885 484230 483802 482431
59948 482431 480677 478679 476724 475316 474623 474403 474562 475350 476812 478374 479232 479025 477995 476639 475346 474260
59932D74260r59r36p96l22M64J373K268L076L640L838L835L966M308M565M571
59917E07151M614N114O078P148Q045Q657Q768Q124O826N273L557J432r17k563
59903E77307k846k320k046k212k201j875j878k468k967k827k501k646k988k669
59889E42863j396L68K055L327L998M226M606N486O372O578O282O224O553O679
59875F04221O297N693M992M011L036K804L175K729N07k457m231m224l504l084
59861F19965k959k880l129l944m814m963m313l493k941k444j623m95O69J865L434
59846E87935N562P826R381R510P946M871R42k649m565m157j928R23L220M142L264
59831F32223Q74j913l953n128o206p484q126p266n346l780l399l817m301m622
$$ plain form
59932 474260 473301 472365 471569 471247 471711 473084 475352 478428 482068 485906 489741 493707 498015 502580 507151
59917 507151 511765 516879 522957 530105 538150 546807 555575 563699 570525 575798 579355 580787 579870 577307
59903 577307 574461 572141 570095 567883 565682 563807 561929 559461 556494 553667 551166 548520 545532 542863
59889 542863 541467 541835 543890 547217 551215 555441 560047 565533 571905 578483 584765 590989 597542 604221
59875 604221 610518 616211 621203 625214 628250 631054 634229 636958 637465 635008 630777 626553 623049 619965
59861 619965 617006 614126 610997 607053 602239 597276 592963 589470 586529 584085 582462 581967 582636 584501 587935
59846 587935 593497 601323 610704 620214 628160 633031 633973 631324 626759 622602 620674 621597 624817 628959 632223
59831 632223 633097 631184 627231 622103 615897 608413 600287 593021 587675 583895 580496 576679 572378 567756
59817E67756m792m576l740k603j758j360j021m60Q3J66l47j217k077k773l502
59802E37779m500n487n656m576k916j848j766k082k216k198k168j968j489q98
59788D98011j83R04K030K128Q16o21n96P30J778J720J229R66N92j88p26l94L16
59771E08512N30L37N08J142J576J486J236J100R40Q12J074J675K070K148K532
59756E27678L430L965L370K353K337L559M835N194M959M976N567O478P278P399
59742E93378O422M812L721L607L502K448J096R04J924K530J575j64j185j144q34
59727F22592q69j072j053p74m76m02n94q59r81j006j085j068o61r1p5p86j457
59710F09283j456j183j270j458j048j64L97M22M70Q16J174J585K552M011N077
$$ plain form
59817 567756 562964 558388 554648 552045 550287 548927 547906 547446 547529 547695 547348 546131 544054 541281 537779
59802 537779 533279 527792 522136 517560 514644 512796 511030 508948 506732 504534 502366 500398 498909 498011
59788 498011 497828 498732 500762 502890 503706 503085 502489 503219 504997 506717 507946 508912 509504 509316 508590 508196 508512
59771 508512 509042 509379 509887 511029 512605 514091 515327 516427 517367 518179 519253 520928 522998 525146 527678
59756 527678 531108 535073 538443 540796 543133 546692 551527 556721 561680 566656 572223 578701 585979 593378
59742 593378 599800 604612 608333 611940 615442 617890 618986 619890 621814 624344 625919 625755 624570 623426 622592
59727 622592 621723 620651 619598 618824 618348 617946 617352 616493 615512 614506 613421 612353 611692 611601 611526 610740 609283
59710 609283 607827 606644 605374 603916 602868 602704 603101 603523 603993 604809 605983 607568 610120 614131 619208
59695F19208N358N583O307O833O272N078M390M251L592J977K46p89j375k069k745
59680F62117k937k697k463k409k485k909l930n191n940o010o043o456o766o247
59666E99634m944l539k531j997j938k272k503k074j122l55k2M28J358K315K811
59651E83249L145L818M532M571L898L110K443J639P44J21m57j828m155o385p468
59636E90977p473o989o146m943l979l870m163l822k785k136k517l185l189k759
59622E33021k843l612m231m096l577l303l262l099k953l320m054m195l164j662
59608D85650q11o90l68N87J407J241L91j14J36N88O57L79Q4q9j06K03R12J690
59590D91747K030J802J347J066J040J103J090R22N93J70k41o09r82j354j652k001
$$ plain form
59695 619208 624566 630149 636456 643289 649561 654639 659029 663280 666872 668849 669095 668306 666931 664862 662117
59680 662117 659180 656483 654020 651611 649126 646217 642287 637096 631156 625146 619103 612647 605881 599634
59666 599634 594690 591151 588620 586623 584685 582413 579910 577836 576714 576359 576337 576765 578123 580438 583249
59651 583249 586394 590212 594744 599315 603213 606323 608766 610405 611149 611270 610813 608985 604830 598445 590977
59636 590977 583504 576515 570369 565426 561447 557577 553414 549592 546807 544671 542154 538969 535780 533021
59622 533021 530178 526566 522335 518239 514662 511359 508097 504998 502045 498725 494671 490476 487312 485650
59608 485650 484839 484149 483781 484368 485775 487016 487407 487293 487429 488017 488674 489053 489137 489048 488942 489145 490057 491747
59590 491747 493777 495579 496926 497992 499032 500135 501225 502147 502740 502910 502669 502060 501078 499724 498072 496071
59574D96071k657l541m088l962l637l777m182m041l270k702k755k709j897q20
59560D52033l39l46j57J90R1m07n29K4P02J065J313J677K056K397K775K983K864
59543D68392L035M299O200P319P398P981J0251J3462J6423J9236K2092K3206J9885
59530F29179J1892K305n218r152j0044r058p227n272l337j145J170K762K912J963
59516F01730R78N89M25l16j910l811n298o291p294q556r649j0047r718q913p738
59501E24181o362n283m849m708m240l416k739k423k084j289p3J031J376Q01O1
59486D89984K46J429K430K358J805J856K505L053L515M483N756O500O724P309
59472E39953Q321Q617P599O143N085L907J873m54j918k364k509k579k120j013
$$ plain form
59574 496071 493414 489873 485785 481823 478186 474409 470227 466186 462916 460214 457459 454750 452853 452033
59560 452033 451694 451348 451191 451381 451472 451065 450536 450560 451262 452327 453640 455317 457373 459770 462545 465528 468392
59543 468392 471427 475726 481926 489245 496643 504624 514875 528337 544760 563996 586088 609294 629179
59530 629179 641071 643376 638158 629006 618962 609904 602677 597405 594068 592923 594093 596855 599767 601730
59516 601730 602708 603297 603722 603406 601496 597685 592387 586096 578802 570246 560597 550550 540832 531919 524181
59501 524181 517819 512536 507687 502979 498739 495323 492584 490161 488077 486788 486715 487746 489122 489923 489984
59486 489984 490230 491659 494089 496447 498252 500108 502613 505666 509181 513664 519420 525920 532644 539953
59472 539953 548274 556891 564490 570633 575718 579625 581498 581044 579126 576762 574253 571674 569554 568541
59458E68541K70J359K278L004L460L928M920O477Q082R285J0027J0382J0435J0429
59444F52877J0544J0371R013N988J778k608o389r186j0796j1091j0289r040q090
59431F23082p715p596p316o892o605o425n928m854l442k039o24J162L627O676
59417E75111R733J2058J3500J4899J7277K0713K4461K8093L1553L3730L2030K4473
59405H37631J2045j701j3196k0569k3368k1907j7109j0200k078O475J3719J6694
59393G76436J3021L131r472k0403k7014k9228k8423k5917k2427j8467j4588j1197
59381E85452q461o455n108l952k471p98L45P27J024J838K789L147K964K896L202
59366E77139L605L955M342M614M531M357M670N460O159O573P146Q060Q818R062
$$ plain form
59458 568541 568811 570170 572448 575452 578912 582840 587760 594237 602319 611604 621631 632013 642448 652877
59444 652877 663421 673792 682805 688793 690571 687963 681574 672388 661592 650501 640212 631172 623082
59431 623082 615367 607771 600455 593563 586958 580533 574605 569751 566309 564270 563646 564808 568435 575111
59417 575111 584844 596902 610402 625301 642578 663291 687752 715845 747398 781128 813158 837631
59405 837631 849676 847975 834779 814210 790842 768935 751826 741626 739548 746023 759742 776436
59393 776436 789457 792588 783116 762713 735699 706471 678048 652131 629704 611237 596649 585452
59381 585452 576991 570536 565428 561476 559005 558207 558552 559279 560303 562141 564930 568077 571041 573937 577139
59366 577139 580744 584699 589041 593655 598186 602543 607213 612673 618832 625405 632551 640611 649429 658491
59352F58491R214R847J0909J2001J3014J3998J4721J4866J4552J4232J4197J4353
59340H14395J4399J3996J2984J1565J0068Q341N828K477q10l133m657o237q259
59327H70957j0358j2185j3724j4897j5424j5227j4554j3567j2309j1149j0633
59316G26930j0556r804p703n149l714l746m025l430k218j295p62K11K154M596
59302F81489O736Q365R895J1775J4134J6752J8856J9057J6058R750J485o857j3870
59289G93625j8761k1100k1002j9336j7208j5140j3061j1042r487q443p239n271
59277F26535k886j034j02M86J492L020M599N875P025Q497J0383J2095J2758J2032
59263G00775J0420Q675P026N175K885K49k543n302p616q984r325r137q964q968
$$ plain form
59352 658491 667705 677552 688461 700462 713476 727474 742195 757061 771613 785845 800042 814395
59340 814395 828794 842790 855774 867339 877407 885748 891576 894053 893243 890110 885453 879216 870957
59327 870957 860599 848414 834690 819793 804369 789142 774588 761021 748712 737563 726930
59316 726930 716374 706570 698867 693718 690004 686258 682233 678803 676585 675290 674528 674739 676893 681489
59302 681489 688225 696590 706485 718260 732394 749146 768002 787059 803117 812867 814352 807495 793625
59289 793625 774864 753764 732762 713426 696218 681078 668017 656975 647488 639045 631806 626535
59277 626535 623649 622615 622513 622999 624491 627511 632110 637985 645010 653507 663890 675985 688743 700775
59263 700775 711195 719870 726896 732071 734956 735205 732662 727360 719744 710760 701435 692298 683334 674366
59249F74366r045r040q644p441n483l472k143j520j124o70j92K82Q05J287J624
59234F29590J949K403K754K621K068J572J401J401J370J219P58k39j631k946l909
59219F40381m593n075n343n520n684n371l979j833k05J04k98l46J12M74M60L50
59203F03634L62M50O48J100J723K281K762L326L857L947L389K427J481Q85P53
59188F33025Q98R38P57P23J170J833K169K115K064K136J962J290M27j49k77p6
59172F51005L25Q28J305J728K236K963L831M608N186N733O538P571Q262P986O830
59157G16935N582M749L930K526P85m42r23j391k511l956m853m863m515m538n136
59142G01379n927o453o632o711o904p224p562p756p589o982o288o005o066n788
$$ plain form
59249 674366 665321 656281 647637 640196 634713 631241 629098 627578 626454 625784 625592 625874 626679 627966 629590
59234 629590 631539 633942 636696 639317 641385 642957 644358 645759 647129 648348 649106 648867 647236 644290 640381
59219 640381 635788 630713 625370 619850 614166 608795 604816 602983 602778 602882 602584 602238 602350 602824 603284 603634
59203 603634 603996 604446 605094 606194 607917 610198 612960 616286 620143 624090 627479 629906 631387 632272 633025
59188 633025 633923 634861 635618 636341 637511 639344 641513 643628 645692 647828 649790 651080 651507 651358 651081 651005
59172 651005 651330 652158 653463 655191 657427 660390 664221 668829 674015 679748 686286 693857 702119 710105 716935
59157 716935 722517 727266 731196 733722 734507 734065 733142 731751 729240 725284 720431 715568 711053 706515 701379
59142 701379 695452 688999 682367 675656 668752 661528 653966 646210 638621 631639 625351 619346 613280 607492
59128F07492m801l606k871k471j762n48P18J643K303K968L799M711N376N511N454
59113F23916O088P699R323R842R424R134R314R298Q661P813P194O681O119N614
59099G36120N040L969K442J091J61q94k400l768m311m118l594k764j641o96l28
59084G24309l20m59j143k604m091m731m906n785p555r095r421q717p757p023o609
59069F44093o421o205n799n407n287n221m785m132l859m060m130l723l315l486
59055E78263m083m426m078l159k180j702j875k185k016j448j127j230j150m48
59041E47156M50Q27N45n8o72r94o09M83J559J941J882K139K889L667M235M857
59025E70297N695O672P939R817J2015J3655J4370J4777J5442J5986J5704J4510
$$ plain form
59128 607492 602691 599085 596214 593743 591981 591433 592151 593794 596097 599065 602864 607575 612951 618462 623916
59113 623916 630004 637703 647026 656868 666292 675426 684740 694038 702699 710512 717706 724387 730506 736120
59099 736120 741160 745129 747571 748662 748823 747929 745529 741761 737450 733332 729738 726974 725333 724637 724309
59084 724309 723989 723530 722387 719783 715692 710961 706055 700270 692715 683620 674199 665482 657725 650702 644093
59069 644093 637672 631467 625668 620261 614974 609753 604968 600836 596977 592917 588787 585064 581749 578263
59055 578263 574180 569754 565676 562517 560337 558635 556760 554575 552559 551111 549984 548754 547604 547156
59041 547156 547606 548433 548978 548920 548248 547254 546645 547128 548687 550628 552510 554649 557538 561205 565440 570297
59025 570297 575992 582664 590603 600420 612435 626090 640460 655237 670679 686665 702369 716879
59013G16879J2625R846O000J872j261l051m264n449o227o103n191l830k185n96
58999G09065L98Q74J704L240M415M033K517J404J310J396Q36k13j300k462l810
58984G23407m996n631n799n733n370m552l460k447j638r01N5J632M014O658Q547
58969G03786R259R452R931J0722J1395J1862J2257J2404J2006J1216J0416R457
58957H34163P835N587L418J682j88k874o052q617r941j0628j1787j3702j5451
58944G73445j5938j5072j3688j2477j1428j0317r153p920o328m342k598j835j996
58931F60353k307k185j703j256j080j114j145j045r43j032j165j010o76p28j306
58916F41658j754j591j256j326j462j023l01j24l71m5J105K117K391K731M202
$$ plain form
59013 716879 729504 739350 745350 747222 745961 742910 738646 733197 726970 720867 715676 711846 709661 709065
58999 709065 709463 710337 712041 715281 719696 723729 726246 727650 728960 730356 731192 730979 729679 727217 723407
58984 723407 718411 712780 706981 701248 695878 691326 687866 685419 683781 682880 682935 684567 688581 695239 703786
58969 703786 713045 722497 732428 743150 754545 766407 778664 791068 803074 814290 824706 834163
58957 834163 841998 847585 851003 852685 852497 849623 843571 834954 825013 814385 802598 788896 773445
58944 773445 757507 742435 728747 716270 704842 694525 685372 677452 671124 666782 664184 662349 660353
58931 660353 658046 655861 654158 652902 651822 650708 649563 648518 647575 646543 645378 644368 643692 642964 641658
58916 641658 639904 638313 637057 635731 634269 633246 632945 632821 632450 632405 633510 635627 638018 640749 644951
58901F44951O709R287J1249J2460J2997J3181J3475J3739J3121J1322R546R327
58889G81364J0668J2214J3111J3797J4921J6370J7665J8538J8640J7358J4537
58878I49183J1037P969N465K730p61m530p673r811j1226j2249j2853j2831j2217
58865H92233j1280j0180q880p458o318n845o005o452p015p789q817r842j0507
58852G85845j0589j0097r340q768q539q202p227n875n100n352n974o096n814n922
58838F82950o712p643q125q115p828p386o944o759o844o830o386n570m628l718
58824E89462k932k285j554m60P63J452J476J664K773M344N185M843L994L431L272
58809F15428L230L126K893K482J983J526J004J66q76j584j634j323j216j568k263
$$ plain form
58901 644951 651660 660947 672196 684656 697653 710834 724309 738048 751169 762491 772037 781364
58889 781364 792032 804246 817357 831154 846075 862445 880110 898648 917288 934646 949183
58878 949183 960220 968189 973654 976384 975623 971093 963420 953609 942383 930134 917281 904450 892233
58865 892233 880953 870773 861893 854435 848117 842272 836267 829815 822800 815011 806194 796352 785845
58852 785845 775256 765159 755819 747051 738512 730310 723083 717208 712108 706756 700782 694686 688872 682950
58838 682950 676238 668595 660470 652355 644527 637141 630197 623438 616594 609764 603378 597808 593180 589462
58824 589462 586530 584245 582691 582231 582994 584446 585922 587586 590359 594703 599888 604731 608725 612156 615428
58809 615428 618658 621784 624677 627159 629142 630668 631672 631838 630962 629378 627744 626421 625205 623637 621374
58794F21374l040l675m091m399m674m701m274l645l257l061k496j278K68J717
58780E80768K883L542L493L176L610N156O825P319O393M652K486r4k759m838o041
58765F16571o707p190p515p632p602p385o817n956n140m538l837k592p96J040
58751E43904K262K582K231J698J315J161J260J634K147K552K789L044L400L742
58737E75721M086M616N235N555N526N689O436P399P973Q091P965P453O273M704
58723F62722L505L080L137L146K833K279J853J986K735L707M607N584O691P414
58709G15279P242O435N635M876L573J436j138l600n679p371q949j0868j3209j5304
58695F78358j6439j6803j7125j7404j6755j4650j1779r362q068p724p670p226
$$ plain form
58794 621374 618334 614659 610568 606169 601495 596794 592520 588875 585618 582557 580061 578783 579051 580768
58780 580768 583651 587193 590686 593862 597472 602628 609453 616772 623165 627817 630303 630209 627450 622612 616571
58765 616571 609864 602674 595159 587527 579925 572540 565723 559767 554627 550089 546252 543660 542864 543904
58751 543904 546166 548748 550979 552677 553992 555153 556413 558047 560194 562746 565535 568579 571979 575721
58737 575721 579807 584423 589658 595213 600739 606428 612864 620263 628236 636327 644292 651745 658018 662722
58723 662722 666227 669307 672444 675590 678423 680702 682555 684541 687276 690983 695590 701174 707865 715279
58709 715279 722521 728956 734591 739467 743040 744476 743338 739738 734059 726688 717739 706871 693662 678358
58695 678358 661919 645116 627991 610587 593832 579182 567403 558041 549973 542249 534579 527353
58683E27353o199n145m775n028n100m468l507k819k436j962j301q17p07n08M41
58668D83022K017L193L285L105M177O737R328J0581J0544R776Q156N529K734P98
58654E62982m67j895l393m106l965l854m170m462m519m623m641m037l122k987
58640E12741l791m221l339j879j070r94r13m14M71J655K759L032K248J220Q72
58625E08377J172J501J558J313O24m26j166r54QJ068K031L136M364N273N565N392
58609E38836N119M893M459L457K041J058J099J585J417M87k31k03l5m05j108j610
58593E60859j809j768j363o47rN27J506L168M963O395P644Q902R816J0229J0758
58578F19171J1817J2643J2089J0155P950O432N744N620N804O130O537P071P783
$$ plain form
58683 527353 521154 516009 511234 506206 501106 496638 493131 490312 487876 485914 484613 483796 483089 482581 483022
58668 483022 485039 488232 491517 494622 498799 505536 514864 525445 535989 545765 553921 559450 562184 562982
58654 562982 562515 560620 557227 553121 549156 545302 541132 536670 532151 527528 522887 518850 515728 512741
58640 512741 508950 504729 501390 499511 498441 497447 496534 496120 496591 498246 501005 504037 506285 507505 508377
58625 508377 509549 511050 512608 513921 514545 514119 512953 511999 512007 513075 515106 518242 522606 527879 533444 538836
58609 538836 543955 548848 553307 556764 558805 559863 560962 562547 563964 564451 564220 564017 563982 563577 562469 560859
58593 560859 559050 557282 555919 555272 555263 555790 557296 560464 565427 571822 579466 588368 598184 608413 619171
58578 619171 630988 643631 655720 665875 673825 680257 686001 691621 697425 703555 710092 717163 724946
58565G24946Q859J0776J3797J7402K0778K3764K6520K8395K8388K6857K5410K4515
58553I80407K2580J8226J2209O255J179k805n192n993o482p727r053r353r137
58540I85114r809j1486j3154j4652j6801j9605k1835k2666k2493k1921k1044j9867
58528G69781j8528j6866j4580j1908r401p097m692k415r41m44n11q71j468k029
58514F78030k333k656l162l157j979l45L74J1l77k95l23p63j082j011j099j673
58498F58160k178k031j427q74n43l73k94q4M97J304K015K697L651M705N455O084
58482F76764P182Q720J0019J0902J2064J4061J6525J8589J9583J9244J7745J5616
58470H47014J3157R981N623N13m242p925j0448j1810j2017j1468j0576r124o609
$$ plain form
58565 724946 733805 744581 758378 775780 796558 820322 846842 875237 903625 930482 955892 980407
58553 980407 1002987 1021213 1033422 1039677 1040856 1038051 1032859 1026866 1020384 1012657 1003604 994251 985114
58540 985114 975305 963819 950665 936013 919212 899607 877772 855106 832613 810692 789648 769781
58528 769781 751253 734387 719807 707899 698498 691401 686709 684294 683353 682909 682398 681527 680059 678030
58514 678030 675697 673041 669879 666722 664743 664398 664772 664783 664406 664111 663788 663025 661943 660932 659833 658160
58498 658160 655982 653951 652524 651650 651107 650734 650440 650356 650853 652157 654172 656869 660520 665225 670680 676764
58482 676764 683946 692666 702685 713587 725651 739712 756237 774826 794409 813653 831398 847014
58470 847014 860171 870152 875775 876288 872046 864121 853673 841863 829846 818378 807802 798678 792069
58457G92069l285q3K474M654O829Q974J0781J1826J1739J0683R280P605M819N50
58443H78915m001p304r275j0786j1864j1788j0622r282q106o602m685k940j540
58430G80120p7J405K346K844L852N842Q181J0076J1390J2262J2652J2401J1324
58417H74618R272O515L743J182j654m759o963p464p102p011o870n974n032n153
58403H37348n778n553m662m233m033k981j591j379j921j170J073K633K474K139
58389H12366K763L197K313J005M86L89o9n79p03q71j203p47J045L279N078O743
58373H34492Q566R865J0238J0452J1070J1446J1086J0743J1092J1560J1480J1306
58361I63396J1701J2418J3019J3615J4179J4163J3519J2994J2723J1799R830P624
$$ plain form
58457 792069 788784 788701 791175 795829 802658 811632 822413 834239 845978 856661 865941 873546 878365 878915
58443 878915 874914 867610 858335 847549 835685 823897 813275 803993 795887 789285 784600 781660 780120
58430 780120 780043 781448 783794 786638 790490 796332 804513 814589 825979 838241 850893 863294 874618
58417 874618 883890 890405 894148 895330 893676 888917 881954 874490 867388 860377 853507 847533 842501 837348
58403 837348 831570 826017 821355 817122 813089 810108 808517 807138 805217 804047 805120 807753 810227 812366
58389 812366 815129 818326 820639 821644 822130 822519 822450 821871 821168 820297 819094 818347 819392 822671 827749 834492
58373 834492 843058 852923 863161 873613 884683 896129 907215 917958 929050 940610 952090 963396
58361 963396 975097 987515 1000534 1014149 1028328 1042491 1056010 1069004 1081727 1093526 1103356 1110980
58349A110980N730L718J592L98O48J550K491L808N390O247O274O835Q666J0742
58335A175069J2067J2940J3699J3974J4021J4922J6594J7500J7203J7069J7506
58324A342564J6880J4456J1950J0574R019O234L846L634M655N142N361O246O981
58311A447542O487N863O879R171J1187J2724J4387J5660J5787J5640J6572J8258
58299A596157J9484K0165K0819K1110K0682K0384K0966K1627K1377K0763K0730
58288A824264K1086K1559K2873K5156K6900K7186K7317K8620L0394L1700L3232
58277B120287L5503L7242L7664L8327M0552M3024M4181M4968M6701M8424M8916
58266B585789M9410N1555N4576N7107N9870O3869O7874P0541P3059P6867Q0695
$$ plain form
58349 1110980 1116710 1120428 1122020 1122418 1123066 1124616 1127107 1130915 1136305 1142552 1148826 1155661 1164327 1175069
58335 1175069 1187136 1200076 1213775 1227749 1241770 1256692 1273286 1290786 1307989 1325058 1342564
58324 1342564 1359444 1373900 1385850 1396424 1405443 1411677 1415523 1419157 1423812 1428954 1434315 1440561 1447542
58311 1447542 1454029 1459892 1466771 1475942 1487129 1499853 1514240 1529900 1545687 1561327 1577899 1596157
58299 1596157 1615641 1635806 1656625 1677735 1698417 1718801 1739767 1761394 1782771 1803534 1824264
58288 1824264 1845350 1866909 1889782 1914938 1941838 1969024 1996341 2024961 2055355 2087055 2120287
58277 2120287 2155790 2193032 2230696 2269023 2309575 2352599 2396780 2441748 2488449 2536873 2585789
58266 2585789 2635199 2686754 2741330 2798437 2858307 2922176 2990050 3060591 3133650 3210517 3291212
58255C291212Q2633Q3240Q3805Q3733Q2478Q1817Q3306Q5801Q8271R2308R8760
58244D237364J05068J09429J14471J22851J32461J40238J47502J56909J67169
58235E433462J75849J84533J96099K09481K22223K35450K51214K67830K83317
58226G459458L00385L22300L46888L70630L95504M25501M59589M94796N33061
58217A1108112N78135O28909O82826P42547Q12238Q91205R78520J079394J199120
58208A8701006J336067J489438J667920J881003K128743K411591K743393L142862
58200C5502023L621707M196908M906400N796016O901076Q260919R941473J2023233
58192I1149755J4586571J7743842K1661265K6462730L2026191L7789674M2638374
$$ plain form
58255 3291212 3373845 3457085 3540890 3624623 3707101 3788918 3872224 3958025 4046296 4138604 4237364
58244 4237364 4342432 4451861 4566332 4689183 4821644 4961882 5109384 5266293 5433462
58235 5433462 5609311 5793844 5989943 6199424 6421647 6657097 6908311 7176141 7459458
58226 7459458 7759843 8082143 8429031 8799661 9195165 9620666 10080255 10575051 11108112
58217 11108112 11686247 12315156 12997982 13740529 14552767 15443972 16422492 17501886 18701006
58208 18701006 20037073 21526511 23194431 25075434 27204177 29615768 32359161 35502023
58200 35502023 39123730 43320638 48227038 54023054 60924130 69185049 79126522 91149755
58192 91149755 105736326 123480168 145141433 171604163 203630354 241420028 284058402
58185B84058402M4932504M2869766L5314310K2711788P277816p937028k0473156
58178D08754402k9280177l4500807l6766995l6732636l4997983l2144400k8696372
58171A75635032k5066262k1546333j8318728j5463881j2991744j0887123r127010
58164F2233951p671442o467747n471215m649943l972362l406231k930476k534703
58156B5129832k206546j930324j696786j502757j341493j203151j083629r83178
58148A3181968q97230q17765p42824o75854o16630n61079n09060m63825m24416
58139G473285l86614l51033l22510l01646k84126k68192k55705k45751k34247
58130D823461k20295k06835j94683j81718j68189j56984j48288j39312j29635
$$ plain form
58185 284058402 328990906 371860672 407174982 429886770 437164586 429227558 408754402
58178 408754402 379474225 344973418 308206423 271473787 236475804 204331404 175635032
58171 175635032 150568770 129022437 110703709 95239828 82248084 71360961 62233951
58164 62233951 54562509 48094762 42623547 37973604 34001242 30595011 27664535 25129832
58156 25129832 22923286 20992962 19296176 17793419 16451926 15248775 14165146 13181968
58148 13181968 12284738 11466973 10724149 10048295 9431665 8870586 8361526 7897701 7473285
58139 7473285 7086671 6735638 6413128 6111482 5827356 5559164 5303459 5057708 4823461
58130 4823461 4603166 4396331 4201648 4019930 3851741 3694757 3546469 3407157 3277522
58121C277522j21687j15761j09537j02771r7597r3942q9289q3272p8071p4115
58111B311480o9656o4716o1221n9138n6523n3416n1698n1237n0118m8437m7858
58100A697462m7713m5793m2693m1158m1165m0001l7207l5072l3998l1888k8567
58089A272207k6446k6051k4977k2231j9713j8528j7520j6394j6638j8311j9297
58078A046101j8854j8699j9628k0208j9762j9590k0262k0534j9860j9254j8900
58067H30550j7633j5528j4219j3964j3181j1442j0141r639q618o999o545p754
58055F94887r026r644j0746j2471j3072j1969j0828j0532r791p921o315n926n764
58042E70882n118m861n360n511m999n133o234o665n681m847n240n687n268n254
$$ plain form
58121 3277522 3155835 3040074 2930537 2827766 2730169 2636227 2546938 2463666 2385595 2311480
58111 2311480 2241824 2177108 2115887 2056749 2000226 1946810 1895112 1843875 1793757 1745320 1697462
58100 1697462 1649749 1603956 1561263 1520105 1478940 1438939 1401732 1366660 1332662 1300774 1272207
58089 1272207 1245761 1219710 1194733 1172502 1152789 1134261 1116741 1100347 1083709 1065398 1046101
58078 1046101 1027247 1008548 988920 968712 948950 929360 909098 888564 868704 849450 830550
58067 830550 812917 797389 783170 769206 756025 744583 734442 724803 716185 709186 702641 694887
58055 694887 685861 676217 665471 653000 639928 627959 617131 606599 596808 588887 582572 576646 570882
58042 570882 565764 560903 555543 550032 545033 539900 533666 527001 521320 516473 511233 505546 500278 495024
58028D95024o767q597r153q863q857q907q312p474p020o580n720m967m771m565
58014C94471l897l310l287l449l512l714l771k913j506j036j838k506k129j320
58000C56283m02J330L718N155N006M687N179N425M428L072K370J667J31j517k321
57985C94211k714l364l734l292k876l421m452n189n942p012p425o313m573l656
57971C30248l588l498l247l169k946k118j038k91K36P18O83p7o68k18Q31J452
57955C13310J371Q09k27j548k475k794l190l927m041k803j046k7K38N70J274K080
57939B97574K831L456L887M554O162Q458J0175J0731J0908J1254J1103R921Q424
57926C99438P346O223M404K206J26k055m341n803n880n518n840o594o903o740
$$ plain form
58028 495024 488257 479660 470507 461644 452787 443880 435568 428094 421074 414494 408774 403807 399036 394471
58014 394471 390574 387264 383977 380528 377016 373302 369531 366618 365112 364076 362238 359732 357603 356283
58000 356283 355881 357211 360929 366084 371090 375777 380956 386381 390809 393881 396251 397918 398049 396532 394211
57985 394211 391497 388133 384399 381107 378231 374810 370358 365169 359227 352215 344790 338477 333904 330248
57971 330248 326660 323162 319915 316746 313800 311682 310644 310353 310589 311307 311990 311913 311245 311027 311858 313310
57955 313310 314681 315490 315263 313715 311240 308446 305256 301329 297288 294485 293439 293412 293650 294220 295494 297574
57939 297574 300405 303861 307748 312302 318464 326922 337097 347828 358736 369990 381093 391014 399438
57926 399438 406784 413007 417411 419617 419743 417688 413347 407544 401664 396146 390306 383712 376809 370069
57912C70069o623o565o307n925n346m116k413j364j591k382l021l827m986n662
57898C09941n344m957n377n857n196l542j870n77L46O15L23L50J086J655J460
57883B83056J317J924K447K055J594K139K895K390Q73k17n52r45j571j861j796
57868B93748j804j722j189o23n50n34r8L4q34j748j310N8Q73J030J607K600K912
57851B92450K458K334K776K814K135J603J590J324L13r90k240l588m736m912m166
57836B89165l512l492l661l662l635l354k265p13K5n38j359j274l31O66J152J029
57820B64241N81M70J171K331L231L766M231M373L649K320J200K87j247l566n725
57805B81313o942p363p331o813n880m929m159l411k683k103j387j53J254K092
$$ plain form
57912 370069 363446 356881 350574 344649 339303 335187 332774 331410 329819 327437 324416 320589 315603 309941
57898 309941 304597 299640 294263 288406 283210 279668 277798 277221 277567 278182 278505 278855 279941 281596 283056
57883 283056 284373 286297 288744 290799 292393 294532 297427 299817 300690 300473 299921 298976 297405 295544 293748
57868 293748 291944 290222 289033 288410 287860 287326 287228 287262 286428 284680 283370 283428 284301 285331 286938 289538 292450
57851 292450 294908 297242 300018 302832 304967 306570 308160 309484 309797 308807 306567 302979 298243 293331 289165
57836 289165 285653 282161 278500 274838 271203 267849 265584 264871 264896 264358 262999 261725 261394 262060 263212 264241
57820 264241 264822 265292 266463 268794 272025 275791 280022 284395 288044 290364 291564 291851 290604 287038 281313
57805 281313 274371 267008 259677 252864 246984 242055 237896 234485 231802 229699 228312 228159 229413 231505
57791B31505K369K700L050K650J429L86K38N99R13J290J896K351K334K196K441
57776B58347L067L755M338M657M424L553K384J357O23N6o56j842l464m945n681
57761B69973n698n455n233n048m910m670l932k589j188l27Q7M47Q05J126J656
57746B35044K380K635K112J610J877K297J866R89R25J683J888Q20p37j769k073
57731B51547j895j560j608k256k670j798L4J374J549J164O92j45j326k104k117
57716B38881j866j706j388r76j119j912k441k113j518j481j981k541k919l013
57702B11907k719k337k385k703k554j869j508j828k022j433o35m54o94o36k38
57687A87892r1m77j112j523j292k53J138J999J967J760K468M557P583J0607J2890
$$ plain form
57791 231505 233874 236574 239624 242274 243703 244089 244327 244926 245839 247129 249025 251376 253710 255906 258347
57776 258347 261414 265169 269507 274164 278588 282141 284525 285882 286505 286561 285905 284063 280599 275654 269973
57761 269973 264275 258820 253587 248539 243629 238959 235027 232438 231250 230923 231010 231457 232262 233388 235044
57746 235044 237424 240059 242171 243781 245658 247955 249821 250810 251735 253418 255306 256126 255389 253620 251547
57731 251547 249652 248092 246484 244228 241558 239760 239794 241168 242717 243881 244573 244428 243102 240998 238881
57716 238881 237015 235309 233921 232945 231826 229914 227473 225360 223842 222361 220380 217839 214920 211907
57702 211907 209188 206851 204466 201763 199209 197340 195832 194004 191982 190549 189914 189460 188766 188130 187892
57687 187892 187801 187324 186212 184689 183397 183144 184282 186281 188248 190008 192476 197033 204616 215223 228113
57672B28113J4690J7408K2325K9252L7051M5348N4638O4306P1357P1684O2395
57661G18567M3231J7004j0942l4783n0976n9222o1018n8130n2404m5782l9487
57650C66058l3652k8162k3329j9340j5784j2322r294p127n683m578l728l086k343
57637A97630j312k40N98J253J707J678J125N19K48J99J11l4k42o02r74j084j146
57620A99434j703k666l128k556j571j158j524k050k039j290l38j24r94k075k270
57605A73948j720j441j626j450p30m20j039j763j768j477j664k159k364k296k361
57590A49670k554k683k792k817k314j206k82k79r37j499j732j777j522q11M4N20
57574A27029M36j13j008j919k313k071j625j300j029r45j418k140k034p73L90
$$ plain form
57672 228113 242803 260211 282536 311788 348839 394187 448825 513131 584488 656172 718567
57661 718567 761798 778802 767860 733077 682101 622879 561861 503731 451327 405545 366058
57650 366058 332406 304244 280915 261575 245791 233469 224175 217048 211365 206787 203059 199973 197630
57637 197630 196318 196078 196676 197929 199636 201314 202439 202958 203206 203405 203516 203482 203240 202638 201664 200580 199434
57620 199434 197731 195065 191937 189381 187810 186652 185128 183078 181039 179749 179411 179287 178293 176218 173948
57605 173948 172228 170787 169161 167711 166981 166561 165522 163759 161991 160514 158850 156691 154327 152031 149670
57590 149670 147116 144433 141641 138824 136510 135304 135022 134743 133806 132307 130575 128798 127276 126465 126509 127029
57574 127029 127465 127352 126344 124425 122112 120041 118416 117116 116087 115142 113724 111584 109550 108777 109167
57559A09167J09j288k291k013q04N07J269J225P67P33J557K817L890M513M399
57544A24557L100Q62j066j642j119l34M50J308J835J554Q30N81J154K011K348
57529A36429J684J28j518k275j951j246p40l60r6l73j285k112k200j702r73j1
57513A21399J018J472J148P05O42O38N01O98J219J059j40j037n17L43k10j852
57497A27086k683k092j380j578k253k685k871k924k600j850j097o57m00j28K36
57482A02124Q25J573J967J569O42k09p74j072r67n27l44p05j040r53j144k249
57466I8716l402l177j632j90K32j79j062k072k373j331K85J009N70l8k58m23o08
57449H4067m78k40m36o33Q8J281J361J15p35p6J030J224P96P22R89J096J219J625
$$ plain form
57559 109167 109276 107988 105697 103684 102880 103387 104656 105881 106648 107381 108938 111755 115645 120158 124557
57544 124557 127657 128519 127453 125811 124692 124358 124808 126116 127951 129505 130335 130916 132070 134081 136429
57529 136429 138113 138241 136723 134448 132497 131251 130511 130151 130055 129682 128397 126285 124085 122383 121410 121399
57513 121399 122417 123889 125037 125742 126384 127022 127523 128221 129440 130499 130359 129322 128805 129148 128938 127086
57497 127086 124403 122311 120931 119353 117100 114415 111544 108620 106020 104170 103073 102416 102016 101888 102124
57482 102124 102949 104522 106489 108058 108700 108491 107717 106645 105678 105151 104807 104102 103062 102109 100965 98716
57466 98716 95314 92137 90505 90315 90547 90368 89306 87234 84861 83530 83815 84824 85394 85356 85098 84675 84067
57449 84067 83589 83349 82913 82280 82368 83649 85010 85125 84390 84314 85344 86568 87364 88086 89075 90171 91390 93015
57431I3015J691P87m14o88l7M20J27k86j13N23R86Q65K89k14j71K99N72K64l99
57412I7516j008j372j293n05P67J750J977J866J894J716P85m59q57j15O32K40
57396A03534r03j352n59L34N0r86j182MJ378J824J786K187K762K650K075K073
57380A15675K723L003K555K241K626L030K725K002J428Q50q1j044j486j490j512
57365A33245j636j674j675j761j729j301o05O6P21J454K000J967J445J004J105
57350A32626J688K333K637K567K472K642K852K630J938J197O55J87j66NP90J575
57334A58628J690J185P06P57J344K102K571K529K215K060K127K124J905J667J587
57319A85197J657J925K481L123L502L647L906M212M095L524L238L760M654N129
$$ plain form
57431 93015 94706 95493 95079 94391 94354 94774 94901 94615 94502 95025 96011 96876 97165 96951 96780 97079 97651 97915 97516
57412 97516 96508 95136 93843 93338 94105 95855 97832 99698 101592 103308 104093 103634 102777 102662 103294 103534
57396 103534 102631 101279 100720 101054 101104 100118 98936 98940 100318 102142 103928 106115 108877 111527 113602 115675
57380 115675 118398 121401 123956 126197 128823 131853 134578 136580 138008 138858 138777 137733 136247 134757 133245
57365 133245 131609 129935 128260 126499 124770 123469 122864 122930 123651 125105 127105 129072 130517 131521 132626
57350 132626 134314 136647 139284 141851 144323 146965 149817 152447 154385 155582 156237 156424 156258 156263 157053 158628
57334 158628 160318 161503 162209 162966 164310 166412 168983 171512 173727 175787 177914 180038 181943 183610 185197
57319 185197 186854 188779 191260 194383 197885 201532 205438 209650 213745 217269 220507 224267 228921 234050
57305B34050N061M922N053N362N647N780N753N748O036O547O853O726O506O591
57291C16635O807O700O258O057O565P583Q488Q953R328J0138J1348J2358J2844
57278D30062J3192J3815J4458J4690J4790J5512J7007J8630J9788K0393K0495
57267F12832K0108J9425J8671J7627J5966J4071J2874J2625J2553J2020J1321
57256G80093J0955J0747J0190R262Q366P845P859Q409R041Q982P999O902O704
57243H93354P539Q775R955J1148J2427J3537J4240J4744J5459J6359J6821J6381
57231A050739J5517J5245J5786J6280J6193J6266J7303J8614J8885J8319J8587
57220A237734K0458K2814K4416K5479K6769K8213K9260K9883L0273L0077K8968
$$ plain form
57305 234050 239111 244033 249086 254448 260095 265875 271628 277376 283412 289959 296812 303538 310044 316635
57291 316635 323442 330142 336400 342457 349022 356605 365093 374046 383374 393512 404860 417218 430062
57278 430062 443254 457069 471527 486217 501007 516519 533526 552156 571944 592337 612832
57267 612832 632940 652365 671036 688663 704629 718700 731574 744199 756752 768772 780093
57256 780093 791048 801795 811985 821247 829613 837458 845317 853726 862767 871749 879748 886650 893354
57243 893354 900893 909668 919623 930771 943198 956735 970975 985719 1001178 1017537 1034358 1050739
57231 1050739 1066256 1081501 1097287 1113567 1129760 1146026 1163329 1181943 1200828 1219147 1237734
57220 1237734 1258192 1281006 1305422 1330901 1357670 1385883 1415143 1445026 1475299 1505376 1534344
57209A534344K7575K6942K7173K7427K7185K6714K6291K5697K4737K3786K3432
57198A821303K3885K4926K6252K7715K9210L0524L1428L1967L2458L2999L3198
57187B145865L2705L1875L1418L1435L1306L0595K9597K8825K8506K8719K9503
57176B480349L0534L1135L0972L0400K9925K9615K9336K9117K9017K8843K8363
57165B807606K7592K6667K5655K4632K3749K3039K2377K1732K1233K0969K0862
57154C066113K0811K0720K0447J9988J9623J9563J9641J9711K0078K1011K2029
57143C289735K2354K1909K1218K0399J9067J7222J5401J3906J2582J1436J0714
57132C475943J0260R650R079R251J0275J1557J2971J5079J7882K0408K2076K3446
$$ plain form
57209 1534344 1561919 1588861 1616034 1643461 1670646 1697360 1723651 1749348 1774085 1797871 1821303
57198 1821303 1845188 1870114 1896366 1924081 1953291 1983815 2015243 2047210 2079668 2112667 2145865
57187 2145865 2178570 2210445 2241863 2273298 2304604 2335199 2364796 2393621 2422127 2450846 2480349
57176 2480349 2510883 2542018 2572990 2603390 2633315 2662930 2692266 2721383 2750400 2779243 2807606
57165 2807606 2835198 2861865 2887520 2912152 2935901 2958940 2981317 3003049 3024282 3045251 3066113
57154 3066113 3086924 3107644 3128091 3148079 3167702 3187265 3206906 3226617 3246695 3267706 3289735
57143 3289735 3312089 3333998 3355216 3375615 3394682 3411904 3427305 3441211 3453793 3465229 3475943
57132 3475943 3486203 3495853 3504932 3514183 3524458 3536015 3548986 3564065 3581947 3602355 3624431 3647877
57120C647877K5041K6215K6062K4804K3640K3584K5031K8068L2787L9431M8343
57109C970883N9294P0998Q2093R2778J04760J19508J37519J59469J86938K21622
57099E205862K64816L18247L84610M66793N67128O87340Q28242R89014J167386
57090A0879438J360169J562428J766339J962005K138868K285409K390419K449850
57082B6794925K471702K466010K424012K310416K083034J722148J241313O75322
57074D2188882O4931n48224j122648j622543k024708k320035k510323k604815
57066B9500517k617236k562551k454955k308085k135311j948464j756777j567395
57058A2149743j386076j216832j061747r21861p97705o88850n93909n11624m41422
$$ plain form
57120 3647877 3672918 3699133 3725195 3749999 3773639 3797223 3822254 3850322 3883109 3922540 3970883
57109 3970883 4030177 4101175 4183268 4276046 4380806 4500314 4637833 4797302 4984240 5205862
57099 5205862 5470678 5788925 6173535 6640328 7207456 7894796 8723038 9712052 10879438
57090 10879438 12239607 13802035 15568374 17530379 19669247 21954656 24345075 26794925
57082 26794925 29266627 31732637 34156649 36467065 38550099 40272247 41513560 42188882
57074 42188882 42253813 41705589 40582941 38960398 36935690 34615655 32105332 29500517
57066 29500517 26883281 24320730 21865775 19557690 17422379 15473915 13717138 12149743
57058 12149743 10763667 9546835 8485088 7563227 6765522 6076672 5482763 4971139 4529717
57049D529717l82599l33666k92791k58412k29245k04331j83173j65287j49720
57040B330493j35607j22942j11926j01884r1885q2190p3759o6410n8796n0300
57030A434794m1441l2256k1784r446M613K0672L8500N3923N8514M5514J6287k0085
57018A547805n3217p6859q9608r3098r0263q3968p5989o7063n7821m9281m2349
57007G68289l7204l3270k9617k5617k1438j7912j5686j4532j3559j2021r892p890
56995E29651o905p171p892p882o677m817l147k039j228q0J939M770P715R946J0873
56980E17056R973O809J760l797q577j2313j5042j6202j5381j3469j1875j0843
56968D28099r597p962o466m891k306J154L953N305O431Q864J2524J6237J9153
$$ plain form
57049 4529717 4147118 3813452 3520661 3262249 3033004 2828673 2645500 2480213 2330493
57040 2330493 2194886 2071944 1960018 1858134 1766249 1684059 1610300 1543890 1485094 1434794
57030 1434794 1393353 1361097 1339313 1329867 1334480 1355152 1393652 1447575 1506089 1551603 1567890 1547805
57018 1547805 1494588 1417729 1328121 1235023 1144760 1060792 984803 917740 859919 810638 768289
57007 768289 731085 697815 668198 642581 621143 603231 587545 573013 559454 547433 537541 529651
56995 529651 522746 515575 507683 499801 493124 488307 485160 483121 481893 481813 483752 488522 496237 506183 517056
56980 517056 527029 533838 535598 531801 523224 510911 495869 479667 464286 450817 438942 428099
56968 428099 418502 410540 404074 399183 396877 398031 401984 407289 413720 422584 435108 451345 470498
56955D70498K0656J9660J5244P937m24q069j4144j8505k1268k2466k1919j9587
56943D07613j6184j2959j0553q436n775k485R00M024P004J0221J4063J8602K3317
56930D29352K7266K9458K8825K4117J4830K505r651j8889k4523k7314k8100k7329
56918D20547k5372k2626j9469j6363j3766j1786j0193q826p682o637n547m598
56906B67682m006l450k407j056j08L03P99J672K452K767K836K845K709K768L843
56891B79649O060Q420J0122J1656J3934J6889J9507K0815K0225J7309J1960M774
56879D41320k968r663j3937j5372j4798j3409j1583r083o238l880k040K94L770
56866C42413P961J2358J7130K2445K8044L3953M0609M7497N2473N3050M7863L6658
$$ plain form
56955 470498 491154 510814 526058 533995 533571 525502 511358 492853 471585 449119 427200 407613
56943 407613 391429 378470 367917 359481 353706 351221 352121 356145 363149 373370 387433 406035 429352
56930 429352 456618 486076 514901 539018 553848 556353 546702 527813 503290 475976 447876 420547
56918 420547 395175 372549 353080 336717 322951 311165 300972 292146 284464 277827 272280 267682
56906 267682 263676 260226 257819 256763 256655 256958 257757 259429 261881 264648 267484 270329 273038 275806 279649
56891 279649 285709 294129 304251 315907 329841 346730 366237 387052 407277 424586 436546 441320
56879 441320 438352 428689 414752 399380 384582 371173 359590 350507 344269 340389 338349 338643 342413
56866 342413 350374 362732 379862 402307 430351 464304 504913 552410 604883 657933 705796 742454
56854G42454K0212J149j6330k8893l5955l8595l7612l3643k8139k2704j7599j2047
56842D92298n705J008P781J4654K1748K9563L9231N1384O4866P7116Q5450Q7273
56830I66667P9895O1799L4556K861k7535n1804o7140p3454p3134o9058o2592n3958
56818F67103m4043l4568k6440j9055j1521l634M528J3115K2191L1523M0953N0253
56806F90405N8080O1681N8130M6039K6315K106k1930m1254n3453n8922n9588n7164
56794F50445n2549m6307l9184l2097k5758k0277j5106r633l822J884P205J2413
56782D27214J7943K3687K8658L1324L0340K5120J5850L384j0538k3235l2148l6417
56770E01182l7125l5862l3434l0173k6653k3505k0791j8212j5731j3539j1570
$$ plain form
56854 742454 762666 763815 747485 718592 682637 644042 606430 572787 544648 521944 504345 492298
56842 492298 486593 487601 495382 510036 531784 561347 600578 651962 716828 793944 879394 966667
56830 966667 1046562 1108361 1142917 1145778 1118243 1066439 999299 925845 852711 783653 721061 667103
56818 667103 623060 588492 562052 542997 531476 527842 532370 545485 567676 599199 640152 690405
56806 690405 748485 810166 868296 914335 940650 942756 920826 879572 826119 767197 707609 650445
56794 650445 597896 551589 512405 480308 454550 434273 419167 409534 405712 407596 414801 427214
56782 427214 445157 468844 497502 528826 559166 584286 600136 603520 592982 569747 537599 501182
56770 501182 464057 428195 394761 364588 337935 314430 293639 275427 259696 246157 234587
56759B34587r566p572n959m990m495m035l222k143j423j570k171k204j369n33
56745A83335n58j240j781j879j801j689j448j102q40p79q57q58m46M54J242J136
56729A70889K16n85p67q11j154j362q79N6Q63J413J814J886J476Q92M79J72j39
56712A74459k83k71m38p08m16N74J392J445J357J857K528K561K019J412P37p2
56696A88153m66j62j7p11j311n73Q68J246L61k61J66O60K80n01p94m91Q1P16J100
56677A88344Q43J03m29m72l91m28l99k23J9N25J431K064J588M35j9N95J174R37
56659A95697M83N38P67N98L37N76J120J284Q27O2n86o52K44J770K817K576J389
56642B09847K20l64l36J86R34J423J395J145J036R16L92m36r17o11J39M62j71
$$ plain form
56759 234587 225021 217449 211490 206500 202005 197970 194748 192605 191182 189612 187441 185237 183868 183335
56745 183335 182777 181537 179756 177877 176076 174387 172939 171837 170997 170218 169361 168503 168057 168511 169753 170889
56729 170889 171105 170520 169753 168942 167788 166426 165547 165603 166466 167879 169693 171579 173055 173947 174426 174598 174459
56712 174459 174176 173905 173467 172759 172343 172917 174309 175754 177111 178968 181496 184057 186076 187488 188225 188153
56696 188153 187687 187525 187508 186797 185486 184913 185781 187027 187388 187127 187293 187953 188233 187732 186938 186447 186528 187244 188344
56677 188344 189187 189290 188861 188389 187998 187570 187171 186948 186967 187492 188923 190987 192575 193010 192991 193586 194760 195697
56659 195697 196180 196718 197485 198083 198420 198996 200116 201400 202227 202289 201703 201051 201295 203065 205882 208458 209847
56642 209847 210067 209703 209367 209553 210487 211910 213305 214450 215486 216402 216794 216358 215441 214830 214969 215431 215260
56625B15260j316j955j564o49n3M6K3M5j06n29j037j503j923k143j948j408q09
56608A98431l05J9q1p10j451j689j313o77o8L80M75K11K5K30M14M0n35l95O35
56589A93636J738K134J765R83J85k31j15J96L07L31N31P07O13O11J146J814J844
56572B08195J329J079J350J671J807J940J957J651J626K848N072O865P521P915
56558B52826R079J0935J2756J3898J3596J1148P004K928L95n96p47l43M58R50
56544C34287M67o85j564j720j573j815k730l901m485m043l079k424k286k371k741
56529B99337l746n093n869n726n213m753m107l161k493k666l482m289m595m194
56515B39950l192k100j462j281j221j192j212r42j82M78M23J71O28J403J233J17
$$ plain form
56625 215260 213944 211989 210425 209776 209723 209769 209792 209837 209731 209202 208165 206662 204739 202596 200648 199240 198431
56608 198431 198126 198145 198064 197354 195903 194214 192901 192224 192156 192536 193011 193222 193247 193477 193891 193931 193396 193001 193636
56589 193636 195374 197508 199273 200256 200441 200210 200095 200291 200598 200929 201460 202167 202780 203391 204537 206351 208195
56572 208195 209524 210603 211953 213624 215431 217371 219328 220979 222605 225453 230525 237390 244911 252826
56558 252826 261905 272840 285596 299494 313090 324238 331242 334170 334565 333969 333222 332879 333337 334287
56544 334287 334754 334069 332505 330785 329212 327397 324667 320766 316281 312238 309159 306735 304449 302078 299337
56529 299337 295591 290498 284629 278903 273690 268937 264830 261669 259176 256510 253028 248739 244144 239950
56515 239950 236758 234658 233196 231915 230694 229502 228290 227348 227166 227644 228067 228238 228866 230269 231502 231619
56499B31619n88l15mj92p6P64J288O63k55l26J11K1o49j228j567j892k009j660
56481B23705j132p32j49Q03J471J274P47P49J126J113O07J57L6J96P24J557K087
56464B34339J868J377J286J374R74J79l14l06k23k39l2N26J072J140N35n60j526
56447B41470j608o79N52J336J551J415J034N97M18M53K91q1j24L17P28R09J326
56430B49905J969J938R02n1j8K80j97r51q00M1K82l44q14o32m63p59r81o05QK55
56410B48965J25j4N0K58M02K20k73o28m59J9L83O79J178J690J673J068M25J81
56392B55942K52L57L96M45O65J094J408J130L48j41K21R94J348J153J004J322
56376B67938J859K034J462L08o56o48K20R55Q59K83l3P0K74M19N49O05N21M43
$$ plain form
56499 231619 231031 230716 230712 230520 230444 231208 232496 233159 232904 232578 232689 232710 232061 230833 229266 227374 225365 223705
56481 223705 222573 221841 221692 222495 223966 225240 225987 226736 227862 228975 229582 229739 229775 229971 230695 232252 234339
56464 234339 236207 237584 238870 240244 241218 241397 241083 240777 240554 240315 240283 240809 241881 243021 243556 242996 241470
56447 241470 239862 239183 239735 241071 242622 244037 245071 245668 246086 246539 246830 246749 246625 246942 247670 248579 249905
56430 249905 251874 253812 254714 254663 254645 254925 254728 253777 252977 253018 253300 252956 252142 251510 251047 250288 249307 248702 248710 248965
56410 248965 249090 249076 249126 249384 249786 250006 249733 249105 248646 248665 249048 249727 250905 252595 254268 255336 255761 255942
56392 255942 256194 256551 256947 257392 258057 259151 260559 261689 262037 261896 262117 263111 264459 265612 266616 267938
56376 267938 269797 271831 273293 273601 272945 272297 272517 273472 274331 274614 274581 274651 274925 275344 275893 276498 277019 277462
56358B77462N26P38J017J326J516J497J554J997K495K438J941J619J429P27k70
56343B98012l57Q48K117K303J740J276J032R74J600K943L885L587K793K563K466
56328C27782J473o1p18l1J125J971K472K694K552K273K164K020J419N06k19n87
56312C46835o45k41N87J197J124Q61J079J554J730J827K432L377M053M509N207
56297C75486N989O226N824N142M176K767J450J059J569K128K262K251K428K838
56283D21595L520M430N208N581N901O630P547Q000P834P481P365P635Q227Q882
56269E15836R478J0478J2357J4382J5048J4196J3582J4595J6585J8396K0286K3014
56257F98233K6126K8757L1412L5325M0466M5700N0686N6224O2850P0293P8167
$$ plain form
56358 277462 277988 278726 279743 281069 282585 284082 285636 287633 290128 292566 294507 296126 297555 298282 298012
56343 298012 297655 298503 300620 302923 304663 305939 306971 307945 309545 312488 316373 319960 322753 325316 327782
56328 327782 329255 329194 328476 328445 329570 331541 334013 336707 339259 341532 343696 345716 347135 347641 347422 346835
56312 346835 346190 345949 346536 347733 348857 349718 350797 352351 354081 355908 358340 361717 365770 370279 375486
56297 375486 381475 387701 393525 398667 402843 405610 407060 408119 409688 411816 414078 416329 418757 421595
56283 421595 425115 429545 434753 440334 446235 452865 460412 468412 476246 483727 491092 498727 506954 515836
56269 515836 525314 535792 548149 562531 577579 591775 605357 619952 636537 654933 675219 698233
56257 698233 724359 753116 784528 819853 860319 906019 956705 1012929 1075779 1146072 1224239
56246A224239Q6206R3939J01120J08118J15088J21083J24865J26099J24926J21028
56236B346711J13998J03970R0924P4290N4246L2583J1037j0178l1021m9996o5544
56225B671020p8073q8804r7481j03057j05908j07290j07219j04915j00945r6829
56215A680499r2801q7895q2041p6129p0292o4131n8337n4027n0533m6075m0682
56204I57556l6311l3872l2161l0061k7729k5285k2305j9167j7029j5941j4612
56193F83083j2516j0552r242p968o510n640n536n171l909k379j277n97m18j073
56179F10295k132k527k031j408r87m18J23O2j99M04J724K472K377K552L505M454
56163F18266M960N570O370O578O097N955O672P607Q276Q989R828J0410J0930J2119
$$ plain form
56246 1224239 1310445 1404384 1505504 1613622 1728710 1849793 1974658 2100757 2225683 2346711
56236 2346711 2460709 2564679 2655603 2729893 2784139 2816722 2827759 2817581 2786560 2736564 2671020
56225 2671020 2592947 2504143 2406662 2303605 2197697 2090407 1983188 1878273 1777328 1680499
56215 1680499 1587698 1499803 1417762 1341633 1271341 1207210 1148873 1094846 1044313 998238 957556
56204 957556 921245 887373 855212 825151 797422 772137 749832 730665 713636 697695 683083
56193 683083 670567 660015 650773 642805 636295 630655 625119 619948 616039 613660 612383 611786 611368 610295
56179 610295 608163 605636 603605 602197 601210 600792 600915 600977 600778 601182 602906 605378 607755 610307 613812 618266
56163 618266 623226 628796 635166 641744 647841 653796 660468 668075 676351 685340 695168 705578 716508 728627
56149G28627J4016J6075J8426K1570K4979K7770L0666L5453M2528N0787N9941
56138A070838P0716Q2613R3477J01545J06019J05626R9149Q7844P5260O4082N4967
56127B012136M8417M5134M3889M1427L5557K6639J5857M217o329j3359j6610j8452
56115B218523k1316k6546l5507m8937o4596p8188q7473r3141r5423r2953q5895
56104A488548p7026o8332n9210m9262m0168l3220k7532k2178j7816j4768j1843
56093A067193q507n987m815l531j149J311K969M516O233O986O456O111O672O985
56079A091443O541O627P793Q715Q836R430J0837J1403J0602J0336J1610J2860
56067A207033J3105J3726J5403J6322J5507J4890J6027J7577J8157J8827K0521
$$ plain form
56149 728627 742643 758718 777144 798714 823693 851463 882129 917582 960110 1010897 1070838
56138 1070838 1141554 1224167 1317644 1419189 1525208 1630834 1729983 1817827 1893087 1957169 2012136
56127 2012136 2060553 2105687 2149576 2191003 2226560 2253199 2269056 2273273 2266944 2253585 2236975 2218523
56115 2218523 2197207 2170661 2135154 2086217 2021621 1943433 1855960 1762819 1667396 1574443 1488548
56104 1488548 1411522 1343190 1283980 1234718 1194550 1161330 1133798 1111620 1093804 1079036 1067193
56093 1067193 1058686 1052699 1047884 1044353 1043204 1044515 1047484 1052000 1058233 1065219 1071675 1077786 1084458 1091443
56079 1091443 1097984 1104611 1112404 1121119 1129955 1139385 1150222 1161625 1172227 1182563 1194173 1207033
56067 1207033 1220138 1233864 1249267 1265589 1281096 1295986 1312013 1329590 1347747 1366574 1387095
56056A387095K1773K1377K0681K0962K1106K0063J9052J9172J9414J9081J9459
56045A609235K1075K2071K1465K1158K2615K4420K5233K6155K8071K9702L0423
56034A881623L1770L4191L5712L5857L7147M0520M3288M3947M4743M6953M8160
56023B323911M7166M6956M9477N2162N3102N4813N9137O3309O5225O7637P2618
56012B955513P6960P7981P8943Q3352Q8686R1402R3533R8404J04132J07607J10812
56001C967325J17044J24672J30723J36781J45404J54613J61967J69823J80665
55992E289017J91753K00632K10986K26287K42890K56579K70701K90086L12314
55983G491245L33179L55372L83090M13564M43022M75531N16504N63150O11082
$$ plain form
56056 1387095 1408868 1430245 1450926 1471888 1492994 1513057 1532109 1551281 1570695 1589776 1609235
56045 1609235 1630310 1652381 1673846 1695004 1717619 1742039 1767272 1793427 1821498 1851200 1881623
56034 1881623 1913393 1947584 1983296 2019153 2056300 2096820 2140108 2184055 2228798 2275751 2323911
56023 2323911 2371077 2418033 2467510 2519672 2572774 2627587 2686724 2750033 2815258 2882895 2955513
56012 2955513 3032473 3110454 3189397 3272749 3361435 3452837 3546370 3644774 3748906 3856513 3967325
56001 3967325 4084369 4209041 4339764 4476545 4621949 4776562 4938529 5108352 5289017
55992 5289017 5480770 5681402 5892388 6118675 6361565 6618144 6888845 7178931 7491245
55983 7491245 7824424 8179796 8562886 8976450 9419472 9895003 10411507 10974657 11585739
55974A1585739O64257P28020P98991Q73137R57116J059588J178521J310190J462900
55965B0618459J647746J864176K110784K402166K758658L189595L706686M344001
55957D2642271N143348O131601P338261Q823946J0664457J2926205J5700130J9140906
55949A28511125K3390925K8394694L3720992L8440603M1080936L9861651L3434853
55942C66835779K1856819O989457q194852k0960074k9796229l4516675l5769406
55935B66444819l4524207l1757451k8271946k4614525k1105539j7920016j5134620
55928I3116515j2746684j0714176q999537p572535o391578n409880m595441l926740
55920C2759944l375597k911938k519939k193565j920784j686211j484160j314962
$$ plain form
55974 11585739 12249996 12978016 13777007 14650144 15607260 16666848 17845369 19155559 20618459
55965 20618459 22266205 24130381 26241165 28643331 31401989 34591584 38298270 42642271
55957 42642271 47785619 53917220 61255481 70079427 80743884 93670089 109370219 128511125
55949 128511125 151902050 180296744 214017736 252458339 293539275 333400926 366835779
55942 366835779 388692598 395682055 387487203 366527129 336730900 302214225 266444819
55935 266444819 231920612 200163161 171891215 147276690 126171151 108251135 93116515
55928 93116515 80369831 69655655 60656118 53083583 46692005 41282125 36686684 32759944
55920 32759944 29384347 26472409 23952470 21758905 19838121 18151910 16667750 15352788
55912A5352788j172151j045551r33163q38132p57418o84305o18701n64291n18546
55903H220530m75566m35825m03444l76426l49059l21619k98677k79723k60121
55894E020070k39676k22084k07306j92191j77350j65952j56912j46206j33993
55885C378400j23713j15258j05537r4925q6923q2190p8716p6965p8935q2840q4376
55874B368022q2856q0994p9329p5982p1299o7669o5203o2105n8744n6908n5773
55863A611160n3016m9065m6003m3328l9260l5136l3790l4360l3448l0802k9196
55852A183756k9085k8062k5506k3454k2769k2438k2506k3851k5157k4051k1212
55841I15665j9675k0162k0662k0356k0287k0266j8919j6705j5479j5073j3763
$$ plain form
55912 15352788 14180637 13135086 12201923 11363791 10606373 9922068 9303367 8739076 8220530
55903 8220530 7744964 7309139 6905695 6529269 6180210 5858591 5559914 5280191 5020070
55894 5020070 4780394 4558310 4351004 4158813 3981463 3815511 3658599 3512393 3378400
55885 3378400 3254687 3139429 3033892 2938967 2852044 2769854 2691138 2614173 2535238 2452398 2368022
55874 2368022 2285166 2204172 2124843 2048861 1977562 1909893 1844690 1782585 1723841 1666933 1611160
55863 1611160 1558144 1509079 1463076 1419748 1380488 1345352 1311562 1277202 1243754 1212952 1183756
55852 1183756 1154671 1126609 1101103 1077649 1054880 1032442 1009936 986085 960928 936877 915665
55841 915665 895990 875828 855166 834810 814523 794257 775338 758633 743154 728081 714318
55830G14318j1918j1495j2116j1354r026p516p615p603o881o943q230r237r385
55817E94999r690j0207r812q941r415j1040j1442r899q326p796p046n252l491
55804D82642k498j485o4J013J764L283N475O699O364N670N252M252K355N56o76
55789E20602j984l389l965l756l899m486m334l414l351m960p264r392j1496j3281
55775D41631j3609j2193r848o790k457K652P020J0266J3139J4941J3315P502j63
55762D65406o810j1412j3959j4249j2596j0279q314o776n718n435n648n683n693
55749C52834o336p236p423p173p614q486q321o988n913n495m539k742j571j857
55735B71140k521k565k514l007l599l784l743l512k891k620l863o008o854n645
$$ plain form
55830 714318 702400 690905 678789 667435 658409 650893 643278 635675 628794 621851 613621 604384 594999
55817 594999 585309 575102 565290 556349 546934 535894 524452 514553 506227 498431 491385 486133 482642
55804 482642 480144 478659 478595 479608 481372 484655 490130 496829 503193 508863 514115 518367 520722 521278 520602
55789 520602 518618 515229 511264 507508 503609 499123 494789 491375 488024 483064 475800 466408 454912 441631
55775 441631 428022 415829 405981 399191 396734 399386 406406 416672 429811 444752 458067 465569 465406
55762 465406 458596 447184 433225 418976 406380 396101 387787 381011 375293 369858 364210 358527 352834
55749 352834 346498 339262 331839 324666 317052 308566 300245 293257 287344 281849 277310 274568 272997 271140
55735 271140 268619 266054 263540 260533 256934 253150 249407 245895 243004 240384 236521 230513 223659 218014
55721B18014m095l632l615l109k572k503k117o34J400L144M630N923O378N740
55707B22952M828M315L838K991J998Q32j104l664n615o286o405o669o761o421
55693A98829o133o088n700m784l985l422k361p47L52N14O48J208J372Q32P74J932
55677A73241L201L367K924K909L168K995K427J772P71o28j608j613j299j452j804
55662A88371j779j498j244q47l18j70l68n0J030J920K028K057K510K678K046J425
55646A97791J505J499M89r01j493j296j153j367j717k174k663k939l359m749o771
55631A70702p663o600m966m232l912k951j803j491j748j714j591j917k079j233
55617A26802m1K01l52n98n00r04j692j889j452j320j728j928j690j603j791j568
$$ plain form
55721 218014 213919 210287 206672 203563 200991 198488 196371 195737 197137 200281 204911 210834 217212 222952
55707 222952 227780 232095 235933 238924 240922 241754 240650 236986 231371 225085 218680 212011 205250 198829
55693 198829 192696 186608 180908 176124 172139 168717 166356 165609 165961 166475 167123 168331 169703 170535 171309 173241
55677 173241 176442 179809 182733 185642 188810 191805 194232 196004 196775 196147 194539 192926 191627 190175 188371
55662 188371 186592 185094 183850 183003 182685 182515 182147 182097 183127 185047 187075 189132 191642 194320 196366 197791
55646 197791 199296 200795 201284 200383 198890 197594 196441 195074 193357 191183 188520 185581 182222 177473 170702
55631 170702 163039 156439 151473 147241 143329 140378 138575 137084 135336 133622 132031 130114 128035 126802
55617 126802 126761 126962 126610 126012 125512 124608 122916 121027 119575 118255 116527 114599 112909 111306 109515 107947
55601A07947o81K65P68Q65M95n27j766k343k079j601j290q52j29M57N17J84j54
55584A00076k53n0L15N52N44M01J64j91k89M36J776K685K596K048J639J249Q87
55567A14585J204K321L080K502J212L60q8q05j665k070k177k473k669k296j896
55552A09125k232k735k227r23k08n23r13p32m12l41k71n1J38M21J145J984K132
55535A03377J567J121J191J327J190R87Q03L85k08o04q57j335j882j954j685j764
55519A01659k177k126j435r63j256j736j740j484j461j567j377p93KQ10J294J058
55503H6708J10j052j940k371k296j827j336j133j019p36n53q03j071o74J68N44
55487G0719J70l41n24l79K49J534K724K609J203m4j97N4j94o44n98k48k24m17
$$ plain form
55601 107947 107266 107531 108299 109164 109659 109132 107366 105023 102944 101343 100053 99201 99072 99529 100046 100230 100076
55584 100076 99823 99773 100088 100640 101184 101585 101749 101558 101269 101705 103481 106166 108762 110810 112449 113698 114585
55567 114585 115789 118110 121190 123692 124904 125264 125176 124371 122706 120636 118459 115986 113317 111021 109125
55552 109125 106893 104158 101931 101008 100800 100277 99364 98632 98220 97879 97608 97557 97695 98116 99261 101245 103377
55535 103377 104944 106065 107256 108583 109773 110760 111563 111948 111740 111136 110279 108944 107062 105108 103423 101659
55519 101659 99482 97356 95921 94958 93702 91966 90226 88742 87281 85714 84337 83544 83546 84356 85650 86708
55503 86708 86818 85766 83826 81455 79159 77332 75996 74863 73844 73108 72555 71752 70681 70007 70175 70719
55487 70719 70889 70548 70024 69645 69894 71428 74152 76761 77964 77920 77723 77777 77583 76939 76341 76093 75869 75452
55469G5452k34L40O74L54m71j410j991j783q68M2L33J85J52L52N18N92Q07J213
55451G4257J540J522J121M85j35m91n20l81j58K43P91J134R11K18m49o95o01n59
55433G8233p58q26k15J003K003K113J569J009N14k30j042j232o75j47k49n82l59
55416H0129M79J291J608J544J313Q31j3q99j236q40k39j04n15j013j277j332j177
55399G8550p48l26l59o45l98N18J169R24M97Q15J466J388O08J13J39j08q62j186
55381H1555l73J004J928K142K003J797J627J521J245M41p17j501j530j297j437
55366H8408j934k334k353j997j398q06m68l17j45j22o21j396j563p75J60L22j50
55349G2511m29k28Nl0q9J16M06L96L0l36l87k41k53m83n60k42J81L03J92J92L02
$$ plain form
55469 75452 75218 75558 76232 76586 76115 74705 72714 70931 70063 70105 70438 70623 70775 71127 71645 72237 73044 74257
55451 74257 75797 77319 78440 78925 78790 78299 77779 77398 77240 77483 78274 79408 80319 80537 80088 79393 78792 78233
55433 78233 77475 76649 76434 77437 79440 81553 83122 84131 84645 84415 83373 82141 81466 81319 81070 80488 80129
55416 80129 80608 81899 83507 85051 86364 87195 87182 86283 85047 84207 83968 83864 83349 82336 81059 79727 78550
55399 78550 77802 77476 77117 76472 76074 76592 77761 78685 79182 79997 81463 82851 83459 83572 83711 83603 82741 81555
55381 81555 81182 82186 84114 86256 88259 90056 91683 93204 94449 94890 94173 92672 91142 89845 88408
55366 88408 86474 84140 81787 79790 78392 77586 77118 76801 76656 76534 75913 74517 72954 72179 72339 72661 72511
55349 72511 72082 71854 71859 71829 71740 71856 72262 72658 72688 72352 71965 71724 71471 70988 70428 70186 70367 70670 70862 71054 71356
55328G1356J65l01p44q10m29K70R36J056M94j12q7L29L84J14L49J298K035J835
55310G8138J264J313J889J942Q46q44k025k057j224l71j14l14m02j48J36J20j63
55293G7986n27p88o97m8R13J549J472R01L16J6P5M06P10O73L01j08l21l10q8K25
55273H2656L11j9m95p39q32j022j120p60j50J59J81M21Q87J046Q41Q89J357J565
55255H5176J067L66P3O8Mk3J14P2m06r55j131j125j342j602j348m06Q83K008K467
55236H3960J970Q29j33m35l54k85k02o9k49r15j543j528j006n39l13j13J63M51
55218G9689P23Q24L97n40j270j096j98O39Q97N87l0n43n31J6N97Q33Q66Q14L95
55199H3069m50j083r07k62J11J07J34K03l1n07o90l93l5m4m26q54q71j78R19J543
$$ plain form
55328 71356 71521 71220 70476 69666 69237 69507 70443 71499 71993 71881 71794 72123 72507 72621 72970 74268 76303 78138
55310 78138 79402 80715 82604 84546 85392 84548 82523 80466 79242 78871 78757 78443 78041 77893 78029 78149 77986
55293 77986 77459 76671 75974 75926 76839 78388 79860 80761 81077 81093 81168 81574 82284 82957 83258 83150 82829 82519 82431 82656
55273 82656 82967 82948 82453 81714 80882 79860 78740 77980 77830 77989 78170 78591 79478 80524 81365 82254 83611 85176
55255 85176 86243 86609 86682 86750 86754 86731 86845 86917 86511 85556 84425 83300 81958 80356 79008 78602 79485 81493 83960
55236 83960 85930 86759 86626 86191 85837 85552 85350 85281 85032 84117 82574 81046 80040 79501 79188 79075 79238 79689
55218 79689 80412 81236 81633 81093 79823 78727 78529 79168 80065 80652 80622 80079 79548 79564 80161 80994 81860 82674 83069
55199 83069 82619 81536 80629 80367 80478 80585 80719 80922 80891 80384 79694 79301 79266 79222 78796 77942 77071 76893 77812 79355
55179G9355J198M28J12L25M77L07R6oj51l46l67j70P0L04N49O03L61K26O24J232
55159H5227J297P56K92K36J33m13j018j053m53K57N43K33m16q51o62j3N39O44
55141H5278M52L30N28J129J966K597K510J581K29q33j100o78k68m65j017j149
55125I1090o33n4J80L36N40K51p03j340p10N32Q71Nr22j044o80l34P3O66J115
55106H9239J116P53J55o05j079o80L33Q69M25j66J41J253K218K318J559M72j43
55089I8178K28J109J361N94k73l02K01L15j47o48r45j186j245p51J03N68K68l44
55071I7084o71n74j97L22P41P24L11N3M10J089J280M67j050k385k735k068j166
55054I1635q38j041r92k61O54R72O48K55J52K15L69P32J200J325R62N47M36L72
$$ plain form
55179 79355 80553 80981 81093 81418 81895 82202 82298 82292 82141 81795 81428 81258 81328 81632 82181 82784 83145 83371 83995 85227
55159 85227 86524 87280 87572 87808 87941 87528 86510 85457 85004 85261 85804 86037 85621 84770 84108 84095 84634 85278
55141 85278 85730 86060 86588 87717 89683 92280 94790 96371 96600 95767 94667 93989 93721 93256 92239 91090
55125 91090 90457 90403 90583 90919 91459 91710 91007 89667 88957 89489 90360 90365 89443 88399 87719 87385 87458 88124 89239
55106 89239 90355 91108 91263 90658 89579 88899 89232 90101 90526 90360 90501 91754 93972 96290 97849 98321 98178
55089 98178 98406 99515 100876 101470 101197 100895 101096 101411 101264 100616 99671 98485 97240 96489 96592 97160 97428 97084
55071 97084 96413 95839 95642 95964 96705 97429 97740 97793 98203 99292 100572 101039 99989 97604 94869 92801 91635
55054 91635 90797 89756 88764 88503 89157 90129 90777 91032 91184 91399 91768 92500 93700 95025 95987 96534 96970 97342
55036I7342P0j29K00P04O31j5m96m59k77j99J5L58L39j11k89J84O65N20J81L65
55016I9599Q21P85K85KN6n0l97m89k59k54o03o88j90L01J86k09r4O96J556J790
54996A02844J202K11l76pJ009J723J511O75k5j50J47M15K57l71j109j497j383
54979A05076r95p16q57j352j523n87J235K564K358J169L15K01K85L21N08N75n8
54962A08519r91j018R1J073J034O38P32Q43J23j020j450j007m90k36J36O43P28
54945A08348L00K6K51M33J31k07K3M88K80p96j858j898p83Q15K137K774K630J813
54927A14907O87k19n65l70J76R43J761K435L027L919N156O096O177N799N785O071
54911A61785N743M407K720J244l31k370m349n443n619n488n395n222m883m412
$$ plain form
55036 97342 97412 97283 97483 98187 98818 98803 98307 97848 97571 97372 97387 97745 98084 97973 97684 97868 98533 99053 99234 99599
55016 99599 100420 101205 101490 101492 101548 101498 101101 100612 100353 100099 99496 98808 98618 98919 99105 98896 98802 99498 101054 102844
54996 102844 104046 104257 103881 103874 104883 106606 108117 108792 108767 108617 108764 109179 109436 109065 107956 106459 105076
54979 105076 104081 103365 102508 101156 99633 99046 100281 102845 105203 106372 106687 106888 107173 107494 108002 108577 108519
54962 108519 107528 106510 106601 107674 108708 109346 110078 110921 111044 110024 108574 107567 107077 106841 106977 107620 108348
54945 108348 108648 108674 108925 109358 109489 109282 109305 109793 110073 109277 107419 105521 104738 105553 107690 110464 113094 114907
54927 114907 115594 115375 114810 114440 114616 115559 117320 119755 122782 126701 131857 137953 144130 149929 155714 161785
54911 161785 167528 171935 174655 175899 175568 173198 168849 163406 157787 152299 146904 141682 136799 132387
54897A32387l723k774j869j391j294j245j125j025r16p08n41n67n72k04M99J129
54881A16061J444J525J497J425J423J611J997K698M038O068Q101R117Q617O823
54867A72445M245J535n12j443j799k669m374n991o462n834n034m680m535m088
54853A30804l339k695k319j891j139l79k12p60j513j957k032j860j410o89K5M16
54837A09050M07M4o14j295j529j184o99m26j03O17J427J709J422J068Q47N20O9
54820A11330r5J71M04J72l60p53q83q94q24n93k80q6q3j50j61q8J03M42P95Q05
54800A08972K43n42p65j3J173J813J555R33N51M42L60K74K21j4o77j543j996j611
54782A09376n24O78J341J206O59L74O13J099J599K199K836L020K493J779J594
$$ plain form
54897 132387 128664 125890 124021 122630 121336 120091 118966 117941 117025 116317 115776 115209 114637 114433 114932 116061
54881 116061 117505 119030 120527 121952 123375 124986 126983 129681 133719 139787 147888 157005 165622 172445
54867 172445 176690 178225 177713 176270 174471 171802 167428 161437 154975 149141 144107 139427 134892 130804
54853 130804 127465 124770 122451 120560 119421 119042 118830 118070 116557 114600 112568 110708 109298 108609 108634 109050
54837 109050 109457 109501 108887 107592 106063 104879 104180 103754 103651 104268 105695 107404 108826 109894 110741 111261 111330
54820 111330 111235 111406 111810 111982 111622 110869 109986 109092 108268 107675 107395 107309 107226 107076 106915 106827 106930 107372 108167 108972
54800 108972 109215 108673 107908 107895 109068 110881 112436 113369 113920 114362 114722 114996 115217 115203 114526 112983 110987 109376
54782 109376 108852 109530 110871 112077 112736 113110 113723 114822 116421 118620 121456 124476 126969 128748 130342
54767A30342J961K357K540K705L040L556M300N293O250O753O617N846M408K429
54753A88397L74j337k744m021m997n418n478n589n793n845n639n109m040k527
54739A30234j308r04q01k19O07Q54N78O43J192J396R40N87P92Q61K00n13j94J159
54721A36104K653L659M173M383M570N145O139O863O463M765K273l49k506l805
54707A80530m363m725n169n396n184m855m725m542l902k892j883j056n45o05j124
54692A29564j384r20k49k44j010j918k464k487j878p06N20J255J449J210M11q19
54676A20330j599j193j08N56O18P43J023P32l83j543j970j689j013n6Q97J286
54660A16631R54L47k05p33j007n26M75R06K50o80r51p49o53n33n9L60K25K8N36
$$ plain form
54767 130342 132303 134660 137200 139905 142945 146501 150801 156094 162344 169097 175714 181560 185968 188397
54753 188397 188771 187434 184690 180669 175672 170254 164776 159187 153394 147549 141910 136801 132761 130234
54739 130234 128926 128022 127221 127002 127609 128463 129041 129684 130876 132272 133212 133799 134591 135452 135652 135139 134945 136104
54721 136104 138757 142416 146589 150972 155542 160687 166826 173689 180152 184917 187190 186841 184335 180530
54707 180530 176167 171442 166273 160877 155693 150838 146113 141571 137669 134777 132894 131838 131293 130688 129564
54692 129564 128180 127260 127011 126767 125757 123839 121375 118888 117010 116304 116824 118079 119528 120738 121149 120330
54676 120330 118731 117538 117430 117986 118604 119347 120370 121102 120719 119176 117206 115517 114504 114448 115345 116631
54660 116631 117585 117932 117727 116994 115987 115461 115936 116842 117092 116412 115461 114712 114059 113526 113467 113827 114052 114080 114616
54641A14616J322J314O21M77J205J616Q79j96m99k08j88m83m66p6J79J98L69O45
54623A21325L99n09j304j293q18o91j041j193o37K80P69M73j85m71k2R03J738
54606A17723J985J458L76o19q81l96J79L16K52M86Q69P61N7m94k79L79P01M29
54588A23302j40p56j376j734j349j86J048J518J126N31L33M87N70M61M03M30J27
54571A24795p17j510j467p36k59m09m08M06J420J471M60n78q26m17K00Q28J288
54554A23541J253P27J97lq3k68l44r5K25L09L42O05Q36O13J86L04J148K030K255
54535A33778J808J088M14j4r2lq4l15k72J42L55r8p70q71l89p3k54l70M8N56L96
54514A34980l67r16q03l99j97j70o0O1k6j96j24J19R3k85m36J23J009J360Q77
$$ plain form
54641 114616 115938 117252 117873 118350 119555 121171 122050 121854 121355 121147 120959 120476 120010 119934 120113 120311 120680 121325
54623 121325 121724 121215 119911 118618 117800 117109 116068 114875 114238 114518 115287 115760 115575 115104 115082 115985 117723
54606 117723 119708 121166 121542 120923 120042 119646 119825 120141 120393 120879 121748 122509 122566 122072 121793 122172 122873 123302
54588 123302 123162 122406 121030 119296 117947 117761 118809 120327 121453 121984 122317 122804 123374 123835 124238 124668 124795
54571 124795 124078 122568 121101 120365 120106 119697 119289 119695 121115 122586 123046 122468 121642 121225 121425 122253 123541
54554 123541 124794 125521 125718 125715 125632 125364 125020 124925 125150 125459 125801 126406 127242 127855 128041 128345 129493 131523 133778
54535 133778 135586 136674 137088 137074 136982 136979 136895 136580 136308 136450 136805 136707 135937 135066 134677 134604 134350 133980 134028 134584 134980
54514 134980 134613 133697 132894 132495 132298 132128 132068 132129 132103 131907 131783 131902 131995 131710 131274 131397 132406 133766 134643
54495A34643R3l83n07n21m53k36n3j60m25m59k15l8k6J51N88P41J68o56q18j70
54475A31264N50P63O69O62O83N36M18O43J087J287J057O52L79L19M54P91J281
54458A43495J665J534O80n07j204j005m54l00l77N5Q24P13o29j701j008P30J519
54441A44030Q15J7J63N74K47n38q83o70m81n40o02n62n48m77j76K24M16L85L14
54422A41708J99o2k78j21M15R99J399J584J470R65K43k92m18k63j34l01q51j536
54404A44726j840j412l64Q98J924K211J437Q7n36L56J918K529J721N94K19M03
54388A54871M03K02L66R56J275P77k47j023j138q39o88r83j454j519q95J3N34
54371A50611M48J98K54N51O79M76K09K07N87J292K063K367J769O15q7K32J044
$$ plain form
54495 134643 134736 134353 133846 133325 132872 132636 132583 132423 131998 131539 131324 131286 131260 131411 131999 132740 132908 132252 131434 131264
54475 131264 131814 132577 133246 133908 134591 135127 135545 136188 137275 138562 139619 140271 140650 140969 141423 142214 143495
54458 143495 145160 146694 147374 146867 145663 144658 144204 143904 143527 143582 144406 145119 144490 142789 141781 142511 144030
54441 144030 144845 144862 145025 145599 145846 145308 144425 143755 143274 142734 142132 141570 141022 140545 140369 140593 141009 141394 141708
54422 141708 141907 141845 141567 141446 141861 142860 144259 145843 147313 148278 148521 148229 147811 147548 147414 147113 146262 144726
54404 144726 142886 141474 141110 142008 143932 146143 147580 147667 147131 147487 149405 151934 153655 154249 154468 154871
54388 154871 155274 155476 155842 156798 158073 158850 158603 157580 156442 155603 154915 153932 152478 150959 150064 150077 150611
54371 150611 151059 151257 151511 152062 152741 153217 153426 153633 154220 155512 157575 159942 161711 162326 162239 162471 163515
54354A63515J535J690J998K359K180J478J068J340J650J326O23J54j62q43j839
54339A78072k479k357j794j390j415j665j698j327r61j192j935k374k068j538
54325A53879j413j414q71J62R66J139Q56L15l58q07p30m42n09q34q15l64n7j31
54307A48572j93q0k44q84j414j260o69k32p2j3q6l45m68r1N94R97Q19K87j36o4
54287A45018N85J406J792J574J182J000Q74N58K25J65K56K07R6K25N42O37K93
54270A56635k52o32o49l44J4P0k74o85q02o44m53k67N1N02R03J107J042O44L4
54251A56000l59j73M63J058J246R57K65o29j352j582j288o48J87R05J001K82p34
54234A55599j301j273j035p98m60j21q4k44r7M18O69K83j43J60R95J422R92K54
$$ plain form
54354 163515 165050 166740 168738 171097 173277 174755 175823 177163 178813 180139 180762 180916 180754 179911 178072
54339 178072 175593 173236 171442 170052 168637 166972 165274 163947 162986 161794 159859 157485 155417 153879
54325 153879 152466 151052 150181 150343 151309 152448 153304 153619 153261 152454 151724 151282 150773 149939 149124 148760 148703 148572
54307 148572 148379 148299 148055 147171 145757 144497 143828 143596 143524 143511 143425 143080 142612 142521 143115 144112 144931 145218 145082 145018
54287 145018 145603 147009 148801 150375 151557 152557 153431 153989 154214 154379 154635 154842 154938 155163 155705 156342 156635
54270 156635 156383 155751 155102 154758 154772 154842 154568 153883 153081 152437 151984 151717 151768 152270 153173 154280 155322 155966 156000
54251 156000 155641 155468 155931 156989 158235 159192 159457 158828 157476 155894 154606 153958 154145 155050 156051 156333 155599
54234 155599 154298 153025 151990 151192 150732 150611 150527 150283 150186 150604 151273 151556 151413 151573 152568 153990 154982 155236
54216A55236j8L25Q53J089Q50K89k80o82j038j489j841j786j451j376j712j828
54200A45141j081J48P59L19l40k14N81J028N71k26m43J55R80J260O53n28j474
54183A47289j524p81l2J16j66l12o7L86P70Q78N70Rk14L31J253J652J191M65J26
54164A51940J06Pj79j56J9n5m66p44n21q8m9n20r54p84p2N56O25L16K53P23J253
54143A51210J103J72p76r88n58j33O0M06R98J153L38p34p35N43J738J587M55l34
54125A55505k55K5r4l62l35j35p7L1N37J195J338Q31K42o1l19o04l04R79K338
54106A60475K292O85r27j136l18J23l13p68l87N82J217R81J04q38j432j641j619
54089A57080j378p60J49Q05P99N42Q01J575J993J541Q00N84Q67J082J114J283
$$ plain form
54216 155236 155218 155543 156396 157485 158335 158624 158344 157662 156624 155135 153294 151508 150057 148681 146969 145141
54200 145141 144060 144208 144967 145286 144946 144732 145313 146341 146912 146686 146243 146398 147378 148638 149291 148763 147289
54183 147289 145765 144984 144952 145068 144902 144590 144523 144909 145679 146557 147127 147136 146922 147253 148506 150158 151349 151814 151940
54164 151940 152046 152053 151874 151718 151737 151682 151216 150472 149951 149863 149814 149294 148340 147556 147484 148040 148665 148981 149234 149957 151210
54143 151210 152313 152485 151709 150721 150163 150030 150090 150496 151494 152647 152985 152251 151516 152059 153797 155384 155839 155505
54125 155505 155250 155275 155181 154819 154484 154349 154272 154303 154840 156035 157373 158204 158446 158385 158066 157462 157158 158137 160475
54106 160475 162767 163452 162525 161389 161071 161194 160881 160113 159726 160308 161525 162506 162610 161772 160340 158699 157080
54089 157080 155702 154942 155091 155896 156695 157237 158038 159613 161606 163147 163947 164531 165398 166480 167594 168877
54073A68877J527J392R07Q33J652K769L154K573J872K024L214M785N943O308N882
54058B13712M709K786L79j835l222l756l927m062l955l234j917m51O75J238J324
54043A98464J209J242J650K351K985L291L399L715M468N489O484P295P764P576
54029B57382O574N176M097L618L432L234L085L067K993K656K134J527P86pm88
54014B99266n41o85j442k552l330l657m022m609n005m896m497m100l709l381l411
53999B49429l771l815l117k297k372l272l733k895j468p68r87j093m61J95%o80
53983B18895p34jN26K89O9P09J767K188J743R92J28j069k227k427j596q88j221
53966B17143k159k733k712k374j706o22L15L46l81q70n47J45N94P83R95J217J332
$$ plain form
54073 168877 170404 171796 172703 173536 175188 177957 181111 183684 185556 187580 190794 195579 201522 207830 213712
54058 213712 218421 221207 221586 219751 216529 212773 208846 204784 200829 197595 195678 195227 195902 197140 198464
54043 198464 199673 200915 202565 204916 207901 211192 214591 218306 222774 228263 234747 242042 249806 257382
54029 257382 263956 269132 273229 276847 280279 283513 286598 289665 292658 295314 297448 298975 299761 299754 299266
54014 299266 298725 298040 296598 294046 290716 287059 283037 278428 273423 268527 264030 259930 256221 252840 249429
53999 249429 245658 241843 238726 236429 234057 230785 227052 224157 222689 221921 220934 219841 219380 219575 219575 218895
53983 218895 218161 218160 218686 218975 219044 219753 221520 223708 225451 226443 226571 225502 223275 220848 219252 218364 217143
53966 217143 214984 212251 209539 207165 205459 204837 205152 205498 205117 204247 203700 203845 204439 205222 206217 207434 208766
53949B08766J504J994K711L255L373L111K651K235K226K883L975M903N376N721
53935B54684O365P146P420O866N841M918M331L980L683L313K944L019M040N789
53921C24339P251P768P991R206J1843J5183J8298K0567K1220J9460J5400J0328
53909D88854N505J274k354m954o269o956p872q835q941q024o922o261n805n256
53895D17184m859m869n007n005n164n848o729p158p094p069p301p412p181p025
53881C29463p373p857p626o429m965m043l660l229k578k266k793l920m965n554
53867B62205n711n435m699l842l419l494l461k839j909j267r89p26m67o92j570
53852B21685k494k675k098j474j281j246r46n47n50q85q73k24M30L82j28k70J43
$$ plain form
53949 208766 210270 212264 214975 218230 221603 224714 227365 229600 231826 234709 238684 243587 248963 254684
53935 254684 261049 268195 275615 282481 288322 293240 297571 301551 305234 308547 311491 314510 318550 324339
53921 324339 331590 339358 347349 356555 368398 383581 401879 422446 443666 463126 478526 488854
53909 488854 494359 495633 493279 488325 482056 475100 467228 458393 449452 441428 434506 428245 422440 417184
53895 417184 412325 407456 402449 397444 392280 386432 379703 372545 365451 358382 351081 343669 336488 329463
53881 329463 322090 314233 306607 300178 295213 291170 287510 284281 281703 279437 276644 272724 267759 262205
53867 262205 256494 251059 246360 242518 239099 235605 232144 229305 227396 226129 225140 224414 223947 223255 221685
53852 221685 219191 216516 214418 212944 211663 210417 209471 208924 208374 207489 206616 206392 206822 207204 207076 206806 206949
53835B06949M49J35n40j079j366j438j156n06P3J46j30k66j10J75O06J313K016
53818B05271K102J347K01p24j111q45N1J195J964K162K290K890L844M643N027
53803B30307N092M914M550M333M736N746O675O770N911M673L776L550L772L935
53789B98740L668K955K079J377J103J226J349R34j27j321k081k407k764l445m339
53774B96947n221n887o076n582m633l827l518l505l463l429l661m190m730m955
53760B34270m680l919k867j826j030n70n35r63j612j993j837j394j112j102j110
53745B07720q90m18J65O42Q25P07M52K39J06L6m1l25q86j266p47O81K076K595
53727B11671K469K420K469K044J079K44j7jm1O2N43J094J222Q99N37M48O70J112
$$ plain form
53835 206949 207398 207533 206993 205914 204548 203110 201954 201448 201521 201667 201537 201271 201161 201336 201942 203255 205271
53818 205271 207373 208720 208921 208197 207086 206241 206292 207487 209451 211613 213903 216793 220637 225280 230307
53803 230307 235399 240313 244863 249196 253932 259678 266353 273123 279034 283707 287483 291033 294805 298740
53789 298740 302408 305363 307442 308819 309922 311148 312497 313431 313304 311983 309902 307495 304731 301286 296947
53774 296947 291726 285839 279763 274181 269548 265721 262203 258698 255235 251806 248145 243955 239225 234270
53760 234270 229590 225671 222804 220978 219948 219378 218843 217880 216268 214275 212438 211044 209932 208830 207720
53745 207720 206830 206412 206577 207219 208044 208751 209203 209442 209548 209584 209543 209218 208332 207066 206319 207000 209076 211671
53727 211671 214140 216560 219029 221073 222152 222396 222379 222378 222337 222399 222942 224036 225258 226157 226694 227142 227812 228924
53709B28924J686K353L168M088M705M497L468K287J591J482J800K420K998K965
53695B68432K290J864K506L771M394L904L085K763K737K271J247L35N6J37r6q24
53679B98872j522j710j628j790k053j720p51j41n93j365j249l75m9p84j548j314
53663B80280n30l40r19j374j081l93j6j14k68j5O57J207J042J98o50r90r79r03
53645B74812n35M10J429J590Q08P4J62P19J046J183J632K328K575K060J292R12
53629B92497R73J101J075J018J159J573K087K432K492K462K634L115L838M685
53615C23141N378N447M704L713L276L494L802L936M243M844N195M960M677M946
53601C85756N466N568N280N066M835M101L012K233J798J006l28j496k070k528
$$ plain form
53709 228924 230610 232963 236131 240219 244924 249421 252889 255176 256767 258249 260049 262469 265467 268432
53695 268432 270722 272586 275092 278863 283257 287161 290246 293009 295746 298017 299264 299599 299655 299792 299696 298872
53679 298872 297350 295640 294012 292222 290169 288449 287698 287557 286964 285599 284350 283975 283926 283142 281594 280280
53663 280280 279750 279410 278491 277117 276036 275643 275627 275513 275245 275230 275887 277094 278136 278334 277684 276694 275715 274812
53645 274812 274277 274687 276116 277706 278514 278588 278750 279469 280515 281698 283330 285658 288233 290293 291585 292497
53629 292497 293470 294571 295646 296664 297823 299396 301483 303915 306407 308869 311503 314618 318456 323141
53615 323141 328519 333966 338670 342383 345659 349153 352955 356891 361134 365978 371173 376133 380810 385756
53601 385756 391222 396790 402070 407136 411971 416072 419084 421317 423115 424121 423793 422297 420227 417699
53587D17699l241l701l395k713k261j953j559j508k196k915k640j602j061j497
53573C85457k072k067j778j730j811j690j381r07q6Q74J129K40r84j338o62J84
53557C71378O05Q64J372J996K295K107J652J274J215J535K044K385K296J865J586
53542C96469K024L208M383M686M123L669M149N347O389O788O753O702O896P493
53528D69079Q524R717J0667J1239J1565J1649J1405J1133J1465J2548J3684J4238
53516F06913J4596J5622J7338J8818J9521K0128K1535K3552K5093K5558K5388
53505H34062K5270K5335K5395K5447K5615K5749K5510K4817K3936K3147K2523
53494A106806K1977K1408K0762K0113J9625J9338J9004J8414J7789J7612J8017
$$ plain form
53587 417699 414458 410757 407362 404649 402388 400435 398876 397368 395172 392257 389617 388015 386954 385457
53573 385457 383385 381318 379540 377810 375999 374309 372928 372021 371935 372809 373938 374178 373194 371856 371194 371378
53557 371378 371983 372847 374219 376215 378510 380617 382269 383543 384758 386293 388337 390722 393018 394883 396469
53542 396469 398493 401701 406084 410770 414893 418562 422711 428058 434447 441235 447988 454690 461586 469079
53528 469079 477603 487320 497987 509226 520791 532440 543845 554978 566443 578991 592675 606913
53516 606913 621509 637131 654469 673287 692808 712936 734471 758023 783116 808674 834062
53505 834062 859332 884667 910062 935509 961124 986873 1012383 1037200 1061136 1084283 1106806
53494 1106806 1128783 1150191 1170953 1191066 1210691 1230029 1249033 1267447 1285236 1302848 1320865
53483A320865J8538J8681J8564J8706J9204J9401J8605J6927J5095J3400J1347
53472A509333Q573N670L503J912j37l032n944q135j0040j2412j4900j6375j6475
53459A441541j5977j5692j5784j6279j7460j9283k0980k1751k1603k1230k1195
53448A234307k1548k1941k1959k1432k0606j9852j9105j7885j5867j3244j0430
53437A030438p768n612m213l318k317j056j26N3L3P53K392M338O094P696R267
53422A036654J0674J1792J2742J3817J5294J7193J9037K0032J9957J9778K0848
53411A217818K3433K6426K8674L0124L1472L3060L4571L5719L6810L8508M1138
53400A577753M4293M7190M9391N1069N2583N4008N5265N6428N7588N8502N8856
$$ plain form
53483 1320865 1339403 1358084 1376648 1395354 1414558 1433959 1452564 1469491 1484586 1497986 1509333
53472 1509333 1517906 1523576 1527079 1528991 1528854 1525822 1519878 1511743 1501703 1489291 1474391 1458016 1441541
53459 1441541 1425564 1409872 1394088 1377809 1360349 1341066 1320086 1298335 1276732 1255502 1234307
53448 1234307 1212759 1190818 1168859 1147427 1126821 1106969 1087864 1069979 1054112 1040868 1030438
53437 1030438 1022670 1017058 1012845 1009527 1007210 1006154 1006028 1006081 1006114 1006867 1009259 1013597 1019691 1027387 1036654
53422 1036654 1047328 1059120 1071862 1085679 1100973 1118166 1137203 1157235 1177192 1196970 1217818
53411 1217818 1241251 1267677 1296351 1326475 1357947 1391007 1425578 1461297 1498107 1536615 1577753
53400 1577753 1622046 1669236 1718627 1769696 1822279 1876287 1931552 1987980 2045568 2104070 2162926
53389B162926N8876N9125N9562N9280N7587N4961N2462N0405M8178M5335M2220
53378B750917L9320L6448L3015K8845K4350J9955J5691J1362O785J741l981j0356
53366B954092j7149k4274l1826l9529m6450n1731n5423n8162o0124o0928o0577
53355B447919n9819n9169n8107n5819n2436m9017m6426m4718m3607m2970m2767
53344A893064m2836m2938m2846m2304m1163l9526l7522l4977l1629k7782k4357
53333A485184k2044k0610j9196j7135j4406j1605r648r217j0196j1730j3041j4013
53321A312343j4838j5387j5279j4472j3357j2268j1167r835q172o247m301k672
53309A184348j529o24M15J629K781L832N021O422P777R010J0473J2465J4736J6800
$$ plain form
53389 2162926 2221802 2280927 2340489 2399769 2457356 2512317 2564779 2615184 2663362 2708697 2750917
53378 2750917 2790237 2826685 2859700 2888545 2912895 2932850 2948541 2959903 2966688 2968429 2964448 2954092
53366 2954092 2936943 2912669 2880843 2841314 2794864 2743133 2687710 2629548 2569424 2508496 2447919
53355 2447919 2388100 2328931 2270824 2215005 2162569 2113552 2067126 2022408 1978801 1935831 1893064
53344 1893064 1850228 1807290 1764444 1722140 1680977 1641451 1603929 1568952 1537323 1509541 1485184
53333 1485184 1463140 1442530 1423334 1406199 1391793 1380188 1370540 1361323 1351127 1339397 1326356 1312343
53321 1312343 1297505 1282118 1266839 1252367 1239010 1226742 1215575 1205740 1197568 1191321 1187020 1184348
53309 1184348 1182819 1182195 1182610 1184239 1187020 1190852 1195873 1202295 1210072 1219082 1229555 1242020 1256756 1273556
53295A273556J8560K0271K2164K4349K6860K9357L0944L0946K9773K8524K7620
53284A562924K6500K4726K2723K1021J9409J7361J4855J2178R198N514J205l150
53272A734464p110j0559j3335j5286j6742j8323k0185k2002k3717k5673k7818
53261A533714k9410k9965k9999l0293l0864l1179l1138l1209l1612l1927l1600
53250A194518l0500k8879k7125k5661k4875k4875k5372k5860k5908k5416k4586
53239I05461k3680k2752k1694k0511j9426j8550j7562j5908j3364j0411p996o831
53227G06776o852p363p757p946q127q425r029j0286j2184j3937j4737j4818j5156
53214E70159j6052j6682j6222j4840j3241j1895j0985j0527j0120r148p650o528
$$ plain form
53295 1273556 1292116 1312387 1334551 1358900 1385760 1415117 1446061 1477007 1506780 1535304 1562924
53284 1562924 1589424 1614150 1636873 1657894 1677303 1694664 1709519 1721697 1730895 1736409 1737614 1734464
53272 1734464 1727354 1716795 1703460 1688174 1671432 1653109 1632924 1610922 1587205 1561532 1533714
53261 1533714 1504304 1474339 1444340 1414047 1383183 1352004 1320866 1289657 1258045 1226118 1194518
53250 1194518 1164018 1135139 1108014 1082353 1057478 1032603 1007231 981371 955463 930047 905461
53239 905461 881781 859029 837335 816824 797398 778848 761286 745378 732014 721603 713607 706776
53227 706776 699924 692561 684804 676858 668731 660306 651277 640991 628807 614870 600133 585315 570159
53214 570159 554107 537425 521203 506363 493122 481227 470242 459715 449595 440447 432797 426269
53202D26269o402o845p185p454p926q346q411q445q735q707p776o587o292o742
53188C20416o675n621m480l945l613l006k410k123j808j199p69j051j855k669
53174B79192l232l325k645j437o93j026j801k005j516j018r88j337j733j733r75
53159B53728K40R41N91k02o11p22j008j223p98m7P3o03j237j297j177j252j261
53142B44135r77p48q11p45j76M28M46J52M03J308J946J548M65l36m07j19M7J26
53124B46685M72J197J970K370K210J558O77Ql0N64J356J893K027J750J030Q7n16
53107B65308m21o0k82j362k685l408l228k476j796j696k140k566k486k067j859
53092B36776j977j909j201n5R20J289J037M94J63L58Q50J050O58j6m82o27o00
$$ plain form
53202 426269 419867 413022 405837 398383 390457 382111 373700 365255 356520 347813 340037 333450 327158 320416
53188 320416 313741 308120 303640 299695 296082 293076 290666 288543 286735 285536 284767 283716 281861 279192
53174 279192 275960 272635 269990 268553 267860 266834 265033 263028 261512 260494 259506 258169 256436 254703 253728
53159 253728 253968 254909 255500 255298 254687 253965 252957 251734 250936 250889 250962 250359 249122 247825 246648 245396 244135
53142 244135 243158 242410 241599 240854 240678 241106 241552 241704 242107 243415 245361 246909 247374 247038 246631 246512 246559 246685
53124 246685 247157 248354 250324 252694 254904 256462 257139 257147 257117 257681 259037 260930 262957 264707 265737 265824 265308
53107 265308 264887 264827 264545 263183 260498 257090 253862 251386 249590 247894 245754 243188 240702 238635 236776
53092 236776 234799 232890 231689 231634 232554 233843 234880 235374 235537 235895 236745 237795 238453 238437 237955 237328 236728
53075B36728m41l8N70J091J222Q39M1r17j713k155k283k220j989j554r87m98k13
53058B25483m2J73M29N70N10L93M03M49K15m20j070j106k70J011J978K186J748
53041B32640J034K71m19p73m85K74Q10O30K3m60p90j285j761j614p90J0L53N98
53023B28266J003J039L09m47k24O64Q81l7j046j097n00k95p92j297j024J06J476
53006B26985K346K505K317K108J686P96j45l82J14N52M37J28j8k95j014j680j481
52989B34959l41J011J867K009J609J066P88P94P03L92L67J039J985K443K301J934
52973B54926J360L46o42n20J054L022M077L972L327K578J664N46n05j161j318
52958B72726j132r38j023j340j567j565j593j874k203k247k066j994k061j948
$$ plain form
53075 236728 236287 236249 236819 237910 239132 239971 240012 239095 237382 235227 232944 230724 228735 227181 226194 225696 225483
53058 225483 225441 225614 226043 226613 227123 227516 227919 228368 228583 228163 227093 225987 225717 226728 228706 230892 232640
53041 232640 233674 233945 233526 232753 232268 232542 233352 233982 234005 233545 232755 231470 229709 228095 227305 227315 227668 228266
53023 228266 229269 230308 230617 230170 229946 230610 231491 231454 230408 229311 228811 228516 227724 226427 225403 225509 226985
53006 226985 229331 231836 234153 236261 237947 238743 238598 238216 238330 238882 239319 239447 239429 239134 238120 236440 234959
52989 234959 234618 235629 237496 239505 241114 242180 242968 243762 244465 244857 245224 246263 248248 250691 252992 254926
52973 254926 256286 256632 255990 255470 256524 259546 263623 267595 270922 273500 275164 275710 275205 274044 272726
52958 272726 271594 270656 269633 268293 266726 265161 263568 261694 259491 257244 255178 253184 251123 249175
52944B49175j526j064p68m66K9M92N68L20J91M03O67N53k9q30j527j893j813j358
52926B41124q16m82m33n59p58r34r14n21J35O81Q49P25N33L71K69L21N43O74M13
52907B41221j23m23j66L67O09L26j66l95j91K02L94K19j43l57l21l10o55j321
52889B38767j821j649p19N35J451J568R63K18n9J93N14N75N64P15P06N0r82j434
52871B40155q56O0M75N41J007J929K508K248J625J350J427J332Q06J15l71n59
52855B53792o00o07n13j86K50L51j75j034j702k094k587l302l844l833l333k570
52839B28013j727j117j077j404j405r05o23j063j615j404o09o5J19N64J354J774
52823B18810J470R53O51L11k49o16n06l42m96n26R3R49J202P97M02L33L53M55
$$ plain form
52944 249175 247649 246585 245817 245351 245380 245872 246440 246760 246951 247354 248021 248574 248545 247715 246188 244295 242482 241124
52926 241124 240308 239826 239393 238834 238076 237142 236228 235707 235842 236523 237372 238097 238630 239001 239270 239591 240134 240808 241221
52907 241221 241098 240675 240509 240876 241485 241811 241645 241250 241059 241261 241655 241874 241731 241374 241053 240743 240088 238767
52889 238767 236946 235297 234578 235113 236564 238132 239095 239313 239254 239447 239961 240536 241100 241815 242521 242571 241589 240155
52871 240155 239299 239359 239834 240375 241382 243311 245819 248067 249692 251042 252469 253801 254607 254722 254351 253792
52855 253792 253192 252585 252072 251886 252136 252487 252312 251278 249576 247482 244895 241593 237749 233916 230583 228013
52839 228013 226286 225169 224092 222688 221283 220378 219755 218692 217077 215673 215064 214999 215118 215682 217036 218810
52823 218810 220280 221233 221884 222195 221946 221330 220824 220482 219986 219460 219553 220502 221704 222501 222903 223236 223589 224044
52805B24044R36J625J779J090Q7p61j649k721l371k944j806r44o68m25R8L89p4
52788B14685r51j405j069l05L39O42P18Q13J028J124P03k01q75o43K86R63P78
52771B16630Q0l46j31N24J113J125L55p34j269q71q1M10O74J149J617J346K82
52754B21873o25o18n7K43J54J26K86K53j26m39k53L32R31J363J743K143K442K545
52736B32316K570K674K716K329J422N22K94P97J388J457J002M50J93L35O57O66
52720B51788p2j429k699l199k814j876q86l55n56j186j590j598j704k121k144
52705B27559j084N58J508J261M38k17n88q13q11n16r0K88O07Q43R24R55J044R53
52687B32819L38n12p99k03P25J349J557J368O45l65q30k97N95R43P38N86N63J73
$$ plain form
52805 224044 224980 226605 228384 229474 229561 228800 227151 224430 221059 218115 216309 215365 214697 214272 214370 214759 214685
52788 214685 213734 212329 211260 210955 211294 211936 212654 213467 214495 215619 216322 216121 215246 214603 214889 215852 216630
52771 216630 216710 216364 216233 216757 217870 218995 219350 218616 217347 216476 216395 216805 217479 218628 220245 221591 221873
52754 221873 221248 220630 220573 220816 220970 221096 221382 221635 221509 221070 220817 221149 222080 223443 225186 227329 229771 232316
52736 232316 234886 237560 240276 242605 244027 244549 244843 245640 247028 248485 249487 249937 250130 250465 251122 251788
52720 251788 251716 250287 247588 244389 241575 239699 238813 238458 237902 236716 235126 233528 231824 229703 227559
52705 227559 226475 227033 228541 229802 230240 230023 229435 228622 227811 227295 227205 227493 228100 228943 229867 230822 231866 232819
52687 232819 233157 232645 231846 231643 232368 233717 235274 236642 237287 236922 236092 235795 236390 237333 238071 238657 239220 239393
52669B39393o93j442j541j043k79M90J065J270J113P44K53k66o16o79n53k44M88
52652B37460J611K452K455K065K133K587K466J293l38j673k474k605j775k36R76
52637B46397J095N04N6l1o1r2K8J05j55m73k20O34J380J495J152P31K94j65l94
52618B52280k01J38J41k60o91r13j106j452j667j268k87O12Q40M89K4k97m62k99
52600B45621L72J237J639J397J062J136J444J473J041K95n43j186j235o10K14
52585B53357P36J005J328J653J608J109N22K38L83Q29J206J034K06p28j106q95
52569B62485o00n32n35m45l57l71l71j74K68P77R29K73j063k201k320j637j101
52552B53025j154j302r83l59L0J9r7k9J69K47J06l6Q9L03P9o14j000n17K21K48
$$ plain form
52669 239393 238700 237258 235717 234674 234395 234885 235950 237220 238333 239077 239330 239064 238448 237769 237216 236972 237460
52652 237460 239071 241523 243978 246043 248176 250763 253229 254522 254184 252511 250037 247432 245657 245421 246397
52637 246397 247492 247996 248052 248021 247960 247868 247896 248001 247846 247373 247153 247787 249167 250662 251814 252545 252839 252674 252280
52618 252280 252079 252217 252358 252098 251407 250494 249388 247936 246269 245001 244714 245326 246166 246655 246679 246382 245920 245621
52600 245621 245993 247230 248869 250266 251328 252464 253908 255381 256422 256717 256174 254988 253753 253143 253357
52585 253357 254093 255098 256426 258079 259687 260796 261318 261556 261939 262768 263974 265008 265214 264486 263380 262485
52569 262485 261885 261353 260818 260373 260016 259645 259274 259100 259368 260145 261074 261347 260284 258083 255763 254126 253025
52552 253025 251871 250569 249586 249227 249257 249276 249179 249150 249319 249566 249672 249636 249725 250028 250107 249493 248493 247976 248197 248445
52532B48445k53j83O50J149P09K99R51K035K093R59p3j11L49M31P0k42k73j78
52514B56827l6L08R69J785K416K697K850L254L906M311M031L181K185J248L00
52499B90232p24j812k921l843m194l855l236k800k460j888j233r77j093r37j15
52484B58144R44J536J423Q66K51p4R4O08J007J006P79O62P35Q57Q55N70m8o92
52466B69523p49O0J286K167K415K313K226K287K472K608K310J270k20j333j499
52451B87136j018p49j267k443l652m236l858k740j544q43o37n22l64n01j119j743
52435B59900j710j043m59m49o93n74K2N93O72L13OJ90Q54J563J901J889J789J658
52417B66422J326Q83P57J071J324J053N43M48R34J674K603M076O166Q284R773
$$ plain form
52532 248445 248192 248009 248659 249808 250517 250816 251767 253802 255895 256854 256781 256670 257019 257450 257520 257278 257005 256827
52514 256827 256791 257099 258068 259853 262269 264966 267816 271070 274976 279287 283318 286499 288684 289932 290232
52499 290232 289508 287696 284775 280932 276738 272883 269647 266847 264387 262499 261266 260289 259196 258259 258144
52484 258144 259088 260624 262047 262913 263164 263090 263184 263792 264799 265805 266584 267246 267981 268838 269693 270263 270215 269523
52466 269523 268774 268834 270120 272287 274702 277015 279241 281528 284000 286608 288918 290188 289968 288635 287136
52451 287136 286118 285369 284102 281659 278007 273771 269913 267173 265629 264786 264149 263627 263263 262762 261643 259900
52435 259900 258190 257147 256688 256239 255546 254972 254994 255587 256259 256572 256578 256768 257622 259185 261086 262975 264764 266422
52417 266422 267748 268631 269388 270459 271783 272836 273379 273827 274761 276435 279038 283114 289280 297564 307337
52402C07337J0537J0857J0800J0021Q076M792N27l845p327r300r620q481o481
52389C17893m643l837l910l899l245k407j984j761j117p2O94P80N27M82Q72J664
52373B96037K714L728M344M468M420M639N294O145O649O318N145L617K090M20
52359C56028j485l023l338k436j247m48J74R66J651J753J354R45Q04R54J466K250
52343C56368K865L088L351M042M577M110L057K889M163N737O516O968Q087R572
52329D25390J0296J0322J1061J3224J5707J7086J7440J7905J9035K0427K1664
52318E99557K2764K3614K3748K3013K2019K1561K1740K1944K1530K0428J9197
52307H41115J8603J8915J9497J9361J8314J7200J6742J6498J5512J3738J2106
$$ plain form
52402 307337 317874 328731 339531 349552 357628 362420 362947 359102 351775 342475 332855 324374 317893
52389 317893 313250 309413 305503 301604 298359 295952 293968 292207 291090 291018 291712 292492 293019 293501 294373 296037
52373 296037 298751 302479 306823 311291 315711 320350 325644 331789 338438 344756 349901 353518 355608 356028
52359 356028 354543 351520 348182 345746 344499 344051 344225 345191 346842 348595 349949 350894 351698 352652 354118 356368
52343 356368 359233 362321 365672 369714 374291 378401 381458 384347 388510 394247 400763 407731 415818 425390
52329 425390 435686 446008 457069 470293 486000 503086 520526 538431 557466 577893 599557
52318 599557 622321 645935 669683 692696 714715 736276 758016 779960 801490 821918 841115
52307 841115 859718 878633 898130 917491 935805 953005 969747 986245 1001757 1015495 1027601
52296A027601J1133J0263Q801O853M778K332q72m376p174q946j0266j1490j2207
52283A016430j2032j1302j0547r765q685p377o083m697k870n47J888M011N659
52270I54083O984Q336R949J1655J3077J4207J5304J6235J6440J5891J5417J5571
52258A113149J5781J5287J4403J3952J3924J3665J3185J3100J3223J2366R930
52247A261965O756L917J461j128l890o463q712j0720j2451j3818j4866j5616j5996
52234A170439j6140j6293j6346j5945j5241j4831j4741j4207j2868j1376j0287
52223A012164r193p652o263n780n773n212m053l180k867k332r49R58K621L523
52209I66012L557L129L060L810M853N421N630O034O322N573L952K926L331M223
$$ plain form
52296 1027601 1038734 1048997 1057798 1064651 1069429 1071761 1070889 1066513 1059339 1050393 1040127 1028637 1016430
52283 1016430 1004398 993096 982549 972784 964099 956722 950639 945942 943072 942525 944413 948424 954083
52270 954083 961067 969403 979352 991007 1004084 1018291 1033595 1049830 1066270 1082161 1097578 1113149
52258 1113149 1128930 1144217 1158620 1172572 1186496 1200161 1213346 1226446 1239669 1252035 1261965
52247 1261965 1268721 1272638 1274099 1272971 1269081 1262618 1253906 1243186 1230735 1216917 1202051 1186435 1170439
52234 1170439 1154299 1138006 1121660 1105715 1090474 1075643 1060902 1046695 1033827 1022451 1012164
52223 1012164 1002971 995319 989056 983276 977503 972291 968238 965058 962191 959859 958910 959868 962489 966012
52209 966012 969569 972698 975758 979568 984421 989842 995472 1001506 1007828 1013401 1017353 1020279 1023610 1027833
52195A027833M288L630L366L943M726N048M966M884M926M834M316L379K274J133
52181A083546j83j749l338m753o137p592q773r370r657r947r829q749p137n983
52167I90349n275m091k293j012r11j162p73J31J084K333M028N234M961L700K681
52152I98984K009Q08q94j782j076L69J218J179R23J070J752K700L405L414K766
52137A016845J913J186O22L81Q94K338M318O326Q270J0321J2467J4483J6306J8259
52123A114929K0783K3936K7184K9810L1584L2860L3932L4543L4320L3406L2237
52112A449524L0905K9172K7082K4967K2844K0259J6968J3410J0272P844O034M687
52100A663968L606K488J169j75j334k460l875n520o979q229j0021j3088j7030
$$ plain form
52195 1027833 1032121 1035751 1039117 1043060 1047786 1052834 1057800 1062684 1067610 1072444 1076760 1080139 1082413 1083546
52181 1083546 1083363 1081614 1078276 1073523 1067386 1059794 1051021 1041651 1031994 1022047 1012218 1003469 996332 990349
52167 990349 985074 980983 978690 977678 976767 975605 974832 974963 976047 978380 982408 987642 992603 996303 998984
52152 998984 1000993 1001801 1000907 999125 998049 998418 999636 1000815 1001738 1002808 1004560 1007260 1010665 1014079 1016845
52137 1016845 1018758 1019944 1020566 1020947 1021841 1024179 1028497 1034823 1043093 1053414 1065881 1080364 1096670 1114929
52123 1114929 1135712 1159648 1186832 1216642 1248226 1281086 1315018 1349561 1383881 1417287 1449524
52112 1449524 1480429 1509601 1536683 1561650 1584494 1604753 1621721 1635131 1645403 1653247 1659281 1663968
52100 1663968 1667574 1670062 1671231 1671056 1669722 1667262 1663387 1657867 1650888 1642659 1632638 1619550 1602520
52087A602520k0396k2120k2520k2639k2819k2443k0920j8343j5142j1668q454
52076A395056o210n003l814j518J842N185P705R549J1271J3181J5317J7563J9571
52063A479695K0821K1025K0366J9280J8083J6803J5279J3437J1547J0042R000
52052A655378P979O615N080L651K022m50l877p591j0866j3549j5972j8521k1264
$$ plain form
52087 1602520 1582124 1560004 1537484 1514845 1492026 1469583 1448663 1430320 1415178 1403510 1395056
52076 1395056 1388846 1383843 1380029 1378511 1380353 1385538 1393243 1402792 1414063 1427244 1442561 1460124 1479695
52063 1479695 1500516 1521541 1541907 1561187 1579270 1596073 1611352 1624789 1636336 1646378 1655378
52052 1655378 1663357 1669972 1675052 1678703 1680725 1680275 1676398 1668807 1657941 1644392 1628420 1609899 1588635
$$ [...]
##END NTUPLES=NMR SPECTRUM
##END=
