
##TITLE=AC1384_HONAH12196_7519100_lsiuzFzhO4
##JCAMPDX= 6.0         $$ Bruker NMR JCAMP-DX V2.0
##DATA TYPE= NMR SPECTRUM
##DATA CLASS= NTUPLES
##ORIGIN= BRUKER
##OWNER= Administrator
$$ 1.72 TOPSPIN		Version 2.1
$$ 2013-02-20 21:11:04.541 -0500  Administrator@X
$$ Compression mode = diff/dup
##.OBSERVE FREQUENCY= 400.02188249412
##.OBSERVE NUCLEUS= ^1H
##.ACQUISITION MODE= SIMULTANEOUS (DQD)
##.ACQUISITION SCHEME= undefined
##.AVERAGES= 64
##.DIGITISER RES= 22
##SPECTROMETER/DATA SYSTEM= spect
##.PULSE SEQUENCE= noesygpps1d.comp
##.SOLVENT NAME= COFFEE_meoh
##.SHIFT REFERENCE= INTERNAL, COFFEE_meoh, 1, 14.96096
##AUDIT TRAIL= $$ (NUMBER, WHEN, WHO, WHERE, PROCESS, VERSION, WHAT)
$$ ##TITLE= Audit trail, TOPSPIN		Version 2.1
$$ ##JCAMPDX= 5.01
$$ ##ORIGIN= Bruker BioSpin GmbH
$$ ##OWNER= Administrator
$$ $$ E:\/data/COFFEE/nmr/AC1384_HONAH12196_7519100_lsiuzFzhO4/12/pdata/1/auditp.txt
$$ ##AUDIT TRAIL=  $$ (NUMBER, WHEN, WHO, WHERE, PROCESS, VERSION, WHAT)
(   1,<2013-02-20 21:10:58.510 -0500>,<Administrator>,<X>,<go>,<TOPSPIN 2.1>,
      <created by zg
	started at 2013-02-20 20:59:27.874 -0500,
	POWCHK enabled, PULCHK disabled,
       configuration hash MD5:
       86 BA 57 50 F2 9D 5C 9B 26 00 A9 28 5F 66 2E 89
       data hash MD5: 64K
       E3 E1 C4 19 C1 21 C6 14 13 78 E5 A7 06 4D 1F CA>)
(   2,<2013-02-20 21:11:01.635 -0500>,<Administrator>,<X>,<proc1d>,<TOPSPIN 2.1>,
      <Start of raw data processing
       efp LB = 0.3 FT_mod = 6 PKNL = 1 PHC0 = 0 PHC1 = 0 SI = 128K 
       data hash MD5: 128K
       29 A6 D5 60 65 90 AB B2 4A 59 5F 7D ED 3F 60 4F>)
(   3,<2013-02-20 21:11:02.729 -0500>,<Administrator>,<X>,<proc1d>,<TOPSPIN 2.1>,
      <pk PHC0 = 252.0319 PHC1 = 0 
       data hash MD5: 128K
       C7 F4 C0 15 B1 7C FA 50 7F A3 B6 22 A1 43 2A 17>)
(   4,<2013-02-20 21:11:03.448 -0500>,<Administrator>,<X>,<proc1d>,<TOPSPIN 2.1>,
      <abs ABSG = 1 
       data hash MD5: 128K
       5B D0 B2 84 D1 56 8A 4A 17 43 C4 FB B9 32 65 AF>)
(   5,<2013-02-20 21:11:03.635 -0500>,<Administrator>,<X>,<proc1d>,<TOPSPIN 2.1>,
      <abs ABSG = 2 
       data hash MD5: 128K
       29 D3 EE 7C 85 88 42 B3 5F FB B3 FF ED 0F EA F8>)
(   6,<2013-02-20 21:11:03.807 -0500>,<Administrator>,<X>,<proc1d>,<TOPSPIN 2.1>,
      <abs ABSG = 3 
       data hash MD5: 128K
       00 76 7C D9 F9 8C C5 55 C5 FC 9D A1 26 3F B9 0C>)
(   7,<2013-02-20 21:11:03.979 -0500>,<Administrator>,<X>,<proc1d>,<TOPSPIN 2.1>,
      <abs ABSG = 4 
       data hash MD5: 128K
       B2 7D E1 A3 99 EA 30 DE 21 85 28 FA 04 E6 7D FC>)
(   8,<2013-02-20 21:11:04.182 -0500>,<Administrator>,<X>,<proc1d>,<TOPSPIN 2.1>,
      <abs ABSG = 5 
       data hash MD5: 128K
       18 A2 8D B0 7C BD D1 88 11 5E ED DB 65 EB C7 8A>)
$$ ##END=
$$ 
$$ $$ hash MD5
$$ $$ 03 CD 0A BF 8F 8D 69 1C 6C F8 AF FD 41 C7 F4 E6
##$RELAX= 
##$RELAX= 
##$RELAX= 
##$RELAX= 
##$RELAX= 
##$RELAX= 
##$RELAX= 
##$RELAX= 
$$ Bruker specific parameters
$$ --------------------------
##$DU= <E:\>
##$EXPNO= 12
$$ [...]
150 150 150 150 150 150 150 150
##$TP07= 0
##$TPNAME0= <>
##$TPNAME1= <>
##$TPNAME2= <>
##$TPNAME3= <>
##$TPNAME4= <>
##$TPNAME5= <>
##$TPNAME6= <>
##$TPNAME7= <>
##$TPOAL= (0..7)
0.5 0.5 0.5 0.5 0.5 0.5 0.5 0.5
##$TPOFFS= (0..7)
0 0 0 0 0 0 0 0
##$TUNHIN= 0
##$TUNHOUT= 0
##$TUNXOUT= 0
##$USERA1= <user>
##$USERA2= <user>
##$USERA3= <user>
##$USERA4= <user>
##$USERA5= <user>
##$V9= 5
##$VALIST= <valist>
##$VCLIST= <CCCCCCCCCCCCCCC>
##$VD= 0
##$VDLIST= <DDDDDDDDDDDDDDD>
##$VPLIST= <PPPPPPPPPPPPPPP>
##$VTLIST= <TTTTTTTTTTTTTTT>
##$WBST= 1024
##$WBSW= 4
##$XGAIN= (0..3)
0 0 0 0
##$XL= 0
##$YL= 0
##$YMAX_a= 6549345
##$YMIN_a= -11718506
##$ZGOPTNS= <>
##$ZL1= 120
##$ZL2= 120
##$ZL3= 120
##$ZL4= 120
##$ABSF1= 14.96096
##$ABSF2= -5.597221
##$ABSG= 5
##$ABSL= 3
##$ALPHA= 0
##$AQORDER= 0
##$ASSFAC= 0
##$ASSFACI= 0
##$ASSFACX= 0
##$ASSWID= 0
##$AUNMP= <proc_prof1d_extract.lims>
##$AXLEFT= 0
##$AXNAME= <>
##$AXNUC= <1H>
##$AXRIGHT= 0
##$AXTYPE= 0
##$AXUNIT= <>
##$AZFE= 0.1
##$AZFW= 0.1
##$BCFW= 0
##$BC_mod= 0
##$BYTORDP= 0
##$COROFFS= 0
##$CY= 15
##$DATMOD= 1
##$DC= 0
##$DFILT= <>
##$DTYPP= 0
##$F1P= 0
##$F2P= 0
##$FCOR= 0.5
##$FTSIZE= 131072
##$FT_mod= 6
##$GAMMA= 0
##$GB= 0
##$INTBC= 1
##$INTSCL= 1
##$ISEN= 128
##$LB= 0.3
##$LEV0= 0
##$LPBIN= 0
##$MAXI= 10000
##$MC2= 0
##$MEAN= 0
##$ME_mod= 0
##$MI= 0
##$NCOEF= 0
##$NC_proc= -2
##$NLEV= 6
##$NOISF1= 0
##$NOISF2= 0
##$NSP= 0
##$NTH_PI= 0
##$NZP= 0
##$OFFSET= 14.96096
##$PC= 1
##$PHC0= 252.0319
##$PHC1= 0
##$PH_mod= 1
##$PKNL= yes
##$PPARMOD= 0
##$PPDIAG= 0
##$PPIPTYP= 0
##$PPMPNUM= 2147483647
##$PPRESOL= 1
##$PSCAL= 4
##$PSIGN= 0
##$PYNMP= <proc.py>
##$REVERSE= no
##$SF= 400.02000965438
##$SI= 131072
##$SIGF1= 0
##$SIGF2= 0
##$SINO= 400
##$SIOLD= 131072
##$SPECTYP= <>
##$SREGLST= <1H.CDCl3>
##$SSB= 0
##$STSI= 131072
##$STSR= 0
##$SW_p= 8223.68421052631
##$SYMM= 0
##$S_DEV= 0
##$TDeff= 65536
##$TDoff= 0
##$TI= <>
##$TILT= no
##$TM1= 0
##$TM2= 0
##$TOPLEV= 0
##$USERP1= <user>
##$USERP2= <user>
##$USERP3= <user>
##$USERP4= <user>
##$USERP5= <user>
##$WDW= 1
##$XDIM= 131072
##$YMAX_p= 380921313
##$YMIN_p= -11463
##$CURPLOT= <Network HP LaserJet P1505>
##$CURPRIN= <$Network HP LaserJet P1505>
##$DFORMAT= <normdp>
##$LAYOUT= <+/1D_H.xwp>
##$LFORMAT= <normlp>
##$PFORMAT= <normpl>
##$SURQMSG= 1
$$ End of Bruker specific parameters
$$ ---------------------------------
##NTUPLES= NMR SPECTRUM
##VAR_NAME=  FREQUENCY,     SPECTRUM/REAL,   SPECTRUM/IMAG
##SYMBOL=    X,             R,               I
##VAR_TYPE=  INDEPENDENT,   DEPENDENT,       DEPENDENT
##VAR_FORM=  AFFN,          ASDF,            ASDF
##VAR_DIM=   131072,        131072,          131072
##UNITS=     HZ,            ARBITRARY UNITS, ARBITRARY UNITS
##FACTOR=    0.0627417313425164, 1,          1
##FIRST=     8223.62146879497, -468,         -68214
##LAST=      0,             1746,            -69029
##MIN=       0,             -11463,          0
##MAX=       8223.62146879497, 380921313,    0
$$ Real data points
##PAGE= N=1
##DATA TABLE= (X++(R..R)), XYDATA
$$ [...]
$$ plain form
61630 503428 500076 496651 492959 489042 485112 481366 477859 474565 471631 469534 468725 469049 469770 470352 470903
61615 470903 471694 472573 473232 473686 474029 473915 472843 470816 468127 464549 459475 453026 446301 440074 433877 426968
61599 426968 419785 413599 408822 404430 399322 393699 388676 384833 381625 378185 374354 370735 367892 365686
61585 365686 363460 360709 357466 354116 351021 348345 346058 343959 341806 339553 337464 335879 334909 334369 333905
61570 333905 333161 331995 330731 330006 330099 330452 330158 328917 327230 325658 324265 322896 321577 320359 319097 317817
61554 317817 317085 317504 318858 320219 320983 321454 322295 323773 325724 327855 329823 331254 332058 332598 333351 334504
61538 334504 336057 338021 340249 342374 344306 346617 349933 354000 357776 360367 361461 360950 358828 355632
61524 355632 352356 349537 346845 343908 341061 338849 337179 335518 333675 331861 330137 328404 326824 325668
$$ packed form
61630E03428l352l425l692l917l930l746l507l294k934k097q09L24P21N82N51
61615D70903P91Q79O59M54L43j14j072k027k689l578n074o449o725o227o197o909
61599D26968p183o186m777m392n108n623n023l843l208l440l831l619k843k206
61585C65686k226k751l243l350l095k676k287k099k153k253k089j585r70n40m64
61570C33905p44j166j264p25R3L53k94j241j687j572j393j369j319j218j262j280
61554C17817p32M19J354J361P64M71Q41J478J951K131J968J431Q04N40P53J153
61538C34504J553J964K228K125J932K311L316M067L776K591J094n11k122l196
61524C55632l276k819k692k937k847k212j670j661j843j814j724j733j580j156
$$ plain form
61510 325668 324746 323574 322216 321375 321379 321563 321036 319705 318162 316825 315640 314528 313704 313454 313803 314462 315038
61493 315038 315302 315315 315172 314626 313224 311024 308891 307706 307424 307266 306821 306457 306581 306991 307315 307713 308660 310132
61475 310132 311523 312453 313292 314627 316408 317904 318464 318193 317869 318260 319483 320904 321660 321341 320248 319072
61459 319072 318364 318181 318075 317459 316233 315124 315119 316384 318049 319319 320463 322222 324436 326004 326377 326441 327492
61442 327492 329718 332197 334180 335897 338086 341120 344680 348033 350644 352696 354941 357878 361169 364191
61428 364191 366994 370195 373828 376775 377749 376649 374648 373081 372485 372644 373160 373844 374705 375845 377410 379452
61412 379452 381697 383535 384479 384678 384723 384810 384317 382501 379462 376108 373257 371088 369367 367759 365857 363359
61396 363359 360462 357766 355589 353679 351845 350467 349952 349910 349472 348423 347515 347466 348091 348668 348940 349322 350188
$$ packed form
61510C25668r22j172j358q41MJ84n27j331j543j337j185j112q24k50L49O59N76
61493C15038K64J3j43n46j402k200k133j185k82j58m45l64J24M10L24L98R47J472
61475C10132J391R30Q39J335J781J496N60k71l24L91J223J421P56l19j093j176
61459C19072p08j83j06o16j226j109nJ265J665J270J144J759K214J568L73O4J051
61442C27492K226K479J983J717K189L034L560L353K611K052K245K937L291L022
61428C64191K803L201L633K947R74j100k001j567n96J59N16O84Q61J140J565K042
61412C79452K245J838R44J99M5Q7m93j816l039l354k851k169j721j608j902k498
61396C63359k897k696k177j910j834j378n15m2m38j049r08m9O25N77K72L82Q66
$$ plain form
61379 350188 351306 352157 352677 353421 354931 357056 359002 360092 360407 360670 361536 363050 364729 366084 367040 367899
61363 367899 369055 370821 373482 377224 381820 386550 390701 394198 397574 401332 405594 410414 416120 423079
61349 423079 431251 440252 449850 460244 471709 483984 496038 506599 515077 521937 528014 533520 537986
61336 537986 541172 543604 545998 548445 550477 551710 552060 551457 549819 547384 544722 542177 539482 536069 531701
61321 531701 526655 521363 516059 510868 506152 502468 499976 498109 496207 494458 493775 494645 496642 499354 503197
61306 503197 508674 515203 521486 527049 532775 539765 548183 557277 565975 573219 578290 581103 581905 580554
61292 580554 576597 570285 562866 555464 548187 540897 534297 529383 526001 522848 519094 515321 512588 511122
61278 511122 510352 509889 510015 511294 513992 517918 522740 528399 535164 543129 551762 560177 567852 574883 581589
$$ packed form
61379C50188J118Q51N20P44J510K125J946J090L15K63Q66J514J679J355R56Q59
61363C67899J156J766K661L742M596M730M151L497L376L758M262M820N706O959
61349D23079Q172R001R598J0394J1465J2275J2054J0561Q478O860O077N506M466
61336E37986L186K432K394K447K032J233L50o03j638k435k662k545k695l413m368
61321E31701n046n292n304n191m716l684k492j867j902j749o83Q70J997K712L843
61306E03197N477O529O283N563N726O990Q418R094Q698P244N071K813Q02j351
61292E80554l957o312p419p402p277p290o600m914l382l153l754l773k733j466
61278E11122p70m63J26J279K698L926M822N659O765P965Q633Q415P675P031O706
$$ plain form
61263 581589 588215 595098 602696 611165 620156 629301 638802 649250 660982 673788 687076 700038 711748
61250 711748 721501 729178 735025 739041 740805 740100 737432 733710 729466 724662 719173 713199 707065 700831
61236 700831 694275 687253 679946 672802 666281 660566 655394 650280 645069 640236 636421 633654 631335 629056
61222 629056 627215 626606 627542 629578 631928 633910 635125 635530 635403 635047 634558 633994 633624 633722 634200 634738 635296
61205 635296 636081 636962 637326 636836 636089 636269 638229 642117 647749 655109 664554 676701 691999 710175 730150
61190 730150 750703 771286 792094 813312 834308 853594 869644 881962 891456 899666 907592 915301
61178 915301 922474 928893 934331 938409 940905 941938 941575 939550 935717 930505 924486 917644 909503 899874
61164 899874 889071 877492 865364 852799 839685 825675 810771 795780 781568 768008 754463
$$ packed form
61263E81589O626O883P598Q469Q991R145R501J0448J1732J2806J3288J2962J1710
61250G11748R753P677N847M016J764p05k668l722m244m804n489n974o134o234
61236G00831o556p022p307p144o521n715n172n114n211m833l815k767k319k279
61222F29056j841o09R36K036K350J982J215M05j27l56m89n64l70R8M78N38N58
61205F35296P85Q81L64m90p47J80J960L888N632P360R445J2147J5298J8176J9975
61190G30150K0553K0583K0808K1218K0996J9286J6050J2318R494Q210P926P709
61178I15301P173O419N438M078K496J033l63k025l833n212o019o842q141r629
61164H99874j0803j1579j2128j2565j3114j4010j4904j4991j4212j3560j3545
$$ plain form
61153 754463 741328 730074 721420 714417 707949 702330 698602 696887 696408 696687 697654 698666 698421 695953 691032
61138 691032 683659 674090 663470 653489 645046 637900 631889 627541 625054 623567 622311 621886 623557 627691
61124 627691 633711 641291 650657 661811 674430 688727 705601 725530 747843 771411 795583 820135
61112 820135 844717 868912 892760 916824 941659 967212 992727 1017202 1040040 1061208 1080703
61101 1080703 1098146 1113180 1125967 1136665 1144457 1147851 1146138 1139898 1129840 1115904 1098057 1077316
61089 1077316 1055096 1031847 1007167 981176 954966 929503 904776 880293 856005 832435 810231
61078 810231 789799 771147 753898 737610 722137 707568 693950 681404 670448 661669 654986 649668
61066 649668 645302 642340 641395 642325 644295 646531 648736 651005 653644 656943 660890 665223 669892 675328 682121
$$ packed form
61153G54463j3135j1254q654p003o468n619l728j715m79K79R67J012k45k468m921
61138F91032p373r569j0620r981q443p146o011m348k487j487j256m25J671M134
61124F27691O020P580R366J1154J2619J4297J6874J9929K2313K3568K4172K4552
61112H20135K4582K4195K3848K4064K4835K5553K5515K4475K2838K1168J9495
61101A080703J7443J5034J2787J0698P792L394j713o240j0058j3936j7847k0741
61089A077316k2220k3249k4680k5991k6210k5463k4727k4483k4288k3570k2204
61078H10231k0432j8652j7249j6288j5473j4569j3618j2546j0956q779o683n318
61066F49668m366k962r45R30J970K236K205K269K639L299L947M333M669N436O793
$$ plain form
61051 682121 690588 700681 712021 723937 735957 748505 762736 779304 797714 817275 838285 861676
61039 861676 887752 915934 945559 976248 1007518 1038834 1070277 1102563 1136149 1170811 1206401
61028 1206401 1243519 1283008 1325014 1368905 1413896 1459420 1505093 1550788 1597006 1645123 1697221
61017 1697221 1755500 1821672 1896884 1982276 2079487 2190446 2317131 2462334 2630970 2830174
61007 2830174 3067750 3350719 3685536 4079616 4542928 5089450 5738691 6516118 7450189
60998 7450189 8565150 9872702 11368050 13031525 14827115 16687207 18490297 20062177
60990 20062177 21227005 21890594 22095316 21998864 21793754 21631202 21590591 21678356 21822909 21871126
60980 21871126 21623638 20917953 19710708 18096952 16255269 14366507 12561368 10912609
$$ packed form
61051F82121Q467J0093J1340J1916J2020J2548J4231J6568J8410J9561K1010K3391
61039H61676K6076K8182K9625L0689L1270L1316L1443L2286L3586L4662L5590
61028A206401L7118L9489M2006M3891M4991M5524M5673M5695M6218M8117N2098
61017A697221N8279O6172P5212Q5392R7211J10959J26685J45203J68636J99204
61007B830174K37576K82969L34817L94080M63312N46522O49241P77427R34071
60998G450189J114961J307552J495348J663475J795590J860092J803090J571880
60990B0062177J164828O63589K04722r6452k05110j62552m0611Q7765J44553M8217
60980B1871126k47488p05685j207245j613756j841683j888762j805139j648759
$$ plain form
60972 10912609 9451228 8183036 7098763 6180950 5409247 4763184 4223124 3771316 3392929
60963 3392929 3075698 2808511 2580859 2383809 2211039 2058544 1923435 1803085 1695192
60954 1695192 1598272 1511803 1435642 1369160 1310996 1259637 1213924 1172758 1134532 1097424 1060382
60943 1060382 1023573 987768 953508 920981 890265 861303 833742 807218 781891 758399 737042
60932 737042 717225 697971 678959 660719 643714 627552 611497 595618 581032 568846 559056 550595
60920 550595 542313 533859 525820 519136 514187 510299 506334 501909 497853 495249 494197 493781 493147 492365 492277
60905 492277 493667 496504 499800 502305 503558 504176 505015 506238 507458 508537 509767 511270 512604 513076 512252
60890 512252 510139 507147 503817 500357 496482 491982 487288 483016 479004 474360 468595 462188 455837 449674
$$ packed form
60972A0912609j461381j268192j084273r17813p71703o46063n40060m51808l78387
60963C392929l17231k67187k27652j97050j72770j52495j35109j20350j07893
60954A695192r6920q6469p6161o6482n8164n1359m5713m1166l8226l7108l7042
60943A060382l6809l5805l4260l2527l0716k8962k7561k6524k5327k3492k1357
60932G37042j9817j9254j9012j8240j7005j6162j6055j5879j4586j2186r790q461
60920E50595q282q454q039o684m949l888l965m425m056k604j052m16o34p82q8
60905D92277J390K837L296K505J253O18Q39J223J220J079J230J503J334M72q24
60890E12252k113k992l330l460l875m500m694m272m012m644n765o407o351o163
$$ plain form
60876 449674 443575 437814 432896 428974 425855 423417 421647 420376 419355 418627 418565 419552 421754 425049 428921
60861 428921 432625 435786 438848 442649 447595 453474 459964 466892 473918 480344 485460 489068 491688 494382
60847 494382 498223 503539 509556 515028 519300 522555 525042 526518 526648 525616 523918 521728 518817 515052
60833 515052 510622 505791 500749 495794 491325 487457 483794 479788 475274 470650 466641 463868 462328 461125
60819 461125 459026 455622 451773 448522 445742 442344 437801 432848 428451 424648 420853 416949 413475 410881
60805 410881 409108 407899 407062 406380 405678 405134 405210 406114 407583 409296 411202 413325 415513 417616 419743 422180
60789 422180 425107 428527 432271 435989 439312 442186 444966 448036 451450 455039 458722 462613 466932 471931
60775 471931 477772 484356 491358 498498 505678 512847 519900 526803 533662 540630 547911 555803 564411 573220
$$ packed form
60876D49674o099n761m918l922l119k438j770j271j021p28o2R87K202L295L872
60861D28921L704L161L062L801M946N879O490O928P026O426N116L608K620K694
60847D94382L841N316O017N472M272L255K487J476J30j032j698k190k911l765
60833E15052m430m831n042m955m469l868l663m006m514m624m009k773j540j203
60819D61125k099l404l849l251k780l398m543m953m397l803l795l904l474k594
60805D10881j773j209q37o82p02n44P6R04J469J713J906K123K188K103K127K437
60789D22180K927L420L744L718L323K874K780L070L414L589L683L891M319M999
60775D71931N841O584P002P140P180P169P053O903O859O968P281P892Q608Q809
$$ plain form
60761 573220 581335 588380 594881 601543 608476 615457 622607 630306 638527 646713 654392 661598 668648 675742
60747 675742 682900 690144 697657 705770 714676 724093 733425 742359 750967 759049 765846 770974 775300 780098
60733 780098 785329 789527 791655 792366 792980 793718 793631 791961 788909 785040 780566 775442 769739 763503 756408
60718 756408 747947 738127 727795 718096 709560 701708 693475 684048 673420 662374 651932 642603 634011
60705 634011 625329 616118 606664 597491 588786 580408 572197 563965 555385 546258 536920 528049 519984 512428
60691 512428 504892 497161 489265 481251 473276 465835 459603 454930 451472 448425 445180 441738 438415 435235
60677 435235 431879 428293 425013 422581 420865 419322 417808 416627 415845 415046 413978 412976 412451 412297 412121
60662 412121 411820 411561 411288 410656 409564 408452 407939 408223 408954 409692 410403 411437 413071 415214 417667 420506
$$ packed form
60761E73220Q115P045O501O662O933O981P150P699Q221Q186P679P206P050P094
60747F75742P158P244P513Q113Q906R417R332Q934Q608Q082O797N128M326M798
60733G80098N231M198K128P11O14P38q7j670l052l869m474n124n703o236p095
60718G56408q461r820j0332r699q536p852q233r427j0628j1046j0442r329q592
60705F34011q682r211r454r173q705q378q211q232q580r127r338q871q065p556
60691E12428p536p731p896q014p975p441o232m673l458l047l245l442l323l180
60677D35235l356l586l280k432j716j543j514j181p82p99j068j002n25j54j76
60662D12121l01k59k73o32j092j112n13K84P31P38P11J034J634K143K453K839
$$ plain form
60646 420506 423947 427899 431902 435534 438650 441214 443145 444463 445302 445711 445690 445454 445318 445132 444255 442469
60630 442469 440627 439951 440769 442354 443873 445001 445638 445570 444683 443214 441501 439692 437825 435998 434246 432424
60614 432424 430391 428140 425629 422652 419169 415608 412556 410247 408640 407867 408117 408993 409488 408974 407877
60599 407877 406988 406355 405340 403739 402257 401678 401994 402634 403295 404189 405528 407060 408170 408412 408018 407767 408155
60582 408155 408677 408355 407065 405875 405760 406478 407267 408227 410258 413687 417798 421856 425946 430541 435848 441974
60566 441974 449228 457780 467336 477529 488302 499501 510357 519906 527706 533761 537949 540056 540225
60553 540225 538779 535620 530468 523864 517418 512648 509924 508762 508781 509948 512190 515315 519384 524815 532008
60538 532008 541089 552077 565012 579664 595112 609836 622398 632082 638934 643261 645174 644600 641579
$$ packed form
60646D20506L441L952M003L632L116K564J931J318Q39M09k1k36j36j86q77j786
60630D42469j842o76Q18J585J519J128O37o8q87j469j713j809j867j827j752j822
60614D32424k033k251k511k977l483l561l052k309j607p73K50Q76M95n14j097
60599D07877q89o33j015j601j482n79L16O40O61Q94J339J532J110K42l94k51L88
60582D08155N22l22j290j190j15P18P89R60K031L429M111M058M090M595N307O126
60566D41974P254Q552R556J0193J0773J1199J0856R549P800O055M188K107J69
60553E40225j446l159n152o604o446m770k724j162J9J167K242L125M069N431P193
60538E32008R081J0988J2935J4652J5448J4724J2562R684O852M327J913n74l021
$$ plain form
60525 641579 636475 629922 622690 615555 609159 603907 599928 597088 594994 593107 591069 589007 587415 586665
60511 586665 586739 587444 588818 591135 594522 598722 603324 608262 614022 621356 630822 642602 656704 673268
60497 673268 692704 715632 742726 774445 810677 850513 892448 934916 976664 1016622 1053454
60486 1053454 1085403 1110622 1127653 1135513 1133444 1120871 1097842 1065443 1025662 980822 933230 885160
60474 885160 838663 795088 754856 717887 684251 654264 628105 605534 586021 568956 553713
60463 553713 539795 527080 515762 505858 496878 488256 479996 472605 466311 460718 455414 450593 446736
60450 446736 443866 441492 439152 436621 433707 430430 427523 426105 426437 427425 427738 427083 425932 424426 422293
60435 422293 419735 417623 416599 416508 416826 417149 417096 416341 415120 414294 414433 415089 415347 414864 413981 413053 412123 411222
$$ packed form
60525F41579n104o553p232p135o396n252l979k840k094j887k038k062j592p50
60511E86665P4P05J374K317L387M200M602M938N760P334R466J1780J4102J6564
60497F73268J9436K2928K7094L1719L6232L9836M1935M2468M1748L9958L6832
60486A053454L1949K5219J7031P860k069j2573k3029l2399l9781m4840m7592m8070
60474H85160m6497m3575m0232l6969l3636k9987k6159k2571j9513j7065j5243
60463E53713j3918j2715j1318r904q980q622q260p391o294n593n304m821l857
60450D46736k870k374k340k531k914l277k907j418L32R88L13o55j151j506k133
60435D22293k558k112j024r1L18L23n3p55j221q26J39O56K58m83q83r28r30r01
$$ plain form
60417 411222 410565 410368 410690 411424 412279 412873 413108 413391 414255 415869 418105 420892 424033 426833 428476 429012 429500
60400 429500 430859 432842 434424 435011 434948 435025 435842 437598 440120 442926 445473 447527 449225 450769 452220 453718
60384 453718 455680 458521 462130 465848 469016 471414 473134 474261 474916 475496 476554 478281 480256 481846 482864
60369 482864 483774 485243 487512 490209 492719 494647 495916 496585 496816 496971 497431 498153 498667 498757 498939 499951 501896
60352 501896 504234 506549 508900 511436 514126 517109 520912 525981 532146 538831 545689 552815 560318 567861
60338 567861 574666 579897 583034 583964 582771 579599 574757 568783 562192 555245 548139 541294 535184 529934
60324 529934 525377 521478 518387 516077 514208 512367 510254 507719 505018 502920 502041 502084 502196 502182 502837 504998
60308 504998 508859 514377 521664 530600 540594 551262 562985 576509 592348 610726 631289 652300
$$ packed form
60417D11222o57j97L22P34Q55N94K35K83Q64J614K236K787L141K800J643N36M88
60400D29500J359J983J582N87o3P7Q17J756K522K806K547K054J698J544J451J498
60384D53718J962K841L609L718L168K398J720J127O55N80J058J727J975J590J018
60369D82864R10J469K269K697K510J928J269O69K31J55M60P22N14R0J82J012J945
60352E01896K338K315K351K536K690K983L803N069O165O685O858P126P503P543
60338E67861O805N231L137R30j193l172m842n974o591o947p106o845o110n250
60324E29934m557l899l091k310j869j841k113k535k701k098q79M3J12j4O55K161
60308E04998L861N518P287Q936R994J0668J1723J3524J5839J8378K0563K1011
$$ plain form
60296 652300 670782 684347 692693 696858 697475 694496 688206 679548 669482 658696 647911 637766 628395
60283 628395 619606 611400 603765 596115 587606 578054 567982 557882 548005 538725 530378 522711 515168 507752
60269 507752 500964 494931 489329 484165 479847 476369 473228 470311 468030 466383 464766 463049 461951 461856 462021
60254 462021 461573 460608 459718 459023 458337 457748 457399 457124 456880 457082 457893 458635 458618 458182 458158 458607 458942 459104 459721
60235 459721 461068 462676 464175 465859 468076 470544 472634 474137 475557 477757 481293 485867 490468 494229
60221 494229 497096 499478 501525 503155 504660 506765 509973 514186 518983 523960 528781 533292 537752 542624
60207 542624 548042 553682 559226 564642 569900 574716 578832 582374 585722 589094 592473 595852 599300 602677
60193 602677 605449 606996 607214 606716 606398 606752 607567 608099 607499 605303 601822 597959 594422 591217 588077 585120
$$ packed form
60296F52300J8482J3565Q346M165O17k979o290q658j0066j0786j0785j0145r371
60283F28395q789q206p635p650q509r552j0072j0100r877r280q347p667p543p416
60269E07752o788o033n602n164m318l478l141k917k281j647j617j717j098r5J65
60254D62021m48r65q90o95o86n89l49k75k44K02Q11P42j7m36k4M49L35J62O17
60235D59721J347J608J499J684K217K468K090J503J420K200L536M574M601L761
60221D94229K867K382K047J630J505K105L208M213M797M977M821M511M460M872
60207E42624N418N640N544N416N258M816M116L542L348L372L379L379L448L377
60193F02677K772J547K18m98l18L54Q15N32o00k196l481l863l537l205l140k957
$$ plain form
60177 585120 582603 580215 577226 573464 569586 566233 563475 561242 559628 558412 556909 554827 552820 551617
60163 551617 550983 550155 548999 548072 547765 547990 548623 549693 551116 552746 554645 556886 559154 560972 562286 563414
60147 563414 564499 565443 566318 567375 568696 570315 572681 576438 581627 587529 593370 598837 603878 608477 612830
60132 612830 617358 622359 627699 632859 637083 639670 640497 640194 639438 638191 636069 633363 631113 630048 629891
60117 629891 629840 629395 628640 628069 628217 629163 630377 631305 631941 632443 632485 631616 630103 628647 627310 625555 623411
60100 623411 621627 620306 618359 614877 610397 606207 603005 600878 599949 600228 601087 601721 602000 602366 603093 604218
60084 604218 606005 608823 612546 616541 620264 623538 626400 629097 632018 635114 637475 638048 636822 634781
60070 634781 632651 630175 626703 621975 616082 609104 601168 592744 584641 577655 572129 567686 563411 558609
$$ packed form
60177E85120k517k388k989l762l878l353k758k233j614j216j503k082k007j203
60163E51617o34q28j156r27l07K25O33J070J423J630J899K241K268J818J314J128
60147E63414J085R44Q75J057J321J619K366L757N189N902N841N467N041M599M353
60132F12830M528N001N340N160M224K587Q27l03p56j247k122k706k250j065j57
60117F29891n1m45p55n71J48R46J214R28O36N02M2q69j513j456j337j755k144
60100F23411j784j321j947l482m480m190l202k127r29K79Q59O34K79L66P27J125
60084F04218J787K818L723L995L723L274K862K697K921L096K361N73j226k041
60070F34781k130k476l472m728n893o978p936q424q103o986n526m443m275m802
$$ plain form
60056 558609 553394 548318 543455 538285 532636 527326 523510 521516 520733 520546 521039 522591 525096 527975 530961
60041 530961 534494 539105 544611 550201 555245 559678 563602 566881 569266 570638 570941 570176 568619 566777 564801
60026 564801 562171 558248 553040 547144 541086 534996 528828 522513 515898 508851 501508 494256 487438 481182
60012 481182 475500 470411 466004 462505 460209 459162 458967 459086 459327 459917 461181 463266 466052 469174 472214
59997 472214 475091 478156 481734 485740 489941 494433 499460 504860 510063 514675 518751 522440 525711 528599
59983 528599 531399 534386 537420 539985 541598 542125 541754 540732 539117 536841 533990 530891 527794 524572 520935
59968 520935 516863 512725 509081 506459 505093 504584 504080 503147 502356 502535 503534 504274 504126 503658 503745 504429 505123
59951 505123 505599 506246 507418 509006 510756 512590 514428 515975 517030 517928 519338 521376 523122 523303 521514
$$ packed form
60056E58609n215n076m863n170n649n310l816j994p83j87M93J552K505K879K986
60041E30961L533M611N506N590N044M433L924L279K385J372L03p65j557j842j976
60026E64801k630l923n208n896o058o090o168o315o615p047p343p252o818o256
60012D81182n682n089m407l499k296j047j95J19K41N90J264K085K786L122L040
59997D72214K877L065L578M006M201M492N027N400N203M612M076L689L271K888
59983E28599K800K987L034K565J613N27l71j022j615k276k851l099l097l222l637
59968E20935m072m138l644k622j366n09n04r33p91J79R99P40j48m68Q7O84O94
59951E05123M76O47J172J588J750J834J838J547J055Q98J410K038J746J81j789
$$ plain form
59936 521514 518501 515187 511766 508033 504227 500984 498424 495830 492500 488618 485043 482435 480862 480104
59922 480104 480001 480475 481415 482642 483967 485221 486279 487093 487749 488530 489844 492018 495048 498616 502291 505828
59906 505828 509320 513053 517050 520760 523463 525113 526507 528417 530811 533184 535365 537561 539813 542017
59892 542017 544507 548055 553074 559156 565509 571448 576411 580048 582638 585047 587871 590855 593432 595561
59878 595561 597677 600041 602564 605148 607845 610637 613200 614944 615231 613809 611137 608027 604791 600997
59864 600997 596268 590944 585698 580864 576575 573190 570950 569389 567725 565875 564507 564099 564491 565500 567429
59849 567429 570764 575754 582444 590642 599626 608369 616342 623742 630636 636332 640017 641666 641827 640867 639042
59834 639042 637102 636008 635809 635332 633319 629518 624423 618310 611054 602847 594615 587397 581433 576115 570853
$$ packed form
59936E21514l013l314l421l733l806l243k560k594l330l882l575k608j573p58
59922D80104j03M74R40J227J325J254J058Q14O56P81J314K174L030L568L675L537
59906E05828L492L733L997L710K703J650J394J910K394K373K181K196K252K204
59892E42017K490L548N019O082O353N939M963L637K590K409K824K984K577K129
59878E95561K116K364K523K584K697K792K563J744K87j422k672l110l236l794
59864F00997m729n324n246m834m289l385k240j561j664j850j368m08L92J009J929
59849E67429L335M990O690Q198Q984Q743P973P400O894N696L685J649J61r60j825
59834F39042j940j094j99m77k013l801n095o113p256q207q232p218n964n318n262
$$ plain form
59819 570853 565660 560675 555410 549064 541688 534432 528281 522964 517681 512538 508487 505913 504118 502466
59805 502466 501196 500607 500101 498811 496863 495165 494063 492924 491177 489060 487082 485353 483863 482981 483101
59790 483101 483916 484512 484198 483014 481486 480132 479153 478311 477119 475364 473493 472296 472150 472716 473363 473682
59774 473682 473582 473123 472500 472065 472140 472722 473446 473927 474242 475049 477202 481114 486405 492081 497028 500510 502551
59757 502551 504029 506175 509646 514001 518184 521481 524014 526447 529455 533360 537994 542882 547710 552600
59743 552600 557739 562838 567251 570646 573272 575510 577536 579486 581527 583485 584743 584916 584536 584693 586008
59728 586008 588110 590079 591169 591244 590782 590465 590583 590837 590923 591123 591977 593364 594436 594684 594735 595680 597781 600247
59710 600247 602308 604111 606393 609533 613232 617086 621071 625356 629829 634099 637958 641652 645595 649852
$$ packed form
59819E70853n193m985n265o346p376p256o151n317n283n143m051k574j795j652
59805E02466j270n89n06j290j948j698j102j139j747k117j978j729j490q82J20
59790D83101Q15N96l14j184j528j354r79q42j192j755j871j197j46N66O47L19
59774D73682j00m59o23m35P5N82P24M81L15Q07K153L912N291N676M947L482K041
59757E02551J478K146L471M355M183L297K533K433L008L905M634M888M828M890
59743E52600N139N099M413L395K626K238K026J950K041J958J258J73l80J57J315
59728E86008K102J969J090P5m62l17J18K54Q6K00Q54J387J072K48N1R45K101K466
59710F00247K061J803K282L140L699L854L985M285M473M270L859L694L943M257
$$ plain form
59696 649852 653951 657183 659137 660079 660799 661903 663189 663819 663163 661372 659030 656472 653594 650265 646727
59681 646727 643505 641003 639115 637203 634600 631288 627994 625439 623500 621325 618251 614407 610354 606349
59667 606349 602134 597417 592397 587739 584024 581241 578894 576601 574466 572818 571710 570868 570051 569249 568598
59652 568598 568350 568889 570474 572889 575549 578060 580345 582095 582537 581162 578484 575571 572794 569502 565077
59637 565077 559881 554891 550675 547092 543792 540631 537609 534792 532396 530673 529588 528821 528143 527539 526871
59622 526871 525757 524004 521865 519598 517088 514276 511689 509946 508871 507727 506322 505217 504661 504052 502906
59607 502906 501775 501628 502643 504210 505858 507560 509256 510692 511777 512593 513057 513028 512787 512872 513340 513634 513376
59590 513376 512814 512351 512054 511889 512016 512562 513379 514329 515451 516565 517034 516337 514661 512595 510393 507854 504730
$$ packed form
59696F49852M099L232J954R42P20J104J286O30o56j791k342k558k878l329l538
59681F46727l222k502j888j912k603l312l294k555j939k175l074l844m053m005
59667F06349m215m717n020m658l715k783k347k293k135j648j108q42q17q02o51
59652E68598k48N39J585K415K660K511K285J750M42j375k678k913k777l292m425
59637E65077n196m990m216l583l300l161l022k817k396j723j085p67o78o04o68
59622E26871j114j753k139k267k510k812k587j743j075j144j405j105n56o09j146
59607E02906j131j47J015J567J648J702J696J436J085Q16M64k9k41Q5M68K94k58
59590E13376n62m63k97j65J27N46Q17R50J122J114M69o97j676k066k202k539l124
$$ plain form
59573 504730 500913 496381 491398 486694 483017 480437 478390 476437 474730 473654 473288 473320 473407 473515 473912 474746
59557 474746 475674 476182 476389 477178 479185 481899 484233 485856 487443 489636 492317 495118 498145 501822 506270
59542 506270 511272 516804 523313 531391 541292 552845 565824 580346 596745 614857 633348 649800
59530 649800 661672 667547 667907 664920 661221 658520 657254 657437 659400 663403 668910 674786 680209 684934
59516 684934 688674 690720 690331 687207 681486 673622 664328 654240 643456 631723 619220 606802 595249
59503 595249 584603 574497 564914 556301 549040 543008 537671 532574 527822 524015 521475 519668 517738 515584
59489 515584 513956 513485 514107 515479 517344 519288 520814 522108 524142 527504 531657 535919 540619 546526 553426
59474 553426 560146 565903 570919 575706 580429 585024 589288 592687 594610 595027 594538 593770 593126 593124 594375 597060
$$ packed form
59573E04730l817m532m983m704l677k580k047j953j707j076l66L2Q7J08L97Q34
59557D74746R28N08K07P89K007K714K334J623J587K193K681K801L027L677M448
59542E06270N002N532O509Q078R901J1553J2979J4522J6399J8112J8491J6452
59530F49800J1872N875L60k987l699k701j266J83J963M003N507N876N423M725
59516F84934L740K046l89l124n721p864r294j0088j0784j1733j2503j2418j1553
59503E95249j0646j0106r583q613p261o032n337n097m752l807k540j807j930k154
59489E15584j628m71O22J372J865J944J526J294K034L362M153M262M700N907O900
59474E53426O720N757N016M787M723M595M264L399J923M17m89p68o44kJ251K685
$$ plain form
59458 597060 600919 605869 612190 619956 628818 638557 649363 661271 673857 686771 700123 713885 727273
59445 727273 739185 749042 756805 762363 765248 764800 760350 751543 738974 724409 709839 696172 683073
59432 683073 670086 657672 646996 638879 633059 628465 624240 620465 617878 616992 617732 619953 623975 630358
59418 630358 639372 650945 665027 681676 700719 721474 742869 763927 784239 803989 823186 840540
59406 840540 853078 857233 850942 835290 814400 793306 775338 761179 750320 742932 739856 740932
59394 740932 743942 745308 741547 730488 712193 689203 665243 643007 623199 605592 590182 576961
59382 576961 565440 555297 547059 541392 537883 535291 532862 530831 529686 529579 530418 531990 533955 536076
59368 536076 538363 540652 542376 543347 544513 547181 551536 556605 561596 566508 571452 576316 581386 587554
$$ packed form
59458E97060L859M950O321P766Q862R739J0806J1908J2586J2914J3352J3762J3388
59445G27273J1912R857P763N558K885m48m450q807j2569j4565j4570j3667j3099
59432F83073j2987j2414j0676q117n820m594m225l775k587q86P40K221M022O383
59418F30358R014J1573J4082J6649J9043K0755K1395K1058K0312J9750J9197J7354
59406H40540J2538M155o291j5652k0890k1094j7968j4159j0859p388l076J076
59394G40932L010J366l761j1059j8295k2990k3960k2236j9808j7607j5410j3221
59382E76961j1521j0143q238n667l509k592k429k031j145j07Q39J572J965K121
59368E36076K287K289J724R71J166K668M355N069M991M912M944M864N070O168
$$ plain form
59354 587554 595476 605047 615961 628210 641698 656052 671261 688003 706820 727272 748310 769121
59342 769121 789264 808406 826433 843525 859656 874209 886352 895464 900951 902178 899086 892507
59330 892507 883377 871959 858370 843403 828055 812502 796406 780166 765055 751934 740475 729795
59318 729795 719286 708689 698060 688001 679415 672611 667009 661991 657606 654119 651328 648867 646932
59305 646932 646173 647014 649482 653671 659825 667882 677312 687581 698570 710332 722552 734221 743643
59292 743643 748716 747739 740496 728770 715479 703044 692468 683788 677017 672348 669645 668345 668128 669368
59278 669368 672576 677523 683316 689406 696163 704319 714105 725202 737271 750133 763410 776377 788379
59265 788379 799203 808820 816869 822651 825664 825955 823848 819498 812904 804239 793950 782424 769751
$$ packed form
59354E87554P922R571J0914J2249J3488J4354J5209J6742J8817K0452K1038K0811
59342G69121K0143J9142J8027J7092J6131J4553J2143R112N487J227l092o579
59330H92507r130j1418j3589j4967j5348j5553j6096j6240j5111j3121j1459j0680
59318G29795j0509j0597j0629j0059q586o804n602n018m385l487k791k461j935
59305F46932p59Q41K468M189O154Q057R430J0269J0989J1762J2220J1669R422
59292G43643N073r77p243j1726j3291j2435j0576q680o771m669k703j300k17J240
59278F69368L208M947N793O090O757Q156R786J1097J2069J2862J3277J2967J2002
59265G88379J0824R617Q049N782L013K91k107m350o594q665j0289j1526j2673
$$ plain form
59252 769751 755954 741408 726955 713592 702026 692410 684424 677691 672124 667828 664682 662256 660317
59239 660317 659235 659629 661650 664865 668845 673506 678757 684080 688801 692601 695466 697156 697082 694803 690438
59224 690438 684478 677390 669432 660605 650626 639288 627135 615593 605989 598425 591937 585707 579718
59211 579718 574237 569225 564571 560539 557530 555531 554152 553074 552198 551524 551212 551688 553264 555607 557906
59196 557906 559637 560969 562403 564362 567111 570779 575235 580170 585412 591082 597384 604406 612061 619993
59182 619993 627576 634356 640539 646675 652790 658247 662692 666677 670992 675703 680315 684708 689431 695077
59168 695077 701767 709305 717462 725986 734531 742766 750470 757496 763783 769406 774485 778875 782045 783318
59154 783318 782304 779073 773989 767390 759406 750021 739291 727521 715327 703508 692704 683063 674318
$$ packed form
59252G69751j3797j4546j4453j3363j1566r616p986o733n567m296l146k426j939
59239F60317j082L94K021L215L980M661N251N323M721L800K865J690p4k279m365
59224F90438n960p088p958q827r979j1338j2153j1542r604p564o488o230n989
59211E79718n481n012m654m032l009j999j379j078q76o74l12M76J576K343K299
59196E57906J731J332J434J959K749L668M456M935N242N670O302P022P655P932
59182F19993P583O780O183O136O115N457M445L985M315M711M612M393M723N646
59168F95077O690P538Q157Q524Q545Q235P704P026O287N623N079M390L170J273
59154G83318j014l231n084o599p984r385j0730j1770j2194j1819j0804r641q745
$$ plain form
59141 674318 666290 659146 653022 647567 642287 637265 633174 630428 628660 627162 625610 624226 623450 623625 624799
59126 624799 626718 629179 632415 636929 642896 650024 658035 666912 676544 686586 696866 707566 718783
59113 718783 730303 742029 754133 766450 778215 788885 798789 808446 817621 825662 832446 838355 843562
59100 843562 848052 852131 856129 859624 861676 861916 860788 858786 856142 853252 850585 848013 845000 841710
59086 841710 839085 837414 835569 832245 827402 821889 816134 809806 802392 793456 782625 770028 756689
59073 756689 743972 732565 722297 712777 703762 695053 686536 678379 670847 663926 657395 651232 645597
59060 645597 640424 635386 630328 625424 620840 616460 612043 607486 602862 598289 593836 589572 585742 582844
59046 582844 581200 580384 579404 577744 576045 575442 576389 578386 580666 582800 584796 587042 590062 593886 597716
$$ packed form
59141F74318q028p144o124n455n280n022m091k746j768j498j552j384p76J75J174
59126F24799J919K461L236M514N967P128Q011Q877R632J0042J0280J0700J1217
59113G18783J1520J1726J2104J2317J1765J0670R904R657R175Q041O784N909N207
59100H43562M490M079L998L495K052K40j128k002k644k890k667k572l013l290
59086H41710k625j671j845l324m843n513n755o328p414q936j0831j2597j3339
59073G56689j2717j1407j0268r520r015q709q517q157p532o921o531o163n635
59060F45597n173n038n058m904m584m380m417m557m624m573m453m264l830k898
59046E82844j644q16r80j660j699o03R47J997K280K134J996K246L020L824L830
$$ plain form
59031 597716 600683 602999 605964 610701 617280 625100 633676 642823 652485 662773 674034 686648 700798
59018 700798 716417 733048 749686 765111 778639 790256 799866 806819 810575 811558 810865 809263 806910
59005 806910 804026 801363 799816 799824 801270 803801 807191 811487 816810 822885 828882 833951 837909 841083 843474
58990 843474 844437 843342 840267 835815 830455 824279 817243 809351 800551 790698 779778 768284 757372 748446
58976 748446 742246 738289 735517 733561 733059 734605 737802 741760 746154 751339 757600 764921 773397 783229
58962 783229 794061 804878 814870 824058 832715 840487 846424 849760 850345 848385 844077 837510 828790 818195
58948 818195 806190 793211 779458 765120 750817 737489 725677 715175 705576 696918 689532 683511
58936 683511 678632 674703 671699 669560 667985 666339 663778 659808 654907 650172 646067 641899 636962 631796
$$ packed form
59031E97716K967K316K965M737O579P820Q576R147R662J0288J1261J2614J4150
59018G00798J5619J6631J6638J5425J3528J1617R610O953L756R83o93j602k353
59005H06910k884k663j547QJ446K531L390M296N323O075N997N069L958L174K391
58990H43474R63j095l075m452n360o176p036p892q800r853j0920j1494j0912q926
58976G48446o200l957k772j956n02J546L197L958M394N185O261P321Q476R832
58962G83229J0832J0817R992R188Q657P772N937L336N85j960m308o567q720j0595
58948H18195j2005j2979j3753j4338j4303j3328j1812j0502r599q658p386o021
58936F83511m879l929l004k139j575j646k561l970m901m735m105m168m937n166
$$ plain form
58922 631796 627666 625004 623039 620902 618463 616027 613910 612537 612371 613345 614703 615693 616224 616748 617818
58907 617818 619849 622972 626962 631653 637480 645130 654602 665160 676454 689003 703091 717803 731914
58894 731914 745394 759159 773414 787146 799595 811667 825347 841915 861093 881824 903393
58883 903393 925573 947891 969226 988296 1004289 1016827 1025570 1030291 1031196 1028691 1022774 1013129 999876
58870 999876 983737 965326 944880 923069 901460 881572 863750 847450 832332 818475 805752
58859 805752 793663 781772 769836 757590 744994 732705 721707 712294 703852 695770 688168 681541
58847 681541 676086 671538 667324 662732 657315 651328 645425 639761 633802 627226 620622 614876 610214 606282
58833 606282 602901 600169 597864 595305 592000 588148 584404 581401 579533 578825 578776 578600 577957 577366 577646 579024
$$ packed form
58922F31796m130k662j965k137k439k436k117j373j66R74J358R90N31N24J070
58907F17818K031L123L990M691N827P650R472J0558J1294J2549J4088J4712J4111
58894G31914J3480J3765J4255J3732J2449J2072J3680J6568J9178K0731K1569
58883I03393K2180K2318K1335J9070J5993J2538Q743M721R05k505n917r645j3253
58870I99876j6139j8411k0446k1811k1609j9888j7822j6300j5118j3857j2723
58859H05752j2089j1891j1936j2246j2596j2289j0998r413q442q082p602o627
58847F81541n455m548m214m592n417n987n903n664n959o576o604n746m662l932
58833F06282l381k732k305k559l305l852l744l003j868p08m9j76o43n91K80J378
$$ plain form
58817 579024 581049 583309 585842 588662 591247 592895 593550 593846 594271 594627 594481 593890 593350 593202 593420 593935 594776
58800 594776 595737 596264 595951 595017 594036 593248 592396 591190 589667 587984 586186 584424 583218 583108 583997 585214
58784 585214 586424 588199 591427 596234 601802 607161 611919 616208 620262 624209 628022 631400 633774 634645
58770 634645 633974 632213 629905 627332 624472 621231 617652 613845 609770 605255 600366 595702 592115 590072
58756 590072 589263 588916 588552 588548 589934 593390 598357 603349 607317 610428 613362 616256 618850 621327 624361 628304
58740 628304 632944 638126 644044 650739 657871 665224 672981 681159 689257 696800 703897 710934 718030 725100
58726 725100 732148 739154 745890 752117 757621 761883 764230 764752 764669 765269 766783 768802 771385 775065 779900
58711 779900 785255 790494 795280 799122 801270 801300 799452 796181 791662 785779 778344 769172 758164 745349
$$ packed form
58817E79024K025K260K533K820K585J648O55K96M25L56j46n91n40j48K18N15Q41
58800E94776R61N27l13r34r81p88q52j206j523j683j798j762j206j10Q89J217
58784E85214J210J775L228M807N568N359M758M289M054L947L813L378K374Q71
58770F34645o71j761k308k573k860l241l579l807m075m515m889m664l587k043
58756E90072q09l47l64mJ386L456M967M992L968L111K934K894K594K477L034L943
58740F28304M640N182N918O695P132P353P757Q178Q098P543P097P037P096P070
58726G25100P048P006O736O227N504M262K347N22q3O00J514K019K583L680M835
58711G79900N355N239M786L842K148L0j848l271m519n883p435r172j1008j2815
$$ plain form
58697 745349 730801 714668 697498 680288 663869 648392 633743 620212 608262 597821 588412 579923
58685 579923 572665 566603 561145 555854 550832 546219 541781 537252 532753 528569 524845 521757 519731 519231
58671 519231 520421 523097 526771 530780 534649 538509 542993 548652 555645 563897 573194 583000 592432 600610
58657 600610 606916 610963 612612 612113 610006 606842 603086 599133 595110 590789 586038 581222 576808 572714
58643 572714 568629 564774 561684 559202 556487 553272 550425 548904 548766 549643 551542 554507 557865 560554 562183
58628 562183 563291 564571 566203 567892 569240 570017 570315 570522 571150 572697 575573 579908 585396 591659 598809
58613 598809 607294 617056 627256 636996 645904 653777 660111 664446 666892 667891 667635 666072 663312 659677
58599 659677 655497 651205 647439 644601 642299 639609 635972 631712 627710 624820 623535 623951 625965 629579
$$ packed form
58697G45349j4548j6133j7170j7210j6419j5477j4649j3531j1950j0441r409q489
58685E79923p258o062n458n291n022m613m438m529m499m184l724l088k026n00
58671E19231J190K676L674M009L869L860M484N659O993Q252R297R806R432Q178
58657F00610O306M047J649m99k107l164l756l953m023m321m751m816m414m094
58643E72714m085l855l090k482k715l215k847j521j38Q77J899K965L358K689J629
58628E62183J108J280J632J689J348P77K98K07O28J547K876M335N488O263P150
58613E98809Q485R762J0200R740Q908P873O334M335K446R99k56j563k760l635
58599F59677m180m292l766k838k302k690l637m260m002k890j285M16K014L614
$$ plain form
58585 629579 635016 642437 651592 661845 672523 683209 693785 704264 714532 724266 733264 741793 750397
58572 750397 759300 768190 776591 784232 791196 798127 806396 817532 832085 849273 868006 888054 909873
58559 909873 933449 957679 980986 1002392 1021900 1039765 1055476 1067666 1075229 1078331 1078014 1075091
58547 1075091 1069860 1062721 1054384 1045313 1035538 1025076 1013930 1001571 987096 970304 952038 933167
58535 933167 913791 893829 873770 854294 835611 817797 801417 787273 775739 766777 760286 755944
58523 755944 753007 750794 749209 748401 748254 748622 749683 751473 753366 754556 754891 754757 754458 754274 754837 756656
58507 756656 759317 761730 763140 763481 762937 761795 760567 759535 758182 755712 752202 748640 745795 743632 741858
58492 741858 740410 739190 737935 736637 735717 735573 736349 738272 741770 746974 753491 760962 769585 779791 791518
$$ packed form
58585F29579N437P421R155J0253J0678J0686J0576J0479J0268R734Q998Q529Q604
58572G50397Q903Q890Q401P641O964O931Q269J1136J4553J7188J8733K0048K1819
58559I09873K3576K4230K3307K1406J9508J7865J5711J2190P563L102l17k923
58547A075091n231p139q337r071r775j0462j1146j2359j4475j6792j8266j8871
58535I33167j9376j9962k0059j9476j8683j7814j6380j4144j1534q962o491m342
58523G55944k937k213j585q08j47L68J061J790J893J190L35j34k99j84N63J819
58507G56656K661K413J410L41n44j142j228j032j353k470l510l562k845k163j774
58492G41858j448j220j255j298r20j44P76J923L498N204O517P471Q623J0206J1727
$$ plain form
58477 791518 804129 817072 830422 844562 859167 872692 883222 889940 893352 894037 891814 886540 879111
58464 879111 870889 862461 853668 844580 835702 827398 820000 814483 812151 813417 817540 823694 831602 840926
58450 840926 850744 859970 867716 873030 875022 873759 870440 866117 860629 853355 844627 835787 827977 821492
58436 821492 816327 812823 811510 812485 815145 818569 822253 826526 832284 840235 850335 861820 873728 885551
58422 885551 897527 910228 923700 937123 949373 959632 967263 971580 972337 970272 966544 961583 955021
58409 955021 946807 937821 929147 921156 913533 905922 898304 890971 884295 878418 873147 868372 864548 862459
58395 862459 862469 864256 867221 870830 874486 877505 879488 880615 881469 882536 883784 884580 884133 882253 879587
58380 879587 876970 874735 872876 871594 871330 872412 874997 879119 884478 890483 896953 904440 913365 923150
$$ packed form
58477G91518J2611J2943J3350J4140J4605J3525J0530O718L412O85k223n274p429
58464H79111q222q428q793r088q878q304p398n517k332J266M123O154P908R324
58450H40926R818R226P746N314J992j263l319m323n488p274q728q840p810o485
58436H21492n165l504j313R75K660L424L684M273N758P951J0100J1485J1908J1823
58422H85551J1976J2701J3472J3423J2250J0259P631M317P57k065l728m961o562
58409I55021q214q986q674p991p623p611p618p333o676n877n271m775l824k089
58395H62459J0J787K965L609L656L019J983J127Q54J067J248P96m47j880k666
58380H79587k617k235j859j282k64J082K585M122N359O005O470P487Q925R785
$$ plain form
58366 923150 932852 942373 952301 962749 973246 983826 995346 1008486 1023013 1038216 1053423 1067917
58354 1067917 1080972 1092375 1102506 1111596 1119210 1124716 1128058 1130017 1131835 1134499 1138102 1142030 1145995
58341 1145995 1150598 1156604 1164094 1172855 1183040 1194739 1207361 1220378 1234342 1250089 1267166 1284221
58329 1284221 1300867 1317898 1335502 1352438 1367386 1380120 1390925 1399813 1406799 1412243 1416582 1420273
58317 1420273 1424115 1428839 1434297 1439900 1445924 1453349 1462335 1472045 1482243 1493768 1506962 1520908 1534863
58304 1534863 1549330 1565015 1581735 1599145 1617500 1636830 1656198 1674615 1692060 1708966 1725576
58293 1725576 1742449 1760629 1780417 1800768 1820796 1841083 1862600 1885147 1907943 1931167 1955776
58282 1955776 1982104 2009630 2037963 2067299 2098004 2130186 2163565 2197564 2232010 2267837 2306342
$$ packed form
58366I23150R702R521R928J0448J0497J0580J1520J3140J4527J5203J5207J4494
58354A067917J3055J1403J0131R090P614N506L342J959J818K664L603L928L965
58341A145995M603O006P490Q761J0185J1699J2622J3017J3964J5747J7077J7055
58329A284221J6646J7031J7604J6936J4948J2734J0805Q888O986N444M339L691
58317A420273L842M724N458N603O024P425Q986R710J0198J1525J3194J3946J3955
58304A534863J4467J5685J6720J7410J8355J9330J9368J8417J7445J6906J6610
58293A725576J6873J8180J9788K0351K0028K0287K1517K2547K2796K3224K4609
58282A955776K6328K7526K8333K9336L0705L2182L3379L3999L4446L5827L8505
$$ plain form
58271 2306342 2347594 2390518 2434813 2481593 2531600 2584074 2638187 2694405 2753419 2814835 2878015
58260 2878015 2943344 3011534 3082389 3155221 3229701 3305290 3380693 3455021 3528937 3603809 3680403
58249 3680403 3759242 3841211 3926800 4015554 4107398 4203749 4306285 4415449 4531083 4653646
58239 4653646 4783743 4921388 5066869 5221465 5386236 5561052 5745852 5941833 6150355
58230 6150355 6371912 6607417 6859178 7129207 7417826 7725430 8054400 8407781 8787488
58221 8787488 9195521 9635660 10112227 10628587 11188820 11799610 12468606 13202292 14007616
58212 14007616 14894568 15875561 16964329 18178169 19540338 21078849 22825743 24821317
58204 24821317 27118828 29784565 32897749 36554611 40869175 45962950 51951725 58944828
$$ packed form
58271B306342M1252M2924M4295M6780N0007N2474N4113N6218N9014O1416O3180
58260B878015O5329O8190P0855P2832P4480P5589P5403P4328P3916P4872P6594
58249C680403P8839Q1969Q5589Q8754R1844R6351J02536J09164J15634J22563
58239D653646J30097J37645J45481J54596J64771J74816J84800J95981K08522
58230F150355K21557K35505K51761K70029K88619L07604L28970L53381L79707
58221H787488M08033M40139M76567N16360N60233O10790O68996P33686Q05324
58212A4007616Q86952R80993J088768J213840J362169J538511J746894J995574
58204B4821317K297511K665737L113184L656862M314564N093775N988775O993103
$$ plain form
58196 58944828 67060352 76450363 87332358 100017005 114904575 132423064 152913066
58189 152913066 176501299 203017248 231980139 262606062 293709088 323441351 349091619
58182 349091619 367375827 375412007 371925197 357826449 335703893 308640006 279229729
58175 279229729 249296951 220109064 192616313 167500075 145132906 125593885 108751928
58168 108751928 94359208 82121660 71743680 62949311 55488231 49139786 43717697
58161 43717697 39068426 35063893 31597178 28582004 25949231 23640456 21605369 19803007
58153 19803007 18200826 16771205 15490161 14338195 13299129 12357975 11501903 10722468
58145 10722468 10014180 9370842 8785129 8250983 7763994 7319620 6913125 6540947 6200034
$$ packed form
58196E8944828Q115524R390011J0881995J2684647J4887570J7518489K0490002
58189A52913066K3588233K6515949K8962891L0625923L1103026K9732263K5650268
58182C49091619J8284208Q036180l486810j4098748k2122556k7063887k9410277
58175B79229729k9932778k9187887k7492751k5116238k2367169j9539021j6841957
58168A08751928j4392720j2237548j0377980q794369p461080o348445n422089
58161D3717697m649271m004533l466715l015174k632773k308775k035087j802362
58153A9803007j602181j429621j281044j151966j039066r41154q56072p79435
58145A0722468p08288o43338n85713n34146m86989m44374m06495l72178l40913
$$ plain form
58136 6200034 5885898 5593228 5318350 5059513 4815164 4583845 4365603 4161551 3971743
58127 3971743 3794793 3629479 3475221 3331108 3195972 3069528 2952089 2843065 2740970
58118 2740970 2644968 2555253 2471849 2394090 2321322 2253092 2188646 2127185 2068563 2012861 1959438
58107 1959438 1907350 1856513 1807458 1760080 1713674 1668112 1623952 1581361 1539867 1499254 1459858
58096 1459858 1421931 1385495 1350764 1317981 1286921 1257257 1229316 1203726 1180516 1159312 1140162
58085 1140162 1123206 1107741 1092600 1077447 1062675 1047999 1032222 1014631 995782 976601 957436
58074 957436 938295 919258 900314 881307 862397 844203 827200 811313 796222 781836 768410
58063 768410 756407 746136 737315 729157 721123 713286 705654 697640 688776 679524 670631 661999 652980 643583
$$ packed form
58136F200034l14136k92670k74878k58837k44349k31319k18242k04052j89808
58127C971743j76950j65314j54258j44113j35136j26444j17439j09024j02095
58118B740970r6002q9715q3404p7759p2768o8230o4446o1461n8622n5702n3423
58107A959438n2088n0837m9055m7378m6406m5562m4160m2591m1494m0613l9396
58096A459858l7927l6436l4731l2783l1060k9664k7941k5590k3210k1204j9150
58085A140162j6956j5465j5141j5153j4772j4676j5777j7591j8849j9181j9165
58074I57436j9141j9037j8944j9007j8910j8194j7003j5887j5091j4386j3426
58063G68410j2003j0271q821q158q034p837p632q014q864r252q893q632r019r397
$$ plain form
58049 643583 634600 626580 619481 613316 608378 604692 601790 599086 596011 591972 586844 581423 576624 572234
58035 572234 567159 560927 554222 547758 541311 534094 525613 516017 506074 496822 488723 481110 473025 464569
58021 464569 456743 449930 443321 436155 428866 422603 418009 414748 411901 408596 404603 400505 397080 394512
58007 394512 392489 390892 389876 389324 388921 388827 389675 391652 394102 396252 397935 399480 401374 404122 407894
57992 407894 412053 415508 417743 419080 419828 419786 418837 417445 416156 415032 413960 413113 412673 412354 411619 410254
57976 410254 408474 406604 404832 403140 401396 399674 398515 398549 399820 401730 403685 405452 406893 407884 408606
57961 408606 409479 410573 411497 412030 412424 412848 412984 412449 411206 409290 406511 402829 398700 394675 390879 387115
57945 387115 383268 379428 375952 373604 373187 374756 377560 381005 385251 390539 396562 403142 410962 420783
$$ packed form
58049F43583q983q020p099o165m938l686k902k704l075m039n128n421m799m390
58035E72234n075o232o705o464o447p217q481r596r943r252q099p613q085q456
58021D64569p826o813o609p166p289o263m594l261k847l305l993m098l425k568
58007C94512k023j597j016n52m03r4Q48J977K450K150J683J545J894K748L772
57992D07894M159L455K235J337P48m2r49j392j289j124j072q47m40l19p35j365
57976D10254j780j870j772j692j744j722j159L4J271J910J955J767J441R91P22
57961D08606Q73J094R24N33L94M24J36n35j243j916k779l682m129m025l796l764
57945C87115l847l840l476k348m17J569K804L445M246N288O023O580P820R821
$$ plain form
57931 420783 432089 443356 453623 463019 471659 478972 484580 489070 493113 496153 496740 494192 489280 483163
57917 483163 476203 468210 459393 450449 441744 433015 424086 415428 407667 400838 394523 388576 383299 378861
57903 378861 374876 370649 365654 359797 353393 346929 340720 334811 329263 324389 320482 317500 315255 313758
57889 313758 313064 312937 313006 313131 313249 313090 312537 312154 312774 314534 316762 318739 320019 320099 318600 315986 313399
57872 313399 311396 309408 306756 303607 300541 297754 295178 292948 291190 289728 288519 288062 288869 290779 293340
57857 293340 296602 301005 306563 312719 319020 325541 332608 340374 348605 356703 364057 370596 376740 382617
57843 382617 387612 391075 393144 394422 395116 395011 394097 392595 390412 387169 382887 378213 373879 370225 367273
57828 367273 364823 362459 359898 357483 355915 355374 355275 355129 355287 356497 358931 361997 364990 367641 369991
$$ packed form
57931D20783J1306J1267J0267R396Q640P313N608M490M043L040N87k548m912o117
57917D83163o960p993q817q944q705q729q929q658p761o829o315n947n277m438
57903C78861l985m227m995n857o404o464o209n909n548m874l907k982k245j497
57889C13758o94j27O9J25J18j59n53l83O20J760K228J977J280Q0j499k614k587
57872C13399k003j988k652l149l066k787k576k230j758j462j209m57Q07J910K561
57857B93340L262M403N558O156O301O521P067P766Q231Q098P354O539O144N877
57843C82617M995L463K069J278O94j05r14j502k183l243m282m674m334l654k952
57828C67273k450k364k561k415j568n41r9j46J58J210K434L066K993K651K350
$$ plain form
57813 369991 372001 373478 374246 374145 372770 369477 363919 356508 348142 339506 330907 322692 315341 308997 303372
57798 303372 298378 294463 292017 290793 290261 290174 290392 290539 290429 290592 291720 293728 295884 297754 299386 300655
57782 300655 301200 301148 301256 302080 303557 305665 308867 313415 318641 323500 327650 331553 335563 339278 341851
57767 341851 342782 342393 341450 340198 337819 333159 326115 317940 309997 302514 294891 286929 279289 272716 267245
57752 267245 262349 257763 253927 251570 250850 251027 251130 250855 250602 250674 250778 250480 249820 249170 248618 247840 246570
57735 246570 244971 243442 242160 240900 239334 237542 236231 236347 238310 241603 245094 247788 249389 250372 251600
57720 251600 253641 256255 258544 259718 259744 259313 259217 259804 260829 261723 262017 261639 260794 259585 257880 255610 253075
57703 253075 250720 248636 246475 243996 241564 239873 239169 238970 238723 238524 238929 240131 241667 242909 243526 243409
$$ packed form
57813C69991K010J477P68j01j375l293n558p411q366q636q599q215p351o344n625
57798C03372m994l915k446j224n32q7K18J47j10J63J128K008K156J870J632J269
57782C00655N45n2J08Q24J477K108L202M548N226M859M150L903M010L715K573
57767C41851R31l89r43j252k379m660p044q175p943p483p623p962p640o573n471
57752B67245m896m586l836k357p20J77J03k75k53P2J04k98o60o50n52p78j270
57735B46570j599j529j282j260j566j792j311J16J963L293L491K694J601R83J228
57720B51600K041K614K289J174K6m31r6N87J025Q94K94l78q45j209j705k270k535
57703B53075k355k084k161k479k432j691p04j99k47j99M05J202J536J242O17j17
$$ plain form
57687 243409 242610 241637 241332 242048 243242 244388 246037 249340 254594 260959 267813 275800 286263 300073 317385
57672 317385 338225 362929 392145 426660 467079 513391 564790 619805 676050 729352 773372
57661 773372 800934 806802 790108 754842 708009 656584 605244 556227 510642 469458 433391 402675
57649 402675 377304 357102 341222 328087 316446 306318 298429 292865 288799 285389 282369 279720 277334
57636 277334 275241 273709 272827 272230 271508 270683 270052 269739 269642 269719 270078 270727 271416 271782 271592 270796 269368 267269
57618 267269 264658 262059 260011 258477 256852 254736 252480 250650 249164 247357 244881 242182 239998 238692
57604 238692 238140 237970 237741 237158 236285 235416 234620 233647 232394 231236 230644 230605 230588 229972 228377 225772 222523 219309
57586 219309 216689 214677 212826 210729 208414 206278 204742 203883 203330 202580 201503 200435 199703 199094 197973
$$ packed form
57687B43409p99r73l05P16J194J146J649L303N254O365O854P987J0463J3810J7312
57672C17385K0840K4704K9216L4515M0419M6312N1399N5015N6245N3302M4020
57661G73372K7562N868j6694l5266m6833n1425n1340m9017m5585m1184l6067l0716
57649D02675k5371k0202j5880j3135j1641j0128p889n564m066l410l020k649k386
57636B77334k093j532q82n97p22q25o31l13r7P7L59O49O89L66j90p96j428k099
57618B67269k611k599k048j534j625k116k256j830j486j807k476k699k184j306
57604B38692n52j70k29n83q73q69p96r73j253j158n92l9j7o16j595k605l249l214
57586B19309k620k012j851k097k315k136j536q59n53p50j077j068p32o09j121
$$ plain form
57571 197973 195908 193124 190383 188437 187431 186788 185781 184309 182925 182046 181472 180907 180617 181073 182122 183005
57555 183005 183238 182995 182552 181922 181216 180893 181259 182057 182919 183928 185349 187025 188521 189714 190768 191634 192066
57538 192066 192165 192391 192970 193767 194868 196712 199249 201408 201983 200935 199386 198393 198125 198238 198554 199073 199573
57521 199573 199665 199338 199251 200217 202388 205146 207888 210723 214098 217910 221455 224321 226918 229860 233145 236231
57505 236231 238648 240212 240898 240990 241206 242153 243591 244656 244876 244577 244185 243577 242433 240931 239741 239316 239426
57488 239426 239410 238835 237913 237258 237218 237607 238205 239226 240894 242703 243689 243566 243075 243013 243393 243846 244361 245103 245801
57469 245801 245929 245382 244555 243804 243233 242956 243136 243692 244336 244979 245800 246849 247880 248659 249255 249979 251211 253193
57451 253193 255691 257925 259246 259899 260755 262277 264180 266144 268196 270146 271309 271411 271384 272517 274920
$$ packed form
57571A97973k065k784k741j946j006o43j007j472j384q79n74n65k90M56J049Q83
57555A83005K33k43m43o30p06l23L66P98Q62J009J421J676J496J193J054Q66M32
57538A92066R9K26N79P97J101J844K537K159N75j048j549r93k68J13L16N19N00
57521A99573R2l27q7R66K171K758K742K835L375L812L545K866K597K942L285L086
57505B36231K417J564O86R2K16R47J438J065K20k99l92o08j144j502j190m25J10
57488B39426j6n75r22o55m0L89N98J021J668J809R86j23m91o2L80M53N15P42O98
57469B45801J28n47q27p51n71k77J80N56O44O43Q21J049J031P79N96P24J232J982
57451B53193K498K234J321O53Q56J522J903J964K052J950J163J02k7J133K403
$$ plain form
57436 274920 277388 278823 279313 279798 281151 283695 287146 290743 293748 296021 297909 299498 300368 300381 300350 301433
57420 301433 303926 306997 309621 311472 312876 314207 315545 316804 318044 319584 321729 324290 326534 327887
57406 327887 328738 330207 332955 336369 339186 340818 341864 343389 345913 349158 352505 355543 358204 360581
57392 360581 362716 364690 366875 369964 374515 380419 386920 393168 398697 403419 407434 411014 414600 418506
57378 418506 422606 426470 429899 433140 436467 439713 442425 444464 446303 448669 451952 455979 460208 464073
57364 464073 467293 470056 472911 476299 480134 483920 487330 490521 493848 497465 501406 505898 511253 517411
57350 517411 523820 529933 535663 541268 546950 552751 558683 564687 570528 575997 581279 586859 592938 599144
57336 599144 605026 610685 616657 623202 630026 636772 643476 650311 657101 663475 669473 675657 682441 689601
$$ packed form
57436B74920K468J435M90M85J353K544L451L597L005K273J888J589Q70J3l1J083
57420C01433K493L071K624J851J404J331J338J259J240J540K145K561K244J353
57406C27887Q51J469K748L414K817J632J046J525K524L245L347L038K661K377
57392C60581K135J974K185L089M551N904O501O248N529M722M015L580L586L906
57378D18506M100L864L429L241L327L246K712K039J839K366L283M027M229L865
57364D64073L220K763K855L388L835L786L410L191L327L617L941M492N355O158
57350E17411O409O113N730N605N682N801N932O004N841N469N282N580O079O206
57336E99144N882N659N972O545O824O746O704O835O790O374N998O184O784P160
$$ plain form
57322 689601 696644 703473 710336 717222 723713 729569 735210 741361 748326 755841 763619 771825 780870 790853
57308 790853 801351 811810 821970 831811 841226 850034 858343 866650 875384 884566 894082 904012 914304
57295 914304 924361 933532 942078 951079 961195 971966 982664 993316 1004376 1015795 1027132 1038429
57283 1038429 1050238 1062661 1075054 1086966 1098793 1111067 1123528 1135479 1146830 1158215 1170092
57272 1170092 1182272 1194501 1207092 1220637 1235222 1250200 1264804 1278844 1292773 1307108 1321919
57261 1321919 1336913 1351896 1366963 1382258 1397819 1413781 1430434 1447842 1465543 1482970 1500059
57250 1500059 1517172 1534493 1551873 1569284 1587021 1605307 1624019 1642976 1662184 1681606 1701016
57239 1701016 1720337 1739892 1759985 1780446 1800898 1821243 1841500 1861291 1880060 1897813 1915288
$$ packed form
57322F89601P043O829O863O886O491N856N641O151O965P515P778Q206R045R983
57308G90853J0498J0459J0160R841R415Q808Q309Q307Q734R182R516R930J0292
57295I14304J0057R171Q546R001J0116J0771J0698J0652J1060J1419J1337J1297
57283A038429J1809J2423J2393J1912J1827J2274J2461J1951J1351J1385J1877
57272A170092J2180J2229J2591J3545J4585J4978J4604J4040J3929J4335J4811
57261A321919J4994J4983J5067J5295J5561J5962J6653J7408J7701J7427J7089
57250A500059J7113J7321J7380J7411J7737J8286J8712J8957J9208J9422J9410
57239A701016J9321J9555K0093K0461K0452K0345K0257J9791J8769J7753J7475
$$ plain form
57228 1915288 1933290 1952183 1971979 1992406 2012787 2032377 2051178 2070050 2089749 2110177 2130907
57217 2130907 2152071 2174215 2197375 2220828 2243855 2266432 2289019 2311887 2334763 2357142 2378934
57206 2378934 2400738 2423300 2446641 2469986 2492683 2514963 2537627 2561237 2585841 2611068 2636104
57195 2636104 2659908 2682036 2703160 2724303 2745695 2766915 2787994 2809684 2832608 2856783 2882100
57184 2882100 2908601 2936028 2963753 2991505 3019575 3047894 3075483 3101413 3125864 3149602 3172766
57173 3172766 3194856 3215719 3235818 3255441 3274237 3291648 3307431 3321708 3334928 3347904 3361536
57162 3361536 3376229 3391696 3407284 3422350 3436442 3449463 3461693 3473332 3483997 3492916 3499668 3504522
57150 3504522 3508114 3511046 3513788 3516602 3519481 3522375 3525451 3528901 3532576 3536290 3540498 3546173 3553792 3562869
$$ packed form
57228A915288J8002J8893J9796K0427K0381J9590J8801J8872J9699K0428K0730
57217B130907K1164K2144K3160K3453K3027K2577K2587K2868K2876K2379K1792
57206B378934K1804K2562K3341K3345K2697K2280K2664K3610K4604K5227K5036
57195B636104K3804K2128K1124K1143K1392K1220K1079K1690K2924K4175K5317
57184B882100K6501K7427K7725K7752K8070K8319K7589K5930K4451K3738K3164
57173C172766K2090K0863K0099J9623J8796J7411J5783J4277J3220J2976J3632
57162C361536J4693J5467J5588J5066J4092J3021J2230J1639J0665Q919O752M854
57150C504522L592K932K742K814K879K894L076L450L675L714M208N675P619R077
$$ plain form
57136 3562869 3572783 3583756 3596671 3612167 3630263 3650725 3673425 3698236 3724740 3752171 3779666
57125 3779666 3806796 3833965 3862261 3892920 3927062 3965950 4011198 4064613 4127947 4202756 4290062
57114 4290062 4389949 4501891 4625807 4762667 4913986 5081444 5267848 5478617 5721880 6007183
57104 6007183 6344460 6744233 7218436 7781294 8450376 9247594 10199337 11335608 12688869
57095 12688869 14292637 16179428 18378704 20916150 23813541 27086669 30740468 34762912
57087 34762912 39117808 43735333 48504739 53280729 57907931 62248051 66185944 69611221
57079 69611221 72400639 74427249 75592438 75853106 75225217 73770568 71582713 68776526
57071 68776526 65476467 61803451 57866972 53765581 49590911 45429414 41360828 37455086
$$ packed form
57136C562869R914J0973J2915J5496J8096K0462K2700K4811K6504K7431K7495
57125C779666K7130K7169K8296L0659L4142L8888M5248N3415O3334P4809Q7306
57114D290062R9887J11942J23916J36860J51319J67458J86404K10769K43263K85303
57104F007183L37277L99773M74203N62858O69082P97218R51743J136271J353261
57095A2688869J603768J886791K199276K537446K897391L273128L653799M022444
57087C4762912M354896M617525M769406M775990M627202M340120L937893L425277
57079F9611221K789418K026610J165189K60668o27889j454649k187855k806187
57071F8776526l300059l673016l936479m101391m174670m161497m068586l905742
$$ plain form
57063 37455086 33768808 30342542 27200514 24352984 21798995 19528094 17522181 15758620
57055 15758620 14213208 12861047 11676063 10631684 9703574 8872478 8124984 7451964 6846361
57046 6846361 6301867 5812684 5373496 4979120 4624232 4303581 4012439 3746831 3503682
57037 3503682 3281057 3078058 2894048 2727951 2578463 2444734 2326510 2223863 2137266 2067834
57027 2067834 2016844 1984894 1971773 1976592 1996485 2024087 2046734 2049600 2021367 1958736 1867151 1757640
57015 1757640 1641787 1527889 1420353 1321451 1232676 1154508 1086040 1025757 972551 925742 884655
57004 884655 848742 817792 791364 768122 746232 724483 702724 681414 661139 642375 625161
56993 625161 608919 593038 577738 564062 552915 544338 537773 532773 529382 528038 529196 532880 538325
$$ packed form
57063C7455086l686278l426266l142028k847530k553989k270901k005913j763561
57055A5758620j545412j352161j184984j044379r28110q31096p47494o73020o05603
57046F846361n44494m89183m39188l94376l54888l20651k91142k65608k43149
57037C503682k22625k02999j84010j66097j49488j33729j18224j02647q6597o9432
57027B067834n0990l1950j3121M819J9893K7602K2647K866k8233o2631r1585j09511
57015A757640j15853j13898j07536r8902q8775p8168o8468o0283n3206m6809m1087
57004H84655l5913l0950k6428k3242k1890k1749k1759k1310k0275j8764j7214
56993F25161j6242j5881j5300j3676j1147q577o565n000l391j344J158L684N445
$$ plain form
56980 538325 543891 547346 546572 540569 529957 516302 500802 483910 466217 449066 433811 420910
56968 420910 410247 401996 396508 393550 392425 392960 395828 401744 410801 422656 436865 452821 469748
56955 469748 486930 503522 517937 527747 530652 525613 513210 495267 474240 452512 431782 412966
56943 412966 396565 382889 371922 363436 357439 354370 354724 358724 366383 377598 392009 409108 428709
56930 428709 450974 475462 500121 521393 535447 539551 532875 516619 493438 466365 437868 409606
56918 409606 382645 357643 334901 314480 296355 280436 266534 254438 243950 234816 226716 219489
56906 219489 213262 208245 204413 201528 199434 198206 197972 198691 200160 202285 205345 209905 216375 224661 234359
56891 234359 245173 257011 269790 283555 298824 316316 335969 356385 375520 391736 403900
$$ packed form
56980E38325N566L455p74o003j0612j3655j5500j6892j7693j7151j5255j2901
56968D20910j0663q251n488k958j125N35K868N916R057J1855J4209J5956J6927
56955D69748J7182J6592J4415R810K905n039j2403j7943k1027k1728k0730j8816
56943D12966j6401j3676j0967q486n997l069L54M000P659J1215J4411J7099J9601
56930D28709K2265K4488K4659K1272J4054M104o676j6256k3181k7073k8497k8262
56918D09606k6961k5002k2742k0421j8125j5919j3902j2096j0488r134q100p227
56906B19489o227n017l832k885k094j228k34P19J469K125L060M560O470Q286R698
56891B34359J0814J1838J2779J3765J5269J7492J9653K0416J9135J6216J2164
$$ plain form
56880 403900 410853 411515 405780 394925 380976 365930 351536 339242 329824 323318 319726 319618 323680
56867 323680 331878 343665 359017 378715 403409 432969 467010 505531 548411 594449 641189 685286
56855 685286 722476 747774 757120 749704 728496 698320 663707 628392 595644 567866 545895 529486
56843 529486 518694 514549 518310 530514 550908 579153 615435 660410 714532 777323 847187 921613
56831 921613 997011 1068047 1127557 1167951 1183456 1171879 1135283 1079577 1012831 942660 874249
56820 874249 810437 753061 703673 663216 631845 609459 596069 591572 595640 608156 629401 659450
56808 659450 697475 741842 790592 841335 890480 932704 961582 971483 959818 928151 881327 825389
56796 825389 765892 707182 652176 602324 558136 520109 489047 465400 448661 437831 432417 432728
$$ packed form
56880D03900O953O62n735j0855j3949j5046j4394j2294r418o506l592j08M062
56867C23680Q198J1787J5352J9698K4694K9560L4041L8521M2880M6038M6740M4097
56855F85286L7190K5298R346p416k1208l0176l4613l5315l2748k7778k1971j6409
56843E29486j0792m145L761J2204K0394K8245L6282M4975N4122O2791O9864P4426
56831I21613P5398P1036N9510M0394J5505j1577l6596n5706o6746p0171o8411
56820H74249o3812n7376m9388m0457l1371k2386j3390m497M068J2516K1245L0049
56808F59450L8025M4367M8750N0743M9145M2224K8878R901j1665l1667m6824n5938
56796H25389n9497n8710n5006m9852m4188l8027l1062k3647j6739j0830n414L11
$$ plain form
56784 432728 439150 451362 468348 489027 512600 538046 563251 584811 598929 602669 594645 575192
56772 575192 546376 511639 474677 438160 403349 370706 340511 313025 288517 267240 249081
56761 249081 233188 218447 204603 192607 183543 177337 172685 168169 163287 158512 154507 151342 148511
56748 148511 145716 143350 141979 141553 141511 141496 141499 141353 140708 139617 138634 138088 137710 137162 136467 135652 134514 133162
56730 133162 132342 132710 134010 135434 136561 137521 138405 139024 139244 139174 139034 139120 139830 141363 143331 144936 145711
56713 145711 146014 146756 148601 151293 153769 155135 155624 156380 158247 160944 163462 164982 165284 164647 163640 162713
56697 162713 161782 160479 158947 157971 157960 158240 157827 156615 155287 154320 153699 153514 154190 155926 158281 160466 161824
56680 161824 162044 161253 159960 158636 157298 155671 153763 152058 151103 151051 151552 151974 151853 151306 150897 150977 151360
$$ packed form
56784D32728O422J2212J6986K0679K3573K5446K5205K1560J4118L740q024j9453
56772E75192k8816l4737l6962l6517l4811l2643l0195k7486k4508k1277j8159
56761B49081j5893j4741j3844j1996r064o206m652m516m882m775m005l165k831
56748A48511k795k366j371m26m2j5Lj46o45j091r83n46l78n48o95q15j138j352
56730A33162q20L68J300J424J127R60Q84O19K20p0j40Q6P10J533J968J605P75
56713A45711L03P42J845K692K476J366M89P56J867K697K518J520L02o37j007r27
56697A62713r31j303j532r76j1K80m13j212j328r67o21j85O76J736K355K185J358
56680A61824K20p91j293j324j338j627j908j705r55n2N01M22j21n47m09Q0L83
$$ plain form
56663 151360 151816 152534 153696 154887 155461 155388 155250 155428 155811 156274 156952 157952 159262 161045 163547 166518 169122
56646 169122 170677 171136 170676 169298 167191 165111 163854 163451 163266 162810 162070 161086 159747 158255 157379 157789
56630 157789 159235 160772 161783 162437 163035 163417 163381 163294 163715 164517 164989 164835 164507 164386 164267 164030 164250 165548
56612 165548 167651 169662 171091 172135 173051 173765 174133 174123 173684 172760 171573 170600 170150 170106 170114 169897 169383 168650
56594 168650 167777 166706 165371 163975 162969 162662 163013 163826 164846 165627 165749 165383 165281 165916 167070 168484
56578 168484 170378 172879 175406 177253 178467 179573 180726 181768 182852 184316 186072 187814 189738 192408
56564 192408 195925 199835 203925 208589 214403 221790 230972 241659 252797 263200 272379 280258 286279
56551 286279 289583 290112 288817 286728 284411 282266 280499 278647 275932 272309 268557 265193 262003 258786
$$ packed form
56663A51360M56P18J162J191N74p3j38J78L83M63O78J000J310J783K502K971K604
56646A69122J555M59m60j378k107k080j257m03j85m56p40r84j339j492q76M10
56630A57789J446J537J011O54N98L82l6q7M21Q02M72j54l28j21j19k37K20J298
56612A65548K103K011J429J044R16P14L68j0m39r24j187r73m50m4Qk17n14p33
56594A68650q73j071j335j396j006l07L51Q13J020P81J22l66j02O35J154J414
56578A68484J894K501K527J847J214J106J153J042J084J464J756J742J924K670
56564A92408L517L910M090M664N814P387R182J0687J1138J0403R179P879O021
56551B86279L304N29j295k089k317k145j767j852k715l623l752l364l190l217
$$ plain form
56537 258786 255795 253164 250624 248081 245803 243811 241776 239688 237853 235956 233114 229269 225622 223072
56523 223072 221036 218538 215738 213525 212123 210959 209607 208166 206924 206127 205791 205366 204014 201669 199299
56508 199299 197700 196607 195517 194680 194487 194504 194007 193035 192082 191151 190038 189157 189120 189721 190326 191078 192669 194978
56490 194978 196972 198069 198672 199196 199499 199524 199636 199953 200017 199504 198742 198231 198139 198497 199297 200187 200664 200817 201358
56471 201358 202611 203997 204794 204945 204777 204468 204185 204274 204801 205228 205031 204450 204210 204650 205443 206058 206222 206040
56453 206040 205877 206056 206517 206922 207182 207603 208367 209216 209886 210594 211705 213144 214497 215602 216634 217604 218171
56436 218171 218091 217579 216988 216311 215271 213947 213037 213265 214509 215744 215975 215066 213580 212106 211088 211079 212562
56419 212562 215275 218139 220154 221234 221972 222821 223801 224813 225770 226375 226131 224869 223102 221702 221223 221686
$$ packed form
56537B58786k991k631k540k543k278j992k035k088j835j897k842l845l647k550
56523B23072k036k498k800k213j402j164j352j441j242p97l36m25j352k345k370
56508A99299j599j093j090q37j93J7m97r72r53r31j113q81l7O01O05P52J591K309
56490A94978J994J097O03N24L03K5J12L17O4n13p62n11r2L58Q00Q90M77J53N41
56471B01358J253J386P97J51j68l09k83Q9N27M27j97n81k40M40P93O15J64j82
56453B06040j63J79M61M05K60M21P64Q49O70P08J111J439J353J105J032R70N67
56436B18171q0n12n91o77j040j324r10K28J244J235K31r09j486j474j018rJ483
56419B12562K713K864K015J080P38Q49R80J012R57O05k44j262j767j400m79M63
$$ plain form
56403 221686 222932 224923 227615 230718 233781 236482 238742 240580 242041 243265 244432 245563 246431 246737 246374
56388 246374 245568 244859 244851 245790 247318 248778 249822 250665 251768 253418 255520 257600 259036 259582 259753 260485 262283
56371 262283 264780 267121 268619 269142 269102 269069 269218 269247 269037 269093 269832 270677 270580 269458 268380 268115 268244 267996 267273
56352 267273 266408 265575 264979 265070 265997 267291 268599 270191 272092 273341 273017 271624 270559 270455 270984 272149
56336 272149 274657 278747 283536 287905 291515 294705 297835 300987 303923 306230 307873 309559 312081 315307
56322 315307 318337 320629 322374 323729 324367 324062 323068 321644 319751 317576 315838 315171 315496 316349 317451 318659
56306 318659 319734 320604 321610 323098 324925 326739 328617 331018 334111 337441 340348 342590 344473 346494
56292 346494 348913 351620 354323 356730 358653 360141 361659 363843 366858 370114 372812 374625 375741 376539
$$ packed form
56403B21686J246J991K692L103L063K701K260J838J461J224J167J131Q68L06l63
56388B46374q06p09qR39J528J460J044Q43J103J650K102K080J436N46J71P32J798
56371B62283K497K341J498N23m0l3J49K9k10N6P39Q45r7j122j078k65J29k48p23
56352B67273q65q33n96R1R27J294J308J592J901J249l24j393j065j04N29J165
56336B72149K508M090M789M369L610L190L130L152K936K307J643J686K522L226
56322C15307L030K292J745J355O38l05r94j424j893k175j738o67L25Q53J102J208
56306C18659J075Q70J006J488J827J814J878K401L093L330K907K242J883K021
56292C46494K419K707K703K407J923J488J518K184L015L256K698J813J116P98
$$ plain form
56278 376539 377551 379395 382260 385606 388823 392056 395890 400386 404987 409389 413893 418881 424503 431021
56264 431021 438858 448056 458093 468526 479485 491365 504384 518641 534222 551058 568927 587811
56252 587811 608068 630231 654940 683022 715127 751072 789952 831143 874852 921497 970885
56241 970885 1022250 1074735 1127447 1179208 1228671 1274728 1316673 1353945 1385805 1411261 1429329
56230 1429329 1439347 1441044 1434380 1419705 1398152 1371438 1340847 1306629 1268782 1228143 1186212 1144130
56218 1144130 1102352 1061208 1021158 982537 945530 910454 877650 847199 819164 793831 771106
56207 771106 749965 729348 709528 691744 676461 662849 650069 638089 626997 616471 606414
56196 606414 597369 589826 583714 578956 575826 574275 573559 573007 572643 572569 572378 571751 571174 571424 572613 574159
$$ packed form
56278C76539J012J844K865L346L217L233L834M496M601M402M504M988N622O518
56264D31021P837R198J0037J0433J0959J1880J3019J4257J5581J6836J7869J8884
56252E87811K0257K2163K4709K8082L2105L5945L8880M1191M3709M6645M9388
56241I70885N1365N2485N2712N1761M9463M6057M1945L7272L1860K5456J8068
56230A429329J0018J697o664j4675k1553k6714l0591l4218l7847m0639m1931m2082
56218A144130m1778m1144m0050l8621l7007l5076l2804l0451k8035k5333k2725
56207G71106k1141k0617j9820j7784j5283j3612j2780j1980j1092j0526j0057
56196F06414r045p543o112m758l130j551p16n52l64p4j91o27n77K50J189J546
$$ plain form
56180 574159 575397 575913 575747 575665 576760 579360 582692 585956 589172 592578 595862 598672 601364 604478 607798
56165 607798 610740 613517 617179 622459 629160 636740 644984 654038 664143 675494 688057 701427 715101
56152 715101 729010 743787 760483 779966 802523 828055 856639 888690 924455 963896 1007575
56141 1007575 1057344 1115484 1183268 1261025 1349309 1448998 1560091 1681202 1810207 1944280
56131 1944280 2078916 2208056 2326135 2429823 2518010 2591375 2652614 2705855 2754375 2798624
56121 2798624 2836554 2865248 2881965 2884823 2873773 2850942 2819507 2782103 2739923 2692076 2635265
56110 2635265 2565098 2478928 2377458 2263673 2141388 2015416 1891758 1775877 1670777 1577379
56100 1577379 1496107 1427086 1369343 1321131 1281112 1248450 1221957 1200125 1182066 1167732 1157154
$$ packed form
56180E74159J238N16j66q2J095K600L332L264L216L406L284K810K692L114L320
56165F07798K942K777L662N280O701P580Q244R054J0105J1351J2563J3370J3674
56152G15101J3909J4777J6696J9483K2557K5532K8584L2051L5765L9441M3679
56141A007575M9769N8140O7784P7757Q8284R9689J11093J21111J29005J34073
56131A944280J34636J29140J18079J03688Q8187P3365O1239N3241M8520M4249
56121B798624L7930K8694J6717K858j1050k2831l1435l7404m2180m7847n6811
56110B635265p0167q6170j01470j13785j22285j25972j23658j15881j05100r3398
56100A577379q1272o9021n7743m8212m0019l2662k6493k1832j8059j4334j0578
$$ plain form
56089 1157154 1149988 1145724 1143836 1143735 1144912 1147042 1149781 1152821 1156330 1160790 1166076 1171289 1175914 1180549
56075 1180549 1186080 1192806 1200858 1210647 1222154 1234455 1246730 1259227 1272605 1286985 1302279 1318691
56063 1318691 1336095 1353649 1370882 1388518 1407349 1427041 1446971 1467470 1489038 1510917 1531686
56052 1531686 1550965 1569508 1588003 1606698 1625834 1645508 1665479 1685926 1707821 1731680 1756616
56041 1756616 1781642 1807176 1834155 1862375 1891066 1920537 1951834 1985149 2019877 2055912 2093588
56030 2093588 2132674 2172656 2213734 2256392 2300356 2345204 2391588 2440583 2492174 2545546 2600469
56019 2600469 2657225 2715804 2776525 2840786 2909623 2982071 3056547 3133413 3214374 3299791 3388473
56008 3388473 3480009 3575471 3675663 3780369 3889461 4003328 4122083 4245646 4374685 4510323
$$ packed form
56089A157154p166m264j888j01J177K130K739L040L509M460N286N213M625M635
56075A180549N531O726Q052R789J1507J2301J2275J2497J3378J4380J5294J6412
56063A318691J7404J7554J7233J7636J8831J9692J9930K0499K1568K1879K0769
56052A531686J9279J8543J8495J8695J9136J9674J9971K0447K1895K3859K4936
56041A756616K5026K5534K6979K8220K8691K9471L1297L3315L4728L6035L7676
56030B093588L9086L9982M1078M2658M3964M4848M6384M8995N1591N3372N4923
56019B600469N6756N8579O0721O4261O8837P2448P4476P6866Q0961Q5417Q8682
56008C388473R1536R5462J00192J04706J09092J13867J18755J23563J29039J35638
$$ plain form
55998 4510323 4653124 4803472 4962520 5131426 5310121 5498252 5696805 5907439 6130851
55989 6130851 6367416 6618694 6886719 7172587 7477571 7804728 8157361 8536807 8943885
55980 8943885 9381722 9855009 10367547 10923108 11527816 12188987 12912537 13704486 14574489
55971 14574489 15535450 16601093 17787532 19116957 20617376 22320817 24266611 26507069
55963 26507069 29108434 32150070 35728866 39962998 44983360 50917212 57881774 65995406
55955 65995406 75400149 86291047 98946759 113738949 131090752 151378807 174808328
55948 174808328 201308667 230485977 261611367 293536705 324449205 351617282 371555959
55941 371555959 380921313 377827141 362730235 338225504 307927901 275252769 242755105
$$ packed form
55998D510323J42801J50348J59048J68906J78695J88131J98553K10634K23412
55989F130851K36565K51278K68025K85868L04984L27157L52633L79446M07078
55980H943885M37837M73287N12538N55561O04708O61171P23550P91949Q70003
55971A4574489R60961J065643J186439J329425J500419J703441J945794K240458
55963B6507069K601365L041636L578796M234132N020362N933852O964562Q113632
55955F5995406R404743J0890898J2655712J4792190J7351803K0288055K3429521
55948A74808328K6500339K9177310L1125390L1925338L0912500K7168077J9938677
55941C71555959R365354l094172j5096906k4504731l0297603l2675132l2497664
$$ plain form
55934 242755105 212069723 184113153 159287937 137644039 119015962 103123424 89632255
55927 89632255 78199228 68508697 60286405 53293176 47321299 42199106 37788649 33974170
55919 33974170 30656304 27755166 25209522 22968694 20988102 19231517 17670932 16281675
55911 16281675 15040560 13928578 12930961 12033634 11222720 10487355 9819342 9209812 8649466
55902 8649466 8132090 7654587 7213495 6804530 6425392 6075688 5753704 5456063 5180606
55893 5180606 4926671 4692356 4474326 4270629 4081066 3904678 3739582 3585624 3444371
55884 3444371 3315801 3197390 3087090 2984974 2891135 2803960 2721139 2640694 2560634 2479521
55874 2479521 2398029 2318406 2241894 2168011 2096344 2027257 1960543 1895172 1830949 1769028 1710483
$$ packed form
55934B42755105l0685382k7956570k4825216k1643898j8628077j5892538j3491169
55927H9632255j1433027r690531q222292o993229n971877n122193m410457l814479
55919C3974170l317866k901138k545644k240828j980592j756585j560585j389257
55911A6281675j241115j111982r97617q97327q10914p35365o68013o09530n60346
55902H649466n17376m77503m41092m08965l79138l49704l21984k97641k75457
55893E180606k53935k34315k18030k03697j89563j76388j65096j53958j41253
55884C444371j28570j18411j10300j02116r3839q7175q2821q0445q0060q1113
55874B479521q1492p9623p6512p3883p1667o9087o6714o5371o4223o1921n8545
$$ plain form
55863 1710483 1655687 1605141 1559295 1517303 1477528 1439574 1404315 1371813 1340783 1310426 1281114
55852 1281114 1252865 1224817 1196748 1169573 1143658 1118015 1091831 1065517 1039562 1013606 987432
55841 987432 961771 937381 914132 891677 870275 850373 832055 815342 800363 786807 773829
55830 773829 760845 747970 735602 724133 713976 705113 696662 687692 678365 669458 660938 651977 642232
55817 642232 632008 621318 610050 599042 589609 581787 574289 566499 559159 552822 547040 541708 537881
55804 537881 536436 536934 538558 541292 545397 550535 556250 562612 569544 575959 580362 582093 581514 579204 575406
55789 575406 570126 563425 555675 547529 539448 531412 523386 515750 508707 501555 493249 483509 472706 461044
55775 461044 448818 437215 427661 420294 414086 408555 404303 401841 401009 401656 403583 405472 405196 401826
$$ packed form
55863A710483n4796n0546m5846m1992l9775l7954l5259l2502l1030l0357k9312
55852A281114k8249k8048k8069k7175k5915k5643k6184k6314k5955k5956k6174
55841I87432k5661k4390k3249k2455k1402j9902j8318j6713j4979j3556j2978
55830G73829j2984j2875j2368j1469j0157q863q451q970r327q907q520q961r745
55817F42232j0224j0690j1268j1008r433p822p498p790p340o337n782n332l827
55804E37881j445M98J624K734M105N138N715O362O932O415M403J731n79k310l798
55789E75406n280o701p750q146q081q036q026p636p043p152q306r740j0803j1662
55775D61044j2226j1603r554p367o208n531m252k462q32O47J927J889k76l370
$$ plain form
55761 401826 396459 390614 384821 379175 374062 369448 364381 358141 351368 345281 340192 335365 329886 323269
55747 323269 315552 307243 298911 290747 282877 275919 270494 266247 262230 258276 255037 252649 250538 248674
55733 248674 247734 247613 247138 245792 244497 244003 243734 243008 242107 241188 239315 235817 231699 228470 226273 224307
55717 224307 222409 220993 219944 218820 217821 217490 217721 218020 218463 219500 221166 223278 225998 229277 232178
55702 232178 233721 234063 233848 232779 230004 225703 221111 216967 212969 208782 204605 200632 196896 193735 191545
55687 191545 189928 187983 185657 184061 184189 186034 189135 193221 197979 202804 207202 211082 214448 217205
55673 217205 219397 221195 222518 223080 222895 222274 221300 219818 218074 216771 216252 216110 215877 215723 216154 217370
55657 217370 219193 221395 223809 226271 228633 230775 232603 234174 235700 237136 237819 236997 234828 232415 230606
$$ packed form
55761D01826n367n845n793n646n113m614n067o240o773o087n089m827n479o617
55747C23269p717q309q332q164p870o958n425m247m017l954l239k388k111j864
55733B48674r40j21m75j346j295m94k69p26r01r19j873l498m118l229k197j966
55717B24307j898j416j049j124r99l31K31K99M43J037J666K112K720L279K901
55702B32178J543L42k15j069k775m301m592m144l998m187m177l973l736l161k190
55687A91545j617j945k326j596J28J845L101M086M758M825M398L880L366K757
55673B17205K192J798J323N62j85o21r74j482j744j303n19j42k33j54M31J216
55657B17370J823K202K414K462K362K142J828J571J526J436O83q22k169k413j809
$$ plain form
55642 230606 229069 226791 223212 218541 213151 207106 200404 193389 186652 180573 175139 170244 165887 161943
55628 161943 157979 153756 149834 147238 146359 146521 146750 146621 146157 145369 144266 143084 142107 141383 140766 140029 138749
55611 138749 136469 133301 130118 127745 126184 124948 123841 122970 122159 120903 118939 116597 114555 113369 113076
55596 113076 113117 112858 112293 111923 111895 111793 111544 111789 112795 113684 113589 113134 113750 115616 117272 117377 116066 114390
55578 114390 113197 112876 113554 115015 116701 118154 119353 120592 122228 124503 127269 129917 131965 133678 135693
55563 135693 138029 139966 140949 141112 140785 139996 138702 137092 135369 133460 131217 128690 126125 123872 122352
55548 122352 121811 122004 122347 122378 121863 120542 118320 115803 114178 114231 115693 117692 119572 121166 122644 124360
55532 124360 126599 129197 131547 133117 133796 133686 132809 131276 129514 127989 126666 124909 122040 118132 114214
$$ packed form
55642B30606j537k278l579m671n390o045o702p015o737o079n434m895m357l944
55628A61943l964m223l922k596q79J62K29j29m64p88j103j182r77p24o17p37j280
55611A38749k280l168l183k373j561j236j107q71q11j256j964k342k042j186k93
55596A13076M1k59n65l70k8j02k49K45J006Q89r5m55O16J866J656J05j311j676
55578A14390j193l21O78J461J686J453J199J239J636K275K766K648K048J713K015
55563A35693K336J937R83J63l27p89j294j610j723j909k243k527k565k253j520
55548A22352n41J93L43L1n15j321k222k517j625N3J462J999J880J594J478J716
55532A24360K239K598K350J570O79j10q77j533j762j525j323j757k869l908l918
$$ plain form
55517 114214 111482 110079 108833 106478 102999 99479 96781 94908 93548 92575 91802 90798 89377 88002 87373
55502 87373 87749 88811 89939 90498 90239 89660 89660 90471 91170 90656 88976 87315 86731 87245 88207 89142 90022 90925
55484 90925 91747 92313 92591 92707 92819 93111 93851 95223 96996 98623 99843 100999 102459 103863 104358 103593 102155
55467 102155 100920 100262 100011 99855 99531 98838 97768 96648 95948 95881 96239 96619 96785 96780 96748 96744 96753 96834 97032 97154 96896
55446 96896 96320 95985 96421 97567 98912 99983 100521 100349 99387 97778 95839 93954 92531 91840 91729 91730 91673 91836
55428 91836 92282 92463 91940 91130 90765 90882 91045 91297 92126 93454 94501 94863 95042 95605 96441 97218 98065 99292
55410 99292 100746 101846 102142 101596 100463 99080 97658 96223 94891 94069 94004 94231 93937 92993 92093 91730 91563
55393 91563 91030 90103 89162 88541 88500 89176 90230 90938 91048 91176 91936 93030 93670 93656 93477 93523 93707 93889 94202
$$ packed form
55517A14214k732j403j246k355l479l520k698j873j360r73p73j004j421j375o29
55502H7373L76J062J128N59k59n79%Q11O99n14j680j661n84N14R62R35Q80R03
55484I0925Q22N66K78J16J12K92P40J372J773J627J220J156J460J404M95p65j438
55467A02155j235o58k51j56l24o93j070j120p00o7L58L80J66nl2mRQ1J98J22k58
55446I6896n76l35M36J146J345J071N38j72r62j609j939j885j423o91j11Jn7J63
55428I1836M46J81n23q10l65J17J63K52Q29J328J047L62J79N63Q36P77Q47J227
55410I9292J454J100K96n46j133j383j422j435j332q22o5K27k94r44r00l63j67
55393I1563n33r27r41o21m1O76J054P08J10J28P60J094O40j4j79M6J84J82L13
$$ plain form
55374 94202 94828 95675 96371 96555 96210 95733 95508 95389 94864 93744 92298 90657 88612 86300 84544 83962 84061
55357 84061 83792 82843 81912 81752 82380 83230 83713 83622 83243 83092 83398 83947 84557 85443 86829 88413 89573 89983
55339 89983 89742 89150 88693 89005 90325 92023 93115 93240 92850 92458 92141 91779 91345 90813 90057 89044 87984
55322 87984 87243 87184 87954 89222 90235 90462 90191 90241 91114 92636 94351 95913 97102 97777 97965 97863 97681 97503
55304 97503 97199 96425 94975 93317 92447 92778 93431 93162 91865 90628 90311 90682 91038 91070 90855 90523 90324 90633
55286 90633 91466 92215 92274 91785 91417 91503 91779 91935 92050 92335 92668 92626 91984 91044 90373 90266 90525 90815 91088 91534
55266 91534 92199 92873 93396 93884 94507 95091 95145 94403 93313 92822 93471 94806 95927 96503 96893 97270 97242 96614 96011
55247 96011 96192 97103 98139 99046 99898 100432 100267 99801 99965 100804 101094 99864 97658 95703 94379 93197 91981
$$ packed form
55374I4202O26Q47O96J84l45m77k25j19n25j120j446j641k045k312j756n82R9
55357H4061k69r49r31j60O28Q50M83r1l79j51L06N49O10Q86J386J584J160M10
55339H9983k41n92m57L12J320J698J092J25l90l92l17l62m34n32p56j013j060
55322H7984p41n9P70J268J013K27k71N0Q73J522J715J562J189O75J88j02j82j78
55304I7503l04p74j450j658q70L31O53k69j297j237l17L71L56L2k15l32j99L09
55286I0633Q33P49N9m89l68Q6K76J56J15K85L33m2o42r40o71j07K59K90K73M46
55266I1534O65O74N23M88O23N84N4p42j090m91O49J335J121N76L90L77k8o28o03
55247I6011J81R11J036R07Q52N34j65m66J64Q39K90j230k206j955j324j182j216
$$ plain form
55230 91981 91190 91078 91180 90885 90145 89430 89222 89692 90674 91817 92806 93486 93790 93687 93296 92845 92356 91582 90529
55211 90529 89854 90279 91646 92953 93443 93335 93346 93814 94539 95267 96012 96875 97763 98331 98211 97364 96284 95721
55193 95721 96042 96838 97287 96956 96153 95513 95380 95688 96283 97084 97844 98028 97247 95856 94832 94847 95586 96136 95996
55174 95996 95559 95614 96538 98037 99520 100621 101353 101877 102210 102283 102247 102546 103540 105073 106575 107545 107880 107811 107664
55155 107664 107633 107551 106953 105607 104003 102985 102799 102877 102728 102631 103065 103803 104162 103977 103698 103482 102863 101636 100497
55136 100497 100360 101326 102733 103997 104967 105660 106078 106260 106141 105373 103679 101448 99639 98991 99486 100597 101833
55119 101833 102976 103979 104752 105020 104541 103564 102839 102846 103204 103237 102969 103082 103927 105167 106425 107645 108611 108746
55101 108746 107860 106677 106136 106408 107005 107571 108158 108851 109551 110126 110493 110643 110743 111080 111736 112449 112943 113163
$$ packed form
55230I1981p91j12J02k95p40p15k08M70R82J143R89O80L04j03l91m51m89p74j053
55211I0529o75M25J367J307M90j08J1M68P25P28P45Q63Q88N68j20q47j080n63
55193I5721L21P96M49l31q03o40j33L08N95Q01P60J84p81j391j024J5P39N50j40
55174I5996m37N5R24J499J483J101P32N24L33P3l6K99R94J533J502R70L35o9j47
55155A07664l1q2n98j346j604j018j86P8j49r7M34P38L59j85k79k16o19j227j139
55136A00497j37R66J407J264R70O93M18J82j19p68j694k231j809o48M95J111J236
55119A01833J143J003P73K68m79r77p25PL58L3k68J13Q45J240J258J220R66J35
55101A08746q86j183n41K72N97N66N87O93P00N75L67J50J00L37O56P13M94K20
$$ plain form
55083 113163 113119 112893 112949 113890 115498 116556 116217 115119 114513 114650 114826 114708 114608 114452 113532 111704 109989 109451
55065 109451 109985 110616 110592 109799 108547 107404 106975 107405 108282 109182 110013 110644 110654 109886 108885 108311 108133 107800
55047 107800 107033 106029 105044 104204 103632 103342 103111 102752 102445 102419 102509 102473 102586 103369 104728 105974 106795 107608 108695
55028 108695 109610 109877 109817 110089 110679 110999 110865 110739 110888 110845 110050 108639 107264 106379 106015 106060 106384 106749 106977
55009 106977 107264 108009 109266 110622 111702 112552 113405 114337 115305 116285 117179 117800 118214 118871 120050 121353 122133
54992 122133 122375 122751 123739 125096 126275 126997 127228 126927 126169 125356 124997 125277 125970 126656 126952 126694 126091 125576
54974 125576 125292 124830 123743 122248 121201 121309 122582 124509 126518 128132 128990 129032 128596 128115 127729 127366 127183
54957 127183 127612 128826 130365 131551 132173 132519 132795 132830 132477 131960 131662 131722 132027 132453 132854 132911 132245 130785
$$ packed form
55083A13163m4k26N6R41J608J058l39j098o06J37J76j18j00j56r20j828j715n38
55065A09451N34O31k4p93j252j143m29M30Q77R00Q31O31J0p68j001n74j78l33
55047A07800p67j004r85q40n72k90k31l59l07k6R0l6J13P83J359J246Q21Q13J087
55028A08695R15K67o0K72N90L20j34j26J49m3p95j411j375q85l64M5L24L65K28
55009A06977K87P45J257J356J080Q50Q53R32R68R80Q94O21M14O57J179J303P80
54992A22133K42L76R88J357J179P22K31l01p58q13l59K80O93O86K96k58o03n15
54974A25576k84m62j087j495j047J08J273J927K009J614Q58M2m36m81l86l63j83
54957A27183M29J214J539J186O22L46K76L5l53n17k98O0L05M26M01N7o66j460
$$ plain form
54939 130785 128942 127450 126952 127554 128673 129523 129887 130235 130993 131988 132835 133577 134556 135883 137471 139514 142450
54922 142450 146424 151104 156029 160842 165318 169589 174277 179885 186025 191645 196021 198969 200178 199131
54908 199131 195985 191850 187684 183400 178526 173196 167967 163040 158352 154143 150797 148266 146259 144843
54894 144843 144240 144071 143475 142098 140448 139153 138425 138363 139192 140846 142729 144300 145661 147288 149412 151936
54878 151936 154735 157722 160761 163888 167544 172317 178361 185220 192132 198290 202928 205506 206009 204848
54864 204848 202342 198395 192889 186321 179793 174297 170049 166567 163254 159776 156009 151942 147743 143806
54850 143806 140526 138078 136411 135412 134910 134619 134194 133363 131955 129907 127394 124895 122933 121634 120704 119906
54834 119906 119420 119545 120176 120772 120955 120955 121296 122089 122860 123113 122943 122918 123389 124024 124152 123525 122671 122369 122742 123097
$$ packed form
54939A30785j843j492m98O02J119Q50L64L48P58R95Q47P42R79J327J588K043K936
54922A42450L974M680M925M813M476M271M688N608O140N620M376K948J209j047
54908A99131l146m135m166m284m874n330n229m927m688m209l346k531k007j416
54894A44843o03j69n96j377j650j295p28o2Q29J654J883J571J361J627K124K524
54878A51936K799K987L039L127L656M773O044O859O912O158M638K578N03j161
54864B04848k506l947n506o568o528n496m248l482l313l478l767m067m199l937
54850A43806l280k448j667r99n02k91m25q31j408k048k513k499j962j299r30p98
54834A19906m86J25O31N96J83%L41P93P71K53j70k5M71O35J28o27q54l02L73L55
$$ plain form
54814 123097 122842 122388 122712 124036 125452 126094 126206 126572 127294 127802 127910 128109 128660 129090 128921 128414 128174 128373
54796 128373 128731 129035 129280 129466 129563 129601 129596 129476 129249 129082 129112 129339 129829 130700 131712 132234 131913 131174 130785 131180
54776 131180 132470 134716 137699 140719 143183 145287 147650 150402 153195 156033 159526 164189 169997 176717
54762 176717 184155 191833 198888 204613 208948 212230 214614 215849 215421 212920 208499 203006 197356 191780
54748 191780 185989 180016 174412 169537 165223 161396 158431 156438 154649 152209 149402 147432 146936 147239 147277
54733 147277 146842 146601 147112 148170 149157 149734 150089 150658 151860 154112 157800 162896 168697 174278 179343 184418
54717 184418 190021 195837 200920 204561 206671 207350 206483 203988 200263 196014 191563 186578 180735 174488 168850
54702 168850 164415 160925 157920 155411 153662 152575 151707 150811 149954 149177 148397 147651 147060 146480 145558 144242
$$ packed form
54814A23097k55m54L24J324J416O42J12L66P22N08J08J99N51M30j69n07k40J99
54796A28373L58L04K45J86R7L8nj20k27j67L0K27M90Q71J012N22l21p39l89L95
54776A31180J290K246K983L020K464K104K363K752K793K838L493M663N808O720
54762A76717P438P678P055N725M335L282K384J235m28k501m421n493n650n576
54748A91780n791n973n604m875m314l827k965j993j789k440k807j970m96L03L8
54733A47277m35k41N11J058R87N77L55N69J202K252L688N096N801N581N065N075
54717A84418N603N816N083L641K110O79q67k495l725m249m451m985n843o247n638
54702A68850m435l490l005k509j749j087q68q96q57p77p80p46n91n80r22j316
$$ plain form
54686 144242 142957 142107 141706 141541 141389 140909 139744 138073 136760 136512 136999 137164 136405 135108 133997 133287 132717
54669 132717 132224 132210 132992 134182 134922 134772 134164 133809 133973 134547 135414 136211 135999 134041 131122 129275 129695 131386
54651 131386 132425 132153 131494 131375 131646 131651 131252 130976 131461 132907 134858 136489 137369 137914 138826 140046 140751 140439
54633 140439 139607 139073 139047 139217 139406 139625 139673 139242 138452 137776 137317 136643 135599 134818 134985 135882 136679 137051 137453
54614 137453 138268 139208 139790 139902 139607 138796 137512 136351 136014 136505 137160 137479 137556 137754 138320 139359 140748 141985
54596 141985 142499 142241 141661 141037 140191 139037 138012 137663 138050 138804 139582 140261 140876 141536 142231 142649 142475 141942
54578 141942 141674 141793 141675 140956 140275 140467 141376 142119 142334 142457 142812 143163 143334 143611 144205 144770 144853 144564 144445
54559 144445 144829 145599 146507 147480 148556 149609 150259 150206 149692 149418 149773 150313 150356 149958 149822 150266 150791 150869 150688
$$ packed form
54686A44242j285q50m01j65j52m80j165j671j313k48M87J65p59j297j111p10n70
54669A32717m93j4P82J190P40j50o08l55J64N74Q67P97k12j958k919j847M20J691
54651A31386J039k72o59j19K71Nl99k76M85J446J951J631Q80N45R12J220P05l12
54633A40439q32n34k6J70J89K19M8m31p90o76m59o74j044p81J67Q97P97L72M02
54614A37453Q15R40N82J12k95q11j284j161l37M91O55L19P7J98N66J039J389J237
54596A41985N14k58n80o24q46j154j025l49L87P54P78O79O15O60O95M18j74n33
54578A41942k68J19j18p19o81J92R09P43K15J23L55L51J71K77N94N65Q3k89j19
54559A44445L84P70R08R73J076J053O50n3n14k74L55N40M3l98j36M44N25P8j81
$$ plain form
54540 150688 150771 151207 151695 152131 152709 153513 154387 155256 156295 157647 159195 160703 162052 163208 164080 164580 164804
54523 164804 165008 165335 165695 166035 166655 167923 169607 170762 170561 169089 167094 165145 163418 162177 161905 162741
54507 162741 164098 165064 164994 163699 161439 159004 157416 157218 158101 159410 160742 161857 162379 162006 160909 159544
54491 159544 158229 157254 157176 158337 160107 161210 161102 160596 160853 162120 163730 164988 165658 165817 165730 165827 166442
54474 166442 167505 168745 170154 171932 173918 175447 175988 175790 175656 176092 176845 177301 177313 177506 178662 180777
54458 180777 182880 183920 183677 182651 181286 179685 178058 176910 176546 176665 176724 176577 176533 176925 177767 178742 179376
54441 179376 179381 178974 178636 178448 177897 176636 175103 173991 173307 172522 171540 170915 170997 171464 171871 172209 172588 172836 172788
54422 172788 172671 172811 173172 173454 173444 172992 171941 170462 169211 168729 168842 169043 169198 169465 169757 169919 170322 171516
$$ packed form
54540A50688Q3M36M88M36N78Q04Q74Q69J039J352J548J508J349J156Q72N00K24
54523A64804K04L27L60L40O20J268J684J155k01j472j995j949j727j241k72Q36
54507A62741J357R66p0j295k260k435j588j98Q83J309J332J115N22l73j097j365
54491A59544j315r75p8J161J770J103j08n06K57J267J610J258O70J59q7R7O15
54474A66442J063J240J409J778J986J529N41j98j34M36P53M56J2J93J156K115
54458A80777K103J040k43j026j365j601j627j148l64J19N9j47m4L92Q42R75O34
54441A79376Nm07l38j88n51j261j533j112o84p85r82o25Q2M67M07L38L79K48m8
54422A72788j17J40L61K82j0m52j051j479j251m82J13K01J55K67K92J62M03J194
$$ plain form
54404 171516 173219 174341 174273 173584 173114 172995 172987 173287 174298 175834 177157 177786 177842 177640 177401 177404 177992 179262 180944
54385 180944 182636 183943 184449 183944 182790 181727 181086 180418 179092 177087 174944 173087 171512 170145 169278
54370 169278 169461 170956 173330 175645 177173 177957 178629 179637 180824 181805 182539 183234 183822 183880 183210 182206 181481
54353 181481 181244 181255 181283 181354 181521 181560 181036 179676 177637 175395 173343 171486 169660 167991 166903 166536 166450 166235
54335 166235 166246 167248 169284 171377 172553 172806 172774 172878 173211 173930 175112 176256 176595 176063 175502 175628 176270
54318 176270 176978 177880 179386 181245 182519 182604 181790 180774 180073 180108 181288 183527 185914 187355 187578 187150 186570
54301 186570 185748 184471 182941 181546 180340 179063 177568 175986 174542 173406 172651 172140 171535 170685 169974 169992
54285 169992 170763 171561 171616 170862 169893 169390 169734 170930 172599 174092 174873 174947 174771 174694 174552 173934 172826 171793
$$ packed form
54404A71516J703J122o8o89m70j19qL00J011J536J323O29N6k02k39LN88J270J682
54385A80944J692J307N06n05j154j063o41o68j326k005k143j857j575j367q67
54370A69278J83J495K374K315J528P84O72J008J187R81P34O95N88N8o70j004p25
54353A81481k37J1K8P1J67L9n24j360k039k242k052j857j826j669j088l67q6k15
54335A66235J1J002K036K093J176K53l2J04L33P19J182J144L39n32n61J26O42
54318A76270P08R02J506J859J274Q5q14j016p01L5J180K239K387J441K23m28n80
54301A86570q22j277j530j395j206j277j495j582j444j136p55n11o05q50p11J8
54285A69992P71P98N5p54r69n03L44J196J669J493P81P4j76p7j42o18j108j033
$$ plain form
54267 171793 171389 171496 171521 171265 171202 171722 172463 172874 173196 174230 176137 178057 179173 179618 180002 180518 180977 181329
54249 181329 181615 181590 180928 179836 179000 178879 179279 179610 179372 178465 177320 176611 176564 176627 176152 175236 174483 174115 173779
54230 173779 173260 172808 172578 172228 171331 169947 168609 167935 168277 169440 170668 171234 171160 171091 171430 171974 172455 172905
54212 172905 173266 173111 172113 170475 168564 166481 164327 162549 161610 161544 162196 163532 165246 166407 166252 165289
54196 165289 164931 165841 167198 167824 167566 167247 167554 168358 169028 169149 168843 168506 168235 167684 166622 165488 165020 165326
54178 165326 165736 165740 165706 166372 167875 169644 171131 172259 173195 173985 174580 174946 175013 174690 174103 173694 173791 174112 173989
54159 173989 173160 172090 171298 170615 169474 167847 166386 165504 164756 163523 161999 160978 160793 161022 161277 161729
54143 161729 162574 163447 163832 163789 163770 163864 163776 163556 163782 164719 165784 166226 166087 166056 166565 167483 168620 170012 171570
$$ packed form
54267A71793m04J07K5k56o3N20P41M11L22J034J907J920J116M45L84N16M59L52
54249A81329K86k5o62j092q36j21M00L31k38r07j145p09m7O3m75r16p53l68l36
54230A73779n19m52k30l50q97j384j338o74L42J163J228N66p4o9L39N44M81M50
54212A72905L61j55r98j638j911k083k154j778r39o6O52J336J714J161j55r63
54196A65289l58R10J357O26k58l19L07Q04O70J21l06l37k71n51j062j134m68L06
54178A65326M10Ml4O66J503J769J487J128R36P90N95L66O7l23n87m09R7L21j23
54159A73989q29j070p92o83j141j627j461q82p48j233j524j021j85K29K55M52
54143A61729Q45Q73L85m3j9R4q8k20K26R37J065M42j39l1N09R18J137J392J558
$$ plain form
54124 171570 172939 173931 174738 175457 175738 175298 174544 174221 174537 175062 175474 175940 176650 177344 177597 177355 176980 176849
54106 176849 177065 177530 178194 179178 180575 182051 182857 182532 181458 180386 179397 177868 175655 173826 173704 175350
54090 175350 177466 178768 179044 178853 178652 178551 178652 179144 180001 180888 181576 182263 183199 184132 184537 184510 184970 186618
54072 186618 188953 190741 191401 191508 191945 192948 194036 194536 194077 192888 191685 191019 190649 189876 188502 187095
54056 187095 186271 186192 186829 188157 189760 190849 191155 191470 192812 195301 198305 201418 204761 208473 212465 216682
54040 216682 221196 225983 230914 235933 240995 245916 250617 255461 261015 267506 274715 282213 289459 295841
54026 295841 301029 305206 308674 311366 313160 314409 315653 316930 317929 318727 319699 320611 320501 318726 315663
54011 315663 312096 308375 304468 300411 296299 292093 287717 283198 278534 273699 268946 264825 261638 259177
$$ packed form
54124A71570J369R92Q07P19K81m40p54l23L16N25M12M66P10O94K53k42l75j31
54106A76849K16M65O64R84J397J476Q06l25j074j072r89j529k213j829j22J646
54090A75350K116J302K76j91k01j01J01M92Q57Q87O88O87R36R33M05k7M60J648
54072A86618K335J788O60J07M37J003J088N00m59j189j203o66l70p73j374j407
54056A87095q24p9O37J328J603J089L06L15J342K489L004L113L343L712L992M217
54040B16682M514M787M931N019N062M921M701M844N554O491P209P498P246O382
54026B95841N188M177L468K692J794J249J244J277R99P98R72R12j10j775l063
54011C15663l567l721l907m057m112m206m376m519m664m835m753m121l187k461
$$ plain form
53997 259177 257236 256114 256270 257693 260005 263073 267134 272296 278173 284228 290391 297229 305433 315088
53983 315088 325413 335174 343144 348131 348991 345191 337418 327203 315794 303646 291071 278916 268317
53970 268317 259924 253505 248137 242799 237159 231979 228411 226783 226282 225908 225316 224614 223883 223298 223275 223953
53954 223953 224709 224733 224013 223374 223517 224421 225719 227341 229627 232887 236987 241380 245526 249210 252422 255181
53938 255181 257841 261360 266613 273292 280055 285996 291398 296731 301677 305814 309743 314554 320310 325880
53924 325880 330369 334034 337696 341845 346483 351271 355620 359090 362053 365574 370390 376245 382426 388646
53910 388646 395176 402292 409845 417204 423485 428010 430717 432096 432629 432472 431655 430262 428309 425640 422148
53895 422148 417889 412886 407031 400373 393329 386370 379593 372810 365996 359402 353191 347166 340952 334378
$$ packed form
53997B59177j941j122J56J423K312L068M061N162N877O055O163O838Q204R655
53983C15088J0325R761P970M987Q60l800p773j0215j1409j2148j2575j2155j0599
53970B68317q393o419n368n338n640n180l568j628n01l74n92p02p31n85k3O78
53954B23953P56K4p20o39J43R04J298J622K286L260M100M393M146L684L212K759
53938B55181K660L519N253O679O763N941N402N333M946M137L929M811N756N570
53924C25880M489L665L662M149M638M788M349L470K963L521M816N855O181O220
53910C88646O530P116P553P359O281M525K707J379N33j57q17j393j953k669l492
53895D22148m259n003n855o658p044o959o777o783o814o594o211o025o214o574
$$ plain form
53881 334378 327578 320742 313968 307464 301730 297207 293699 290456 286969 283425 280199 277264 274462 272039
53867 272039 270267 268654 266169 262448 258297 254741 251953 249425 246852 244513 242847 241908 241198 240016 238091
53852 238091 235883 234042 232629 231205 229739 228920 229323 230672 232212 233469 234314 234673 234662 234746 235248 235846 236078
53835 236078 236156 236691 237623 238137 237798 237234 237416 238811 241507 245675 251319 257925 264976 272751 282110 293477
53819 293477 306459 320547 335729 352143 369372 386222 400983 411785 417106 416374 410201 399984
53807 399984 387332 373812 360824 349371 339987 333046 328869 327262 327270 327882 328932 330825 333466 336058
53793 336058 338113 340008 342246 344712 347142 349844 353276 357171 360722 363617 366260 368961 371467 373435
53779 373435 374867 375795 376014 375411 374220 372547 369849 365288 358619 350494 341882 333375 325072 316939 309099
$$ packed form
53881C34378o800o836o774o504n734m523l508l243l487l544l226k935k802k423
53867B72039j772j613k485l721m151l556k788k528k573k339j666r39p10j182j925
53852B38091k208j841j413j424j466q19M03J349J540J257Q45L59j1Q4N02N98K32
53835B36078P8N35R32N14l39n64J82J395K696M168N644O606P051P775R359J1367
53819B93477J2982J4088J5182J6414J7229J6850J4761J0802N321p32o173j0217
53807C99984j2652j3520j2988j1453r384o941m177j607QO12J050J893K641K592
53793C36058K055J895K238K466K430K702L432L895L551K895K643K701K506J968
53779C73435J432R28K19o03j191j673k698m561o669q125q612q507q303q133p840
$$ plain form
53764 309099 301698 294646 287760 281234 275661 271290 267508 263475 259163 255271 252186 249629 247446 246004
53750 246004 245392 244798 243330 241206 239525 238967 239176 239400 239285 238974 238808 239050 239685 240365 240705 240638 240378 240142
53732 240142 240072 240292 240754 241148 241264 241355 241784 242404 242734 242795 243289 244764 246954 249126 250770 251763 252216 252520
53714 252520 253311 254941 257035 258885 260313 261906 264366 267774 271525 274837 277354 279367 281457 283851
53700 283851 286166 287899 289096 290410 292546 295740 299678 303714 307187 309784 311673 313237 314698 316189
53686 316189 318013 320430 323101 325193 326289 326796 327066 326514 324319 320923 318045 316960 317303 317865 317991 317689
53670 317689 316962 315817 314698 314130 313935 313533 313026 313149 313951 314345 313495 311954 310842 310395 310052 309525 308947
53653 308947 308174 306882 305392 304588 304783 305307 305509 305586 306144 307442 309375 311675 313709 314590 314048 312899 312177
$$ packed form
53764C09099p401p052o886o526n573m371l782m033m312l892l085k557k183j442
53750B46004o12n94j468k124j681n58K09K24j15l11j66K42O35O80L40o7k60k36
53732B40142p0K20M62L94J16R1M29O20L30O1M94J475K190K172J644R93M53L04
53714B52520P91J630K094J850J428J593K460L408L751L312K517K013K090K394
53700B83851K315J733J197J314K136L194L938M036L473K597J889J564J461J491
53686C16189J824K417K671K092J096N07K70n52k195l396k878j085L43N62J26l02
53670C17689p27j145j119n68j95m02n07J23Q02L94q50j541j112m47l43n27n78
53653C08947p73j292j490q04J95N24K02P7N58J298J933K300K034Q81n42j149p22
$$ plain form
53636 312177 312059 312126 312350 313156 314620 316303 317975 319891 322178 324469 326426 328205 330120 332220 334533
53621 334533 337373 340956 344885 348473 351527 354489 357812 361552 365563 369711 373743 377320 380444 383668
53607 383668 387593 392240 397145 401948 406572 410830 414265 416621 418286 419967 421940 423832 425146 425770
53593 425770 425933 425875 425742 425660 425698 425799 425860 425879 425887 425755 425236 424188 422624 420548 417971 415180 412757 411084 409897
53574 409897 408512 406493 403917 401063 398068 395032 392259 390162 388891 388148 387405 386320 385009 383960 383644
53559 383644 384175 385315 386752 388220 389363 389774 389437 389034 389460 390992 393174 395547 398165 401167 404225
53544 404225 406898 409448 412770 417356 422797 428601 435098 442990 452179 461704 470964 480420 490691 501370
53530 501370 511351 520209 528671 537559 546799 555818 564561 573634 583586 594516 606400 619290 633019
$$ packed form
53636C12177j18O7K24Q06J464J683J672J916K287K291J957J779J915K100K313
53621C34533K840L583L929L588L054K962L323L740M011M148M032L577L124L224
53607C83668L925M647M905M803M624M258L435K356J665J681J973J892J314O24
53593D25770J63n8j33q2L8J01O1J9Qj32n19j048j564k076k577k791k423j673j187
53574D09897j385k019k576k854k995l036k773k097j271p43p43j085j311j049l16
53559C83644N31J140J437J468J143M11l37m03M26J532K182K373K618L002L058
53544D04225K673K550L322M586N441N804O497P892R189R525R260R456J0271J0679
53530E01370R981Q858Q462Q888R240R019Q743R073R952J0930J1884J2890J3729
$$ plain form
53517 633019 647137 661547 676978 694378 713877 734761 756544 779624 804610 831333 858900
53506 858900 886638 914608 943115 972050 1000900 1029262 1057158 1084856 1112423 1139499 1165558
53495 1165558 1190499 1214950 1239804 1265433 1291481 1317390 1342832 1367505 1390875 1412507 1432545
53484 1432545 1451672 1470606 1489889 1509878 1530542 1551283 1571424 1590993 1610631 1630535 1649831
53473 1649831 1667216 1681944 1693881 1702938 1708908 1711821 1712042 1709891 1705303 1697910 1687398 1673907 1658210
53460 1658210 1641369 1624014 1606059 1587275 1567850 1548137 1528077 1507252 1485394 1462442 1438273
53449 1438273 1412974 1387341 1362458 1338541 1314804 1290809 1267398 1245792 1226201 1207935 1190682
53438 1190682 1174962 1161269 1149366 1138662 1128923 1120382 1113366 1108073 1104561 1102759 1102508 1103665 1106186
$$ packed form
53517F33019J4118J4410J5431J7400J9499K0884K1783K3080K4986K6723K7567
53506H58900K7738K7970K8507K8935K8850K8362K7896K7698K7567K7076K6059
53495A165558K4941K4451K4854K5629K6048K5909K5442K4673K3370K1632K0038
53484A432545J9127J8934J9283J9989K0664K0741K0141J9569J9638J9904J9296
53473A649831J7385J4728J1937R057N970K913K21k151m588p393j0512j3491j5697
53460A658210j6841j7355j7955j8784j9425j9713k0060k0825k1858k2952k4169
53449A438273k5299k5633k4883k3917k3737k3995k3411k1606j9591j8266j7253
53438A190682j5720j3693j1903j0704r739q541p016n293l512j802k51J157K521
$$ plain form
53425 1106186 1110120 1115608 1122860 1132023 1143034 1155693 1169868 1185572 1202892 1221953 1242904 1265745
53413 1265745 1290167 1315755 1342439 1370651 1400910 1433295 1467437 1502978 1539987 1578917 1620247
53402 1620247 1664188 1710660 1759431 1810255 1863070 1918137 1975871 2036271 2098551 2161599 2224900
53391 2224900 2288778 2353629 2419147 2484469 2548963 2612617 2675651 2737832 2798197 2855576 2909512
53380 2909512 2960580 3009454 3055721 3098032 3135541 3168690 3198331 3224578 3246921 3265014 3278695
53369 3278695 3287506 3290780 3288090 3279062 3262923 3238863 3206770 3167075 3120058 3066157 3007022 2945285
53357 2945285 2882843 2819954 2756303 2692296 2628822 2566419 2505281 2445677 2387784 2331330 2275894
53346 2275894 2221329 2167555 2114286 2061391 2009113 1957498 1906070 1854727 1804609 1757301 1713340
$$ packed form
53425A106186L934N488P252R163J1011J2659J4175J5704J7320J9061K0951K2841
53413A265745K4422K5588K6684K8212L0259L2385L4142L5541L7009L8930M1330
53402A620247M3941M6472M8771N0824N2815N5067N7734O0400O2280O3048O3301
53391B224900O3878O4851O5518O5322O4494O3654O3034O2181O0365N7379N3936
53380B909512N1068M8874M6267M2311L7509L3149K9641K6247K2343J8093J3681
53369C278695Q811L274k690r028j6139k4060l2093l9695m7017n3901n9135o1737
53357B945285o2442o2889o3651o4007o3474o2403o1138n9604n7893n6454n5436
53346B275894n4565n3774n3269n2895n2278n1615n1428n1343n0118m7308m3961
$$ plain form
53335 1713340 1672119 1633068 1596186 1561549 1529197 1499562 1473202 1449835 1428305 1407740 1388139
53324 1388139 1369584 1351585 1333603 1315756 1298567 1282448 1267735 1254727 1243281 1232764 1222910
53313 1222910 1214384 1207990 1203661 1200779 1199267 1199746 1202595 1207379 1213276 1219770 1226873 1235032 1244883 1256948
53299 1256948 1271467 1288511 1308046 1329710 1352811 1376847 1401940 1428532 1456798 1486576 1517593
53288 1517593 1549367 1581130 1612298 1642878 1672940 1701813 1728377 1752138 1773496 1792895 1810250
53277 1810250 1825356 1838254 1848900 1856903 1861917 1863901 1862704 1857781 1848809 1836363 1821553 1805080
53265 1805080 1786880 1766552 1743774 1718462 1690845 1661452 1630787 1599073 1566413 1533053 1499241
53254 1499241 1464935 1429964 1394450 1358876 1323791 1289671 1256929 1225675 1195407 1165238 1134600
$$ packed form
53335A713340m1221l9051l6882l4637l2352k9635k6360k3367k1530k0565j9601
53324A388139j8555j7999j7982j7847j7189j6119j4713j3008j1446j0517r854
53313A222910q526o394m329k882j512M79K849M784N897O494P103Q159R851J2065
53299A256948J4519J7044J9535K1664K3101K4036K5093K6592K8266K9778L1017
53288A517593L1774L1763L1168L0580L0062K8873K6564K3761K1358J9399J7355
53277A810250J5106J2898J0646Q003N014J984j197m923q972j2446j4810j6473
53265A805080j8200k0328k2778k5312k7617k9393l0665l1714l2660l3360l3812
53254A499241l4306l4971l5514l5574l5085l4120l2742l1254l0268l0169l0638
$$ plain form
53243 1134600 1103656 1073027 1043241 1014400 986196 958202 930319 902967 876738 851868 828202
53232 828202 805630 784379 764846 747338 731991 718740 707270 697014 687238 677190 666414 655086
53220 655086 643773 632569 620673 607246 592596 577957 564014 550174 535558 520277 505393
53209 505393 491912 480223 470275 461796 454280 447148 440048 432956 425933 418892 411639 404163 396849 390247
53195 390247 384476 379023 373437 368123 363898 360793 357881 354545 351207 348345 345469 341847 337821 334455
53181 334455 331986 329565 326630 323668 321318 319489 317792 316233 314944 313690 312167 310529 309140 308044
53167 308044 307152 306667 306849 307447 307870 307842 307479 306836 305857 304786 304138 304087 304205 303967 303300 302552 302117 302170 302539
53148 302539 302762 302468 301728 300835 299812 298466 296881 295407 294025 292247 289966 287990 287217 287445 287507 286590
$$ packed form
53243A134600l0944l0629k9786k8841k8204k7994k7883k7352k6229k4870k3666
53232H28202k2572k1251j9533j7508j5347j3251j1470j0256r776j0048j0776j1328
53220F55086j1313j1204j1896j3427j4650j4639j3943j3840j4616j5281j4884
53209E05393j3481j1689r948q479p516p132p100p092p023p041p253p476p314o602
53195C90247n771n453n586n314m225l105k912l336l338k862k876l622m026l366
53181C34455k469k421k935k962k350j829j697j559j289j254j523j638j389j096
53167C08044q92m85J82N98M23k8l63o43r79j071o48n1J18k38o67p48m35N3L69
53148C02539K23k94p40q93j023j346j585j474j382j778k281j976p73K28O2r17
$$ plain form
53132 286590 285013 283630 282876 282586 282482 282518 282790 283270 283708 283787 283409 282803 282284 281916 281524 281050 280707 280718 281055
53113 281055 281555 282188 282989 283805 284324 284385 284050 283310 281993 280138 278298 277130 276709 276496 276001 275175 274119
53096 274119 272836 271492 270551 270190 269805 268575 266459 264183 262302 260832 259909 260056 261354 262866 263549 263458
53080 263458 263459 263931 264461 264784 265289 266305 267461 268098 268004 267421 266681 266108 265953 266053 265847 265125 264465 264469 264792 264546
53060 264546 263608 262885 263120 263990 264676 264879 264868 264791 264420 263618 262705 262263 262634 263650 264867 266084 267598 269785
53042 269785 272462 274847 276234 276511 275988 274991 273820 272841 272341 272360 272755 273267 273387 272516 270621 268566 267387
53025 267387 267283 267647 267968 268237 268449 268249 267392 266251 265530 265557 266059 266488 266416 265737 264779 264222 264694 266294 268441
53006 268441 270235 271068 271017 270676 270526 270495 270244 269750 269404 269544 270123 270846 271337 271165 270085 268473 267230 266999
$$ packed form
53132B86590j577j383p54k90j04L6K72M80M38P9l78o06n19l68l92m74l43J1L37
53113B81055N00O33Q01Q16N19O1l35p40j317j855j840j168m21k13m95q26j056
53096B74119j283j344r41l61l85j230k116k276j881j470r23J47J298J512O83r1
53080B63458JM72N30L23N05J016J156O37r4n83p40n73j55J00k06p22o60ML23k46
53060B64546r38p23K35Q70O86K03j1p7l71q02r13m42L71J016J217J217J514K187
53042B69785K677K385J387K77n23r97j171r79n00J9L95N12J20q71j895k055j179
53025B67387j04L64L21K69K12k00q57j141p21K7N02M29p2o79r58n57M72J600K147
53006B68441J794Q33n1l41j50l1k51m94l46J40N79P23M91j72j080j612j243k31
$$ plain form
52988 266999 267628 268590 269640 270822 272105 273417 274897 276656 278317 279283 279524 279710 280432 281640 283020 284563
52972 284563 286439 288547 290570 292419 294314 296369 298359 300017 301457 303133 305373 307982 310304 311618
52958 311618 311494 309961 307580 305353 304229 304340 304807 304561 303356 301766 300299 298867 297218 295436 293797
52943 293797 292397 291176 290117 289198 288333 287577 287188 287208 287181 286605 285502 284230 282926 281586 280484 279898 279475
52926 279475 278520 277084 276036 275766 275511 274477 273082 272331 272332 272271 271746 271283 271344 271578 271381 270750 270235 270398 271542
52907 271542 273563 275742 276992 276709 275278 273597 272305 271617 271496 271659 271687 271491 271489 272051 273008 274061 275329
52890 275329 277023 278786 279910 280184 280032 279879 279811 279798 279755 279388 278498 277455 276783 276215 274843 272438 269992
52873 269992 268580 268238 268386 268772 269405 270001 270239 270384 271006 272105 273086 273634 274121 275087 276711 278847 281123
$$ packed form
52988B66999O29R62J050J182J283J312J480J759J661R66K41J86P22J208J380J543
52972B84563J876K108K023J849J895K055J990J658J440J676K240K609K322J314
52958C11618j24j533k381k227j124J11M67k46j205j590j467j432j649j782j639
52943B93797j400j221j059r19q65p56l89K0k7n76j103j272j304j340j102n86m23
52926B79475r55j436j048k70k55j034j395p51Jo1n25m63O1K34j97o31n15J63J144
52907B71542K021K179J250k83j431j681j292o88j21J63K8j96kN62R57J053J268
52890B75329J694J763J124K74j52j53o8j3m3l67q90j043o72n68j372k405k446
52873B69992j412l42J48L86O33N96K38J45O22J099R81N48M87R66J624K136K276
$$ plain form
52856 281123 282901 283600 283292 282691 282331 282001 281137 279531 277442 275209 273038 271122 269664 268646 267636 265953
52840 265953 263179 259589 255990 253077 251003 249601 248775 248436 248218 247624 246553 245416 244702 244600 245056 245940
52824 245940 247031 248019 248693 249016 248968 248409 247216 245513 243687 242216 241464 241563 242440 243936 245827 247785 249551
52807 249551 251283 253465 256227 258941 260788 261574 261610 261011 259666 257883 256386 255448 254530 253121 251511 250335
52791 250335 249696 249191 248614 248130 247792 247309 246398 245167 244061 243515 243630 244081 244445 244644 244934 245394 245689 245549
52773 245549 245191 244965 244854 244753 245020 246155 247897 249263 249704 249769 250262 251153 251795 252014 252387 253335 254400 254759
52755 254759 254262 253614 253511 253876 254046 253551 252456 251067 249577 248098 246775 245738 245040 244807 245274 246466
52739 246466 247982 249364 250618 252089 253824 255391 256495 257442 258758 260521 262355 263977 265438 266806
$$ packed form
52856B81123J778O99l08o01l60l30q64j606k089k233k171j916j458j018j010j683
52840B65953k774l590l599k913k074j402q26l39k18n94j071j137p14j02M56Q84
52824B45940J091R88O74L23m8n59j193j703j826j471p52R9Q77J496J891J958J766
52807B49551J732K182K762K714J847P86L6n99j345j783j497r38r18j409j610j176
52791B50335o39n05n77m84l38m83r11j231j106n46J15M51L64J99K90M60K95j40
52773B45549l58k26j11j01K67J135J742J366M41O5M93Q91O42K19L73R48J065L59
52755B54759m97o48j03L65J70m95j095j389j490j479j323j037o98k33M67J192
52739B46466J516J382J254J471J735J567J104R47J316J763J834J622J461J368
$$ plain form
52725 266806 267944 268728 269211 269342 268776 267277 265272 263616 262696 262058 261069 259725 258540 257901 257809 258195 259034
52708 259034 260093 260965 261570 262336 263600 264952 265472 264627 262743 260646 259028 258195 258199 259002 260439 262058 263154
52691 263154 263190 262332 261462 261420 262198 263051 263425 263582 264195 265482 266996 268202 268988 269547 270060 270762 272061 274149
52673 274149 276489 278103 278600 278601 278923 279664 280431 281095 281816 282435 282535 282175 281996 282357 282869 283139 283477 284370 285572
52654 285572 286327 286471 286755 287936 289894 291768 292693 292328 290981 289429 288365 287761 286874 285133 282959 281442
52638 281442 281157 281564 281741 281514 281498 282100 282923 283369 283524 284049 285292 286920 288464 289890 291526 293629 296075
52621 296075 298286 299387 298759 296568 293631 290714 288152 286063 284519 283316 281995 280355 278749 277676
52607 277676 277312 277505 277894 277825 276659 274546 272575 271732 271934 272451 272975 273806 275199 277081 279303 281722 284065
$$ packed form
52725B66806J138P84M83J31n66j499k005j656r20o38r89j344j185o39r2L86Q39
52708B59034J059Q72O05P66J264J352N20q45j884k097j618q33MQ03J437J619J096
52691B63154L6q58q70m2P78Q53L74J57O13J287J514J206P86N59N13P02J299K088
52673B74149K340J614M97JL22P41P67O64P21O19J00l60j79L61N12K70L38Q93J202
52654B85572P55J44K84J181J958J874R25l65j347j552j064o04q87j741k174j517
52638B81442k85M07J77k27j6O02Q23M46J55N25J243J628J544J426J636K103K446
52621B96075K211J101o28k191k937k917k562k089j544j203j321j640j606j073
52607B77676l64J93L89o9j166k113j971q43K02N17N24Q31J393J882K222K419K343
$$ plain form
52590 284065 286151 288160 290286 292267 293764 295079 296850 299034 300828 301755 302231 302835 303569 304157 304596 304965
52574 304965 305057 304614 303762 302837 301941 300951 299877 298881 297964 296866 295333 293444 291681 290624 290426 290570 290347
52557 290347 289621 288948 288835 289075 288955 288054 286755 285972 286306 287424 288374 288631 288568 288738 289082 289295 289647 290662
52539 290662 292021 292625 291991 290993 290804 291554 292382 292414 291354 289530 287766 286946 287304 288299 289307 290145 290786
52522 290786 291063 291016 291062 291365 291417 290748 289797 289547 290494 292345 294520 296542 298237 299998 302584 306164 309820
52505 309820 312547 314471 316403 318401 319573 319229 317450 314452 310240 305210 300420 296793 294390 292716
52491 292716 291333 289956 288448 287049 286258 286168 286280 286229 286302 286841 287547 287882 287938 288428 289869 292138 294742 297106
52473 297106 298637 298956 298264 297264 296684 296982 298381 300758 303428 305463 306574 307544 309457 312488 315653
$$ packed form
52590B84065K086K009K126J981J497J315J771K184J794R27M76O04P34N88M39L69
52574C04965R2m43q52r25q96r90j074r96r17j098j533j889j763j057j98J44k23
52557B90347p26o73j13K40j20r01j299p83L34J118R50K57o3J70L44K13L52J015
52539B90662J359O04o34r98j89P50Q28L2j060j824j764q20L58R95J008Q38O41
52522B90786K77m7M6L03N2o69r51k50R47J851K175K022J695J761K586L580L656
52505C09820K727J924J932J998J172l44j779k998m212n030m790l627k403j674
52491B92716j383j377j508j399p91r0J12n1P3N39P06L35N6M90J441K269K604K364
52473B97106J531L19o92j000n80K98J399K377K670K035J111R70J913L031L165
$$ plain form
52458 315653 317839 318867 319407 319988 320334 319738 317864 315043 311897 308838 305958 303205 300592 298246 296270
52443 296270 294587 293007 291473 290178 289345 288973 288884 288924 288982 288889 288435 287485 286060 284387 282958 282337 282714 283710
52425 283710 284811 285920 287321 289194 291388 293591 295444 296549 296671 296020 295205 294897 295622 297651 300762
52410 300762 304244 307579 311168 315972 322392 329954 338134 346970 356550 366440 376005 384887 392597 397909
52396 397909 399373 396579 390554 382804 374292 365355 356253 347538 340033 334505 331202 329572 328638 327786 327112
52381 327112 326978 327400 328035 328656 329449 330841 333119 336203 339685 343103 346266 349447 353200 357962 363657
52366 363657 369590 374765 378474 380735 382140 383169 383752 383626 383040 382798 383386 384263 384348 383298 382053 381977 383546
52349 383546 386012 388261 389854 391237 393048 395364 397728 399820 401984 404897 408833 413449 418300 423319
$$ packed form
52458C15653K186J028N40N81L46n96j874k821l146l059k880k753k613k346j976
52443B96270j683j580j534j295q33l72q9M0N8r3m54r50j425j673j429o21L77R96
52425B83710J101J109J401J873K194K203J853J105J22o51q15l08P25K029L111
52410C00762L482L335L589M804O420P562Q180Q836R580R890R565Q882P710N312
52396C97909J464k794o025p750q512q937r102q715p505n528l303j630r34q52o74
52381C27112j34M22O35O21P93J392K278L084L482L418L163L181L753M762N695
52366C63657N933N175L709K261J405J029N83j26n86k42N88Q77Q5j050j245p6J569
52349C83546K466K249J593J383J811K316K364K092K164K913L936M616M851N019
$$ plain form
52335 423319 428748 434826 441679 449389 458029 467701 478571 490716 503960 518072 533183 549688 567601
52322 567601 586351 605481 625217 646002 667665 689477 710865 731687 751878 771264 789827
52311 789827 807881 825928 844446 863681 883425 903099 922345 941341 960233 978499 995356
52300 995356 1010683 1024952 1038283 1050161 1060203 1068666 1075884 1081632 1085259 1086199 1084214 1079549 1073036
52287 1073036 1065707 1058062 1049958 1041281 1032428 1024077 1016928 1011701 1008727 1007295 1006057 1004534 1003777 1005080
52273 1005080 1008543 1013407 1019295 1026363 1034564 1043631 1053795 1065723 1079588 1094731 1110414 1126414
52261 1126414 1142647 1158726 1174244 1189254 1204143 1219129 1234118 1248942 1263510 1277668 1291096
52250 1291096 1303513 1314945 1325591 1335229 1342958 1347847 1349790 1349403 1347172 1343228 1337970 1332174 1326047
$$ packed form
52335D23319N429O078O853P710Q640R672J0870J2145J3244J4112J5111J6505J7913
52322E67601J8750J9130J9736K0785K1663K1812K1388K0822K0191J9386J8563
52311G89827J8054J8047J8518J9235J9744J9674J9246J8996J8892J8266J6857
52300I95356J5327J4269J3331J1878J0042Q463P218N748L627R40j985m665o513
52287A073036p329p645q104q677q853q351p149n227k974j432j238j523p57J303
52273A005080L463M864N888P068Q201R067J0164J1928J3865J5143J5683J6000
52261A126414J6233J6079J5518J5010J4889J4986J4989J4824J4568J4158J3428
52250A291096J2417J1432J0646R638P729M889J943l87k231l944n258n796o127
$$ plain form
52237 1326047 1318798 1309795 1299797 1290346 1282153 1274738 1267522 1260549 1254076 1248096 1242537 1237498 1233158 1229737
52223 1229737 1227570 1226745 1226624 1226260 1225512 1225353 1226875 1230286 1235022 1240418 1246048 1251811 1258010 1265140 1273317
52208 1273317 1282113 1291073 1300121 1309302 1318456 1327393 1336060 1344247 1351422 1357313 1362452 1367779 1373745 1380131
52194 1380131 1386602 1392999 1399111 1404583 1409309 1413683 1418230 1423052 1427702 1431469 1433737 1434215 1433010 1430429
52180 1430429 1426578 1421227 1414175 1405687 1396350 1386520 1376193 1365533 1355180 1345703 1337015 1328765 1321167
52167 1321167 1314940 1310426 1307337 1305497 1305123 1306047 1307360 1308431 1309756 1312067 1314996 1317489 1319282 1320998
52153 1320998 1322800 1324003 1324211 1323881 1323310 1322037 1319919 1317987 1317350 1317699 1317812 1317231 1316550 1316126 1315478 1314189
52137 1314189 1312649 1311436 1310447 1309091 1307184 1305336 1304575 1305799 1309468 1315592 1323930 1334293 1346650 1361043
$$ packed form
52237A326047p249r003r998r451q193p415p216o973o473n980n559n039m340l421
52223A229737k167q25j21l64p48j59J522L411M736N396N630N763O199P130Q177
52208A273317Q796Q960R048R181R154Q937Q667Q187P175N891N139N327N966O386
52194A380131O471O397O112N472M726M374M547M822M650L767K268M78j205k581
52180A430429l851n351p052q488r337r830j0327j0660j0353r477q688q250p598
52167A321167o227m514l089j840l74R24J313J071J325K311K929K493J793J716
52153A320998J802J203K08l30n71j273k118j932o37L49J13n81o81m24o48j289
52137A314189j540j213r89j356j907j848p61J224L669O124Q338J0363J2357J4393
$$ plain form
52123 1361043 1377600 1396674 1418748 1443938 1471563 1500375 1529293 1557906 1586210 1614029 1640862
52112 1640862 1666365 1690739 1714436 1737539 1759617 1780152 1798889 1815831 1831131 1845003 1857507
52101 1857507 1868367 1877301 1884597 1891015 1896895 1901694 1904641 1905603 1904975 1902945 1899253 1893498 1885276 1874107
52087 1874107 1859812 1843107 1825458 1808072 1791295 1775181 1760342 1747865 1738455 1732007 1728111 1726665
52075 1726665 1727791 1731319 1736650 1743228 1750950 1760027 1770595 1782602 1795934 1810403 1825671 1841416
52063 1841416 1857615 1874434 1891712 1908780 1924877 1939601 1952830 1964421 1974233 1982365 1989088 1994521
52051 1994521 1998497 2000722 2000898 1998598 1993258 1984556 1972828 1958932 1943484 1926351 1907126 1886087 1864274
52038 1864274 1842475 1820556 1798212 1776078 1755457 1736935 1719880 1703456 1687661 1673095 1660128
$$ packed form
52123A361043J6557J9074K2074K5190K7625K8812K8918K8613K8304K7819K6833
52112A640862K5503K4374K3697K3103K2078K0535J8737J6942J5300J3872J2504
52101A857507J0860Q934P296O418N880M799K947R62o28k030l692n755q222j1169
52087A874107j4295j6705j7649j7386j6777j6114j4839j2477r410o448l896j446
52075A726665J126L528N331O578P722R077J0568J2007J3332J4469J5268J5745
52063A841416J6199J6819J7278J7068J6097J4724J3229J1591R812Q132O723N433
52051A994521L976K225J76k300n340q702j1728j3896j5448j7133j9225k1039k1813
52038A864274k1799k1919k2344k2134k0621j8522j7055j6424j5795j4566j2967
$$ plain form
52027 1660128 1648660 1638381 1628918 1619850 1610903 1602033 1593220 1584371 1575544 1566969 1558662 1550267 1541500
52014 1541500 1532478 1523372 1514069 1504421 1494489 1484168 1472895 1460147 1445960 1430562 1413655 1394608
52002 1394608 1373216 1349850 1324958 1298837 1271726 1243709 1214686 1184964 1155694 1128139 1102494
51991 1102494 1078034 1054403 1032069 1011393 991892 972714 953362 933852 914739 897128 881843
51980 881843 868110 853744 837305 819701 803059 788412 775109 762181 749415 737106 725564
51969 725564 715142 706293 699308 694259 691281 690563 691914 694652 698139 702167 706707 711527 716251 720528
51955 720528 723871 725546 724945 722002 717007 710147 701657 692363 683615 676401 670831 666767 664596 664897 667553
51940 667553 671857 677556 685125 694705 705390 716152 727076 738883 751306 762666 771228 776359 778164
$$ packed form
52027A660128j1468j0279r463r068q947q870q813q849q827q575q307q395q767
52014A541500r022r106r303r648r932j0321j1273j2748j4187j5398j6907j9047
52002A394608k1392k3366k4892k6121k7111k8017k9023k9722k9270k7555k5645
51991A102494k4460k3631k2334k0676j9501j9178j9352j9510j9113j7611j5285
51980H81843j3733j4366j6439j7604j6642j4647j3303j2928j2766j2309j1542
51969G25564j0422q849o985n049k978p18J351K738L487M028M540M820M724M277
51955G20528L343J675o01k943m995o860q490r294q748p214n570m064k171L01K656
51940F67553M304N699P569R580J0685J0762J0924J1807J2423J1360Q562N131J805
$$ plain form
51927 778164 776572 771306 762475 750644 736374 720037 702074 683156 664009 645268 627549 611467
51915 611467 597427 585351 574683 564819 555654 547680 541399 536712 533081 530266 528636 528714 530642 534173
51901 534173 538914 544467 550523 556975 563694 570114 575241 578290 579033 577439 573326 566632 557802 547549
51887 547549 536502 525409 515455 507779 502616 499315 497292 496699 498067 501598 506964 513610 521182 529794
51873 529794 539908 551768 564901 578336 591302 603552 615051 625596 634786 642085 647013 649592
51861 649592 650700 651589 652842 654042 654544 654138 652710 649756 644823 638259 631017 623711 616308 608692 600983
51846 600983 593165 584901 575986 566637 557131 547525 538057 529422 522151 515909 510023 504559 500307 497631
51832 497631 495948 494602 493707 493791 495029 497263 500399 504195 507783 509980 510203 508732 506162 502945 499474
$$ packed form
51927G78164j592n266q831j1831j4270j6337j7963j8918j9147j8741j7719j6082
51915F11467j4040j2076j0668r864r165p974o281m687l631k815j630P8J928L531
51901E34173M741N553O056O452O719O420N127L049P43j594m113o694q830j0253
51887E47549j1047j1093r954p676n163l301k023n93J368L531N366O646P572Q612
51873E29794J0114J1860J3133J3435J2966J2250J1499J0545R190P299M928K579
51861F49592J108Q89J253J200N02m06j428k954m933o564p242p306p403p616p709
51846F00983p818q264q915r349r506r606r468q635p271o242n886n464m252k676
51832D97631j683j346q95Q4J238K234L136L796L588K197K23j471k570l217l471
$$ plain form
51817 499474 496131 493099 490542 489015 489255 491268 494056 496583 498713 500838 502934 504543 505527 506204 506667
51802 506667 506524 505560 504225 503047 501834 499896 497058 494082 491960 490973 490579 490049 488986 487308 485047
51787 485047 482376 479766 477865 477064 477150 477449 477356 476730 475824 474873 473849 472553 470836 468695 466331 464272
51771 464272 463270 463815 465757 468667 472538 477764 484402 491884 499681 507800 516279 524558 531753 537244
51757 537244 540566 541048 538288 532881 526042 518507 510376 501910 493691 485821 477834 469822 462942 458277
51743 458277 455679 454221 453344 453096 453763 455878 460272 467417 476811 487449 498678 510162 521334 531535
51729 531535 540575 548520 555069 559722 562575 564466 566362 568960 572598 576871 580344 581362 579357 575018
51715 575018 569315 562933 556568 550991 546565 543211 540792 538923 536510 532496 527396 523213 521341 521360 522403
$$ packed form
51817D99474l343l032k557j527K40K013K788K527K130K125K096J609R84O77M63
51802E06667j43r64j335j178j213j938k838k976k122r87l94n30j063j678k261
51787D85047k671k610j901q01Q6K99r3o26r06r51j024j296j717k141k364k059
51771D64272j002N45J942K910L871N226O638P482P797Q119Q479Q279P195N491
51757E37244L322M82k760n407o839p535q131q466q219p870p987q012o880m665
51743D58277k598j458q77k48O67K115M394P145R394J0638J1229J1484J1172J0201
51729E31535R040P945O549M653K853J891J896K598L638M273L473J018k005m339
51715E75018n703o382o365n577m426l354k419j869k413m014n100m183j872J9J043
$$ plain form
51700 522403 524822 529530 536167 542878 547828 550329 550760 550131 549676 550155 551420 552960 554705 556784 558628
51685 558628 558913 556456 550833 542323 531876 521087 511503 503713 497434 492520 489414 488553 489816 492728
51671 492728 496766 501332 505876 510323 515054 520376 526407 533572 542617 553659 565484 576086 583706
51658 583706 587229 586116 580543 571492 560331 548324 536671 526659 519288 514872 513289 514456 518084
51645 518084 523015 527268 528908 526774 520674 511394 500490 489492 478964 468575 458125 448137 439297
51632 439297 431754 425294 419862 415468 411824 408576 405942 404671 405117 406632 408081 408910 409523 410587 412199
51617 412199 413808 414938 415675 416307 416611 415941 414179 412255 411366 411774 412691 413277 413339 413010 412270 411191 410416
51600 410416 410870 412885 415927 419304 423017 427725 434072 442222 451997 463095 474939 486434 496246 503563
$$ packed form
51700E22403K419M708O637O711M950K501M31o29m55M79J265J540J745K079J844
51685E58628K85k457n623q510j0447j0789r584p790o279m914l106q61J263K912
51671D92728M038M566M544M447M731N322O031P165R045J1042J1825J0602P620
51658E83706L523j113n573r051j1161j2007j1653j0012p371m416j583J167L628
51645E18084M931M253J640k134o100r280j0904j0998j0528j0389j0450r988q840
51632D39297p543o460n432m394l644l248k634j271M46J515J449Q29O13J064J612
51617D12199J609J130P37O32L04o70j762j924q89M08R17N86O2l29p40j079p75
51600D10416M54K015L042L377L713M708O347Q150R775J1098J1844J1495R812P317
$$ plain form
51586 503563 508514 511752 513770 514775 515103 515417 516391 518432 521818 526838 533587 541875 551743 563994 579809
51571 579809 599642 622623 647139 671914 696647 721921 748595 777059 806739 836372 864992
51560 864992 892736 920812 950842 984186 1021488 1062333 1105243 1148154 1188941 1225268 1254110
51549 1254110 1272020 1276538 1267432 1246385 1215493 1176242 1129903 1078380 1024227 969844 916868 866225
51537 866225 818463 773950 733104 696630 665301 639308 617852 599576 583345 568571 555074
51526 555074 542957 532538 523990 516913 510459 504008 497608 491697 486564 482172 478387 475185 472586 470404
51512 470404 468167 465428 462263 459225 456643 454180 451428 448737 446880 445843 444543 442062 438727 435599
51498 435599 433269 431649 430630 430321 430655 431349 432345 433844 435754 437532 438835 440038 441803 444321 447162
$$ packed form
51586E03563M951L238K018J005L28L14R74K041L386N020O749Q288R868J2251J5815
51571E79809J9833K2981K4516K4775K4733K5274K6674K8464K9680K9633K8620
51560H64992K7744K8076L0030L3344L7302M0845M2910M2911M0787L6327K8842
51549A254110J7910M518r106k1047l0892l9251m6339n1523n4153n4383n2976n0643
51537H66225m7762m4513m0846l6474l1329k5993k1456j8276j6231j4774j3497
51526E55074j2117j0419q548p077o454o451o400n911n133m392l785l202k599k182
51512D70404k237k739l165l038k582k463k752k691j857j037j300k481l335l128
51498D35599k330j620j019l09L34O94R96J499J910J778J303J203J765K518K841
$$ plain form
51483 447162 449691 451358 451757 450737 448563 445778 442786 439608 436021 431904 427436 423021 419013 415474
51469 415474 412160 408734 405036 401315 398239 396547 396421 397199 397923 398244 398686 399988 402353 405379 408504
51454 408504 411408 414166 417229 421137 426036 431465 436698 441241 445024 448368 452060 457243 464848 474988
51440 474988 487118 500778 515872 531972 547517 560071 567645 569931 568397 565262 562259 560082 558541
51427 558541 556864 553904 548501 540139 529333 517261 505082 493652 483611 475304 468588 463065 458609
51414 458609 455388 453304 451810 450450 449309 448683 448647 449219 450663 453196 456556 460261 464171 468347 472460
51399 472460 475879 478435 480577 482600 484240 485302 486293 488062 491119 495693 502185 511029 522221 535441
51385 535441 550715 568614 589866 615067 644797 679598 719693 764951 815118 869760 927871
$$ packed form
51483D47162K529J667L99j020k174k785k992l178l587m117m468m415m008l539
51469D15474l314l426l698l721l076j692j26P78P24L21M42J302K365L026L125
51454D08504K904K758L063L908M899N429N233M543L783L344L692N183P605J0140
51440D74988J2130J3660J5094J6100J5545J2554P574K286j534l135l003k177j541
51427E58541j677k960n403q362j0806j2072j2179j1430j0041q307o716n523m456
51414D58609l221k084j494j360j141o26l6N72J444K533L360L705L910M176M113
51399D72460L419K556K142K023J640J062R91J769L057M574O492Q844J1192J3220
51385E35441J5274J7899K1252K5201K9730L4801M0095M5258N0167N4642N8111
$$ plain form
51374 927871 987952 1048662 1109062 1167840 1222467 1269533 1305936 1329695 1339821 1335971 1318455 1288402
51362 1288402 1247677 1198516 1143151 1083639 1021886 959794 899259 841923 788915 740860 698102
51351 698102 660750 628507 600604 576148 554640 536084 520480 507245 495264 483622 472191
51340 472191 461435 451750 443155 435503 428700 422583 416907 411655 407257 404215 402519 401573 400693 399568
51326 399568 398285 397142 396472 396444 396851 397122 396701 395516 394144 393467 393997 395343 396429 396462 395746 395392 396141
51309 396141 397706 399301 400526 401457 402127 402432 402550 402966 403907 405063 406099 407067 407976 408256 407151 404600
51293 404600 401297 397879 394468 391029 387666 384394 381105 378089 376228 376246 377950 380580 383678 387217 391065
51278 391065 394890 398636 402610 406909 411096 414636 417405 419599 421343 422653 423732 425109 427392 430859
$$ packed form
51374I27871O0081O0710O0400N8778N4627M7066L6403K3759J0126l850j7516l0053
51362A288402m0725m9161n5365n9512o1753o2092o0535n7336n3008m8055m2758
51351F98102l7352l2243k7903k4456k1508j8556j5604j3235j1981j1642j1431
51340D72191j0756r685q595p652o803o117n676n252m398l042j696r46q80j125
51326C99568j283j143o70k8M07K71m21j185j372o77N30J346J086L3p16l54P49
51309C96141J565J595J225R31O70L05J18M16R41J156J036R68R09K80j105k551
51293D04600l303l418l411l439l363l272l289l016j861J8J704K630L098L539L848
51278C91065L825L746L974M299M187L540K769K194J744J310J079J377K283L467
$$ plain form
51264 430859 435273 440097 444865 449268 452920 455305 456036 454986 452098 447451 441736 436140 431265 426417
51250 426417 420553 413752 407189 401846 397954 395484 394258 393417 391829 389493 387768 387617 388281 388321 387423 386435
51234 386435 386051 386212 386525 386528 385707 383969 382100 381176 381500 382591 384055 385834 387712 389343 390905 393107
51218 393107 396207 399451 401713 402434 401931 401171 401264 402678 404776 406431 407249 407816 408783 410210 411949 414116
51202 414116 416840 419960 423263 426687 430056 432938 435066 436578 437553 437690 436800 435354 434126 433485 433344
51187 433344 433585 434113 434611 434665 434148 433219 432011 430661 429570 429224 429633 430179 430214 429658 428932 428387 427939 427265
51169 427265 426268 425250 424591 424372 424466 424918 425975 427660 429573 431262 432616 433711 434434 434478 433665 432133 430200
51152 430200 428130 426010 423791 421405 418790 415792 412252 408455 405333 403764 403621 403887 403814 403552 403498 403569
$$ packed form
51264D30859M414M824M768M403L652K385P31j050k888m647n715n596m875m848
51250D26417n864o801o563n343l892k470j226q41j588k336j725j51O64M0q98r88
51234C86435l84J61L13Lq21j738j869r24L24J091J464J779J878J631J562K202
51218C93107L100L244K262P21n03p60R3J414K098J655Q18N67R67J427J739K167
51202D14116K724L120L303L424L369K882K128J512R75J37q90j446j228o41j41
51187D33344K41N28M98N4n17r29j208j350j091l46M09N46L5n56p26n45m48o74
51169D27265r97j018o59k19R4M52J057J685J913J689J354J095P23M4q13j532j933
51152D30200k070k120k219k386k615k998l540l797l122j569j43K66p3k62n4P1
$$ plain form
51136 403569 403547 403708 404517 405840 407026 407811 408644 410022 411881 413820 415648 417485 419452 421434 423105 424194
51120 424194 424798 425420 426601 428460 430716 433122 435743 438761 442129 445517 448597 451378 454251 457682 461816
51105 461816 466313 470483 473559 475074 475276 475100 475345 475805 475560 474256 472675 471771 471536 471206 470370 469407 468933
51088 468933 469219 470100 471115 471764 471972 472242 473016 473966 474340 474062 474015 475068 477195 479769 482373 484999 487693
51071 487693 490388 493081 495907 498981 502265 505651 509099 512669 516415 520258 524099 528192 533365 540560
51057 540560 549985 560746 571371 580645 587977 593211 596489 598435 600366 603983 610469 619679 630224
51044 630224 640484 649631 657807 665533 673085 680284 686629 691565 694779 696375 696808 696650 696251 695293 692595
51029 692595 686650 676720 663422 648168 632156 616045 600362 585822 573160 562862 555100 549753
$$ packed form
51136D03569k2J61Q09J323J186P85Q33J378J859J939J828J837J967J982J671J089
51120D24194O04O22J181J859K256K406K621L018L368L388L080K781K873L431M134
51105D61816M497M170L076J515K02j76K45M60k45j304j581r04k35l30q36r63m74
51088D68933K86Q81J015O49K08K70P74R50L74k78m7J053K127K574K604K626K694
51071D87693K695K693K826L074L284L386L448L570L746L843L841M093N173P195
51057E40560R425J0761J0625R274P332N234L278J946J931L617O486R210J0545
51044F30224J0260R147Q176P726P552P199O345M936L214J596M33j58l99r58k698
51029F92595n945r930j3298j5254j6012j6111j5683j4540j2662j0298p762n347
$$ plain form
51017 549753 546430 544628 543971 544351 545922 548942 553433 558895 564559 570040 575532 581284 587259 593590 600945
51002 600945 609831 619712 629372 638174 646423 654500 662241 669420 676354 683740 692137 701814 712758 724634
50988 724634 736985 749729 763290 778102 794223 811587 830369 850809 872835 896057 920083
50977 920083 944722 969914 995443 1020536 1043832 1064137 1081405 1096819 1111899 1127798 1145467
50966 1145467 1166013 1190592 1220125 1255220 1296088 1342349 1393272 1448350 1507297 1569352 1633134
50955 1633134 1697511 1762132 1826577 1889381 1948563 2002987 2052614 2097554 2137558 2172552 2203100
50944 2203100 2230054 2254079 2275786 2295994 2315559 2334962 2354143 2372553 2389197 2402747 2411898
50933 2411898 2415843 2414601 2408938 2399784 2387516 2371677 2351307 2325447 2293381 2254785 2209881 2159258
$$ packed form
51017E49753l323j802o57L80J571L020M491N462N664N481N492N752N975O331P355
51002F00945Q886R881R660Q802Q249Q077P741P179O934P386Q397R677J0944J1876
50988G24634J2351J2744J3561J4812J6121J7364J8782K0440K2026K3222K4026
50977I20083K4639K5192K5529K5093K3296K0305J7268J5414J5080J5899J7669
50966A145467K0546K4579K9533L5095M0868M6261N0923N5078N8947O2055O3782
50955A633134O4377O4621O4445O2804N9182N4424M9627M4940M0004L4994L0548
50944B203100K6954K4025K1707K0208J9565J9403J9181J8410J6644J3550R151
50933B411898L945j242n663r154j2268j5839k0370k5860l2066l8596m4904n0623
$$ plain form
50921 2159258 2103329 2042189 1976218 1906591 1834888 1762359 1689895 1618472 1549220 1483157 1421269
50910 1421269 1364651 1313978 1268780 1227751 1189925 1155139 1123366 1094205 1067378 1043217 1022191
50899 1022191 1004152 988413 974331 961537 949796 939090 929731 922012 915709 910217 905174 900715
50887 900715 897077 894264 892197 891012 890972 892123 894201 896897 900200 904388 909700 916046 923119 930719 938878
50872 938878 947675 957123 967230 978050 989646 1002153 1015884 1031137 1047871 1065884 1085546 1108026
50860 1108026 1134375 1164526 1197662 1233544 1273039 1317216 1366490 1421054 1481757 1549911 1626218
50849 1626218 1710415 1802142 1901761 2010004 2127018 2252083 2384133 2522211 2665476 2812999
50839 2812999 2963628 3115760 3267089 3414722 3555660 3687081 3806211 3910326 3997421 4067041
$$ packed form
50921B159258n5929o1140o5971o9627p1703p2529p2464p1423o9252o6063o1888
50910A421269n6618n0673m5198m1029l7826l4786l1773k9161k6827k4161k1026
50899A022191j8039j5739j4082j2794j1741j0706r359p719o303n492n043m459
50887I00715l638k813k067j185m0J151K078K696L303M188N312O346P073P600Q159
50872I38878Q797R448J0107J0820J1596J2507J3731J5253J6734J8013J9662K2480
50860A108026K6349L0151L3136L5882L9495M4177M9274N4564O0703O8154P6307
50849A626218Q4197R1727R9619J08243J17014J25065J32050J38078J43265J47523
50839B812999J50629J52132J51329J47633J40938J31421J19130J04115Q7095O9620
$$ plain form
50829 4067041 4120368 4159375 4185923 4201668 4208686 4209987 4209234 4209877 4214459 4224547 4240984 4263978 4292923
50816 4292923 4326124 4360570 4391873 4414844 4424746 4418319 4393656 4349300 4283945 4197134 4089857
50805 4089857 3964225 3822708 3667912 3502858 3331206 3157230 2985515 2820233 2664288
50796 2664288 2519147 2385611 2264483 2156358 2061170 1978432 1907811 1849093 1801714 1764730
50786 1764730 1737194 1718095 1705895 1698535 1694003 1690725 1687514 1683665 1679194 1674459 1669245 1662531 1653430
50773 1653430 1642013 1628866 1614075 1597090 1577572 1555942 1532945 1508854 1483336 1456046 1427213
50762 1427213 1397544 1367698 1337996 1308667 1280089 1252634 1226456 1201689 1178745 1158230 1140569
50751 1140569 1125924 1114289 1105447 1098985 1094717 1093056 1094608 1099493 1107445 1118551 1133373 1152202 1174694
$$ packed form
50829D067041N3327L9007K6548J5745P018J301p53O43M582J0088J6437K2994K8945
50816D292923L3201L4446L1303K2971R902o427k4663m4356o5355q6811j07277
50805D089857j25632j41517j54796j65054j71652j73976j71715j65282j55945
50796B664288j45141j33536j21128j08125r5188q2738p0621n8718m7379l6984
50786A764730k7536j9099j2200p360m532l278l211l849m471m735n214o714r101
50773A653430j1417j3147j4791j6985j9518k1630k2997k4091k5518k7290k8833
50762A427213k9669k9846k9702k9329k8578k7455k6178k4767k2944k0515j7661
50751A140569j4645j1635q842o462m268j661J552M885P952J1106J4822J8829K2492
$$ plain form
50738 1174694 1200448 1229615 1262723 1300246 1342533 1389801 1441977 1498862 1560555 1627293 1698677
50727 1698677 1773655 1851644 1933014 2017771 2104196 2189664 2272681 2353300 2431434 2505526 2573164
50716 2573164 2632403 2682032 2720930 2747803 2761745 2763062 2753607 2736333 2714406 2690694 2668057 2649612
50704 2649612 2638065 2634627 2638854 2649539 2665378 2684796 2705751 2726066 2743611 2755815 2759421 2751279
50692 2751279 2729475 2693494 2643542 2580202 2504875 2420153 2329429 2236124 2143251 2053473 1969196
50681 1969196 1892362 1824163 1765175 1715873 1676948 1648906 1631507 1623924 1625472 1635860 1654608 1680670
50669 1680670 1712960 1750953 1794183 1841173 1889317 1935977 1979393 2018540 2052729 2081782 2106257
50658 2106257 2126912 2143969 2157290 2167231 2174855 2181197 2186746 2191776 2196638 2201317 2205151 2207684 2209727
$$ packed form
50738A174694K5754K9167L3108L7523M2287M7268N2176N6885O1693O6738P1384
50727A698677P4978P7989Q1370Q4757Q6425Q5468Q3017Q0619P8134P4092O7638
50716B573164N9239M9629L8898K6873J3942J317r455j7274k1927k3712k2637j8445
50704B649612j1547l438M227J0685J5839J9418K0955K0315J7545J2204L606q142
50692B751279k1804l5981m9952o3340p5327q4722r0724r3305r2873q9778q4277
50681A969196p6834o8199n8988m9302l8925k8042j7399p583J548J0388J8748K6062
50669A680670L2290L7993M3230M6990M8144M6660M3416L9147L4189K9053K4475
50658B106257K0655J7057J3321R941P624O342N549N030M862M679L834K533K043
$$ plain form
50645 2209727 2213036 2218899 2227513 2238768 2253042 2271038 2293371 2320689 2353639 2392068 2434469 2478853
50633 2478853 2524119 2570158 2616719 2662779 2707132 2749035 2787980 2823289 2854271 2880386 2900595
50622 2900595 2912400 2911897 2895230 2860489 2808878 2744574 2673555 2602020 2535167 2476560 2427997 2389744
50610 2389744 2361168 2341487 2330040 2325883 2327358 2332212 2338099 2342854 2344427 2340867 2330488 2311951 2284178
50597 2284178 2246423 2198669 2141952 2078143 2009383 1937766 1865364 1794023 1724817 1657921 1593472
50586 1593472 1532503 1476545 1426273 1381069 1340178 1303771 1272373 1245690 1222756 1203091 1186924
50575 1186924 1174170 1163932 1155508 1149390 1146698 1147840 1152112 1158428 1165944 1174066 1182413 1190965 1200009
50562 1200009 1209759 1220230 1231655 1244904 1261205 1281306 1304968 1331465 1360674 1393532 1431234
$$ packed form
50645B209727L309N863Q614J1255J4274J7996K2333K7318L2950L8429M2401M4384
50633B478853M5266M6039M6561M6060M4353M1903L8945L5309L0982K6115K0209
50622B900595J1805n03j6667l4741n1611o4304p1019p1535o6853n8607m8563l8253
50610B389744k8576j9681j1447m157J475M854N887M755J573l560j0379j8537k7773
50597B284178l7755m7754n6717o3809o8760p1617p2402p1341o9206o6896o4449
50586A593472o0969n5958n0272m5204m0891l6407l1398k6683k2934j9665j6167
50575A186924j2754j0238q424o118k692J142M272O316P516Q122Q347Q552R044
50562A200009R750J0471J1425J3249J6301K0101K3662K6497K9209L2858L7702
$$ plain form
50551 1431234 1474017 1520983 1571003 1623355 1677279 1731311 1783524 1832419 1877464 1918992 1957939
50540 1957939 1995578 2033138 2071532 2111546 2154134 2200269 2250579 2305430 2365306 2430758 2501949
50529 2501949 2578682 2660998 2749461 2844646 2946709 3055635 3171550 3294273 3422534 3553949
50519 3553949 3685779 3815558 3941065 4060032 4170034 4268464 4352526 4419454 4467011 4493809
50509 4493809 4499111 4482484 4443923 4384402 4306132 4212097 4105448 3989464 3867982 3745459 3626356
50498 3626356 3514528 3413314 3325931 3255348 3203568 3171154 3157442 3160996 3179768 3211021 3251204
50487 3251204 3295799 3339213 3375222 3398045 3403314 3388146 3350658 3289998 3207079 3105031 2988549
50476 2988549 2862619 2731666 2599426 2469018 2342863 2222561 2109005 2002644 1903693 1812271
$$ packed form
50551A431234M2783M6966N0020N2352N3924N4032N2213M8895M5045M1528L8947
50540A957939L7639L7560L8394M0014M2588M6135N0310N4851N9876O5452P1191
50529B501949P6733Q2316Q8463R5185J02063J08926J15915J22723J28261J31415
50519C553949J31830J29779J25507J18967J10002R8430Q4062O6928M7557K6798
50509D493809N302j6627l8561n9521p8270r4035j06649j15984j21482j22523j19103
50498C626356j11828j01214q7383p0583n1780l2414j3712L554J8772L1253M0183
50487C251204M4595M3414L6009K2823N269j5168l7488o0660q2919j02048j16482
50476B988549j25930j30953j32240j30408j26155j20302j13556j06361r8951r1422
$$ plain form
50466 1812271 1728423 1652026 1582649 1519632 1462384 1410521 1363678 1321342 1283088 1248895 1218974
50455 1218974 1193259 1171231 1152347 1136458 1123664 1113859 1106551 1101070 1096870 1093723 1091707 1090940 1091230
50442 1091230 1092146 1093506 1095633 1098946 1103429 1108724 1114562 1120827 1127363 1134169 1141837 1151398 1163542 1178232
50428 1178232 1195097 1213846 1234180 1255765 1278559 1302891 1328922 1356343 1384925 1415031 1447218
50417 1447218 1481624 1518287 1557861 1601467 1649861 1703236 1761666 1825093 1892800 1963692 2037269
50406 2037269 2113648 2192237 2271080 2348116 2422553 2494252 2562150 2624170 2678618 2724885 2762628
50395 2762628 2790917 2808441 2814010 2806539 2784989 2748866 2698804 2636572 2564670 2485926 2403151 2318914
50383 2318914 2235744 2156408 2083562 2018982 1963512 1917915 1883258 1860050 1847439 1843794 1847841 1858599
$$ packed form
50466A812271q3848p6397o9377o3017n7248n1863m6843m2336l8254l4193k9921
50455A218974k5715k2028j8884j5889j2794r805p308n481m200l147k016p67K90
50442A091230R16J360K127L313M483N295N838O265O536O806P668R561J2144J4690
50428A178232J6865J8749K0334K1585K2794K4332K6031K7421K8582L0106L2187
50417A447218L4406L6663L9574M3606M8394N3375N8430O3427O7707P0892P3577
50406B037269P6379P8589P8843P7036P4437P1699O7898O2020N4448M6267L7743
50395B762628K8289J7524N569p471k1550l6123n0062o2232p1902p8744q2775q4237
50383B318914q3170p9336p2846o4580n5470m5597l4657k3208j2611l645M047J0758
$$ plain form
50371 1858599 1874248 1891736 1907792 1919967 1926527 1925723 1915663 1894980 1863553 1822591 1774028 1719749
50359 1719749 1661342 1600455 1539018 1478793 1420797 1365415 1313003 1263991 1218412 1175765 1135645
50348 1135645 1098283 1064297 1034070 1007541 984380 964146 946352 930584 916597 904256 893429
50337 893429 883974 875725 868457 862037 856648 852685 850242 848827 847713 846506 845345 844649 844779 845752 847234
50322 847234 848971 851319 855035 860371 866629 872907 879118 885942 893895 902791 912086 921394 930588 939735
50308 939735 949042 958729 968868 979427 990451 1002022 1014088 1026543 1039446 1052867 1066490 1079751
50296 1079751 1092550 1105547 1119557 1134873 1151457 1169433 1188903 1209190 1228790 1246380 1261703
50285 1261703 1275233 1287154 1297129 1305166 1312270 1319861 1328784 1339249 1351414 1365028 1378043 1386309
$$ packed form
50371A858599J5649J7488J6056J2175O560q04j0060k0683l1427m0962m8563n4279
50359A719749n8407o0887o1437o0225n7996n5382n2412m9012m5579m2647m0120
50348A135645l7362l3986l0227k6529k3161k0234j7794j5768j3987j2341j0827
50337H93429r455q249p268o420n389l963k443j415j114j207j161o96J30R73J482
50322H47234J737K348L716N336O258O278O211O824P953Q896R295R308R194R147
50308I39735R307R687J0139J0559J1024J1571J2066J2455J2903J3421J3623J3261
50296A079751J2799J2997J4010J5316J6584J7976J9470K0287J9600J7590J5323
50285A261703J3530J1921R975Q037P104P591Q923J0465J2165J3614J3015Q266
$$ plain form
50273 1386309 1385750 1375221 1357077 1335098 1312329 1290650 1271293 1254896 1241186 1229205 1218029 1207168
50261 1207168 1196461 1185890 1175590 1165835 1156920 1149092 1142585 1137629 1134329 1132417 1131126 1129548 1127428
50248 1127428 1125561 1125099 1126456 1129172 1132771 1137221 1142324 1147289 1151403 1154899 1158643 1163109 1168025 1172838
50234 1172838 1177054 1180194 1181979 1182690 1182913 1182804 1181912 1179806 1176543 1172367 1167294 1161252 1154458 1147477 1140948
50219 1140948 1135279 1130424 1125993 1121881 1118763 1117689 1119158 1123022 1129342 1138813 1152117 1169399 1190829
50206 1190829 1217170 1249169 1286615 1328674 1375015 1425888 1480877 1538144 1595240 1650308 1702347
50195 1702347 1750764 1795166 1835546 1872335 1906227 1937957 1968027 1996315 2021725 2042153 2054750
50184 2054750 2056527 2045250 2020120 1981656 1931075 1870075 1801182 1727672 1652604 1578165 1506173
$$ packed form
50273A386309n59j0529j8144k1979k2769k1679j9357j6397j3710j1981j1176j0861
50261A207168j0707j0571j0300r755q915p828o507m956l300j912j291j578k120
50248A127428j867m62J357K716L599M450N103M965M114L496L744M466M916M813
50234A172838M216L140J785P11K23j09q92k106l263m176n073o042o794o981o529
50219A140948n669m855m431m112l118j074J469L864O320R471J3304J7282K1430
50206A190829K6341L1999L7446M2059M6341N0873N4989N7267N7096N5068N2039
50195A702347M8417M4402M0380L6789L3892L1730L0070K8288K5410K0428J2597
50184B054750J777j1277k5130l8464n0581o1000o8893p3510p5068p4439p1992
$$ plain form
50173 1506173 1438799 1378107 1324951 1278920 1239368 1205952 1178039 1154253 1133051 1113312 1094018
50162 1094018 1073868 1051911 1028450 1004827 982357 961868 944010 929269 917562 908407 901732 898004
50150 898004 897314 898818 901421 904571 907967 910995 912975 913692 913093 910787 906525 901009 895428 890134 884577
50135 884577 878780 874092 872007 872713 875289 878936 883434 888690 894402 900125 905340 909603 912981 916152
50121 916152 919753 923813 928207 933374 939950 947839 956326 965121 974604 984884 995362 1005679 1016553
50108 1016553 1029018 1043107 1057833 1072331 1086584 1101117 1116438 1132909 1150784 1170261 1191627
50097 1191627 1215383 1242073 1271997 1305305 1342365 1383869 1430634 1483616 1544156 1613799 1693473
50086 1693473 1782858 1880692 1985620 2096545 2212107 2330100 2447640 2562003 2671370 2775056
$$ packed form
50173A506173o7374o0692n3156m6031l9552l3416k7913k3786k1202j9739j9294
50162A094018k0150k1957k3461k3623k2470k0489j7858j4741j1707r155o675l728
50150H98004o90J504K603L150L396L028J980P17n99k306m262n516n581n294n557
50135H84577n797m688k085P06K576L647M498N256N712N723N215M263L378L171
50121I16152L601M060M394N167O576P889Q487Q795R483J0280J0478J0317J0874
50108A016553J2465J4089J4726J4498J4253J4533J5321J6471J7875J9477K1366
50097A191627K3756K6690K9924L3308L7060M1504M6765N2982O0540O9643P9674
50086A693473Q9385R7834J04928J10925J15562J17993J17540J14363J09367J03686
$$ plain form
50076 2775056 2873376 2967352 3058132 3146153 3230633 3309874 3381783 3443650 3491453 3520108 3525230
50065 3525230 3504935 3459921 3392183 3304132 3198915 3080785 2954416 2823636 2691021 2558655
50055 2558655 2429019 2304884 2188410 2080605 1981811 1892552 1813595 1745175 1686559 1636546
50045 1636546 1594127 1558343 1527765 1500821 1476910 1456861 1441885 1432091 1426126 1422149 1418987 1416458
50033 1416458 1414928 1414705 1415765 1417722 1419835 1421054 1420392 1417515 1412888 1407076 1399942 1390864 1379719 1367261
50019 1367261 1354315 1340992 1327009 1312432 1297576 1282287 1265940 1248248 1229600 1210402 1190551
50008 1190551 1169913 1149026 1128928 1110442 1093968 1079831 1068274 1059083 1051694 1045931 1042367 1041744
49996 1041744 1044271 1049728 1057939 1068664 1081050 1093617 1105010 1114705 1122926 1130127 1136615 1142535 1147964
$$ packed form
50076B775056R8320R3976R0780Q8021Q4480P9241P1909O1867M7803K8655N122
50065C525230k0295m5014o7738q8051j05217j18130j26369j30780j32615j32366
50055B558655j29636j24135j16474j07805r8794q9259p8957o8420n8616n0013
50045A636546m2419l5784l0578k6944k3911k0049j4976r794n965l977l162k529
50033A416458j530k23J060J957K113J219o62k877m627n812p134r078j1145j2458
50019A367261j2946j3323j3983j4577j4856j5289j6347j7692j8648j9198j9851
50008A190551k0638k0887k0098j8486j6474j4137j1557r191p389n763l564o23
49996A041744K527N457Q211J0725J2386J2567J1393R695Q221P201O488N920N429
$$ plain form
49983 1147964 1152875 1156971 1159650 1160486 1160007 1159776 1161279 1164790 1169738 1176159 1185251 1198263 1215441 1236534
49969 1236534 1262001 1293117 1330983 1375831 1427065 1483442 1543277 1605093 1668177 1732092 1795537
49958 1795537 1856290 1912544 1964010 2011597 2056447 2099543 2141735 2183567 2224979 2265021 2301283
49947 2301283 2329436 2344093 2341055 2318864 2278158 2220284 2147324 2063007 1972299 1879556 1787459
49936 1787459 1697695 1611826 1531010 1455428 1384546 1317821 1254932 1195724 1140309 1089096 1042435
49925 1042435 1000383 962928 930150 901883 877529 856527 838812 824440 812877 803085 794312 786550
49913 786550 780254 775833 773358 772506 772776 773877 775875 778884 782884 788028 794866 803860 814791 826978
49899 826978 840015 853914 868624 883756 898677 912455 923790 931603 935868 937470 937028 934241 928487
$$ packed form
49983A147964M911M096K679Q36m79k31J503L511M948O421R092J3012J7178K1093
49969A236534K5467L1116L7866M4848N1234N6377N9835O1816O3084O3915O3445
49958A795537O0753N6254N1466M7587M4850M3096M2192M1832M1412M0042L6262
49947B301283K8153J4657l038k2191m0706n7874p2960q4317r0708r2743r2097
49936A787459q9764q5869q0816p5582p0882o6725o2889n9208n5415n1213m6661
49925A042435m2052l7455l2778k8267k4354k1002j7715j4372j1563r792q773p762
49913G86550o296m421k475q52K70J101J998L009M000N144O838Q994J0931J2187
49899H26978J3037J3899J4710J5132J4921J3778J1335P813M265J602m42k787n754
$$ [...]
##END NTUPLES=NMR SPECTRUM
##END=
