
##TITLE=AC1386_BRAAS12198_7519771_v0Zb4zdImy
##JCAMPDX= 6.0         $$ Bruker NMR JCAMP-DX V2.0
##DATA TYPE= NMR SPECTRUM
##DATA CLASS= NTUPLES
##ORIGIN= BRUKER
##OWNER= Administrator
$$ 1.72 TOPSPIN		Version 2.1
$$ 2013-02-20 17:56:25.990 -0500  Administrator@X
$$ Compression mode = diff/dup
##.OBSERVE FREQUENCY= 400.02188249412
##.OBSERVE NUCLEUS= ^1H
##.ACQUISITION MODE= SIMULTANEOUS (DQD)
##.ACQUISITION SCHEME= undefined
##.AVERAGES= 8
##.DIGITISER RES= 22
##SPECTROMETER/DATA SYSTEM= spect
##.PULSE SEQUENCE= zg30
##.SOLVENT NAME= COFFEE_meoh
##.SHIFT REFERENCE= INTERNAL, COFFEE_meoh, 1, 14.98509
##AUDIT TRAIL= $$ (NUMBER, WHEN, WHO, WHERE, PROCESS, VERSION, WHAT)
$$ ##TITLE= Audit trail, TOPSPIN		Version 2.1
$$ ##JCAMPDX= 5.01
$$ ##ORIGIN= Bruker BioSpin GmbH
$$ ##OWNER= Administrator
$$ $$ E:\/data/COFFEE/nmr/AC1386_BRAAS12198_7519771_v0Zb4zdImy/10/pdata/1/auditp.txt
$$ ##AUDIT TRAIL=  $$ (NUMBER, WHEN, WHO, WHERE, PROCESS, VERSION, WHAT)
(   1,<2013-02-20 17:56:17.646 -0500>,<Administrator>,<X>,<go>,<TOPSPIN 2.1>,
      <created by zg
	started at 2013-02-20 17:55:11.521 -0500,
	POWCHK enabled, PULCHK disabled,
       configuration hash MD5:
       86 BA 57 50 F2 9D 5C 9B 26 00 A9 28 5F 66 2E 89
       data hash MD5: 64K
       1A 2F 26 1B 3F 5C 22 A2 17 DE B7 00 D3 1F 69 AD>)
(   2,<2013-02-20 17:56:20.709 -0500>,<Administrator>,<X>,<proc1d>,<TOPSPIN 2.1>,
      <Start of raw data processing
       efp LB = 0 FT_mod = 6 PKNL = 1 PHC0 = 0 PHC1 = 0 SI = 32K 
       data hash MD5: 32K
       2D CC E0 4C 12 A8 52 E3 06 93 93 B6 00 C9 93 7B>)
(   3,<2013-02-20 17:56:21.209 -0500>,<Administrator>,<X>,<proc1d>,<TOPSPIN 2.1>,
      <pk PHC0 = 71.54846 PHC1 = 0 
       data hash MD5: 32K
       E3 74 66 B9 65 93 EA E1 4E 24 B7 C4 D5 D5 7E 08>)
(   4,<2013-02-20 17:56:21.553 -0500>,<Administrator>,<X>,<proc1d>,<TOPSPIN 2.1>,
      <abs ABSG = 1 
       data hash MD5: 32K
       B9 A8 5D DC 28 03 28 A6 C4 A7 0D 2C D1 C8 F1 93>)
(   5,<2013-02-20 17:56:21.709 -0500>,<Administrator>,<X>,<proc1d>,<TOPSPIN 2.1>,
      <abs ABSG = 2 
       data hash MD5: 32K
       73 37 DD EC FB 6D D0 B1 A9 97 6A 03 A1 31 AA 7B>)
(   6,<2013-02-20 17:56:21.849 -0500>,<Administrator>,<X>,<proc1d>,<TOPSPIN 2.1>,
      <abs ABSG = 3 
       data hash MD5: 32K
       39 93 4B 45 46 83 28 81 D3 F7 CF 6F 4C 47 BD BC>)
(   7,<2013-02-20 17:56:21.990 -0500>,<Administrator>,<X>,<proc1d>,<TOPSPIN 2.1>,
      <abs ABSG = 4 
       data hash MD5: 32K
       F4 CB 5B 79 F4 7A A8 72 9B 24 CF 86 1E 15 86 95>)
(   8,<2013-02-20 17:56:22.178 -0500>,<Administrator>,<X>,<proc1d>,<TOPSPIN 2.1>,
      <abs ABSG = 5 
       data hash MD5: 32K
       03 E0 2A 1D 6B DB 43 54 41 C9 16 85 ED BA BC 03>)
$$ ##END=
$$ 
$$ $$ hash MD5
$$ $$ 8E FC 41 7E CA EE 06 D2 7F EA BE C1 5B 8E F8 6E
##$RELAX= 
##$RELAX= 
##$RELAX= 
##$RELAX= 
##$RELAX= 
##$RELAX= 
##$RELAX= 
$$ Bruker specific parameters
$$ --------------------------
##$DU= <E:\>
##$EXPNO= 10
##$NAME= <AC1386_BRAAS12198_7519771_v0Zb4zdImy>
$$ [...]
##$TP= (0..7)
150 150 150 150 150 150 150 150
##$TP07= 0
##$TPNAME0= <>
##$TPNAME1= <>
##$TPNAME2= <>
##$TPNAME3= <>
##$TPNAME4= <>
##$TPNAME5= <>
##$TPNAME6= <>
##$TPNAME7= <>
##$TPOAL= (0..7)
0.5 0.5 0.5 0.5 0.5 0.5 0.5 0.5
##$TPOFFS= (0..7)
0 0 0 0 0 0 0 0
##$TUNHIN= 0
##$TUNHOUT= 0
##$TUNXOUT= 0
##$USERA1= <user>
##$USERA2= <user>
##$USERA3= <user>
##$USERA4= <user>
##$USERA5= <user>
##$V9= 5
##$VALIST= <valist>
##$VCLIST= <CCCCCCCCCCCCCCC>
##$VD= 0
##$VDLIST= <DDDDDDDDDDDDDDD>
##$VPLIST= <PPPPPPPPPPPPPPP>
##$VTLIST= <TTTTTTTTTTTTTTT>
##$WBST= 1024
##$WBSW= 4
##$XGAIN= (0..3)
0 0 0 0
##$XL= 0
##$YL= 0
##$YMAX_a= 550336
##$YMIN_a= -546828
##$ZGOPTNS= <>
##$ZL1= 120
##$ZL2= 120
##$ZL3= 120
##$ZL4= 120
##$ABSF1= 14.98509
##$ABSF2= -5.573092
##$ABSG= 5
##$ABSL= 3
##$ALPHA= 0
##$AQORDER= 0
##$ASSFAC= 0
##$ASSFACI= 0
##$ASSFACX= 0
##$ASSWID= 0
##$AUNMP= <proc_prof1d_extract_pilot.lims>
##$AXLEFT= 0
##$AXNAME= <>
##$AXNUC= <1H>
##$AXRIGHT= 0
##$AXTYPE= 0
##$AXUNIT= <>
##$AZFE= 0.1
##$AZFW= 0.1
##$BCFW= 0
##$BC_mod= 0
##$BYTORDP= 0
##$COROFFS= 0
##$CY= 15
##$DATMOD= 1
##$DC= 0
##$DFILT= <>
##$DTYPP= 0
##$F1P= 0
##$F2P= 0
##$FCOR= 0.5
##$FTSIZE= 32768
##$FT_mod= 6
##$GAMMA= 0
##$GB= 0
##$INTBC= 1
##$INTSCL= 1
##$ISEN= 128
##$LB= 0
##$LEV0= 0
##$LPBIN= 0
##$MAXI= 10000
##$MC2= 0
##$MEAN= 0
##$ME_mod= 0
##$MI= 0
##$NCOEF= 0
##$NC_proc= -8
##$NLEV= 6
##$NOISF1= 0
##$NOISF2= 0
##$NSP= 0
##$NTH_PI= 0
##$NZP= 0
##$OFFSET= 14.98509
##$PC= 1
##$PHC0= 71.54846
##$PHC1= 0
##$PH_mod= 1
##$PKNL= yes
##$PPARMOD= 0
##$PPDIAG= 0
##$PPIPTYP= 0
##$PPMPNUM= 2147483647
##$PPRESOL= 1
##$PSCAL= 4
##$PSIGN= 0
##$PYNMP= <proc.py>
##$REVERSE= no
##$SF= 400.02
##$SI= 32768
##$SIGF1= 0
##$SIGF2= 0
##$SINO= 400
##$SIOLD= 32768
##$SPECTYP= <>
##$SREGLST= <1H.CDCl3>
##$SSB= 0
##$STSI= 32768
##$STSR= 0
##$SW_p= 8223.68421052631
##$SYMM= 0
##$S_DEV= 0
##$TDeff= 65536
##$TDoff= 0
##$TI= <>
##$TILT= no
##$TM1= 0
##$TM2= 0
##$TOPLEV= 0
##$USERP1= <user>
##$USERP2= <user>
##$USERP3= <user>
##$USERP4= <user>
##$USERP5= <user>
##$WDW= 1
##$XDIM= 32768
##$YMAX_p= 453849695
##$YMIN_p= -731524
##$CURPLOT= <Network HP LaserJet P1505>
##$CURPRIN= <$Network HP LaserJet P1505>
##$DFORMAT= <normdp>
##$LAYOUT= <+/1D_H.xwp>
##$LFORMAT= <normlp>
##$PFORMAT= <normpl>
##$SURQMSG= 1
$$ End of Bruker specific parameters
$$ ---------------------------------
##NTUPLES= NMR SPECTRUM
##VAR_NAME=  FREQUENCY,     SPECTRUM/REAL,   SPECTRUM/IMAG
##SYMBOL=    X,             R,               I
##VAR_TYPE=  INDEPENDENT,   DEPENDENT,       DEPENDENT
##VAR_FORM=  AFFN,          ASDF,            ASDF
##VAR_DIM=   32768,         32768,           32768
##UNITS=     HZ,            ARBITRARY UNITS, ARBITRARY UNITS
##FACTOR=    0.250966925370066, 1,           1
##FIRST=     8223.43324360094, -41806,       -95918
##LAST=      0,             -203259,         -25332
##MIN=       0,             -731524,         0
##MAX=       8223.43324360094, 453849695,    0
$$ Real data points
##PAGE= N=1
##DATA TABLE= (X++(R..R)), XYDATA
$$ [...]
$$ plain form
19550 -59201 218550 12841 -180621 -67194 19353 -161981 -25955 55593 55982 68868 69254 344982
19538 344982 66826 -21972 -195247 -186206 -232191 206786 79101 -339848 -153205 -35912 284571
19526 -281900 102846 299071 124606 -126598 -190702 144992 33520 25673 -200197 -184244
19516 -184244 28013 -63949 77496 50186 -96450 -131646 -129830 -127265 -207376 -57435 -23152 -307143
19504 -307143 -68762 -61383 14869 271548 -84350 -34361 -23703 45699 -254044 -317279 37292
19492 77880 -154852 143443 22188 -262384 -558353 -217047 -236302 -119417 -133326 79396
19481 233367 152722 -58578 -38278 220859 26050 -61359 -348436 -97073 -99149 -75692 -217496
19470 -217496 -132339 53278 -21575 -138214 -203084 -169692 26284 297719 25297 -49431 -47732
$$ packed form
19550e9201B18550A2841a80621f7194A9353a61981b5955E5593L89J2886L86K75728
19538C44982F6826b1972j73275R041m5985B06786G9101c39848a53205c5912B84571
19526b81900A02846J96225A24606a26598o4104A44992C3520p847b00197J5953
19516a84244B8013f3949G7496k7310i6450l5196J816K565q0111e7435b3152k83991
19504c07143f8762P379A4869K56679h4350c4361J0658D5699b54044o3235C7292
19492G7880a54852A43443B2188b62384k95969b17047j9255J16885j3909G9396
19481B33367q0645e8578K0300B20859B6050f1359k87077i7073k076K3457j41804
19470b17496Q5157E3278b1575j16639o4870L3392B6284K71435B5297d9431J699
$$ plain form
19459 -47732 -191750 -109570 159145 -268438 257148 -51199 -182041 52023 -66117 298267
19448 -284280 84322 -17045 101246 -55051 -58805 315500 -152540 110486 111595 -71450 -27767
19436 -256624 -200461 156793 -47200 -230041 -46700 -244787 -95562 105632 -4515 -45809 -199705
19425 -199705 226108 197639 159133 -137470 -113468 -61578 14886 -166282 -238988 -37708 -158200
19414 -158200 7592 -226247 -277391 17463 129129 190924 -210545 -148975 -170731 81404 127929
19403 127929 361798 -77898 -21977 -117003 -139614 -254079 -1258 -269968 173646 80039 -110978
19391 -55210 -262667 246804 -95981 -105319 -268169 44893 87565 306864 -105347 -433608 -113589
19379 -382772 152199 16017 65717 -145925 -294755 16894 52896 128806 21652 -541307 -83003
$$ packed form
19459d7732j44018Q2180A59145b68438B57148e1199j30842E2023f6117B98267
19448b84280H4322a7045A01246e5051l754C15500a52540A10486J109g1450b7767
19436b56624N6163A56793d7200j82841d6700j98087i5562A05632d515m1294j53896
19425a99705B26108k8469l8506a37470K4002N1890A4886a66282p2706c7708j20492
19414a58200G592b26247n1144A7463J11666O1795b10545O1570k1756H1404M6525
19403A27929K33869g7898b1977r5026k2611j14465a258k68710A73646H0039a10978
19391e5210k07457B46804i5981r338j62850D4893M2672K19299a05347l28261a13589
19379c82772A52199A6017M9700a45925j48830A6894L6002P5910B1652e41307h3003
$$ plain form
19367 222571 -133330 20185 -440319 154415 143459 302695 -108871 -198457 -63071 -26285
19356 32002 -330560 -7253 -5852 -217636 54464 5377 79806 284827 -108310 -356264 -82146
19344 -111531 -182133 60138 -132784 71710 -301220 -69155 262120 208160 -225072 -196273 -155320
19333 -155320 111226 -110338 42558 -5656 -102463 -172921 -236110 -89330 -55275 128990 -341613
19321 -359945 1201 -298811 -144995 -124511 218761 36666 -96029 -90853 76322 -35237 -85513
19310 -85513 -197731 -319048 -27266 -73793 -107436 -120622 -6069 -30694 -256525 -67334 -69806
19299 -69806 129423 30309 2962 -179198 -134013 147622 -100162 -185487 -34181 79002 144453
19288 144453 -73413 -80551 -200697 341877 320713 -17833 5110 -253809 178281 36414 -180967
$$ packed form
19367B22571a33330B0185d40319A54415j0956J59236a08871q9586f3071b6285
19356C2002c30560g253J401k11784E4464E377P4429K05021a08310k47954h2146
19344a11531p0602F0138a32784G1710c01220f9155B62120n3960b25072K8799M0953
19333a55320A11226a10338D2558e656r6807p0458o3189h9330L4055A28990c41613
19321c59945A201b98811a44995K0484B18761C6666i6029N176G6322c5237n0276
19310h5513j12218j21317b7266m6527l3643j3186f069k4625k25831f7334k472
19299f9806A29423C0309B962a79198M5185A47622a00162q5325c4181G9002O5451
19288A44453g3413p138j20146C41877k1164a7833E110b53809A78281C6414a80967
$$ plain form
19276 -88785 -1268 -31825 248331 -150951 42464 -81642 -21815 3574 -67539 -196987 -136296
19265 -136296 -207760 -3710 -76804 -56971 -84807 -50790 65314 185730 272259 -231733 35347
19253 208837 -210309 -55148 -159531 -294292 -98100 -56079 47191 -246722 -391904 -90343
19242 -187605 49931 515020 -391561 -102882 287196 -191144 -127247 129513 29084 -107003
19231 135485 -259924 -334115 -291370 -28974 104324 -218869 140280 222773 -204205 65023
19220 74027 113527 -190442 81355 -156549 -16720 -70874 -252337 68501 -14623 316084 48419
19208 148762 95610 187311 -347392 -12401 39105 -278641 70444 9203 -4838 -69464 -153313
19197 -153313 69165 -141440 112958 -17439 -404015 -325051 117058 -65445 114137 23756
$$ packed form
19276h8785a268l0557B48331a50951D2464h1642b1815C574f7539j29448O0691
19265a36296p1464c710p3094J9833k7836L4017F5314J20416Q6529b31733C5347
19253B08837b10309e5148j04383j34761i8100M2021D7191b46722j45182i0343
19242a87605D9931M65089c91561a02882B87196a91144O3897A29513B9084a07003
19231A35485b59924p4191M2745b8974A04324b18869A40280Q2493b04205F5023
19220G4027L9500a90442H1355a56549a6720n4154j81463F8501a4623C16084D8419
19208A48762n3152R1701c47392a2401C9105b78641G0444I203d838o4626q3849
19197a53313F9165a41440A12958a7439l86576P8964A17058f5445A14137B3756
$$ plain form
19186 72746 121375 -139389 -505519 178141 21521 119728 257331 43093 -285748 -78736 -143769
19175 -143769 -135635 -195957 -184966 -178725 23874 -111778 -37265 -4506 -54723 -137094 -53819 -323803
19163 -323803 -381898 462685 130616 -75891 -480714 109378 -236282 -240921 309288 -107947
19152 50779 -70032 -77004 99036 38583 -70277 -177189 -224050 102506 79983 8431 -147081
19140 -164377 97634 106405 67261 51224 -133189 -20320 153732 -19969 327151 -71133 -198144
19129 -198144 -184236 -275951 -87862 -177603 19903 60050 -172464 -110841 81261 20337 -94025
19117 86162 28785 -175530 -321305 -74490 -39279 -187186 -237127 -81246 105713 255415 96302
19105 -163564 -28251 107895 -54886 -173351 -93127 -73084 29991 -441815 -206062 107430
$$ packed form
19186G2746M8629a39389l66130A78141B1521R8207J37603D3093b85748g8736o5033
19175a43769Q134o0322J0991O241B3874a11778c7265d506n0217q2371e3819k69984
19163c23803n8095D62685A30616g5891m04823A09378b36282m639C09288a07947
19152E0779g0032o972I9036C8583g0277j06912m6861A02506k2523H431a47081
19140a64377I7634Q771l9144j6037a33189b0320A53732a9969C27151g1133j27011
19129a98144J3908r1715h7862q9741A9903M0147a72464O1623H1261B0337i4025
19117H6162B8785a75530j45775g4490L5211j47907m9941h1246A05713J49702I6302
19105a63564b8251A07895e4886j18465Q0224K0043B9991d41815b06062A07430
$$ plain form
19094 168380 -185273 -165675 60110 -100271 8591 57894 -314897 -268424 -350166 -422381 -78986
19082 -190222 -111291 -177160 -275197 -105229 -150356 -332122 -188205 -288096 -171623 16871 124879
19071 124879 52279 48813 31112 61865 -455742 -323404 -275419 -74921 252470 -731524 -60880
19059 81532 17858 -119217 188608 62507 96236 -152633 -232468 140936 -193265 107891
19048 -36697 38079 117382 -303216 -60066 2615 -92210 -350969 196194 52816 -150855 -34811
19036 -39170 10038 32074 96645 -107838 50688 6858 -96127 170821 -90691 41425 190770
19025 190770 3836 -469747 -3164 93213 440034 -281039 197938 -31658 -31430 -209520 127908
19013 251467 24835 -7480 -251591 152739 -184758 -38075 212670 -162306 -144415 147914
$$ packed form
19094A68380a85273J9598F0110a00271H591M9303c14897M6473q1742p2215g8986
19082a90222P8931o5869r8037a05229m5127j81766J43917r9891J16473A6871J08008
19071A24879E2279l466j7701L0753d55742J32338M7985g4921B52470g31524f0880
19059H1532A7858a19217A88608F2507L3729a52633p9835A40936a93265A07891
19048c6697C8079P9303c03216f0066B615i2210k58759A96194E2816a50855c4811
19036c9170A0038K2036O4571a07838E0688F858i6127A70821i0691D1425J49345
19025A90770C836d69747c164I3213L46821b81039A97938c1658K28j78090A27908
19013B51467B4835g480k44111A52739a84758c8075B12670a62306J7891A47914
$$ plain form
19002 179902 -43450 2219 58713 -401680 -29090 -93707 -16969 306790 -43069 73452 -123343
18990 166672 56977 -50447 -110504 27369 -230302 195740 147014 -570558 169395 -78035 -113366
18979 -113366 -208956 95589 -127647 218222 -54886 30853 -154618 239605 -33913 298518
18968 -35018 146670 -242914 -23398 -64628 -305975 -239730 14583 -202401 -190122 -317012 -328449
18957 -328449 512485 124981 177531 68140 216730 -221454 154702 -171628 -76588 94117
18946 183607 -145077 94424 194775 253588 -252744 182673 19567 183080 -168928 -52886
18935 -10625 -108097 -57447 -7287 28388 363018 294961 -404458 50449 -89100 -162356 -80269
18923 -3445 -29090 -36350 -97976 -346176 -165437 -278674 102531 -140856 45468 -68643 -241569
$$ packed form
19002A79902d3450B219N6494d01680b9090o4617a6969C06790d3069G3452a23343
18990A66672E6977e0447o0057B7369b30302A95740m8726e70558A69395g8035l5331
18979a13366r5590I5589a27647B18222e4886C0853a54618B39605c3913B98518
18968c5018A46670b42914b3398m1230k41347O6245A4583b02401J2279j26890j1437
18957c28449E12485A24981N2550F8140J48590b21454A54702a71628g6588I4117
18946A83607a45077I4424J00351N8813b52744A82673A9567J63513a68928e2886
18935a0625r7472N0650g287B8388L34630o8057d04458E0449h9100p3256h0269
18923c445k5645p260o1626k48200a65437j13237A02531a40856D5468f8643j72926
$$ plain form
18912 -241569 -120639 -2502 237549 -45785 44780 -191256 -64306 -239927 -42303 -262029 -57330
18900 -120958 -85698 132537 119908 -66337 -46071 -309112 2296 -151236 161552 -68292 -302898
18889 -302898 -78456 -59990 -186878 -98219 -53555 -103800 -3448 26052 -225764 -164234 -139794
18878 -139794 -164034 -179455 -230667 14281 -92991 -267930 -62424 262958 -255333 -26109 160941
18866 -63170 -38636 -229322 -225382 -77197 279460 -51564 -230881 -37430 -73365 -61579 -174660
18855 -174660 -72055 256535 -322826 -237939 -142314 251958 48399 -87223 224652 99326 321688
18844 321688 -207136 52706 -48951 -52512 199367 64413 -44681 71996 48937 368571 -250107
18832 -215020 256564 -174448 85061 84641 -147309 8465 144802 -177019 -257258 21785 157938
$$ packed form
18912b41569a20639b502B37549d5785D4780a91256f4306j75621d2303k19726e7330
18900a20958L5260A32537j2629f6337K0266k63041B296a51236A61552f8292k34606
18889c02898g8456J8466j26888Q8659M4664n0245c448B6052b25764O1530K4440
18878a39794k4240j5421n1212A4281i2991j74939f2424B62958b55333b6109A60941
18866f3170K4534j90686L940g7197B79460e1564j79317c7430l5935J1786j13081
18855a74660g2055B56535c22826Q4887R5625B51958D8399h7223B24652I9326K22362
18844C21688b07136E2706d8951l561A99367F4413d4681G1996k3059L19634b50107
18832b15020B56564a74448H5061m20a47309H465J36337a77019q0239B1785J36153
$$ plain form
18821 157938 149653 -22866 -73063 161418 23762 -50548 -227914 -134169 55284 -130516 -33791
18809 111081 -100552 201677 357750 194733 200371 32487 -210314 85761 -16941 -486930
18799 -486930 -120911 -189683 -325143 -173881 146720 -74555 -67667 -4131 -103719 -106536 -413248
18788 -413248 -4464 -179863 447505 62121 273886 118013 -328416 -46174 -115696 54616 -120286
18776 -48218 31191 41548 -106940 308670 -694835 -199409 -312985 205945 84465 232190
18766 232190 -17118 -16356 -168088 11517 -451635 -23300 107247 -202526 126058 200193 -96519
18754 -324739 18769 -450858 40242 -34391 -18083 -122798 125424 -21305 -277633 -34582 -171161
18743 -171161 -42172 -142060 -180604 2812 -210481 -179972 8281 199158 -42702 -52214 20867 21055
$$ packed form
18821A57938q285b2866n0197A61418B3762e0548j77366R3745E5284a30516c3791
18809A11081a00552B01677J56073j63017N638C2487b10314H5761a6941m69989
18799d86930a20911o8772j35460J51262A46720g4555O888d131r9588k817l06712
18788d13248d464j75399D47505F2121K11765A18013c28416d6174o9522E4616a20286
18776d8218C1191J0357a06940C08670f94835a99409j13576B05945H4465J47725
18766B32190a7118P62j51732A1517d51635b3300A07247b02526A26058P4135i6519
18754c24739A8769d50858D0242c4391J6308j04715A25424b1305k56328c4582j36579
18743a71161d2172r9888l8544B812b10481L0509H281J90877d2702r512B0867J88
$$ plain form
18731 21055 1530 110477 -249695 61820 -151905 -255809 -70964 -223343 -45630 70224 -102964
18719 35184 -71999 -108368 -128637 10010 -156271 141832 153408 -87527 -37776 -54216 73094
18707 -51487 -190774 -9239 51007 -16465 -130428 150777 -6757 -221221 -259069 107832 -61365
18695 -137498 -192624 -121484 61518 -221500 189146 34568 -127191 -197964 60426 -26446 -83224
18684 -83224 -227611 -221888 247003 -341381 45180 -23469 32773 -292527 -565049 -59868 -165454
18673 -165454 -186263 150096 124730 -211847 -132086 -88887 -7282 383507 -26645 60655 83547
18662 83547 149820 220806 163206 -293408 -201419 11942 372930 333812 24221 129950 9544
18650 -37970 240061 72644 -481585 -6349 -143641 21441 -24292 11004 -183545 10315 -352025
$$ packed form
18731B1055A530J08947b49695F1820a51905j03904g0964j52379d5630G0224a02964
18719C5184g1999l6369k0269A0010a56271A41832J1576h7527c7776j6440G3094
18707e1487j39287i239E1007a6465j13963A50777f757k14464l7848A07832f1365
18695a37498n5126P1140F1518b21500A89146C4568a27191p0773F0426b6446n6778
18684h3224j44387N723B47003c41381D5180b3469C2773b92527k72522e9868j05586
18673a65454k0809A50096k5366b11847P9761M3199g282C83507b6645F0655K2892
18662H3547O6273P0986n7600b93408R1989A1942L60988l9118B4221J05729I544
18650c7970B40061G2644d81585f349j37292B1441b4292A1004a83545A0315c52025
$$ plain form
18638 160418 -265022 -330675 -151410 -97172 -18263 96201 -58492 232712 45211 -30541 -278727
18627 -278727 204133 -307116 81360 13739 -382262 -26019 -29631 -125138 -26964 -42258 -195787
18616 -195787 35912 73730 -205723 45260 54745 -6685 44993 -20101 -154357 -131351 -379644
18605 -379644 -117805 -174491 111699 102275 -421379 -133340 -82599 254239 55468 -238501
18594 106332 -43553 237498 37752 46389 169492 265060 -119525 -104434 -50632 139972 -458765
18582 -109060 -309182 -185392 43018 -272690 62841 123006 -101647 52109 121682 -60126 346259
18570 4777 46046 -17659 79278 -104547 -36273 -275608 4729 -236633 -355297 -356728 -32975
18558 -353985 -479509 -171991 283460 104414 165427 11939 -18721 -262191 -214774 -56755
$$ packed form
18638A60418b65022o5653a51410N4238a8263I6201e8492B32712D5211c0541k48186
18627b78727B04133c07116H1360A3739c82262b6019l612r5507b6964j5294j53529
18616a95787C5912L7818b05723D5260R485f685D4993b0101j34256K3006k48293
18605c79644a17805n6686A11699r424d21379a33340N0741B54239E5468b38501
18594A06332d3553B37498C7752Q637J23103R5568a19525J5091e0632A39972d58765
18582a09060k00122J23790D3018b72690F2841O0165a01647E2109O9573f0126C46259
18570D777M1269a7659G9278a04547c6273k39335D729b36633j18664j431c2975
18558c53985j25524a71991B83460A04414O1013A1939a8721k43470M7417e6755
$$ plain form
18547 -56292 -48203 145702 5828 -265240 181059 162409 172745 93952 31769 89125 -35658
18535 39079 3189 -226825 -119323 -61359 -451575 -412335 -18161 -308731 -298732 -54970 -196002
18524 -196002 -223427 65470 -180694 -363332 326340 77298 -212396 -63658 -76134 -237003
18514 -237003 -287772 -105943 -122714 -125708 47541 -13417 18431 -274679 165363 -41692 -64751
18503 -64751 -194318 135683 243981 -112921 -13616 -115825 59418 -240266 -143171 189936
18492 -48851 -194587 -143818 -14701 -80530 -171975 -173707 56001 -145474 103845 27246 -112906
18480 65339 151861 -111409 -195955 93437 -188430 92009 -90604 -403018 -51550 11803 -275805
18468 179122 -62771 58649 65648 -48082 40310 28760 -129525 -63651 -87566 -171670 -91640
$$ packed form
18547e6292Q089A45702E828b65240A81059j8650J0336p8793C1769N7356c5658
18535C9079C189b26825J07502N7964l90216L9240a8161k90570R999e4970j41032
18524a96002k7425F5470a80694j82638C26340G7298b12396f3658j2476j60869
18514b37003n0769a05943j6771k994D7541a3417A8431b74679A65363d1692k3059
18503f4751j29567A35683J08298a12921a3616j02209E9418b40266R7095A89936
18492d8851j45736N0769a4701o5829r1445j732E6001a45474A03845B7246a12906
18480F5339Q6522a11409q4546I3437a88430I2009i0604l12414e1550A1803b75805
18468A79122f2771E8649O999d8082D0310j1550a29525f3651k3915q4104Q0030
$$ plain form
18457 -91640 63556 -150079 -433575 61900 37980 -4573 -426573 -67213 -44883 -140779 -104820
18446 -104820 -18215 -36372 239527 -128300 -193900 -117378 -237984 -43859 -132521 16989 -382676
18434 -119937 -46352 35885 59689 -236790 -195172 46548 -407402 -87258 -103629 -446431 -293986
18423 -293986 -57926 -276943 58961 178238 7854 81413 -190276 -179153 -206023 -10586 30028
18411 46866 182400 -262776 143737 72190 37909 520658 191966 -123455 -35471 -64946
18401 -64946 -209149 -323867 11702 43325 21231 -187256 185703 19851 171356 116916 -47260
18389 163630 -53562 -206061 -159806 -167919 4585 142207 224699 -54419 272379 11430 -384603
18377 -265592 13096 58080 -143825 495983 288416 91659 23934 -21610 -87080 65882 -15509
$$ packed form
18457i1640F3556a50079k83496F1900k3920d573m22000f7213K2330r5896L5959
18446a04820a8215j8157B39527a28300o5600P6522j20606d3859q8662A6989c82676
18434a19937d6352C5885K3804b36790M1618D6548d07402h7258j6371l42802J52445
18423b93986e7926k19017E8961J19277G854P3559a90276J1123k6870a0586C0028
18411D6866J35534b62776A43737p1547l4281M82749A91966a23455c5471k9475
18401f4946j44203j14718A1702L1623B1231a87256A85703A9851J51505n4440d7260
18389A63630e3562j52499M6255q113D585J37622Q2492e4419B72379A1430c84603
18377b65592A3096M4984a43825D95983k07567I1659B3934b1610o5470F5882a5509
$$ plain form
18365 283210 -6058 6842 -96876 82259 148386 -329168 -32017 -165063 263592 -1010 -37641
18354 -37641 -49302 -20182 -31425 37161 108941 -170411 19049 -135897 -206032 -28730 537189
18342 -236467 40724 -289139 -124754 -77664 61480 -166758 -38704 -197674 -238824 -67358 -150512
18331 -150512 75871 39020 117366 -369563 -129051 -227998 65033 78007 84181 246902 -98627
18319 92166 -247623 -60854 -330735 40987 200673 52752 -216740 -239081 -296108 -372219 -133702
18307 -165476 42289 21077 -212776 234509 68858 -134066 -70108 -70962 89393 379137 -307486
18295 -11864 31225 -132918 -258267 -72938 -73775 111159 -26394 61278 41670 56041 30557
18284 30557 97460 223947 -61384 -129809 196281 97834 -102422 84366 -206830 -171506 112777
$$ packed form
18365B83210f058F842i6876H2259O6127c29168c2017j33046B63592a010l6631
18354c7641j1661b0182j1243C7161P1780a70411A9049a35897p0135b8730E37189
18342b36467D0724b89139a24754M7090F1480a66758c8704j58970m1150f7358q3154
18331a50512G5871l6851P8346c69563a29051r8947F5033J2974O174J62721i8627
18319I2166b47623f0854k69881D0987J59686E2752b16740k2341n7027p6111a33702
18307a65476D2289B1077b12776B34509F8858a34066O3958q54H9393K89744c07486
18295a1864C1225a32918j25349g2938q37A11159b6394F1278j9608J4371k5484
18284C0557O6903J26487f1384o8425A96281I7834a02422H4366b06830L5324A12777
$$ plain form
18272 -100499 -97227 -119117 248468 -316816 -90866 -250482 -48731 -252516 -68381 -150051 240767
18260 216083 -828 140793 -498671 206685 14952 -58705 13844 -29201 -216794 -16702 161444
18248 -388348 -394205 -162617 -323822 -140854 121164 -113958 -162524 -176257 62455 89166 -134689
18236 112068 -200536 -106367 -179662 -147707 -100115 39642 239885 15179 296140 11471 -51840
18224 -172079 17925 -127014 -154610 -11173 -34827 -330141 -212167 76096 -26562 -258459 -177879
18213 -177879 67265 -265636 -107547 51148 -127270 95745 238602 -6253 121457 220598 -153193
18201 132477 116461 -146001 -64775 -352401 -203567 156822 -140440 46420 159987 -140837
18190 -53851 -154284 9835 -221952 -136476 227881 108508 302761 -92394 -164010 -10374 -199647
$$ packed form
18272a00499L272k1890B48468c16816i0866j59616d8731k03785f8381q1670B40767
18260B16083h28A40793d98671B06685A4952e8705A3844b9201j87593a6702A61444
18248c88348n857a62617j61205a40854A21164a13958m8566j3733F2455K6711a34689
18236A12068b00536R4169p3295L1955M7592C9642K00243A5179K80961A1471e1840
18224a72079A7925a27014k7596a1173k3654k95314J17974G6096b6562k31897Q0580
18213a77879F7265b65636a07547E1148a27270I5745J42857f253A21457R9141a53193
18201A32477j6016a46001f4775k87626J48834A56822a40440D6420J13567a40837
18190e3851j00433I835b21952Q5476B27881A08508J94253i2394p1616a0374j89273
$$ plain form
18179 -199647 -71682 56520 18167 -173834 61809 -13569 -10163 -103519 -32494 326187 -17256
18167 -6285 -286273 148071 -10074 105932 -142705 -179587 -25593 -109934 -73421 194773 260203
18156 260203 -214175 61474 -146617 -71410 -115147 2736 -78237 184074 -211759 -9556 46112
18144 -92997 -67169 -33436 11686 -319442 -55814 118296 -321269 -46325 11681 1367 -179158
18132 -29004 -278958 -490643 71821 -30000 -265734 -288074 -164247 -95428 18035 245209 -257457
18120 -94446 -35478 -47687 -101202 54196 -184453 26347 176166 228159 -217776 -8085 -96295
18109 -96295 -242971 53359 285836 93765 22 -15098 -52742 123656 37033 -48609 155785
18097 -26200 -194450 -4574 -227597 1291 -13898 -170434 -313160 4095 -164257 -107045 -159850
$$ packed form
18179a99647g1682E6520A8167a73834F1809a3569L406r3356c2494C26187a7256
18167f285k79988A48071a0074A05932a42705l6882b5593q4341L6513A94773O5430
18156B60203b14175F1474a46617g1410m3737B736g8237A84074b11759i556D6112
18144i2997K5828c3436A1686c19442e5814A18296c21269d6325A1681A367a79158
18132b9004k49954k11685G1821c0000k35734k2340J23827O8819A8035K27174b57457
18120i4446c5478j2209n3515E4196a84453B6347J49819N1993b17776h085q8210
18109i6295j46676E3359K32477I3765B2a5098l7644A23656C7033d8609A55785
18097b6200j68250d574k23023A291a3898j56536j42726D095a64257N7212n2805
$$ plain form
18086 -159850 -23212 -358770 -336198 -193792 91159 -184466 -154353 -97456 -22913 81328 -99597
18074 -155425 116001 -70124 71553 -56689 129988 -164822 -36354 -206100 -360339 -45052
18063 -59546 80545 25197 -450483 -122564 -95015 -120286 -163156 -48958 52862 -142142 177976
18051 -343745 64895 -106960 76031 17970 197283 -138045 409376 -116156 19043 -483759
18040 -60141 -186824 -180147 262912 -38878 -133049 -41533 1434 111334 48138 -104809 83985
18028 -353929 -236260 203339 2883 -85617 174379 -483528 -141694 60720 69076 55838 -108781
18016 -183054 -209629 53191 126088 -182760 -62223 119438 140270 -195747 -195008 -110643 45952
18004 -51490 -24133 39532 -188708 168536 -114586 -429000 -53688 -57592 -236466 -117500 -204474
$$ packed form
18086a59850b3212l35558K2572J42406I1159a84466L0113N6897b2913H1328i9597
18074a55425A16001g0124G1553e6689A29988a64822c6354j69746j54239d5052
18063e9546H0545B5197d50483a22564K7549k5271m2870d8958E2862a42142A77976
18051c43745F4895a06960G6031A7970J79313a38045D09376a16156A9043d83759
18040f0141j26683O677B62912c8878r4171d1533A434J09900D8138a04809H3985
18028c53929J17669B03339B883h5617A74379d83528a41694F0720Q356j3238a08781
18016a83054k6575E3191P2897a82760f2223A19438K0832a95747P39Q4365D5952
18004e1490b4133C9532a88708A68536a14586l14414e3688l904j78874a17500q6974
$$ plain form
17993 -204474 -97301 69756 52191 -109047 -74442 -138437 98060 168739 -383627 -104551 251454
17981 83498 -211124 -374893 -52493 90923 4459 -177127 106464 -127506 -100707 -52223 -186986
17970 -186986 -60179 131281 -125535 199734 -132249 -13564 -16082 223740 13394 3504 -6946
17958 140782 201207 147748 -202724 -128759 51186 400592 24361 -236710 31001 -296848 -355283
17947 -355283 171719 -153495 -138399 20269 -4629 80795 156743 -90059 -75606 -108083 266618
17935 -38016 -172361 58851 60855 26808 -118178 -170912 1877 185921 161652 75341 -89931
17923 -138463 187343 52481 -488196 -115105 420109 -148994 -155068 -219641 -83320 -129802 -76207
17912 -76207 99753 81515 -45807 -421628 -86796 -67983 -461482 221037 -65928 92329 -183943
$$ packed form
17993b04474i7301F9756j7565a09047L4605o3995I8060P0679c83627a04551B51454
17981H3498b11124j63769e2493I0923D459a77127A06464a27506K6799M8484j34763
17970a86986f0179A31281a25535A99734a32249a3564k518B23740A3394C504f946
17958A40782O0425n3459b02724P3965E1186L49406B4361b36710C1001b96848n8435
17947c55283A71719a53495J5096B0269d629H0795P5948i0059J4453l2477B66618
17935c8016j34345E8851K004B6808a18178n2734A877J84044k4269G5341h9931
17923a38463A87343E2481d88196a15105D20109a48994o074o4573h3320m6482N3595
17912g6207I9753j8238d5807l75821h6796J8813l93499B21037f5928I2329a83943
$$ plain form
17900 260830 72224 208043 -223695 144263 -11341 -113887 8432 -139605 -95695 -27910 -172945
17889 -172945 214186 -47159 -244689 325913 -60784 -177365 -218567 8980 -118811 27358 -48020
17877 27894 314171 -84093 -307233 -22728 -108699 -54914 49503 66244 167138 142509 -43067
17865 194280 -390750 302066 -148781 113121 165203 273187 -193216 32622 -256150 -81260
17854 71769 230928 -108353 -59057 -251544 -122635 -126490 -172048 -117969 25519 -122984 161659
17842 28014 132103 115148 19702 -171836 -276892 -331627 -71055 297844 -92718 83942 284700
17831 284700 -174045 17649 305840 -108776 -438511 -155867 -167750 152169 -139864 110415
17820 59051 141896 -47750 -103380 -187445 195912 -60357 170439 9263 -252133 -198316 -6232
$$ packed form
17900B60830G2224J35819b23695A44263a1341j02546H432a39605M3910b7910j45035
17889a72945B14186d7159j97530C25913f0784j16581m1202H980a18811B7358d8020
17877B7894K86277h4093k23140b2728q5971N3785D9503J6741J00894k4629d3067
17865A94280c90750C02066a48781A13121N2082J07984a93216C2622b56150h1260
17854G1769J59159a08353M9296j92487a22635l855m5558N4079B5519a22984A61659
17842B8014J04089j6955A9702a71836j05056n4735g1055B97844i2718H3942K00758
17831B84700a74045A7649K88191a08776l29735a55867j1883A52169a39864A10415
17820E9051Q2845d7750n5630q4065A95912f0357A70439I263b52133N3817f232
$$ plain form
17808 91312 141217 181997 26505 -176300 -4535 -224989 46123 -174397 10982 149489 142904
17797 142904 -40632 38002 42395 -20923 389707 -175459 190172 359382 51432 79671 -349682
17785 261183 194297 -153910 -141625 107081 -469247 45920 36581 291334 82067 70621 92795
17774 92795 -153022 31413 -199120 -120809 91483 435316 -144678 -113329 267936 -97614 -82564
17763 -82564 -50659 -178645 -24866 34864 242587 37712 23570 41377 28816 119572 42176
17751 -42983 -200165 59092 43233 248350 -348892 141693 286988 -10593 231491 133807
17741 133807 -467556 289847 -26839 -24135 163026 427394 90719 -186049 -127485 379373
17730 -83247 173803 -321207 26909 177904 217357 55632 -11430 -141108 92163 -223846 51850
$$ packed form
17808I1312M9905M0780B6505a76300d535k20454D6123a74397A0982J38507o585
17797A42904d0632C8002M393b0923C89707a75459A90172J69210E1432K8239c49682
17785B61183o6886a53910J2285A07081d69247D5920r339K54753H2067j1446K2174
17774I2795a53022C1413a99120P8311I1483L43833a44678L1349B67936i7614J5050
17763h2564L1905j27986b4866C4864K07723C7712j4142J7807j2561R0756D2176
17751d2983j57182E9092j5859K05117c48892A41693J45295a0593B31491r7684
17741A33807d67556B89847b6839K704A63026K64368I0719a86049N8564C79373
17730h3247A73803c21207B6909J50995L9453E5632a1430j29678I2163b23846E1850
$$ plain form
17718 50950 -295109 24409 267847 385231 133696 16914 -113887 -73542 5282 152373 55195
17706 77521 101866 -30586 123090 15861 -138167 -231573 -72199 2244 -149493 315853 23327
17694 30519 -79835 -25766 237317 -86725 -6323 189732 -191955 265329 203802 115239 -37759
17682 -241888 -293707 -183984 127612 175187 265693 41826 117361 44889 240865 -74591 93789
17670 82675 131482 228702 21129 179957 4950 79905 28957 102566 -46364 -172430 222627
17658 -74767 -118346 -177584 63790 -123475 -18333 215627 236940 66510 -68800 -286514 -226338
17647 -226338 46887 69822 107347 -311362 26206 105052 -110662 108712 -126354 -38804 -228890
17636 -228890 -82149 3413 -100545 -157087 -36541 20644 189199 97835 133003 24119 -72168
$$ packed form
17718E0950b95109B4409K43438J17384A33696A6914a13887M0345E282J47091E5195
17706G7521K4345c0586A23090A5861a38167r3406g2199B244a49493C15853B3327
17694C0519g9835b5766B37317h6725f323A89732a91955B65329o1527q8563c7759
17682b41888n1819J09723A27612M7575R0506D1826P5535D4889J95976g4591I3789
17670H2675M8807R7220B1129J58828D950P4955B8957P3609d6364j26066B22627
17658g4767m3579n9238F3790a23475a8333B15627K1313F6510f8800k17714O0176
17647b26338D6887K2935L7525c11362B6206P8846a10662A08712a26354c8804j90086
17636b28890h2149C413a00545n6542c6541B0644J68555r1364L5168B4119g2168
$$ plain form
17624 21673 156673 -252931 -297110 -154662 88349 72319 28877 -37526 261380 -42573 27071
17612 35279 -212902 -328704 295883 268 -122628 125596 169223 70122 27463 258838 -158617
17600 29583 -76300 109797 -194931 56976 188957 -11150 -107147 -15349 96930 79680 193648
17589 193648 217358 -69099 185941 -469855 66208 -288527 -209292 -125339 248176 84173 -5239
17577 -105485 92209 -66404 182967 -15252 211194 408992 275917 10596 41808 -67724 -4883
17565 -44037 147761 -68890 49339 -112289 -106506 16364 -169842 408590 188161 -113229 61506
17553 -141089 98233 39034 338636 353793 84975 167955 563 -109823 70763 -163782 -206573
17542 -206573 186912 -191977 -45937 78669 -140892 15310 19732 -45202 -191013 121979 184317
$$ packed form
17624B1673J35000b52931m4179J42448H8349j6030B8877c7526B61380d2573B7071
17612C5279b12902j15802B95883B68a22628A25596M3627G0122B7463K31375a58617
17600B9583g6300A09797a94931E6976J31981a1150r5997a5349I6930j7250J13968
17589A93648K3710f9099A85941d69855F6208b88527P9235Q3953B48176H4173e239
17577a05485I2209f6404A82967a5252B11194J97798j33075A0596L1212f7724d883
17565d4037A47761f8890D9339a12289N783A6364a69842D08590A88161a13229F1506
17553a41089I8233C9034K99602J5157H4975Q2980E63a09823G0763a63782m2791
17542b06573A86912a91977d5937G8669a40892A5310M422d5202j45811A21979O2338
$$ plain form
17531 184317 103691 -47368 11785 -1407 -155020 -26553 -108887 -88189 173817 139482 -46893
17519 93653 112829 117726 146188 106382 348129 209952 235358 -25262 241782 67834 -85717
17507 312242 481832 85244 -302178 403671 137748 -26471 -141184 101503 -102273 245702
17496 -125831 164070 449140 128445 150165 461633 -70875 33248 31343 404349 216920
17486 216920 37984 69244 -19532 51218 179429 150773 -260598 421228 50041 -53770 93963
17474 34651 381503 81132 84874 171407 -9455 174075 388842 102161 -132844 396742 -11715
17462 422885 -46857 2539 -104487 -202258 -98204 -225536 53548 310922 235776 83818 209044
17451 209044 135468 336552 359972 464147 68479 75240 157354 157298 394068 249158 -108598
$$ packed form
17531A84317q0626d7368A1785a407j53613b6553q2334K0698A73817l4335d6893
17519I3653J9176M897K8462l9806K41747j38177K5406b5262B41782F7834h5717
17507C12242J69590H5244c02178D03671A37748b6471j14713A01503a02273B45702
17496a25831A64070K85070A28445K1720L11468g0875C3248j905L73006j87429
17486B16920C7984L1260a9532E1218J28211k8656b60598D21228E0041e3770I3963
17474C4651L46852H1132L742Q6533i455A74075K14767A02161a32844C96742a1715
17462D22885d6857B539a04487r7771i8204j27332E3548K57374p5146H3818J25226
17451B09044p3576K01084K3420J04175F8479O761Q2114n6K36770j44910a08598
$$ plain form
17439 328556 199642 463308 -35539 198733 214111 139884 129618 217921 277077 -65029 210017
17427 285036 -51480 333327 281966 112672 207039 328941 257296 423653 -5531 250683 196168
17416 196168 124761 439626 331403 338956 337298 298687 123992 293783 -18943 182662 316254
17405 316254 101197 45101 10169 264665 -63565 72163 116975 45207 353876 105778 83302
17394 83302 -17976 214780 422474 311454 84164 387328 -395338 58840 154455 191225 190274
17383 190274 -21826 555412 -35284 -387394 -48873 181443 -98123 62017 399425 -33055 31781
17371 180121 59217 205733 99000 134108 16814 75893 229827 95400 63275 192546 73167
17359 -117091 2436 193056 62587 -12982 187868 222559 256574 300357 -1815 112017 206004
$$ packed form
17439C28556j28914K63666c5539A98733J5378p4227j0266Q8303N9156f5029B10017
17427B85036e1480C33327n1361A12672R4367J21902p1645J66357e531B50683n4515
17416A96168p1407L14865j08223P553j658l8611A23992J69791a8943A82662J33592
17405C16254A01197D5101A0169K54496f3565G2163M4812D5207L08669A05778k2476
17394H3302a7976B14780K07694j11020H4164L03164c95338E8840R5615L6770r51
17383A90274b1826E55412c5284l52110d8873A81443i8123F2017L37408c3055C1781
17371A80121E9217J46516I9000L5108A6814N9079J53934I5400l2125J29271G3167
17359a17091B436J90620F2587a2982A87868L4691L4015M3783a815A12017R3987
$$ plain form
17348 206004 143502 152676 401 16108 94204 127777 146231 159601 216773 -4565 -4260 -136492
17336 -136492 358175 -43905 277046 493600 107677 -75776 144855 385613 178825 471802
17326 471802 314931 82885 116289 162687 238276 381901 316921 -235917 104243 188272 22373
17314 317850 179754 -47277 -179292 44305 226075 91617 -149723 254447 88205 192782
17304 192782 269798 331327 133733 432851 299675 95458 79968 269572 -192398 -186916 -133267
17293 -133267 84920 102308 489279 191495 536371 346235 311391 291796 260809 280544 421158
17282 421158 33282 21768 186044 101519 314200 -73051 7770 42165 -61070 216101 196993
17271 196993 23357 86108 -55762 328472 123348 61360 159440 83263 371188 83868 362404
$$ packed form
17348B06004o2502R174D01J5707P8096L3573J8454J3370N7172d565L05j32232
17336a36492C58175d3905B77046K16554A07677g5776A44855K40758A78825K92977
17326D71802j56871H2885L3404M6398P5589J43625o4980b35917A04243Q4029B2373
17314C17850j38096d7277j32015D4305J81770I1617a49723B54447H8205J04577
17304A92782P7016O1529A33733K99118j33176I5458j5490J89604a92398N482N3649
17293a33267H4920J7388L86971A91495L44876j90136l4844j9595l0987J9735J40614
17282D21158C3282j1514J64276q4525K12681g3051G770L4395f1070B16101j9108
17271A96993B3357O2751e5762C28472A23348F1360R8080p6177K87925H3868K78536
$$ plain form
17260 362404 139859 278 25826 -90921 430255 219017 -140392 435386 305031 -16587 198348
17248 20879 203977 65688 247299 420392 322693 433436 39432 36443 177558 198079 138955
17237 138955 214900 4787 34517 105182 384472 13615 605465 88719 282255 321306 211179
17226 211179 144649 112742 48339 214572 381605 244491 109877 141491 149789 178186 139743
17215 139743 383046 637925 367546 584679 99641 180329 82542 452175 168184 191575
17205 191575 169872 24658 229228 275023 -200670 131616 414887 258503 174740 295598
17195 295598 242416 177099 -132225 20110 193047 270772 132271 53904 313354 139491
17184 395749 443270 75344 445284 -46515 354419 344651 345568 305300 339490 67434 278643
$$ packed form
17260C62404A39859B78K5548i0921D30255k11238a40392D35386j30355a6587A98348
17248B0879J83098F5688J81611J73093r7699J10743C9432k989J41115K0521n9124
17237A38955P5945D787K9730P0665K79290A3615N91850H8719J93536L9051j10127
17226B11179o6530l1907D8339J66233J67033j37114A09877L1614Q298K8397l8443
17215A39743K43303K54879k70379K17133I9641Q0688H2542L69633A68184K3391
17205A91575k1703B4658K04570M5795b00670A31616K83271j56384q3763J20858
17195B95598n3182o5317a32225B0110J72937P7725A32271E3904K59450A39491
17184C95749M7521G5344L69940d6515C54419r768R17m0268L4190F7434K11209
$$ plain form
17173 278643 345530 -109241 152402 4384 395251 357355 539987 243068 173743 370061
17163 370061 219643 145165 200686 -35202 353377 544154 253748 418655 50643 412010
17153 412010 78513 308781 327139 372735 308475 188764 477708 204021 -187478 96601
17142 410340 248215 478134 312925 14002 518617 50184 571622 46786 322447 262348
17132 262348 4329 458523 75565 53608 301881 327437 246067 49189 -41516 22030 390225
17121 390225 571898 374089 163981 393171 425295 267569 333305 491844 203150 900081
17111 900081 336546 220182 633261 35957 572016 568017 664422 527581 344138 523258
17101 523258 332649 561961 509219 317579 536525 403618 468657 339865 227393 539963
$$ packed form
17173B78643O6887a09241A52402D384L90867l7896J82632B43068o9325J96318
17163C70061j50418p4478N5521c5202C53377J90777B53748J64907E0643L61367
17153D12010G8513K30268J8358M5596o4260j19711K88944B04021a87478I6601
17142D10340j62125K29919j65209A4002N04615E0184N21438D6786K75661o0099
17132B62348D329M54194G5565k1957K48273K5556q1370D9189d1516B2030L68195
17121C90225J81673j97809A63981K29190L2124j57726O5736J58539B03150O96931
17111I00081C36546j16364M13079C5957N36059l999R6405j36841j83443J79120
17101E23258j90609K29312n2742j91640K18946j32907O5039j28792j12472L12570
$$ plain form
17091 539963 541377 546754 517838 777029 132169 360927 304216 411946 333279 626620 246993
17079 487192 507919 277810 467395 537755 260837 390022 383359 305190 351130 564248 246679
17067 217146 472920 483063 430771 261665 390484 619128 342827 386691 550578 439300
17057 439300 402041 152086 412697 389830 84610 378944 501213 423635 489609 165443
17046 424385 686012 331053 344582 622048 967410 394946 662856 632484 292148 288640
17036 288640 639179 825867 678973 673863 560917 605169 429182 708775 383503 292322
17026 292322 526958 642280 772826 556943 388433 479273 505621 904289 292108 451003
17016 451003 616697 643418 709842 702567 521079 667751 830604 483320 724488 307457
$$ packed form
17091E39963J414N377k8916K59191A32169K28758n6711J07730p8667K93341B46993
17079D87192K0727k30109J89585P0360B60837J29185o663p8169M5940K13118B46679
17067B17146K55774J0143n2292j69106J28819K28644k76301M3864J63887j11278
17057D39300l7259A52086K60611k2867H4610K94334J22269p7578O5974A65443
17046D24385K61627C31053J3529K77466L45362C94946K67910l0372B92148l508
17036B88640L50539J86688j46894n110j12946M4252j75987K79593l25272r1181
17026B92322K34636J15322J30546k15883j68510R0840K6348L98668B92108J58895
17016D51003J65694K6721O6424p275j81488J46672J62853l47284K41168C07457
$$ plain form
17005 751445 635534 751137 450912 732196 614684 986959 991816 517533 684885 570033
16995 570033 549421 723411 811870 732061 1029498 880573 823672 794323 540787 678934
16985 678934 934576 738659 604668 1073440 872423 499111 999750 753993 699734 884389
16975 884389 1081970 1046410 913414 557420 1197223 907502 890158 973296 956590 933613
16965 933613 915557 1129505 1217423 1297354 788728 982964 999981 1036538 970324 700685 940132
16954 940132 1160082 983444 1273200 930219 1351050 1229366 1121155 930279 1165461 1081708
16944 1081708 968436 1351060 1104751 1356650 992981 1131145 1086708 926984 1084515 1187764
16934 1187764 1153961 1325078 1196943 999960 1436247 1444665 1156850 1318948 1391143 1138751
$$ packed form
17005G51445j15911J15603l00225K81284j17512L72275M857m74283J67352j14852
16995E70033k0612J73990Q8459p9809K97437j48925n6901k9349k53536J38147
16985F78934K55642j95917j33991M68772k01017l73312N00639k45757n4259J84655
16975H84389J97581l5560j32996l55994O39803k89721j7344Q3138j6706k2977
16965I33613j8056K13948Q7918P9931n08626J94236J7017L6557o6214k69639K39447
16954I40132K19950j76638K89756l42981M20831j21684j08211j90876K35182q3753
16944A081708j13272L82624k46309K51899l63669J38164m4437j59724J57531J03249
16934A187764l3803J71117j28135j96983M36287Q418k87815J62098P2195k52392
$$ plain form
16924 1138751 1273227 1470849 1590463 1241701 1438060 1119752 1643673 1308146 1427978
16915 1427978 1418087 1362406 1189087 1528211 1673058 1957479 1462542 1776002 1523334 1632308
16905 1632308 1894798 1868825 1719640 1660899 1661944 2066830 1881394 2188731 1560822 1640380
16895 1640380 1526815 1727186 1881013 1928548 2012806 2098029 1786465 1907271 2182674 2042156
16885 2042156 2044647 2048301 2052762 2080776 2057837 2154563 2263255 2333217 2466591 2198568 2435539
16874 2435539 2356852 2193803 2314044 2659804 2717691 2488666 2643381 2909711 2777154 2776168
16864 2776168 2992341 2731373 2652477 2721625 2803455 2939034 3211144 2966604 3147585 2863777
16854 2863777 3188769 3184198 3017877 3162485 3582675 3331156 3459911 3194693 3478383 3598117
$$ packed form
16924A138751J34476J97622J19614l48762J96359l18308N23921l35527J19832
16915A427978r891n5681j73319L39124J44847K84421m94937L13460k52668J08974
16905A632308K62490k5973j49185n8741J045M04886j85436L07337o27909P9558
16895A640380j13565K00371J53827M7535Q4258Q5223l11564J20806K75403j40518
16885B042156K491L654M461K8014k2939R6726J08692O9962J33374k68023K36971
16874B435539p8687j63049J20241L45760N7887k29025J54715K66330j32557r86
16864B776168K16173k60968p8896O9148Q1830J35579K72110k44540J80981k83808
16854B863777L24992m571j66321J44608M20190k51519J28755k65218K83690J19734
$$ plain form
16844 3598117 3638580 3448679 4143188 3798382 3657703 4161588 4031508 4144134 4409289 4174237
16834 4174237 4065936 4080460 4496201 4041076 4731327 4606085 4762551 4840619 4746823 4868619
16824 4868619 4900926 5289942 5690216 5119154 5464614 5581503 5275157 5638365 5499411 5926834
16814 5926834 5837390 6092550 6444738 6284467 6602496 6651499 6742821 7123653 7194793 7407449
16804 7407449 7353441 7563327 7707846 7980220 8089420 8356199 8519805 8767979 9156811 9105019
16794 9105019 9455370 9445558 9880738 9954728 10350986 10747271 10680441 11428179 11773586 11890040
16784 11890040 12205224 12431439 13262421 13358968 13599914 14064201 14633465 14917771 15918821
16775 15918821 15979017 16678872 16822696 17494995 18222856 18938138 19604646 20248095 21227131
$$ packed form
16844C598117M0463j89901O94509l44806j40679N03885j30080J12626K65155k35052
16834D174237j08301J4524M15741m55125O90251j25242J56466P8068r3796J21796
16824D868619L2307L89016M00274n71062L45460J16889l06346L63208j38954M27423
16814E926834q9444K55160L52188j60271L18029M9003R1322L80832P1140K12656
16804G407449n4008K09886J44519K72374J09200K66779J63606K48174L88832n1792
16794I105019L50351r812M35180P3990L96258L96285o6830P47738L45407J16454
16784A1890040L15184K26215Q30982R6547K40946M64287N69264K84306J001050
16775A5918821O0196O99855J43824O72299P27861P15282O66508O43449R79036
$$ plain form
16766 21227131 21762941 22550260 23517258 24383060 24984058 26301414 27457147 28451602 29659884
16757 29659884 31010255 32117178 33753947 35039875 36672220 38065917 39976452 42069343
16749 42069343 44168509 46188224 48577070 51266980 54233621 56668301 59587285 62813582
16741 62813582 66487983 69956607 73832045 78071052 82634390 87675787 93103625 98163141
16733 98163141 103702084 109945841 116330241 122495590 129395517 136618273 143775675 150662600
16725 150662600 157556789 164066271 170220297 175925214 180985693 184860814 187919345 189597802
16717 189597802 190214834 189592978 188007111 185229066 181294674 176233358 170682895 164556633
16709 164556633 157962755 150846145 143723549 136689722 129277341 122348316 115573848 109011712
$$ packed form
16766B1227131N35810P87319R66998Q65802O00998J317356J155733R94455J208282
16757B9659884J350371J106923J636769J285928J632345J393697J910535K092891
16749D2069343K099166K019715K388846K689910K966641K434680K918984L226297
16741F2813582L674401L468624L875438M239007M563338N041397N427838N059516
16733I8163141N538943O243757O384400O165349O899927P222756P157402O886925
16725A50662600O894189O509482O154026N704917N060479L875121L058531J678457
16717A89597802O17032o21856j585867k778045l934392n061316n550463o126262
16709A64556633o593878p116610p122596p033827p412381o929025o774468o562136
$$ plain form
16701 109011712 102775644 97149477 91403260 86128235 81318587 76724250 72260486 67976202
16693 67976202 64675740 60871509 57482701 54643567 51573472 49088235 46482964 44362622
16685 44362622 42257399 40302289 38615564 36392947 34536263 33056557 31675326 30537974
16677 30537974 29022859 27837711 26672266 25614328 24898421 23749172 22924680 21934997
16669 21934997 21068715 20145079 19401762 18864147 18123063 17544290 17073146 16115783 15915410
16660 15915410 14926110 14820889 14511512 13814278 13354938 13059584 12548839 12403189 11822700
16651 11822700 11505722 11220131 11066975 10612170 10440560 10370145 9721110 9605673 9167142
16642 9167142 9327275 8468706 8656768 8289516 8242707 8114558 7690590 7699785 7245195 7411165
$$ packed form
16701A09011712o236068n626167n746217n275025m809648m594337m463764m284284
16693F7976202l300462l804231l388808k839134l070095k485237k605271k120342
16685D4362622k105223j955110j686725k222617j856684j479706j381231j137352
16677C0537974j515115j185148j165445j057938p15907j149249q24492r89683
16669B1934997q66282r23636p43317n37615p41084n78773m71144r57363k00373
16660A5915410r89300j05221l09377o97234m59340k95354n10745j45650n80489
16651A1822700l16978k85591j53156m54805j71610p0415o49035j15437m38531
16642I167142J60133q58569J88062l67252m6809j28149m23968R195m54590J65970
$$ plain form
16632 7411165 6948082 6767583 6605337 6563654 6570653 6180188 6308015 6083890 5977633 5784391
16622 5784391 5788155 5625961 5423818 5425216 5106964 5097750 5205509 5255619 4817001 4681556 4805274
16611 4805274 4644969 4210133 4477372 4441204 3992517 4072257 3941854 3837986 3714864 3897937
16601 3897937 3908869 3859765 3543195 3344691 3561236 3427009 3708853 3169694 3316510 3110676
16591 3110676 3125542 3375226 3156809 3001334 3296259 2816887 2812544 2714822 2713078 2737259 2952923
16580 2952923 2717141 2523363 2775020 2444085 2631462 2584060 2527266 2298040 2468749 2055083
16570 2055083 2430318 2191764 2157420 2302559 2304333 1969693 2090860 2030930 1763320 2007357
16560 2007357 2234711 1755901 2071793 1866932 1862177 1690640 1816389 1729309 1962280 1865452
$$ packed form
16632G411165m63083j80499j62246m1683O999l90465J27827k24125j06257j93242
16622E784391L764j62194k02143J398l18252r214J07759N0110m38618j35445J23718
16611D805274j60305m34836K67239l6168m48687P9740j30403j03868j23122J83073
16601C897937J0932m9104l16570j98504K16545j34227K81844n39159J46816k05834
16591C110676J4866K49684k18417j55475K94925m79372m343r7722j744K4181K15664
16580B952923k35782j93778K51657l30935J87377m7402n6794k29226J70709m13666
16570B055083L75235k38554l4344J45139J774l34640J21167n9930k67610K44037
16560B007357K27354m78810L15892k04861m755j71537J25749q7080K32971r6828
$$ plain form
16550 1865452 1736055 1788376 1712518 1495172 1461484 1702758 1570647 1508750 1517835 1710465
16540 1710465 1242591 1480918 1588265 1584842 1723926 1352951 1286967 1492394 1346414 1280364
16530 1280364 1193239 1132741 1303960 1226459 1268182 1214215 1354098 1218544 1088614 1152439
16520 1152439 1281569 1271585 1440492 1189182 1034174 1388257 1000360 1206592 883041 887962
16510 887962 1298454 1103722 1374027 962770 782802 1186158 1130028 1255525 1082846 1123059
16500 1123059 1040500 1076434 1159307 845962 1003735 982557 982817 1143608 1009474 530419 649334
16489 649334 717464 870024 768421 751806 711903 789773 833732 595704 643593 635982 880470
16478 880470 705170 663914 930584 734946 668751 933131 594407 1042784 601089 331063
$$ packed form
16550A865452j29397N2321p5858k17346l3688K41274j32111o1897R085J92630
16540A710465m67874K38327J07347l423J39084l70975o5984K05427j45980o6050
16530A280364q7125o0498J71219p7501M1723n3967J39883j35554j29930O3825
16520A152439J29130r984J68907k51310j55008L54083l87897K06232l23551M921
16510H87962M10492j94732K70305m11257j79968M03356n6130J25497j72679M0213
16500A123059q2559L5934Q2873l13345J57773k1178K60J60791j34134m79055J18915
16489F49334O8130J52560j01603j6615l9903P7870M3959k38028M7889p611K44488
16478H80470j75300m1256K66670j95638o6195K64380l38724M48377m41695k70026
$$ plain form
16468 331063 711345 670751 831536 970845 705880 531208 657852 665117 344420 748856
16458 748856 657295 452182 764542 682145 605737 864129 527809 661806 649136 687939
16448 687939 627021 604427 448801 759624 686764 211687 536328 859967 723213 753343
16438 753343 563036 597859 566450 606006 250690 959221 472985 570740 520412 371919
16428 371919 818866 302231 209169 541227 414951 532425 771871 612274 487538 619040
16418 619040 433392 630953 585286 817828 429539 275796 329569 644667 526867 381501
16408 381501 647751 639326 382960 386700 810719 362942 399929 418107 466118 378675 494139
16397 494139 426460 258681 457980 406092 178582 334676 395513 283480 466103 271056
$$ packed form
16468C31063L80282m0594J60785J39309k64965j74672J26644P265l20697M04436
16458G48856r1561k05113L12360q2397p6408K58392l36320J33997j2670L8803
16448F87939o0918k2594j55626L10823p2860B11687L24641L23639j36754L0130
16438G53343j90307L4823l1409L9556B50690P08531D72985R7755n0328j48493
16428C71919M46947C02231r3062L32058j26276J17474K39446j59597j24736J31502
16418F19040j85648J97561m5667K32542l88289j53743N3773L15098j17800j45366
16408C81501K66250q425k56366L740M24019C62942L6987J8178M8011q7443J15464
16397D94139o7679j67779J99299n1888A78582J56094O0837j12033J82623j95047
$$ plain form
16387 271056 401213 448735 83442 365616 239883 659519 551666 470017 310265 343266
16377 343266 98373 357901 436764 638104 116857 308175 149567 407093 289517 154966
16367 154966 126737 312620 421253 376373 14944 427332 423853 426714 167996 395452 82487
16355 421400 69947 412350 248800 231104 -2178 260801 242066 157131 500917 204366 451272
16344 451272 188193 273931 -221100 416497 518335 622253 286219 176402 90684 113356
16334 113356 55995 184268 405992 2988 86650 108230 374382 334438 280428 327652 164820
16323 164820 167924 426008 580580 -8115 378497 340270 259208 73411 210682 -47052 425438
16311 337383 162433 463882 149807 289116 -55488 301590 378538 8538 219631 113414
$$ packed form
16387B71056J30157M7522H3442K82174j25733M19636j07853q1649j59752L3001
16377C43266I8373K59528P8863K01340A16857J91318A49567K57526j17576j34551
16367A54966k8229J85883J08633m4880A4944M12388l479K861A67996K27456H2487
16355D21400F9947L42403j63550j7696b178B60801j8735q4935L43786B04366K46906
16344D51272A88193Q5738b21100D16497J01838J03918B86219j09817q5718K2672
16334A13356E5995J28273K21724B988Q3662K1580K66152l9944n4010M7224j62832
16323A64820L104K58084J54572h115C78497l8227q1062G3411J37271d7052D25438
16311C37383A62433L01449A49807J39309e5488C01590P6948H538K11093j06217
$$ plain form
16301 113414 392194 27 40357 162532 239966 416976 24616 290048 38302 70693 122859
16290 122859 97222 473796 373084 299222 13897 408277 209475 234508 81849 -5617 -48888
16279 -48888 171447 124258 216364 42406 200311 436134 192796 -182149 123892 323485
16269 323485 100562 385761 137904 86826 60126 47849 -71525 46324 218284 259416 -6901
16257 205724 3932 180373 -87163 79700 277565 -23212 460481 249764 512742 523149 76601
16245 -110232 157077 -288101 114037 178909 230671 683969 168016 137846 219652 149363
16235 149363 158728 -80640 229682 409368 53051 -70895 217126 138329 -123659 146299 347861
16224 347861 75645 188602 23481 324213 206005 -108628 30992 156956 104643 164597
$$ packed form
16301A13414K78780B7M0330J22175P7434J77010B4616K65432C8302L2391N2166
16290A22859k5637L76574j00712p3862A3897L94380j98802K5033H1849e617m3271
16279d8888A71447m7189R2106D2406J57905K35823A92796a82149A23892J99593
16269C23485A00562K85199A37904n1078k6700j2277g1525D6324J71960M1132f901
16257B05724C932J76441h7163G9700J97865b3212D60481k10717K62978J0407G6601
16245a10232A57077b88101A14037O4872N1762M53298A68016l0170Q1806p0289
16235A49363R365h0640B29682J79686E3051g0895B17126p8797a23659A46299K01562
16224C47861G5645J12957B3481L00732j18208a08628C0992J25964n2313N9954
$$ plain form
16214 164597 -70218 107469 136901 -53791 123489 211959 200553 381345 28020 -228523 53263
16202 170853 -11334 204999 143180 224682 385454 -6199 121369 -72874 217939 -320994 337963
16190 247020 71822 -111173 272566 173809 -90813 354376 243696 165618 209012 57389 179952
16179 179952 31212 -50695 11215 91366 -229594 18710 176190 380650 -69226 115361 59619
16168 59619 -17267 -15577 7928 -53945 -44977 -103331 -109746 489293 64530 -41103 151118 276896
16156 276896 -290577 -114199 204620 -39308 -124207 33856 -782 14437 371137 -64262 171176
16144 -138451 96822 65960 -75776 45675 81440 222599 73601 -132542 21010 -9377 -153976
16133 -153976 79306 244387 -160832 202900 -16932 97254 -174269 -190935 420583 -67666
$$ packed form
16214A64597g0218A07469K9432e3791A23489Q8470j1406J80792B8020b28523E3263
16202A70853a1334B04999o1819Q1502J60772f199A21369g2874B17939c20994C37963
16190B47020G1822a11173B72566r8757i0813C54376j10680p8078M3394E7389J22563
16179A79952C1212e0695A1215Q0151b29594A8710J57480K04460f9226A15361n5742
16168E9619a7267J690G928e3945Q968n8354o415D89293F4530d1103A51118J25778
16156B76896b90577a14199B04620c9308q4899C3856g82A4437L56700f4262A71176
16144a38451I6822l0862g5776D5675L5765J41159G3601a32542B1010i377j44599
16133a53976G9306J65081a60832B02900a6932I7254a74269j6666D20583f7666
$$ plain form
16122 123284 111832 3564 24432 221347 107688 -172408 -51752 -387190 90196 272547 47984
16110 171544 -202312 161729 77252 160544 -221755 64463 -2501 397819 84904 71024 -189396
16098 123883 216767 19020 66869 -70686 182420 192969 43281 135029 209413 -427615 -49865
16086 -175997 10468 224899 -46493 158883 143726 -160236 -315757 185731 268836 -170078
16075 138804 383513 46490 119212 31946 83079 -193368 -120309 213462 135617 45747 -41476
16063 494695 200233 -264441 -137233 213736 -201731 272890 -271552 154154 183075 108438
16053 108438 2566 -32855 -84155 -18384 -11498 -311925 -107179 -353 -200442 -319749 -62157
16041 343993 -140084 -7915 146568 50555 -442976 180207 -19249 -225819 262111 -54605
$$ packed form
16122A23284j1452C564K0868J96915A07688a72408e1752l35438I0196J82351D7984
16110A71544b02312A61729G7252Q3292b21755F4463b501C97819H4904j3880a89396
16098A23883R2884A9020M7849g0686A82420J0549D3281R1748P4384d27615d9865
16086a75997A0468K14431d6493A58883j5157a60236j55521A85731Q3105a70078
16075A38804K44709D6490P2722C1946N1133a93368P3059B13462p7845D5747d1476
16063D94695B00233b64441J27208B13736b01731B72890b71552A54154K8921p4637
16053A08438B566c2855n1300a8384O886l00427a07179c53k00089j19307f2157
16041C43993a40084g915A46568E0555d42976A80207a9249k06570B62111e4605
$$ plain form
16030 -72282 -332797 -31033 6238 -296663 42836 -227653 225004 117153 -294706 -195143 -181427
16019 -181427 -161070 -66545 158503 -178052 -97756 -27457 -114010 -95862 -135914 -33460 19711
16007 -51560 -66471 -153980 -422454 95239 361011 -164843 233262 -121501 154254 145965 -170613
15995 125348 -13955 30795 -83900 -155433 23429 28888 379458 -223948 -41217 177473 -190587
15983 176703 190017 67938 288603 128060 169448 -164194 140722 67540 58658 377584 87724
15971 101374 49762 43590 -34593 101276 39609 274228 159580 1846 256023 -105525 -181007
15960 -181007 260545 27575 -215073 85538 153021 10525 74325 -44492 48369 -55016 68855
15948 203908 124400 187818 165597 -354788 67289 88145 -21336 -228807 352239 100457 250960
$$ packed form
16030g2282k60515c1033F238b96663D2836b27653B25004j07851b94706R9563J3716
16019a81427K0357f6545A58503a78052Q0296b7457q6553J8148m0052c3460A9711
16007e1560j4911q7509k68474I5239K65772a64843B33262a21501A54254q289a70613
15995A25348a3955C0795h3900p1533B3429N459L50570b23948d1217A77473a90587
15983A76703J3314F7938K20665A28060M1388a64194A40722F7540q882L18926H7724
15971A01374D9762o172c4593A01276C9609K34619j14648A846K54177a05525p5482
15960a81007B60545B7575b15073H5538O7483A0525O3800d4492D8369e5016F8855
15948B03908p9508O3418k2221c54788F7289K0856b1336k07471C52239A00457J50503
$$ plain form
15937 250960 -53901 216697 67019 87660 -29386 1531 -198895 -142205 48203 -271217 -15306
15925 -60009 94285 -19091 199915 24072 -116971 33419 -79414 -15514 62138 -30776 68997
15913 -118065 97778 -32234 -102779 -421966 -86353 33032 57287 -345985 -261250 -115612 35537
15901 -183922 106469 58602 -45767 -102214 -70341 86357 -13294 32322 -116367 116836 -26134
15889 13157 -275902 -25470 179799 160305 202587 47099 -121459 -119187 191004 -313047 -34455
15877 -22504 14713 63414 -91220 -119834 226435 33992 134587 -169748 100536 118412 -494471
15865 -223623 135952 -221243 228025 55774 -216674 34192 -15736 16040 33522 175575
15855 175575 -183713 -185205 256785 -24370 -9093 -110587 -218036 174406 -51319 -75527 -1870
$$ packed form
15937B50960e3901B16697F7019K0641b9386A531a98895N6690D8203b71217a5306
15925f0009I4285a9091A99915B4072a16971C3419g9414a5514F2138c0776F8997
15913a18065I7778c2234p0545l19187h6353C3032K4255c45985Q4735a15612C5537
15901a83922A06469m7867d5767n6447L1873H6357a3294C2322a16367A16836b6134
15889A3157b75902b5470A79799j9494M2282D7099a21459K272A91004c13047c4455
15877b2504A4713M8701i1220k8614B26435C3992J00595a69748A00536J7876d94471
15865b23623A35952b21243B28025E5774b16674C4192a5736A6040J7482J42053
15855A75575a83713j492B56785b4370i093j01494j07449A74406e1319k4208a870
$$ plain form
15843 -185849 377252 4789 12439 -126792 -168078 187693 -128763 164381 288608 32952 -95354
15831 102478 -108246 -231710 332277 -290729 7157 -54700 -111530 -58124 -411161 -163540
15820 -387653 -155698 80802 -230959 120186 114828 -334490 -225708 294875 -202663 176817
15809 58344 -395045 -81438 15213 315194 200327 56111 139176 -189934 71962 -252912 75959
15797 -136146 -143768 -115967 -128365 451740 -30407 -16521 -41906 -82920 40344 126874 -179855
15785 92436 92831 -118406 -50292 129499 -38563 -154982 -76712 22771 -164645 -15892 -114152
15774 -114152 370019 41083 177366 -290145 -300964 53050 -200395 97452 -6701 -152707 -412220
15763 -412220 43433 84988 13303 54009 142203 -32667 -276486 153046 -9271 94141 85425
$$ packed form
15843a85849C77252D789P650a26792m1286A87693a28763A64381J24227C2952i5354
15831A02478a08246j23464C32277b90729G157e4700n6830N3406l53037a63540
15820c87653a55698H0802b30959A20186n358c34490J08782B94875b02663A76817
15809E8344c95045h1438A5213K99981j14867E6111Q3065a89934G1962b52912G5959
15797a36146p622K7801j2398D51740c0407J3886k5385m1014D0344Q6530a79855
15785I2436L95a18406e0292A29499c8563j16419g6712B2771a64645a5892r8260
15774a14152C70019D1083J36283b90145j0819E3050b00395I7452f701j46006k59513
15763d12220D3433M1555A3303M0706Q8194c2667k43819A53046i271I4141q716
$$ plain form
15752 85425 -320637 117678 110818 272383 -156297 400483 117173 -129871 76904 -110518
15741 140360 -196533 -153558 122414 230143 -14249 271071 -25412 92988 -217950 39778
15730 -56348 5858 68787 -234842 -247368 -111037 69139 -19191 -155758 -238977 34959 -54024
15718 -94553 -29807 77441 187930 -290904 14434 106550 -233122 -451539 26664 -138484 -347104
15707 -347104 -185613 -18236 41050 -241034 -41782 80070 19265 -113808 -210077 458447 -142126
15695 -127637 341069 -89952 -201362 -20903 -195522 80727 212744 -182285 107861 -32089
15684 -42892 9888 -229503 173072 -53534 -23264 88808 196005 -319761 -212548 -45654 -160337
15673 -160337 311270 295431 59193 138934 -87944 -10107 40246 205042 89344 -311704 68161
$$ packed form
15752H5425c20637A17678o860J61565a56297D00483A17173a29871G6904a10518
15741A40360a96533M2975A22414J07729a4249B71071b5412I2988b17950C9778
15730e6348E858O2929b34842j2526a11037F9139a9191j36567q3219C4959e4024
15718i4553b9807G7441J10489b90904A4434R2116b33122k18417B6664a38484k08620
15707c47104J61491a8236D1050b41034d1782H0070A9265a13808r6269D58447a42126
15695a27637C41069h9952j11410b0903j74619H0727J32017a82285A07861c2089
15684d2892I888b29503A73072e3534b3264H8808J07197c19761J07213d5654j14683
15673a60337C11270j5839E9193P9741h7944a0107D0246J64796H9344c11704F8161
$$ plain form
15661 53155 -154370 -464567 -348568 116933 194949 276917 -340649 -301895 173357 -156471
15650 216321 125388 -214698 148507 -155851 -126422 274844 -84308 -438967 -110932 -214798
15640 -214798 -75826 -73092 35332 238600 75877 -439531 -67988 281212 -189332 -65129 -37485
15629 -37485 39225 174627 -155042 116003 -59029 22762 -385691 247620 107377 -102483
15618 -355495 11693 132350 -130167 217431 146906 154771 -196417 58621 -455648 -301735
15608 -301735 227807 -51352 -41838 -78797 261601 332911 -209396 32589 126074 -359010 -206283
15597 -206283 -190845 -230723 107898 193666 -126761 -54163 302613 188603 -179146 146279
15586 322899 -271916 409340 177792 171729 -110634 28571 -379332 178626 345819 56003
$$ packed form
15661E3155a54370l10197J15999A16933P8016Q1968c40649L8754A73357a56471
15650B16321r0933b14698A48507a55851K9429B74844h4308l54659a10932j03866
15640b14798g5826K734C5332K03268G5877d39531f7988B81212a89332f5129K7644
15629c7485C9225J35402a55042A16003e9029B2762c85691B47620A07377a02483
15618c55495A1693J20657a30167B17431p0525P865a96417E8621d55648J53913
15608c01735B27807e1352R514l6959B61601P1310b09396C2589R3485c59010J52727
15597b06283J5438l9878A07898Q5768a26761e4163C02613j14010a79146A46279
15586C22899b71916D09340A77792o063a10634B8571c79332A78626J67193E6003
$$ plain form
15575 -219408 160553 -61678 32179 -159464 -39943 -391488 37734 170196 -191046 14245
15564 103377 -124068 30495 200063 64498 -162042 -87248 138480 -231936 15311 25554
15554 25554 -41142 -237195 -118132 -154512 -32389 -52142 143708 177771 14576 -17492 -97116
15543 -97116 -29406 60536 -148621 41102 -56151 311308 72618 -111591 -66670 -29104 27976
15531 -100254 308682 377495 -132071 -129462 157807 17488 -43314 -18884 -120957 111514 -275373
15519 51010 344783 -103140 99688 -84194 -264377 -96775 -61418 239224 -225965 32803 142492
15508 142492 1618 15762 168190 21544 15670 -113316 421269 -400716 -207295 -37331 59253
15496 61481 171002 -19747 -81867 49407 -386454 -24076 101376 -191893 -457994 170127
$$ packed form
15575b19408A60553f1678C2179a59464c9943l51545C7734J32462a91046A4245
15564A03377a24068C0495J69568F4498a62042P4794A38480b31936A5311J0243
15554B5554d1142j96053a18132l6380c2389j9753A43708L4063A4576a7492p9624
15543i7116b9406F0536a48621D1102e6151C11308G2618a11591M4921b9104B7976
15531a00254C08682O8813a32071K609A57807A7488d3314a8884j02073A11514b75373
15519E1010K93773a03140I9688h4194j80183i6775L5357B39224b25965C2803J09689
15508A42492A618J4144J52428B1544n874a13316D21269d00716J93421c7331E9253
15496F1481J09521a9747o2120D9407c86454b4076A01376a91893k66101A70127
$$ plain form
15485 -451783 51175 -134843 -217895 19766 -85874 -26142 -90001 122977 55763 74765 -204768
15473 -144351 -60180 -164970 155949 -211461 57022 -4110 31121 -78268 -184921 -190812 -174266
15462 -174266 113288 38551 113244 77225 125268 12020 124534 203947 -233755 -406140 -318628
15451 -318628 -46001 -210444 -151310 257753 46201 -213921 -174279 -409002 73795 55584 375448
15440 375448 98188 185844 -79983 53397 55298 -42599 -47293 -13691 401663 -96775 228459
15428 -492646 -34966 -25382 -268285 -191783 -102914 17794 13876 169776 56463 257530 -106182
15416 -71280 -132318 -194442 -310972 -249386 64930 166436 -89556 52922 -127333 46434 -100692
15404 323486 -69453 241055 -241994 -102984 -30747 -173179 225598 255323 -202038 -37023
$$ packed form
15485d51783E1175a34843q3052A9766h5874b6142o3859A22977E5763J9002b04768
15473a44351f0180j04790A55949b11461E7022d110C1121g8268j06653n891J6546
15462a74266A13288C8551P4693l6019M8043A2020J12514P9413b33755j72385Q7512
15451c18628d6001j64443N9134B57753D6201b13921L9642k34723G3795j8211L19864
15440C75448I8188Q7656g9983E3397J901d2599m694a3691D01663i6775B28459
15428d92646c4966R584k42903P6502Q8869A7794l918J55900E6463K01067a06182
15416g1280o1038o2124j16530O1586F4930J01506h9556E2922a27333D6434a00692
15404C23486f9453B41055b41994a02984c0747j42432B25598K9725b02038c7023
$$ plain form
15393 101779 -166375 -89395 -75215 170472 231748 -58496 -100455 -357768 -206721 -81114 -110050
15382 -110050 -122729 59324 -13133 165299 143714 -214527 -75727 125664 -162387 195082
15371 -228669 -292716 -72620 52048 -75464 61350 316042 -57208 -68680 106559 -167912 130741
15359 201794 187307 234287 212374 -120143 112093 193483 -144884 -241339 -91652 -55195 49916
15347 -159294 148884 -22276 -11141 20630 -121484 -73788 6923 233529 -206973 -107589 -285437
15336 -285437 92126 189518 33715 -98052 -156616 -42723 -417162 -193501 -72675 44179 59330
15325 59330 50944 -74495 -17879 -11412 -363457 90373 -55901 -34001 -47756 65592 211457 16079
15312 98006 -75646 100490 97854 -145483 -204467 -23768 -18892 -80987 275933 129246 -69356
$$ packed form
15393A01779a66375P6980J4180A70472O1276e8496m1959k57313J51047h1114k8936
15382a10050j2679E9324a3133A65299k1585b14527g5727A25664a62387A95082
15371b28669o4047g2620E2048g5464F1350K54692e7208j1472A06559a67912A30741
15359B01794j4487M6980k1913a20143A12093Q1390a44884r6455i1652L6457D9916
15347a59294A48884b2276J1135B0630a21484M7696F923K26606b06973R9384j77848
15336b85437I2126R7392C3715i8052n8564d2723l74439a93501g2675D4179J5151
15325E9330q386g4495a7879O467l52045I0373e5901K1900j3755F5592J45865A6079
15312I8006g5646A00490k636a45483n8984b3768M876o2095B75933A29246f9356
$$ plain form
15300 192133 -59530 215730 -34191 7073 -13707 84960 -2908 -123276 48184 -60042 31838
15288 -103088 -41836 367315 -166693 -78327 208498 -191501 268751 83647 89522 145349 107619
15277 107619 415085 -81332 230794 349984 56346 204226 115372 100356 -226939 165359
15266 -192623 212220 165545 6703 137989 152801 14460 -108701 -9740 101470 73526 166475
15255 166475 -76284 293929 52811 207777 218342 411703 434494 960847 1196603 1440129
15245 1440129 1322161 1282861 578113 -177067 101716 199558 -31608 -67256 230900 128959
15235 128959 54545 -32312 138584 10980 -191669 37361 185362 23811 253411 17015 -227685
15223 -409048 132381 -9824 180881 345893 94377 71737 154724 -110247 -72113 85032 -60907
$$ packed form
15300A92133e9530B15730c4191G073a3707H4960b908j20368D8184f0042C1838
15288a03088d1836C67315a66693g8327B08498a91501B68751H3647N875N5827l7730
15277A07619L07466h1332B30794J19190E6346J47880q8854j5016b26939A65359
15266a92623B12220m6675F703J31286J4812A4460a08701i740A01470k7944R2949
15255A66475g6284B93929E2811J54966J0565J93361K2791N26353K35756K43526
15245A440129j17968l9300E78113a77067A01716R7842c1608l5648B30900j01941
15235A28959E4545c2312A38584A0980a91669C7361J48001B3811K29600A7015b27685
15223d09048A32381i824A80881J65012I4377k2640Q2987a10247L8134H5032f0907
$$ plain form
15211 237893 -82210 162351 302574 41517 -135743 139767 -88927 78907 -62916 -139529 173636
15199 8781 41283 106396 -18378 175568 141495 361919 -86333 17681 -130472 221537 78484
15187 48100 189513 95435 76313 147354 203658 12903 120595 1996 -24851 -154097 -316600
15176 -316600 129357 126135 503852 51818 -21147 40215 310539 -255643 268118 -254658
15165 -15972 92016 84803 -50878 63174 151233 170259 -123532 25243 169943 -166068 -2565
15153 -269 142730 164291 36450 -98718 -83531 18158 273053 29321 -186207 -141401 217856
15141 222279 218854 -20467 405124 55753 -262536 189131 -22419 64740 -29406 335357 57931
15129 73114 341317 246761 95058 363738 318039 297978 170879 217079 303383 71972 202569
$$ packed form
15211B37893h2210A62351J40223D1517a35743A39767h8927G8907f2916p6613A73636
15199H781L2502O5113a8378A75568l4073K20424h6333A7681a30472B21537G8484
15187D8100J41413r4078j9122P1041N6304A2903J07692A996b4851j29246j62503
15176c16600A29357l222L77717E1818b1147D0215K70324b55643B68118b54658
15165a5972I2016p213e0878F3174Q8059J9026a23532B5243J44700a66068b565
15153b69A42730K1561C6450i8718J5187A8158K54895B9321a86207M4806B17856
15141B22279l425b0467D05124E5753b62536A89131b2419F4740b9406C35357E7931
15129G3114K68203r4556I5058K68680m5699k0061j27099M6200Q6304G1972J30597
$$ plain form
15118 202569 -100485 453710 449021 173481 5697 -192556 68290 143305 270239 6019 80230
15107 80230 -117826 18235 492015 319996 82024 56427 11911 96288 161920 279965 37203
15095 201458 -13757 297836 210733 160570 139627 418468 132354 256448 -83754 323903
15084 154026 173428 89559 249948 193835 137934 332883 355310 151632 67557 14070 104861
15073 104861 214415 39524 -11292 277973 284934 61455 146573 85220 41556 111087 260417
15062 260417 -71765 341528 110716 149983 8936 447050 306509 184547 8125 115823 111071
15051 111071 70928 458692 30240 -96575 336218 -24463 211736 -29730 90283 64963 -70956
15039 16101 219488 724 138280 132633 137016 359852 294060 106071 84731 311254 -226993
$$ packed form
15118B02569a00485D53710m689A73481E697a92556F8290P5015J26934F019P4211
15107H0230a17826A8235M73780j72019H2024k5597A1911Q4377O5632J18045C7203
15095B01458a3757B97836q7103n0163k0943K78841A32354J24094h3754C23903
15084A54026J9402q3869J60389n6113n5901J94949K2427A51632F7557A4070R0791
15073A04861J09554C9524a1292B77973O961F1455Q5118o1353D1556O9531J49330
15062B60417g1765C41528A10716L9267H936M38114j40541j21962H125J07698m752
15051A11071m0143L87764C0240i6575C36218b4463B11736b9730I0283k5320g0956
15039A6101K03387G24J37556n647M383K22836o5792A06071k1340K26523b26993
$$ plain form
15027 383684 156737 6311 460028 122038 -267857 143306 422174 346859 99596 -85323
15016 653300 39558 97261 82810 486524 225782 164259 610931 -62487 284008 79902 164911
15005 164911 16380 40357 151801 189129 139813 221669 370917 300477 410978 -141970 312158
14993 -3945 65752 48932 -26933 192377 239655 70768 244294 320656 74803 325155 212173
14982 212173 -1632 550581 391331 103389 232184 457427 106097 175714 -320659 405236
14971 428838 34357 201077 -106469 116984 325163 415554 -14899 449777 430562 230835
14961 230835 182328 238726 177420 514056 270286 456734 312071 49085 414909 115169
14950 299960 64178 146906 281857 370218 522033 218372 252710 348332 297510 246457 -11209
$$ packed form
15027C83684A56737F311M53717A22038b67857A43306K78868p5315I9596h5323
15016F53300C9558N7703j4451M03714B25782o1523M46672f2487B84008G9902Q5009
15005A64911A6380K3977J11444L7328m9316Q1856J49248p0440J10501a41970C12158
14993c945F5752j6820b6933A92377M7278G0768J73526P6362G4803K50352j12982
14982B12173a632E50581j59250A03389J28795K25243A06097O9617c20659D05236
14971D28838C4357J66720a06469A16984K08179R0391a4899D49777j9215j99727
14961B30835m8507N6398o1306L36636k43770J86448j44663D9085L65824A15169
14950B99960F4178Q2728J34951Q8361J51815B18372L4338R5622n0822n1053a1209
$$ plain form
14938 279502 384289 452150 400988 -44906 273631 251713 336723 416865 175719 251530 350736
14927 350736 82967 373070 30744 60349 489783 28390 153297 479497 189635 59143
14916 415621 -14323 417860 297136 261920 182850 128406 351538 52296 366111 27499 449654
14905 449654 503125 258403 283142 481273 361874 162738 220836 349686 274840 297662
14895 297662 279720 354962 265082 112368 -53386 324220 377379 455596 368566 326583 280012
14884 280012 371743 421075 340747 598417 441537 433155 345704 235292 152165 467487 531211
14873 531211 474457 276838 63268 361635 543746 46313 481978 378686 127987 391929
14863 391929 256025 221186 258401 209545 790462 392441 366530 501311 406807 646378
$$ packed form
14938B79502J04787O7861n1162d4906B73631k1918Q5010Q0142A75719P5811R9206
14927C50736H2967K90103C0744K9605M29434B8390J24907L26200A89635E9143
14916D15621a4323D17860j20724l5216p9070n4444K23132E2296L13815B7499M22155
14905D49654N3471k44722K4739J98131j19399A62738N8098J28850p4846K2822
14895B97662j7942P5242q9880A12368e3386C24220N3159P8217q7030m1983m6571
14884B80012R1731M9332q0328K57670j56880q382q7451j10412q3127L15322O3724
14873E31211n6754j97619F3268K98367J82111D6313M35665j03292A27987K63942
14863C91929j35904l4839L7215m8856N80917C92441k5911J34781r4504K39571
$$ plain form
14853 646378 300841 554010 563027 367605 431086 472177 527441 157740 469651 285063
14843 285063 529215 417137 588424 751617 262378 446115 241636 573008 645213 200214
14832 436967 458687 553311 266624 331912 211179 294928 153930 390397 491719 241854
14821 421823 520980 595604 368976 592040 434482 519131 627029 943996 374035 517800
14811 517800 347350 452334 590972 537283 279939 399188 803611 241286 213494 350413
14801 350413 709574 461133 540411 535464 370989 182199 312445 195344 416734 388769
14791 388769 519889 368424 420629 493156 720475 456456 624454 344065 789102 781653
14781 781653 593565 670366 537738 684989 883851 503686 753675 914058 495662 527644
$$ packed form
14853F46378C00841K53169R017j95422O3481M1091N5264A57740L11911j84588
14843B85063K44152j12078J71287J63193B62378J83737k04479L31372P2205B00214
14832D36967K1720R4624B66624O5288j20733Q3749j40998K36467J01322B41854
14821D21823R9157P4624k26628K23064j57558Q4649J07898L16967C74035J43765
14811E17800j70450J04984J38638n3689k57344J19249M04423B41286k7792J36919
14801C50413L59161k48441P9278m947j64475A82199J30246j17101K21390k7965
14791C88769J31120j51465N2205P2527K27319k64019J67998k80389M45037p449
14781G81653j88088P6801j32628J47251J98862l80165K49989J60383m18396L1982
$$ plain form
14771 527644 226071 558051 405175 642555 571436 534598 507535 905810 675195 659201
14761 659201 435647 865645 558876 401698 638869 830608 517918 906765 645161 754997
14751 754997 778907 414685 759644 991281 404819 919268 673060 818852 747498 611077
14741 611077 694115 609184 338357 851145 294870 595811 770245 813402 969896 638405
14731 638405 709966 773012 693466 742055 768473 989581 579729 1012230 855416 922575 604823
14720 604823 1078492 770843 670443 1004578 748024 787908 705084 844031 829425 812552
14710 812552 509813 662413 807987 628215 617033 649192 779763 1072106 753553 889964
14700 889964 1059893 679296 618638 1071838 831008 765118 986976 846645 794780 864139
$$ packed form
14771E27644B26071L31980j52876K37380p1119l6838k7063L98275k30615j5994
14761F59201k23554M29998l06769j57178K37171J91739l12690L88847k61604J09836
14751G54997K3910l64222L44959K31637D04819N14449k46208J45792p1354j36421
14741F11077Q3038q4931k70827N12788B94870L00941J74434M3157J56494l31491
14731F38405P1561O3046p9546M8589K6418K21108m09852M32501j56814O7159l17752
14720F04823M73669l07649j00400L34135k56554L9884q2824J38947j4606j6873
14710H12552l02739J52600J45574j79772j1182L2159J30571K92343l18553J36411
14700H89964J69929l80597o0658M53200k40830o5890K21858j40331n1865O9359
$$ plain form
14690 864139 1007038 817457 1001298 981880 762775 980615 1125134 691524 1052812 1127948
14680 1127948 1171560 896042 822719 946917 1217599 821298 824982 887058 1047811 965374
14670 965374 1321458 1241529 889097 1151751 902207 1033049 975036 1159161 1296969 1193905
14660 1193905 1220512 961909 1121558 1135903 1108064 1042872 1197990 1093108 1377104 930682
14650 930682 1224799 1466327 1557808 1309302 1229669 1187155 1249520 1357633 1070440 1411178
14640 1411178 1227250 1393639 1300333 1240275 1279303 1339643 1544394 1092756 1470686 1015060
14630 1015060 1416564 1217146 1599879 1201768 2099855 1413734 1463475 1339706 1304989 1755344
14620 1755344 1330002 1263437 1158004 1359917 1602140 1379665 1632108 1447952 1503621 1496072
$$ packed form
14690H64139J42899j89581J83841j9418k19105K17840J44519m33610L61288P5136
14680A127948M3612k75518p3323J24198K70682l96301L684O2076J60753q2437
14670I65374L56084p9929l52432K62654k49544J30842n8013J84125J37808j03064
14660A193905K6607k58603J59649J4345k7839o5192J55118j04882K83996m46422
14650I30682K94117K41528R1481k48506p9633m2514O2365J08113k87193L40738
14640A411178j83928J66389r3306o0058L9028O0340K04751m51638L77930m55626
14630A015060M01504j99418L82733l98111Q98087o86121M9741j23769l4717M50355
14620A755344m25342o6565j05433K01913K42223k22475K52443j84156N5669p549
$$ plain form
14610 1496072 1319882 1528728 1740498 1562636 1593043 1653765 1373307 1528215 1568189 1794134
14600 1794134 1811218 1967447 1965348 1793047 1583420 1539635 1753148 1570288 1880791 1930470
14590 1930470 1597072 1699249 2061280 1736404 2271667 1726280 2041829 2160529 2075305 1633435
14580 1633435 2150280 2308276 2061112 2176219 2192345 2296743 2020698 2360091 2252492 2283398
14570 2283398 2524944 2219669 2670124 2244907 2271803 2149070 2532177 2684843 2787869 2765529
14560 2765529 2770038 2875546 2978648 2978424 2904253 3411420 3800292 4001085 4223003 4678619
14550 4678619 6188207 7460025 11392356 20489658 37102221 39796153 25259167 13200245
14542 13200245 6982559 4189990 2739763 2387883 1948717 2380600 1928618 1992072 2160694
$$ packed form
14610A496072j76190K08846K11770j77862L0407O0722k80458J54908L9974K25945
14600A794134J7084J56229k099j72301k09627m3785K13513j82860L10503M9679
14590A930470l33398J02177L62031l24876N35263n45387L15549J18700q5224m41870
14580A633435N16845J57996k47164J15107J6126J04398k76045L39393j07599L0906
14570B283398K41546l05275M50455m25217K6896j22733L83107J52666J03026k2340
14560B765529M509J05508J03102k24p4171N07167L88872K00793K21918M55616
14550D678619J509588J271818L932331R097302J6612563K693932j4536986j2058922
14542A3200245o217686k792569j450227l51880m39166M31883m51982O3454J68622
$$ plain form
14533 2160694 1968219 2340545 2198697 2477445 2378584 2007675 2485162 2454143 2431159 2100546
14523 2100546 2249345 2363702 2627902 2202956 2623193 2978301 2628130 2788915 2484284
14514 2484284 2702592 2888282 2825136 2851572 2915546 2897142 2861070 3078174 3240680 3041013
14504 3041013 3203799 3477410 3445309 3285358 3206521 3350381 3566094 3561127 3595349 3315959
14494 3315959 3596492 3495901 3483838 3506501 3705235 3602096 3548998 3832924 3743637 3875415
14484 3875415 3776474 3619082 4067607 4046386 3870801 3918820 4086818 3899454 4388293 4077705
14474 4077705 4030624 4358856 4395234 4204195 4324295 4786292 4621020 4664598 4545421 5028341
14464 5028341 5037818 4731146 5269347 5241229 5309627 4561009 5411276 4872877 5196335 5407209
$$ packed form
14533B160694j92475L72326j41848K78748r8861l70909M77487l1019k2984l30613
14523B100546J48799J14357K64200m24946M20237L55108l50171J60785l04631
14514B484284K18308J85690o3146K6436O3974j8404l6072K17104J62506j99667
14504C041013J62786K73611l2101j59951p8837J43860K15713m967L4222k79390
14494C315959K80533j00591j2063K2663J98734j03139n3098K83926q9287J31778
14484C875415r8941j57392M48525k1221j75585M8019J67998j87364M88839l10588
14474D077705m7081L28232L6378j91039J20100M61997j65272M3578j19177M82920
14464E028341R477l06672N38201k8118O8398p48618Q50267n38399L23458K10874
$$ plain form
14454 5407209 5300108 5560509 5667545 5788967 5671262 5418746 5827367 5772920 5836023 5934700
14444 5934700 6161810 6347048 6267476 6386617 6264511 6699944 6591655 6635651 6719048 6696474
14434 6696474 6801473 7011296 7012454 7353263 7489962 7108397 7726975 7714889 7192001 7569667
14424 7569667 8073944 7861757 8265614 8149548 8344342 8216682 8558410 8729731 8500227
14415 8500227 8835972 8687568 8999494 9290478 9145439 9365707 9865269 9543588 9729948
14406 9729948 10097527 10477676 10297542 10530575 10661229 10953954 11046897 11315864 11411415 11596349
14396 11596349 11959625 11928529 12105171 12141423 12539701 12509781 13017830 13085247 13620421 13496055
14386 13496055 13731061 14192601 14531287 14764773 14661915 15195658 15375349 15749867 15757155 16111381
$$ packed form
14454E407209j07101K60401J07036J21422j17705k52516M08621n4447O3103R8677
14444E934700K27110J85238p9572J19141j22106M35433j08289M3996Q3397k2574
14434F696474J04999K09823J158L40809J36699l81565O18578j2086n22888L77666
14424G569667N04277k12187M03857j16066J94794j27660L41728J71321k29504
14415H500227L35745j48404L11926K90984j45039K20268M99562l21681J86360
14406I729948L67579L80149j80134K33033J30654K92725R2943K68967R5551J84934
14396A1596349L63276l1096J76642L6252L98278k9920N08049O7417N35174j24366
14386A3496055K35006M61540L38686K33486j02858N33743J79691L74518P288L54226
$$ plain form
14376 16111381 16798562 16853116 17512412 17400451 17908516 17917159 18342603 18863932 18975957 19344752
14366 19344752 20233421 20040817 20460612 21075986 21419670 22090169 22400746 23424356 23860779
14357 23860779 23824170 24621877 25321178 25655669 26244804 27350720 27851819 28588601 29079928
14348 29079928 29754450 30558681 31354302 32134584 32810936 33716410 34517336 35508402 36648883
14339 36648883 37874792 38644374 40049683 40725741 42013616 43114610 44254029 45877526
14331 45877526 47473039 48623368 50267800 51735221 53173854 54960829 56595088 59002957
14323 59002957 60475241 62585092 65042521 66930197 69414764 71775145 74688679 77501256
14315 77501256 80196813 83006699 86444549 89706168 93569753 96883365 100949723 104990975
$$ packed form
14376A6111381O87181N4554O59296j11961N08065Q643M25444N21329J12025L68795
14366A9344752Q88669j92604M19795O15374L43684O70499L10577J023610M36423
14357B3860779l6609P97707O99301L34491N89135J105916N01099P36782M91327
14348B9079928O74522Q04231P95621P80282O76352R05474Q00926R91066J140481
14339C6648883J225909P69582J405309O76058J287875J100994J139419J623497
14331D5877526J595513J150329J644432J467421J438633J786975J634259K407869
14323E9002957J472284K109851K457429J887676K484567K360381K913534K812577
14315G7501256K695557K809886L437850L261619L863585L313612M066358M041252
$$ plain form
14307 104990975 109520448 113931485 119143514 123937574 129631093 135373647 141727755 148092638
14299 148092638 155063282 162432840 170001836 178109623 186568255 195835399 205069907 214790695
14291 214790695 225610926 236719700 248011796 260272048 272955428 285684006 299271276
14284 299271276 313077854 327184026 341426762 356011817 370107940 384516651 397909195
14277 397909195 411020454 423061516 433873948 443235814 450562730 453849695 453640290 452243721
14269 452243721 449970529 449251319 446055554 441863046 435246160 427101229 416794538 404708411
14261 404708411 391498689 377375928 362857904 347600754 332512487 317323455 302734757
14254 302734757 289284673 275526197 262244092 249423313 237254859 225916942 215082245
$$ packed form
14307A04990975M529473M411037N212029M794060N693519N742554O354108O364883
14299A48092638O970644P369558P568996Q107787Q458632R267144R234508R720788
14291B14790695J0820231J1108774J1292096J2260252J2683380J2728578J3587270
14284B99271276J3806578J4106172J4242736J4585055J4096123J4408711J3392544
14277C97909195J3111259J2041062J0812432R361866P326916L286965k09405j396569
14269D52243721k273192p19210l195765m192508o616886q144931j0306691j2086127
14261D04708411j3209722j4122761j4518024j5257150j5088267j5189032j4588698
14254C02734757j3450084j3758476j3282105j2820779j2168454j1337917j0834697
$$ plain form
14247 215082245 204458092 194599843 185238080 176804488 168605307 160739201 153347045 146316478
14239 146316478 139907102 133966392 128502672 122788718 117468698 112523324 108097488 103295254
14231 103295254 99464068 95761123 91891474 88557608 85269831 81717598 78511114 75648544
14223 75648544 73069169 70437726 68115972 65988013 63709790 61450426 59443541 57547970
14215 57547970 55627241 54049326 52792263 51105307 49385551 47775792 46254909 45425457
14207 45425457 44261468 43080412 41870596 40573578 39331524 38214719 37455573 36693345
14199 36693345 35371475 34717989 33517915 32806164 32144063 31198417 30739149 29773335 28960146
14190 28960146 28414579 27698609 27020569 26327071 25683403 25020281 24533337 24288847 23667698
$$ packed form
14247B15082245j0624153r858249r361763q433592q199181p866106p392156p030567
14239A46316478o409376n940710n463720n713954n320020m945374m425836m802234
14231A03295254l831186l702945l869649l333866l287777l552233l206484k862570
14223G5648544k579375k631443k321754k127959k278223k259364k006885j895571
14215E7547970j920729j577915j257063j686956j719756j609759j520883q29452
14207D5425457j163989j181056j209816j297018j242054j116805p59146p62228
14199C6693345j321870o53486j200074p11751o62101r45646m59268r65814q13189
14190B8960146n45567p15970o78040o93498o43668o63122m86944k44490o21149
$$ plain form
14181 23667698 22971793 22559067 22009885 21249401 20806288 20746425 20282637 19997389 19322705
14172 19322705 19024010 18551188 18162038 18009986 17510932 17191025 17108956 16628185 16179675
14163 16179675 15791807 15865610 15402847 14721152 14889751 14699503 14242877 13825425 13801222 13550613
14153 13550613 13422755 13310291 12529195 12848943 12586789 12400845 12157100 11745038 11722106
14144 11722106 11522401 11392274 10939443 11033857 11020327 10643419 10468363 10541654 10168688 10040229
14134 10040229 9924813 9793011 9525072 9495612 9530192 9118624 9132277 8793074 8925984 8701202
14124 8701202 8603345 8596484 8757220 8111653 8575560 8132889 8075999 7788709 7617925 7853635
14114 7853635 7571764 7357130 7553041 7251801 6901876 7080044 7042581 6848774 6746041 6808365
$$ packed form
14181B3667698o95905m12726n49182p60484m43113n9863m63788k85248o74684
14172A9322705k98695m72822l89150j52052m99054l19907q2069m80771m48510
14163A6179675l87868P3803m62763o81695J68599j90248m56626m17452k4203k50609
14153A3550613j27858j12464p81096L19748k62154j85944k43745m12062k2932
14144A1722106j99705j30127m52831R4414j3530l76908j75056P3291l72966j28459
14134A0040229j15416j31802k67939k9460L4580m11568J3653l39203J32910k24782
14124H701202r7857o861J60736o45567M63907m42671n6890k87290j70784K35710
14114G853635k81871k14634J95911l01240l49925J78168l7463j93807j02733O2324
$$ plain form
14104 6808365 6852072 6798755 6698675 6517006 6236721 6062351 6455208 6058856 6256346 6065485
14094 6065485 5955580 5547697 5519092 5095732 5622737 5401762 5373046 5301523 5420917 5132597
14084 5132597 5343793 5070531 5146567 4999893 5202137 5129528 4842450 4833411 4915042 4783555
14074 4783555 4513226 4675416 4244165 4505878 4800024 4524154 4508844 4567505 4359740 4571794
14064 4571794 4345205 4184149 4198251 4115590 4460835 4607074 4273146 4033092 4234840 4021964
14054 4021964 4085722 3752587 3858266 3494094 3838893 3578861 3467139 3497900 3197720 3719703
14044 3719703 3521548 3425598 3695576 3497458 3004967 3397795 3675606 3572453 3335200 3404447
14034 3404447 3230025 2985497 3111531 3517009 3232183 2988553 3173417 3027654 2856932
$$ packed form
14104F808365M3707n3317j00080j81669k80285j74370L92857l96352J97490j90861
14094F065485j09905m07883k8605m23360N27005k20975k8716p1523J19394k88320
14084E132597K11196k73262P6036j46674K02244p2609k87078r039Q1631j31487
14074D783555k70329J62190m31251K61713K94146k75870j5310N8661k07765K12054
14064D571794k26589j61056J4102q2661L45245J46239l33928k40054K01748k12876
14054D021964O3758l33135J05679l64172L44799k60032j11722L0761l00180N21983
14044C719703j98155r5950K69978j98118m92491L92828K77811j03153k37253O9247
14034C404447j74422k44528J26034M05478k84826k43630J84864j45763j70722
$$ plain form
14025 2856932 2820711 2691008 2983161 2761087 2812024 2652565 2902759 2640622 2537585 2344295
14015 2344295 2858513 2891318 2475832 2487669 2194420 2370445 2820003 2543686 2462309 2492190
14005 2492190 2204693 2411604 2404540 2303320 2114988 2097395 2224361 2348752 2462137 2132073
13995 2132073 2210202 2252067 2039826 2496435 2511031 2854398 3197291 6209156 13971505 31337733
13985 31337733 40431919 28079846 16197670 9732462 6901286 5331838 4374443 4016876
13977 4016876 3965993 3350982 3090344 3055804 2857608 2871689 2586629 2378660 2307716 2248840
13967 2248840 2590246 2619418 2511384 2451705 2542115 2239570 2155511 2120608 2272140 2436791
13957 2436791 2332968 2383540 2343168 2189467 1946329 2426453 2240183 2043457 1989823 1914952
$$ packed form
14025B856932l6221j29703K92153k22074N0937j59459K50194k62137j03037j93290
14015B344295N14218L2805m15486J1837k93249J76025M49558k76317q1377K9881
14005B492190k87497K06911p064j01220j88332j7593J26966J24391J13385l30064
13995B132073P8129M1865k12241M56609J4596L43367L42893L011865P762349J7366228
13985C1337733R094186j2352073j1882176o465208k831176j569448r57395l57567
13977D016876n0883o15011k60638l4540j98196J4081k85060k07969p0944n8876
13967B248840L41406K9172j08034n9679R0410l02545q4059l4903J51532J64651
13957B436791j03823N0572m0372j53701k43138M80124j86270j96726n3634p4871
$$ plain form
13947 1914952 1851113 2132327 1709742 2096442 1982373 2002025 1939971 1358950 1913461 2214466
13937 2214466 1812591 1949117 1757457 1702616 1538442 1747966 1700244 1871640 1816847 1885639
13927 1885639 1646321 1786332 1605666 1451474 1890640 1467615 1614594 1740173 1814555 1597953
13917 1597953 1721921 1658883 1568722 1302109 1494238 1418244 1473721 1788032 1676346 1169888
13907 1169888 1527311 1867498 1633143 1487648 1450880 1426062 1263291 1257984 1324553 1689740
13897 1689740 1330703 1384445 1537095 1260386 1148405 1322129 1509450 1357055 1145602 1286059
13887 1286059 1307161 1408535 1425661 1201413 1352489 1378086 1362205 1481374 1364076 1373645
13877 1373645 1639436 1454316 1361903 1305663 1435607 1212319 1583633 1249067 1131683 1428290
$$ packed form
13947A914952o3839K81214m22585L86700j14069J9652o2054n81021N54511L01005
13937B214466m01875J36526j91660n4841j64174K09524m7722J71396n4793O8792
13927A885639k39318J40011j80666j54192M39166m23025J46979J25579P4382k16602
13917A597953J23968o3038r0161k66613J92129p5994N5477L14311j11686n06458
13907A169888L57423L40187k34355j45495l6768k4818j62771n307O6569L65187
13897A689740l59037N3742J52650k76709j11981J73724J87321j52395k11453J40457
13887A286059K1102J01374J7126k24248J51076K5597j5881J19169j17298R569
13877A373645K65791j85120r2413n6240J29944k23288L71314l34566j17384K96607
$$ plain form
13867 1428290 928483 1169467 1243402 1073734 1077159 860168 1196851 971036 1263641 1329514
13857 1329514 1242538 1296875 1115410 887688 1138735 1451518 1123868 940795 1229727 1273396
13847 1273396 1227501 1071007 1073738 1112023 807222 812519 957386 953260 946585 1343246 954254
13836 954254 829003 1221422 1160310 1243213 1032908 818304 1156698 1204706 743657 1075295
13826 1075295 916734 1216110 1173940 909122 621843 1158906 951315 724007 1122803 876293
13816 876293 880133 887507 793400 875822 1119971 802565 1163064 1264537 910958 829798 869626
13805 869626 470537 904425 976838 1060566 828992 828287 1237344 655516 659616 724832 922105
13794 922105 809057 1090005 696309 635079 1120602 1157285 950477 640094 919611 916851
$$ packed form
13867A428290m99807K40984P3935j69668L425k16991L36683k25815K92605O5873
13857A329514q6976N4337j81465k27722K51047L12783l27650j83073K88932M3669
13847A273396m5895j56494K731L8285l04801N297J44867m126o675L96661l88992
13836I54254j25251L92419o1112Q2903k10305k14604L38394M8008m61049L31638
13826A075295j58561K99376m2170k64818k87279N37063k07591k27308L98796k46510
13816H76293L840P374r4107Q2422K44149l17406L60499J01473l53579q1160L9828
13805H69626l99089M33888P2413Q3728k31574p05M09057n81828M100O5216J97273
13794I22105j13048K80948l93696o1230M85523L6683k06808l10383K79517k760
$$ plain form
13784 916851 729224 613765 502349 748240 832078 588685 481567 776094 650512 1063962
13774 1063962 939410 692870 899975 786156 741245 856189 827296 1189523 720764 669405
13764 669405 913996 989697 563228 400692 727683 625395 793771 759180 472551 796204
13754 796204 653248 602840 650545 552595 505827 573140 543388 1006920 440528 627079 614755
13743 614755 687448 613778 793448 845808 624550 615553 729871 516739 447524 719141 687787
13732 687787 615097 960384 386787 722980 261544 459168 413904 701319 599630 470972
13722 470972 549477 598688 501877 617561 458861 401981 512919 489721 753929 612199
13712 612199 446806 614947 337540 677353 418832 388583 837571 649164 348926 588194
$$ packed form
13784I16851j87627j15459j11416K45891Q3838k43393j07118K94527j25582M13450
13774A063962j24552k46540K07105j13819m4911J14944k8893L62227m68759n1359
13764F69405K44591P5701m26469j62536L26991j02288J68376l4591k86629L23653
13754G96204j42956n0408M7705r7950m6768O7313k9752M63532D40528J86551j2324
13743F14755P2693p3670J79670N2360k21258q997J14318k13132o9215K71617l1354
13732F87787p2690L45287C86787L36193B61544J97624m5264K87415j01689j28658
13722D70972P8505M9211r6811J15684j58700n6880J10938k3198K64208j41730
13712F12199j65393J68141k77407L39813k58521l0249M48988j88407l00238K39268
$$ plain form
13702 588194 627060 452454 708441 483736 451281 466778 759102 596168 402840 228027
13692 228027 421054 562024 718247 327277 678446 565037 205704 563962 670036 411166
13682 411166 686649 235208 581154 287317 591293 582532 726231 453796 627261 333285
13672 333285 526196 510198 331251 509451 811932 664426 617023 394138 617322 590731
13662 590731 656286 591714 444858 530392 486720 363739 473714 394048 509356 504850 607727
13651 607727 668363 544175 524690 497700 162636 603494 179541 232515 809018 326079
13640 563345 742593 408022 345520 351011 510798 580563 411172 644957 625388 843252
13630 843252 287366 509206 264391 672296 526578 397446 553110 416500 397690 228336
$$ packed form
13702E88194L8866j74606K55987k24705l2455J5497K92324j62934j93328j74813
13692B28027J93027J40970J56223C27277L51169j13409B05704L58258J06074k58870
13682D11166K75483B35208L45946B87317L03976q761J43699k72435J73465k93976
13672C33285J92911j5998j78947J78200L02481j47506m7403k22885K23184k6591
13662E90731O5555o4572j46856Q5534m3672j22981J09975p9666J15308m506J02877
13651F07727O0636j24188j9485k6990A62636M40858A79541N2974N76503C26079
13640E63345J79248l34571o2502N491J59787O9765j69391K33785j9569K17864
13630H43252B87366K21840k44815M07905j45718j29132J55664j36610j8810j69354
$$ plain form
13620 228336 789511 342482 458031 463675 510032 384755 420653 261621 440651 443570 347494
13609 347494 192255 179176 426737 610765 -30801 327522 673307 619594 461089 308196
13599 308196 641529 600245 373996 253407 359950 226139 313937 233014 -99659 306098
13588 489768 235231 403949 463379 575149 412666 542044 384452 76633 321201 130476
13577 472174 244603 318730 373927 639593 312096 384542 261110 334065 300107 309856 259930
13566 259930 489344 237482 359252 725365 387963 468888 435780 448813 482052 521610
13556 521610 334664 257289 330033 552426 196484 317258 126376 276294 545661 593801
13546 593801 591173 166723 402383 337648 176054 454708 543974 418880 511392 415830 315169
$$ packed form
13620B28336N61175C42482J15549N644M6357j25277L5898j59032J79030K919r6076
13609C47494j55239j3079K47561J84028c0801C27522L45785n3713j58505j52893
13599C08196L33333m1284k26249j20589J06543j33811Q7798q0923i9659C06098
13588D89768B35231J68718N9430J11770j62483J29378j57592G6633K44568A30476
13577D72174k27571P4127N5197K65666C12096P2446j23432P2955l3958R749m9926
13566B59930K29414B37482J21770L66113l37402Q0925l3108J3033L3239L9558
13556E21610j86946p7375P2744K22393A96484J20774A26376J49918K69367M8140
13546E93801k628A66723K35660o4735j61594K78654Q9266j25094R2512r5562j00661
$$ plain form
13535 315169 560462 16226 190451 -95602 460472 223569 371365 241501 251906 273829
13525 273829 437602 327613 285900 367053 136470 438693 331007 411219 371046 247846
13515 247846 202136 423980 38253 -10550 374622 311693 441101 154068 207887 393784
13505 393784 448546 183320 434589 264721 292047 169039 303380 461772 212226 218235
13495 218235 94206 421336 156726 271102 251799 364725 170303 52191 192424 358299
13485 358299 -24959 412708 179782 301616 286729 74962 348528 232093 654804 356724
13475 356724 352641 286170 384431 144957 78848 189726 369318 6559 298490 94116 234850
13464 234850 396231 584493 -5515 416168 332985 -39754 115756 -20736 244427 172752 467376
$$ packed form
13535C15169K45293A6226J74225i5602D60472B23569J47796j29864J0405K1923
13525B73829J63773j09989m1713Q1153A36470L02223j07686Q0212m0173j23200
13515B47846m5710K21844C8253a0550C74622o2929J29408A54068N3819J85897
13505C93784N4762A83320K51269j69868K7326j23008J34341J58392B12226O009
13495B18235I4206L27130A56726J14376j9303J12926A70303E2191J40233J65875
13485C58299b4959D12708A79782J21834j4887G4962K73566j16435M22711k98080
13475C56724m083o6471R8261A44957o6109J10878J79592F559K91931I4116J40734
13464B34850J61381J88262e515D16168q3183c9754A15756b0736B44427p1675K94624
$$ plain form
13453 467376 220223 283282 317473 60207 50748 303833 197991 361266 199446 -1364 552970
13441 176807 15929 363895 194389 -135403 349473 260108 416350 365054 116269 460817
13431 460817 568074 349924 287606 315053 119554 195669 203127 375447 195255 118144 123196
13420 123196 321894 34968 226619 427626 138767 1610 46472 350022 24279 241211
13410 241211 492685 123633 387590 -81869 365078 -51462 167012 170544 -42970 127687
13399 255729 468278 325345 -12074 182734 218074 -30057 584289 -29586 221131 263075
13389 263075 248338 174669 164518 92579 175800 109484 75694 284902 266964 572592 85741
13377 160703 237445 62925 240099 262885 -58481 184724 558982 10859 350717 218386
$$ packed form
13453D67376B20223O3059L4191F0207r459K53085j05842J63275j61820a364E52970
13441A76807A5929L47966j69506a35403C49473q9365J56242n1296A16269L44548
13431D60817J07257k18150o2318K7447A19554P6115P458J72320j80192p7111N052
13420A23196J98698C4968J91651K01007A38767A610M4862L03550B4279K16932
13410B41211K51474A23633K63957h1869C65078e1462A67012L532d2970A27687
13399B55729K12549j42933a2074A82734L5340c0057E84289b9586B21131M1944
13389B63075j4737p3669j0151p1939Q3221o6316l3790K09208j7938L05628H5741
13377A60703P6742F2925J77174K2786e8481A84724L74258A0859L39858j32331
$$ plain form
13367 218386 384088 391487 332232 228107 247832 -38299 -325646 168421 402525 420180 63392
13355 575895 272706 221583 -34680 -151526 -66764 21268 121622 380208 458374 321010
13345 321010 263447 241343 330856 514591 480540 274800 227845 281002 516094 9229 39330
13334 39330 40878 694764 507085 363299 -2199 27910 327705 416334 392586 610320 142419
13322 90659 320471 287473 -108487 88228 109517 257702 480370 719552 412811 243493
13312 243493 112996 203548 51467 227442 68946 319554 225795 188988 -217508 230983
13301 -353267 77833 29586 394256 97597 376981 182474 252445 231675 205687 356293 -117733
13289 345206 -28565 71969 300130 55957 129897 14702 231367 36306 56296 53130 187591
$$ packed form
13367B18386J65702P399n9255j04125J9725c8299k87347A68421K34104J7655F3392
13355E75895B72706n1123c4680j16846f6764B1268J00354K58586P8166j37364
13345C21010n7563k2104Q9513J83735l4051k05740m6955N3157K35092I229L0101
13334C9330J548O53886j87679j43786b199B7910K99795Q8629k3748K17734A42419
13322I0659K29812l2998a08487H8228K1289J48185K22668K39182l06741j69318
13312B43493A12996R0552E1467J75975F8946K50608r3759l6807b17508B30983
13301c53267G7833B9586L64670I7597K79384A82474O9971k0770k5988J50606a17733
13289C45206b8565G1969K28161E5957P3940A4702K16665C6306J9990l166J34461
$$ plain form
13278 187591 246056 83388 160177 100233 254265 -50114 231083 179006 56105 228212 126882
13267 126882 449727 44666 458644 136059 6579 289890 345063 -326715 150222 182306
13257 182306 399081 -157854 1781 -141755 309317 -213960 -39019 326822 221303 292481
13247 292481 314023 -42344 -136480 -198298 141761 27584 16085 149455 -41270 -41540 232918
13235 341750 -123412 -220822 62105 272996 -196379 284744 322822 142605 218240 39460
13224 -26725 106899 165814 189942 278509 577826 -117978 234541 -108324 75779 386742
13214 386742 309363 122881 204786 271150 287089 252326 -90416 233093 -3614 -18773 212792
13202 293405 136323 127202 120043 209191 270087 -160167 -57164 389767 148997 203537 110567
$$ packed form
13278A87591N8465H3388P6789n9944J54032e0114B31083n2077E6105J72107j01330
13267A26882L22845D4666M13978A36059F579K83311N5173c26715A50222L2084
13257A82306K16775a57854A781a41755C09317b13960c9019C26822j05519P1178
13247B92481K1542d2344r4136o1818A41761B7584j1499J33370d1270k70B32918
13235C41750a23412r7410F2105K10891a96379B84744L8078A42605P5635C9460
13224b6725A06899N8915K4128Q8567K99317a17978B34541a08324G5779L10963
13214C86742p7379A22881Q1905O6364J5939l4763i0416B33093c614j5159B12792
13202B93405A36323r121p159Q9148O0896a60167e7164C89767A48997N4540r2970
$$ plain form
13191 110567 85788 193447 58202 116285 130530 178777 190827 -183342 -152285 141909 209518
13180 209518 77553 -53787 229282 79130 95608 216869 290668 -138564 344766 -42537 54161
13168 93992 79838 210033 -224339 -63373 -19977 94395 -199398 157625 145408 132907 54190
13156 -50437 180334 360098 170303 -36081 111279 260018 126299 245829 58261 -217156
13145 188552 80375 -138420 -68256 152259 202133 -110496 -172299 157365 67489 22989 270797
13134 270797 179262 23362 272828 -184116 27436 230368 203199 124829 242586 95175 179738
13123 179738 -41464 328053 146538 -71943 205080 364915 424017 11138 140430 259477
13113 259477 47969 90145 -245146 -158530 282201 -101326 137908 420850 150528 -190568
$$ packed form
13191A10567k4779J07659E8202N8083J4245M8247J2050a83342L1057A41909O7609
13180B09518G7553e3787B29282G9130J6478J21261P3799a38564C44766d2537E4161
13168I3992j4154J30195b24339f3373a9977I4395a99398A57625j2217j2501E4190
13156e0437A80334J79764A70303c6081A11279J48739A26299J19530E8261b17156
13145A88552H0375a38420f8256A52259M9874a10496o1803A57365F7489B2989K47808
13134B70797r1535B3362K49466a84116B7436K02932k7169p8370J17757I5175Q4563
13123A79738d1464C28053A46538g1943B05080J59835N9102A1138J29292J19047
13113B59477D7969M2176b45146Q6616B82201a01326A37908K82942A50528a90568
$$ plain form
13102 25852 -37523 130688 236532 155243 308835 7334 -23376 278672 -97572 -374670 -23974
13090 -351234 5938 149435 226946 -148605 -91818 -160580 155352 -159445 95608 19357 559152
13079 559152 291236 97218 26400 -73876 253902 66278 49810 50652 160916 50335 201938
13068 201938 -186653 55468 331141 336435 228376 -337131 212 166764 279009 170297 429133
13057 429133 284974 169901 -75540 112913 94715 50293 -129606 102959 135886 29118
13046 267397 69143 195965 114074 197891 -329252 219742 302891 154506 307889 -102676
13035 263939 112731 1387 225082 86584 -75381 82362 168079 74616 178944 218501 99267
13023 215873 460030 204538 -33306 91737 -43790 -176149 330649 151383 127050 153081
$$ packed form
13102B5852c7523A30688J05844q1289J53592G334b3376B78672i7572k77098b3974
13090c51234E938J43497P7511a48605N6787o8762A55352a59445I5608A9357N39795
13079E59152k67916I7218B6400g3876B53902F6278j6468Q42J10264E0335J51603
13068B01938a86653E5468K75673N294j08059c37131B12J66552J12245j08712K58836
13057D29133j44159j15073g5540A12913j8198m4422a29606A02959L2927B9118
13046B67397F9143J26822q1891Q3817c29252B19742Q3149j48385J53383a02676
13035B63939A12731A387K23695H6584g5381H2362Q5717G4616J04328L9557I9267
13023B15873K44157B04538c3306I1737d3790j32359C30649A51383k4333K6031
$$ plain form
13013 153081 -93400 104577 233694 -73986 -6501 11913 119297 111865 75988 178581 14321
13001 174405 134271 19429 -28440 525351 -134096 132986 82693 -10523 241405 145623 -45676
12989 -166795 75794 93360 -86366 -166757 259779 -143511 204396 -160779 162934 -72271
12978 58511 180782 -56577 9472 -84545 357617 -44870 203594 224998 74541 39205 101066
12967 101066 56908 -4020 320791 257620 824 -80760 275919 43149 331230 199884 107129
12956 107129 215742 -88870 -30147 52611 226041 50165 -108562 226297 194706 168904 161052
12945 161052 72153 15028 -90893 -50136 30288 -103991 255303 -260936 103274 192839 -14325
12933 164754 -84264 -134561 150367 -102792 -193277 42982 -174926 103540 470920 320766
$$ packed form
13013A53081i3400A04577J29117g3986f501A1913J07384p432l5877J02593A4321
13001A74405m0134A9429b8440E25351a34096A32986n0293a0523B41405r5782d5676
12989a66795G5794J7566h6366q0391B59779a43511B04396a60779A62934g2271
12978E8511J22271e6577I472h4545C57617d4870B03594K1404G4541l5336O1861
12967A01066m4158d020C20791o3171H24h0760B75919D3149K88081j31346r2755
12956A07129J08613h8870c0147E2611J73430E0165a08562B26297l1591k5802p852
12945A61052G2153A5028i0893M0757C0288a03991B55303b60936A03274Q9565a4325
12933A64754h4264n0297A50367a02792r0485D2982a74926A03540L67380j50154
$$ plain form
12923 320766 -33800 -46455 50521 37135 -116734 -123098 -244276 124469 6374 282746 173349
12912 173349 175099 -9323 168017 9949 140360 47714 66876 -116468 -121142 -12109 -62466 -256438
12900 -256438 53082 218472 -90905 132653 146880 112729 -224834 -192568 25659 9003 123050
12889 123050 -33628 196126 -34658 288183 68685 239355 -126577 -30730 -137667 100575
12878 192976 2172 -83428 54926 -164020 -24947 -220370 -48729 235274 5279 -17545 -5857
12866 548178 270314 263090 -28267 -342296 97172 -234004 -60542 -14233 129139 307201 203812
12855 203812 105655 75130 209870 -311193 -49983 21265 11852 108481 72560 379097 272836
12844 272836 81999 -86437 294126 92393 169668 -239160 -60526 -224478 140341 -4408 45501
$$ packed form
12923C20766c3800j2655E0521j3386a16734o364j21178A24469F374K76372j09397
12912A73349J750i323A68017I949J30411D7714J9162a16468m674a2109n0357j93972
12900b56438E3082J65390i0905A32653J4227l4151b24834L2266B5659I003J14047
12889A23050c3628A96126c4658B88183F8685J70670a26577c0730j06937A00575
12878A92976B172h3428E4926a64020b4947j95423d8729B35274E279a7545e857
12866E48178B70314p224b8267l14029I7172b34004f0542a4233A29139J78062j03389
12855B03812r8157l0525J34740c11193d9983B1265r413R6629l5921L06537j06261
12844B72836H1999h6437B94126I2393P7275b39160f0526j63952A40341d408D5501
$$ plain form
12832 -86222 14820 194331 54463 101787 76000 -329290 -183859 268884 -155611 94470 203158
12821 203158 70527 -190010 202095 -35771 74829 -237334 84638 278199 -276207 -84296
12810 162606 -70014 -114762 281674 111959 246391 25386 -100988 -369215 -14951 -151051
12800 -151051 -209290 285066 -176777 72431 -70241 154971 -70690 204852 -138359 131237
12789 -61496 214659 -121890 243290 1927 -244279 -288155 -177141 -38954 170146 57523 -89455
12777 -79606 108356 326115 -28486 -95431 14023 -265785 -72188 132202 190556 251187 41035
12765 239028 -136174 17303 -160276 142895 184226 99042 24709 -37322 1051 -222523 -64313
12753 198592 164668 -225714 -79268 440439 2284 423263 185033 -165937 -158539 19202 51253
$$ packed form
12832h6222A4820J79511E4463M7324k5787c29290J45431B68884a55611I4470J08688
12821B03158G0527a90010B02095c5771G4829b37334H4638J93561b76207h4296
12810A62606g0014m4748B81674A11959J34432B5386a00988k68227a4951j36100
12800a51051n8239B85066a76777G2431g0241A54971g0690B04852a38359A31237
12789f1496B14659a21890B43290A927b44279m3876J11014c8954A70146E7523h9455
12777g9606A08356K17759b8486o6945A4023b65785g2188A32202N8354O0631D1035
12765B39028a36174A7303a60276A42895M1331q5184B4709c7322A051b22523f4313
12753A98592l3924b25714g9268D40439B284M20979A85033a65937P398A9202L2051
$$ plain form
12742 51253 114940 -230845 -36194 170711 66605 330279 447070 77922 -59230 111822 109216
12731 109216 -64495 28675 424427 219378 304129 283168 204056 181683 36256 -203523 -221793
12720 -221793 216112 253200 85896 182832 -333265 14141 213999 -30289 254534 125483
12709 235273 119393 342286 55193 415309 172999 474113 48122 25433 211502 217543
12699 217543 113554 195649 145444 507313 -109076 -116675 113355 285074 221467 -92221 -53243
12688 -53243 -118805 202240 156365 231363 91409 8769 -331130 -194275 123108 -161936 57787
12676 -121323 121247 266539 36295 -84438 -225201 24844 73195 -150559 25525 54683 195970
12665 195970 276356 27040 169099 101086 -192210 30081 218889 132274 60849 329659 91949
$$ packed form
12742E1253O3687b30845c6194A70711F6605K63674J16791G7922e9230A11822k606
12731A09216f4495B8675L95752k05049Q4751k0961p9112k2373C6256b03523j8270
12720b21793B16112L7088H5896R6936c33265A4141J99858c0289B54534A25483
12709B35273j15880K22893E5193L60116A72999L01114D8122k2689J86069O041
12699B17543j03989Q2095n0205L61869a09076p599A13355J71719o3607i2221L8978
12688e3243o5562B02240m5875P4998I1409H769c31130J36855A23108a61936E7787
12676a21323A21247J45292C6295h4438j40763B4844M8351a50559B5525K9158J41287
12665A95970Q0386B7040J42059o8013a92210C0081J88808q6615F0849K68810I1949
$$ plain form
12653 -8348 179600 -78024 191354 224324 -218761 157784 -14560 -124858 -33050 -160309 -146414
12642 -146414 96867 -476 187809 220886 57589 -117982 490767 -37472 187456 253520 203515
12631 203515 102410 391934 416987 227439 137684 377791 -139477 41607 21573 113176
12621 113176 135200 234633 148802 266731 190374 125378 -141403 -135491 -272726 130862 169392
12610 169392 -6009 18506 -110992 -199775 167914 270527 12812 107918 68493 289209 -130750
12598 63612 -271 187185 102078 350802 61931 -243039 216430 -232012 -82255 38602 176403
12587 176403 46775 -170623 360223 51942 -67888 -21661 -83774 -136244 94074 192257 23219
12575 -72301 125905 163385 239756 259757 300367 -83070 112966 -26007 23288 158456 -113127
$$ packed form
12653h348A79600g8024A91354L2970b18761A57784a4560j10298c3050j27259J3895
12642a46414I6867d76A87809L3077E7589a17982D90767c7472A87456O6064n0005
12631B03515j01105K89524K5053j89548q9755K40107a39477D1607k0034R1603
12621A13176K2024R9433q5831J17929p6357o4996a41403N912j37235A30862L8530
12610A69392f009A8506a10992q8783A67914J02613A2812R5106l9425K20716a30750
12598F3612b71A87185q5107K48724F1931b43039B16430b32012h2255C8602J37801
12587A76403D6775a70623C60223E1942f7888b1661o2113n2470I4074R8183B3219
12575g2301A25905L7480P6371K0001M0610h3070A12966b6007B3288J35168a13127
$$ plain form
12563 30861 154108 -59885 -289641 -257699 -67571 141081 -21271 184383 -193245 -241646 523296
12551 91222 -45315 -68690 -21595 75636 236837 26285 188043 171602 -146450 -277109 173113
12539 336749 172813 -4159 123260 -89828 16653 208564 -206507 -2742 107278 -149635 -43219
12527 86716 314624 66697 208239 -83877 223654 223430 26052 -314846 181970 -146600 224104
12515 -7339 26049 319222 -150082 -137751 133056 344345 -183150 2321 193191 -232624 139048
12503 -16794 86547 170335 94091 -66930 8112 -49320 67496 -98180 73441 562543 280306
12491 190823 109536 126874 204300 187086 -196504 -62300 -175063 139956 -150475 138361
12480 -65718 301659 -114353 113064 -6711 67167 -126514 -50772 115154 -195939 -100789 150701
$$ packed form
12563C0861J23247e9885k29756L1942f7571A41081b1271A84383a93245m8401E23296
12551I1222d5315k3375b1595G5636J61201B6285J61758j6441a46450j30659A73113
12539C36749j63936d159A23260h9828A6653J91911b06507b742A07278a49635d3219
12527H6716K27908F6697J41542h3877B23654k24B6052c14846A81970a46600B24104
12515g339B6049K93173a50082J2331A33056K11289a83150B321J90870b32624A39048
12503a6794H6547Q3788p6244f6930H112d9320F7496i8180G3441M89102B80306
12491A90823q1287J7338P7426j7214a96504f2300j12763A39956a50475A38361
12480f5718C01659a14353A13064f711F7167a26514e0772A15154a95939R5150A50701
$$ plain form
12468 55471 22766 -274962 201145 -29776 -99537 -16266 -38032 215355 81190 40576 55651
12457 55651 -197087 -177048 31552 19040 98084 -141298 -37965 6931 -75565 641460 -164438
12445 -193507 43873 -222399 176071 -72113 215091 -118783 -72716 -126501 110045 -88293
12434 -193252 -237714 60830 -248694 -229928 35047 153463 -14568 -238357 305988 -72369 -25988
12422 -35422 -10883 -172011 -177964 244602 133710 9719 -55064 -290219 74585 83791 90857 47314
12410 47314 263391 -120664 90334 212528 162484 66306 51805 -229643 151123 -194584
12399 68251 109922 34359 290530 24729 162852 -62467 13512 -177625 -513336 74717 226068
12388 226068 257114 195571 -156123 140907 -171072 -156558 29842 -347357 -60711 91487 -386284
$$ packed form
12468E5471B2766b74962B01145b9776o9761a6266k1766B15355H1190D0576J5075
12457E5651a97087K0039C1552j2512P9044a41298c7965F931g5565F41460a64438
12445a93507D3873b22399A76071g2113B15091a18783M6067n3785A10045h8293
12434a93252m4462F0830b48694J8766C5047J18416a4568k23789C05988g2369b5988
12422c5422a0883j61128n953B44602j10892I719e5064k35155G4585R206P066m3543
12410D7314K16077a20664I0334J22194n0044F6306j4501b29643A51123a94584
12399F8251M1671C4359K56171B4729J38123f2467A3512a77625l35711G4717J51351
12388B26068L1046o1543a56123A40907a71072J4514B9842c47357f0711I1487c86284
$$ plain form
12376 -135150 30040 37211 -107886 284718 -521 31178 -368542 -31839 -36110 -154139 117812
12364 -90870 -30207 200231 -306 152232 36099 126851 67089 81089 68813 15757 46244 -54240
12351 -50211 -198402 147717 -385 44911 -385484 -11391 -62197 86057 -247174 133402 -23322
12339 -23962 -93409 431532 15416 378642 147298 116234 -7985 -75866 -275412 193745 -139874
12327 -140850 122593 -291848 201404 222930 115996 99604 322209 22165 -3090 186140
12316 21372 1156 -81407 -88989 -122535 14297 -21082 -316133 486801 65457 -36434 133315
12304 105940 -175908 226783 -48385 -431646 -191032 170933 130355 104884 -221395 96325
12293 164950 -339509 -96600 133653 286467 147120 74510 -21878 282213 37264 143599
$$ packed form
12376a35150C0040P171a07886B84718e21C1178c68542c1839m271j18029A17812
12364i0870c0207B00231c06A52232C6099R0752n9762J4000j2276A5757L0487e4240
12351e0211j48191A47717c85D4911c85484a1391n0806H6057b47174A33402b3322
12339b3962o9447D31532A5416L63226A47298l1064g985o7881j99546A93745a39874
12327a40850A22593b91848B01404K1526j06934j6392K22605B2165c090A86140
12316B1372A156h1407p582l3546A4297b1082k95051D86801F5457c6434A33315
12304A05940a75908B26783d8385l83261a91032A70933m0578k5471b21395I6325
12293A64950c39509i6600A33653J52814j39347p2610b1878B82213C7264J06335
$$ plain form
12283 143599 5074 375942 192967 363644 78235 15409 298541 53976 -64243 60032 155709
12272 155709 378225 131706 -24316 53225 227632 372741 108697 200979 93931 -17902
12261 -108099 88678 41414 226054 193278 38103 19859 416609 144970 479069 -119425
12250 130671 32220 232519 81211 36576 199274 -176067 359114 467996 -1 196859 114510
12239 114510 -76820 343128 246429 121258 214863 418753 359216 61681 -63853 170410 67700
12227 265715 181683 67867 109244 184776 77552 306138 180901 -22112 173204 73914 594417
12216 594417 161011 156579 181255 286407 137648 125169 423321 108239 174612 -49361 291559
12204 56496 285746 -52901 333941 453996 110612 463823 58835 84902 360234 -24853
$$ packed form
12283A43599E074L70868j82975J70677G8235A5409K83132E3976f4243F0032R5677
12272A55709K22516A31706b4316E3225J74407J45109A08697R2282I3931a7902
12261a08099H8678D1414J84640l2776C8103j8244L96750A44970L34099a19425
12250A30671C2220K00299H1211C6576J62698a76067C59114J08882aA96859q2349
12239A14510g6820C43128r6699A21258R3605K03890n9537F1681f3853A70410F7700
12227B65715q4032F7867M1377P5532G7552K28586j25237b2112A73204G3914N20503
12216E94417A61011m432K4676J05152A37648j2479K98152A08239O6373d9361B91559
12204E6496K29250e2901C33941J20055A10612L53211E8835K6067K75332b4853
$$ plain form
12193 91135 274331 381943 -36552 51852 324997 -195667 -110652 235482 382644 -17923
12182 235804 215482 55906 -98953 167483 53474 307831 126428 128604 326182 -242015 315379
12170 -105175 455865 125450 334658 -30726 74049 66246 170063 -23160 49738 124673 117178
12159 117178 96665 -82736 -405463 -103021 -77434 150400 139415 118756 -98701 -213832 57164
12147 256059 -112259 -122017 -256201 -109512 17980 15551 253569 59795 -32409 73595 206177
12136 206177 260154 137488 -159369 -327774 25921 -77041 -51154 91864 -98695 15490 8369
12125 8369 -140331 63465 283828 40286 228597 80056 -215758 -117504 346119 247261 61317
12113 38626 -142843 -22917 51801 -297461 -151032 142570 -35445 -131639 23884 140575 235921
$$ packed form
12193I1135J83196J07612c6552E1852K73145a95667Q5015B35482J47162a7923
12182B35804k0322E5906i8953A67483E3474K54357A26428K176J97578b42015C15379
12170a05175D55865A25450K09208c0726G4049p803J03817b3160D9738P4935p495
12159A17178k0513h2736l22727a03021K5587A50400j0985k0659i8701j15131E7164
12147B56059a12259r758j34184a09512A7980k429K38018E9795c2409G3595J32582
12136B06177N3977j22666a59369j68405B5921g7041K5887I1864i8695A5490p121
12125H369a40331F3465K20363D0286J88311H0056b15758R8254C46119r8858F1317
12113C8626a42843b2917E1801b97461J46429A42570c5445r6194B3884J16691R5346
$$ plain form
12102 235921 170593 29785 -69690 -196470 259834 -106721 231938 363373 205371 -143161
12091 90077 -137 50250 -73038 -14037 -236324 138818 47037 -101117 51171 276502 -203168
12079 223255 -25398 68954 -556841 48712 -59699 -79063 -24768 -51821 -200945 360097 -128770
12067 -318845 121536 597192 1186433 956187 523340 428710 1702 140752 7980 -286355
12056 147053 -132756 -73859 100312 32460 -216161 73968 352403 48791 -33877 -360794
12046 -360794 -145482 -28092 240637 144182 -265141 -141392 -162647 -51556 -116317 542005
12035 -349785 -4989 164472 45524 72564 59343 -9744 -419097 16609 51415 -66979 -82725
12024 -82725 -130858 63393 3547 93629 -31494 165599 28800 60232 3618 270193 211140 113668
$$ packed form
12102B35921o5328B9785f9690j26780B59834a06721B31938J31435j58002a43161
12091I0077a37E0250g3038a4037k22287A38818D7037a01117E1171K25331b03168
12079B23255b5398F8954e56841D8712e9699j9364b4768k7053j49124C60097a28770
12067c18845A21536M75656N89241k30246m32847r4630A702J39050G980b86355
12056A47053a32756N8897A00312C2460b16161G3968K78435D8791c3877l26917
12046c60794a45482b8092B40637r6455b65141J23749k1255e1556o4761E42005
12035c49785d989A64472D5524K7040j3221i744m09353A6609L4806f6979j5746
12024h2725m8133F3393C547R0082c1494A65599B8800L1432C618K66575n9053r7472
$$ plain form
12012 113668 -157029 67508 147712 166105 273643 -18721 -132361 -47377 280384 910 -45653
12000 206299 -28450 -67404 -106032 -195990 -169136 226051 106630 43716 43030 56406 835 274396
11988 274396 451669 97045 -154479 -99173 -173921 54012 -117927 -90246 -158654 -366126 -230381
11977 -230381 -135830 -244214 -18465 82559 -97214 39667 -22918 -296114 -14108 -83304 171667
11965 69582 -89469 199521 -5931 248653 -118993 179459 170715 154134 220299 -27535 -78682
11954 -78682 161202 102392 -353421 253004 -112132 72842 109924 227619 -321276 99583
11943 -74303 -216840 -193400 -268133 -3827 -14507 27208 -83218 -354638 14515 66186 -116230
11931 176221 93766 166734 140714 46137 351872 244632 -19522 165658 14193 -124603 -293677
$$ packed form
12012A13668a57029F7508Q0204J8393J07538a8721j13640d7377B80384I10d5653
12000B06299b8450l8954l8628q9958K6854B26051A06630D3716o86J3376H35K73561
11988B74396J77273I7045a54479N5306p4748E4012a17927K7681o8408k07472J35745
11977b30381R4551j08384a8465H2559i7214C9667b2918k73196a4108o9196A71667
11965F9582h9469A99521e931B48653a18993A79459q744j6581O6165b7535n1147
11954g8682A61202n8810c53421B53004a12132G2842L7082J17695c21276I9583
11943g4303j42537K3440p4733c827j0680B7208h3218k71420A4515N1671a16230
11931A76221q2455P2968k6020D6137L05735j07240a9522A65658A4193a24603j69074
$$ plain form
11920 -293677 -79960 57912 -235415 162494 133958 124690 -34938 -218047 -310640 114041 -104491
11908 -98093 115419 -51807 5600 8019 211488 -195755 -26480 434031 -17142 135222 -137024
11896 53224 -339690 423515 -59905 -262272 -15493 22754 -485756 -71669 86065 167594 142017
11885 142017 -145817 262278 2609 235924 -125095 -93739 238086 114412 -272402 -339247
11875 -339247 182194 84981 54389 -63071 -125935 -203515 -321840 -61660 43950 -172272 248347
11863 -318146 512827 -94906 128506 23745 207878 19266 -219555 18672 148805 -92160
11852 262569 -225608 -144943 -14095 88292 -183095 -151225 -144875 314769 181870 2335 -20373
11840 -54325 182411 52551 105142 332969 -363886 71185 217095 -240923 116432 -170669
$$ packed form
11920b93677g9960E7912b35415A62494k8536r268c4938j83109r2593A14041a04491
11908i8093A15419e1807E600K419K03469a95755b6480D34031a7142A35222a37024
11896E3224c39690D23515e9905k02367a5493B2754d85756g1669H6065Q1529k5577
11885A42017a45817B62278B609K33315a25095L1356B38086A14412b72402o6845
11875c39247A82194H4981l0592f3071o2864p7580j18325f1660D3950a72272B48347
11863c18146E12827i4906A28506B3745J84133A9266b19555A8672J30133i2160
11852B62569b25608Q0665a4095H8292a83095L1870O350C14769j32899B335b0373
11840e4325A82411E2551N2591K27827c63886G1185J45910b40923A16432a70669
$$ plain form
11829 -136205 -196909 -19901 79171 -62754 -315711 176084 76081 168874 46257 19596 119015
11818 119015 -214031 43870 280767 -219921 48865 69565 31730 78910 150989 -271205 195529
11806 -90546 -113889 47632 -17753 -80864 71993 -108895 -12157 -132254 -146453 -208078 -89010
11794 217896 279812 -18133 -228009 -1153 111781 -107437 -118435 -171238 234060 -71763 47970
11782 74706 -65511 -13066 -249247 110520 167553 39533 -13196 -73143 -333558 -205626 16774
11770 -151487 83079 42544 15241 -254298 -185203 -7373 -203384 134555 326715 77576 -196074
11758 127741 140376 152724 79694 -107390 -27932 99986 154142 -39407 8137 -132448 222008
11746 -341117 -202120 -163055 -51256 7331 -11640 -208517 186228 -27883 282329 -105981 -66114
$$ packed form
11829a36205o0704a9901G9171f2754k52957A76084G6081R2793D6257A9596R9419
11818A19015b14031D3870K36897b19921D8865K0700C1730M7180P2079b71205A95529
11806i0546k3343D7632a7753o3111G1993a08895a2157j20097j4199o1625h9010
11794B17896O1916a8133k09876a153A11781a07437j0998n2803B34060g1763D7970
11782G4706f5511a3066k36181A10520N7033C9533a3196n9947k60415J27932A6774
11770a51487H3079m0535A5241b54298O9095g373j96011A34555J92160G7576a96074
11758A27741J2635J2348p3030a07390b7932I9986N4156c9407H137a32448B22008
11746c41117J38997L9065e1256G331a1640j96877A86228b7883B82329a05981L9867
$$ plain form
11735 -66114 180413 221015 -196345 51785 -160247 21915 -39725 2919 -36766 -103175 -164912
11724 -164912 52982 -138230 -97825 -94361 174416 -62242 327332 302425 443717 66846 164377
11713 164377 -160650 -20837 38036 255693 177368 -36070 -73580 -5990 -109765 -88693 64904
11701 85551 -28427 115222 154135 283253 84785 -67765 88795 294973 -82842 167250 374311
11690 374311 -16698 6404 62619 211545 -225537 144477 231570 184769 161643 118547 265936
11679 265936 -27561 429666 110174 -93810 420914 -136018 294751 -191498 255476 -150040
11668 -125297 215161 317754 80411 -129319 268401 -27221 59360 283090 -95101 -67966
11658 -67966 126157 -172724 -369610 20538 -118590 104259 -143860 9742 -252870 135917
$$ packed form
11735f6114A80413M0602a96345E1785a60247B1915c9725B919c6766o6409o1737
11724a64912E2982a38230M0405L464A74416f2242C27332k4907J41292F6846R7531
11713A64377a60650b0837C8036K17657p8325c6070l7510e990j03775K1072F4904
11701H5551b8427A15222L8913J29118H4785f7765H8795K06178h2842A67250K07061
11690C74311a6698F404N6215J48926b25537A44477Q7093m6801k3126m3096J47389
11679B65936b7561D29666A10174i3810D20914a36018B94751a91498B55476a50040
11668a25297B15161J02593H0411a29319B68401b7221E9360K23730i5101K7135
11658f7966A26157a72724j96886B0538a18590A04259a43860I742b52870A35917
$$ plain form
11647 88504 17217 247567 391677 101332 241517 250474 17326 185341 -141292 26277 -42656
11635 -233358 -14480 144550 3144 -55534 177378 194684 283589 82558 261214 340395 129448
11623 226053 45142 -8603 355891 -134462 15278 -2252 72937 284045 -12488 35136 301517
11612 301517 107217 197328 -335073 -113369 291947 -24184 60023 117285 -109530 94511
11601 76910 106347 424011 40721 33826 -28255 303035 96992 254610 -153553 34368 -849
11589 49323 239766 311752 -18060 237933 170752 73954 119769 77166 285249 122886 68702
11578 68702 -80807 14293 152389 199470 -236686 529376 239622 252537 -179885 23445 38450
11567 38450 378314 75501 -126228 231191 -10213 -35355 61946 226428 23756 124905 195792
$$ packed form
11647H8504A7217K30350J44110A01332J40185Q957A7326J68015a41292B6277d2656
11635b33358a4480A44550C144e5534A77378J7306Q8905H2558J78656P9181A29448
11623B26053D5142h603C55891a34462A5278b252G2937K11108a2488C5136K66381
11612C01517A07217R0111c35073a13369B91947b4184F0023N7262a09530I4511
11601G6910K9437L17664D0721o895b8255C03035I6992J57618a53553C4368h49
11589D9323J90443P1986a8060B37933o7181G3954M5815m2603K08083A22886n4184
11578F8702h0807A4293J38096M7081b36686E29376B39622J2915a79885B3445J5005
11567C8450L39864G5501a26228B31191a0213k5142F1946J64482B3756J01149P0887
$$ plain form
11556 195792 935 224555 -123035 -14698 59914 225322 365687 57475 250645 129346 254877
11545 254877 65528 317085 350077 186190 261380 312636 36398 98474 419279 105573 79753
11534 79753 411323 250659 -131871 162544 34692 19114 195664 174553 30769 68069 329255
11523 329255 -204868 -39749 -72110 -275254 127412 363354 -12360 -161062 144655 163759
11513 163759 242453 183306 115654 -114090 -10193 274130 -15932 47867 275223 98092 267336
11502 267336 -207015 42031 153365 152961 333154 261793 274428 -57064 147904 -73992 129678
11490 -23179 135113 240006 -67530 -57935 -305663 348341 -330542 13023 999 93790 14131
11478 200410 246473 379690 212438 235003 -230345 -10819 341390 17471 76854 19469 121295
$$ packed form
11556A95792I35K23620a23035a4698E9914J65408J40365E7475J93170j21299J25531
11545B54877F5528K51557L2992j63887P5190N1256C6398O2076L20805A05573k5820
11534G9753L31570j60664a31871A62544C4692j5578J76550k1111C0769L7300K61186
11523C29255b04868c9749l2361k03144A27412K35942a2360j48702A44655J9104
11513A63759P8694n9147o7652a14090a0193B74130a5932D7867K27356I8092J69244
11502B67336b07015D2031J11334m04J80193p1361J2635e7064A47904g3992A29678
11490b3179A35113J04893f7530R595k47728C48341c30542A3023I99R2791A4131
11478B00410M6063J33217j67252K2565b30345a0819C41390A7471N9383A9469J01826
$$ plain form
11467 121295 214144 129324 324155 -238298 -78598 282299 -171370 26713 -55449 156186
11456 1627 215325 166135 79118 305375 436358 354839 -23217 26596 331424 228680 241031
11445 241031 2768 -52465 80012 -5803 220225 157412 -178381 345759 43980 286719 87590
11433 67419 76697 204990 -50866 -50619 71101 -129248 -208114 -25669 225096 -13054 50215 95726
11421 95726 312931 116034 -15772 130367 364480 90826 6524 -170947 223443 193028 -62241
11409 -25412 168079 62137 -13805 152081 -91762 -43925 123593 15894 -196005 -78979 9023
11397 97395 366437 39430 12680 -8914 145334 55063 116399 262421 114219 -66400 104409
11385 219605 246024 -28032 -151138 -82741 7608 254379 315106 -116330 100711 54987 96982
$$ packed form
11467A21295R2849q4820J94831b38298g8598B82299a71370B6713e5449A56186
11456A627K13698m9190G9118K26257J30983q1519b3217B6596L04828j02744J2351
11445B41031B768e2465H0012e803B20225o2813a78381C45759D3980K42739H7590
11433F7419R278J28293e0866K47G1101a29248p8866b5669B25096a3054E0215M5511
11421I5726K17205A16034a5772A30367K34113I0826F524a70947B23443l0415f2241
11409b5412A68079F2137a3805A52081i1762d3925A23593A5894a96005g8979I023
11397I7395K69042C9430A2680h914A45334E5063O1336J46022A14219f6400A04409
11385B19605K6419b8032j23106O8397G608K46771O0727a16330A00711m5724M1995
$$ plain form
11374 96982 134262 299085 111531 11042 8555 172118 1188 44493 84619 -283707 -56658
11362 297839 -80025 -311062 -56313 138340 -4595 -96489 -180053 -124959 -238901 31569 -313298
11350 48319 165437 -30260 119913 -757 -152321 48161 -186665 78965 176818 78692 -59006
11338 389433 -128811 96108 -127157 16509 -25070 138175 -84189 67338 -289685 -15914 -360234
11327 -360234 30845 -163567 65458 -26890 34200 -43077 95808 -279357 141299 -40788 -20840
11316 -20840 -193811 199555 63321 -130183 187488 33957 58419 113103 -344580 -339306 -166940
11304 -396683 92720 -46719 -205061 -89251 123350 -37790 556189 -72188 -262069 -288355 -111176
11292 13004 -315108 121523 -28954 41236 61867 -24815 -105172 211399 -132075 -75090 126822
$$ packed form
11374I6982L7280J64823A11531A1042k487J63563A188M3305M0126b83707e6658
11362B97839h0025k31037e6313A38340d595r1894q3564N5094j13942C1569c13298
11350D8319J17118c0260A19913g57j51564D8161a86665G8965R7853G8692e9006
11338C89433a28811I6108a27157A6509b5070A38175h4189F7338b89685a5914l44320
11327c60234C0845a63567F5458b6890C4200d3077I5808b79357A41299d0788J9948
11316b0840j72971A99555F3321a30183A87488C3957K4462N4684c44580N274a66940
11304c96683I2720d6719j58342h9251A23350c7790E56189g2188j89881k6286a11176
11292A3004c15108A21523b8954D1236K0631b4815q0357B11399a32075N6985A26822
$$ plain form
11280 -59283 -442541 39449 83804 -14580 -109107 196197 -236608 -45493 -371087 -134204 267527
11268 -42333 -52278 -117998 30961 -256497 -114013 24720 88502 7050 82221 92444 -25861 206494
11255 392033 -140569 -240598 -103597 312550 48689 170788 -166804 -117855 -10104 202322
11244 -227715 -129893 -48714 221738 43799 156442 -84170 129030 119661 -186648 -124079 -210429
11233 -210429 -38481 -190649 9518 61234 -240138 75652 -74322 226624 -121518 -95103 -235014
11222 -235014 -45223 237912 121557 103911 -243052 59876 -398670 54756 -28089 -12194 -144801
11211 -144801 89951 -97080 200935 10674 -181664 -157973 -316428 -432061 -65645 86556 134921
11200 134921 -159295 -329797 -191653 33459 6972 113642 97636 -112774 -12882 141350
$$ packed form
11280e9283l83258C9449M4355a4580r4527A96197b36608d5493l25594a34204B67527
11268d2333r945o5720C0961b56497a14013B4720O3782G050P5171J0223b5861B06494
11255C92033a40569j00029a03597C12550D8689J22099a66804M8949a0104B02322
11244b27715R7822d8714B21738D3799J12643h4170A29030r369a86648O2569q6350
11233b10429c8481j52168I518N1716b40138G5652g4322B26624a21518K6415j39911
11222b35014d5223B37912j16355j7646b43052E9876c98670E4756b8089a2194j32607
11211a44801H9951i7080B00935A0674a81664K3691j58455j15633f5645H6556M8365
11200A34921a59295j70502J38144C3459F972J06670j6006a12774a2882A41350
$$ plain form
11189 -279724 -158880 -185958 -15758 -59508 146195 -315302 -27204 40469 116593 -6363 -152875
11178 -152875 196822 177819 -127577 101101 62119 -97475 -105322 -7545 -14435 -53233 -90850
11167 -90850 177518 284184 61654 13390 191319 -390499 84406 -420891 -108363 -113077 -84554
11156 -84554 -146053 40055 42577 -78410 74091 -110123 -160548 -78649 108023 -112353 -312431
11145 -312431 -203405 -42623 -263505 77687 33227 112886 -22731 63622 291712 -70674 -57505
11134 -57505 -37757 205405 75610 86414 -42926 20923 379731 338445 193893 -204847 -54539
11122 62684 95942 425851 226825 -203708 -85834 243137 19269 265490 -78635 -140739 -334526
11111 -334526 302542 -8524 14728 -265237 -23629 -32746 -12279 226992 374117 229343 3434
$$ packed form
11189b79724J20844k7078a5758m3750A46195c15302b7204D0469P6124f363j46512
11178a52875A96822j9003a27577A01101l8982i7475p847g545o890l8798l7617
11167i0850A77518J06666F1654A3390J77929c90499H4406d20891a08363m714K8523
11156h4554o1499D0055K522g8410G4091a10123n0425g8649A08023a12353k00078
11145c12431J09026d2623k20882G7687C3227P9659b2731F3622K28090g0674J3169
11134e7505J9748B05405G5610J0804d2926B0923L58808m1286j44552b04847e4539
11122F2684L3258L29909j99026b03708h5834B43137A9269K46221g8635o2104j93787
11111c34526C02542h524A4728b65237b3629r117a2279B26992J47125j44774C434
$$ plain form
11099 139373 164217 107124 291110 478004 156740 360374 -61473 361417 100379 373282
11089 373282 272384 -137179 144338 251234 120132 400322 287204 512679 -82337 390190
11078 171577 32884 135557 514484 324363 243344 425232 448441 160599 390539 106154
11067 526955 453795 482668 238425 479493 362577 235942 382430 557108 821565 753890
11057 753890 522202 558483 834305 710204 891059 891795 675318 464776 528380 570041 677313
11046 677313 898941 855265 572955 659009 971098 781980 733384 683185 827477 933718
11036 933718 682040 767196 631650 595777 756899 810123 480892 761342 515529 682930
11026 682930 985495 576299 506967 854893 711124 660095 781473 567627 534633 773196
$$ packed form
11099A39373K4844n7093J83986J86894A56740K03634f1473C61417A00379K72903
11089C73282j00898a37179A44338J06896A20132K80190j13118K25475h2337C90190
11078A71577C2884J02673L78927j90121q1019J81888K3209A60599K29940A06154
11067E26955p3160K8873B38425K41068j16916j26635J46488J74678K64457o7675
11057G53890k31688L6281K75822j24101J80855P36k16477k10542O3604M1661J07272
11046F77313K21628m3676k82310Q6054L12089j89118m8596n0199J44292J06241
11036I33718k51678Q5156j35546l5873J61122N3224l29231K80450k45813J67401
11026F82930L02565m09196o9332L47926j43769n1029J21378k13846l2994K38563
$$ plain form
11016 773196 538903 801205 912723 599225 716961 590629 650026 666747 421803 409348
11006 409348 643778 559667 496429 748867 638825 864727 620796 719210 732177 668247
10996 668247 740146 417581 1025415 865834 508180 604900 737191 922311 714099 1138056
10986 1138056 1095547 952488 995855 864608 1046623 1366655 1701780 1678567 1531421 1626287
10976 1626287 1936441 2423154 2679213 2751551 2884940 3175178 2919337 2611443 2723780 2472130
10966 2472130 2398646 2129649 2155097 1659376 1790170 2166060 2071634 1969379 1913733 1969441
10956 1969441 2044535 1942796 1802398 1608174 1433374 1433062 1171149 945975 678603 926257
10946 926257 474346 235061 138727 387370 162018 310253 465634 436971 386944 36500
$$ packed form
11016G73196k34293K62302J11518l13498J17736j26332N9397J6721k44944j2455
11006D09348K34430q4111o3238K52438j10042K25902k43931R8414J2967o3930
10996F68247P1899l22565O07834j59581l57654R6720J32291J85120k08212M23957
10986A138056m2509j43059M3367j31247J82015L20032L35125k3213j47146R4866
10976A626287L10154M86713K56059P2338J33389K90238k55841l07894J12337k51650
10966B472130p3484k68997K5448m95721J30794L75890r4426j02255n5646N5708
10956A969441P5094j01739j40398j94224j74800l12k61913k25174k67372K47654
10946I26257m51911B35061r6334K48643A62018J48235J55381k8663n0027C6500
$$ plain form
10935 -56231 125429 -240533 298082 -413590 -35659 201825 -171365 72345 -36299 157690
10924 302237 81656 106932 156915 311237 -130095 256227 -81684 122401 73070 -114030
10913 -67490 -62822 29219 170875 170630 -116198 91793 223390 -139545 320511 66413 -20631
10901 -128953 7426 -156774 -242388 264204 22995 205162 -180125 103779 -64735 35863 62884
10890 62884 14079 51848 19935 9966 -96897 -29859 -406295 -640 285083 71531 -328607 200287
10877 -62451 57565 -34640 -156764 -146181 418572 168162 160172 72284 102186 94753 23612
10865 -140768 237251 105238 43269 -318104 -76639 -188974 -280707 -7462 -247496 18090 92117
10854 92117 175882 -108551 -122493 -200717 -55907 150588 315852 -72019 -150564 -339280 28312
$$ packed form
10935e6231A25429b40533B98082d13590c5659B01825a71365G2345c6299A57690
10924C02237H1656K5276M9983J54322a30095B56227h1684A22401m9331a14030
10913f7490M668B9219J41656k45a16198I1793J31597a39545C20511F6413b0631
10901a28953G426a56774q5614B64204B2995J82167a80125A03779f4735C5863K7021
10890F2884A4079L7769A9935I966i6897b9859l76436f40B85083G1531c28607B00287
10877f2451E7565c4640j22124J0583D18572A68162p990G2284K9902p433B3612
10865a40768B37251A05238D3269c18104g6639j12335r1733g462k40034A8090P4027
10854I2117Q3765a08551j3942p8224e5907A50588J65264g2019p8545j88716B8312
$$ plain form
10842 322799 63151 -253436 -75915 -42905 84715 -360914 -54533 -95253 193044 370153 184239
10830 -86791 -76086 -193187 84932 -179462 -100764 11406 203556 -156297 -86222 -125489 -296646
10819 -296646 -103063 -186433 -174769 -62896 72161 -196592 -113101 -219073 15321 -28941 -73240
10808 -73240 310184 11273 -120414 -161684 -140036 -311254 -269872 111715 -154194 146201
10797 -3339 10627 -241713 -830 38790 -99743 -163165 23325 72610 -54591 475685 -173474 155083
10784 -98286 -20176 -43716 164617 -82043 164931 -151787 -128837 374115 -304110 82293 136204
10773 136204 -79090 -17041 224840 -309837 -305690 -140918 125146 -154142 -131345 394873
10762 -269228 -52894 -132541 -113169 186313 -224323 -206634 -4069 49799 7902 -68880 -156960
$$ packed form
10842C22799F3151b53436g5915L3010H4715c60914e4533m0720A93044J77109A84239
10830h6791J0705j17101H4932a79462P8698A1406J92150a56297P0075l9267j71157
10819b96646a03063q3370J1664f2896G2161a96592Q3491j05972A5321b8941m4299
10808g3240C10184A1273a20414m1270K1648j71218M1382A11715a54194A46201
10797c339A0627b41713h30C8790i9743o3422B3325M9285e4591D75685a73474A55083
10784i8286b0176k3540A64617h2043A64931a51787K2950C74115c04110H2293N3911
10773A36204g9090a7041B24840c09837M147a40918A25146a54142K2797C94873
10762b69228e2894p9647J9372A86313b24323J7689d069D9799G902f8880q8080
$$ plain form
10751 -156960 -195015 -137515 -156592 -214544 214134 184693 253053 -158590 -22272 -187268 8046
10739 18733 223226 -86648 138946 -41511 -273432 32414 -58270 50559 -229262 94366 -214474
10727 76896 -19722 -161722 -59718 139809 28900 -105532 156409 -259034 -44268 76098 169180
10716 169180 90617 -255209 -35052 125088 -29018 38452 -68148 -136705 236309 -16287 291
10704 -11663 -274565 -18844 310746 -245678 161474 -182440 2031 138487 -204582 236265
10693 16823 -157672 94944 -433604 167518 -128015 82114 41035 -170728 -184646 -335931
10683 -335931 111029 604 119440 -177669 -39908 15100 168122 80363 -83901 -31971 459570
10671 7189 -247804 -84396 -66680 -223980 185104 -43653 -64980 -142645 44610 221596 178837
$$ packed form
10751a56960l8055N7500j9077n7952B14134k9441O8360a58590b2272j64996H046
10739A8733K04493h6648A38946d1511k31921C2414e8270E0559b29262I4366b14474
10727G6896a9722j42000e9718A39809B8900a05532A56409b59034d4268G6098R3082
10716A69180p8563b55209c5052A25088b9018C8452f8148o8557B36309a6287B91
10704a1663k62902a8844C10746b45678A61474a82440B031J36456b04582B36265
10693A6823a57672I4944d33604A67518a28015H2114D1035a70728j3918j51285
10683c35931A11029F04J18836a77669c9908A5100J53022H0363h3901c1971D59570
10671G189b47804h4396J7716j57300A85104d3653k1327p7665D4610J76986m2759
$$ plain form
10660 178837 2401 -322535 -75643 -346472 -26092 -211357 -215691 87429 -241116 22014 -309793
10648 -4629 -50220 62790 153094 321437 -358301 86724 -140637 -311738 -119703 -200054 -143719
10637 -143719 -228110 -26780 -101266 -247739 -58529 15977 -176136 -138798 52324 98389 -275354
10625 -5072 -134544 -263482 -86895 -64617 -151014 -263467 -10408 1252 -98408 -473901 -190619
10613 -6195 -51953 -149713 -127186 -100951 -175362 21128 358324 -2451 -13823 291320 77960 87426
10601 87426 -272452 -45521 95558 2347 82283 24689 -163044 -184809 79735 38621 -153275
10589 109291 -39161 -149684 -123239 -27162 111662 136423 -412825 46128 -94731 -267112 -130597
10577 212135 51367 252986 -19062 131272 -35762 43043 93939 -184164 43903 -8736 -62425
$$ packed form
10660A78837B401c22535g5643k70829b6092j85265m334H7429b41116B2014c09793
10648d629m5591F2790R0304J68343c58301H6724a40637j71101a19703q0351N6335
10637a43719q4391b6780p4486j46473e8529A5977a76136L7338E2324M6065b75354
10625e072j29472j28938h6895K2278q6397j12453a0408A252i8408l75493a90619
10613f195m5758r7760K2527K6235p4411B1128L37196b451j1372B91320G7960R466
10601H7426b72452d5521I5558B347P9936B4689a63044k1765G9735C8621a53275
10589A09291c9161j10523K6445b7162A11662K4761d12825D6128i4731j72381a30597
10577B12135E1367K01619a9062A31272c5762D3043N0896a84164D3903h736n3689
$$ plain form
10566 -62425 194680 -301100 185098 119880 -95632 -269478 103748 35638 -118662 -92165
10556 -92165 -379554 9178 -112302 286021 247749 -467305 162836 -287870 238738 -145850
10545 -54843 -31593 -299939 -35049 -370276 -107755 -124557 -162659 -563413 90890 -124340 -383019
10534 -383019 -180352 -254246 188541 74512 14619 282564 75862 -25890 -143838 -265052
10524 -265052 152701 35951 -21786 286434 -130356 293 170530 -143616 -256692 9169 125430
10513 125430 -115768 51999 -405791 -197123 -6507 197609 -106876 -35523 -216008 105041
10502 35118 -162389 -152356 2559 190823 50814 185405 30722 18496 6303 143085 -191760
10490 -149231 -180112 281997 359458 143912 127819 302295 -24573 313135 710284 72103
$$ packed form
10566f2425A94680c01100A85098o5218i5632j73846A03748C5638a18662K6497
10556i2165k87389I178a12302B86021l8272d67305A62836b87870B38738a45850
10545e4843K3250k68346c5049l35227a07755j6802l8102m00754I0890a24340k58679
10534c83019a80352p3894A88541G4512A4619K67945G5862b5890j17948j21214
10524b65052A52701C5951b1786B86434a30356B93J70237a43616j13076I169J16261
10513A25430a15768E1999d05791a97123f507A97609a06876c5523j80485A05041
10502C5118a62389J0033B559J88264E0814J34591C0722j2226F303J36782a91760
10490a49231l0881B81997P7461A43912j6093J74476b4573C13135L97149G2103
$$ plain form
10479 653716 373182 362686 294681 253748 53843 -139269 -193593 4540 486772 154931 341599
10468 341599 32713 7985 51830 -270949 74288 -98867 -59372 127113 -39193 -285617 -116383
10456 -35384 -115290 34185 -217253 -169538 127608 -76566 -137406 -152183 -47405 -67665 -211238
10445 -211238 -227675 -74348 245902 19228 -94925 -141367 209195 124649 -234894 -351853 -61411
10433 117527 -203471 -254079 275096 33204 5171 -84343 390843 109754 267268 -203590
10422 120807 -50150 -101133 -65128 134021 -108286 -187329 36607 -247071 -27873 7183 305812
10411 305812 5952 -34867 1612 16919 53161 58552 -123117 -300761 52809 -92976 -91526 -332639
10399 -332639 -277577 -24181 -92853 126524 56856 165378 102789 -242896 180261 -92267 126859
$$ packed form
10479F53716k80534j0496o8005m0933E3843a39269n4324D540M82232A54931J86668
10468C41599C2713G985M3845b70949G4288i8867L9495A27113c9193k46424a16383
10456c5384p9906C4185b17253M7715A27608g6566o0840j4777d7405k0260j43573
10445b11238j6437g4348B45902A9228i4925m6442B09195q4546b34894j16959f1411
10433A17527b03471n0608B75096C3204E171h4343C90843A09754J57514b03590
10422A20807e0150n0983L6005A34021a08286p9043C6607b47071b7873G183K98629
10411C05812E952c4867A612J5307L6242N391a23117j77644E2809i2976J450k41113
10399c32639N5062b4181o8672A26524E6856J08522o2589b42896A80261i2267A26859
$$ plain form
10387 232176 -70552 178314 153232 314740 -94136 212539 -7159 213551 -159878 174319
10376 251634 112565 232209 177012 166952 194333 461314 113213 446398 170627 308956
10366 308956 580841 547918 120484 309441 200506 99258 362130 533410 -189656 190542
10355 157381 423148 132059 513772 380117 622039 687357 142577 445141 93669 299903
10345 299903 236598 431867 598066 466001 406520 515829 452871 131365 178362 78145
10334 109940 184438 358261 91663 156333 420014 41943 -78816 20237 59969 -41654 209901
10322 467913 320808 316021 142693 -22500 140284 216763 34449 172636 216407 96652 167070
10311 167070 192042 212462 -31771 -57352 134571 -32873 106644 101431 -113933 -70306 -9254
$$ packed form
10387B32176g0552A78314k5082J61508i4136B12539g159B13551a59878A74319
10376B51634A12565J19644n5197j0060K7381K66981A13213L33185A70627J38329
10366C08956K71885l2923A20484J88957j08935I9258K62872J71280a89656A90542
10355A57381K65767A32059L81713j33655K41922O5318A42577L02564I3669K06234
10345B99903o3305J95269J66199j32065n9481J09309o2958A31365M6997G8145
10334A09940P4498J73823I1663O4670K63681D1943g8816B0237L9732d1654B09901
10322D67913j47105m787A42693b2500A40284P6479C4449J38187M3771I6652P0418
10311A67070K4972K0420c1771k5581A34571c2873A06644n213a13933M3627i254
$$ plain form
10299 -26587 -52393 146777 -47340 123018 99823 -205828 251067 161329 -187140 10952 68072
10288 68072 167914 -56474 -264680 -82387 -392823 -279112 21910 -126223 404026 -139273
10277 -251299 178326 -137935 -14211 -40072 -194426 42796 -67045 165774 195849 141383 -129178
10265 106384 87350 -98759 32181 80498 301234 270384 366639 139517 337048 202495 106761
10254 106761 48594 238227 8347 -106850 154287 -42089 -189608 -52412 -106698 181957 -22095
10242 -94030 -309676 93643 62735 208174 -61521 -10570 -237261 197401 -255802 25748 -293018
10230 -46754 -96796 -449394 21515 -80607 -284033 70440 -179478 -53711 30116 -51993 -14447
10218 -175148 -22528 -289776 100064 223402 256613 95410 -20965 -72507 50796 -83927 11878
$$ packed form
10299b6587k5806A46777d7340A23018k3195b05828B51067q9738a87140A0952N7120
10288F8072R9842e6474k08206h2387l10436J13711B1910a26223D04026a39273
10277b51299A78326a37935a4211k5861j54354D2796f7045A65774L0075n4466a29178
10265A06384j9034i8759C2181M8317K20736l0850R6255A39517J97531j34553r5734
10254A06761D8594J89633H347a06850A54287d2089j47519e2412n4286A81957b2095
10242i4030k15646I3643l0908J45439f1521a0570k26691A97401b55802B5748b93018
10230d6754n0042l52598B1515h0607k03426G0440a79478e3711C0116e1993a4447
10218a75148b2528k67248A00064J23338L3211I5410b0965n1542E0796h3927A1878
$$ plain form
10206 -376208 40942 -273167 -218860 66537 -82142 191908 -32468 -188535 77716 -491006 360161
10194 133254 -155023 -112130 -62243 -61149 -115808 -66203 -292410 -202647 331404 -254771 79791
10182 -94603 104485 -53943 -197891 -57963 -89425 195146 69505 332384 -61022 88936 -222262
10170 -80296 -140336 89894 -175394 81662 -9506 -74872 -230398 -240 332007 -6759 -146482 -33294
10157 50895 190685 -119849 -266218 -115013 -157006 -205462 -142576 91184 -298058 -86805 -52903
10146 -52903 -100903 -89170 -202750 3472 -269276 -28567 93287 -344095 -456238 7175 297965
10135 297965 -236959 -112993 -19089 4992 -215382 -15262 -210407 12157 -151920 -103698 -119089
10124 -119089 -125775 -107802 69083 345781 92491 4461 224954 -19824 26095 -12958 180113
$$ packed form
10206c76208D0942b73167N4307F6537h2142A91908c2468j56067G7716d91006C60161
10194A33254a55023M2893M9887J094n4659M9605k26207Q9763C31404b54771G9791
10182i4603A04485e3943j43948e7963l1462A95146F9505K62879f1022H8936b22262
10170h0296o0040H9894a75394H1662i506o5366j55526b40C32007f759j39723c3294
10157E0895J39790a19849j46369a15013m1993m8456O2886I1184b98058h6805L3902
10146e2903m8000J1733j13580C472b69276b8567I3287c44095j12143G175K90790
10135B97965b36959a12993a9089D992b15382a5262j95145A2157a51920M8222j5391
10124a19089o686J7973F9083K76698I2491D461K20493a9824B6095a2958A80113
$$ plain form
10112 36905 -79533 -44116 -193996 -250252 -130127 -162841 -71446 -221643 -124545 -252978 -373121
10101 -373121 178629 44300 265004 -103443 -184234 82205 -187816 -251289 117705 -103460
10090 26215 -108941 284246 24891 -10858 -294310 47161 -417634 -100306 236205 -182299
10079 -88672 202738 -86425 -149245 -36471 45341 -88741 -179078 11156 -217988 93731 24729
10067 -273599 -26402 -215265 -210143 179578 286385 -21357 -328886 -73006 -431728 181078
10056 237106 -243334 -182614 10877 -19116 -14605 -124852 -7875 -75609 1868 23978 -187759
10044 -305422 246516 115903 -122426 -311899 162592 -163391 -264397 48137 -423915 54716
10033 190741 -53926 -286884 80961 -153902 -331898 210880 -40507 -342207 -109167 28183
$$ packed form
10112C6905g9533L5417j49880n6256J20125l2714g1446j50197R7098j28433j20143
10101c73121A78629D4300K20704a03443q0791H2205a87816o3473A17705a03460
10090B6215a08941B84246B4891a0858k83452D7161d17634a00306B36205a82299
10079h8672B02738h6425o2820c6471D5341h8741r0337A1156b17988I3731B4729
10067b73599b6402j88863N122A79578J06807b1357l07529g3006l58722A81078
10056B37106b43334O0720A0877a9116M511j10247g875o7734A868K2110a87759
10044c05422B46516A15903a22426j89473A62592a63391j01006D8137d23915E4716
10033A90741e3926k32958H0961a53902j77996B10880d0507l01700a09167B8183
$$ plain form
10022 -185955 -119807 59972 25742 -123223 -39802 -372872 -78006 -16807 -134175 -174199 -218349
10011 -218349 -33666 15235 -23463 38088 -183969 -186482 6173 -170912 -74206 -87649 -125766
10000 -125766 -6230 116965 -231742 -58258 -68113 -58722 -228284 -50935 72774 -71701 -6110 134067
9987 -412844 23816 -394726 360726 -111437 -179462 20714 -118972 -38525 -119367 62841 -292162
9975 31807 -212244 142436 15890 54911 -140821 -38449 75468 107850 -536122 -79520 -57934
9964 -57934 -274640 2504 252222 -191159 -82765 59364 -483251 -83128 -167382 415111 45242
9952 57420 -39626 -8098 -30190 98986 28051 26250 -136971 83108 -178777 -147202 89854 -252501
9939 -33640 32710 -112747 -232471 -87955 142591 99737 32486 -48765 -286842 -67727 -460805
$$ packed form
10022a85955O6148E9972B5742a23223c9802l33070g8006a6807j17368m0024m4150
10011b18349c3666A5235b3463C8088a83969k513F173a70912g4206j3443l8117
10000a25766f230A16965b31742e8258r855R391j69562e0935G2774g1701f110A34067
9987d12844B3816c94726C60726a11437o8025B0714a18972c8525q0842F2841b92162
9975C1807b12244A42436A5890L9021a40821c8449G5468L2382e36122g9520K1586
9964e7934k16706B504K49718a91159h2765E9364d83251h3128q4254D15111D5242
9952E7420c9626h098k2092I8986B8051j801a36971H3108a78777L1575H9854b52501
9939c3640C2710a12747j19724h7955A42591m2854C2486d8765k38077f7727l93078
$$ plain form
9928 -460805 -282602 -123035 -172594 -179177 -30347 -64928 51005 -111856 -196768 369942 -267484
9916 -213473 -42233 43318 39676 -39681 87766 6095 -306605 108314 81774 -49644 -246022
9905 -246022 127879 -550913 -435413 29264 -308825 -125669 -11925 116764 20070 -444643
9894 107634 1439 36617 -267798 -42780 -179930 -208981 283822 8649 -77032 -414585 17105
9882 -78897 -98746 -135768 13675 32635 -199944 -292309 84583 -118900 -357206 -174998 225966
9870 125696 -251154 3338 -133966 -35574 -157833 -229745 -247764 385694 -92072 -167351 -123667
9859 -123667 149739 -181270 287922 -98797 -33014 -66842 184016 -311997 370900 55914
9848 11514 -152828 -261956 226711 -67546 -234606 47473 4411 17796 -210966 -270453 219691
$$ packed form
9928d60805J78203a23035m9559o583c0347l4581E1005a11856q4912C69942b67484
9916b13473d2233D3318l642c9681H7766F095c06605A08314k6540d9644j96378
9905b46022A27879e50913J15500B9264c08825a25669a1925A16764B0070d44643
9894A07634A439L5178b67798d2780j37150k9051B83822H649g7032l37553A7105
9882g8897j9849l7022A3675J8960a99944r2365H4583a18900k38306a74998B25966
9870A25696b51154C338a33966c5574j22259p1912j8019C85694i2072p5279M3684
9859a23667A49739a81270B87922i8797c3014l3828A84016c11997C70900E5914
9848A1514a52828j09128B26711f7546j67060D7473D411J3385b10966n9487B19691
$$ plain form
9836 -147550 -24725 -204526 -171775 -49081 122204 104930 -68995 -123409 -46328 -164620 -148230
9825 -148230 151502 -158453 -270407 227170 142543 -324492 -380674 72294 -299834 -349927
9815 -349927 100814 74051 -140688 73942 178412 -4484 50440 -292553 -33562 30129 -42857
9803 158061 246588 -36673 -244626 -84997 -36323 86663 -210416 49972 122135 143359 -70615
9791 -114806 -29553 -178993 -200167 -190262 -217734 -272558 189 -105774 21 -229203 -10443 -304374
9779 -304374 136402 266808 -249786 -122654 -268741 3457 -27559 -51615 -219388 -261904 96176
9767 -191194 -102554 -163560 68221 -196125 -103169 54886 -83775 -156669 -226777 210190 192363
9756 192363 -99640 -118726 235859 -177968 59693 -90519 -87103 -166689 -309837 -120285 -248172
$$ packed form
9836a47550b4725j79801L2751d9081A22204j7274f8995n4414d6328j18292J6390
9825a48230A51502a58453j11954B27170q4627c24492n6182G2294b99834n0093
9815c49927A00814k6763a40688G3942J04470d484E0440b92553c3562C0129d2857
9803A58061Q8527c6673k07953h4997c6323H6663b10416D9972P2163K1224g0615
9791a14806b9553j49440k1174R905k7472n4824A89a05774B1b29203a0443k93931
9779c04374A36402J30406b49786a22654j46087C457b7559k4056j67773m2516I6176
9767a91194Q8640o1006F8221a96125R2956E4886h3775p2894p0108B10190j7827
9756A92363i9640j9086B35859a77968E9693i0519L416p9586j43148a20285j27887
$$ plain form
9745 -248172 -7618 -169120 -29693 122092 188275 -168390 -81131 -165407 4624 59564 45982
9734 45982 141994 6684 -19915 -290743 -70379 177621 -37393 -173408 -145307 -12348 -116969
9723 -116969 -22297 31082 -92139 -165273 -113875 -111565 334607 -176753 -258612 -96326 -25308
9711 -361104 178559 252888 148438 63665 33405 -92127 -369213 117023 -7279 -214492 174112
9699 93560 -173088 -216434 196731 -18817 -271992 23794 -281483 288280 -109503 -180937 161583
9687 -134885 -138928 -4581 -159011 -259582 16565 -147497 28943 21888 -49283 -29390 135472
9675 -275332 -163707 -152247 147826 12262 135883 -224516 -37209 55409 158597 -422908
9664 -153456 -45069 26260 16991 -231557 -129555 -386166 240089 -57921 143465 -388813 -41478
$$ packed form
9745b48172g618j61502b9693A22092O6183a68390h1131q4276D624N4940j3582
9734D5982R6012F684a9915k70828g0379A77621c7393j36015K8101a2348j04621
9723a16969b2297C1082i2139p3134N1398K310C34607a76753q1859i6326b5308
9711c61104A78559P4329j04450F3665l0260i2127k77086A17023g279k07213A74112
9699I3560a73088m3346A96731a8817k53175B3794b81483B88280a09503p1434A61583
9687a34885m043d581j54430j00571A6565a47497B8943p055d9283J9893A35472
9675b75332J11625J1460A47826A2262J23621b24516c7209E5409J03188d22908
9664a53456d5069B6260r269b31557J02002k56611B40089e7921A43465c88813d1478
$$ plain form
9652 -263956 -1603 -317434 -195440 -54363 -343206 77214 165458 -20282 -339926 15119 -85720
9640 -250072 21823 -233462 -265076 50848 -337080 -218613 -303410 -283867 -137281 -131681 -264771
9629 -264771 -67093 28260 -147674 -75347 40355 261764 -59692 -256698 -28816 208626 24791
9617 -92833 -53377 -342879 -56392 92280 -154339 78364 -242229 85145 -68087 -240944 102736
9605 -250380 -235558 14998 163199 41287 -263321 45498 79261 -154272 176633 -63611 -173170
9594 -173170 -77549 -183305 -428773 -218883 24944 76823 -127451 20879 101214 -398738 87429
9582 42844 -244983 90698 43370 -277302 -22073 250620 18427 60411 -296367 -97274 -203351
9571 -203351 201561 -27908 25628 246532 242471 295039 115148 -39015 -167926 -251650 138103
$$ packed form
9652b63956a603l15831J21994e4363k88843G7214Q8244b0282l19644A5119h5720
9640b50072B1823b33462l1614E0848c37080J18467q4797J9543a37281N600j33090
9629b64771f7093B8260a47674P2327D0355K21409e9692j97006b8816B08626B4791
9617i2833L9456k89502e6392I2280a54339G8364b42229H5145f8087j72857A02736
9605b50380J4822A4998J48201D1287b63321D5498L3763a54272A76633f3611j09559
9594a73170g7549j05756k45468K09890B4944N1879a27451B0879Q0335c98738H7429
9582D2844b44983I0698D3370b77302b2073B50620A8427M1984b96367i7274j06077
9571b03351B01561b7908B5628K20904m061N2568A15148c9015j28911q3724A38103
$$ plain form
9559 -85976 154241 -211831 -322959 17511 -145976 -303638 5146 -109794 -37648 62993 -195443
9547 -112643 -76011 -6072 29135 80012 130039 133052 -71446 -109651 -62654 -144608 -104075 -193488
9535 -193488 -90254 120994 -144406 -367827 -150431 -116445 141183 -171872 -238478 -187468
9525 -187468 197488 -207970 -158612 183862 -108328 -152952 -182350 -186653 282005 -140529 98299
9513 380155 -230729 -134915 318270 99135 -96600 18795 102242 193721 -16280 -69942 -154648
9502 -154648 -142859 261134 -253187 -384509 -231745 -52870 -32229 -98668 -93444 -138981 -122879
9491 -122879 244498 117694 28680 -28004 -279756 -322879 -184687 -29940 -45175 -14448 -178310
9480 -178310 -13350 -284121 -26005 -284631 -188310 88932 1990 -49590 -337488 98338 7634
$$ packed form
9559h5976A54241b11831j11128A7511a45976j57662E146a09794c7648F2993a95443
9547a12643L6632f072B9135N0877N0027L013g1446l8205M6997q1954M0533q9413
9535a93488i0254A20994a44406k23421a50431L3986A41183a71872o6606N1010
9525a87468A97488b07970M9358A83862a08328m4624k9398m303B82005a40529I8299
9513C80155b30729R5814C18270I9135i6600A8795Q3447R1479a6280n3662q4706
9502a54648J1789B61134b53187j31322J52764e2870K0641o6439N224m5537J6102
9491a22879B44498A17694B8680b8004k51752m3123J38192b9940j5235a4448j63862
9480a78310a3350k70771b6005k58626R6321H8932A990d9590k87898I8338G634
$$ plain form
9468 29661 -384177 -37414 -119 -162649 -82487 -477330 107363 106401 553191 -546 -259166 -151884
9456 -151884 -43339 132219 -78327 97236 -246324 -302229 -61433 -44020 -3640 -373133 109260
9444 -53302 -25954 50456 -44428 -129752 -75652 -191439 -253385 -245641 -180330 -258759 -140000 -37012
9431 -133045 42982 65569 -227393 -61303 -14269 -263814 12610 -22292 -214516 -428066 -159990
9419 61095 46647 -17130 -21995 -329348 -119595 -69329 62264 -14863 -2936 -227967 -87960 -157007
9407 -157007 11078 -162787 -71512 -10556 120401 -150789 -393384 -295551 -231328 -154328 223403
9395 -532749 -204037 -34775 -308774 -241838 70725 -139450 177260 197201 -120015 64081 -158546
9383 5239 -155430 9276 83380 132526 -114704 -186043 -112941 -66262 -256403 -166956 135036
$$ packed form
9468B9661c84177c7414a19j62530Q0162l94843A07363r62M46790e46k58620J07282
9456a51884d3339A32219g8327I7236b46324n5905f1433J7413c640l69493A09260
9444e3302b5954E0456d4428q5324N4100j15787o1946P744O5311p8429J18759c7012
9431a33045D2982K2587b27393f1303a4269k49545A2610b2292j92224k13550a59990
9419F1095j4448a7130m865l07353a19595N0266F2264a4863b936k25031h7960o9047
9407a57007A1078a62787g1512a0556A20401a50789k42595R7833O4223P7000B23403
9395e32749b04037c4775k73999O6936G0725a39450A77260J9941a20015F4081a58546
9383E239a55430I276P4104M9146a14704p1339P3102M6679j90141Q9447A35036
$$ plain form
9371 135230 -199561 -173059 25078 -47713 -91349 -22911 31529 -43007 372963 109342 94477
9360 94477 -110719 41753 56932 172825 37868 -207468 192869 -76327 -117606 117461 8676
9348 -62423 164642 -178451 -42302 4008 -88434 -503426 -244813 -214791 -211679 -4669 -150181
9337 -150181 99954 -99329 -117500 -98281 -216666 -92114 -18523 -152968 130315 142717 -110951
9325 -113060 52766 248310 -242143 230725 143243 -185405 -152607 253912 61825 -110099
9314 -5575 39136 -104186 -102398 3812 -118202 19970 182172 -135129 -160393 -482694 -87403
9302 -43451 -181140 -31395 -117014 -109421 37544 74013 -391907 -67250 -209983 -45078 -224377
9291 -224377 -44766 -20192 -57432 38357 95508 -130997 -87528 12091 -194663 208652 -28763
$$ packed form
9371A35230a99561K6502B5078d7713m3636b2911C1529d3007C72963A09342j4865
9360I4477a10719D1753J5179J15893C7868b07468A92869g6327m1279A17461H676
9348f2423A64642a78451d2302D008h8434m14992b44813L0022L112d669j45512
9337a50181I9954i9329j8171J9219j18385i2114a8523j34445A30315J2402a10951
9325a13060E2766J95544b42143B30725q7482a85405L2798B53912F1825a10099
9314e575C9136a04186J788C812a18202A9970J62202a35129k5264l22301h7403
9302d3451j37689c1395q5619P593C7544L6469c91907f7250j42733d5078j79299
9291b24377d4766b0192l7240C8357N7151a30997M3469A2091a94663B08652b8763
$$ plain form
9279 323042 -43446 -110755 -249518 78769 86379 -239751 138290 -58965 -63379 -120608 -14282
9267 182306 121533 19525 -45820 -8526 -128430 -285598 40331 131888 -318853 -102195 -142574
9256 -142574 -240975 114049 -130387 -19625 -124439 90210 29424 -73477 388247 -171149 -157594
9245 -157594 -177326 211241 369905 1904 -163732 24393 -23720 243768 -142230 -117768 -167934
9234 -167934 256986 -90032 24474 119759 -16406 -289073 304383 397515 108038 -114641 -103581
9223 -103581 45926 -323712 50797 164474 133235 220532 -151842 -266416 -143164 322025
9212 46246 -195081 -238728 114866 -88311 -264161 -80331 139155 -43476 130187 -367299 24253
9200 355239 318007 -169557 -327234 -207323 -237385 51693 -370731 37470 -92521 -165003 -202231
$$ packed form
9279C23042d3446o7309j38763G8769P610b39751A38290e8965m414n7229a4282
9267A82306o0773A9525d5820h526j19904j57168D0331R1557c18853a02195m0379
9256a42574r8401A14049a30387a9625j04814I0210B9424g3477C88247a71149J3555
9245a57594j9732B11241J58664A904a63732B4393b3720B43768a42230K4462n0166
9234a67934B56986i0032B4474R5285a6406k72667C04383R3132A08038a14641J1060
9223a03581D5926c23712E0797J13677l1239Q7297a51842j14574J23252C22025
9212D6246a95081m3647A14866h8311j75850h0331A39155d3476A30187c67299B4253
9200C55239l7232a69557j57677J19911l0062E1693c70731C7470i2521p2482l7228
$$ plain form
9189 -202231 35368 50925 -308527 -172280 -167938 -239005 1712 -319457 -12643 18206 -178098
9177 -114542 -251028 61390 133403 43997 44403 -163393 -45598 123625 114734 -103910 -275180
9166 -275180 154936 -57623 -283268 -249890 109777 -95078 -86176 -266244 51492 -65958 309744
9154 53880 -126012 -496239 158436 186710 -77350 -117710 94092 283746 -105300 -11329 131501
9142 -218669 -460309 15250 -224451 -148698 -214950 14130 128889 -211767 -123474 -7462 -20482
9131 -20482 -150161 -195790 -130139 -183987 -51194 -111893 272420 126257 60633 -16904 61621
9119 45288 -159995 -81074 -272917 -161705 -322010 -236109 217210 127310 -162126 -37623 -148009
9108 -148009 -108521 69626 -70819 -121848 -75111 -127324 113993 202962 -78726 349461 357916
$$ packed form
9189b02231C5368J5557c08527J36247M342p1067A712c19457a2643A8206a78098
9177a14542j36486F1390P2013D3997M06a63393d5598A23625q891a03910j71270
9166b75180A54936e7623k25645L3378A09777i5078Q902j80068E1492f5958C09744
9154E3880a26012l70227A58436K8274g7350m0360I4092J89654a05300a1329A31501
9142b18669k41640A5250b24451P5753o6252A4130J14759b11767Q8293g462j3020
9131b0482j29679m5629O5651n3848e1194o0699B72420A26257F0633a6904F1621
9119D5288a59995P8921j91843J11212j60305Q5901B17210q9900a62126c7623j10386
9108a48009L9488F9626g0819n1029M6737n2213A13993Q8969g8726C49461Q455
$$ plain form
9097 357916 -105214 -490204 112656 -146483 37202 -62845 -100695 167423 -23643 -198375
9087 -198375 -255435 -91406 -52208 -136726 -184258 -44789 -81845 -318851 -74197 2840 216773
9076 216773 221060 -29117 -329581 -325068 175633 91993 -4802 -43861 195538 41851 -175910
9064 -157554 -137446 6255 -59642 -550261 -306306 127041 172548 117145 -57620 182847 74097
9052 -28504 -27834 7552 -33987 -10517 -320774 -256500 -225623 13759 -234627 -138734 48067 128993
9040 128993 -170382 118496 -250158 -127156 -15904 -318485 -131219 -216912 236868 -35638
9029 -199673 -228876 -225202 93128 87962 -97144 32575 -174694 -359839 -120745 101077 114219
9018 114219 -297519 240296 107391 -383515 -479 -59577 -236943 -35127 -230288 287 131330
$$ packed form
9097C57916a05214l84990A12656a46483C7202f2845l7850A67423b3643j74732
9087a98375n7060i1406L9198q4518m7532d4789l7056k37006g4197B840K13933
9076B16773M287b9117l00464M513A75633q3640d802l9059A95538D1851a75910
9064a57554K0108F255e9642m90619K43955A27041M5507n5403e7620A82847G4097
9052b8504O70G552c3987a0517l10257O4274L0877A3759b34627R5893D8067Q0926
9040A28993a70382A18496b50158J23002a5904l02581a31219q5693B36868c5638
9029a99673k9203L674I3128n166i7144C2575a74694j85145a20745A01077J3142
9018A14219b97519B40296A07391c83515d79n9098j77366c5127j95161B87J31043
$$ plain form
9007 131330 30608 -209193 -115616 -252332 -85318 -191033 -209119 219790 180361 -389442 93027
8995 -53637 128054 -181363 219854 -221805 -85659 318354 177100 113744 -9409 -84659 313203
8983 -119239 -110917 210682 -66642 17220 -41111 -424759 -9076 186623 255807 199943 50545
8971 44834 142152 -243089 165279 -198349 -239507 -252626 77702 -77260 -517229 201020 -128685
8959 181018 7622 48131 -158596 60301 -74763 -87912 -117131 225231 85963 -237328 -167638
8948 -167638 31423 -473576 -161030 87995 -42523 -265198 -62944 -46419 -307099 74043 -47185
8936 -258499 141601 -14894 1549 -174102 345244 -367430 41979 86629 50599 442487 513769
8925 513769 102350 1041160 3297341 11237040 11394334 4342533 1638472 864141 502044
$$ packed form
9007A31330C0608b09193R3577j36716h5318j05715j8086B19790l9429c89442I3027
8995e3637A28054a81363B19854b21805h5659C18354j41254o3356i409p5250C13203
8983a19239Q322B10682f6642A7220d1111l83648i076A86623O9184n5864E0545
8971D4834R7318b43089A65279a98349m1158j3119G7702g7260m39969B01020a28685
8959A81018G622M0509a58596F0301g4763j3149k9219B25231H5963b37328O9690
8948a67638C1423d73576a61030H7995d2523k22675f2944J6525k60680G4043d7185
8936b58499A41601a4894A549a74102C45244c67430D1979M4650l6030L91888P1282
8925E13769A02350R38810K256181P939699J57294D342533A638472p74331l62097
$$ plain form
8916 502044 476855 408726 212082 -62623 239577 -271252 176137 151088 441432 37193 -364264
8904 -159335 175665 -179808 -139017 187850 69417 223256 -257571 104807 -150194 350906
8893 -215105 -87880 -115640 -19269 -290836 -147168 -261416 -74449 -231728 -198490 -140095 36762
8881 -2593 83517 -33917 -273564 -283549 -141962 -81753 149369 17083 -99607 29444 131357
$$ packed form
8916E02044k5189o8129j96644f2623B39577b71252A76137k5049K90344C7193c64264
8904a59335A75665a79808M0791A87850F9417J53839b57571A04807a50194C50906
8893b15105h7880k7760a9269k71567J43668j14248g4449j57279L3238N8395C6762
8881b593H3517c3917k39647r985J41587O0209A49369A7083i9607B9444J01913
$$ [...]
##END NTUPLES=NMR SPECTRUM
##END=
