
##TITLE=AC1389_VIERS12201_7519815_cQI4wlELCh
##JCAMPDX= 6.0         $$ Bruker NMR JCAMP-DX V2.0
##DATA TYPE= NMR SPECTRUM
##DATA CLASS= NTUPLES
##ORIGIN= BRUKER
##OWNER= Administrator
$$ 1.72 TOPSPIN		Version 2.1
$$ 2013-02-20 02:44:37.971 -0500  Administrator@X
$$ Compression mode = diff/dup
##.OBSERVE FREQUENCY= 400.02188249412
##.OBSERVE NUCLEUS= ^1H
##.ACQUISITION MODE= SIMULTANEOUS (DQD)
##.ACQUISITION SCHEME= undefined
##.AVERAGES= 64
##.DIGITISER RES= 22
##SPECTROMETER/DATA SYSTEM= spect
##.PULSE SEQUENCE= noesygpps1d.comp
##.SOLVENT NAME= COFFEE_meoh
##.SHIFT REFERENCE= INTERNAL, COFFEE_meoh, 1, 14.96106
##AUDIT TRAIL= $$ (NUMBER, WHEN, WHO, WHERE, PROCESS, VERSION, WHAT)
$$ ##TITLE= Audit trail, TOPSPIN		Version 2.1
$$ ##JCAMPDX= 5.01
$$ ##ORIGIN= Bruker BioSpin GmbH
$$ ##OWNER= Administrator
$$ $$ E:\/data/COFFEE/nmr/AC1389_VIERS12201_7519815_cQI4wlELCh/12/pdata/1/auditp.txt
$$ ##AUDIT TRAIL=  $$ (NUMBER, WHEN, WHO, WHERE, PROCESS, VERSION, WHAT)
(   1,<2013-02-20 02:44:31.987 -0500>,<Administrator>,<X>,<go>,<TOPSPIN 2.1>,
      <created by zg
	started at 2013-02-20 02:33:02.157 -0500,
	POWCHK enabled, PULCHK disabled,
       configuration hash MD5:
       86 BA 57 50 F2 9D 5C 9B 26 00 A9 28 5F 66 2E 89
       data hash MD5: 64K
       6F 83 A6 38 B5 5F 69 47 4E 22 5B 6D A6 6C 4A FF>)
(   2,<2013-02-20 02:44:35.096 -0500>,<Administrator>,<X>,<proc1d>,<TOPSPIN 2.1>,
      <Start of raw data processing
       efp LB = 0.3 FT_mod = 6 PKNL = 1 PHC0 = 0 PHC1 = 0 SI = 128K 
       data hash MD5: 128K
       BF 9F C5 63 8C 28 A8 06 05 10 0F B0 53 4F 79 56>)
(   3,<2013-02-20 02:44:36.268 -0500>,<Administrator>,<X>,<proc1d>,<TOPSPIN 2.1>,
      <pk PHC0 = 254.9103 PHC1 = 0 
       data hash MD5: 128K
       D3 32 E7 9C 34 DC 6F DF FB 14 B5 00 A6 21 49 5F>)
(   4,<2013-02-20 02:44:36.925 -0500>,<Administrator>,<X>,<proc1d>,<TOPSPIN 2.1>,
      <abs ABSG = 1 
       data hash MD5: 128K
       2E E2 CB C8 5C AA A2 0A 7E 38 48 39 00 75 C8 EF>)
(   5,<2013-02-20 02:44:37.096 -0500>,<Administrator>,<X>,<proc1d>,<TOPSPIN 2.1>,
      <abs ABSG = 2 
       data hash MD5: 128K
       47 26 19 34 01 2D D5 3D CA AE 30 E6 97 DD 9D 2B>)
(   6,<2013-02-20 02:44:37.268 -0500>,<Administrator>,<X>,<proc1d>,<TOPSPIN 2.1>,
      <abs ABSG = 3 
       data hash MD5: 128K
       E0 52 5E 6A DC D6 56 58 96 C2 18 49 1A 79 CE E3>)
(   7,<2013-02-20 02:44:37.456 -0500>,<Administrator>,<X>,<proc1d>,<TOPSPIN 2.1>,
      <abs ABSG = 4 
       data hash MD5: 128K
       A1 67 B9 7E 19 79 C9 12 C3 FF B6 93 1E 8B 5B 53>)
(   8,<2013-02-20 02:44:37.690 -0500>,<Administrator>,<X>,<proc1d>,<TOPSPIN 2.1>,
      <abs ABSG = 5 
       data hash MD5: 128K
       00 EA E0 94 D8 14 BE 08 EC 26 76 B3 04 43 8C 09>)
$$ ##END=
$$ 
$$ $$ hash MD5
$$ $$ 62 36 92 D2 D4 5D DD 85 AB 60 03 31 03 38 65 08
##$RELAX= 
##$RELAX= 
##$RELAX= 
##$RELAX= 
##$RELAX= 
##$RELAX= 
##$RELAX= 
##$RELAX= 
$$ Bruker specific parameters
$$ --------------------------
##$DU= <E:\>
##$EXPNO= 12
$$ [...]
150 150 150 150 150 150 150 150
##$TP07= 0
##$TPNAME0= <>
##$TPNAME1= <>
##$TPNAME2= <>
##$TPNAME3= <>
##$TPNAME4= <>
##$TPNAME5= <>
##$TPNAME6= <>
##$TPNAME7= <>
##$TPOAL= (0..7)
0.5 0.5 0.5 0.5 0.5 0.5 0.5 0.5
##$TPOFFS= (0..7)
0 0 0 0 0 0 0 0
##$TUNHIN= 0
##$TUNHOUT= 0
##$TUNXOUT= 0
##$USERA1= <user>
##$USERA2= <user>
##$USERA3= <user>
##$USERA4= <user>
##$USERA5= <user>
##$V9= 5
##$VALIST= <valist>
##$VCLIST= <CCCCCCCCCCCCCCC>
##$VD= 0
##$VDLIST= <DDDDDDDDDDDDDDD>
##$VPLIST= <PPPPPPPPPPPPPPP>
##$VTLIST= <TTTTTTTTTTTTTTT>
##$WBST= 1024
##$WBSW= 4
##$XGAIN= (0..3)
0 0 0 0
##$XL= 0
##$YL= 0
##$YMAX_a= 5718101
##$YMIN_a= -8948069
##$ZGOPTNS= <>
##$ZL1= 120
##$ZL2= 120
##$ZL3= 120
##$ZL4= 120
##$ABSF1= 14.96106
##$ABSF2= -5.597122
##$ABSG= 5
##$ABSL= 3
##$ALPHA= 0
##$AQORDER= 0
##$ASSFAC= 0
##$ASSFACI= 0
##$ASSFACX= 0
##$ASSWID= 0
##$AUNMP= <proc_prof1d_extract.lims>
##$AXLEFT= 0
##$AXNAME= <>
##$AXNUC= <1H>
##$AXRIGHT= 0
##$AXTYPE= 0
##$AXUNIT= <>
##$AZFE= 0.1
##$AZFW= 0.1
##$BCFW= 0
##$BC_mod= 0
##$BYTORDP= 0
##$COROFFS= 0
##$CY= 15
##$DATMOD= 1
##$DC= 0
##$DFILT= <>
##$DTYPP= 0
##$F1P= 0
##$F2P= 0
##$FCOR= 0.5
##$FTSIZE= 131072
##$FT_mod= 6
##$GAMMA= 0
##$GB= 0
##$INTBC= 1
##$INTSCL= 1
##$ISEN= 128
##$LB= 0.3
##$LEV0= 0
##$LPBIN= 0
##$MAXI= 10000
##$MC2= 0
##$MEAN= 0
##$ME_mod= 0
##$MI= 0
##$NCOEF= 0
##$NC_proc= -2
##$NLEV= 6
##$NOISF1= 0
##$NOISF2= 0
##$NSP= 0
##$NTH_PI= 0
##$NZP= 0
##$OFFSET= 14.96106
##$PC= 1
##$PHC0= 254.9103
##$PHC1= 0
##$PH_mod= 1
##$PKNL= yes
##$PPARMOD= 0
##$PPDIAG= 0
##$PPIPTYP= 0
##$PPMPNUM= 2147483647
##$PPRESOL= 1
##$PSCAL= 4
##$PSIGN= 0
##$PYNMP= <proc.py>
##$REVERSE= no
##$SF= 400.020009613696
##$SI= 131072
##$SIGF1= 0
##$SIGF2= 0
##$SINO= 400
##$SIOLD= 131072
##$SPECTYP= <>
##$SREGLST= <1H.CDCl3>
##$SSB= 0
##$STSI= 131072
##$STSR= 0
##$SW_p= 8223.68421052631
##$SYMM= 0
##$S_DEV= 0
##$TDeff= 65536
##$TDoff= 0
##$TI= <>
##$TILT= no
##$TM1= 0
##$TM2= 0
##$TOPLEV= 0
##$USERP1= <user>
##$USERP2= <user>
##$USERP3= <user>
##$USERP4= <user>
##$USERP5= <user>
##$WDW= 1
##$XDIM= 131072
##$YMAX_p= 389558273
##$YMIN_p= -13651
##$CURPLOT= <Network HP LaserJet P1505>
##$CURPRIN= <$Network HP LaserJet P1505>
##$DFORMAT= <normdp>
##$LAYOUT= <+/1D_H.xwp>
##$LFORMAT= <normlp>
##$PFORMAT= <normpl>
##$SURQMSG= 1
$$ End of Bruker specific parameters
$$ ---------------------------------
##NTUPLES= NMR SPECTRUM
##VAR_NAME=  FREQUENCY,     SPECTRUM/REAL,   SPECTRUM/IMAG
##SYMBOL=    X,             R,               I
##VAR_TYPE=  INDEPENDENT,   DEPENDENT,       DEPENDENT
##VAR_FORM=  AFFN,          ASDF,            ASDF
##VAR_DIM=   131072,        131072,          131072
##UNITS=     HZ,            ARBITRARY UNITS, ARBITRARY UNITS
##FACTOR=    0.0627417313425164, 1,          1
##FIRST=     8223.62146879497, 2633,         -54403
##LAST=      0,             4674,            -53870
##MIN=       0,             -13651,          0
##MAX=       8223.62146879497, 389558273,    0
$$ Real data points
##PAGE= N=1
##DATA TABLE= (X++(R..R)), XYDATA
$$ [...]
63922D162346Q9605N9554K8770k853l5340o8085r9865j29481j56084j78709j95967
63911C473891k06882k11914k12716k10780k06596j99988j90819j79271j65876
63902A689049j51483j36975j22809j09047r5874q3788p3076o3465n4620m6755
63892G51157m0343l5346l1188k7418k4061k1275j9046j7359j6249j5474j4493
63881D88905j3046j1540j0491r729q572o747m834l582l043k550j474J78J932L438
63867D18845M750O062P380Q652J0088J2041J4474J6859J8799K0520K2484K4694
63855E85648K6704K8263K9556L0814L1946L2652L2681L1915L0464K8694K6879
63844I16216K4771K1801J7934J3931J0467P200L195j819p031j1479j5042j8331
$$ y = [4162346, 4251951, 4311505, 4340275, 4337422, 4302082, 4233997, 4134132, 4004651, 3848567, 3669858, 3473891, 3267009, 3055095, 2842379, 2631599, 2425003, 2225015, 2034196, 1854925, 1689049, 1537566, 1400591, 1277782, 1168735, 1072861, 989073, 915997, 852532, 797912, 751157, 710814, 675468, 644280, 616862, 592801, 571526, 552480, 535121, 518872, 503398, 488905, 475859, 464319, 453828, 444099, 435527, 428780, 423946, 420364, 417321, 414771, 413297, 413475, 415407, 418845, 423595, 429657, 437037, 445689, 455777, 467818, 482292, 499151, 517950, 538470, 560954, 585648, 612352, 640615, 670171, 700985, 732931, 765583, 798264, 830179, 860643, 889337, 916216, 940987, 962788, 980722, 994653, 1005120, 1012320, 1015515, 1013696, 1006665, 995186, 980144, 961813]
63832I61813k1835k5410k8485l0562l1528l1695l1626l1799l2299l2767l2694
63821F31113l1725k9809k7221k4471k2029j9954j7871j5505j3226j1768j1357
63810D06177j1375j1081j0428r882r669r566r364r149q991q699q010o863n453
63797B87647m155l415l409l769l983m043m347m841m787l705k181j314j559k400
63783B39739l055l104k631k102k019k379k580k105j172l87L1K22J26m97j462k135
63767B14490k152j717j079k37O18R15L87m49q49p14n35o25p86p22l88O8M70P11
63749B07406P39N78K65j45n04n74k69K17N76O62N77O10J097K124L243L736L321
63732B23659K485J965J975K178K293K451K879L443L759L708L654L977M518M772
$$ y = [961813, 939978, 914568, 886083, 855521, 823993, 792298, 760672, 728873, 696574, 663807, 631113, 599388, 569579, 542358, 517887, 495858, 475904, 458033, 442528, 429302, 417534, 406177, 394802, 383721, 373293, 363411, 353742, 344176, 334812, 325663, 316672, 307973, 299963, 293100, 287647, 283492, 280077, 276668, 272899, 268916, 264873, 260526, 255685, 250898, 247193, 245012, 243698, 242139, 239739, 236684, 233580, 230949, 228847, 226828, 224449, 221869, 219764, 218592, 218205, 218236, 218458, 218584, 218087, 216625, 214490, 212338, 210621, 209542, 209305, 209923, 210838, 211225, 210776, 209927, 209213, 208678, 208053, 207267, 206545, 206157, 206225, 206695, 207406, 208145, 208723, 208988, 208843, 208339, 207765, 207496, 207713, 208289, 208951, 209528, 210138, 211235, 213359, 216602, 220338, 223659, 226144, 228109, 230084, 232262, 234555, 237006, 239885, 243328, 247087, 250795, 254449, 258426, 262944, 267716]
63718B67716M649M702N289N850N476M096K603J716J225N15n82j712k491k783k696
63703B93573k512k457k470k346k146k103k087j654p73j1K45K85M83P40R84J594
63687B79345K680L386K782J248J32J01N31N72P1o42j150r51K39J894K912K808
63671B95958K195J875K028K560L513M591M923M065K895K665L256L262J838k61
63657C35363j807k569l128l695l875l557l342l785m558m818m257l384k766k363
63643B87459j832j172p23n90l50M98J919L262L839L599L164L176L621M054M311
63628C14235M675N278N764N821N649N634N910O582P951R949J1760J2657J3084
63615D14949J4129J6028J7942J9333K0654K2420K4407K6261K8343L1164L4343
$$ y = [267716, 272365, 277067, 282356, 288206, 293682, 297778, 300381, 302097, 303322, 303837, 303255, 301543, 299052, 296269, 293573, 291061, 288604, 286134, 283788, 281642, 279539, 277452, 275798, 275025, 275014, 275259, 275544, 276027, 276767, 277751, 279345, 282025, 285411, 288193, 289441, 289573, 289674, 290205, 290777, 290848, 290206, 289056, 288105, 288344, 290238, 293150, 295958, 298153, 300028, 302056, 304616, 308129, 312720, 317643, 321708, 324603, 327268, 330524, 333786, 335624, 335363, 333556, 330987, 327859, 324164, 320289, 316732, 313390, 309605, 305047, 300229, 295972, 292588, 289822, 287459, 285627, 284455, 283732, 283142, 282792, 283290, 285209, 288471, 292310, 295909, 299073, 302249, 305870, 309924, 314235, 318910, 324188, 329952, 335773, 341422, 347056, 352966, 359548, 367499, 377448, 389208, 401865, 414949, 429078, 445106, 463048, 482381, 503035, 525455, 549862, 576123, 604466, 635630, 669973]
63604F69973L6812L7947L8019L7406L5824L2591K7486K1134J4466P985J804l664
63592I57783p597r704j0812j1924j3062j3817j4690j6749j9859k2494k3730k4290
63580G69055k4989k5253k4233k2483k1208k0325j8645j5822j2801j0260p800n084
63568E60152k642r76L54K033L938N420O340P091P820Q184Q033P814Q088Q880R704
63553F40233J0235J0719J1648J3158J4983J7051J9844K3871K8930L4110L8589
63542H63371M2228M5301M7569M7619M3423L4073K1116P817l105j0849j5747j7992
63530A104824j7711j5716j3372j1695j1103j1822j3951j7181k0919k4732k8313
63519I18309l1202l3060l4017l4251l3454l1367k8687k6556k5164k3630k1399
$$ y = [669973, 706785, 744732, 782751, 820157, 855981, 888572, 916058, 937192, 951658, 959643, 961447, 957783, 950186, 940482, 929670, 917746, 904684, 890867, 876177, 859428, 839569, 817075, 793345, 769055, 744066, 718813, 694580, 672097, 650889, 630564, 611919, 596097, 583296, 573036, 565236, 560152, 557510, 556534, 556888, 558921, 562859, 568279, 574619, 581710, 589530, 597714, 605747, 613561, 621649, 630529, 640233, 650468, 661187, 672835, 685993, 700976, 718027, 737871, 761742, 790672, 824782, 863371, 905599, 950900, 998469, 1046088, 1089511, 1123584, 1144700, 1152517, 1149412, 1138563, 1122816, 1104824, 1087113, 1071397, 1058025, 1046330, 1035227, 1023405, 1009454, 992273, 971354, 946622, 918309, 887107, 854047, 820030, 785779, 752325, 720958, 692271, 665715, 640551, 616921, 595522]
63508E95522j8951j6858j4931j2790j0700r233q505q139p806p396o891o324n746
63495D61252n165m679m633n229o004o157n481m523l762l184k747k565k408j696
63481D03019l43R72J683K029K469L027L601M349N251N780N449M318K638N47j554
63466D43235k987l660m333n454o370o343n653m923m112l075k493l001l819l579
63452C83433k287j202q74n95P9O32P61J072K022L130L889M565N513O412O902P427
63436D20879Q724J0881J3436J6135J9148K2819K7399L2544L6787L8108L5607L0268
63424G12735K3787J7348J1874Q562Q099R716J2023J4734J8706K4332L0699L6428
63412I29043M0747M3430M4286M2996L9276L3067K4852J5751P011p01p182j2058
$$ y = [595522, 576571, 559713, 544782, 531992, 521292, 512059, 503554, 495415, 487609, 480213, 473322, 466998, 461252, 456087, 451408, 446775, 441546, 435542, 429385, 423904, 419381, 415619, 412435, 409688, 407123, 404715, 403019, 402676, 403648, 405331, 407360, 409829, 412856, 416457, 420806, 426057, 431837, 437286, 441604, 444242, 444789, 443235, 440248, 436588, 432255, 426801, 420431, 414088, 408435, 403512, 399400, 396325, 393832, 390831, 387012, 383433, 381146, 379944, 379070, 378475, 378554, 379186, 379947, 381019, 383041, 386171, 390060, 394625, 400138, 406550, 413452, 420879, 429603, 440484, 453920, 470055, 489203, 512022, 539421, 571965, 608752, 646860, 682467, 712735, 736522, 753870, 765744, 774306, 782405, 792121, 804144, 818878, 837584, 861916, 892615, 929043, 969790, 1013220, 1057506, 1100502, 1139778, 1172845, 1197697, 1213448, 1220459, 1219758, 1212576, 1200518]
63400A200518j4818j5645j5734j6392j7992k0053k2200k4734k8149l2203l5667
63389I56931l7204l6559l4662l2543l0422k8042k5435k2919k0563j8201j5941
63378F54440j4026j2193r704o360k980n51Q40J935L401N345P517R667J1581J3079
63364F61991J4070J4656J5149J6021J7659K0096K2999K5927K8570L0855L3044
63353I01037L5670L8982M2279M4147M3567M0640L6004K9849K2010J2889L779l948
63341A246905r655j3393j5455j6348j6900j7851j9294k0819k2310k4280k7180
63330A043420l0631l3672l5645l6526l6446l5327l3189l0465k7656k4746k1352
63319F97765j7392j3304r493n909k501J8K75k606p914j3601j7681j9473j9535
$$ y = [1200518, 1185700, 1170055, 1154321, 1137929, 1119937, 1099884, 1077684, 1052950, 1024801, 992598, 956931, 919727, 883168, 848506, 815963, 785541, 757499, 732064, 709145, 688582, 670381, 654440, 640414, 628221, 618517, 612157, 609177, 608626, 609466, 611401, 614802, 620147, 627664, 637331, 648912, 661991, 676061, 690717, 705866, 721887, 739546, 759642, 782641, 808568, 837138, 867993, 901037, 936707, 975689, 1017968, 1062115, 1105682, 1146322, 1182326, 1212175, 1234185, 1247074, 1250853, 1246905, 1237250, 1223857, 1208402, 1192054, 1175154, 1157303, 1138009, 1117190, 1094880, 1070600, 1043420, 1012789, 979117, 943472, 906946, 870500, 835173, 801984, 771519, 743863, 719117, 697765, 680373, 667069, 657576, 651667, 649166, 649184, 649459, 646853, 638939, 625338, 607657, 588184, 568649]
63306E68649j8640j7131j5217j3450j2450j2219j2056j1227r588p588n888n069
63294D28126n372o443p422p566o919o216o090o395o378n564m330l547l654m247
63280C47983m569m255l440k413j458r02q95j120j042o38m75r21j527j570r51l06
63264C21501k66r42k017k984l317k820j955j479j569j563q17M42J386J589J363
63249C06552J130Q53L60j16j22M19J059J400J494J564J538J158M45j88k94K32
63233C17484J125J965K447K619K800L177L504L442L048K692K541K459K423K642
63219C54368L055L223K906K473K385K626K951L423M116M636M468L808L374L356
63205D01168L141K300J314Q82Q94N60n39j870k472j941q63k46m10n70K40J894
$$ y = [568649, 550009, 532878, 517661, 504211, 491761, 479542, 467486, 456259, 446671, 439083, 433195, 428126, 422754, 416311, 408889, 401323, 394404, 388188, 382098, 375703, 369325, 363761, 359431, 355884, 352230, 347983, 343414, 339159, 335719, 333306, 331848, 330946, 330051, 328931, 327889, 327251, 326776, 325855, 324328, 322758, 321807, 321501, 321235, 320293, 318276, 315292, 311975, 309155, 307200, 305721, 304152, 302589, 301772, 302214, 303600, 305189, 306552, 307682, 308535, 308895, 308779, 308657, 309076, 310135, 311535, 313029, 314593, 316131, 317289, 317734, 317546, 317252, 317484, 318609, 320574, 323021, 325640, 328440, 331617, 335121, 338563, 341611, 344303, 346844, 349303, 351726, 354368, 357423, 360646, 363552, 366025, 368410, 371036, 373987, 377410, 381526, 386162, 390630, 394438, 397812, 401168, 404309, 406609, 407923, 408805, 409699, 410259, 409720, 407850, 405378, 403437, 402574, 402328, 401918, 401348, 401588, 403482]
63189D03482L341M061M772O320Q361R755J0039R871J0064J0751J1615J2425J3081
63176E17938J3455J3501J3429J3492J3610J3423J2701J1644J0660R895R068P812
63164F60628O123M348K771J380j5j601l576o080r005j1989j4606j6472j7317j7273
63150E77316j7102j7549j8321j8213j6608j4325j2570j1502j0453r205q183p470
63138D15815o492m893l117j858j335j279j210o68M61J651K232K258K468L256M193
63123D11482M719M821M803M814M902N111N223M896M348M425N528O923P606P463
63109D87064P120O920O705O386O090N843N537N243N090M876M290L464K985L270
63095E60883M210N382O343O859P115P548Q217Q545Q067P183O517N873M457K124
$$ y = [403482, 406823, 410884, 415656, 421976, 430337, 440092, 450131, 460002, 470066, 480817, 492432, 504857, 517938, 531393, 544894, 558323, 571815, 585425, 598848, 611549, 623193, 633853, 643748, 652816, 660628, 666751, 671099, 673870, 675250, 675235, 673634, 670058, 663978, 654973, 642984, 628378, 611906, 594589, 577316, 560214, 542665, 524344, 506131, 489523, 475198, 462628, 451126, 440673, 431468, 423285, 415815, 409323, 404430, 401313, 399455, 398120, 396841, 395631, 394963, 395424, 397075, 399307, 401565, 404033, 407289, 411482, 416201, 421022, 425825, 430639, 435541, 440652, 445875, 450771, 455119, 459544, 465072, 471995, 479601, 487064, 494184, 501104, 507809, 514195, 520285, 526128, 531665, 536908, 541998, 546874, 551164, 554628, 557613, 560883, 565093, 570475, 576818, 583677, 590792, 598340, 606557, 615102, 623169, 630352, 636869, 642742, 647199, 649323]
63081F49323l57k376m106n835p348q298q715q762q462p955p686p958q500q812
63067E54153q650p983o845n500m447l871l310k226p23O23J508K117K736L428M155
63052E25165M980O047P420Q922J0186J1029J1672J2358J2823J2609J1908J1577
63040F46696J2077J2883J3249J3094J2778J2444J2044J1677J1405J0951J0103
63029G79401R182Q573Q087P192N781M070K020n06l146n319p117r120j1303j2856
63015G74939j3297j3029j2485j1516j0074q719p823o835n056k736o01J333L625
63002F87726O259Q610J0605J2916J5730J8177J9525K0197K0938K1568K1408K0588
62990H84247J9954J9724J9194J8112J7380J7820J8838J9085J8094J6424J4336
$$ y = [649323, 648966, 646590, 642484, 636649, 629301, 621003, 612288, 603526, 595064, 587109, 579423, 571465, 562965, 554153, 545503, 537520, 530675, 525175, 520728, 516857, 513547, 511321, 510598, 511221, 512729, 514846, 517582, 521010, 525165, 530145, 536192, 543612, 552534, 562720, 573749, 585421, 597779, 610602, 623211, 635119, 646696, 658773, 671656, 684905, 697999, 710777, 723221, 735265, 746942, 758347, 769298, 779401, 788583, 797156, 805243, 812435, 818216, 822286, 824306, 823800, 820654, 815335, 808218, 799098, 787795, 774939, 761642, 748613, 736128, 724612, 714538, 705819, 697996, 691161, 686105, 683369, 682768, 684101, 687726, 693985, 702595, 713200, 726116, 741846, 760023, 779548, 799745, 820683, 842251, 863659, 884247, 904201, 923925, 943119, 961231, 978611, 996431, 1015269, 1034354, 1052448, 1068872, 1083208]
62979A083208J1290P016K232k240o490j1060j5814j9989k3247k5979k8455l0320
62967I40152l1139l1040l0499k9800k8940k7840k6364k4376k2041j9859j8127
62956F50127j6561j4826j3288j2733j3332j4303j4771j4574j4070j3470j2780
62945D95419j2099j1591j1079j0123q684p422p111p848q934r468q941p425n514
62932C79180l989l286l181l140k989k982l220l325k949k350k093k288k416k009
62918C38963j256p91r71j454j536r28j50K4m34o61L5J280K101K096J698J402J275
62901C40693J285J557K068K527K779L000L258L387L556M432O245Q082Q849Q630
62887D00348Q418Q515Q065O402M149K513J940J882J561N66j057k845m212n012
$$ y = [1083208, 1094498, 1101514, 1103746, 1101506, 1095016, 1083956, 1068142, 1048153, 1024906, 998927, 970472, 940152, 909013, 877973, 847474, 817674, 788734, 760894, 734530, 710154, 688113, 668254, 650127, 633566, 618740, 605452, 592719, 579387, 565084, 550313, 535739, 521669, 508199, 495419, 483320, 471729, 460650, 450527, 441843, 434421, 427310, 419462, 410528, 401060, 392119, 384694, 379180, 375191, 371905, 368724, 365584, 362595, 359613, 356393, 353068, 350119, 347769, 345676, 343388, 340972, 338963, 337707, 336916, 335945, 334491, 332955, 332027, 331877, 331901, 331467, 330806, 330841, 332121, 334222, 336318, 338016, 339418, 340693, 341978, 343535, 345603, 348130, 350909, 353909, 357167, 360554, 364110, 368542, 374787, 382869, 391718, 400348, 408766, 417281, 425346, 431748, 435897, 438410, 440350, 442232, 443793, 444359, 443302, 440457, 436245, 431233]
62873D31233n725o757p712p833p097o384o410o897p078o691o133n760n490n082
62859C40184m536m020l588l187k829k532k187j667j116q37p98n22K50R98Q52l20
62843C14145j631k040j322j16P52Q78M33j20n25r15j396j586r66J95Q43L71n52
62826C06448q00j84N80J013J381J969K500K545K067J356P10L77N19R31J104P89
62810C23305L22J33J67Q0j38j26L11Q59J050Q44P03J086J832K239J923J448J663
62793C37701K454K664J561q6q40k04R78J711J906K237L244M705N805O003N768
62778C75607O218P876J0055J1742J2751J3517J4112J4127J3463J2617J2034J1696
62766E15815J1435J1127J0381Q604N748K648K44j374k916n065p759j0208j1508
$$ y = [431233, 425508, 418751, 411039, 403206, 396109, 389725, 383315, 376418, 369340, 362649, 356516, 350756, 345266, 340184, 335648, 331628, 328040, 324853, 322024, 319492, 317305, 315638, 314522, 313685, 312887, 312365, 312615, 313613, 314465, 314145, 312514, 310474, 309152, 309036, 309788, 310666, 311099, 310979, 310454, 309539, 308143, 306557, 305591, 305786, 306629, 307000, 306448, 305648, 305464, 306044, 307057, 308438, 310407, 312907, 315452, 317519, 318875, 319585, 319962, 320481, 321412, 322516, 323305, 323627, 323760, 323927, 324007, 323869, 323743, 324054, 324913, 325963, 326807, 327510, 328596, 330428, 332667, 334590, 336038, 337701, 340155, 342819, 344380, 344294, 343454, 343250, 344228, 345939, 347845, 350082, 353326, 358031, 363836, 369839, 375607, 381825, 389701, 399756, 411498, 424249, 437766, 451878, 466005, 479468, 492085, 504119, 515815, 527250, 538377, 548758, 557362, 563110, 565758, 566002, 564628, 561712, 556647, 548888, 538680, 527172]
62753E27172j1541j1197j1396j2002j2186j1793j1572j1891j2060j1381j0157
62742C99996r067q156p200o521o550o872o644n803n035m563l898k888k058j630
62728C23111j026J51J295J512P59j72n16mJ204K628L663L983L727L183K613K450
62712C48561L194M768O400P527Q428R585J0806J1609J2110J2917J4222J5720J7389
62699D83236J9614K2421K5155K7253K8852L0392L1997L3650L5524L7702L9730
62688H15526M0868M0750L9467L7091L3518K8783K3263J7336J1065M307k928j0275
62676A078771j7176k3238k8493l3206l7324m0247m1411m1037m0010l8935l7620
62665G00074l5697l3350l1097k9008k6672k3947k1305j9248j7713j6324j4956
$$ y = [527172, 515631, 504434, 493038, 481036, 468850, 457057, 445485, 433594, 421534, 410153, 399996, 390929, 382773, 375573, 369052, 362502, 355630, 348986, 343183, 338148, 333585, 329687, 326799, 324741, 323111, 322085, 322236, 323531, 325043, 325802, 325630, 325114, 325110, 326314, 328942, 332605, 336588, 340315, 343498, 346111, 348561, 351755, 356523, 362923, 370450, 378878, 388463, 399269, 410878, 422988, 435905, 450127, 465847, 483236, 502850, 525271, 550426, 577679, 606531, 636923, 668920, 702570, 738094, 775796, 815526, 856394, 897144, 936611, 973702, 1007220, 1036003, 1059266, 1076602, 1087667, 1091974, 1089046, 1078771, 1061595, 1038357, 1009864, 976658, 939334, 899087, 857676, 816639, 776629, 737694, 700074, 664377, 631027, 599930, 570922, 544250, 520303, 498998, 479750, 462037, 445713, 430757]
62654D30757j3680j2422j1013r583q486p823p357o945o683o497n953m849l661
62641C25805l035k911k662k045j528j463j419p94J83O46L39J1L31Q72P12k28j098
62624C11716j358j436j912k605k883k547j953j412r82o56m19j45J92K96J9j97
62608B93718J80Q53R24K25l53m2P94J319J291J068R45J024J442K146K754L099
62592C11387L587M527N398N538N266N519O398O999O811O316N957N354M109K638
62578C85804J514N81n94j840k721l420m465n703o385o230n676n078m386l816l927
62563C33658m699n207m804m019l651l535k921j819j059j020j159r97q27j025j221
62548B95695p82J07N55J28n64o21J17J029J516J566J548J653J717J549J227R23
$$ y = [430757, 417077, 404655, 393642, 384059, 375573, 367750, 360393, 353448, 346765, 340268, 334315, 329466, 325805, 322770, 319859, 317197, 315152, 313624, 312161, 310742, 309948, 310131, 310777, 311116, 311127, 311458, 312330, 313042, 312814, 311716, 310358, 308922, 307010, 304405, 301522, 298975, 297022, 295610, 294628, 293972, 293553, 293408, 293600, 293896, 293915, 293718, 293898, 294751, 295675, 295900, 295547, 295505, 296299, 297618, 298909, 299977, 300922, 301946, 303388, 305534, 308288, 311387, 314974, 319501, 324899, 330437, 335703, 341222, 347620, 354619, 361430, 367746, 373703, 379057, 383166, 385804, 387318, 387899, 387305, 385465, 382744, 379324, 374859, 369156, 362771, 356541, 350865, 345787, 341401, 337585, 333658, 328959, 323752, 318948, 314929, 311278, 307743, 304822, 303003, 301944, 300924, 299765, 298768, 297941, 296916, 295695, 294913, 295020, 295575, 295703, 295139, 294518, 294635, 295664, 297180, 298746, 300294, 301947, 303664, 305213, 306440, 307363]
62532C07363O24K39J7M77J700K914L196K552K005K479L848N188N850O037O447
62517C50936P498Q958J0282J1290J2423J4224J6596J8840K0474K1791K3371K5180
62505E41863K6460K6547K5585K4262K2988K1405J8819J5099J1014P478M509J267
62493G47296k647o334q476q873q460p868o655m316j384J132L050N084P683J0520
62479G19752J3193J5735J8119J9774K0118J9169J7204J4124R766M717M8l825p538
62466H60356j1790j6491k1144k5487k9351l2222l3560l3430l2381l0828k8994
62455E64678k7257k5876k4389k1990j8791j6005j4454j3414j1588q875o498n457
62443C70084n500n665n273m207k776j578j154j388j463o99O39J610J610R01K09
$$ y = [307363, 307987, 308226, 308243, 308720, 310420, 313334, 316530, 319082, 321087, 323566, 327414, 332602, 338452, 344489, 350936, 358434, 367392, 377674, 388964, 401387, 415611, 432207, 451047, 471521, 493312, 516683, 541863, 568323, 594870, 620455, 644717, 667705, 689110, 707929, 723028, 734042, 741520, 746029, 747296, 744649, 738315, 729839, 720966, 712506, 704638, 697983, 693667, 692283, 693415, 696465, 701549, 709232, 719752, 732945, 748680, 766799, 786573, 806691, 825860, 843064, 857188, 866954, 871671, 871719, 867894, 860356, 848566, 832075, 810931, 785444, 756093, 723871, 690311, 656881, 624500, 593672, 564678, 537421, 511545, 487156, 465166, 446375, 430370, 415916, 402502, 390914, 382039, 375541, 370084, 364584, 358919, 353646, 349439, 346663, 345085, 343931, 342543, 341080, 340381, 341020, 342630, 344240, 345141, 345350]
62428C45350J6K48M46J56p50k004l100l610l443k887k331j916j495j013p12p88
62412C22167r87q62m34j90m02p61q40o08k50J95P11J067J021O71L33J58J84O07
62394C21780J616K999M184M736M637M141L660L641M239M996N272M962M563M491
62380C79917M752N304O249P510Q746R857J1082J2335J2964J2671J2304J2969J4615
62367E11275J6133J6852J7284J8271K0063K2426K5211K8416L2028L6116M0828
62356G84903M6112N1657N7219O2690O7648P1238P2819P2437P0260O5886N8688
62345A481557M8741L6979K4552J2458J619p360j4724k1430k8260l5252m2029m8210
62333A408641n3262n6429n7190n5714n2697m8968m5376m2601m0651l8744l6179
$$ y = [345350, 345366, 345614, 346060, 346216, 345466, 343462, 340362, 336752, 333309, 330422, 328091, 326175, 324680, 323667, 322955, 322167, 321180, 320318, 319884, 319694, 319292, 318531, 317691, 317083, 316833, 317028, 317739, 318806, 319827, 320498, 320831, 320989, 321173, 321780, 323396, 326395, 330579, 335315, 339952, 344093, 347753, 351394, 355633, 360629, 365901, 370863, 375426, 379917, 384669, 389973, 396222, 403732, 412478, 422335, 433417, 445752, 458716, 471387, 483691, 496660, 511275, 527408, 544260, 561544, 579815, 599878, 622304, 647515, 675931, 707959, 744075, 784903, 831015, 882672, 939891, 1002581, 1070229, 1141467, 1214286, 1286723, 1356983, 1422869, 1481557, 1530298, 1567277, 1591829, 1604287, 1605906, 1598546, 1583822, 1562392, 1534132, 1498880, 1456851, 1408641, 1355379, 1298950, 1241760, 1186046, 1133349, 1084381, 1039005, 996404, 955753, 917009, 880830]
62322H80830l3231l0777k9101k7587k5622k3406k1635k0763k0690k0924k0783
62311F06311j9784j8140j6613j5566j4420j2469j0047q251p511p088o216n140
62299D65066m500m167l421k176j222j050j110o10L88J157J374J415J704K243K811
62284D57902L305L632L629L266K791K509K509K686K937L247L666M273N117O108
62270E07577P067P874Q572R378J0641J2664J5372J8253K0842K3268K6079K9664
62258F97251L4049L9161M4855N0612N5787O0304O4690O9113P2784P4603P4028
62247A337237P0934O4978N5793M3721K9962J5974K996q117j7214k5030l2663m0629
62235A497942m8599n5807o1412o4659o5338o4114o1988n9382n6123n2247m8137
$$ y = [880830, 847599, 816822, 787721, 760134, 734512, 711106, 689471, 668708, 648018, 627094, 606311, 586527, 568387, 551774, 536208, 521788, 509319, 499272, 491021, 483510, 476422, 470206, 465066, 460566, 456399, 452978, 450802, 449580, 448530, 447420, 446810, 447198, 448355, 449729, 451144, 452848, 455091, 457902, 461207, 464839, 468468, 471734, 474525, 477034, 479543, 482229, 485166, 488413, 492079, 496352, 501469, 507577, 514644, 522518, 531090, 540468, 551109, 563773, 579145, 597398, 618240, 641508, 667587, 697251, 731300, 770461, 815316, 865928, 921715, 982019, 1046709, 1115822, 1188606, 1263209, 1337237, 1408171, 1473149, 1528942, 1572663, 1602625, 1618599, 1621595, 1613478, 1596264, 1571234, 1538571, 1497942, 1449343, 1393536, 1332124, 1267465, 1202127, 1138013, 1076025, 1016643, 960520, 908273, 860136]
62224H60136m3900l9321l4649l0683k7665k4785k1355j7880j5325j3713j2243
62213E78617j0549r095q293p930p587p102o464n684m907m387m170m011l644k937
62199D91857j920q53j42K18R35K620M777O170O335O125O503P365P958Q077Q250
62184E54275Q934J0002J1052J1872J2500J3018J3340J3202J2416J1164R864Q750
62172F90389P838P365P901R728J2485J5702J9461K4082K9407L4858M0127M5255
62160I44598M9983N3485N4992N4280N1382M6171L8625K9318J9290R480M85p309
62148A344780j3714j9109k4422l0443l6946m2699m6474m8013m7938m6830m4754
62137I43438m1718l8168l4643l1173k7472k3679k0398j7919j5813j3593j1374
$$ y = [860136, 816236, 776915, 742266, 711583, 683918, 659133, 637778, 619898, 604573, 590860, 578617, 568068, 558973, 550680, 542750, 535163, 528061, 521597, 515913, 511006, 506619, 502449, 498438, 494794, 491857, 489937, 489084, 488942, 489160, 490095, 492715, 497492, 503662, 509997, 516122, 522625, 529990, 537948, 546025, 554275, 563209, 573211, 584263, 596135, 608635, 621653, 634993, 648195, 660611, 671775, 681639, 690389, 698227, 705592, 713493, 723221, 735706, 751408, 770869, 794951, 824358, 859216, 899343, 944598, 994581, 1048066, 1103058, 1157338, 1208720, 1254891, 1293516, 1322834, 1342124, 1351604, 1352089, 1344780, 1331066, 1311957, 1287535, 1257092, 1220146, 1177447, 1130973, 1082960, 1035022, 988192, 943438, 901720, 863552, 828909, 797736, 770264, 746585, 726187, 708268, 692455, 678862, 667488]
62126F67488r556q125o663m932l088j363J76J500K593L607M872O627Q830J1219
62112F73185J3451J5285J6832J8542K0631K2556K3280K2104J8945J3988P720J468
62100H67987k854m217l430k171j308q14r99k777o351j0431j3325j4410j4069j2662
62086G78169j0251p164m043j220J511M378P331J0304J3345J6231J8472J9991K1468
62073H68522K3581K6119K8285K9663L0508L1173L1798L2508L3451L4454L5154
62062A205216L5658L6672L8581M0697M1798M1202L8899L4819K8649K0576J1760
62051A574527L634l207r211j5085k1005k6629l1663l6223m0564m4610m7878m9927
62039A252159n0672n0196m8546m5926m2948m0231l7747l4975l1755k8606k5984
$$ y = [667488, 657932, 649807, 643144, 638212, 635124, 633761, 633937, 635437, 638030, 641637, 646509, 653136, 661966, 673185, 686636, 701921, 718753, 737295, 757926, 780482, 803762, 825866, 844811, 858799, 866519, 867987, 865133, 860916, 857486, 855315, 854007, 853193, 852194, 849417, 843066, 832635, 819310, 804900, 790831, 778169, 767918, 760754, 756711, 755491, 757002, 761380, 768711, 779015, 792360, 808591, 827063, 847054, 868522, 892103, 918222, 946507, 976170, 1006678, 1037851, 1069649, 1102157, 1135608, 1170062, 1205216, 1240874, 1277546, 1316127, 1356824, 1398622, 1439824, 1478723, 1513542, 1542191, 1562767, 1574527, 1578161, 1574954, 1565743, 1550658, 1529653, 1503024, 1471361, 1435138, 1394574, 1349964, 1302086, 1252159, 1201487, 1151291, 1102745, 1056819, 1013871, 973640, 935893, 900918, 869163, 840557, 814573]
62028H14573k3623k0937j7831j4832j2498j1052j0398j0157r759q891p879p331
62016F59385p402p699p859p891p922p951p971p922p502o351m600k865j516l49
62002E73585Q72J942K658L335M373N563O329O468O146N319L779J819K06p10j418
61987F20266k510l951n383o765q295r868j1032j1468j1241j0589r730q939q542
61974E11953q624q762q291p001n542m863n119n392m798l612k856k918l193l126
61960D37856k937k941k796j983o88M07R94J327J639J943K302K754L039K922K865
61945D46703L726N615P620R011J0151J1751J3704J5244J6143J7068J8584K0349
61933E95669K1578K2015K2099K2155K1909K0961J9541J8245J7041J5085J1948
$$ y = [814573, 790950, 770013, 752182, 737350, 724852, 713800, 703402, 693245, 683486, 674595, 666716, 659385, 651983, 644284, 636425, 628534, 620612, 612661, 604690, 596768, 589266, 582915, 578315, 575450, 573934, 573585, 574457, 576399, 579057, 582392, 586765, 592328, 598657, 605125, 611271, 616590, 620369, 622188, 622394, 621684, 620266, 617756, 613805, 608422, 601657, 593362, 583494, 572462, 560994, 549753, 539164, 529434, 520495, 511953, 503329, 494567, 486276, 479275, 473733, 468870, 463751, 458359, 453561, 449949, 447093, 444175, 440982, 437856, 434919, 431978, 429182, 427199, 426511, 426918, 427912, 429239, 430878, 432821, 435123, 437877, 440916, 443838, 446703, 450429, 456044, 463664, 472675, 482826, 494577, 508281, 523525, 539668, 556736, 575320, 595669, 617247, 639262, 661361, 683516, 705425, 726386, 745927, 764172, 781213, 796298, 808246]
61922H08246Q518O003M252J911j617n302p931r636j1255j2723j3039j1625q963
61909G46839n827k563Q00M241P698J0942J3407J4621J4759J4382J3559J1774Q779
61896H53411M988R08l269p250j0406j2411j3665j4750j5765j6548j7125j7542
61884G30576j7546j6927j5912j4895j4000j3267j2898j2940j3067j3158j3663
61873E72303j4783j5620j4954j2798j0358q518p054n455l728k125p40L59J164
61860D77693K106L843O332Q694J0303J1587J3360J5852J8720K1585K4110K6086
61848F40271K7750K9719L2168L4551L6466L8162L9576L9616L7268L3053K8386
61837A016986K3667J8066J1109L604l263q820j2746j4803j5198j4581j3296j1137
$$ y = [808246, 816764, 822767, 827019, 828930, 827313, 822011, 814080, 804444, 793189, 780466, 767427, 755802, 746839, 741012, 738449, 739249, 743490, 751188, 762130, 775537, 790158, 804917, 819299, 832858, 844632, 853411, 858399, 859307, 856038, 848788, 838382, 825971, 812306, 797556, 781791, 765243, 748118, 730576, 713030, 696103, 680191, 665296, 651296, 638029, 625131, 612191, 599124, 585966, 572303, 557520, 541900, 526946, 514148, 503790, 495272, 488218, 482763, 479035, 476910, 476170, 476529, 477693, 479799, 483642, 489974, 498668, 508971, 520558, 533918, 549770, 568490, 590075, 614185, 640271, 668021, 697740, 729908, 764459, 800925, 839087, 878663, 918279, 955547, 988600, 1016986, 1040653, 1058719, 1069828, 1073432, 1070169, 1061349, 1048603, 1033800, 1018602, 1004021, 990725, 979588]
61825I79588q061m545r27L002P221J0883J2980J3285J2074R471N561Q77m013r191
61811A028205j4977k0904k5811k9080l1135l2589l3422l3319l2327l0793k8907
61800G14941k6689k4274k1856j9416j6832j4296j2357j1333j0801r947q470o935
61788E31735o058n855n718n233m572m071l802l679l681l742l696l500l257k882
61774D71989k131j286j249k447l948m303l221j699n90K81J378K445K781K168J178
61759D61346O93J203K450L579L924L691L684M257M935N082M574L637K513J549
61745E07117J125J116Q28p8j003j252j068j134j347r63N9P71M98k82o57k76O52
61728E04106J788K569K368J331O40J249K625L440L280K901K863K823K399J931
$$ y = [979588, 971527, 966982, 966055, 969057, 976278, 987161, 1000141, 1013426, 1025500, 1034971, 1040532, 1041409, 1037396, 1028205, 1013228, 992324, 966513, 937433, 906298, 873709, 840287, 806968, 774641, 743848, 714941, 688252, 663978, 642122, 622706, 605874, 591578, 579221, 567888, 557087, 547140, 538670, 531735, 525677, 519822, 514104, 508871, 504299, 500228, 496426, 492747, 489066, 485324, 481628, 478128, 474871, 471989, 469858, 468572, 467323, 464876, 460928, 456625, 453404, 451705, 451115, 451396, 452774, 455219, 458000, 460168, 461346, 462039, 463242, 465692, 469271, 473195, 476886, 480570, 484827, 489762, 494844, 499418, 503055, 505568, 507117, 508242, 509358, 510186, 510108, 509105, 507853, 506785, 505651, 504304, 503341, 503400, 504171, 504669, 504387, 503730, 503454, 504106, 505894, 508463, 510831, 512162, 512802, 514051, 516676, 520116, 523396, 526297, 529160, 531983, 534382, 536313]
61714E36313J908K266K677L087L498L626L309K912K746K399J309j88j208j652
61700E63002k288l359l967l372k155j470j599j922j987j896j815j778j943k476
61686E30975l130l523l752m214m734m614l751k993k976l242l015k404k112k266
61672D84249k272j770j126q95j249k010k801l073k534j604j073j091r75k05P86
61657D62357J255J160J048J165J255J201J340J960K911L806M391M544M280L901
61643D96574L894M389M913M938M531M170M044L856L311K417J262p0j296j987k095
61628E32851k130k488k870k825k606k955l928m566m000k530j221o86p22r15j120
61613D97289j302j318j165j162j682k746m030n214o137o673o655o054n184m552
$$ y = [536313, 538221, 540487, 543164, 546251, 549749, 553375, 556684, 559596, 562342, 564741, 566050, 565862, 564654, 563002, 560714, 557355, 553388, 550016, 547861, 546391, 544792, 542870, 540883, 538987, 537172, 535394, 533451, 530975, 527845, 524322, 520570, 516356, 511622, 507008, 503257, 500264, 497288, 494046, 491031, 488627, 486515, 484249, 481977, 480207, 479081, 478186, 476937, 474927, 472126, 469053, 466519, 464915, 463842, 462751, 461776, 461571, 462357, 463612, 464772, 465820, 466985, 468240, 469441, 470781, 472741, 475652, 479458, 483849, 488393, 492673, 496574, 500468, 504857, 509770, 514708, 519239, 523409, 527453, 531309, 534620, 537037, 538299, 538229, 536933, 534946, 532851, 530721, 528233, 525363, 522538, 519932, 516977, 513049, 508483, 504483, 501953, 500732, 500046, 499324, 498409, 497289, 495987, 494669, 493504, 492342, 490660, 487914, 483884, 478670, 472533, 465860, 459205, 453151, 447967, 443415]
61599D43415m408m485m357l950l596l451l223k627j949j760k173k692k849k697
61585C99198k578k710l116l652l975l741l078k563k502k530k244j913k051k525
61571C60020k699k460k374k709k964k709k322k372k662k488j685q11l62l60o94
61556C30349j324j952k012j333n14k34l83k45M66J138J041K83k40P6Q37J233J104
61539C28290J027J315J489J076N38P74J865K875K998K384J642J063O18L43L05
61524C48602L63K32k11r16j744k480k903l013l004k933k688k333k148k157j988
61509C20679j484r67o42j62P10J437J298L98n07j009j217j184p89k41%j55l91
61492C15774n31o24n23n3M49M67J65K09O18O51K7o25p93p27o04q0P79J063L09
$$ y = [443415, 439007, 434522, 430165, 426215, 422619, 419168, 415945, 413318, 411369, 409609, 407436, 404744, 401895, 399198, 396620, 393910, 390794, 387142, 383167, 379426, 376348, 373785, 371283, 368753, 366509, 364596, 362545, 360020, 357321, 354861, 352487, 349778, 346814, 344105, 341783, 339411, 336749, 334261, 332576, 331765, 331403, 331043, 330349, 329025, 327073, 325061, 323728, 323214, 322980, 322597, 322352, 322818, 323956, 324997, 325280, 325040, 325116, 325953, 327186, 328290, 329317, 330632, 332121, 333197, 333735, 334509, 336374, 339249, 342247, 344631, 346273, 347336, 347954, 348297, 348602, 348965, 349197, 348986, 348070, 346326, 343846, 340943, 337930, 334926, 331993, 329305, 326972, 324824, 322667, 320679, 319195, 318228, 317586, 317424, 318134, 319571, 320869, 321267, 320760, 319751, 318534, 317350, 316561, 316320, 316320, 316165, 315774, 315243, 314619, 314096, 314043, 314492, 314959, 315124, 315333, 315951, 316602, 316629, 316004, 315211, 314484, 313880, 313800, 314579, 315642, 315951]
61473C15951n37l62N56J204J408J643J770J203J70m92p07j160j848j912j162n71
61457C15154p03p88j01P36O29l49j169j227p75k23K15L70K47K20O14J158J318
61440C15326J041O85M39K72M14J233K568L680M085M040L997L922L487K730K136
61425C50055K022K117J915J315P20N17O96J026J372J680J857J906J989K052J634
61410C72873M95p46j238j059j060j531j824j552j315j701k322k501k317k231k151
61395C49820j713j159j043j275j280j043j114j575j816j453p28P0Q95J465J368
61380C39419Q73Q92J710K496K450J837J356J140J002J038J367J673J669J651J875
61365C62448J804P99o38j228n40N44J078J087J187J788K831L868M221L636K889
$$ y = [315951, 315414, 315052, 315608, 316812, 318220, 319863, 321633, 322836, 323006, 322514, 321807, 320647, 318799, 316887, 315725, 315154, 314451, 313663, 313562, 314298, 314927, 314578, 313409, 312182, 311407, 311184, 311399, 311769, 312016, 312236, 312850, 314008, 315326, 316367, 317052, 317491, 317763, 318177, 319410, 321978, 325658, 329743, 333783, 337780, 341702, 345189, 347919, 350055, 352077, 354194, 356109, 357424, 358144, 358661, 359357, 360383, 361755, 363435, 365292, 367198, 369187, 371239, 372873, 373368, 372622, 371384, 370325, 369265, 367734, 365910, 364358, 363043, 361342, 359020, 356519, 354202, 351971, 349820, 348107, 346948, 345905, 344630, 343350, 342307, 341193, 339618, 337802, 336349, 335621, 335691, 336586, 338051, 339419, 340292, 341184, 342894, 345390, 347840, 349677, 351033, 352173, 353175, 354213, 355580, 357253, 358922, 360573, 362448, 364252, 365051, 364413, 363185, 362645, 363189, 364267, 365354, 366541, 368329, 371160, 375028, 379249, 382885, 385774]
61350C85774L131M441N691O145O445P536R247J0610J1157J1122J0622R528Q037
61337D89486O643N436M095K710J936J995K114J383j86j868l096l803m095m166
61323D98584m382m971n565n438m348k875j810j441j551j840k111k123j600n28
61309D58001O85J546J969K313K838L319L471L568M288N884P848R550J0786J1458
61295E27524J1076R131N809J981j511m232o019o956p454p905q190p894p087o349
61281D91924n940n428m371k897j318L10J866K868L085L152L942N404O614O951
61267E06162O754O750P279Q189R074R463R045Q006O946O461O830Q034R792J1579
61253F20364J2969J3944J4697J5008J4244J2057Q871N495K462j66k569m923p148
$$ y = [385774, 388905, 393346, 399037, 405182, 411627, 419163, 428410, 439020, 450177, 461299, 471921, 481449, 489486, 496129, 501565, 505660, 508370, 510306, 512301, 514415, 515798, 515612, 513744, 510648, 506845, 502750, 498584, 494202, 489231, 483666, 478228, 473880, 471005, 469195, 467754, 466203, 464363, 462252, 460129, 458529, 458001, 458686, 460232, 462201, 464514, 467352, 470671, 474142, 477710, 481998, 487882, 495730, 505280, 516066, 527524, 538600, 547731, 553540, 555521, 554010, 549778, 543759, 536803, 529349, 521444, 513254, 505360, 498273, 491924, 485984, 480556, 476185, 473288, 471970, 472280, 474146, 477014, 480099, 483251, 487193, 492597, 499211, 506162, 512916, 519666, 526945, 535134, 544208, 553671, 562716, 570722, 577668, 584129, 590959, 598993, 608785, 620364, 633333, 647277, 661974, 676982, 691226, 703283, 712154, 717649, 720111, 719945, 717376, 712453, 705305]
61240G05305q865r722r817r547r062q222p144o291n750n005l739k454j759j454
61226F16474r13j67J88J26M35J582K967L693L588L056K307J295K00n68q90j113
61210F32260j627k479l383l858l436k106n56K89J11o14j238j453j210n40L10J016
61194F11486J679K982N401Q440J1091J2981J4664J6737J9024K0754K1194K0038
61182G66471J7519J4405J1639R668Q228O922N810N203N052M839M078K666P40j471
61168H61769l567n054n760o105o680p535q197q412q660r576j1015j2106j2325
61155G56777j2092j2053j2085j1524j0229q829p837p000n805m223k583r56R67
61142F62528L358N768P217O754M195M25l162n692p179p985q283q201p969p610
$$ y = [705305, 696440, 686718, 676901, 667354, 658292, 650070, 642926, 636635, 630885, 625880, 622141, 619687, 617928, 616474, 615561, 615394, 615582, 615708, 616143, 617725, 620692, 624385, 627973, 631029, 633336, 634631, 634831, 634263, 633373, 632260, 630633, 628154, 624771, 620913, 617477, 615371, 614815, 615104, 615215, 614601, 613363, 611910, 610700, 610160, 610470, 611486, 613165, 616147, 621548, 629988, 641079, 654060, 668724, 685461, 704485, 725239, 746433, 766471, 783990, 798395, 810034, 819702, 827930, 834852, 840662, 845865, 850917, 855756, 859834, 862500, 863240, 861769, 858202, 853148, 847388, 841283, 834603, 827068, 818871, 810459, 801799, 792223, 781208, 769102, 756777, 744685, 732632, 720547, 709023, 698794, 689965, 682128, 675128, 669323, 665100, 662517, 661561, 662528, 665886, 671654, 678871, 685625, 689820, 690245, 687083, 681391, 674212, 666227, 657944, 649743, 641774, 634164]
61128F34164o747n157l254j607j49J599L650N472O854Q272J0172J2314J4061J5075
61114F94719J5510J5769J6261J7203J8380J9248J9498J9415J9490J9742J9688
61103H94923J8991J7906J6918J6118J5188J3987J2773J1657J0065P190K964j721
61091A036959n826r041j1806j4725j7981k1058k3030k3441k2903k2455k2360k1955
61079H20378k0832j9452j8347j7278j5745j3877j2254j1138j0277r263p730n584
61067F58601l369j944j379p07O52J925K175J840K088L006L644L663L809M630N717
61052F84351O478O883P279Q027R387J1092J2287J2576J2908J4411J6615J8018
61040H20312J8348J8899K0509K2550K4263K5756K7211K8344K9212L0375L1737
$$ y = [634164, 627417, 622260, 619006, 617399, 617250, 618849, 622499, 627971, 634825, 643097, 653269, 665583, 679644, 694719, 710229, 725998, 742259, 759462, 777842, 797090, 816588, 836003, 855493, 875235, 894923, 913914, 931820, 948738, 964856, 980044, 994031, 1006804, 1018461, 1028526, 1035716, 1038680, 1036959, 1031133, 1022092, 1010286, 995561, 977580, 956522, 933492, 910051, 887148, 864693, 842333, 820378, 799546, 780094, 761747, 744469, 728724, 714847, 702593, 691455, 681178, 671915, 664185, 658601, 655232, 653288, 651909, 651202, 651854, 653779, 655954, 657794, 659882, 662888, 666532, 670195, 674004, 678634, 684351, 690829, 697712, 704991, 713018, 722405, 733497, 745784, 758360, 771268, 785679, 802294, 820312, 838660, 857559, 878068, 900618, 924881, 950637, 977848, 1006192, 1035404, 1065779, 1097516]
61029A097516L2454L2510L3166L5059L7185L8491L9357M0649M2616M5543N0106
61018A524652N5861O0721O3205O4204O5284O6665O8342P1856P9013Q9749J02979
61007B312531J18587J36637J55630J73897J92466K14783K44257K83875L37012
60998D169675M05911M90040N88703P04594Q42186J004307J195287J427947J722766
60989A2551416K097386K553484L057766L511596L737708L539018K832305J756895
60981C5637574O38153j90027n56592m84858j08314L99549Q24661R21085N11928
60972C7593159l74755j482421k468992l100685l338141l278417l046977k736673
60964A7766098k404565k084566j792537j530950j297921j092646r14012p59496
$$ y = [1097516, 1129970, 1162480, 1195646, 1230705, 1267890, 1306381, 1345738, 1386387, 1429003, 1474546, 1524652, 1580513, 1641234, 1704439, 1768643, 1833927, 1900592, 1968934, 2040790, 2119803, 2209552, 2312531, 2431118, 2567755, 2723385, 2897282, 3089748, 3304531, 3548788, 3832663, 4169675, 4575586, 5065626, 5654329, 6358923, 7201109, 8205416, 9400703, 10828650, 12551416, 14648802, 17202286, 20260052, 23771648, 27509356, 31048374, 33880679, 35637574, 36275727, 36085700, 35529108, 35044250, 34935936, 35335485, 36160146, 37081231, 37593159, 37218404, 35735983, 33266991, 30166306, 26828165, 23549748, 20502771, 17766098, 15361533, 13276967, 11484430, 9953480, 8655559, 7562913, 6648901, 5889405]
60956E889405o27699n19233m33561l66985l14815k73785k41366k14626j91238
60947B706097j70536j52466j36258j20999j06717r4025q3275p4749o9103o6727
60937A631242o6883o7986o8623o7995o5796o2165n7663n2984m8637m4867m1595
60926I86048l8490l5358l2490l0245k8365k6184k3605k1272j9592j8059j5979
60915F96409j3507j1569j0766j0672j0295r137p658o589n969n180l922k640j778
60902E96727j103k52N25P28L87r1n81j139j491j360j140j520k410l021k972k705
60886E78582k714l037l629m494n336n671n573n712o419p257p742p909p906p701
60872D97482p440p549q036q211p562o476n652n142m563l823l130k452j570n95
$$ y = [5889405, 5261706, 4742473, 4308912, 3941927, 3627112, 3353327, 3111961, 2897335, 2706097, 2535561, 2383095, 2246837, 2125838, 2019121, 1925096, 1841821, 1767072, 1697969, 1631242, 1564359, 1496373, 1427750, 1359755, 1293959, 1231794, 1174131, 1121147, 1072510, 1027643, 986048, 947558, 912200, 879710, 849465, 821100, 794916, 771311, 750039, 730447, 712388, 696409, 682902, 671333, 660567, 649895, 639600, 630463, 622805, 616216, 610247, 605067, 601145, 598505, 596727, 595624, 595372, 595897, 596625, 597012, 596921, 596340, 595201, 593710, 592350, 591210, 589690, 587280, 584259, 581287, 578582, 575868, 572831, 569202, 564708, 559372, 553701, 548128, 542416, 535997, 528740, 520998, 513089, 505183, 497482, 490042, 482493, 474457, 466246, 458684, 452208, 446556, 441414, 436851, 433028, 429898, 427446, 425876, 425281]
60858D25281N5K60L82Q18J590K466L262L947M571N138N517N533N182M698M456
60843D73156M756N624O607O933O105M393K542J030j99j312k276k990l411l478
60829D97480l164k673k297k068j780j391j110j046j090j163j241j220j073j172
60815D74992j951l216m303m982n648o434o771o281n520n313n711o058n890n272
60801D01642m478l834l643l857l900l280k279j625j576j727j685j434j046n09
60787C66769k0o5p79j524j376j08J514K473K419J838J451J573K025K529K999L484
60771C85202L909M055L799L405L422M116N125N918O541P426Q406Q542P388N833
60757D63087N014M805M222L103K324K295K294J748J202J358J854J761R02m9n11
$$ y = [425281, 425336, 425596, 425978, 426796, 428386, 430852, 434114, 438061, 442632, 447770, 453287, 458820, 464002, 468700, 473156, 477912, 483536, 490143, 497076, 503181, 507574, 510116, 511146, 510947, 509635, 507359, 504369, 500958, 497480, 494316, 491643, 489346, 487278, 485498, 484107, 482997, 481951, 480861, 479698, 478457, 477237, 476164, 474992, 473041, 469825, 465522, 460540, 454892, 448458, 441687, 435406, 429886, 424573, 418862, 412804, 406914, 401642, 397164, 393330, 389687, 385830, 381930, 378650, 376371, 374746, 373170, 371443, 369758, 368324, 367278, 366769, 366749, 366684, 365905, 364381, 363005, 362897, 364411, 366884, 369303, 371141, 372592, 374165, 376190, 378719, 381718, 385202, 389111, 393166, 396965, 400370, 403792, 407908, 413033, 418951, 425492, 432918, 441324, 449866, 457254, 463087, 468101, 472906, 477128, 480231, 482555, 484850, 487144, 488892, 490094, 491452, 493306, 495067, 495969, 495920, 495409]
60742D95409m53j64j11q95k688m834o444p340p950q439q468p812o737n771n340
60727D21963n542n854n310l567j680j080j765k259j629o47m22o15L1J744L293
60712C96661L612L024K555K648L105L826M900O132P089P663Q107Q426Q279P665
60698D73692P184P303P758Q047Q091P990P564O675N755N353N358N321N364O026
60684E67481P310Q593R542J0398J1254J1927J2636J3966J5740J6850J6659J5808
60672G18164J5123J4471J3382J2001J0585Q693N817K435n97l302o290r407j1790
60659G69285j3206j4323j5535j6475j6864j6990j7003j6587j5675j4722j3848
60648E98057j2492j0478q735q185q323p791o230m784m619n547o393o391n821n389
$$ y = [495409, 494956, 494792, 494681, 493786, 491098, 486264, 479820, 472480, 464530, 456091, 447623, 439811, 433074, 427303, 421963, 416421, 410567, 405257, 401690, 400010, 398930, 397165, 394906, 393277, 392630, 392208, 391593, 391624, 393368, 396661, 400273, 403297, 405852, 408500, 411605, 415431, 420331, 426463, 433552, 441215, 449322, 457748, 466027, 473692, 480876, 488179, 495937, 503984, 512075, 520065, 527629, 534304, 540059, 545412, 550770, 556091, 561455, 567481, 574791, 583384, 592926, 603324, 614578, 626505, 639141, 653107, 668847, 685697, 702356, 718164, 733287, 747758, 761140, 773141, 783726, 792419, 798236, 800671, 800074, 796772, 790482, 781075, 769285, 756079, 741756, 726221, 709746, 692882, 675892, 658889, 642302, 626627, 611905, 598057, 585565, 575087, 566352, 558167, 549844, 542053, 535823, 531039, 526420, 520873, 514480, 508089, 502268, 496879]
60634D96879n311n118m327l039j821j089p69n05MQ89K043L087L501L049K035J062
60618D90570M98J84k78r71j567j860k217l133m402n154m830l785k752k126j965
60603D56212k228k614k535j811j117j237k007k594k607k396k272k081j634j082
60589D27997o47m06m12o25p00k37O38J331J534J511J548J548J334J061J051J531
60573D38057K526L778M736N062N253O298Q487J1045J3131J4816J6693J8922K1118
60560E69922K2966K4474K5606K5898K4619K1233J5875R407K879l068q166j2004
60548G19641j4043j4205j3049j1152q597n352j747J800N369R377J3904J8551K3108
60535G23605K7981L3603L9399M3624M4492M1543L5769K8468K0300J1471K328o560
$$ y = [496879, 491568, 486450, 482123, 479084, 477263, 476174, 475405, 474900, 474904, 475793, 477836, 480923, 484424, 487473, 489508, 490570, 491068, 491252, 490974, 490003, 488436, 486576, 484359, 481226, 476824, 471670, 466840, 463055, 460303, 458177, 456212, 453984, 451370, 448835, 447024, 445907, 444670, 442663, 440069, 437462, 435066, 432794, 430713, 429079, 427997, 427350, 426944, 426532, 425907, 425207, 424970, 425608, 426939, 428473, 429984, 431532, 433080, 434414, 435475, 436526, 438057, 440583, 444361, 449097, 454159, 459412, 465710, 474197, 485242, 498373, 513189, 529882, 548804, 569922, 592888, 617362, 642968, 668866, 693485, 714718, 730593, 740000, 742879, 739811, 731645, 719641, 705598, 691393, 678344, 667192, 658595, 653243, 651496, 653296, 658665, 668042, 681946, 700497, 723605, 751586, 785189, 824588, 868212, 912704, 954247, 990016, 1018484, 1038784, 1050255, 1052583, 1046023]
60523A046023j4560k0781k4108k4124k1904j9183j6816j4599j2492j1065j0551
60512H55840j0296r625q615p474n741k848Q32M114O204P445Q869J1275J4675J8522
60498H83177K2532K7209L3342M1105N0080N9980P0627Q1106Q9906R6300J00927
60487A556291J04320J05513J02787R5510Q4583P1378N6715M0641K2618K212j9935
60476B222633m2090o2701q1226r7233j09349j16135j17687j15438j10507j03156
60466A267111r3877q3990p4770o6625n9345n2675m6451m0621l5361l0868k7003
60455F55525k3550k0650j8508j6784j4930j3023j1603j0629r354p438n485m292
60443D99279m090m669n570o015n328l798k440j720j157m04J37K06K81O41O55k11
$$ y = [1046023, 1031463, 1010682, 986574, 962450, 940546, 921363, 904547, 889948, 877456, 866391, 855840, 845544, 835919, 827304, 819830, 814089, 811241, 812073, 816187, 822391, 829836, 838705, 849980, 864655, 883177, 905709, 932918, 966260, 1007365, 1057445, 1117425, 1188052, 1269158, 1359064, 1455364, 1556291, 1660611, 1766124, 1868911, 1964421, 2049004, 2120382, 2177097, 2217738, 2240356, 2242568, 2222633, 2180543, 2117842, 2036616, 1939383, 1830034, 1713899, 1596212, 1480774, 1370267, 1267111, 1173234, 1089244, 1014474, 947849, 888504, 835829, 789378, 748757, 713396, 682528, 655525, 631975, 611325, 592817, 576033, 561103, 548080, 536477, 525848, 516494, 509056, 503571, 499279, 495189, 490520, 484950, 478935, 473607, 469809, 467369, 465649, 464492, 464088, 464225, 464431, 464712, 465353, 466008, 465797]
60427D65797j355j964k456l824n812o924o369n004m046l689l416k969k462j909
60413D13598j221n68l09m95o66l02N31J127R29K65pL72P02L47l23n25k02L8k4
60394D13267QL21N11K74o0k7L16O18P84J023J442J908K212K222J921J413Q89N05
60376D29547L30L64M92N42N07N40N78K60m12o52K56J787K626K282J542J066M94
60359D42149n39j343r98K13J094J048N11J3l31m57k06K34L86K44L56R53J544J701
60341D46572J709K046K629L047L180L151K877K173J219N00K53K79K60M8k93n01
60325D69149l11J63L97R3l16j75M55Q80P43M98P09J355K095K851L734M617N234
60308D92171N718O584Q073R817J1330J2642J4233J6507J9620K3703K8710L3779
$$ y = [465797, 464442, 462478, 460022, 456198, 450386, 443462, 437093, 432089, 428043, 424354, 420938, 417969, 415507, 413598, 412377, 411809, 411500, 411005, 410339, 410037, 410568, 411695, 412624, 412889, 412882, 413254, 413956, 414303, 413980, 413455, 413253, 413291, 413267, 413275, 413596, 414107, 414381, 414321, 414294, 414610, 415228, 416012, 417035, 418477, 420385, 422597, 424819, 426740, 428153, 429042, 429547, 429877, 430241, 430733, 431275, 431782, 432322, 432900, 433160, 432748, 432096, 432352, 434139, 436765, 439047, 440589, 441655, 442149, 441610, 440267, 439269, 439482, 440576, 441624, 442135, 442148, 441817, 441360, 441154, 441388, 441774, 442018, 442374, 443327, 444871, 446572, 448281, 450327, 452956, 456003, 459183, 462334, 465211, 467384, 468603, 469103, 469356, 469635, 469895, 469943, 469650, 469149, 468838, 469001, 469398, 469491, 469175, 469000, 469455, 470335, 471078, 471576, 472285, 473640, 475735, 478586, 482320, 486937, 492171, 497889, 504473, 512546, 522363, 533693, 546335, 560568, 577075, 596695, 620398, 649108, 682887]
60296F82887L7051L6670L2112K4443J5220N373m852j5078k4188l0631l3375l2676
60284F92956k9837k6174k2236j8057j3937j0555q407p412p165p241p258p001o650
60271E21026o570o742o761o458o143n986n619m721l632k962k800k724k451k087
60257D55370j816j664j516j191o80l60o33j193j201m83M2l00q15m55N65J124R34
60240D45728P46R54J008N16q8k67o6K82P51J258J634J974K462K787K584K472L471
60223D68206N150N629M122K218J663J980J572L72j21Q46K369L321L525L346L053
60208E07251K911L145L571L745L595L461L459L368L050K556J851J010N04P18J246
60193E45441J340R37N78M12M8n65r23q55q86j450k285k871k931k447j735j521
$$ y = [682887, 719938, 756608, 788720, 813163, 828383, 833756, 828904, 813826, 789638, 759007, 725632, 692956, 663119, 636945, 614709, 596652, 582715, 572160, 563753, 556341, 549176, 541935, 534677, 527676, 521026, 514456, 507714, 500953, 494495, 488352, 482366, 476747, 472026, 468394, 465432, 462632, 459908, 457457, 455370, 453554, 451890, 450374, 449183, 448503, 448143, 447510, 446317, 445116, 444633, 444675, 444375, 443560, 443105, 443670, 444794, 445728, 446474, 447428, 448436, 448952, 448864, 448597, 448531, 448813, 449564, 450822, 452456, 454430, 456892, 459679, 462263, 464735, 468206, 473356, 478985, 483107, 485325, 486988, 488968, 490540, 490912, 490791, 491637, 494006, 497327, 500852, 504198, 507251, 510162, 513307, 516878, 520623, 524218, 527679, 531138, 534506, 537556, 540112, 541963, 542973, 543477, 544195, 545441, 546781, 547718, 548296, 548708, 548756, 548191, 547268, 546413, 545527, 544077, 541792, 538921, 535990, 533543, 531808, 530287]
60177E30287k286l390l623k744j740j330j098n16N6O6j94n9M83Q59P71M18J18
60160E16078J44P12J683K559L060L500M187M875N130M934M471L679K542J470Q90
60145E59914O77M61K66L86Q61J537K367L217L630L437L309M092N664P034P460
60130F04312O913N600L772J972P97K15l75j343k521l639m529m808m054k464q23
60115E99025L63J259K048K528K543K303J984J534J133J305K178L062L343L313
60101F27921L646M378M986N242N290N076M285K901J275m04k179l774m567m351
60087F49725l693l209k862k282j486p84j11R11K195K948K542J290N3p63j392k026
60071F41056k537k945l697n027o377o939o663o232o127o191o132n908n444m526
$$ y = [530287, 528001, 524611, 520988, 518244, 516504, 515174, 514076, 513560, 513616, 513682, 513488, 513429, 513912, 514771, 515542, 515960, 516078, 516222, 516934, 518617, 521176, 524236, 527736, 531923, 536798, 541928, 546862, 551333, 555012, 557554, 559024, 559914, 560591, 561052, 561318, 561704, 562565, 564102, 566469, 569686, 573316, 576753, 580062, 584154, 589818, 596852, 604312, 611225, 616825, 620597, 622569, 623366, 623581, 623206, 621863, 619342, 615703, 611174, 606366, 602312, 599848, 599025, 599388, 600647, 602695, 605223, 607766, 610069, 612053, 613587, 614720, 616025, 618203, 621265, 624608, 627921, 631567, 635945, 640931, 646173, 651463, 656539, 660824, 663725, 665000, 664596, 662417, 658643, 654076, 649725, 646032, 642823, 639961, 637679, 636193, 635409, 635298, 636209, 638404, 641352, 643894, 645184, 645237, 644474, 643082, 641056, 638519, 635574, 631877, 626850, 620473, 613534, 606871, 600639, 594512, 588321, 582189, 576281, 570837, 566311]
60057E66311l322k585k828l618m126m187m263m558m751m644m473m380m016l021
60043E11539j544p3J106J985K577K862K909K875K920L094L237K966K055Q45Jk68
60027E39086m55j083k048k872l307l454l551l891m681n558n626m451k790j765
60013D93554j531j359r71r12j480k092k072j473o81K40J249J878J702J054O90
59998D87796Q26J024R47P59Q13J232J843K252K132J693J607K158K727K615K102
59983E12526K086K725L193K867K086J513J255R96N34j12q02j224j120p71q83j631
59967E23238k281k126j441j027j058j051p08j75N40J693L203M400M765M498M032
59952E36502L336K180Q46K2j25k41q68j625j662q75j39k81j194k180k833l217
$$ y = [566311, 562989, 560404, 557576, 553958, 549832, 545645, 541382, 536824, 532073, 527429, 522956, 518576, 514560, 511539, 509995, 509922, 511028, 513013, 515590, 518452, 521361, 524236, 527156, 530250, 533487, 536453, 538508, 539353, 539354, 539086, 538631, 537548, 535500, 532628, 529321, 525867, 522316, 518425, 513744, 508186, 502560, 498109, 495319, 493554, 492023, 490664, 489693, 488781, 487301, 485209, 483137, 481664, 480983, 481223, 482472, 484350, 486052, 487106, 487796, 488622, 489646, 490593, 491352, 492165, 493397, 495240, 497492, 499624, 501317, 502924, 505082, 507809, 510424, 512526, 514612, 517337, 520530, 523397, 525483, 526996, 528251, 529247, 529781, 529669, 528867, 527643, 526523, 525752, 524869, 523238, 520957, 518831, 517390, 516363, 515305, 514254, 513546, 513371, 513911, 515604, 518807, 523207, 527972, 532470, 536502, 539838, 542018, 542864, 542886, 542761, 542520, 541652, 540027, 538365, 537490, 537351, 537070, 535876, 533696, 530863, 527646]
59936E27646l421l368l081k769k564k425k329k322k319k101j607r66k44N45J142
59921D99817J254J160J635K869L897L679K504J661J790K226K145J709J678K268
59907E30292K942L195L034K680K232J759J432J296J113P06K78P3j54q83j981k509
59891E45505j706J48K061L326L914M128M320M816N664O400O454N811M953M169
59877E99963L408K821K873L588M213M012L103K083J132K9j148j881j917j640j606
59862F19033j950k442k864l125l163k944k559k243k177k327k492k496k351k148
59848E83752j881j447p94l1O88J311J975L061N016P967J1327J4047J5313J5024
59834F55328J3563J1207P904L711n54l259l006m8L521N304M313J064l550q847
$$ y = [527646, 524225, 520857, 517776, 515007, 512443, 510018, 507689, 505367, 503048, 500947, 499340, 498374, 498130, 498675, 499817, 501071, 502231, 503866, 506735, 510632, 514311, 516815, 518476, 520266, 522492, 524637, 526346, 528024, 530292, 533234, 536429, 539463, 542143, 544375, 546134, 547566, 548862, 549975, 550681, 550959, 551032, 550878, 549995, 548014, 545505, 543799, 543947, 546008, 549334, 553248, 557376, 561696, 566512, 572176, 578576, 585030, 590841, 595794, 599963, 603371, 606192, 609065, 612653, 616866, 620878, 623981, 626064, 627196, 627225, 626077, 624196, 622279, 620639, 619033, 617083, 614641, 611777, 608652, 605489, 602545, 599986, 597743, 595566, 593239, 590747, 588251, 585900, 583752, 581871, 580424, 579630, 579599, 580287, 581598, 583573, 586634, 591650, 599617, 610944, 624991, 640304, 655328, 668891, 680098, 688002, 691713, 691159, 687900, 684894, 684846, 688367, 693671, 697984, 699048, 695498, 686651]
59820F86651j3965j7716j9345j9133j7970j6576j5232j3934j2499j0683q441o116
59808E15041m310l542l810m326l977k551j216j190k159k774k610k577l221l794
59794D72984l573l088l227l826m026l504k569j535p19n87j059j143j53J134J496
59779D46605R52L97n0j016k322k938k590k139k042j750j020o01r16j216q55m18
59763D28081n60o33L72K050K979K635J848J456J568K197L511N143N987N346L873
59748D65853K912L133M042M653M382L357K172J326R10P41P30R17J128R05Kj126
59732D96037j608j079j39K81r9q12j395j820k022j653o94N5j74j022j385q53j36
59715D81482O7j50m34p64j125j144n94K07R41J801K955L916M137L920M025M533
$$ y = [686651, 672686, 654970, 635625, 616492, 598522, 581946, 566714, 552780, 540281, 529598, 521157, 515041, 510731, 507189, 503379, 499053, 495076, 492525, 491309, 490119, 487960, 485186, 482576, 479999, 476778, 472984, 469411, 466323, 463096, 459270, 455244, 451740, 449171, 447636, 446917, 446330, 445271, 444128, 443975, 445109, 446605, 447557, 447954, 447904, 446888, 444566, 441628, 439038, 436899, 434857, 433107, 432087, 431486, 430570, 429354, 428499, 428081, 427521, 426888, 427260, 429310, 432289, 434924, 436772, 438228, 439796, 441993, 445504, 450647, 456634, 461980, 465853, 468765, 471898, 475940, 480593, 484975, 488332, 490504, 491830, 492740, 493481, 494211, 495128, 496256, 497161, 497163, 496037, 494429, 493350, 493211, 493492, 493393, 492581, 491186, 489366, 487344, 485691, 484997, 485052, 484878, 483856, 482471, 481618, 481482, 481549, 481399, 480965, 480201, 479076, 477932, 477338, 477545, 478486, 480287, 483242, 487158, 491295, 495215, 499240, 503773]
59699E03773M795M576M437M871N586O050O207O368O662O964P042O503M856K043
59685E80733j145l514m402l980k841j580p24n65q67r51m37L16O10K04n52j216
59669E59089j636j912k252k811l406l493k809j944j775k257k443j883j261j201
59655E28006j100K3J944L428L872L902M214M622M553L825K645J234j57j230j957
59640E57824k710l809n109o135o486o111n362m775m595m549m313l919l405k434
59626D94112q81N03P94J64l79m80p19j300j568j212r04j183j576j600j757k620
59610D79394l601l623k671j716j292j065p07l78k68k87l20l70m32m98n98n97k62
59593D60709K51L99J19J34Q37J503J328P21N65O43k0j440k446k355j785j606j936
$$ y = [503773, 508568, 513144, 517581, 522452, 528038, 534088, 540295, 546663, 553325, 560289, 567331, 573834, 578690, 580733, 579588, 576074, 571672, 567692, 564851, 563271, 562547, 561982, 561115, 560164, 559727, 560043, 560653, 560857, 560305, 559089, 557453, 555541, 553289, 550478, 547072, 543579, 540770, 538826, 537051, 534794, 532351, 530468, 529207, 528006, 526906, 526929, 528873, 532301, 536173, 540075, 544289, 548911, 553464, 557289, 559934, 561168, 561011, 559781, 557824, 555114, 551305, 546196, 540061, 533575, 527464, 522102, 517327, 512732, 508183, 503870, 499951, 496546, 494112, 493231, 493734, 494528, 494692, 494313, 493833, 493114, 491814, 490246, 489034, 488130, 486947, 485371, 483771, 482014, 479394, 475793, 472170, 469499, 467783, 466491, 465426, 464719, 464341, 464073, 463786, 463466, 463096, 462664, 462166, 461568, 460971, 460709, 460960, 461359, 461478, 461612, 462449, 463952, 465280, 466001, 466566, 467209, 467189, 465749, 463303, 460948, 459163, 457557, 455621]
59576D55621k498l098l385k979k184j922k533l256l248k554j717j012n20m09o19
59561D23687o48j69N13R25J080J258J463J484J233P65K48M9M99J338J839J804
59545D37368J906K648L501L687L416L638M741O206P538Q976J1126J4308J8273
59532E27332K2007K3677K1350J4503M964l884r182j0282q603o048l590j297P22
59519E71669K000K349K258K289K343J908P80p32k241l524m420m807m853n047n792
59504E54180o917p692p499o537n733n751o236o338n817n187m766m170k958j336
59490D77243J69J273J909J957J476R11P26R59J408J971K534K880L139L957N740
59475E08252P921R528J0222J0330J0047R282Q106O685M841K351k70k060k771l011
$$ y = [455621, 453123, 450025, 446640, 443661, 441477, 439555, 437022, 433766, 430518, 427964, 426247, 425235, 424715, 424306, 423687, 423039, 422870, 423383, 424308, 425388, 426646, 428109, 429593, 430826, 431591, 431839, 431888, 432387, 433725, 435564, 437368, 439274, 441922, 445423, 449110, 452526, 456164, 460905, 467111, 474649, 483625, 494751, 509059, 527332, 549339, 573016, 594366, 608869, 613833, 609949, 600767, 590485, 581882, 575834, 572244, 570947, 571669, 573669, 576018, 578276, 580565, 582908, 584816, 585596, 584864, 582623, 579099, 574679, 569872, 565019, 559972, 554180, 547263, 539571, 532072, 525535, 519802, 514051, 507815, 501477, 495660, 490473, 485707, 481537, 478579, 477243, 477412, 478685, 480594, 482551, 484027, 484938, 485664, 486623, 488031, 490002, 492536, 495416, 498555, 502512, 508252, 516173, 525701, 535923, 546253, 556300, 565582, 573688, 580373, 585214, 587565, 587295, 585235, 582464, 579453]
59461E79453l080k502j041O22J855L004M697O687Q208R121R966J1049J2233J3557
59447F53829J5271J7190J8665J9289J9029J7551J4132Q610J911m732j0599j5228
59435G54918j7965j8462j7358j5782j4320j2921j1735j1243j1504j1848j1638
59424F00142j0918r977q656o513l485l8L296O225Q615J0499J2211J4161J6340
59411F31902J8337K0178K2700K6337K9321K8012J9966O828o495j5674j9678j9904
59399G41830j7789j3917q604k269M477J0067J1548O448m298j6129k4421k7802
59387F59141k7778k6104k3511k0425j7502j5107j2994j0753q328n958l997k754
59375D83930k174j794j265p95o58n10K05J310K019K011J756J702J813K047K576
$$ y = [579453, 576373, 573871, 572830, 573452, 575307, 578311, 583008, 589695, 597903, 607024, 616990, 628039, 640272, 653829, 669100, 686290, 704955, 724244, 743273, 760824, 774956, 783566, 785477, 780745, 770146, 754918, 736953, 718491, 701133, 685351, 671031, 658110, 646375, 635132, 623628, 611780, 600142, 589224, 579247, 570591, 564078, 560593, 560555, 563851, 570076, 578691, 589190, 601401, 615562, 631902, 650239, 670417, 693117, 719454, 748775, 776787, 796753, 803581, 797086, 781412, 761734, 741830, 724041, 710124, 701520, 699251, 703728, 713795, 725343, 731791, 727493, 711364, 686943, 659141, 631363, 605259, 581748, 561323, 543821, 528714, 515720, 504967, 496639, 490681, 486684, 483930, 481756, 479962, 478697, 477902, 477244, 476734, 476939, 478249, 480268, 482279, 484035, 485737, 487550, 489597, 492173]
59360D92173L218L321K692K047K100K604K928L129L856N302P008Q631J0301J2073
59346E61383J3563J4457J5064J5964J7245J8338J8660J8242J7580J6963J6156
59335G43615J4856J3155J1360R425O982L970R02j634l508m959o220p415q599r680
59321G62250j0391j0507j0010q972p522o027n103n126n791o317o042m839l180
59308F72423j858j399j560j593j167q01j113j901k310j819p71J39O22J027J914
59293F59833L489N393P148Q790J0953J4197J8441K3060K7195K9705K9058K3924
59281H61186J4296K096r454j7383k0453j9579j6824j3826j0975p882m248k99L293
59268G59948N809P071P808Q978J0560J1421J0673Q732O558M376J791j136l806
$$ y = [492173, 495391, 498712, 501404, 503451, 505551, 508155, 511083, 514212, 518068, 523370, 530378, 539009, 549310, 561383, 574946, 589403, 604467, 620431, 637676, 656014, 674674, 692916, 710496, 727459, 743615, 758471, 771626, 782986, 792411, 799393, 803363, 804265, 802631, 799123, 794164, 787944, 780529, 771930, 762250, 751859, 741352, 731342, 722370, 714848, 708821, 703718, 698592, 692801, 686484, 680442, 675603, 672423, 670565, 669166, 667606, 666013, 664846, 664045, 662932, 661031, 658721, 656902, 656131, 656270, 656892, 657919, 659833, 663322, 668715, 675863, 684653, 695606, 709803, 728244, 751304, 778499, 808204, 837262, 861186, 875482, 877578, 868124, 850741, 830288, 810709, 793885, 780059, 769084, 761202, 756954, 756655, 759948, 765757, 772828, 780636, 789614, 800174, 811595, 822268, 831000, 837558, 841934, 843725, 842589, 838783]
59255H38783n995q079j0163j1783j2728j3459j4270j4635j4019j2877j2162j2036
59243F96577j1717j0602q923p194n595m153l135k769k746k411j481l35N00R37
59229F36953J224J488J531J114K57q51k076l421m881o323p544q392q800q759q296
59214E83224p528o690o072n816n810n769n428m692l677k647j825j264q85o70o27
59199E23824n79k21M23Q23N58J1Q1J097K394L135L269L456M128M995N484N500
59183E58378N504N869O303O220N573N028N121N579N835N834N848N711M991L950
59169F35744L603M472N874O816P210P662Q479R370R966J0135R846R117Q137P131
59155G43562O155N218M411L717K740J043j370m085o599q437r162q805q160q203
$$ y = [838783, 832788, 824709, 814546, 802763, 790035, 776576, 762306, 747671, 733652, 720775, 708613, 696577, 684860, 674258, 665335, 658141, 652546, 648393, 645258, 642489, 639743, 637332, 635851, 635516, 636016, 636953, 638177, 639665, 641196, 642310, 642567, 641716, 639640, 636219, 631338, 625015, 617471, 609079, 600279, 591520, 583224, 575696, 569006, 562934, 557118, 551308, 545539, 540111, 535419, 531742, 529095, 527270, 526006, 525121, 524451, 523824, 523245, 523024, 523447, 524270, 524828, 524839, 524920, 526017, 528411, 531546, 534815, 538271, 542399, 547394, 552878, 558378, 563882, 569751, 576054, 582274, 587847, 592875, 597996, 603575, 609410, 615244, 621092, 626803, 631794, 635744, 639347, 643819, 649693, 656509, 663719, 671381, 679860, 689230, 699196, 709331, 719177, 728294, 736431, 743562, 749717, 754935, 759346, 763063, 765803, 766846, 765476, 761391, 754792, 746355, 737193, 728388, 720228, 712025]
59141G12025r044r830r742q801p603o557n636m692l786l103k644k127j314l46
59127F36800M67J179K208L656M986N728O189P105Q687J0464J2016J3432J4911
59114G27828J6240J6888J6580J5654J4836J4584J4638J4277J3054J1168R144P378
59102H92269O081N265M566L406J565n56k528m316n890o846o930o691o947p739
59088H64709q306q132p520p071p020p295p902r025j0734j2588j3715j3573j2729
59075G39099j2395j2977j3592j3358j2579j2026j1653j0836r567q421p550o605
59063F07540n653n179n101m676l657k749k575k862l022k864k523k153k029k352
59049E60145k766k655k051j649j718j768j470j148j020p56k15K61O45J485K795
$$ y = [712025, 702981, 693151, 683409, 674608, 667005, 660448, 654812, 650120, 646334, 643231, 640587, 638460, 637146, 636800, 637267, 638446, 640654, 644310, 649296, 655024, 661213, 668318, 677005, 687469, 699485, 712917, 727828, 744068, 760956, 777536, 793190, 808026, 822610, 837248, 851525, 864579, 875747, 884891, 892269, 898350, 903615, 908181, 911587, 913152, 912596, 910068, 905752, 899862, 893016, 886086, 879395, 872448, 864709, 856403, 848271, 840751, 833680, 826660, 819365, 811463, 802438, 791704, 779116, 765401, 751828, 739099, 726704, 713727, 700135, 686777, 674198, 662172, 650519, 639683, 630116, 621695, 614145, 607540, 601887, 596708, 591607, 586931, 583274, 580525, 577950, 575088, 572066, 569202, 566679, 564526, 562497, 560145, 557379, 554724, 552673, 551024, 549306, 547538, 546068, 544920, 543900, 543144, 542929, 543190, 543835, 545320, 548115]
59034E48115L651L553L312L694M152L926L640M381N832O688O728P010Q075R340
59020F22097J0402J1586J2833J3288J2586J1509J0656R467P259M483K086K22j491
59007G26983k921l519l291k792k230j324q4J018J815K738L986M935M818L760K698
58992G36590K303K344K153J389J36j460l323n196o567p163p380p903q910r796
58978F87217r857r029p838o710n590m257k737j192M60K473M712O493P365P815
58964F69325Q766J0334J1551J1587J0772J0039R639Q937P371N064K440k30k741
58951G62854m792o273p514q965j0630j2042j2742j2660j2069j1243j0207q784
58939F44933o990n301m306l938l332j782K91J668J678Q22j07j027k304l708m435
$$ y = [548115, 551766, 555319, 558631, 562325, 566477, 570403, 574043, 578424, 584256, 590944, 597672, 604682, 612757, 622097, 632499, 644085, 656918, 670206, 682792, 694301, 704957, 714424, 721683, 726166, 728252, 728474, 726983, 724062, 720543, 717252, 714460, 712230, 710906, 710822, 711840, 713655, 716393, 720379, 725314, 730132, 733892, 736590, 738893, 741237, 743390, 744779, 744915, 743455, 740132, 734936, 728369, 721206, 713826, 705923, 697013, 687217, 677360, 668331, 660493, 653783, 648193, 643936, 641199, 640007, 640467, 642940, 647652, 654145, 661510, 669325, 678091, 688425, 699976, 711563, 722335, 732374, 742013, 750950, 758321, 763385, 765825, 765595, 762854, 758062, 751789, 744275, 735310, 724680, 712638, 699896, 687236, 675167, 663924, 653717, 644933, 637943, 632642, 628336, 624398, 621066, 619284, 619575, 621243, 622921, 623743, 623636, 622609, 620305, 616597, 612162]
58924F12162m242l945m391n330n844n634n209m956m685m219l773l398k620j141
58910E52775M88J461J794K204L077M089M940N862P163Q696J0045J1035J1763J2390
58896F37782J3046J3741J4122J3634J2285J0965J0593J1067J1632J2183J3460
58885G74510J5760J8141J9471J9682J9346J8422J6363J3322J0239P561M696J130
58873I38643k728o235r341j2020j3598j3537j2495j1655j1289j0810j0078r571
58861H15286r282q596p551p252q457j0502j2172j3068j3505j3601j3191j2381
58849F85728j1623j1207j1029j0728r973q749p512o721o227n562m893m913n551
58836E81040n627m406k834k383l219m274m822n006m967m460l509k724k631l107
$$ y = [612162, 607920, 603975, 599584, 594254, 588410, 582776, 577567, 572611, 567926, 563707, 559934, 556536, 553916, 552775, 553263, 554724, 556518, 558722, 561799, 565888, 570828, 576690, 583853, 592549, 602594, 613629, 625392, 637782, 650828, 664569, 678691, 692325, 704610, 715575, 726168, 737235, 748867, 761050, 774510, 790270, 808411, 827882, 847564, 866910, 885332, 901695, 915017, 925256, 932817, 937513, 938643, 935915, 929680, 920339, 908319, 894721, 881184, 868689, 857034, 845745, 834935, 824857, 815286, 806004, 797408, 789857, 782605, 774148, 763646, 751474, 738406, 724901, 711300, 698109, 685728, 674105, 662898, 651869, 641141, 631168, 622419, 614907, 608186, 601959, 596397, 591504, 586591, 581040, 575413, 571007, 568173, 565790, 562571, 558297, 553475, 548469, 543502, 539042, 535533, 532809, 530178, 527071]
58822E27071l587l524k659j274j73L5l51m98j03M04O39P09P97Q37Q25J031J603
58805E21782K311K808K947K691J965Q04n29j677k381k531k259j907j695j469r75
58790E19885l06K24N33P36P78N81N15J223K803M589N938O821P437P689P454P003
58774E73903O732O452N463L455J028q53j844k386k982l558l773l693l803m373
58760E69768n108n531n394m690l564k326j253k59R07K050K580K400K167K369K669
58745E56785K650K625L096L846M325M667N525P005Q526R630J0292J0478J0079
58732F39529R390Q985R067R379R769J0209J0341R686Q377P071O039N010M004L621
58718G50477M190N280O295P051P588P916Q173Q501Q541P623N702L565J810J45
$$ y = [527071, 523484, 519960, 517301, 516027, 515854, 515889, 515538, 515040, 514937, 515341, 515980, 516689, 517486, 518323, 519148, 520179, 521782, 524093, 526901, 529848, 532539, 534504, 535308, 534779, 533102, 530721, 528190, 525931, 524024, 522329, 520860, 519885, 519579, 519803, 520336, 521072, 521850, 522431, 522946, 524169, 526972, 531561, 537499, 544320, 551757, 559446, 566900, 573903, 580635, 587087, 592550, 596005, 597033, 596180, 594336, 591950, 588968, 585410, 581637, 577944, 574141, 569768, 564660, 559129, 553735, 549045, 545481, 543155, 541902, 541643, 542550, 544600, 547180, 549580, 551747, 554116, 556785, 559435, 562060, 565156, 569002, 573327, 577994, 583519, 590524, 599050, 608680, 618972, 629450, 639529, 648919, 657904, 666971, 676350, 686119, 696328, 706669, 716355, 724732, 731803, 737842, 742852, 746856, 750477, 754667, 759947, 766242, 773293, 780881, 788797, 796970, 805471, 814012, 821635, 827337, 830902, 832712, 832857]
58704H32857j965m532p262j0090j3030j5848j8226k0045k1191k1481k0991k0221
58692F57975j9557j8880j7844j6351j4532j2622j0910r532q206o648n241m726
58680E12926n051n198m486l459l045l318l591l288k303q65N63J507K023K703L861
58665D88979N033N666N909O345P230Q320R123R013P523M955K370N45p51k080l317
58650E54863l849l563l064k962l281l618l661l531l643m029m030l078j754j282
58636E09518j882k365j818q21m27n84l74N63J671K271K135J383L99l05n51o45
58620E08168q04p82m61k35l55l69K27J233K215L259M524N579N910N752N555N074
58604E44490L891K522J915J958J536J12j663k981l610l487k541j170j61K11L97
$$ y = [832857, 830892, 826360, 819098, 809008, 795978, 780130, 761904, 741859, 720668, 699187, 678196, 657975, 638418, 619538, 601694, 585343, 570811, 558189, 547279, 537747, 529541, 522893, 517652, 512926, 507875, 502677, 498191, 494732, 491687, 488369, 484778, 481490, 479187, 478322, 478885, 480392, 482415, 485118, 488979, 494012, 499678, 505587, 511932, 519162, 527482, 536605, 545618, 553141, 558096, 560466, 561011, 560260, 558180, 554863, 551014, 547451, 544387, 541425, 538144, 534526, 530865, 527334, 523691, 519662, 515632, 512554, 510800, 509518, 507636, 505271, 503453, 502632, 502205, 501621, 501247, 501810, 503481, 505752, 507887, 509270, 509669, 509364, 508813, 508168, 507364, 506582, 506121, 505886, 505531, 505162, 505389, 506622, 508837, 512096, 516620, 522199, 528109, 533861, 539416, 544490, 548381, 550903, 552818, 554776, 556312, 556424, 554761, 551780, 548170, 544683, 542142, 540972, 540811, 541022, 541419]
58589E41419P99J406K273L601N123O237O972Q098R893J1592J2435J2577J2439
58576F34864J1846J0511Q886P769P297O934O365N876N865O432P542R286J1784
58563G41257J4865J7939K0273K1537K2037K2228K2090K1212J9431J7009J4173
58552I54051J0844O947K735j377n024p957j0100j1662j2928j3886j4263j4015
58540H83365j3545j3389j3853j4923j6309j7570j8394j8750j8630j7812j6176
58529G04014j4107j2171j0547r095p846o858n746m039k099j006j196j786j640
58516F25878o71L36Q45R82R70P02R3m60k81Q18K147K745K419J883J817K063K061
58499F44347J737J507J532J519J166M51n19j508k023j693q19n2M25J019J887K610
$$ y = [541419, 542218, 543624, 545897, 549498, 554621, 560858, 567830, 575928, 585821, 597413, 609848, 622425, 634864, 646710, 657221, 666107, 673876, 681173, 688107, 694472, 700348, 706213, 712645, 720187, 729473, 741257, 756122, 774061, 794334, 815871, 837908, 860136, 882226, 903438, 922869, 939878, 954051, 964895, 971842, 974577, 973200, 968176, 960219, 950119, 938457, 925529, 911643, 897380, 883365, 869820, 856431, 842578, 827655, 811346, 793776, 775382, 756632, 738002, 720190, 704014, 689907, 677736, 667189, 658094, 650248, 643390, 637644, 633605, 631506, 630500, 629304, 627518, 625878, 625207, 625543, 626388, 627370, 628340, 629042, 629135, 628675, 628394, 629212, 631359, 634104, 636523, 638406, 640223, 642286, 644347, 646084, 647591, 649123, 650642, 651808, 652259, 651740, 650232, 648209, 646516, 645697, 645645, 646070, 647089, 648976, 651586]
58483F51586K886L094L798N113O823Q787J0808J2348J2851J2342J1401J0467R408
58470G61712P868N798L486J126j340l823n771o655o671o600o872p098o686n514
58456G22960l882k087l47J234K824M639O308O942O187M793L637K598R41j465l852
58441G51430n369n764n425m997m743m110k368R6J876K283K255K913L990M596M740
58426G41403N044N479N607N736O609Q113R358R890R809Q898O869M394K686K011
58412H31906J639J170P41J4j634l785n196n579n876o415o275n005l614l044k863
58397G86184k271j381o93r2P19J534K100K601L131L295K990K790L016L106K545
58382H09574J796J617K126L054M313N664O417O133N215M339L767L600L963M531
$$ y = [651586, 654472, 657566, 661364, 666477, 673300, 682087, 692895, 705243, 718094, 730436, 741837, 752304, 761712, 769580, 775378, 778864, 779990, 778650, 774827, 769056, 762401, 755730, 749130, 742258, 735160, 728474, 722960, 719078, 716991, 716644, 717878, 720702, 725341, 731649, 738591, 744778, 749571, 753208, 755806, 756747, 755282, 751430, 746061, 740297, 734872, 729875, 725132, 721022, 718654, 718750, 720626, 722909, 725164, 728077, 732067, 736663, 741403, 746447, 751926, 757533, 763269, 769878, 777991, 787349, 797239, 807048, 815946, 822815, 827209, 829895, 831906, 833545, 834715, 835456, 835470, 833836, 830051, 824855, 819276, 813400, 806985, 800710, 795705, 792091, 789047, 786184, 783913, 782532, 781839, 781747, 782466, 784000, 786100, 788701, 791832, 795127, 798117, 800907, 803923, 807029, 809574, 811370, 812987, 815113, 818167, 822480, 828144, 834561, 840694, 845909, 850248, 854015, 857615, 861578, 866109]
58368H66109M649M407M768O044P148P174O935P858R972J1988J3018J3226J2951
58355I76247J2171J0924R553Q360P312O242N139M277M041M456M981N153N285N998
58341A070139P231Q362R247J0234J1202J1574J1459J1706J2590J3395J3645J3716
58329A204500J3863J3685J3076J2732J3055J3407J2957J1581R601P491O111O149
58317A338208P001P310O980P384R051J0561J0557R687R552J0702J2465J3988J4699
58304A468145J4626J4764J6183J8350J9506J9128J8617J8975J9397J9048J8589
58293A665328J8830J9302J9372J9555K0462K1674K2728K4022K5660K6675K6610
58282A910218K6612K7704K9192L0050L0595L1544L2611L3407L4539L6453L8347
$$ y = [866109, 870758, 875165, 879933, 885977, 893125, 900299, 907234, 915092, 925064, 937052, 950070, 963296, 976247, 988418, 999342, 1008895, 1017255, 1024567, 1030809, 1035948, 1040225, 1044266, 1048722, 1053703, 1058856, 1064141, 1070139, 1077370, 1085732, 1094979, 1105213, 1116415, 1127989, 1139448, 1151154, 1163744, 1177139, 1190784, 1204500, 1218363, 1232048, 1245124, 1257856, 1270911, 1284318, 1297275, 1308856, 1318457, 1325948, 1332059, 1338208, 1345209, 1352519, 1359499, 1366883, 1375934, 1386495, 1397052, 1406739, 1416291, 1426993, 1439458, 1453446, 1468145, 1482771, 1497535, 1513718, 1532068, 1551574, 1570702, 1589319, 1608294, 1627691, 1646739, 1665328, 1684158, 1703460, 1722832, 1742387, 1762849, 1784523, 1807251, 1831273, 1856933, 1883608, 1910218, 1936830, 1964534, 1993726, 2023776, 2054371, 2085915, 2118526, 2151933, 2186472, 2222925, 2261272]
58271B261272L9584M0954M3213M5618M7301M8867N1239N4095N6736N9386O2334
58260B810599O5088O7542P0508P3947P6330P6992P7294P8195P8765P8571P9288
58249C633119Q2027Q5352Q7980R1261R6692J03216J09363J15904J23824J31826
58239D660564J38569J45425J54193J64052J73554J83618J95648K08620K21081
58230F245324K34062K49098K65389K81854K99924L21205L44688L69186L96237
58221I006967M27510M62086M99351N41491N89808O42064O97220P59108Q31371
58212A4456976R12902J002748J105293J225772J365354J526153J716472J945723
58204B5257393K219429K545441K939653L419411L997073M685535N502257O462623
$$ y = [2261272, 2300856, 2341810, 2385023, 2430641, 2477942, 2526809, 2578048, 2632143, 2688879, 2748265, 2810599, 2875687, 2943229, 3013737, 3087684, 3164014, 3241006, 3318300, 3396495, 3475260, 3553831, 3633119, 3715146, 3800498, 3888478, 3979739, 4076431, 4179647, 4289010, 4404914, 4528738, 4660564, 4799133, 4944558, 5098751, 5262803, 5436357, 5619975, 5815623, 6024243, 6245324, 6479386, 6728484, 6993873, 7275727, 7575651, 7896856, 8241544, 8610730, 9006967, 9434477, 9896563, 10395914, 10937405, 11527213, 12169277, 12866497, 13625605, 14456976, 15369878, 16372626, 17477919, 18703691, 20069045, 21595198, 23311670, 25257393, 27476822, 30022263, 32961916, 36381327, 40378400, 45063935, 50566192, 57028815]
58196E7028815P581326Q890307J0444940J2304478J4520847J7153966K0269260
58189A48193939K3880489K7858114L1802534L4856758L5609504L2453575K4514669
58182C59169582J2559003j023577j3352233k2428560k7708625k9717052k9358618
58175B48139920k7493244k4793842k1702299j8449558j5151936j1901141q809777
58168A19838123o087205m119217l351749l935209n460033p130302q256748q600409
58160G2897251q312850p664380o863205o034074n247508m534370l900838l347280
58152B6992746k871557k463384k110030j806151j550123j335237j152808r99992
58144A2703464q76990p79388o99541o32908n77951n32420m93933m61705m33942
$$ y = [57028815, 64610141, 73500448, 83945388, 96249866, 110770713, 127924679, 148193939, 172074428, 199932542, 231735076, 266591834, 302201338, 334654913, 359169582, 371728585, 370705008, 357352775, 334924215, 307215590, 277498538, 248139920, 220646676, 195852834, 174150535, 155700977, 140549041, 128647900, 119838123, 113750918, 109631701, 106279952, 102344743, 96884710, 89754408, 81497660, 72897251, 64584401, 56920021, 50056816, 44022742, 38775234, 34240864, 30340026, 26992746, 24121189, 21657805, 19547775, 17741624, 16191501, 14856264, 13703456, 12703464, 11826474, 11047086, 10347545, 9714637, 9136686, 8604266, 8110333, 7648628, 7214686]
58135G214686m06176l75456l43657l13875k86145k59244k33770k10682j89345
58126D596336j69796j54731j46744j45098j46790j48943j48912j44651j36825
58117C253846j28548j21606j14787j06904r9052r2491q6627q0716p5460p1496
58107B276159o8038o4434o1296n9000n6727n4118n2098n1051m9852m7725m5437
58096A666383m3751m2271m0615l9051l7301l4476l0968k8624k8150k8065k7004
58085A286107k5342k3717k1810j9613j8232j8265j8820j9055j9283j9757j9893
58074A062320j9598j9846k0927k1570k0880j9740j9297j9219j8584j7400j6178
58063H49081j4894j3323j1675j0247r116q606r151j0345j1123j1141j0937j0585
$$ y = [7214686, 6808510, 6433054, 6089397, 5775522, 5489377, 5230133, 4996363, 4785681, 4596336, 4426540, 4271809, 4125065, 3979967, 3833177, 3684234, 3535322, 3390671, 3253846, 3125298, 3003692, 2888905, 2782001, 2682949, 2590458, 2503831, 2423115, 2347655, 2276159, 2208121, 2143687, 2082391, 2023391, 1966664, 1912546, 1860448, 1809397, 1759545, 1711820, 1666383, 1622632, 1580361, 1539746, 1500695, 1463394, 1428918, 1397950, 1369326, 1341176, 1313111, 1286107, 1260765, 1237048, 1215238, 1195625, 1177393, 1159128, 1140308, 1121253, 1101970, 1082213, 1062320, 1042722, 1022876, 1001949, 980379, 959499, 939759, 920462, 901243, 882659, 865259, 849081, 834187, 820864, 809189, 798942, 789826, 781220, 772069, 761724, 750601, 739460, 728523, 717938]
58051G17938r573q286q040r040r808r346q423q005p875p675p930q938r697r155
58037E96147p658o348n819o024o700p250p031o351o374p461q523q549p839p232
58023D96988p056p310p910q198p253n264l673l349l613l575l396l582m045m545
58009D24219n087n333m576k927j563j130r57m04L6k84j139j997k669k705j322
57994C92162J287L631M812N662P043Q174P859O424N107M220L256K247J728J587
57980D55199J150K75n56j103j553j958k200k387k659k826k662k393k391k641k866
57965D28429k989l092l219l453l814l917l276k168j594k048k991l715m107m209
57951C83837l846l170k818l039l298l148k805k420j610k65R37J435J618K143L040
$$ y = [717938, 708365, 700079, 692039, 682999, 673191, 663845, 655422, 647417, 639542, 631867, 623937, 614999, 605302, 596147, 588489, 582141, 576322, 570298, 563598, 556348, 549317, 542966, 536592, 529131, 520608, 512059, 504220, 496988, 489932, 482622, 474712, 466514, 459261, 453997, 450324, 446975, 443362, 439787, 436391, 432809, 428764, 424219, 419132, 413799, 409223, 406296, 404733, 403603, 402646, 402242, 402278, 401994, 400855, 398858, 396189, 393484, 392162, 393449, 397080, 401892, 407554, 414597, 422771, 430630, 437054, 442161, 446381, 449637, 451884, 453612, 455199, 456349, 456624, 456068, 454965, 453412, 451454, 449254, 446867, 444208, 441382, 438720, 436327, 433936, 431295, 428429, 425440, 422348, 419129, 415676, 411862, 407945, 404669, 402501, 400907, 398859, 395868, 392153, 388046, 383837, 379991, 376821, 374003, 370964, 367666, 364518, 361713, 359293, 357683, 357418, 358355, 359790, 361408, 363551, 366591]
57936C66591L990M917N748O270O668P527Q817R580R222Q364P811P393O507N174
57922D64579L867K810K029J505Q01q02l229n423o763p878r372j0713j1156j1025
57908D09230j1084j1233j0804r716q517p618p171p237p515p359o665o127o124
57895C02060o089n577n092n052m825l721k209j150n24R4N09M59N41J417K578L106
57879B76525L167L556M170M183L506K852K434J798Q62J48j17k28l91o09j012j598
57863B99246j900j639j324j416j405o54L67Q65J228K388M031M943N000N257O002
57848C20989O338N970N831O342O527N651M460L845L367K254R67M90N11l40k440
57833C70762m458n089m731m855o036p237p110n591l849k900k720k809k955l122
$$ y = [366591, 370581, 375498, 381246, 387516, 394184, 401711, 410528, 420108, 429330, 437694, 445505, 452898, 459405, 464579, 468446, 471256, 473285, 474790, 475591, 474789, 471560, 466137, 459374, 451496, 442124, 431411, 420255, 409230, 398146, 386913, 376109, 366393, 357876, 350258, 343087, 335850, 328335, 320976, 314311, 308184, 302060, 295971, 290394, 285302, 280250, 275425, 271704, 269495, 268345, 267821, 267915, 268424, 268883, 269424, 270841, 273419, 276525, 279692, 283248, 287418, 291601, 295107, 297959, 300393, 302191, 303053, 303201, 303084, 302856, 302465, 301856, 300844, 299246, 297346, 295707, 294383, 292967, 291562, 290908, 291275, 292140, 293368, 295756, 299787, 304730, 309730, 314987, 320989, 327327, 333297, 339128, 345470, 351997, 357648, 362108, 365953, 369320, 371574, 372541, 373031, 373542, 373202, 370762, 366304, 361215, 356484, 351629, 345593, 338356, 331246, 325655, 321806, 318906, 316186, 313377, 310422, 307300]
57819C07300k995k193p75Q33K302L459M155M402M479M548M393L808K999K269J657
57804C40641J122P02P9j449l970o370p416p152o578o279o091n892n872o020n981
57789B73474n555m860m069l357k978k927k758k175j580j522j795j656p80M91J685
57774B39638K531K918L012L262L882M547M966N372O043O707O900O544N697M240
57760C06259K337O93l20j288k808m454n487o068o861p850q437q356p685o342m481
57745B38852k929k234j723n65P04R08J11o03q82j240j591j206k56J19l76o62m8
57728B26379P19P32K21m3J66O00J065J412J537J648J946K056J421K66n91r23j218
57711B37393j643j875j951k321k908l128k938k865k887k396j428q14p90o77j49
$$ y = [307300, 304305, 302112, 301337, 302170, 304472, 307931, 312086, 316488, 320967, 325515, 329908, 333716, 336715, 338984, 340641, 341763, 342465, 342544, 341095, 337125, 330755, 323339, 316187, 309609, 303330, 297239, 291347, 285475, 279455, 273474, 267919, 263059, 258990, 255633, 252655, 249728, 246970, 244795, 243215, 241693, 239898, 238242, 237462, 237953, 239638, 242169, 245087, 248099, 251361, 255243, 259790, 264756, 270128, 276171, 282878, 289778, 296322, 302019, 306259, 308596, 309289, 308969, 307681, 304873, 300419, 294932, 288864, 282003, 274153, 265716, 257360, 249675, 243333, 238852, 235923, 233689, 231966, 231401, 232105, 233013, 233124, 232521, 231639, 230399, 228808, 227602, 227346, 227465, 227089, 226427, 226379, 227098, 227830, 228051, 228008, 228174, 228774, 229839, 231251, 232788, 234436, 236382, 238438, 239859, 240125, 239534, 238611, 237393, 235750, 233875, 231924, 229603, 226695, 223567, 220629, 217764, 214877, 212481, 211053, 210239, 209449, 208772, 208623]
57696B08623L08N66J175K055K167J128Lk69j22l07o72p97q09p30J8J523K767L134
57678B19761L658N615Q587J1155J3048J5342J8821K3239K8234L3964M0821M9122
57666D71367N9172P0637Q1360Q6935Q2098O3682L3417j852l3619n6337o9016p3273
57654G14571p1182o5107n7717n0696m3964l6957l0148k4547k0391j7164j4505
57643B82193j2276j0184q064o235m937l879k872k308k333k171j176oK49k90n56
57628B25155j91J10j46o17q78r79j059r69n90j49n1n73j554k331k292j669j355
57611B09862j646j808j321q26j138j878k034j535j214j399j497j066m71j69j0
57596A91850L81Q61Q03k06j754k873l021k729k826l139k736j577r47j648k722
$$ y = [208623, 208931, 209497, 210672, 212727, 214894, 216022, 216025, 215756, 215634, 215327, 214655, 213858, 213049, 212319, 212337, 213860, 216627, 219761, 223419, 229034, 237621, 248776, 261824, 277166, 295987, 319226, 347460, 381424, 422245, 471367, 530539, 601176, 682536, 769471, 851569, 915251, 948668, 946816, 913197, 856860, 787844, 714571, 643389, 578282, 520565, 469869, 425905, 388948, 358800, 334253, 313862, 296698, 282193, 269917, 259733, 251669, 245434, 240497, 236618, 233746, 231438, 229105, 226934, 225758, 225752, 226001, 225711, 225155, 224964, 225074, 224928, 224311, 223433, 222454, 221395, 220426, 219836, 219687, 219636, 219063, 217509, 215178, 212886, 211217, 209862, 208216, 206408, 205087, 204261, 203123, 201245, 199211, 197676, 196462, 195063, 193566, 192500, 192029, 191860, 191850, 192231, 193092, 193895, 193689, 191935, 189062, 186041, 183312, 180486, 177347, 174611, 173034, 172087, 170439, 167717]
57581A67717k751j864j307j530j798j526r94o73o56r26j480k082k400k417k281
57566A43032j938j363r60j112j505j537j233j039q86k63P90J553J668J564J660
57551A38431J802J730J565J526J599J731J971K232K210J775J145N83J79K6K98
57536A58803R91J734J993J469L63o42r22n83l93q23j449j657j566j742k200k318
57520A51058j718p10K05P98J069J096J082J229J534J826J947J730R98n3p15m87
57504A60889J48J82o76j624j774j188o19n46p08n84j35J46r8o19r46j012j076
57487A49760j174j187j278j670k029j813j220r60r70l64R54J770J286L35m4k34
57471A41162j094k135k067q31K59L76L9J6L69P64R49P60K78K1L69R26J025P33
$$ y = [167717, 164966, 163102, 161795, 160265, 158467, 156941, 155947, 155274, 154618, 153692, 152212, 150130, 147730, 145313, 143032, 141094, 139731, 138771, 137659, 136154, 134617, 133384, 132345, 131459, 131196, 131986, 133539, 135207, 136771, 138431, 140233, 141963, 143528, 145054, 146653, 148384, 150355, 152587, 154797, 156572, 157717, 158300, 158479, 158505, 158803, 159794, 161528, 163521, 164990, 165353, 164711, 163789, 163206, 162813, 161990, 160541, 158884, 157318, 155576, 153376, 151058, 149340, 148630, 148835, 149633, 150702, 151798, 152880, 154109, 155643, 157469, 159416, 161146, 162144, 162091, 161376, 160889, 161037, 161219, 160543, 158919, 157145, 155957, 155338, 154792, 154084, 153500, 153365, 153511, 153413, 152794, 151848, 150836, 149760, 148586, 147399, 146121, 144451, 142422, 140609, 139389, 138429, 137459, 137095, 138049, 139819, 141105, 141440, 141396, 141162, 140068, 137933, 135866, 135035, 135294, 135670, 135709, 135725, 136094, 136858, 137807, 138567, 138845, 138866, 139235, 140161, 141186, 141919]
57453A41919N62M59k1o32o03Q1N81N44N52R61J263J070Q49J161J784K131K040
57436A54701J694J209P01M30M66N46N11N90J014J610J994J888J185nj217j840
57420A65477j589o59M51J110Q30j78r20o47J82N35K22J4M28J168J750J961J645
57403A71780P99k1j88K7j51n83j81J293K552K542J953K056K732K757J718N93M24
57386A90102J200K188K788K840K531K185K002J858J560J177J035J322J926K558
57372B17272K922K808K214J417Q37P22R45J085P86Q9o26j010r76n95O8Q69J580
57355B30407K070K364K488K492K622L047L340K816J578O67P33J182J188R59J257
57340B59210K056K631K706K669K732K704K554K515K599K636K744L163L660L760
$$ y = [141919, 142481, 142940, 142919, 142287, 141684, 141765, 142346, 142890, 143442, 144403, 145666, 146736, 147585, 148746, 150530, 152661, 154701, 156395, 157604, 158305, 158735, 159201, 159747, 160258, 160848, 161862, 163472, 165466, 167354, 168539, 168534, 167317, 165477, 163888, 163229, 163680, 164790, 165620, 165442, 164522, 163875, 164057, 164592, 164814, 164828, 165256, 166424, 168174, 170135, 171780, 172579, 172558, 172370, 172397, 172246, 171663, 171482, 172775, 175327, 177869, 179822, 181878, 184610, 187367, 189085, 189678, 190102, 191302, 193490, 196278, 199118, 201649, 203834, 205836, 207694, 209254, 210431, 211466, 212788, 214714, 217272, 220194, 223002, 225216, 226633, 227470, 228192, 229137, 230222, 231008, 231097, 230471, 229461, 228485, 227890, 227958, 228827, 230407, 232477, 234841, 237329, 239821, 242443, 245490, 248830, 251646, 253224, 253891, 254624, 255806, 256994, 257953, 259210, 261266, 263897, 266603, 269272, 272004, 274708, 277262, 279777, 282376, 285012, 287756, 290919, 294579, 298339]
57326B98339L473L129K703K088J804K490L690M165L552K742K419K295K106K366
57312C37361L440M680N100M461L302K349K263L339M970N895N492M419L730L769
57298C94570M228M788N239N406N332N276N273N027M488M129M319M799N076N134
57284D63084N397O167P258Q083Q161P669P333P527P767P478O896O667O836O974
57270E63297P013P135P070O482N876O075O818P023O554O492P394Q446Q842Q844
57256F63361Q966R027Q779Q615R019R866J0762J1450J1581J0853R762R330R761
57243G91132J0200J0218J0484J1433J2409J2797J2986J3442J3722J3392J3009
57232I25224J3285J3949J4307J4262J3981J3350J2625J2765J4142J5618J6049
$$ y = [298339, 301812, 304941, 307644, 309732, 311536, 314026, 317716, 321881, 325433, 328175, 330594, 332889, 334995, 337361, 340801, 345481, 350581, 355042, 358344, 360693, 362956, 366295, 371265, 377160, 382652, 387071, 390801, 394570, 398798, 403586, 408825, 414231, 419563, 424839, 430112, 435139, 439627, 443756, 448075, 452874, 457950, 463084, 468481, 474648, 481906, 489989, 498150, 505819, 513152, 520679, 528446, 535924, 542820, 549487, 556323, 563297, 570310, 577445, 584515, 590997, 596873, 602948, 609766, 616789, 623343, 629835, 637229, 645675, 654517, 663361, 672327, 681354, 690133, 698748, 707767, 717633, 728395, 739845, 751426, 762279, 772041, 781371, 791132, 801332, 811550, 822034, 833467, 845876, 858673, 871659, 885101, 898823, 912215, 925224, 938509, 952458, 966765, 981027, 995008, 1008358, 1020983, 1033748, 1047890, 1063508, 1079557]
57221A079557J5984J6668J8016J8871J8896J8796J8913J8898J8839J9446K0925
57210A283809K2545K3601K4059K4229K4414K4922K5803K6599K6853K6733K6663
57199A560230K6645K6488K6341K6364K6190K5480K4750K4786K5508K6129K6294
57188A845205K6220K5967K5379K4786K4880K5771K6835K7491K7628K7337K6816
57177B134315K6516K6797K7417K7786K7647K7166K6588K6220K6360K6772K6663
57166B430247K5746K4914K5155K6163K6771K6330K5112K3683K2681K2712K3558
57155B703072K3997K3265K2259K2221K2745K2376K0939J9852K0104K1208K2249
57144B944287K2855K2911K2498K2383K3488K5610K7564K8847L0115L1790L3305
$$ y = [1079557, 1095541, 1112209, 1130225, 1149096, 1167992, 1186788, 1205701, 1224599, 1243438, 1262884, 1283809, 1306354, 1329955, 1354014, 1378243, 1402657, 1427579, 1453382, 1479981, 1506834, 1533567, 1560230, 1586875, 1613363, 1639704, 1666068, 1692258, 1717738, 1742488, 1767274, 1792782, 1818911, 1845205, 1871425, 1897392, 1922771, 1947557, 1972437, 1998208, 2025043, 2052534, 2080162, 2107499, 2134315, 2160831, 2187628, 2215045, 2242831, 2270478, 2297644, 2324232, 2350452, 2376812, 2403584, 2430247, 2455993, 2480907, 2506062, 2532225, 2558996, 2585326, 2610438, 2634121, 2656802, 2679514, 2703072, 2727069, 2750334, 2772593, 2794814, 2817559, 2839935, 2860874, 2880726, 2900830, 2922038, 2944287, 2967142, 2990053, 3012551, 3034934, 3058422, 3084032, 3111596, 3140443, 3170558, 3202348, 3235653]
57133C235653L4157L4728L5509L6326L6903L7412L8027L8648L9527M1433M4718
57122C653041M8844N3259N8166O3887P0121P6356Q2593Q9182R6351J04352J13666
57111D509818J24682J37470J52182J69335J89434K12746K39720K71354L09115
57102F315856L54980M11721M82537N70189O76968Q05602R59435J141209J352083
57093A3070580J591900J859497K152089K464725K790491L120185L441064L736880
57085C4227411L990348M184936M302284M317664M200475L922791L470444K849007
57077F5465360K083331J215046K99990n98208j421130k129421k707705l158089
57069E9049174l489990l714466l843061l886915l855361l756368l598643l392524
$$ y = [3235653, 3269810, 3304538, 3340047, 3376373, 3413276, 3450688, 3488715, 3527363, 3566890, 3608323, 3653041, 3701885, 3755144, 3813310, 3877197, 3947318, 4023674, 4106267, 4195449, 4291800, 4396152, 4509818, 4634500, 4771970, 4924152, 5093487, 5282921, 5495667, 5735387, 6006741, 6315856, 6670836, 7082557, 7565094, 8135283, 8812251, 9617853, 10577288, 11718497, 13070580, 14662480, 16521977, 18674066, 21138791, 23929282, 27049467, 30490531, 34227411, 38217759, 42402695, 46704979, 51022643, 55223118, 59145909, 62616353, 65465360, 67548691, 68763737, 69063727, 68465519, 67044389, 64914968, 62207263, 59049174, 55559184, 51844718, 48001657, 44114742, 40259381, 36503013, 32904370, 29511846]
57061B9511846l149262k880800k600201k320664k052990j804131j577985j376478
57053A1749335j199754j046471r14758q02594p07344o25880n55527m94380m40704
57044D961923l92859l49981l11918k78236k48116k21232j97830j77661j59848
57035B624242j43962j30230j18338j07181r6238q6164p7449o9466o1463n3467
57025A680284m5648l7645k9111k0059j0122J620J5631L1814N0745P3787J01585
57014A812881J33757J69441K04199K24445K09696J47434M7671o0113j46368j97892
57004B545151k17997k16539k02501j82593j61516j41611j23366j06771r1880p8566
56994A021811o6586n5935m6677l8675l1815k6198k1732j7968j4604j1778r474
$$ y = [29511846, 26362584, 23481784, 20881583, 18560919, 16507929, 14703798, 13125813, 11749335, 10549581, 9503110, 8588352, 7785758, 7078414, 6452534, 5897007, 5402627, 4961923, 4569064, 4219083, 3907165, 3628929, 3380813, 3159581, 2961751, 2784090, 2624242, 2480280, 2350050, 2231712, 2124531, 2028293, 1942129, 1864680, 1795214, 1733751, 1680284, 1634636, 1596991, 1567880, 1547821, 1537699, 1539319, 1554950, 1586764, 1637509, 1711296, 1812881, 1946638, 2116079, 2320278, 2544723, 2754419, 2901853, 2949524, 2889411, 2743043, 2545151, 2327154, 2110615, 1908114, 1725521, 1564005, 1422394, 1299028, 1192257, 1100377, 1021811, 955225, 899290, 852613, 813938, 782123, 755925, 734193, 716225, 701621, 689843, 680369]
56983F80369p298n329m590n978r091j2756j6274j9465k1831k2681k2036k0636
56971E12404j8931j6781j4220j1712r425o950m149j685j48R55K732N625R116J2513
56957D59344J5437J7458J7719J5282R824K111o103j2830j6988j8878j9473j9335
56945D43568j8463j6888j4884j2531r680o460l384p72J573M004O771J0188J4451
56932C97493J9009K2671K4591K4611K2319J6728P710k796j1989j8448k2415k4361
56920D55123k4370k2951k1197j9705j8113j6137j4312j3199j2420j1189r457p922
56908B64151p020o401n479m169k878j978j423r51m82r3L49J153K324L441M286
56893B44830N188O461P929R376J1064J3235J5488J7279J8602J9383J8609J5121
$$ y = [680369, 673071, 667742, 663152, 657174, 648083, 635327, 619053, 599588, 577757, 555076, 533040, 512404, 493473, 476692, 462472, 450760, 441335, 434385, 430236, 428551, 428403, 429358, 432090, 437715, 446831, 459344, 474781, 492239, 509958, 525240, 535064, 537175, 531072, 518242, 501254, 482376, 462903, 443568, 425105, 408217, 393333, 380802, 371122, 364662, 361278, 360506, 362079, 366083, 372854, 383042, 397493, 416502, 439173, 463764, 488375, 510694, 527422, 535132, 532336, 520347, 501899, 479484, 455123, 430753, 407802, 386605, 366900, 348787, 332650, 318338, 305139, 292719, 281530, 272073, 264151, 257131, 250730, 245251, 241082, 238204, 236226, 234803, 233852, 233370, 233277, 233626, 234779, 237103, 240544, 244830, 250018, 256479, 264408, 273784, 284848, 298083, 313571, 330850, 349452, 368835, 387444, 402565]
56881D02565R297K889k791p564j1194j2781j2048j0241q867p961o376l484O6L246
56867C34756N912Q948J3278J8686K3933K8274L2427L7422M2649M5785M4658L8458
56855F75186K7391J2498l741j7747k6868l0932l1456k9887k6933k2937j8181j2943
56843D93450p550k149L663J0489J8235K6140L3835M1766N0324N9192O7478P3466
56831H68339P3947O5185M5979J9501q450l2744n0457o0668o4153o3006n9277n3810
56819F80386m6731l8663l0691k3411j6719j0328l833L457J1971K1175L0069L8244
56807F14926M5783N1927N4328M9976L7167J7127n872k6466m1043m9035n1821n1004
56795F45993m7909m3639l8792l3368k7533k2036j7308j2752p643k280K567O951
$$ y = [402565, 411862, 414751, 411960, 404396, 393202, 380421, 368373, 358132, 349265, 341304, 334928, 331444, 331510, 334756, 340668, 349616, 362894, 381580, 405513, 433787, 466214, 503636, 546285, 592070, 636728, 675186, 702577, 715075, 711334, 693587, 666719, 635787, 604331, 574444, 547511, 524574, 506393, 493450, 485900, 483751, 487414, 497903, 516138, 542278, 576113, 617879, 668203, 727395, 794873, 868339, 942286, 1007471, 1053450, 1072951, 1064501, 1031757, 981300, 920632, 856479, 793473, 734196, 680386, 633655, 594992, 564301, 540890, 524171, 513843, 510010, 513467, 525438, 546613, 576682, 614926, 660709, 712636, 766964, 816940, 854107, 871234, 865362, 838896, 797853, 748818, 696997, 645993, 598084, 554445, 515653, 482285, 454752, 432716, 415408, 402656, 395013, 392733, 395300, 402251]
56783D02251J1585J6595K1224K4592K5842K3809J7603P807l557j4368k3207k9160
56771D81016l1816l1789l0452k8808k6928k4642k2155j9774j7482j5116j2678
56760B19376j0278q057o301n380n404o022o595o515n550m028k595j596r11m62
56746A49682m92j056j644j704j306r07p25p25q84j071r96o95o78j105j277o52
56730A33765J35L6r27j742j795j313n97K28P46M92j39j14Q28J730J717J019L61
56713A34430m7m23p96j012j048r10m33N46J827K919L341K883J822Q82O94J136
56697A45811J449J052J13p13q74l05N47J037Q91N47O40J259J849J859J196J70
56681A56528p26r84m19N40J177J166P39K41j82m14k84J31L09k00j126j596j092
$$ y = [402251, 413836, 430431, 451655, 476247, 502089, 525898, 543501, 551308, 547751, 533383, 510176, 481016, 449200, 417411, 386959, 358151, 331223, 306581, 284426, 264652, 247170, 232054, 219376, 209098, 201041, 194740, 189360, 183956, 177934, 171339, 164824, 159274, 155246, 152651, 151055, 150144, 149682, 149190, 148134, 146490, 144786, 143480, 142573, 141848, 141123, 140239, 139168, 138172, 137477, 136799, 135694, 134417, 133765, 133900, 133936, 133009, 131267, 129472, 128159, 127562, 127790, 128536, 129028, 128889, 128775, 129603, 131333, 133050, 134069, 134430, 134383, 133960, 133164, 132152, 131104, 130194, 129761, 130307, 132134, 135053, 138394, 141277, 143099, 143981, 144675, 145811, 147260, 148312, 148425, 147712, 146838, 146533, 147080, 148117, 149008, 149555, 150195, 151454, 153303, 155162, 156358, 156528, 155802, 154818, 154399, 154939, 156116, 157282, 158021, 158262, 158080, 157666, 157382, 157513, 157822, 157622, 156496, 154900, 153808]
56664A53808j01M82M70M38O19M32m29j095o42L60M72m67j116o52J32L52L49P41
56646A54153J104O72l10r35r06o18l20oJ75J41K15N95Q83O96L00O0j08j02P55
56627A56444K516L791L315J791R15J058J236J054J059J307J121M72J38K20r1q80
56611A75466j033q2Q01M58n56q17Q5J342K030J752O22p50j564j576j263j050q00
56594A73065l95j78m17p54o65j13N56J052J135O15k98r12o86J93J039J304R16
56577A75457K78rL35R85J479J866K425K898K668J802J245J684K734L611M134M757
56561B08349N814P135Q270Q973R468J0150J0896J0869R434P114N110L977L251
56548C08810K425J718J599K039K442K223J310J86o56j325k300l502m171l967l583
$$ y = [153808, 153707, 154189, 154659, 155097, 155716, 156148, 155719, 154624, 153982, 154342, 154814, 154347, 153231, 152579, 152711, 153063, 153412, 154153, 155257, 155929, 155619, 154684, 153778, 153160, 152840, 152834, 153009, 153150, 153365, 153960, 154843, 155539, 155839, 155899, 155791, 155689, 156444, 158960, 162751, 166066, 167857, 168772, 169830, 171066, 172120, 173179, 174486, 175607, 176079, 176217, 176437, 176346, 175466, 174433, 174351, 175152, 175610, 175054, 174237, 174322, 175664, 177694, 179446, 180068, 179318, 177754, 176178, 174915, 173865, 173065, 172670, 172492, 172075, 171321, 170656, 170543, 171099, 172151, 173286, 173901, 173603, 172691, 172005, 172198, 173237, 174541, 175457, 175735, 175726, 176061, 177046, 178525, 180391, 182816, 185714, 188382, 190184, 191429, 193113, 195847, 199458, 203592, 208349, 214163, 221298, 229568, 238541, 248009, 258159, 269055, 279924, 289358, 296472, 301582, 305559, 308810, 311235, 312953, 314552, 316591, 319033, 321256, 322566, 322752, 322096, 320771, 318471, 314969, 310798, 306831, 303248]
56533C03248l696l905l533k936l016l736m211m133m065m283m397m225m111m120
56519B48881l837l192k751k899l429m051m590m620l685k135j070j168k121l244
56505B06089l966l797k650j330q77j285j650j601j681k155k491k267j720j100
56491A77519l70J65n5p95r89j49R61J542J677J658J287N61J57N49J224J383R91
56474A87316N52L97N55Q97J009N14k08k35O25J531J857J981K382K703K440J826
56458B06142J451J371J233R20O17N67J001J930K810K925K279J643J489J615J857
56443B29850K379K968K882J902P33Om64r61j249j114q69p79n73j2N88Q19O08K1
56425B36735p37j003k82O26K59j362k364j522L4N04j46n60o9P43J178J104O83
$$ y = [303248, 299552, 295647, 292114, 289178, 286162, 282426, 278215, 274082, 270017, 265734, 261337, 257112, 253001, 248881, 245044, 241852, 239101, 236202, 232773, 228722, 224132, 219512, 215827, 213692, 212622, 211454, 209333, 206089, 202123, 198326, 195676, 194346, 193469, 192184, 190534, 188933, 187252, 185097, 182606, 180339, 178619, 177519, 177149, 177314, 177259, 176464, 175475, 175326, 176287, 177829, 179506, 181164, 182451, 183012, 183169, 183718, 184942, 186325, 187316, 187868, 188265, 188820, 189717, 190726, 191240, 191032, 190797, 191422, 192953, 194810, 196791, 199173, 201876, 204316, 206142, 207593, 208964, 210197, 211117, 211734, 212301, 213302, 215232, 218042, 220967, 223246, 224889, 226378, 227993, 229850, 232229, 235197, 238079, 239981, 240714, 240720, 240256, 239295, 238046, 236932, 236063, 235284, 234711, 234699, 235287, 236106, 236714, 236735, 235998, 234995, 234713, 235339, 235598, 234236, 231872, 230350, 230384, 230888, 230742, 230182, 230113, 230856, 232034, 233138, 233821]
56408B33821J86j5K04M99N33M24M25N48P03P58M31l49q75k79J150K153K195J991
56390B44503K102K129J791J555J593J267M56K75J487L136L773L253K334J281n8
56375B70877j411k283k666k737k329j367l57K28N06O72N66K36J04Q1m94j473j607
56358B56546m86M65Nr76q40M11J445J610J303Q14J43m13n25m27l60mP81J285J007
56339B61784O72J119J922K187K066K262K711K908K985L223L163K437J903K503
56325B93845L628M004L725L781M040L433K002J089J322J932K163K091J824J195
56311C30074N05L99P88Q65M05K1K6K3j60q0N48J479K465L476M252M392L911L142
56293C56531K112P11o64j340j218p38j59N06J004J058Q85R03J115J357J788K481
$$ y = [233821, 234007, 233992, 234196, 234695, 235228, 235652, 236077, 236625, 237328, 238086, 238517, 238168, 237293, 237014, 238164, 240317, 242512, 244503, 246605, 248734, 250525, 252080, 253673, 254940, 255396, 255671, 257158, 260294, 264067, 267320, 269654, 270935, 270877, 269466, 267183, 264517, 261780, 259451, 258084, 257727, 257955, 258461, 259133, 259699, 259935, 260039, 260120, 259626, 258153, 256546, 256060, 256525, 256530, 255554, 254714, 255125, 256570, 258180, 259483, 260297, 260440, 260027, 259502, 259075, 258715, 258711, 259492, 260777, 261784, 262456, 263575, 265497, 267684, 269750, 272012, 274723, 277631, 280616, 283839, 287002, 289439, 291342, 293845, 297473, 301477, 305202, 308983, 313023, 316456, 318458, 319547, 320869, 322801, 324964, 327055, 328879, 330074, 330579, 330978, 331766, 332631, 333036, 333057, 333083, 333106, 332946, 332866, 333414, 334893, 337358, 340834, 345086, 349478, 353389, 356531, 358643, 359354, 358690, 357350, 356132, 355394, 355235, 355741, 356745, 357803, 358688, 359591, 360706, 362063, 363851, 366332]
56277C66332K887K493J711J324J432J634J901K477L278M076M891N596N698N201
56263D10931N009N638O306O237O054O692P681P910P588Q038R727J1848J3591J4847
56249E28097J5839J7080J9312K2548K5594K7470K8703L0218L1757L2660L3374
56238H12652L4625L5690L5139L2847K9766K6182K1792J7050J2705Q337L110k350
56226A067545o645r913j3534j7559k0530k1946k2955k4162k4689k3998k2997k2554
56214H36063k2276k1502k0377j9303j8263j7160j6050j4806j3344j2189j1958
56203F48835j2278j2163j1309j0085q564o711n206m807n029m781m014l474l098
56190E57316k169q55o7R2K87N29L79L05J196K605L170K723K309K233J869J368
$$ y = [366332, 369219, 371712, 373423, 374747, 376179, 377813, 379714, 382191, 385469, 389545, 394436, 400032, 405730, 410931, 415940, 421578, 427884, 434121, 440175, 446867, 454548, 462458, 470046, 478084, 487811, 499659, 513250, 528097, 543936, 561016, 580328, 602876, 628470, 655940, 684643, 714861, 746618, 779278, 812652, 847277, 882967, 918106, 950953, 980719, 1006901, 1028693, 1045743, 1058448, 1066785, 1069895, 1067545, 1060900, 1050987, 1037453, 1019894, 999364, 977418, 954463, 930301, 905612, 881614, 858617, 836063, 813787, 792285, 771908, 752605, 734342, 717182, 701132, 686326, 672982, 660793, 648835, 636557, 624394, 613085, 603000, 594436, 587725, 582519, 577712, 572683, 567902, 563888, 560414, 557316, 555147, 554292, 554225, 554317, 554604, 555133, 555512, 555817, 557013, 559618, 562788, 565511, 567820, 570053, 571922, 573290]
56174E73290J617K396K469J760J532K143K537K308K362L015L329K938K867L811
56160F08374N183O379P525Q429Q391P607P339Q182R448J0668J2126J3635J4378
56147G27664J4447J5071J6762J8703K0393K2502K5624K9533L4004L8992M3898
56136A007593M8106N2537N9080O8386P9678R2630J07367J22379J34481J41300
56126A913537J42124J36315J23386J05371Q6950P2043O1666N5313N2150M9934
56116B798789M4927L4633J9802L295j1800k2824k8407k9894l0900l4935m4049
56105B698637n9024p8777r9483j16392j27049j31498j29916j22375j10645r7648
56095A625830q4765p1879n9848n0208m2482l4681k6815k0887j7118j3401r087
$$ y = [573290, 574907, 577303, 579772, 581532, 583064, 585207, 587744, 590052, 592414, 595429, 598758, 601696, 604563, 608374, 613557, 619936, 627461, 635890, 644281, 651888, 659227, 667409, 676857, 687525, 699651, 713286, 727664, 742111, 757182, 773944, 792647, 813040, 835542, 861166, 890699, 924703, 963695, 1007593, 1055699, 1108236, 1167316, 1235702, 1315380, 1408010, 1515377, 1637756, 1772237, 1913537, 2055661, 2191976, 2315362, 2420733, 2507683, 2579726, 2641392, 2696705, 2748855, 2798789, 2843716, 2878349, 2898151, 2901446, 2889646, 2866822, 2838415, 2808521, 2777621, 2742686, 2698637, 2639613, 2560836, 2461353, 2344961, 2217912, 2086414, 1956498, 1834123, 1723478, 1625830, 1541065, 1469186, 1409338, 1359130, 1316648, 1281967, 1255152, 1234265, 1217147, 1203746, 1194659]
56084A194659n938m443k596M60K882L600M235N954P463P804Q293R906J1447J1992
56070A255718J2530J3544J3687J2566J2132J3482J4914J5012J5005J6225J7749
56059A412564J8552J9490K1207K2426K2200K1591K1412K0773J9449J9027J9969
56048A638660K0263J8856J7666J8326J9673K0431K1529K3665K5459K6141K7299
56037A877968K9777L1752L2057L2551L4802L7378L8750L9976M2150M4093M5053
56026B286307M6653M9736N2242N2798N3364N5686N8287N9644O1183O4322O7656
56015B907878O9909P2565P6750Q0678Q3009Q5528Q9765R4302R8142J03091J10029
56004C871646J16525J21161J26254J33378J40349J45804J52327J61672J71439
$$ y = [1194659, 1188721, 1184278, 1181682, 1182142, 1185024, 1188624, 1192859, 1198813, 1206276, 1214080, 1222373, 1232279, 1243726, 1255718, 1268248, 1281792, 1295479, 1308045, 1320177, 1333659, 1348573, 1363585, 1378590, 1394815, 1412564, 1431116, 1450606, 1471813, 1494239, 1516439, 1538030, 1559442, 1580215, 1599664, 1618691, 1638660, 1658923, 1677779, 1695445, 1713771, 1733444, 1753875, 1775404, 1799069, 1824528, 1850669, 1877968, 1907745, 1939497, 1971554, 2004105, 2038907, 2076285, 2115035, 2155011, 2197161, 2241254, 2286307, 2332960, 2382696, 2434938, 2487736, 2541100, 2596786, 2655073, 2714717, 2775900, 2840222, 2907878, 2977787, 3050352, 3127102, 3207780, 3290789, 3376317, 3466082, 3560384, 3658526, 3761617, 3871646, 3988171, 4109332, 4235586, 4368964, 4509313, 4655117, 4807444, 4969116, 5140555]
55995E140555J80010J89965K02842K15530K26001K37546K53035K70105K86403
55986G201992L04199L25243L46798L67693L92390M23908M58902M95024N36381
55977A0852530N85912O39600O94722P56560Q30019R12362J001603J104101J225983
55968A8603392J365849J524623J713723J944425K219146K543423K936350L418395
55960C6269326L999916M692485N518342O496978P639428Q972634J0553692J2444256
55952I6587057J4691718J7354313K0513477K4215014K8371897L2647392L6258920
55945B70639788L7800594L5489180K8089706J6008698J530307j2224730k2834495
55938C54499048k9412598l2361389l2630388l1172903k8753333k5912722k2980256
$$ y = [5140555, 5320565, 5510530, 5713372, 5928902, 6154903, 6392449, 6645484, 6915589, 7201992, 7506191, 7831434, 8178232, 8545925, 8938315, 9362223, 9821125, 10316149, 10852530, 11438442, 12078042, 12772764, 13529324, 14359343, 15271705, 16273308, 17377409, 18603392, 19969241, 21493864, 23207587, 25152012, 27371158, 29914581, 32850931, 36269326, 40269242, 44961727, 50480069, 56977047, 64616475, 73589109, 84142801, 96587057, 111278775, 128633088, 149146565, 173361579, 201733476, 234380868, 270639788, 308440382, 343929562, 372019268, 388027966, 389558273, 377333543, 354499048, 325086450, 292725061, 260094673, 228921770, 200168437, 174255715, 151275459]
55931A51275459k0134821j7479175j5068646j2914489j1008442r349473p935502
55924E7384911o744030n741442m903390m210965l636970l152871k743211k400018
55916B3852014k109514j856593j636203j448493j287589j145223j020179r14289
55908A2433931q23591p42220o70558o11116n60622n13995m71863m36705m05637
55899G197624l74381l44369l18897k96109k72679k50609k33368k18739k02418
55890D686055j85520j71701j59697j45599j30159j17103j05988r3065p7830o2859
55880C436534m8272l1777j3331N150K3612M2519N8529O6006O2515M9303K7634
55869C678422j499l5157o9676j03260j34214j58226j71236j73995j70464j62836
$$ y = [151275459, 131140638, 113661463, 98592817, 85678328, 74669886, 65320413, 57384911, 50640881, 44899439, 39996049, 35785084, 32148114, 28995243, 26252032, 23852014, 21742500, 19885907, 18249704, 16801211, 15513622, 14368399, 13348220, 12433931, 11610340, 10868120, 10197562, 9586446, 9025824, 8511829, 8039966, 7603261, 7197624, 6823243, 6478874, 6159977, 5863868, 5591189, 5340580, 5107212, 4888473, 4686055, 4500535, 4328834, 4169137, 4023538, 3893379, 3776276, 3670288, 3577223, 3499393, 3436534, 3388262, 3356485, 3343154, 3348304, 3371916, 3414435, 3472964, 3538970, 3601485, 3650788, 3678422, 3676923, 3641766, 3572090, 3468830, 3334616, 3176390, 3005154, 2831159, 2660695, 2497859]
55859B497859j51360j37625j24250j12015j00282q9469q0372p2242o4277n7751
55849A508216n3908n1233m7709m4187m2487m1564l8977l4950l1710k9655k7430
55838A064406k5017k3660k3243k2559k1581k0935j9952j7773j5589j5072j5462
55827H43563j4826j3375j2828j3203j3036j2272j2294j3283j4034j4050j3783
55816F96579j3233j2271j1691j1915j1595r590p249o399o222m792k741k329l471
55803E93081l727k142j80J229K847M907O280O454O263O157N429L674J495n70k557
55788F28640m428o030p560r075r914r667r029q584p782o552o672r506j3315j5056
55774E05470j4197j2610j1281r491o947m301j499K202O250Q667Q219N292P74m419
$$ y = [2497859, 2346499, 2208874, 2084624, 1972609, 1872327, 1782858, 1702486, 1630244, 1565967, 1508216, 1454308, 1403075, 1355366, 1311179, 1268692, 1227128, 1188151, 1153201, 1121491, 1091836, 1064406, 1039389, 1015729, 992486, 969927, 948346, 927411, 907459, 889686, 874097, 859025, 843563, 828737, 815362, 802534, 789331, 776295, 764023, 751729, 738446, 724412, 710362, 696579, 683346, 671075, 659384, 647469, 635874, 626284, 619035, 612636, 606414, 601622, 598881, 596552, 593081, 589354, 587212, 587032, 588261, 591108, 596015, 602295, 608749, 615012, 621169, 626598, 630272, 631767, 631197, 628640, 624212, 618182, 610622, 601547, 591633, 581966, 572937, 564353, 556571, 550019, 543347, 533841, 520526, 505470, 491273, 478663, 467382, 457891, 450944, 446643, 445144, 447346, 453596, 462263, 470482, 475774, 476548, 472129]
55760D72129q840j1325j2273j2858j3247j2942j2302j1924j1096q856o168m977
55748C45321n296n381m677m359m822m951m352m185n048n784n237l726k163r41
55734B84399k25j18k15l6m6j074k663l437l231l341m464n807o505o543n952m518
55718B36224k738j748j840k152k112j992j770q47P44K069K760L514M679N475N155
55703B45421L960K370L92j912m012n493o392o723o428n915n806n951n616m753
55689A93142m153m105l909l053j942j139o46l04j29NL55Q28J109J296J644J767
55673A80766R79m51j392j351j052j305k101l007l688l810l185k143j266o55p9
55658A56260L69M90O58J397K523L530M539N858O894O755N774N107M886M135K659
$$ y = [472129, 463289, 451964, 439691, 426833, 413586, 400644, 388342, 376418, 365322, 356466, 350298, 345321, 340025, 334644, 329967, 325608, 320786, 315835, 311483, 307298, 302250, 296466, 291229, 287503, 285340, 284399, 284174, 284056, 283841, 283805, 283759, 282685, 280022, 276585, 273354, 270013, 265549, 259742, 253237, 246694, 240742, 236224, 233486, 231738, 229898, 227746, 225634, 223642, 221872, 221025, 221769, 223838, 226598, 230112, 234791, 240266, 245421, 249381, 251751, 252143, 250231, 246219, 240726, 234334, 227611, 221183, 215268, 209462, 203511, 197895, 193142, 188989, 184884, 180975, 177922, 175980, 174841, 174195, 173891, 173762, 173767, 174122, 174950, 176059, 177355, 178999, 180766, 181745, 181294, 179902, 178551, 177499, 176194, 174093, 171086, 167398, 163588, 160403, 158260, 156994, 156339, 156260, 156629, 157119, 157777, 159174, 161697, 165227, 169766, 175624, 182518, 189273, 195047, 200154, 205040, 209175, 211834]
55643B11834J479J057N13q32k378l364l962m562m932m832m684m957n480n863n976
55628A63061n666m631l058j733j161j092j190j448j714j568r91n58n93q27j090
55613A35741j643k451k947k844k544k355k023j424j044j265j699j766j422r35
55599A09379l90J31K81j83r56j457j360q08k87k42n66n92K8O71N32k11p04o89
55581A02577o27o24j98P49J561J734J488J262J236J463J832J859J258O87J154
55566A17411K518L547L589L245L119K922K305J601J093L11j181k820l687l702
55552A30271l556l623l583l140k559k341k517k508j768n32L70N60N71R57J375
55537A07977J108J52p97j224j142p73m46n40r54r77l04K93O2m40j66P30J144P49
$$ y = [211834, 213313, 214370, 214883, 214051, 211673, 208309, 204347, 199785, 194853, 190021, 185337, 180380, 174900, 169037, 163061, 157395, 152764, 149706, 147973, 146812, 145720, 144530, 143082, 141368, 139800, 138809, 138251, 137658, 136831, 135741, 134098, 131647, 128700, 125856, 123312, 120957, 118934, 117510, 116466, 115201, 113502, 111736, 110314, 109379, 108989, 109120, 109401, 109218, 108262, 106805, 105445, 104637, 104350, 104108, 103542, 102950, 102978, 103649, 104181, 103970, 103266, 102577, 101950, 101326, 101128, 101877, 103438, 105172, 106660, 107922, 109158, 110621, 112453, 114312, 115570, 116257, 117411, 119929, 123476, 127065, 130310, 133429, 136351, 138656, 140257, 141350, 141661, 140480, 137660, 133973, 130271, 126715, 123092, 119509, 116369, 113810, 111469, 108952, 106444, 104676, 104144, 104514, 105074, 105645, 106602, 107977, 109085, 109237, 108440, 107216, 106074, 105301, 104855, 104315, 103361, 102384, 102080, 102373, 102435, 101995, 101829, 102559, 103703, 104452]
55519A04452L23M11P76J139J361R37m82k062k486j855j610k395l204l004k014
55504I0287r17j0M51J79l45r6R20J294J71j406j873j041P6O73P10M76K83K88L11
55485I0431J56R4M77R34P21j35r17j361j706j695p82M40N45o20j507j021J65J044
55467H5263J493J406J64j874k790j407Q41J695Q61k59q32j081j144q86o95j103
55451G9652j690j394K8J667K505K205J050k49q96p50m25l31o6O99J379J258N85
55434H5227J46J28J40m8l95q69j253j148o41m38p30p43m4N56L36%N21J390J380
55415H3515N88K37P38J332J567J749J856J322J76p40r97j085j325j259n97Q2J36
55398H7295k48n02n91r09j498j809j285j08P28L80p37j210l41Q72J026J49n14
$$ y = [104452, 104775, 105186, 105962, 107101, 108462, 109399, 108917, 106855, 104369, 102514, 100904, 98509, 95305, 92301, 90287, 89370, 89360, 89811, 89990, 89645, 89549, 90469, 91763, 91934, 90528, 88655, 87614, 87690, 88363, 89073, 89549, 89832, 90120, 90431, 90587, 90681, 91158, 92092, 92813, 92678, 91761, 90400, 88694, 86999, 86217, 86657, 87202, 86582, 85075, 84054, 84219, 85263, 86756, 88162, 88326, 86452, 83662, 82255, 83096, 84791, 85652, 85393, 84561, 83480, 82336, 81450, 80755, 79652, 77962, 76568, 76596, 78263, 80768, 82973, 84023, 83774, 82878, 82128, 81703, 81372, 81306, 82005, 83384, 84642, 85227, 85373, 85501, 85641, 85593, 85198, 84329, 83076, 81928, 81287, 80849, 80119, 79376, 79332, 79888, 80224, 80224, 80745, 82135, 83515, 84103, 84340, 85078, 86410, 87977, 89726, 91582, 92904, 93080, 92340, 91343, 90258, 88933, 87674, 87077, 87159, 87295, 87047, 86545, 85954, 85045, 83547, 81738, 80453, 80345, 81073, 81453, 80716, 79506, 79165, 80037, 81063, 81212, 80698]
55381H0698k72L76P60P75M90j42q47j054o97n17j104k065k536k193j435p04o6
55364F9467N73J057J057M91k16n58m67k48j1L65P58Q12N84O03R72J022L14n61
55346G6014p75l69L5K02K61R8m40r27p18R8P99J042J094J073P20N9l74k14K82
55327G7960O59P32N07K9m99p69o81m11j07K12M54M07L2m08n67k53M52J190J561
55308H0500J411Q56K3r52j665j656j068o13o06n46m3M90N62N41J047J773J810
55291H1864R49j08q18j238j376q82K76J415J794J363O11l7m26n09k68J56M19J90
55273H3375l83o13jJ015J502J272J099J440J694J188K49l55n27o30o39l10O6m
55255H9438l09j99L35O28M20J73K53M69N84O22N63K95m4j81k65o92j287j363p36
$$ y = [80698, 80426, 80802, 81562, 82337, 82827, 82685, 81838, 80784, 80087, 79570, 78466, 76401, 73865, 71672, 70237, 69533, 69467, 70040, 71097, 72154, 72645, 72429, 71871, 71404, 71156, 71145, 71510, 72268, 73080, 73664, 74267, 75239, 76261, 76575, 76014, 75239, 74870, 74905, 75107, 75368, 75466, 75026, 74099, 73381, 73479, 74278, 75320, 76414, 77487, 78207, 78266, 77892, 77678, 77960, 78619, 79351, 79858, 79887, 79388, 78619, 77938, 77527, 77420, 77632, 78086, 78493, 78525, 78117, 77550, 77297, 77749, 78939, 80500, 81911, 82767, 82790, 81838, 80173, 78517, 77449, 76836, 76230, 75684, 75641, 76131, 76693, 77234, 78281, 80054, 81864, 82813, 82705, 81887, 80649, 79273, 78391, 78667, 80082, 81876, 83239, 83850, 83813, 83387, 82878, 82610, 82766, 83185, 83375, 82992, 82379, 82378, 83393, 84895, 86167, 87266, 88706, 90400, 91588, 91837, 91482, 90955, 90325, 89686, 89376, 89442, 89438, 89129, 88930, 89265, 89893, 90313, 90486, 90739, 91208, 91792, 92414, 92977, 93272, 93228, 93047, 92782, 92090, 90803, 89440, 88704]
55236H8704j36k76r83j517j407p95k20j56n31p07k33M94P35M02M6l3NJ21M99R58
55216H4970J011P02O88J170J430Q58j09o00m14NL10N39P48Q84R07P87M75Q7o6
55197I4382J59M42L89k2n54j126j694j904j274N1J137J152L51k17J1N13N51K61
55179I2608L02O92P14J01m25k18L20L86k1k40oK58J86j08l11k10K94J075J699
55160I7096J825J616J415J174O24j22o54q77j041j173r64l57K58M96L60J06n6
55143I9726r8k63q10j457j409m03N92L87q41j777j662r75l93N0M23M07o4l15K32
55124I1350J083J173K05j038j645j398o31K39R32J262J172P54J95k93m75j54O17
55107I3348J362J426O21m25p80k07O72J117R68N84M29Q47J827K774K894K089J130
$$ y = [88704, 88568, 88292, 87309, 85792, 84385, 83590, 83370, 83214, 82683, 81976, 81743, 82237, 82972, 83374, 83420, 83387, 83392, 83513, 84012, 84970, 85981, 86683, 87371, 88541, 89971, 90829, 90720, 90120, 89706, 89711, 90021, 90560, 91308, 92192, 93099, 93886, 94361, 94448, 94382, 94541, 94983, 95372, 95350, 94796, 93670, 91976, 90072, 88798, 88849, 89986, 91138, 91489, 91272, 91283, 91796, 92347, 92608, 92910, 93602, 94316, 94417, 93992, 93774, 94094, 94480, 94459, 94219, 94213, 94471, 94657, 94549, 94238, 94028, 94322, 95397, 97096, 98921, 100537, 101952, 103126, 103750, 103628, 102974, 102097, 101056, 99883, 98919, 98562, 98820, 99316, 99676, 99782, 99726, 99628, 99365, 98555, 97098, 95689, 95286, 95878, 96265, 95424, 93647, 91985, 91010, 90617, 90667, 91090, 91497, 91433, 91118, 91350, 92433, 93606, 93811, 92773, 91128, 89730, 89099, 89338, 90270, 91532, 92704, 93458, 93653, 93360, 92885, 92731, 93348, 94710, 96136, 96757, 96332, 95552, 95345, 96017, 97134, 98102, 98686, 99115, 99962, 101789, 104563, 107457, 109546, 110676]
55090A10676P17O57L40l70j063j325r76q9Q80J256Q20P6m90r64j522j875j709
55073A05039j285j034q94o42m67o14p60m56P5K99J89P4m8l69o88p14o55q13q47
55054I5390l07M52P58P28Q86R72K84q53j273o64J14N57J079J735J661N55m89m09
55036A01176L46N78mp10r85q47m72L4N32Q85J019Q14K42m01p18p66r04j089r25
55017I7805m35j02k6K83R85J509J436J074Q15M98j15p73j062q74l35K98M84j45
54999A01320r71p96N48J758J788J196J116J464J235K05o38m29N21J202J048M31
54983A10998J96P42J510J546O04n26r03l87M04Q69R50R97J193J202N58m65q77
54966A18611j72Q27R46J11p79j112q88j90P70J215N70m47n58K35O87K95m9L05
$$ y = [110676, 111393, 112050, 112390, 112020, 110957, 109632, 108656, 108567, 109447, 110703, 111523, 111599, 111109, 110145, 108623, 106748, 105039, 103754, 102720, 101826, 101184, 100717, 100103, 99343, 98887, 98962, 99261, 99450, 99524, 99476, 99107, 98419, 97705, 97050, 96237, 95390, 95083, 95535, 96293, 97021, 97907, 98879, 99163, 98310, 97037, 96373, 96487, 97044, 98123, 99858, 101519, 102074, 101585, 101176, 101522, 102100, 102096, 101386, 100401, 99554, 99082, 99116, 99648, 100533, 101552, 102366, 102608, 102207, 101489, 100723, 99819, 98730, 97805, 97370, 97268, 97242, 97525, 98510, 100019, 101455, 102529, 103344, 103842, 103727, 102954, 101892, 101018, 100683, 100981, 101465, 101320, 100349, 99553, 100101, 101859, 103647, 104843, 105959, 107423, 108658, 108863, 108225, 107796, 108317, 109519, 110567, 110998, 111194, 111936, 113446, 114992, 115596, 115070, 114167, 113780, 114184, 115053, 116003, 117000, 118193, 119395, 119953, 119488, 118611, 118439, 119266, 120212, 120323, 119544, 118432, 117544, 117354, 118124, 119339, 119909, 119462, 118904, 119139, 119826, 120121, 120072, 120377]
54948A20377P84P43M21J59k02n98m64P6r6j388k541k321j187k89L15J178K019
54931A16986K032J283O23M74O48J039J674K274K617L034L845M678N127N576O575
54916A58485P753Q293Q162P952P684O722M797K337j69k493m464n948o947p311
54902A84853o779n718n235n797o355n662l978k567j941j658j490j594j696j247
54888A33136m32n8k80l71J35R03J514K008K493K902L242L641M066M477N109O153
54872A68638P308Q185Q823R151Q367N788K124j060l120m619n937o670o589o262
54858A84127o264o475o438n940n020l961l369l636m241m201l320k362j945j897
54844A25058j892j970k112j945j264m79j56l08m24q7N30P50P1j174k019j882j014
$$ y = [120377, 121161, 121904, 122325, 122484, 122282, 121684, 121220, 121296, 121200, 119812, 117271, 114950, 113763, 113474, 113789, 114967, 116986, 119018, 120301, 120924, 121398, 122046, 123085, 124759, 127033, 129650, 132684, 136529, 141207, 146334, 151910, 158485, 166238, 174531, 182693, 190645, 198329, 205051, 209848, 212185, 212016, 209523, 205059, 199111, 192164, 184853, 178074, 172356, 167121, 161324, 154969, 149307, 145329, 142762, 140821, 139163, 137673, 136079, 134383, 133136, 132704, 132646, 132366, 131995, 132130, 133033, 134547, 136555, 139048, 141950, 145192, 148833, 152899, 157376, 162485, 168638, 175946, 184131, 192954, 202105, 210472, 216260, 218384, 217324, 214204, 209585, 203648, 196978, 190389, 184127, 177863, 171388, 164950, 159010, 153990, 150029, 146660, 143024, 138783, 134582, 131262, 128900, 126955, 125058, 123166, 121196, 119084, 117139, 115875, 115396, 115240, 114932, 114508, 114421, 114951, 115701, 115772, 114598, 112579, 110697, 109683]
54827A09683J05J209J847J357o0j022o11L48N66J52M6K59J07j19N12J697J974
54810A18050R69j7n5K21Q0j48n3q6o04j043r15o39o06k75P88J848J982J482J226
54791A22205J170O16m06j055r19m10KJ49j07p54j213p96L25J201J343J240J481
54774A24072J903K060K105K602L523L986L389K433K473L824N337N930N895O190
54760A75722O969P628P952Q196Q032O491L286n25l613n560o728p490p960q077
54746A84323p655o628n378m394l634k710j693j135j179j357j337j210r64m05J82
54731A44826J62l72n63r1L61M09O81J627K576K814K868L704N239O598P465Q179
54715A86483Q710Q460P123N048K711L05k146m569o697p968p942p004o202o059
$$ y = [109683, 109788, 110997, 112844, 114201, 114141, 113119, 112508, 112856, 113422, 113574, 113620, 113879, 113986, 113867, 114379, 116076, 118050, 119019, 119002, 118947, 119168, 119248, 119100, 119047, 118961, 118357, 117314, 116399, 115760, 115154, 114879, 115667, 117515, 119497, 120979, 122205, 123375, 123991, 123585, 122530, 121611, 121201, 121203, 121352, 121245, 120491, 119278, 118482, 118807, 120008, 121351, 122591, 124072, 125975, 128035, 130140, 132742, 136265, 140251, 143640, 146073, 148546, 152370, 157707, 163637, 169532, 175722, 182691, 190319, 198271, 206467, 214499, 220990, 224276, 223751, 220138, 214578, 207850, 200360, 192400, 184323, 176668, 170040, 164662, 160268, 156634, 153924, 152231, 151096, 149917, 148560, 147223, 146013, 145049, 144644, 144826, 144988, 144616, 144053, 143962, 144323, 144732, 145413, 147040, 149616, 152430, 155298, 159002, 164241, 170839, 178304, 186483, 195193, 203653, 210776, 215824, 218535, 218840, 216694, 212125, 205428, 197460, 189518, 182514, 176312, 170253]
54701A70253o033n485m580l774l086k431k084k097j889j181o82j027j607j468
54687A32829q79p88j140r88j52M96M79K37J23m1j50K18O84J62j388k353j479L60
54669A26230J291O99m66j187j223p39j0M86L15m29j262j832k000j634q45k96n74
54652A16524j265j223%J525K213J965J518J347J211P42M5m30l58J78P03O52j44
54635A25203j175j658j267l89L79P55P86N71K68R3R8P5j27l19k73j35j88l50k77
54616A22070J3Q7k67o90p00k30M34J008J336J372J206J039J032J181J276J013
54600A31180K50o68j113q76m85m64n55j14Q50J575J486P37k10j003j364j120m53
54583A27653K41Q10J276J434J017K68k24l58n06o24j14J146K351K702K268J522
$$ y = [170253, 164220, 158735, 154155, 150381, 147295, 144864, 142780, 140683, 138794, 137613, 136931, 135904, 134297, 132829, 131950, 131162, 130022, 129034, 128882, 129378, 129857, 130094, 130217, 130176, 130026, 130244, 130928, 131090, 129702, 127349, 125870, 126230, 127521, 128220, 127754, 126567, 125344, 124605, 124595, 125081, 125396, 124967, 123705, 121873, 119873, 118239, 117394, 117098, 116524, 115259, 114036, 114036, 115561, 117774, 119739, 121257, 122604, 123815, 124557, 124602, 124172, 123814, 123992, 124695, 125347, 125203, 124028, 122370, 121103, 120714, 121093, 121848, 122634, 123205, 123473, 123566, 123664, 123739, 123612, 123293, 123020, 122885, 122697, 122347, 122070, 122083, 122170, 121903, 121213, 120513, 120283, 120717, 121725, 123061, 124433, 125639, 126678, 127710, 128891, 130167, 131180, 131430, 130762, 129649, 128773, 128288, 127824, 127269, 127155, 128005, 129580, 131066, 131803, 131593, 130590, 129226, 128106, 127653, 127894, 128704, 129980, 131414, 132431, 132699, 132475, 132117, 131611, 130987, 130873, 132019, 134370, 137072, 139340, 140862]
54567A40862O40k78q73r55q29p88o14m7O25R31Q55P05O67P83J054J254R60J37
54549A45089o63r55q02m70o5K42K23J16N12J394J927J624J066R73J276J610J994
54532A55091K353K116J074N4j15L25P36J166J783K015J320L36J3Q3l70j174j264
54515A65542m67K90M94M74L46k64j182j662j605j675k010j957j376j017j207j314
54499A51410r69o71o93m82K12P06N85N01R90J462J258Q41Q85J004N02k37k64L86
54481A57426Q34P48N83N34L56K45Q41K066K840K404J311P16J025J699K143K360
54465A78131K656L001K897K087J036M20J76l71j326j811j126K03J075J192J155
54450A89395J402J715J714J318O25k48j050j448j315q74n43p22j491k379k640
$$ y = [140862, 141502, 141224, 140351, 139396, 138567, 137779, 137165, 137118, 137743, 138674, 139529, 140234, 140901, 141684, 142738, 143992, 144952, 145089, 144426, 143471, 142669, 142199, 142134, 142376, 142599, 142715, 143227, 144621, 146548, 148172, 149238, 150211, 151487, 153097, 155091, 157444, 159560, 160634, 160688, 160573, 160898, 161634, 162800, 164583, 166598, 167918, 168254, 168267, 168350, 167980, 166806, 165542, 165075, 165365, 165859, 166333, 166679, 166415, 165233, 163571, 161966, 160291, 158281, 156324, 154948, 153931, 152724, 151410, 150441, 149770, 149077, 148595, 148807, 149513, 150098, 150599, 151589, 153051, 154309, 155150, 156035, 157039, 157541, 157304, 157040, 157426, 158260, 159008, 159591, 160125, 160481, 160726, 161567, 163633, 166473, 168877, 170188, 170904, 171929, 173628, 175771, 178131, 180787, 183788, 186685, 188772, 189808, 190228, 190404, 190033, 188707, 186896, 185770, 185973, 187048, 188240, 189395, 190797, 192512, 194226, 195544, 196169, 195921, 194871, 193423, 192108, 191234, 190691, 189969, 188478, 186099, 183459]
54435A83459k052j222q33q62r12j000j407j909j872j185m64p0L68J102J492P92
54419A73425n66j216n20O48J063O45K61L92O36N66L81L93L91M7m06m74k62l74
54401A75030r60j456j377q98m03Q5P34J482K061K284K120J748J559J765J953J450
54385A87177K90o26o52j93p2m97j078j524j782j754j362q41n69n87o08m29j05
54368A74788J98L26K33J04J97M25M11Q6j84k32l96p70p95j17O27O04J6k85j40
54349A75096j47m89o19k80N8k1l31o41j061j561j742j523j449j878k313k107j407
54332A57585r03q67r53p85l01L00O96O22K22J5K25M45K41k67o99r80j120q55m6
54313A52575P52P96J35m47m47p8K91M93L94o2m74j95Q30J913K486K653K628K244
$$ y = [183459, 181407, 180185, 179352, 178490, 177578, 176578, 175171, 173262, 171390, 170205, 169741, 169671, 170039, 171141, 172633, 173425, 172859, 171643, 171123, 171771, 172834, 173479, 173740, 174132, 174768, 175334, 175715, 176108, 176499, 176546, 176140, 175666, 175404, 175030, 174070, 172614, 171237, 170339, 169936, 170021, 170755, 172237, 174298, 176582, 178702, 180450, 182009, 183774, 185727, 187177, 187467, 186841, 186189, 185996, 185924, 185427, 184349, 182825, 181043, 179289, 177927, 177086, 176517, 175930, 175322, 174893, 174788, 174986, 175312, 175545, 175649, 175846, 176271, 176682, 176768, 176584, 176352, 175956, 175186, 174391, 174274, 174901, 175505, 175521, 175236, 175096, 174949, 174460, 173841, 173561, 173619, 173598, 173267, 172626, 171565, 170004, 168262, 166739, 165290, 163412, 161099, 158992, 157585, 156682, 155815, 154862, 154077, 153776, 154076, 154772, 155394, 155616, 155631, 155856, 156301, 156542, 156275, 155576, 154596, 153476, 152621, 152575, 153327, 154123, 154258, 153811, 153364, 153286, 153577, 154070, 154464, 154402, 153928, 153733, 154563, 156476, 158962, 161615, 164243, 166487]
54295A66487J314J36q27j400j531j104l83k13j161k593l230k592j362l38L61Q45
54279A52409Q63J58q16j094k46R87J418P60n0m4N25O04q4o67m66Oj4k63L5P65
54259A54786R91L97k99m91l91l26j61J39J15m35q72n26K87O82L60k40p36j112
54241A52168j391j469j328j065p01l11j25j43Q8Q29J466J135Qp91o61k87n36j193
54223A45693j374q35j80J41L63P21Q32K44o81j039o29k63o17j187r51J62J101
54206A41501R92Q3p56r21l38O80J474J393M91l44l65J66L99j4o34q58n70j11J18
54187A42386L5l3K21O14P13N34N33P61O37r2p37n75P7K95j68o72o20lQ40J504
54167A46250J590R80L3q06j437j886j923j393o12L4O25J282J551R00l33j203j260
$$ y = [166487, 167801, 167937, 167110, 165710, 164179, 163075, 162692, 162479, 161318, 158725, 155495, 152903, 151541, 151203, 151564, 152409, 153272, 153430, 152614, 151520, 151274, 152261, 153679, 154439, 154389, 154345, 154870, 155474, 155390, 154723, 154257, 154263, 154249, 153986, 154021, 154786, 155777, 156174, 155875, 155384, 154993, 154667, 154506, 154645, 154760, 154325, 153453, 152927, 153214, 153896, 154256, 154016, 153280, 152168, 150777, 149308, 147980, 146915, 146214, 145903, 145778, 145635, 145723, 146552, 148018, 149153, 149161, 148370, 147709, 147422, 146886, 145693, 144319, 143484, 143304, 143445, 143808, 144529, 145361, 145605, 144924, 143885, 143256, 142993, 142376, 141189, 140238, 140400, 141501, 142493, 142576, 141820, 140899, 140561, 141241, 142715, 144108, 144599, 144255, 143890, 144056, 144455, 144441, 143807, 142949, 142379, 142268, 142386, 142421, 142388, 142609, 143223, 143936, 144470, 145003, 145764, 146401, 146309, 145572, 144997, 145074, 145369, 145201, 144529, 143909, 143906, 144746, 146250, 147840, 148820, 148853, 148047, 146610, 144724, 142801, 141408, 140796, 140830, 141455, 142737, 144288, 145188, 144855, 143652, 142392]
54150A42392p80j30M76P20M93K84N83R57O49r8k50L74P59J93p99j388j456j265
54132A41714q31j83L51O09Q39J249J666J863J761J194J12q76r45k26K28j47p89
54115A47589j014p96k50O81J552J450L38m92o8R60J429J295J246J333J006J72
54099A56431o87j209j329j034n24k93m63m85j1M29K51k50m92n27n82k86O72J632
54081A51243J674R61L87K12K5k35k27QJ53K97O60Q99O75N88J347K299K097P97
54063A63860j33j1K85M2k62k17l55r53j145k39R65J255P50N24R66J494J689J703
54045A70218J643J329Q19N72Q92J552K130K494K921L732M795N484N357M823M755
54030B13516N389O051O092N642N191M906M672M434M164L741L251L047L297L630
$$ y = [142392, 141612, 141482, 141958, 142678, 143171, 143455, 144038, 144995, 145644, 145546, 145296, 145670, 146429, 146622, 145823, 144435, 142979, 141714, 140883, 140700, 141051, 141660, 142499, 143748, 145414, 147277, 149038, 150232, 150344, 149468, 148523, 148297, 148525, 148378, 147589, 146575, 145779, 145529, 146210, 147762, 149212, 149550, 149058, 148990, 149950, 151379, 152674, 153920, 155253, 156259, 156431, 155744, 154535, 153206, 152172, 151648, 151355, 150892, 150407, 150396, 150825, 151076, 150826, 150334, 149807, 149225, 148939, 149611, 151243, 152917, 153878, 154265, 154477, 154502, 154267, 154040, 154048, 154201, 154498, 155158, 156057, 156732, 157320, 158667, 160966, 163063, 163860, 163727, 163716, 164001, 164043, 163781, 163564, 163209, 162256, 161111, 160872, 161837, 163092, 163842, 164366, 165332, 166826, 168515, 170218, 171861, 173190, 174009, 174581, 175473, 177025, 179155, 181649, 184570, 188302, 193097, 198581, 203938, 208761, 213516, 218905, 224956, 231048, 236690, 241881, 246787, 251459, 255893, 260057, 263798, 267049, 270096, 273393, 277023]
54016B77023L581L153K676K311J967J548J018L38n00j433k380l232l798l994m079
54001B74199m353m722m851m805m928n102m751l798k949k647k379j619q73j006
53987B25416j808k163j638j095j449k382k812k300j513j267j538j661j267o83
53973B01840l47k70k70m29q49j181r04k0R80J790K449K802K519J804J495K121
53957B13530L319M505N706P310R352J1410J2886J3055J1241P477K860j188l930
53944B97533n479o219o410o169n471m303k958j928j333p59J05J042J754K289K669
53929B64363K563J900J330J451J831J591P58K80P03J595K380L046L771M429M845
53914B96836N141N520N960O348O674O974P284P738Q387Q880Q727Q024P418P142
$$ y = [277023, 280604, 283757, 286433, 288744, 290711, 292259, 293277, 293615, 293115, 291682, 289302, 286070, 282272, 278278, 274199, 269846, 265124, 260273, 255468, 250540, 245438, 240687, 236889, 233940, 231293, 228914, 227295, 226422, 225416, 223608, 221445, 219807, 218712, 217263, 214881, 212069, 209769, 208256, 206989, 205451, 203790, 202523, 201840, 201493, 201223, 200953, 200524, 199675, 198494, 197590, 197570, 198550, 200340, 202789, 205591, 208110, 209914, 211409, 213530, 216849, 221354, 227060, 234370, 243722, 255132, 268018, 281073, 292314, 299791, 302651, 301463, 297533, 292054, 285835, 279425, 273256, 267785, 263482, 260524, 258596, 257263, 256504, 256609, 257651, 259405, 261694, 264363, 266926, 268826, 270156, 271607, 273438, 275029, 275787, 276067, 276770, 278365, 280745, 283791, 287562, 291991, 296836, 301977, 307497, 313457, 319805, 326479, 333453, 340737, 348475, 356862, 365742, 374469, 382493, 389911, 397053]
53900C97053O529M900K578N22p81j577k117k315k203k154k409k722k847l028l704
53885C85725m826n889o551o884p012o912o665o531o553o427n964n382m891m317
53871C00921l570l070l194l506l263k586k423l207m220m583m258l688l091k538
53857B53724k262k318k303k002j921k517l234l045j922r77r88j526j795j712j695
53842B23507j773j508p14J58M42j11j136j940k010j377n81k48n65j192j669j950
53826B07333k283k587k277j033M39J027N52q5j89m0o2L1N87J130R56L83M05J192
53808B05479J836J718J350J425J818K017K017K222K801L614M570N602O456O835
53794B49760O722O271N616N006M912N485O099N852M687L563L424M171M872M809
$$ y = [397053, 403582, 408482, 411060, 411582, 410801, 409224, 407107, 404792, 402589, 400435, 398026, 395304, 392457, 389429, 385725, 380899, 375010, 368459, 361575, 354563, 347651, 340986, 334455, 327902, 321475, 315511, 310129, 305238, 300921, 297351, 294281, 291087, 287581, 284318, 281732, 279309, 276102, 271882, 267299, 263041, 259353, 256262, 253724, 251462, 249144, 246841, 244839, 242918, 240401, 237167, 234122, 232200, 231223, 230235, 228709, 226914, 225202, 223507, 221734, 220226, 219512, 219670, 220112, 220001, 218865, 216925, 214915, 213538, 212957, 212709, 212144, 210952, 209283, 207333, 205050, 202463, 200186, 199153, 199592, 200619, 201171, 201086, 200897, 200857, 200795, 200826, 201413, 202543, 203499, 203882, 204287, 205479, 207315, 209033, 210383, 211808, 213626, 215643, 217660, 219882, 222683, 226297, 230867, 236469, 242925, 249760, 256482, 262753, 268369, 273375, 278287, 283772, 289871, 295723, 300410, 303973, 307397, 311568, 316440, 321249]
53780C21249M175L813M320N465O388O329N061K721m37l877o749q417q994r062
53766C21985q922q500p904p548p510p277o445n353m607m279l990l631l479l655
53752B38885l926m066l980l480k456j309p70j010j462j658j708j706j337n48K8
53737B09497qm8N25R93J41j755k931k350q41K92Q02J054J034O14J74J17J60j36
53719B07334m62j72O54J322J484J309Q88K76N5R09K529L670L638L057K858L122
53703B32471L325L258L132L032K783K296J704J136O23J89j19l14m35m50k71J19
53687B52479N79Q85Q97O35K40j52m37n33n18o81j157j527j236m71j13n31j003
53670B47356p97k68j82m29l11Q8j01j095j943j834j098n32l42l00l25m22l63j4
$$ y = [321249, 325424, 329237, 333557, 339022, 345410, 351739, 356800, 359521, 359084, 355207, 348458, 340041, 331047, 321985, 313063, 304563, 296659, 289111, 281601, 274324, 267879, 262526, 257919, 253640, 249650, 246019, 242540, 238885, 234959, 230893, 226913, 223433, 220977, 219668, 218898, 217888, 216426, 214768, 213060, 211354, 210017, 209469, 209497, 209489, 209441, 209966, 210959, 211100, 209345, 206414, 204064, 203223, 203515, 204317, 205371, 206405, 207019, 207193, 207310, 207470, 207334, 206872, 206700, 207354, 208676, 210160, 211469, 212357, 212633, 212688, 213597, 216126, 219796, 223434, 226491, 229349, 232471, 235796, 239054, 242186, 245218, 248001, 250297, 252001, 253137, 253760, 253949, 253830, 253516, 253081, 252631, 252360, 252479, 253058, 253943, 254840, 255475, 255715, 255563, 255126, 254593, 254075, 253394, 252237, 250710, 249474, 249003, 248890, 248359, 247356, 246559, 246291, 246109, 245680, 245369, 245457, 245356, 244261, 242318, 240484, 239386, 238854, 238512, 238212, 237887, 237465, 237102, 237088]
53652B37088L70N25N56N45K53l94r29r68q14q43o96J40J209J436O24k40l46nJ73
53633B37684K85P39J341J462R76M82N27J036J545J711J499J113Q48Q76J128J453
53617B54705J908K603L291L429K870K195K059K376K526K302K117K293K615K822
53603B90111K989L088K662J507L79L02J170J778J353M60N7K16K40k29p78q37l94
53586C04074jj65p85j267j225r55r62j209j229r85j005j528k019j886j246o13
53570B86994k26p6k30o41r40r08r09j282j585j099M9R65J241J346J649J823J567
53553B87738J262J365J615J468J023Q71J175J521J699K077L000M144M807M670
53539C18435M063L542L426L692M135M578M974N453O201P255Q311Q892Q828Q613
$$ y = [237088, 237458, 237983, 238539, 239084, 239337, 238943, 238014, 237046, 236232, 235389, 234693, 234833, 236042, 237478, 238102, 237862, 237516, 237511, 237684, 237969, 238708, 240049, 241511, 242487, 242969, 243496, 244532, 246077, 247788, 249287, 250400, 251248, 252124, 253252, 254705, 256613, 259216, 262507, 265936, 268806, 271001, 273060, 275436, 277962, 280264, 282381, 284674, 287289, 290111, 293100, 296188, 298850, 300357, 300736, 301038, 302208, 303986, 305339, 305799, 305856, 306072, 306312, 306083, 305305, 304468, 304074, 304073, 303908, 303123, 301856, 300631, 299676, 298714, 297505, 296276, 295291, 294286, 292758, 290739, 288853, 287607, 286994, 286768, 286692, 286462, 285821, 284881, 283973, 283064, 281782, 280197, 279098, 279147, 280112, 281353, 282699, 284348, 286171, 287738, 289000, 290365, 291980, 293448, 294471, 295342, 296517, 298038, 299737, 301814, 304814, 308958, 313765, 318435, 322498, 326040, 329466, 333158, 337293, 341871, 346845, 352298, 358499, 365754, 374065, 382957, 391785, 400398]
53525D00398R089J0596J2462J3549J3386J2619J2287J2789J3725J4687J5769J7175
53513E58531J8648J9692K0301K1044K2312K3809K5031K5939K6781K7359K6947
53502H16394K5138K2588K0630K0126K0721K1252K0870J9794J8916J8779J9078
53491A044286J9226J9075J8889J8788J8634J8458J8570J8998J9149J8385J6830
53480A249288J5257J4196J3453J2583J1542J0570R639Q354O460M212K068K39j348
53467A356513k793m236o051q647j1907j5009j7090j8083j8656j9335j9930k0038
53455A194738j9909k0387k1840k3486k4196k3817k3212k3033k2975k2516k1790
53444I47577k1199k0589j9507j8067j6851j5893j4581j2697j0864r543q279o400
$$ y = [400398, 409487, 420083, 432545, 446094, 459480, 472099, 484386, 497175, 510900, 525587, 541356, 558531, 577179, 596871, 617172, 638216, 660528, 684337, 709368, 735307, 762088, 789447, 816394, 841532, 864120, 884750, 904876, 925597, 946849, 967719, 987513, 1006429, 1025208, 1044286, 1063512, 1082587, 1101476, 1120264, 1138898, 1157356, 1175926, 1194924, 1214073, 1232458, 1249288, 1264545, 1278741, 1292194, 1304777, 1316319, 1326889, 1336528, 1344882, 1351342, 1355554, 1357622, 1357861, 1356513, 1353720, 1349484, 1343433, 1334786, 1322879, 1307870, 1290780, 1272697, 1254041, 1234706, 1214776, 1194738, 1174829, 1154442, 1132602, 1109116, 1084920, 1061103, 1037891, 1014858, 991883, 969367, 947577, 926378, 905789, 886282, 868215, 851364, 835471, 820890, 808193, 797329, 787786, 779507, 773107]
53432G73107m020j767J01J714L042M012N000O597Q763J0758J2023J2735J3412
53419H45477J4383J5803J7783K0247K2772K4780K5921K6381K6841K7926K9578
53408A097892L1174L2482L4042L6255L8540M0064M1058M2575M4960M7402M9226
53397A535670N0800N2720N4751N6217N6981N7450N7758N7584N6798N5835N5247
53386B147811N5079N4760N3680N1753M9374M6740M3498L9347L4756L0572K6999
53375B634369K3479J9546J5203J0402M966p77n988j0388j4666j9389k4284k9145
53363B603328l4693m1530m8763n4739n8914o1986o4405o5755o5798o5136o4482
53352A977127o3954o3305o2259o0437n7645n4432n1746m9832m8116m6350m5109
$$ y = [773107, 769087, 767320, 767421, 769135, 772177, 776189, 781189, 787786, 796549, 807307, 819330, 832065, 845477, 859860, 875663, 893446, 913693, 936465, 961245, 987166, 1013547, 1040388, 1068314, 1097892, 1129066, 1161548, 1195590, 1231845, 1270385, 1310449, 1351507, 1394082, 1439042, 1486444, 1535670, 1586470, 1639190, 1693941, 1750158, 1807139, 1864589, 1922347, 1979931, 2036729, 2092564, 2147811, 2202890, 2257650, 2311330, 2363083, 2412457, 2459197, 2502695, 2542042, 2576798, 2607370, 2634369, 2657848, 2677394, 2692597, 2702999, 2707965, 2707188, 2701200, 2690812, 2676146, 2656757, 2632473, 2603328, 2568635, 2527105, 2478342, 2423603, 2364689, 2302703, 2238298, 2172543, 2106745, 2041609, 1977127, 1913173, 1849868, 1787609, 1727172, 1669527, 1615095, 1563349, 1513517, 1465401, 1419051, 1373942]
53341A373942m4682m4290m3054m1126l9232l7497l5545l3395l1416k9499k7033
53330I67173k3886k0739j8273j6441j4829j3348j2231j1458j0534q956o860m951
53318H04667l675k641j206N06J702K136K605L884N721P376Q730J0200J1832J3183
53304H65020J4083J4838J5719J6793J8229K0186K2252K3670K4355K5165K6814
53293A087124K8983L0766L1665L1778L1402L0878L0567L0482L0054K8620K6110
53282A418429K3021J9782J6530J3429J0745Q434O012L080j44l099n607q065j0819
53269A491728j3525j5472j6446j7043j8027j9598k1476k3437k5486k7570k9481
53258A264167l1031l2161l2897l3426l4099l5052l5843l5859l5072l4048l3176
$$ y = [1373942, 1329260, 1284970, 1241916, 1200790, 1161558, 1124061, 1088516, 1055121, 1023705, 994206, 967173, 943287, 922548, 904275, 887834, 873005, 859657, 847426, 835968, 825434, 816478, 809618, 804667, 800992, 798351, 797145, 797651, 799353, 801489, 804094, 807978, 813699, 821075, 829805, 840005, 851837, 865020, 879103, 893941, 909660, 926453, 944682, 964868, 987120, 1010790, 1035145, 1060310, 1087124, 1116107, 1146873, 1178538, 1210316, 1241718, 1272596, 1303163, 1333645, 1363699, 1392319, 1418429, 1441450, 1461232, 1477762, 1491191, 1501936, 1510370, 1516382, 1519462, 1519318, 1516219, 1510612, 1502547, 1491728, 1478203, 1462731, 1446285, 1429242, 1411215, 1391617, 1370141, 1346704, 1321218, 1293648, 1264167, 1233136, 1200975, 1168078, 1134652, 1100553, 1065501, 1029658, 993799, 958727, 924679, 891503]
53247H91503l2325l1333l0299k9241k7951k6499k5380k4756k3956k2395k0580
53236E96788j9595j9732k0216k0253j9644j8410j6487j4144j2095j0850j0221
53225D15141r742r246q765q171p338o488o005n990o150o110n685m972m305m014
53211C22160m102m272m375m541m793m807m405l971l967m223m139l533k804k262
53197B65966j787j326j154j404j655j447r35o97r96j595k180k602k728k422j777
53182B41261j097o11l92m55o66o43j13N40O00Nm68l28r9m54j053j006k94J02l99
53163B34430j188j390r38l38J84P35J157J017J72r50j688j610p59L22Q93N86l40
53146B30295j355k100k334j827o70N45J262J521J611J365M48q01j462j166n01
$$ y = [891503, 859178, 827845, 797546, 768305, 740354, 713855, 688475, 663719, 639763, 617368, 596788, 577193, 557461, 537245, 516992, 497348, 478938, 462451, 448307, 436212, 425362, 415141, 405399, 396153, 387388, 379217, 371879, 365391, 359386, 353396, 347246, 341136, 335451, 330479, 326174, 322160, 318058, 313786, 309411, 304870, 300077, 295270, 290865, 286894, 282927, 278704, 274565, 271032, 268228, 265966, 264179, 262853, 261699, 260295, 258640, 257193, 256258, 255561, 254565, 252970, 250790, 248188, 245460, 243038, 241261, 240164, 239553, 239161, 238706, 238040, 237397, 237284, 237824, 238424, 238429, 237961, 237633, 237534, 237080, 236027, 235021, 234727, 234829, 234430, 233242, 231852, 230914, 230576, 230760, 231495, 232652, 233669, 233841, 232891, 231203, 229593, 228834, 229156, 230049, 230635, 230295, 228940, 226840, 224506, 222679, 222009, 222554, 223816, 225337, 226948, 228313, 228761, 227960, 226498, 225332, 224831]
53131B24831r3J26M04N00Q8n92j002j073j150j375j555j529j251o39J68O20L60
53114B16838p1J35P65O89m55j504j264j41M38j11j071j675j938k087j905j134
53098B05509q5N52M55j45q21j296j496j502j473j478j475j430j378j197o03M34
53082A92571J398J632J048K41k10l28n27r91j377j257p03l23n67j137j274o66
53066A87530K26P86R15Q76P42L87j41o04q96j061j084r30p88q53q93m35N01J270
53048A85548J373J048Q41Q71Q25M72r1n76p26n37l30m53p80p92k91L19O15O63
53030A87999O81N46J03l25l08K8J68j0j90k31l32m93l95J0K36q2o57r20o94k27
53010A84907J68K76m2p12j340j471r95j82N80J049J173J028O74J27n23j010j112
$$ y = [224831, 224738, 224864, 225268, 225768, 225856, 225264, 224262, 223189, 222039, 220664, 219109, 217580, 216329, 215690, 215858, 216478, 216838, 216767, 216902, 217667, 218356, 217901, 216397, 215133, 214992, 215430, 215319, 214248, 212573, 210635, 208548, 206643, 205509, 205424, 205976, 206431, 206286, 205465, 204169, 202673, 201171, 199698, 198220, 196745, 195315, 193937, 192740, 192137, 192571, 193969, 195601, 196649, 196890, 196680, 196352, 195825, 194834, 193457, 192200, 191497, 191174, 190607, 189470, 188196, 187530, 187756, 188542, 189457, 190333, 191075, 191462, 191321, 190717, 189821, 188760, 187676, 186746, 185958, 185105, 184212, 183777, 184278, 185548, 186921, 187969, 188810, 189681, 190506, 190978, 190887, 190311, 189585, 189048, 188718, 188265, 187485, 186693, 186402, 186721, 187336, 187999, 188680, 189226, 189329, 189004, 188696, 188724, 188892, 188882, 188692, 188461, 188129, 187636, 187241, 187251, 187487, 187405, 186748, 185828, 185134, 184907, 185075, 185351, 185309, 184597, 183257, 181786, 180791, 180609, 181189, 182238, 183411, 184439, 185113, 185240, 184717, 183707, 182595]
52993A82595r47q65r64r66o37j39J68J48L1J42N73J052J159P86L20K31N35Q17
52975A84039P50L43k17o99p63k10O08R99P22K80K10M23N43O37J115J963K488J985
52957A95216N34r96j738j608j275j336j575j318m23L86L64l33q12m94K52M98k84
52940A85058j627k453k184j362r81j238j372p51L11J068J241J064P44L52lk87
52924A77580p28j468k081j908r27Q9M60L42L65P52J062P68o0q09j005q27p68q93
52906A69944p69j84L81L38j83m71j05O17J149J243J030P71O59P01P26N87M17N04
52888A77355R37J444J622J272N24k77p66p86m93k49l54p73j096r01k23M14N97
52871A78247N29O61R49R93Q16R33J380J378M40o83q32P9J085J581J907K441K793
$$ y = [182595, 181648, 180783, 179819, 178853, 178216, 178077, 178245, 178393, 178424, 178566, 179139, 180191, 181350, 182136, 182456, 182687, 183222, 184039, 184789, 185132, 184915, 184216, 183453, 183243, 183851, 184850, 185572, 185852, 186062, 186485, 187028, 187665, 188780, 190743, 193231, 195216, 195750, 194754, 193016, 191408, 190133, 188797, 187222, 185904, 185481, 185867, 186231, 185898, 185086, 184592, 184844, 185342, 185058, 183431, 180978, 178794, 177432, 176451, 175213, 173841, 173090, 173401, 174469, 175710, 176774, 177518, 177870, 177867, 177580, 176852, 175384, 173303, 171395, 170468, 170557, 171017, 171359, 171724, 172476, 173538, 174306, 174246, 173437, 172432, 171605, 170837, 169944, 169175, 168991, 169372, 169710, 169527, 169056, 168951, 169568, 170717, 171960, 172990, 173761, 174420, 175121, 175847, 176434, 176851, 177355, 178292, 179736, 181358, 182630, 183154, 182877, 182111, 181325, 180832, 180583, 180229, 179456, 178360, 177459, 177236, 177650, 178247, 178776, 179437, 180386, 181379, 182195, 183128, 184508, 185886, 186326, 185643, 184811, 184890, 185975, 187556, 189463, 191904, 194697]
52854A94697K340J159j1n95p04q41j227j500j139k37L89M8j008j930k291k354
52838A84796k364k141j525q54o15q28j032q33k71K98N73N42M12L68M47N81O11
52821A78165K65n57j352j287k82N81K75p58j114k58Q95J361J256J212J317J345
52805A81064J523K316L484M013L141J087j292l180m096l950l135k377k161k300
52791A74137k240j768j224r74r40q23o21n89p03o18k23J00N5q4L3J99l8n55p29
52772A62395l70nq7l60l04J23N28O63O95R23J386J753J608R32K05j07k6J62M00
52753A70514P24Q17K75o45j116q07l20k58l43R1J041J773J709J013K80r5k47m78
52735A73928o94l12R48K344K713J882R13P16J021J067Q01P64J106J361J157O36
$$ y = [194697, 197037, 198196, 198185, 197590, 196886, 196045, 194818, 193318, 192179, 191942, 192331, 192379, 191371, 189441, 187150, 184796, 182432, 180291, 178766, 177912, 177297, 176469, 175437, 174604, 174333, 174631, 175204, 175746, 176158, 176526, 176973, 177554, 178165, 178430, 177873, 176521, 175234, 174952, 175533, 175808, 175050, 173936, 173678, 174573, 175934, 177190, 178402, 179719, 181064, 182587, 184903, 188387, 192400, 195541, 196628, 195336, 192156, 188060, 184110, 180975, 178598, 176437, 174137, 171897, 170129, 168905, 167931, 166991, 166168, 165547, 164958, 164255, 163637, 163414, 163514, 163569, 163485, 163518, 163717, 163679, 163124, 162395, 162025, 162020, 161933, 161573, 161269, 161392, 161920, 162583, 163278, 164201, 165587, 167340, 168948, 169880, 170085, 169978, 169952, 170114, 170514, 171238, 172055, 172330, 171685, 170569, 169762, 169442, 169184, 168841, 168932, 169973, 171746, 173455, 174468, 174748, 174653, 174406, 173928, 173234, 172922, 173870, 176214, 178927, 180809, 181722, 182438, 183459, 184526, 185327, 186091, 187197, 188558, 189715, 190351]
52719A90351J01m07j012j722k337k575k337j856j457j164q12n22o73j270j702
52704A70606j455p51k09j22l71p46j020r55n12M3M39N73L29l07p66k30J115J858
52686A67519J090k23m83M20J212J231J088J304J418R67M18M71R74J192Q11J71
52670A79580l47o64p65n38N3O99Q52K79m77n03M06J342J373O87K61O01J395K174
52652A86408K649K486J581O44P23J936L215L560K875J500l05k089l206l564l691
52637A94722l651k689o48J056Q87p72k052j896r75l17n5K24O13R72J325J700J789
52620A90233J232K32n26o76o25r83j640j792j016M5M37N9m41p29j021j258r15
52603A80616L4P49O70L56N39R24Q22M71P19J519J771Q74l85q88n08lom25o65k19
$$ y = [190351, 190452, 190045, 189033, 187311, 184974, 182399, 180062, 178206, 176749, 175585, 174773, 174251, 173578, 172308, 170606, 169151, 168400, 168191, 168069, 167698, 166952, 165932, 164977, 164465, 164508, 164947, 165520, 165849, 165542, 164776, 164546, 165661, 167519, 168609, 168386, 167903, 168323, 169535, 170766, 171854, 173158, 174576, 175543, 175961, 176432, 177406, 178598, 179409, 179580, 179233, 178569, 177804, 177266, 177319, 178018, 178870, 179149, 178672, 178169, 178575, 179917, 181290, 181977, 182238, 182839, 184234, 186408, 189057, 191543, 193124, 193768, 194491, 196427, 199642, 203202, 206077, 207577, 207272, 205183, 201977, 198413, 194722, 191071, 188382, 187734, 188790, 189677, 188905, 186853, 184957, 183982, 183665, 183610, 183834, 184447, 185419, 186744, 188444, 190233, 191465, 191697, 191171, 190495, 189870, 188887, 187247, 185455, 184439, 184484, 184921, 184980, 184539, 183810, 182789, 181531, 180616, 180650, 181399, 182069, 182425, 182964, 183888, 184710, 185181, 185900, 187419, 189190, 190064, 189679, 188791, 188283, 188280, 188274, 187849, 187184, 186965]
52583A86965P98J684J867J530J238J168J121J083J186J153N13m92r31l80M32O03
52567A99538J67j84j39k0k38q38j479j643j084j92K94J27k47m52o46r41r33l26
52549A90764L61L58k74p79p55m61j38L30R74J450J451J004K90m51q15m79K34N63
52531A93627K74ML11Q07O98j10r45j244r96m24K71Q07R30P70P30Q69P88L28J0
52512A97505L55J071J446J451J804K836L818L806K803J696J136R44N61k79j338
52497B19615k082k055j331o14n81j083j303q51k96l60q85j028l35P87J637J876
52481B11111J588J043N79M81P53J091J202J084R06P38N67N04P63J321J785J755
52465B27271J324R97J038J122Q70N49P75J562K077J662O67j13n84j343k604l685
$$ y = [186965, 187763, 189447, 191314, 192844, 194082, 195250, 196371, 197454, 198640, 199793, 200306, 199814, 198883, 198503, 198935, 199538, 199705, 199521, 199382, 199362, 199124, 198286, 196807, 195164, 194080, 193888, 194182, 194309, 194062, 193610, 192964, 192023, 191090, 190764, 191125, 191483, 191209, 190430, 189675, 189214, 189076, 189406, 190380, 191830, 193281, 194285, 194575, 194124, 193309, 192830, 193064, 193627, 193901, 193905, 194216, 195023, 195721, 195611, 194666, 193422, 192426, 192002, 192273, 193080, 194010, 194780, 195510, 196379, 197167, 197495, 197505, 197860, 198931, 200377, 201828, 203632, 206468, 210286, 214092, 216895, 218591, 219727, 220671, 221232, 220953, 219615, 217533, 215478, 214147, 213533, 212952, 211869, 210566, 209715, 209419, 209059, 208174, 207146, 206811, 207598, 209235, 211111, 212699, 213742, 214321, 214802, 215555, 216646, 217848, 218932, 219838, 220576, 221143, 221647, 222410, 223731, 225516, 227271, 228595, 229592, 230630, 231752, 232622, 233171, 233946, 235508, 237585, 239247, 239914, 239801, 239217, 237874, 235270, 231585]
52449B31585l840l217k637k587k817k867k679k518k409k009j122j50K83Q6j97
52434B02905j57K1K8q2j67m15r76j389j031p9N56M05k2l0M09R10J267J460J395
52415B05008J028N99L81L82M66O17Q58J112J355J653J928K020K094K613L620M547
52399B30281N076N606O337O406M857K102m35k024l100m032m490m262l822l570
52385B34930l200k390j505r99o18J27J021J337Q64J63j04L28J375K623L358L125
52369B40435K336J900K168K636K733K394J742O75p94k105k558k106j426j086r68
52354B45976o48j49J5l85q43o57J97J052J393J344J198R11L34k50l72n4J70O2
52336B49294O8P23J857K753K977K795K730K937L213L442L789M350M887N163N395
$$ y = [231585, 227745, 224528, 221891, 219304, 216487, 213620, 210941, 208423, 206014, 204005, 202883, 202733, 203016, 203102, 202905, 202748, 202769, 202797, 202715, 202548, 202133, 201157, 199768, 198737, 198658, 199214, 199619, 199597, 199567, 199976, 200886, 202153, 203613, 205008, 206036, 206635, 207016, 207398, 207864, 208481, 209339, 210451, 211806, 213459, 215387, 217407, 219501, 222114, 225734, 230281, 235357, 240963, 247300, 253706, 258563, 260665, 260230, 258206, 255106, 251074, 246584, 242322, 238500, 234930, 231730, 229340, 227835, 226836, 226218, 226345, 227366, 228703, 229567, 229730, 229626, 229954, 231329, 233952, 237310, 240435, 242771, 244671, 246839, 249475, 252208, 254602, 256344, 257019, 256225, 254120, 251562, 249456, 248030, 246944, 245976, 245328, 245179, 245194, 244809, 243966, 243309, 243506, 244558, 245951, 247295, 248493, 249404, 249738, 249488, 249116, 249062, 249232, 249294, 249362, 250085, 251942, 254695, 257672, 260467, 263197, 266134, 269347, 272789, 276578, 280928, 285815, 290978, 296373]
52321B96373O029P018P665P385O341N133M104L301K899L165L925M456M178L277
52307C65249K502K441L131M172N077N555N661N722N999O413O582O213N397M511
52293D34625L836L289K597J680P95K87L05P45J327J687J526Q63K5o51j092j321
52277D50523j260q18j28N27R69J235J451J747K224K795L128K917K271J672J631
52262D70884K374L715N059N619N084M020L365L471L901M186M322M475M553M472
52248E29500M480M806N155M958M108L133K531K307K208K139K130K141K114K122
52234E73832K255K457K603K671K653K460K152K161K896M039M672M263L304K637
52220F15055K485K443K262K155K371K813L142L050K472J857J996L143M411M657
$$ y = [296373, 302402, 309420, 317085, 324470, 330811, 335944, 340048, 343349, 346248, 349413, 353338, 357794, 361972, 365249, 367751, 370192, 373323, 377495, 382572, 388127, 393788, 399510, 405509, 411922, 418504, 424717, 430114, 434625, 438461, 441750, 444347, 446027, 446822, 447109, 447414, 448159, 449486, 451173, 452699, 453562, 453587, 452936, 451844, 450523, 449263, 448445, 448317, 448844, 449813, 451048, 452499, 454246, 456470, 459265, 462393, 465310, 467581, 469253, 470884, 473258, 476973, 482032, 487651, 492735, 496755, 500120, 503591, 507492, 511678, 516000, 520475, 525028, 529500, 533980, 538786, 543941, 548899, 553007, 556140, 558671, 560978, 563186, 565325, 567455, 569596, 571710, 573832, 576087, 578544, 581147, 583818, 586471, 588931, 591083, 593244, 596140, 600179, 604851, 609114, 612418, 615055, 617540, 619983, 622245, 624400, 626771, 629584, 632726, 635776, 638248, 640105, 642101, 645244, 649655, 654312]
52206F54312L973L600M229N155N525N533N680N548M395K620J613K034L201M219
52192G11637M938N477N656N385N070N051N025M474L439K427J710J112L69o36j882
52177G59252l163m147m734n272o111p019p289o549n212m010l206k513j753j288
52163F96986j517k024j790m24J184J877J592J254J474J967K152J747P08p48j919
52148G02519j969q88L64R77J135J451K076K735L211L341K867J781N57l48r64j397
52132G17448j433j019p10r14j009l0J882L591M540N383O791Q487R794J0556J1016
52117G74373J1263J1283J1195J0975J0255Q834P124N614M174K386M20j040j778
52104H55078k262k783k904k141p45O17J726K751L627M052M168M604N561O336O116
$$ y = [654312, 658285, 661885, 666114, 671269, 676794, 682327, 688007, 693555, 697950, 700570, 702183, 704217, 707418, 711637, 716575, 722052, 727708, 733093, 738163, 743214, 748239, 752713, 756152, 758579, 760289, 761401, 761770, 761134, 759252, 756089, 751942, 747208, 741936, 735825, 728806, 721517, 714968, 709756, 705746, 702540, 700027, 698274, 696986, 695469, 693445, 691655, 691231, 692415, 694292, 695884, 697138, 698612, 700579, 702731, 704478, 705186, 704438, 702519, 700550, 699662, 700026, 701003, 702138, 703589, 705665, 708400, 711611, 714952, 717819, 719600, 720157, 719809, 718845, 717448, 716015, 714996, 714286, 713372, 712363, 712333, 714215, 717806, 722346, 727729, 734520, 743007, 752801, 763357, 774373, 785636, 796919, 808114, 819089, 829344, 838178, 845302, 850916, 855090, 857476, 857896, 856856, 855078, 852816, 850033, 847129, 844988, 844243, 844860, 846586, 849337, 852964, 857016, 861184, 865788, 871349, 877685, 883801]
52089H83801M868L084R76j442l780n412o214o566o614o110n114m188l617l012
52075H40660k095j286j040j037o59P5O20P88R19J265J685J951J946J653J224J017
52059H47686J209J446J249O39Rm03n88m92j24J74P7k78n70q78j494k346l153l932
52041H38231m724n084m581l744l609m246m632m066k919j753o70J66L34JJ15J134
52025G99953K299K770K765K910L225L615M569O305P720P404N571L888L368L479
$$ y = [883801, 888669, 891753, 892729, 891287, 887507, 882095, 875881, 869315, 862701, 856591, 851477, 847289, 843672, 840660, 838565, 837279, 836239, 835202, 834543, 834618, 835238, 836026, 836945, 838210, 839895, 841846, 843792, 845445, 846669, 847686, 848895, 850341, 851590, 852229, 852238, 851835, 851247, 850755, 850631, 850805, 850882, 850604, 850034, 849156, 847662, 845316, 842163, 838231, 833507, 828423, 823842, 820098, 816489, 812243, 807611, 803545, 800626, 798873, 798203, 798369, 798703, 798704, 798819, 799953, 802252, 805022, 807787, 810697, 813922, 817537, 822106, 828411, 836131, 843535, 849106, 852994, 856362, 859841]
$$ [...]
##END NTUPLES=NMR SPECTRUM
##END=
