
##TITLE=AC1391_HONAH12203_7519507_Tmd1RbEgxY
##JCAMPDX= 6.0         $$ Bruker NMR JCAMP-DX V2.0
##DATA TYPE= NMR SPECTRUM
##DATA CLASS= NTUPLES
##ORIGIN= BRUKER
##OWNER= Administrator
$$ 1.72 TOPSPIN		Version 2.1
$$ 2013-02-19 22:30:07.645 -0500  Administrator@X
$$ Compression mode = diff/dup
##.OBSERVE FREQUENCY= 400.02188249412
##.OBSERVE NUCLEUS= ^1H
##.ACQUISITION MODE= SIMULTANEOUS (DQD)
##.ACQUISITION SCHEME= undefined
##.AVERAGES= 64
##.DIGITISER RES= 22
##SPECTROMETER/DATA SYSTEM= spect
##.PULSE SEQUENCE= noesygpps1d.comp
##.SOLVENT NAME= COFFEE_meoh
##.SHIFT REFERENCE= INTERNAL, COFFEE_meoh, 1, 14.96089
##AUDIT TRAIL= $$ (NUMBER, WHEN, WHO, WHERE, PROCESS, VERSION, WHAT)
$$ ##TITLE= Audit trail, TOPSPIN		Version 2.1
$$ ##JCAMPDX= 5.01
$$ ##ORIGIN= Bruker BioSpin GmbH
$$ ##OWNER= Administrator
$$ $$ E:\/data/COFFEE/nmr/AC1391_HONAH12203_7519507_Tmd1RbEgxY/12/pdata/1/auditp.txt
$$ ##AUDIT TRAIL=  $$ (NUMBER, WHEN, WHO, WHERE, PROCESS, VERSION, WHAT)
(   1,<2013-02-19 22:30:01.348 -0500>,<Administrator>,<X>,<go>,<TOPSPIN 2.1>,
      <created by zg
	started at 2013-02-19 22:18:31.548 -0500,
	POWCHK enabled, PULCHK disabled,
       configuration hash MD5:
       86 BA 57 50 F2 9D 5C 9B 26 00 A9 28 5F 66 2E 89
       data hash MD5: 64K
       47 24 2F 81 08 80 E5 C3 C2 F5 5B EF 1D FA 31 55>)
(   2,<2013-02-19 22:30:04.504 -0500>,<Administrator>,<X>,<proc1d>,<TOPSPIN 2.1>,
      <Start of raw data processing
       efp LB = 0.3 FT_mod = 6 PKNL = 1 PHC0 = 0 PHC1 = 0 SI = 128K 
       data hash MD5: 128K
       E8 E9 12 85 C4 B6 CB 17 1F AE 10 12 8A F2 73 E1>)
(   3,<2013-02-19 22:30:05.739 -0500>,<Administrator>,<X>,<proc1d>,<TOPSPIN 2.1>,
      <pk PHC0 = 254.2236 PHC1 = 0 
       data hash MD5: 128K
       B5 CF CC 34 A8 F9 10 37 B2 73 85 BA 35 A1 95 2A>)
(   4,<2013-02-19 22:30:06.473 -0500>,<Administrator>,<X>,<proc1d>,<TOPSPIN 2.1>,
      <abs ABSG = 1 
       data hash MD5: 128K
       13 29 61 0C 8D 04 2A E6 F2 1D 55 C5 7F 44 31 78>)
(   5,<2013-02-19 22:30:06.645 -0500>,<Administrator>,<X>,<proc1d>,<TOPSPIN 2.1>,
      <abs ABSG = 2 
       data hash MD5: 128K
       5A 64 80 F0 79 F1 DD 50 C9 3B 04 68 4B 0F 65 46>)
(   6,<2013-02-19 22:30:06.801 -0500>,<Administrator>,<X>,<proc1d>,<TOPSPIN 2.1>,
      <abs ABSG = 3 
       data hash MD5: 128K
       AE 6C D2 99 BA C6 44 BC 92 26 86 B3 29 B3 2D 9B>)
(   7,<2013-02-19 22:30:06.989 -0500>,<Administrator>,<X>,<proc1d>,<TOPSPIN 2.1>,
      <abs ABSG = 4 
       data hash MD5: 128K
       9E 63 26 58 12 D9 5C 98 1B DE 76 65 05 EA C8 DC>)
(   8,<2013-02-19 22:30:07.223 -0500>,<Administrator>,<X>,<proc1d>,<TOPSPIN 2.1>,
      <abs ABSG = 5 
       data hash MD5: 128K
       FD CA 63 A7 05 2E 41 45 CD AF 01 2F A8 25 2E 55>)
$$ ##END=
$$ 
$$ $$ hash MD5
$$ $$ A3 E7 A8 91 0C D4 60 F2 D3 41 70 CC BE 50 B4 E1
##$RELAX= 
##$RELAX= 
##$RELAX= 
##$RELAX= 
##$RELAX= 
##$RELAX= 
##$RELAX= 
##$RELAX= 
$$ Bruker specific parameters
$$ --------------------------
##$DU= <E:\>
##$EXPNO= 12
$$ [...]
150 150 150 150 150 150 150 150
##$TP07= 0
##$TPNAME0= <>
##$TPNAME1= <>
##$TPNAME2= <>
##$TPNAME3= <>
##$TPNAME4= <>
##$TPNAME5= <>
##$TPNAME6= <>
##$TPNAME7= <>
##$TPOAL= (0..7)
0.5 0.5 0.5 0.5 0.5 0.5 0.5 0.5
##$TPOFFS= (0..7)
0 0 0 0 0 0 0 0
##$TUNHIN= 0
##$TUNHOUT= 0
##$TUNXOUT= 0
##$USERA1= <user>
##$USERA2= <user>
##$USERA3= <user>
##$USERA4= <user>
##$USERA5= <user>
##$V9= 5
##$VALIST= <valist>
##$VCLIST= <CCCCCCCCCCCCCCC>
##$VD= 0
##$VDLIST= <DDDDDDDDDDDDDDD>
##$VPLIST= <PPPPPPPPPPPPPPP>
##$VTLIST= <TTTTTTTTTTTTTTT>
##$WBST= 1024
##$WBSW= 4
##$XGAIN= (0..3)
0 0 0 0
##$XL= 0
##$YL= 0
##$YMAX_a= 6424569
##$YMIN_a= -11216644
##$ZGOPTNS= <>
##$ZL1= 120
##$ZL2= 120
##$ZL3= 120
##$ZL4= 120
##$ABSF1= 14.96089
##$ABSF2= -5.597292
##$ABSG= 5
##$ABSL= 3
##$ALPHA= 0
##$AQORDER= 0
##$ASSFAC= 0
##$ASSFACI= 0
##$ASSFACX= 0
##$ASSWID= 0
##$AUNMP= <proc_prof1d_extract.lims>
##$AXLEFT= 0
##$AXNAME= <>
##$AXNUC= <1H>
##$AXRIGHT= 0
##$AXTYPE= 0
##$AXUNIT= <>
##$AZFE= 0.1
##$AZFW= 0.1
##$BCFW= 0
##$BC_mod= 0
##$BYTORDP= 0
##$COROFFS= 0
##$CY= 15
##$DATMOD= 1
##$DC= 0
##$DFILT= <>
##$DTYPP= 0
##$F1P= 0
##$F2P= 0
##$FCOR= 0.5
##$FTSIZE= 131072
##$FT_mod= 6
##$GAMMA= 0
##$GB= 0
##$INTBC= 1
##$INTSCL= 1
##$ISEN= 128
##$LB= 0.3
##$LEV0= 0
##$LPBIN= 0
##$MAXI= 10000
##$MC2= 0
##$MEAN= 0
##$ME_mod= 0
##$MI= 0
##$NCOEF= 0
##$NC_proc= -2
##$NLEV= 6
##$NOISF1= 0
##$NOISF2= 0
##$NSP= 0
##$NTH_PI= 0
##$NZP= 0
##$OFFSET= 14.96089
##$PC= 1
##$PHC0= 254.2236
##$PHC1= 0
##$PH_mod= 1
##$PKNL= yes
##$PPARMOD= 0
##$PPDIAG= 0
##$PPIPTYP= 0
##$PPMPNUM= 2147483647
##$PPRESOL= 1
##$PSCAL= 4
##$PSIGN= 0
##$PYNMP= <proc.py>
##$REVERSE= no
##$SF= 400.020009679379
##$SI= 131072
##$SIGF1= 0
##$SIGF2= 0
##$SINO= 400
##$SIOLD= 131072
##$SPECTYP= <>
##$SREGLST= <1H.CDCl3>
##$SSB= 0
##$STSI= 131072
##$STSR= 0
##$SW_p= 8223.68421052631
##$SYMM= 0
##$S_DEV= 0
##$TDeff= 65536
##$TDoff= 0
##$TI= <>
##$TILT= no
##$TM1= 0
##$TM2= 0
##$TOPLEV= 0
##$USERP1= <user>
##$USERP2= <user>
##$USERP3= <user>
##$USERP4= <user>
##$USERP5= <user>
##$WDW= 1
##$XDIM= 131072
##$YMAX_p= 428742114
##$YMIN_p= -26296
##$CURPLOT= <Network HP LaserJet P1505>
##$CURPRIN= <$Network HP LaserJet P1505>
##$DFORMAT= <normdp>
##$LAYOUT= <+/1D_H.xwp>
##$LFORMAT= <normlp>
##$PFORMAT= <normpl>
##$SURQMSG= 1
$$ End of Bruker specific parameters
$$ ---------------------------------
##NTUPLES= NMR SPECTRUM
##VAR_NAME=  FREQUENCY,     SPECTRUM/REAL,   SPECTRUM/IMAG
##SYMBOL=    X,             R,               I
##VAR_TYPE=  INDEPENDENT,   DEPENDENT,       DEPENDENT
##VAR_FORM=  AFFN,          ASDF,            ASDF
##VAR_DIM=   131072,        131072,          131072
##UNITS=     HZ,            ARBITRARY UNITS, ARBITRARY UNITS
##FACTOR=    0.0627417313425164, 1,          1
##FIRST=     8223.62146879497, 1712,         -64395
##LAST=      0,             3238,            -64843
##MIN=       0,             -26296,          0
##MAX=       8223.62146879497, 428742114,    0
$$ Real data points
##PAGE= N=1
##DATA TABLE= (X++(R..R)), XYDATA
$$ [...]
63843A577183j8597k4237l0305l6311m1423m5424m8569n0901n2288n2825n2618
$$ 1577183 1558586 1534349 1504044 1467733 1426310 1380886 1332317 1281416 1229128 1176303 1123685
63832A123685n1463m9218m6310m3423m0840l8606l7055l6543l6723l6718l6012
$$ 1123685 1072222 1023004 976694 933271 892431 853825 816770 780227 743504 706786 670774
63821F70774l4700l2889l0513k7814k5376k3433k1571j9393j7012j4717j2593
$$ 670774 636074 603185 572672 544858 519482 496049 474478 455085 438073 423356 410763
63810D10763j0774r632r285r161q556p460o494o051n910n639n109m471l895l448
$$ 410763 399989 390357 381072 371911 363355 355895 349401 343350 337440 331801 326692 322221 318326 314878
63796C14878l130k879k647k528k762l435m247m701m585m166l779l449l055k716
$$ 314878 311748 308869 306222 303694 300932 297497 293250 288549 283964 279798 276019 272570 269515 266799
63782B66799k682k799k583j930j399j409j512r69Q7O88K74n73r29o15k19j94m15
$$ 266799 264117 261318 258735 256805 255406 253997 252485 251516 251603 252291 252565 251992 251063 250448 250229 250035 249620
63765B49620n43n36o52j041j489j577j122m14O9J66J12J28J56R2L9J15J69k0l43
$$ 249620 249077 248541 247889 246848 245359 243782 242660 242246 242315 242481 242593 242721 242877 242969 243008 243123 243292 243272 242929
63746B42929m58k41J59O87J431K151K222J431M80K57P70J304J535J853K459K860
$$ 242929 242471 242230 242389 243076 244507 246658 248880 250311 250791 251048 251818 253122 254657 256510 258969 261829
63730B61829K625K200K330L038L682L945M119M443M756N049N727O918P909P804
$$ 261829 264454 266654 268984 272022 275704 279649 283768 288211 292967 298016 303743 310661 318570 326374
63716C26374O656N425M792M425L612K233P63m68j610k829l944m703n128n293n044
$$ 326374 333030 338455 343247 347672 351284 353517 354280 353812 352202 349373 345429 340726 335598 330305 325261
63701C25261m302l469l043k886k394j445n65nP15J938L121L546L411L493L998
$$ 325261 320959 317490 314447 311561 309167 307722 307157 307152 307867 309805 312926 316472 319883 323376 327374
63686C27374M413M433M287M038L298J944O53K62Q18J526J579R11K04J79Q07J385
$$ 327374 331787 336220 340507 344545 347843 349787 350440 350702 351520 353046 354625 355536 355740 355919 356726 358111
63670C58111J508J687K583L857M410L782K722K191K303K467K128J074n79k344
$$ 358111 359619 361306 363889 367746 372156 375938 378660 380851 383154 385621 387749 388823 388244 385900
63656C85900l587m103m336m785n429n919o081n952n495m643l539k535j892j549
$$ 385900 382313 378210 373874 369089 363660 357741 351660 345708 340213 335570 332031 329496 327604 326055
63642C26055j117j26J486L184M299M717M849M933M770M297L971M256M954N412
$$ 326055 324938 324812 326298 329482 333781 338498 343347 348280 353050 357347 361318 365574 370528 375940
63628C75940N308M996N100N878O911P457P211O715O736P378Q147Q906J0200J2390
$$ 375940 381248 386244 391344 397222 404133 411590 418801 425516 432252 439630 447777 456683 466883 479273
63614D79273J4907J6811J7833J8465J9302K0635K2586K5127K7907L0435L2543
$$ 479273 494180 510991 528824 547289 566591 587226 609812 634939 662846 693281 725824
63603G25824L4462L6356L7815L8008L6216L2249K6341J8866J0413K092m660q950
$$ 725824 760286 796642 834457 872465 908681 940930 967271 986137 996550 998642 993982 985032
63591I85032j1027j1684j1339j0134q744q383r734j2416j5743j9523k3724k7787
$$ 985032 974005 962321 950982 940848 932104 923721 913987 901571 885828 866305 842581 814794
63579H14794l0785l2136l1801k9997k7151k4026k1361j9268j7181j4510j1234
$$ 814794 784009 751873 720072 690075 662924 638898 617537 598269 581088 566578 555344
63568E55344p836m849k530p98O41K013L230L932L962L829M453O137P996Q809Q464
$$ 555344 547508 542659 540129 539331 539972 541985 545215 549147 553109 556938 561391 567528 575524 584333 592797
63553E92797Q147R053J1360J4605J8303K1959K5157K8261L2343L7890M4253N1076
$$ 592797 600944 609997 621357 635962 654265 676224 701381 729642 761985 799875 844128 895204
63541H95204N9028O7495P2291O8021N3435L3028J2869l720j6011k3559k6037k4533
$$ 895204 954232 1021727 1094018 1162039 1215474 1248502 1261371 1257651 1241640 1218081 1192044 1167511
63529A167511k1171j7379j3532j0169q428r086j1901j6190k1500k7491l3501l8479
$$ 1167511 1146340 1128961 1115429 1105260 1096832 1087746 1075845 1059655 1038155 1010664 977163 938684
63517I38684m1458m2204m1443m0152l8615l6455l3577l0441k7346k4175k1110
$$ 938684 897226 855022 813579 773427 734812 698357 664780 634339 606993 582818 561708
63506E61708j8804j7379j5991j4046j2169j1233j0973j0383r145p871p120o896
$$ 561708 542904 525525 509534 495488 483319 472086 461113 450730 441585 433714 426594 419698
63494D19698o942o895o310n134m001l546l542l223k251r51J77P28N37J06M40J911
$$ 419698 412756 405861 399551 394417 390416 386870 383328 380105 377854 376903 377080 377808 378345 378451 378891 380802
63478C80802L612M536M922N669O757P284O888O095N236M004K323P70k21q80j619
$$ 380802 384414 388950 393872 399541 406298 413582 420470 426565 431801 435805 438128 438898 438677 437797 436178
63463D36178k467l271l918m171l775k878j923j046o5Q31J076N83J53M92J336J876
$$ 436178 433711 430440 426522 422351 418576 415698 413775 412729 412664 413495 414571 415154 415307 415799 417135 419011
63447D19011J854J769K137K887L582M090M841O300Q245R923J1065J2404J4811
$$ 419011 420865 422634 424771 427658 431240 435330 440171 446471 454716 464639 475704 488108 502919
63434E02919J8258K2080K6273L1972M0335N0787O0179O3911N8755M5441K8353
$$ 502919 521177 543257 569530 601502 641837 692624 752803 816714 875469 920910 949263
63423I49263J2305k24q797j3107j2706q329k117M139J0300J7046K4402L1542L7662
$$ 949263 961568 961344 952547 939440 926734 918405 916288 920427 930727 947773 972175 1003717 1041379
63410A041379M2304M4866M4331L9863L1643K1078J0088K49p521j2743j5325j5700
$$ 1041379 1083683 1128549 1172880 1212743 1244386 1265464 1275552 1275801 1268280 1255537 1240212 1224512
63398A224512j4694j3131j1799j1674j3606j7590k2804k8452l4118l9209m2814
$$ 1224512 1209818 1196687 1184888 1173214 1159608 1142018 1119214 1090762 1056644 1017435 974621
63387I74621m4442m4359m2939m0307l6974l3943l1636k9354k6405k3059j9899
$$ 974621 930179 885820 842881 802574 765600 731657 700021 670667 644262 621203 601304
63376F01304j6928j4014j1375q873n729j863J362K873L584N098P400R287J0609
$$ 601304 584376 570362 558987 550114 544385 542522 543884 546757 550341 555439 562839 572126 582735
63363E82735J2447J5265J8415K1444K4518K7487K9939L2212L5105L8438M1245
$$ 582735 595182 610447 628862 650306 674824 702311 732250 764462 799567 838005 879250
63352H79250M3439M5940M8838N0777N0487M7743M2435L4180K3411J1867J327p240
$$ 879250 922689 968629 1017467 1068244 1118731 1166474 1208909 1243089 1266500 1278367 1279694 1272454
63340A272454j3190j5989j6093j4894j3421j1973j1258j2548j6162k0969k5974
$$ 1272454 1259264 1243275 1227182 1212288 1198867 1186894 1175636 1163088 1146926 1125957 1099983
63329A099983l1182l6391m0442m2472m2846m2020l9641l5591l0816k6169k1324
$$ 1099983 1068801 1032410 991968 949496 906650 864630 824989 789398 758582 732413 711089
63318G11089j5546q581l02Q803J5774J5672O145r184k3605l3017l7461l8211l5900
$$ 711089 695543 686962 686660 695463 711237 726909 733054 723870 700265 667248 629787 591576 555676
63305E55676l1481k6665k2498j8778j5351j2813j1404j0352q978p629o924o699
$$ 555676 524195 497530 475032 456254 440903 428090 416686 406334 397356 389727 382803 376104
63293C76104o294n428m391l588l231l186l112k896k868l220l402k709j441p95
$$ 376104 369810 364382 359991 356403 353172 349986 346874 343978 341110 337890 334488 331779 330338 329543
63279C29543j388k467k857k265j283m48K20Q80J443J692J667J667J844J967J724
$$ 329543 328155 325688 322831 320566 319283 318835 319055 319935 321378 323070 324737 326404 328248 330215 331939
63264C31939J175O48M05N87J285K278K900K756K413K788L941N126N914O403O420
$$ 331939 333114 333762 334167 334754 336039 338317 341217 343973 346386 349174 353115 358241 364155 370558 376978
63249C76978N586M400M092M939N811N970O200P320Q691R253R291R914J1348J2859
$$ 376978 382564 386964 391056 395995 401806 407776 413976 421296 429987 439240 448531 458445 469793 482652
63235D82652J3979J4744J5095J5107J5538J7093J9274K0962K1906K2648K3244
$$ 482652 496631 511375 526470 541577 557115 574208 593482 614444 636350 658998 682242
63224F82242K3171K2429K1667K1117K0502K0090K0711K2459K4338K5553K6203
$$ 682242 705413 727842 749509 770626 791128 811218 831929 854388 878726 904279 930482
63213I30482K6407K5685K3756K1104J8146J4470R566L768k197q125j4103j9644
$$ 930482 956889 982574 1006330 1027434 1045580 1060050 1069616 1073384 1071187 1063062 1048959 1029315
63201A029315k3893k6656k8620l0346l1484l1301k9647k7046k3896k0024j5289
$$ 1029315 1005422 978766 950146 919800 888316 857015 827368 800322 776426 756402 741113
63190G41113j0234n724k003J400M813Q034J0964J3990J7300K0367K2704K4777
$$ 741113 730879 725155 723152 724552 729365 737399 748363 762353 779653 800020 822724 847501
63178H47501K7381L0335L2493L3150L2800L2278L1659L0377K8237K5927K4388
$$ 847501 874882 905217 937710 970860 1003660 1035938 1067597 1097974 1126211 1152138 1176526
63167A176526K3731K2962K1034J7941J4340J0276M959j919r515j6881k4008l1160
$$ 1176526 1200257 1223219 1244253 1262194 1276534 1286810 1291769 1289850 1280335 1263454 1239446 1208286
63155A208286l7762m2795m6045m8096m9208m9013m7319m4579m1413l8138l4820
$$ 1208286 1170524 1127729 1081684 1033588 984380 935367 888048 843469 802056 763918 729098
63144G29098l1402k7756k4012k0772j8647j7557j6800j5688j3935j1691r480p871
$$ 729098 697696 669940 645928 625156 606509 588952 572152 556464 542529 530838 521358 513487
63132E13487o869n856m505l296k736k497j904r50j79J47K23L02P09J885L671M910
$$ 513487 506618 500762 496257 492961 490225 487728 485824 484874 484695 484842 485065 485367 486076 487961 491632 496542
63116D96542M594L223K201K055K176K188K516L423M380M748M413L599K576J763
$$ 496542 501136 504359 506560 508615 510791 512979 515495 518918 523298 528046 532459 536058 538634 540397
63102E40397J511J633J639J494J564J784J595Q51K40M94J673L320M917O045O541
$$ 540397 541908 543541 545180 546674 548238 550022 551617 552468 552708 553202 554875 558195 563112 569157 575698
63087E75698O539O093M863K724L98j179j976k627l222l245k695k187j787p94R48
$$ 575698 582237 588330 593193 595917 596315 595136 593160 590533 587311 584066 581371 579184 577397 576603 577551
63072E77551K495L187L695M933O623P781Q300R082J0676J2460J3436J3466J3470
$$ 577551 580046 583233 586928 591861 598484 606265 614565 623647 634323 646783 660219 673685 687155
63059F87155J4509J6741J9372K1622K3542K5766K8661L2023L5469L8718M1703
$$ 687155 701664 718405 737777 759399 782941 808707 837368 869391 904860 943578 985281
63048I85281M4629M7792N0978N3423N4718N5361N5906N6092N5572N4933N4980
$$ 985281 1029910 1077702 1128680 1182103 1236821 1292182 1348088 1404180 1459752 1514685 1569665
63037A569665N5347N5086N4437N4720N6302N7952N8506N7959N6462N3435M8303
$$ 1569665 1625012 1680098 1734535 1789255 1845557 1903509 1962015 2019974 2076436 2129871 2178174
63026B178174M1194L2302K1445Q900m242j7195l0137m2972n4361o2876o8517p2171
$$ 2178174 2219368 2251670 2273115 2282015 2277773 2260578 2230441 2187469 2133108 2070232 2001715 1929544
63014A929544p4061p3620p0575o5291n8336n0409m2397l4736k6916j8214q807
$$ 1929544 1855483 1781863 1711288 1645997 1587661 1537252 1494855 1460119 1433203 1414989 1406182
63003A406182M04Q845J6603K3940L0975L7582M3182M6916M8599M9173M9736N0425
$$ 1406182 1406586 1415431 1432034 1455974 1486949 1524531 1567713 1614629 1663228 1712401 1762137 1812562
62991A812562N0810N0947N1260N1675N1737N1444N1141N0481M8285M3713L7041
$$ 1812562 1863372 1914319 1965579 2017254 2068991 2120435 2171576 2222057 2270342 2314055 2351096
62980B351096K9081K0207J0114j704j5361l0166m4777n7998o9429p9080q6575
$$ 2351096 2380177 2400384 2410498 2408794 2393433 2363267 2318490 2260492 2191063 2111983 2025408
62969B025408r1244r2969r2525r0798q7985q3765p8146p1930o6183o1214n6266
$$ 2025408 1934164 1841195 1748670 1657872 1569887 1486122 1407976 1336046 1269863 1208649 1152383
62958A152383n0576m4615l9774l6664l4330l1552k8338k5609k3824k2670k1882
$$ 1152383 1101807 1057192 1017418 980754 946424 914872 886534 860925 837101 814431 792549
62947G92549k1478k1204k0508j9300j8172j7560j7198j6653j5935j5189j4237
$$ 792549 771071 749867 729359 710059 691887 674327 657129 640476 624541 609352 595115
62936E95115j2863j1332j0138r298q412p448o924p100p330o704n182l648k825
$$ 595115 582252 570920 560782 551484 543072 535624 528700 521600 514270 507566 502384 498736 495911
62923D95911k590k417k110j803j590j509j597j688j344m57L81N68L23L07O21Q11
$$ 495911 493321 490904 488794 486991 485401 483892 482295 480607 479263 478806 479187 479755 480078 480385 481006 481817
62907D81817P70Q37Q62P6j769l738m724m605l966l207k383j586r08k47M44Q90
$$ 481817 482587 483424 484286 484362 482593 478855 474131 469526 465560 462353 459970 458384 457476 457229 457673 458563
62891D58563Q62N64L01Pm66q16o03j7J60m47j276j449p15L71J084J173R43P93
$$ 458563 459425 459989 460290 460297 459831 459015 458412 458395 458555 458108 456832 455383 454668 455039 456123 457296 458239 459032
62873D59032Q46R81J082J012N58l66j400k014k099k104k499l246l791l492k167
$$ 459032 459878 460859 461941 462953 463511 463145 461745 459731 457632 455528 453029 449783 445992 442500 440333
62858D40333m44O01N00j27m10k68j24K3M58Q54N25l10m96M52J642K072J836J461
$$ 440333 439889 440490 440990 440863 440453 440185 440061 440084 440542 441396 441921 441611 441115 441567 443209 445281 447117 448578
62840D48578Q76j72j232j522j003l49p7k36p00j204j240m96O20J401J663J754
$$ 448578 449454 449282 448050 446528 445525 445176 445099 444863 444163 442959 441719 441223 441843 443244 444907 446661
62824D46661J899J987J952J966K152K409K542K436K177K042K267K698K939K909
$$ 446661 448560 450547 452499 454465 456617 459026 461568 464004 466181 468223 470490 473188 476127 479036
62810D79036K949L255L608L854M205M763N166N124M923N059N628O479P639R159
$$ 479036 481985 485240 488848 492702 496907 501670 506836 511960 516883 521942 527570 534049 541688 550847
62796E50847J0695J1753J2213J2360J2479J2717J3163J3888J5025J6853J9582
$$ 550847 561542 573295 585508 597868 610347 623064 636227 650115 665140 681993 701575
62785G01575K2932K6358K9760L3590L8097M2992M8132N3832O0222O6792P3026
$$ 701575 724507 750865 780625 814215 852312 895304 943436 997268 1057490 1124282 1197308
62774A197308P8998Q4849R0190R4437R7225R7932R5451Q9200Q0101O9702N8508
$$ 1197308 1276306 1361155 1451345 1545782 1643007 1740939 1836390 1925590 2005691 2075393 2133901
62763B133901M5706L0536J3367m416k1296l6457n0006o2169p2294p9260q3115
$$ 2133901 2179607 2210143 2223510 2219094 2197798 2161341 2111335 2049166 1976872 1897612 1814497
62752A814497q5366q7151q7920q6632q3477p9424p4811o9507o4017n9150n4770
$$ 1814497 1729131 1641980 1554060 1467428 1383951 1304527 1229716 1160209 1096192 1037042 982272
62741I82272n0087m5050m0386l6337l2408k8476k5035k2219j9581j7039j5048
$$ 982272 932185 887135 846749 810412 778004 749528 724493 702274 682693 665654 650606
62730F50606j3623j2106j0253q601p391o043m207k488j510r45j53Q68J789K791
$$ 650606 636983 624877 614624 606023 598632 592589 588382 585894 584384 583439 583286 584154 585943 588734
62716E88734M299O152P788R146J0772J2984J5405J7563J9598K2107K5315K8685
$$ 588734 593033 599185 606973 616119 626891 639875 655280 672843 692441 714548 739863 768548
62704G68548L1513L3900L6859M1270M7002N3252N9496O5749P2095P8431Q4653
$$ 768548 800061 833961 870820 912090 959092 1012344 1071840 1137589 1209684 1288115 1372768
62693A372768R0727R6532J01847J06375J09448J09978J07184J01193R2446Q0714
$$ 1372768 1463495 1560027 1661874 1768249 1877697 1987675 2094859 2196052 2288498 2369212
62683B369212O5392M6780K6325N415j5448l5975n5221p1875q5169r5211j02502
$$ 2369212 2434604 2481384 2507709 2513124 2497676 2461701 2406480 2334605 2249436 2154225 2051723
62672B051723j07324j09472j08648j05276j00687r6030r1131q5025p7626p0170
$$ 2051723 1944399 1834927 1726279 1621003 1520316 1424286 1333155 1248130 1170504 1100334
62662A100334o3787n8311n2970m7696m3047l9122l5286l1135k7194k4257k2249
$$ 1100334 1036547 978236 925266 877570 834523 795401 760115 728980 701786 677529 655280
62651F55280k0218j7573j4989j3600j3483j3493j2709j1422j0379r624q705p637
$$ 655280 635062 617489 602500 588900 575417 561924 549215 537793 527414 517790 509085 501448
62639E01448o888o529o127n440m601l532j876K31J880K189J156n01k010k952l304
$$ 501448 494560 488031 481904 476464 471863 468331 466455 466686 468566 470755 471911 471410 469400 466448 463144
62624D63144l314l219l032k719k452k379k216j529m46L20L36O7L60J568L250M661
$$ 463144 459830 456611 453579 450860 448408 446029 443813 442284 441838 442158 442494 442561 442921 444489 447739 452400
62608D52400N463N958O662P580Q181Q152P923Q212R220J0596J2003J3473J5361
$$ 452400 457863 463821 470483 478063 486244 494396 502319 510531 519751 530347 542350 555823 571184
62595E71184J8118K1855K5933K9380L2015L4759L8390M2471M5931M8230M9242
$$ 571184 589302 611157 637090 666470 698485 733244 771634 814105 860036 908266 957508
62584I57508M8482M5378M0171L3724K6490J8338R362J42q767j6985k4052k9713
$$ 957508 1005990 1051368 1091539 1125263 1151753 1170091 1179453 1179595 1170828 1153843 1129791 1100078
62572A100078l4371l8467m1506m2581m1938m0978m0504l9750l7598l4111l0371
$$ 1100078 1065707 1027240 985734 943153 901215 860237 819733 779983 742385 708274 677903
62561F77903k7327k5140k3350k1303j8711j5913j3381j1096q766o583n172m830
$$ 677903 650576 625436 602086 580783 562072 546159 532778 521682 512916 506333 501161 496331
62549D96331n280o065o640o338m983l383k482k070j246M9J008J447K065K998L434
$$ 496331 491051 484986 478346 472008 467025 463642 461160 459090 457844 457893 458901 460348 462413 465411 468845
62534D68845L109K958L574M123L711K845K611L101L752M610O130Q070R676J0878
$$ 468845 471954 474912 478486 482609 486320 489165 491776 494877 498629 503239 509369 517439 527115 537993
62520E37993J2384J4571J7072J9604K2525K6320L0900L5612L9781M3251M6516
$$ 537993 550377 564948 582020 601624 624149 650469 681369 716981 756762 800013 846529
62509H46529N0232N4455N8501O1565O3251O3363O1615N7803N1979M4235L4672
$$ 846529 896761 951216 1009717 1071282 1134533 1197896 1259511 1317314 1369293 1413528 1448200
62498A448200K3752J2360J219r391j9162k7467l3855l8387m1025m1203l8602l4095
$$ 1448200 1471952 1484312 1485531 1476140 1456978 1429511 1395656 1357269 1316244 1275041 1236439 1202344
62486A202344k9164k4425j9303j3238o650m86M864R804J4832J9905K4543K8146
$$ 1202344 1173180 1148755 1129452 1116214 1109564 1109078 1113942 1123746 1138578 1158483 1183026 1211172
62474A211172K9919K8712K3760J5913P610R81l972q992j5635k4073l3345m1964
$$ 1211172 1241091 1269803 1293563 1309476 1317086 1318067 1314095 1305103 1289468 1265395 1232050 1190086
62462A190086m8478n2227n3773n4148n3794n2673n1001m9036m6318m2082l6593
$$ 1190086 1141608 1089381 1035608 981460 927666 874993 823992 774956 728638 686556 649963
62451F49963l1168k6767k3273k0182j7177j3876j0088o592m722m753n414n287
$$ 649963 618795 592028 568755 548573 531396 517520 507432 500840 496118 491365 485951 480664
62439D80664l977j757Q54K957L712L516L681M541M902L897K226P80p03k654m374
$$ 480664 476687 474930 475784 478741 482453 485969 489650 494191 499093 502990 505216 505996 505293 502639 498265
62424D98265n032n151n788o829p310p078o832o726o201n181m408m347m566m434
$$ 498265 493233 488082 482294 475465 468155 461077 454245 447519 441318 436137 431729 427382 422816 418382
62410D18382l770k791j827j178q99q50j102j954l190l867l328j993p23J57N80
$$ 418382 414612 411821 409994 408816 407917 407067 405965 404011 400821 396954 393626 391633 390910 391067 391647
62395C91647L11m39n02J014L319M703M521L601K911K735L021L570L877L619L350
$$ 391647 391958 391519 391017 392031 395350 400053 404574 408175 411086 413821 416842 420412 424289 427908 431258
62380D31258L945N317O491O934P014P071O928O555O492P117Q058Q717R032R451
$$ 431258 435203 440520 447011 453945 460959 468030 474958 481513 488005 495122 503180 511897 520929 530380
62366E30380J0341J1642J2990J4123J5267J6952J9414K2401K5846L0182L5592
$$ 530380 540721 552363 565353 579476 594743 611695 631109 653510 679356 709538 745130
62355G45130M1379M6730N1796N7259O3045O8143P1640P3137P2193O8186O1008
$$ 745130 786509 833239 885035 942294 1005339 1073482 1145122 1218259 1290452 1358638 1419646
62344A419646N1371M0281K8541J6928O270k965j0933j8160k5145l2119l8922m5022
$$ 1419646 1471017 1511298 1539839 1556767 1563037 1560072 1549139 1530979 1505834 1473715 1434793 1389771
62332A389771m9807n2855n3980n3319n1509m9310m6779m3298l8744l4155l0696
$$ 1389771 1339964 1287109 1233129 1179810 1128301 1078991 1032212 988914 950170 916015 885319
62321H85319k8427k6715k5376k4610k4157k3412k2369k1611k1301k0922k0053
$$ 885319 856892 830177 804801 780191 756034 732622 710253 688642 667341 646419 626366
62310F26366j8847j7620j6448j5339j4262j3003j1362r594q221p361o602n550
$$ 626366 607519 589899 573451 558112 543850 530847 519485 509891 501670 494309 487707 482157
62298D82157m206k875j944j676j859j833j180k70K45L07M25R55J763K486K875
$$ 482157 477951 475076 473132 471456 469597 467764 466584 466314 466559 466866 467291 468246 470009 472495 475370
62283D75370K945L034L410L761L496K724K285K491K625K221K001K714L734L907
$$ 475370 478315 481349 484759 488520 492016 494740 497025 499516 502141 504362 506363 509077 512811 516718
62269E16718L332L236M288O083Q049R972J1700J3245J5193J8139K1863K5718K9624
$$ 516718 520050 523286 527574 533657 541706 551678 563378 576623 591816 609955 631818 657536 687160
62256F87160L3935L8620M3552M9232N6141O3441O9512P3702P6426P7474P5481
$$ 687160 721095 759715 803267 852499 908640 972081 1041593 1115295 1191721 1269195 1344676
62245A344676O9449N9867M7953L4779K1389Q929j895j1009j8678k5653l3343m2627
$$ 1344676 1414125 1473992 1521945 1556724 1578113 1587042 1585147 1574138 1555460 1529807 1496464 1453837
62233A453837n2286n9778o3943o5905o6972o6838o4608o0563n5822n0891m5510
$$ 1453837 1401551 1341773 1277830 1211925 1144953 1078115 1013507 952944 897122 846231 800721
62222H00721l9681l4078k9424k5860k2927k0019j7037j4541j3030j2220j1439
$$ 800721 761040 726962 697538 671678 648751 628732 611695 597154 584124 571904 560465
62211E60465j0548r856r295q478p529p024p003o813o101n113l966k511j068k99
$$ 560465 549917 540061 530766 522288 514759 507735 500732 493919 487818 482705 478739 476228 475160 474861
62197D74861j52J96R82J523J604K097L615N449O597P068P478Q039Q707R691J1025
$$ 474861 474709 474905 475887 477410 479014 481111 484726 490175 496772 503840 511318 519357 528064 537755 548780
62182E48780J2125J2418J2087J1699J1462J1281J0894R708P183M016K109K596
$$ 548780 560905 573323 585410 597109 608571 619852 630746 640454 647637 651653 653762 656358
62170F56358M473O066P234R217J2714J7249K2264K7813L3948M0206M6035N1218
$$ 656358 660831 666897 674131 683348 696062 713311 735575 763388 797336 837542 883577 934795
62158I34795N5591N8605N9380N7128N1597M3334L3501K3372J3898N649j179o817
$$ 934795 990386 1048991 1108371 1165499 1217096 1260430 1293931 1317303 1331201 1336850 1335671 1328854
62146A328854j1753j6426k1213k6459l2001l6785l9522l9848l8327l5419l1209
$$ 1328854 1317101 1300675 1279462 1253003 1221002 1184217 1144695 1104847 1066520 1031101 999892
62135I99892k6191k1347j7066j2765q160m090j478n5J159K475L389L542L199K862
$$ 999892 973701 952354 935288 922523 914363 910273 908795 908740 909899 912374 915763 919305 922504 925366
62121I25366K875L335M041M605M802M749M681M860N547O583O881N032P37m766
$$ 925366 928241 931576 935617 940222 945024 949773 954454 959314 964861 971444 978325 983357 984094 979328
62107I79328r836j3462j5122j4529j2044q785n842l785l028l858n592o533n482
$$ 979328 969492 956030 940908 926379 914335 905550 899708 895923 892895 889037 883445 876912 871430
62094H71430k909p4K391M510O148P083P588Q241R192J0148J0880J1341J1470J1311
$$ 871430 868521 868447 870838 875348 881496 888579 896167 904408 913600 923748 934628 945969 957439 968750
62080I68750J1295J2106J4264J7764K1805K5014K6570K7122K7915K9010K9281
$$ 968750 980045 992151 1006415 1024179 1045984 1070998 1097568 1124690 1152605 1181615 1210896
62069A210896K8249K6715K5239K3282K0561J8090J6871J6586J6724J8004K1338
$$ 1210896 1239145 1265860 1291099 1314381 1334942 1353032 1369903 1386489 1403213 1421217 1442555
62058A442555K5964L0003L2475L3465L2750K9778K4986J9770J4865R868M502o99
$$ 1442555 1468519 1498522 1530997 1564462 1597212 1626990 1651976 1671746 1686611 1696479 1700981 1700282
62046A700282n434j0412j6623k4237l2520m0416m7139n2561n7086o0825o3117
$$ 1700282 1694848 1684436 1667813 1643576 1611056 1570640 1523501 1470940 1413854 1353029 1289912
62035A289912o3402o2184o0459n8311n5051n0658m6155m2250l8515l4253k9635
$$ 1289912 1226510 1164326 1103867 1045556 990505 939847 893692 851442 812927 778674 749039
62024G49039k5436k2113j9527j7377j5517j3969j2785j1942j1341j0986j0981
$$ 749039 723603 701490 681963 664586 649069 635100 622315 610373 599032 588046 577065
62013E77065j1247j1393j1098j0375r360q057o520m983l559k100o24N26J240J960
$$ 577065 565818 554425 543327 532952 523592 515535 509015 504032 500473 498373 497749 498275 499515 501475
61999E01475L104M531N891P049P737P414N988M174K616J159l97j593k141k796
$$ 501475 504579 509110 515001 522050 529787 537201 543189 547363 549979 551138 550741 549148 547007 544211
61985E44211m360o270p397p838q665r995j0678j0057q882q033p430o650n784n139
$$ 544211 539851 533581 526184 518346 509681 499686 489008 478951 470069 462036 454606 447956 442172 437033
61971D37033m650m127l559k914k000q54J68Q14J126J137R03Q21J308K044K177
$$ 437033 432383 428256 424697 421783 419783 418929 419097 419911 421037 422174 423077 423898 425206 427250 429427
61956D29427J488P89Q85J703K641L277L459L214K973L414M732O309P432Q071Q683
$$ 429427 430915 431704 432589 434292 436933 440210 443669 446883 449856 453270 458002 464311 471743 479814 488497
61941D88497R538J0572J1697J2998J4585J6383J8103J9410K0216K0629K0625K0002
$$ 488497 498035 508607 520304 533302 547887 564270 582373 601783 621999 642628 663253 683255
61929F83255J8845J7684J6839J5986J4715J3112J1278Q734N098J088k137m473
$$ 683255 702100 719784 736623 752609 767324 780436 791714 800448 805546 806634 804497 800024
61917H00024o810r390j1267j1707j1138j0222q762o282l062J74L284O708J0482
$$ 800024 793214 783824 772557 760850 749712 739490 730728 724446 721384 721558 724842 731550 742032
61904G42032J3917J6316J7653J8306J8306J7118J4244J0017N568J837j315m720
$$ 742032 755949 772265 789918 808224 826530 843648 857892 867909 873477 875314 873999 869279
61892H69279q703j2600j5461j7031j7876j8735j9714k0114j9101j6705j3983j2073
$$ 869279 860576 847976 832515 815484 797608 778873 759159 739045 719944 703239 689256 677183
61880F77183j1220j0913j0700j0510j0346j0064r486q559p412o387n748n316m620
$$ 677183 665963 655050 644350 633840 623494 613430 603944 595385 587973 581586 575838 570522 565902
61867E65902l550k437j420l01P79J262J251J843L684N885P296Q244R875J2261
$$ 565902 562352 559915 558495 558194 558973 560235 561486 563329 567013 572898 580194 588438 598313 610574
61853F10574J4401J5989J7813K0385K3291K6141K9002L1657L3439L4214L4618
$$ 610574 624975 640964 658777 679162 702453 728594 757596 789253 822692 856906 891524
61842H91524L4868L4224L2122K8968K5222K0503J4340P263M49n410j0261j4055
$$ 891524 926392 960616 992738 1021706 1046928 1067431 1081771 1089034 1089483 1084073 1073812 1059757
61830A059757j6496j7268j6208j3373r198m365O54N729J0658J4968J8279K0472
$$ 1059757 1043261 1025993 1009785 996412 987214 982849 983503 989232 999890 1014858 1033137 1053609
61818A053609K1297K0220J6916J1654N081k078r129j5656k1769k7655l2795l6137
$$ 1053609 1074906 1095126 1112042 1123696 1128777 1126699 1117570 1101914 1080145 1052490 1019695 983558
61806I83558l7237l6802l5886l4888l3515l1337k8296k4985k2458k1211k0422
$$ 983558 946321 909519 873633 838745 805230 773893 745597 720612 698154 676943 656521
61795F56521j8759j6045j3418j1752j0612r171p416n979n206m959m985n105n161
$$ 656521 637762 621717 608299 596547 585935 576764 569348 563369 558163 553204 548219 543114 537953
61782E37953n105m906m359l334k261j870k275k760k654j994j246q40j069j888
$$ 537953 532848 527942 523583 520249 517988 516118 513843 511083 508429 506435 505189 504349 503280 501392
61768E01392k653k638j953j397j274j046l50M62J030J491J831J648R81O58J170
$$ 501392 498739 496101 494148 492751 491477 490431 490081 490543 491573 493064 494895 496543 497524 498182 499352
61753D99352J868J955J623J505J601J466J041M98k68j211j674j186l96k71o32
$$ 499352 501220 503175 504798 506303 507904 509370 510411 510909 510641 509430 507756 506570 506174 505903 505271
61738E05271m57N06J449J886K334L303M394M895M696M214L777L467L344L444L666
$$ 505271 504814 505320 506769 508655 510989 514292 518686 523581 528277 532491 536268 539735 543079 546523 550189
61723E50189L891M136M446M689M656M330L938L641L261K458J283K92j54m95j431
$$ 550189 554080 558216 562662 567351 572007 576337 580275 583916 587177 589635 590918 591210 591056 590561 589130
61708E89130k850l838l908l641l823m476n082n351n271m795m004l310l020k872
$$ 589130 586280 582442 578534 574893 571070 566594 561512 556161 550890 546095 542091 538781 535761 532889
61694E32889k495k147k355k911k894j929q64q49k027l382l814l123k043j457j604
$$ 532889 530394 528247 525892 522981 520087 518158 517294 516445 514418 511036 507222 504099 502056 500599 498995
61679D98995j939j768r85k32k40j073k044k391k013j429j066q49n80l83n46j059
$$ 498995 497056 495288 494303 494071 493831 492758 490714 488323 486310 484881 483815 482966 482386 482003 481457 480398
61663D80398j688k286k792l008k782k268j672q58L51J544J995J528O85o4o81j097
$$ 480398 478710 476424 473632 470624 467842 465574 463902 463044 463395 464939 466934 468462 469147 469083 468402 467305
61647D67305r99m01R7L7k62j06P47J900K771L046K826K492K247J813Q61m16j457
$$ 467305 466306 465905 466002 466039 465777 465671 466418 468318 471089 474135 476961 479453 481700 483513 484374 483958 482501
61630D82501k073k541k985l180l078k985l079l240l386l522l361k549j390o83
$$ 482501 480428 477887 474902 471722 468644 465659 462580 459340 455954 452432 449071 446522 445132 444449
61616D44449o42o43l21j45m64p87o08l67q62k130l543m680n489n885n846n649
$$ 444449 443807 443164 442843 442698 442234 441447 440839 440472 439610 437480 433937 429257 423768 417883 412037 406388
61600D06388n514n149m242l173k660k771k896k663k405k549k993l241k971k372
$$ 406388 400874 395725 391483 388310 385650 382879 379983 377320 374915 372366 369373 366132 363161 360789
61586C60789j989k242k980l620l747l433k905k185j301n80m41r11j610k142k407
$$ 360789 358800 356558 353578 349958 346211 342778 339873 337688 336387 335807 335366 334455 332845 330703 328296
61571C28296k549k640k453j703n61K96M08R2p7q8k74n50m75q3J22o4l72o70j060
$$ 328296 325747 323107 320654 318951 318390 318686 319094 319186 319109 319021 318747 318197 317722 317639 317761 317697 317325 316655 315595
61552C15595j246o74N03J346J349R98Q08O02J37j98N4P27J355J738J867J697J414
$$ 315595 314349 313675 314178 315524 316873 317871 318679 319281 319418 319220 319274 320001 321356 323094 324961 326658 328072
61535C28072J383J599J674J630J929K458K316J105l50j131j313j407j438j354
$$ 328072 329455 331054 332728 334358 336287 338745 341061 342166 341816 340685 339372 337965 336527 335173
61521C35173j518k095k557k566k648l178l415k549j127l45k88o8N61Q27K53o13
$$ 335173 333655 331560 329003 326437 323789 320611 317196 314647 313520 313175 312887 312819 313380 314207 314460 313847
61505C13847r62n64K06O78L40n84j229j196j184j939k991l262k555j653j089p14
$$ 313847 312885 312321 312527 313205 313545 312961 311732 310536 309352 307413 304422 301160 298605 296952 295863 295149
61489B95149l67k00k86m88o81o37M9J376K521K661J923J009K28l69l86M52J539
$$ 295149 294782 294582 294296 293808 293127 292490 292539 293915 296436 299097 301020 302029 302257 301888 301502 301954 303493
61472C03493K007J900J845J837J428Q57P92R77M20q50j509q20L07P09M83L53M23
$$ 303493 305500 307400 309245 311082 312510 313367 314159 315136 315556 314706 313197 312377 312684 313393 313876 314229 314652
61455C14652L47K18L95P42P42L17n6l4J57R0l17o59m54L12J101J373J125P35N12
$$ 314652 314999 315217 315612 316354 317096 317413 317357 317323 317480 317570 317253 316594 316140 316452 317553 318926 320051 320786 321298
61436C21298O18J229K310L319L629L249K759K527K328J851J194P52Q23J375K001
$$ 321298 321916 323145 325455 328774 332403 335652 338411 340938 343266 345117 346311 347063 347886 349261 351262
61421C51262K181J773J242J157J573K073K329K329K159J892J642J469J228O93
$$ 351262 353443 355216 356458 357615 359188 361261 363590 365919 368078 369970 371612 373081 374309 375002
61407C75002j56j085j760j945j742j632k055k903l635l967m007l771l050j917
$$ 375002 374846 373761 372001 370056 368314 366682 364627 361724 358089 354122 350115 346344 343294 341377
61393C41377q25m0N14P68M81q2k44Q6K47QRN72R78O38R2P8L92N37P46J367J892
$$ 341377 340552 340512 341026 341794 342275 342193 341949 342035 342282 342290 342299 342871 343849 344487 344579 344657 345049 345586 346332 347699 349591
61372C49591J652J038R33J386J734J739J564J095K87j60M30J483J792J150M98
$$ 349591 351243 352281 353214 354600 356334 358073 359637 360732 361019 360859 361289 362772 364564 365714 366212
61357C66212N73J350K539L712M210L856L592M496O387Q284R839J1311J2509J2937
$$ 366212 366785 368135 370674 374386 378596 382452 386044 390540 396927 405211 415050 426361 438870 451807
61343D51807J2673J1939J0221P201M295L547M930O292O234N515N185M885L750
$$ 451807 464480 476419 486640 493841 498136 501683 506613 512905 519139 524654 529839 534724 538474
61330E38474J879P2j165j773k005k498l729n110n429m499l510l384l662l462k711
$$ 538474 540353 540425 539260 537487 535482 532984 529255 524145 518716 514217 510707 507323 503661 500199 497488
61315D97488j884j182n63p2L38R66K022L338M634N714O471P038P875R279J0931
$$ 497488 495604 494422 493859 493787 494125 495091 497113 500451 505085 510799 517270 524308 532183 541462 552393
61300E52393J2307J3223J3492J2525J0067O941M097J343j997n445p600p955p387
$$ 552393 564700 577923 591415 603940 614007 620948 625045 626388 624391 618946 611346 603391 596004
61287E96004o900o852p269p843p773o691n543n401n697n046l581k680k498j556
$$ 596004 589104 582252 574983 567140 559367 552676 547133 541732 536035 530989 527408 524728 522230 520674
61273E20674P75L167M303M472M503M583M782N433O265O329N412M421L867L304
$$ 520674 521449 524616 528919 533391 537894 542477 547259 552692 558957 565286 570698 575119 578986 582290
61259E82290K829L653O294R511J1932J3540J4669J4780J3437J1403R627P887N566
$$ 582290 585119 588772 595066 604577 616509 630049 644718 659498 672935 684338 693965 701852 707418
61246G07418L008J023l14j452k449l149l755m465n046n385n774o124n668m230
$$ 707418 710426 711449 711135 709683 707234 704085 700330 695865 690819 685434 679660 673536 667868 663638
61232F63638k967k985l873m443m353m011l408k029J81K496M066M537M169L611
$$ 663638 660671 657686 653813 649370 645017 641006 637598 635569 635750 638246 642312 646849 651018 654629
61218F54629L347L304L280L532M294N006M928M376M305M724M731M129L583L095
$$ 654629 657976 661280 664560 668092 672386 677392 682320 686696 691001 695725 700456 704585 708168 711263
61204G11263J877J36o92k2J078J861L000M923O721P838R338J2126J5289J7550
$$ 711263 713140 713276 712584 712562 713640 715501 718501 723424 730145 737983 747321 759447 774736 792286
61190G92286J9261K1461K3888K5277K4929K2818J9018J4251J0251Q276P773P477
$$ 792286 811547 833008 856896 882173 907102 929920 948938 963189 973440 981716 989489 996966
61178I96966P070O800O323N177L661K203N25j595l561m995o605q916j1029j1957
$$ 996966 1004036 1010836 1017159 1022336 1025997 1028200 1028725 1027130 1023569 1018574 1011969 1003053 992024 980067
61164I80067j2279j3103j4212j4780j5179j6411j8163j9075j8764j8162j7912
$$ 980067 967788 954685 940473 925693 910514 894103 875940 856865 838101 819939 802027
61153H02027j7656j6916j5604j3733j1458r265p409n431k889k65J579K242J580
$$ 802027 784371 767455 751851 738118 726660 717395 709986 704555 701666 701401 702980 705222 706802
61140G06802o06l881o919q810r857j0427j0007q372o562n426m224k047L10J510
$$ 706802 706196 702315 695396 686586 676729 666302 656295 647923 641361 635935 631711 629664 629974 631484
61126F31484J962L342O149R350J2099J4421J6398J7976J9494K1384K3494K5533
$$ 631484 633446 636788 642937 652287 664386 678807 695205 713181 732675 754059 777553 803086
61114H03086K7650K9809L1231L1539L1626L2399L3354L3608L3412L3306L2633
$$ 803086 830736 860545 891776 923315 954941 987340 1020694 1054302 1087714 1121020 1153653
61103A153653L0500K7548K5154K3341K0997J7714J3945R651M269k138q833j5223
$$ 1153653 1184153 1211701 1236855 1260196 1281193 1298907 1312852 1322503 1326772 1324634 1315801 1300578
61091A300578k0809k4956k7753l0227l2746l4152l3842l3312l4027l4950l4244
$$ 1300578 1279769 1254813 1227060 1196833 1164087 1129935 1096093 1062781 1028754 993804 959560
61080I59560l2327l0968l0123k8170k4965k2156k0477j8909j6728j4451j2565
$$ 959560 927233 896265 866142 837972 813007 790851 770374 751465 734737 720286 707721
61069G07721j0950r683q959q214o795n220m370l772k305k12J255J766J945J998
$$ 707721 696771 687088 678129 669915 663120 657900 653530 649758 647453 647241 648496 650262 652207 654205
61055F54205J926K471M119N809O475P034Q838J1103J2185J2567J3949J6139J7554
$$ 654205 656131 658602 662721 668530 675005 682039 690877 701980 714165 726732 740681 756820 774374
61042G74374J8377K0224K3035K5157K6366K7971K9950L0888L0783L1100L2002
$$ 774374 792751 812975 836010 861167 887533 915504 945454 976342 1007125 1038225 1070227
61031A070227L2394L2622L4130L6443L7621L7795L9023M1473M3129M3428M3732
$$ 1070227 1102621 1135243 1169373 1205816 1243437 1281232 1320255 1361728 1404857 1448285 1492017
61020A492017M3945M2490M0106L9865M2772M7212N3120O2289P3857Q4106R2001
$$ 1492017 1535962 1578452 1618558 1658423 1701195 1748407 1801527 1863816 1937673 2021779 2113780
61009B113780J00415J11092J23592J40443J67240K05919K54180L13332L88863
$$ 2113780 2214195 2325287 2448879 2589322 2756562 2962481 3216661 3529993 3918856
61000C918856M80693N83046O99437Q47238J040562J282990J587524J975281K407223
$$ 3918856 4399549 4982595 5682032 6529270 7569832 8852822 10440346 12415627 14822850
60991A4822850K713949K652747K099576J196397K79525l54238o07566n36305k18417
$$ 14822850 17536799 20189546 22289122 23485519 23765044 23410806 22803240 22266935 22048518
60982B2048518K67589P54036R69304O96486l7734r58665j739555k201424k349767
$$ 22048518 22316107 23070143 24039447 24735933 24698199 23739534 21999979 19798555 17448788
60973A7448788k279261k083183j830341j571249j335071j128082r46976p91108
$$ 17448788 15169527 13086344 11256003 9684754 8349683 7221601 6274625 5483517
60965E483517o60174n49388m54061l74587l12265k64091k25508j94823j71386
$$ 5483517 4823343 4273955 3819894 3445307 3133042 2868951 2643443 2448620 2277234
60956B277234j52547j35802j21416j09960r9601q8409p7143o7214n8003m8769
$$ 2277234 2124687 1988885 1867469 1757509 1657908 1569499 1492356 1425142 1367139 1318370
60946A318370m1228l7626l7542l8728l9815m0326l9495l7130l4544l2907l1630
$$ 1318370 1277142 1239516 1201974 1163246 1123431 1083105 1043610 1006480 971936 939029 907399
60935I07399k9749k7650k6016k4429k2446k0821k0132j9451j7857j6090j5192
$$ 907399 877650 850000 823984 799555 777109 756288 736156 716705 698848 682758 667566
60924F67566j4639j3405j1831j0903j0459r652q458p411o546n799n618o064o086
$$ 667566 652927 639522 627691 616788 606329 596677 588219 580808 574262 568463 562845 556781 550695
60911E50695m938l440k668k235j160L32J292J549J527J136K10m86l2J269K326
$$ 550695 545757 542317 539649 537414 536254 536586 537878 539427 540954 542090 542300 541814 541782 543051 545377
60896E45377K643K269J030j023k913l668l620l701l993l996l788l728l535k916
$$ 545377 548020 550289 551319 550296 547383 543715 540095 536394 532401 528405 524617 520889 517354 514438
60882E14438k648l705n512o438n911m857m165l913m074m743n454n354m331l131
$$ 514438 511790 508085 502573 496135 490224 485367 481202 477289 473215 468472 463018 457664 453333 450202
60868D50202k237j458o52j2N49J410K530L419M010M708N599O321O905P774Q722
$$ 450202 447965 446507 445855 445843 446392 447802 450332 453751 457761 462469 468068 474389 481294 489068 497790
60853D97790Q776P545N931M979M662M378M120M403N292O097O101N234L924K566
$$ 497790 506566 514111 520042 525021 529683 534061 538181 542584 547876 553973 560074 565308 569232 571798
60839E71798J185l70k031l402m190m561m865n176n329n322n267n037m365l372
$$ 571798 572983 572613 570582 567180 562990 558429 553564 548388 543059 537737 532470 527433 523068 519696
60825E19696k599k414k666l009l270l402l378l325l469l847m209m375m403m370
$$ 519696 517097 514683 512017 509008 505738 502336 498958 495633 492164 488317 484108 479733 475330 470960
60811D70960m179l763l276k913k728k654k539k083j085J51J015J369J722K324
$$ 470960 466781 463018 459742 456829 454101 451447 448908 446825 445740 445891 446906 448275 449997 452321
60797D52321K618K159J630K102L394M169L827L315L614M337M533M235M248M797
$$ 452321 454939 457098 458728 460830 464224 468393 472220 475535 479149 483486 488019 492254 496502 501299
60783E01299N351N644O027O715P448Q037Q549Q913Q928Q793Q961R379R523R263
$$ 501299 506650 512294 518321 525036 532484 540521 549070 557983 566911 575704 584665 594044 603567 612830
60769F12830R038R026Q978Q992R623J0849J1818J2066J2126J2424J2443J1704
$$ 612830 621868 630894 639872 648864 658487 669336 681154 693220 705346 717770 730213 741917
60757G41917J0838J0814J1625J2454J2737J2404J1634J0973J1140J1989J2290
$$ 741917 752755 763569 775194 787648 800385 812789 824423 835396 846536 858525 870815
60746H70815J1270R733Q831Q487P965P248O601N409K851n17l249m918o246p511
$$ 870815 882085 891818 900649 909136 917101 924349 930950 936359 939210 938693 935444 930526 924280 916769
60732I16769q243q521r158j0345j1395j2059j2874j3873j4257j3795j3340j3425
$$ 916769 908526 900005 890847 880502 869107 857048 844174 830301 816044 802249 788909 775484
60720G75484j3426j2781j2041j1933j2258j2336j1915j1054r833q720q432q889
$$ 775484 762058 749277 737236 725303 713045 700709 688794 677740 667907 659187 650755 641866
60708F41866r056q410p729p792q143p985p573p614p860p460o500o099o865q059
$$ 641866 632810 624400 616671 608879 600736 592751 585178 577564 569704 562244 555744 549645 542780 534721
60694E34721q583q186p491p107o966o489n416m351m129m754n358n344m956m570
$$ 534721 526138 517952 510461 503354 496388 489899 484483 480132 476003 471249 465891 460547 455591 451021
60680D51021m028l130k146j461j048p98p92r17p07j09J32m54j156r19J87J159
$$ 451021 446993 443863 441717 440256 439208 438410 437618 436701 435994 435885 436017 435563 434407 433488 433675 434834
60664D34834J446J285Q22j73j578k637k769k178j455r56p08n74k69M60J481K337
$$ 434834 436280 437565 438387 438214 436636 433999 431230 429052 427597 426641 425933 425359 425090 425550 427031 429368
60648D29368K818L188L687M131M185L901L605L419L126K464J359o7j435k051j383
$$ 429368 432186 435374 439061 443192 447377 451278 454883 458302 461428 463892 465251 465184 463749 461698 460315
60633D60315K19J553J718J064O39Q34J067P32j01j085k040k785l048k835k505
$$ 460315 460534 462087 463805 464869 465508 466342 467409 468141 468040 466955 464915 462130 459082 456247 453742
60618D53742k206j735j216j220j814k188j860j559k054k821k839k176j662j353
$$ 453742 451536 449801 448585 447365 445551 443363 441503 439944 437890 435069 432230 430054 428392 427039
60604D27039o59J62O6j008j782j449q06r59j818k402k114j148j11M77O43R42J540
$$ 427039 426380 426542 426608 425600 423818 422369 421563 420604 418786 416384 414270 413122 413011 413488 414131 415073 416613
60587D16613J650P15k80M4J103Q54j054k420j549L80J257Q89M83M07J75Q2J011
$$ 416613 418263 418978 418698 418742 419845 420699 419645 417225 415676 416056 417313 418202 418685 419092 419267 419349 420360
60570D20360K754M067M543N139O633Q563J0090J1035J1731J2468J3326J4050J3969
$$ 420360 423114 427181 431724 436863 443496 452059 462149 473184 484915 497383 510709 524759 538728
60557E38728J2449R568N985K274j221m068n944p108p993q368p591n764l941k831
$$ 538728 551177 560745 566730 569004 567783 563715 557771 550663 542670 534302 526711 520947 517006 514175
60543E14175j922l62J785L697M983O167P954J0348J2625J4056J4448J4003J2850
$$ 514175 512253 511891 513676 517373 522356 528523 536477 546825 559450 573506 587954 601957 614807
60530F14807J0871Q026M608J132j957m349n839o331n836m560l008j923j738k127
$$ 614807 625678 633704 638312 639444 637487 633138 627299 620968 615132 610572 607564 605641 603903 601776
60516F01776k310j854r66q4M24L35k29o25k86M54P48N12O19J591K844L727M639
$$ 601776 599466 597612 596646 596562 596986 597321 597092 596467 596181 596635 597383 597895 598514 600105 602949 606676 611315
60499F11315O445R320J2849J6890K1533K6505L1334L6049M0960M5753M9438N1281
$$ 611315 617760 627080 639929 656819 678352 704857 736191 772240 813200 858953 908391 959672
60487I59672N1185M8975M3928L5438K3867J0356l984j8268l1394m1961m9036n2792
$$ 959672 1010857 1059832 1103760 1139198 1163065 1173421 1169437 1151169 1119775 1077814 1028778 975986
60475I75986n4057n3271n0369m5717m0502l5793l1632k7644k4042k1302j9147
$$ 975986 921929 868658 818289 772572 732070 696277 664645 637001 612959 591657 572510
60464E72510j6846j4479j2909j2261j1493r873q006o823o304n887n482n276n034
$$ 572510 555664 541185 528276 516015 504522 494649 486643 479820 473516 467629 462147 456871 451837
60451D51837m368l431k706k326k133k153k447k718k639k314j976j545r93q32j498
$$ 451837 447469 444038 441332 439006 436873 434720 432273 429555 426916 424602 422626 421081 420088 419256 417758
60436D17758k441k572j592k84N28O99M23j96r62j451j396j020p53p37p46n05n1
$$ 417758 415317 412745 411153 410869 411397 412096 412519 412323 411361 409910 408514 407494 406741 406004 405258 404753 404702
60419D04702K97L41L66Q21J620K094J817J192R16J090J208R20M32J72L22P00R90
$$ 404702 404999 405340 405706 406527 408147 410241 412058 413250 414166 415256 416464 417384 417816 417988 418310 419010 420000
60402D20000J034R02P11M96L37M69R67J465J551J350J292J391J288J036J147J694
$$ 420000 421034 421936 422647 423143 423480 423949 424916 426381 427932 429282 430574 431965 433253 434289 435436 437130
60386D37130J997J661J289J687K693L352L060K176J541J609K030J951R77k44o36
$$ 437130 439127 440788 442077 443764 446457 449809 452869 455045 456586 458195 460225 462176 463153 462909 462273
60371D62273J45J450K526L120L223K823K051J135Q6j068j778j383j23R76J382
$$ 462273 462418 463868 466394 469514 472737 475560 477611 478746 478832 477764 475986 474603 474480 475456 476838
60356D76838J485J603J439R27P05J230K084K617K728K638K547K910M234O230P813
$$ 476838 478323 479926 481365 482292 482997 484227 486311 488928 491656 494294 496841 499751 503985 510215 518028
60341E18028Q449Q675Q895Q598P349N628L938J946o95l406n447o880p932q217
$$ 518028 526477 535152 544047 552645 559994 565622 569560 571506 570811 567405 561958 555078 547146 538929
60327E38929p473o405n809n425m648l704l205l063k878k822l095l121k391j530
$$ 538929 531456 525051 519242 513817 509169 505465 502260 499197 496319 493497 490402 487281 484890 483360
60313D83360j349j350m60J170K399K876L266L976M939O406Q683J1262J3548J6182
$$ 483360 482011 480661 480201 481371 483770 486646 489912 493888 498827 505233 513916 525178 538726 554908
60299E54908K0018K3938K5444K3705K0350J6748J2208N766j631p937j2003j3805
$$ 554908 574926 598864 624308 648013 668363 685111 697319 703085 701454 693517 681514 667709
60287F67709j3510j1515q933o985n985n486n333n846p108q581r599r919r749r319
$$ 667709 654199 642684 633751 626766 620781 615295 609962 604116 597008 588427 578828 568909 559160 549841
60273E49841q630p694o857o591o876p176p154o970o634n756m415l514l558l711
$$ 549841 541211 533517 526660 520069 513193 506017 498863 491893 485259 479503 475088 471574 468016 464305
60259D64305k947j628q82q72q75p86j204j977j963o24J144K191K263J765J143
$$ 464305 461358 459730 458848 457976 457101 456315 455111 453134 451171 450547 451691 453882 456145 457910 459053
60244D59053P99R23J111Q24K99L04Q25Q92J1j053j308p00J59Q48J312J653K074
$$ 459053 459852 460775 461886 462710 463009 463313 464138 465030 465041 463988 462680 461980 462139 462987 464299 465952 468026
60227D68026K714L341L537L315L144L277L464L374K980K548K530L204M134M394
$$ 468026 470740 474081 477618 480933 484077 487354 490818 494192 497172 499720 502250 505454 509588 513982
60213E13982L853L726N015O916P849P605P309P444P376O892O716P074P064O045
$$ 513982 517835 521561 526576 533492 541341 548946 556255 563699 571075 577967 584683 591757 598821 604866
60199F04866M719M102M252M511M392L775K818J993J661J431O39m88r96o87n01
$$ 604866 609585 613687 617939 622450 626842 630617 633435 635428 637089 638520 639159 638671 637675 636988 636487
60184F36487j092k090l040m049n011n277m783m566n332o290o207n079l948l496
$$ 636487 635395 633305 630265 626216 621205 615928 611145 606579 601247 594957 588750 583671 579723 576227
60170E76227l546l589l233k442j694j587j988k061j413o06k17J4N67J289J686
$$ 576227 572681 569092 565859 563417 561723 560136 558148 556087 554674 554068 553851 553865 554432 555721 557407
60155E57407J693J590J519J451J389J271R44M25p2m35o14l28O54J882K545K517
$$ 557407 559100 560690 562209 563660 565049 566320 567264 567689 567617 567182 566568 566240 566894 568776 571321 573838
60139E73838K480K959L915N237O814Q076Q410Q097P935P860P067N610M518L953
$$ 573838 576318 579277 583192 588429 595243 603319 611729 619826 627761 635621 642688 648298 652816 656769
60125F56769K754M40j672k343k090j989j894j088J42R28J225J585K034K194K171
$$ 656769 659523 659963 658291 655948 653858 651869 649975 648887 649029 649957 651182 652767 654801 656995 659166
60110F59166K261K198J641J025R06Q62N9j357k529l293m228n354n896n507m839
$$ 659166 661427 663625 665266 666291 667197 668059 668118 666761 664232 660939 656711 651357 645461 639954 635115
60095F35115m593m690m601m015k941j616m24L54Q15J234J696K138K580L009L256
$$ 635115 630522 625832 621231 617216 614275 612659 612235 612589 613404 614638 616334 618472 621052 624061 627317
60080F27317L326L547M065M419M035K992J889J057K10j132l100n234o785p410
$$ 627317 630643 634190 638255 642674 646709 649701 651590 652647 652857 651725 648625 643391 636606 629196
60066F29196p535p747q000p919p673p757p925p357o064n133n106n137m398l411
$$ 629196 621661 613914 605914 597995 590322 582565 574640 567283 561219 556086 550980 545843 541445 538034
60052E38034l160l604l903l651k960j878m71Q45J776K607L607M455M880N321O225
$$ 538034 534874 531270 527367 523716 520756 518878 518407 519252 521028 523635 527242 531697 536577 541898 548123
60037E48123P081P036O139N244M821M596M172L446K487J452M33q51k767m958o493
$$ 548123 555204 562240 568379 573623 578444 583040 587212 590658 593145 594597 595030 594179 591412 586454 579961
60022E79961p197p996r324j0212r808q943q948r606r634q751p834p179o064m252
$$ 579961 572764 564768 555444 545232 535424 526481 517533 507927 498293 489542 481708 474529 468465 464213
60008D64213k655k069k076j709o06Q43K038K612K698K774L073L327L328L382L715
$$ 464213 461558 459489 457413 455704 455098 455941 457979 460591 463289 466063 469136 472463 475791 479173 482888
59993D82888L928L726L720M633N970O545O135N630N506N146M052K741K022J871
$$ 482888 486816 490542 494262 498895 504865 511410 517545 523175 528681 533827 537879 540620 542642 544513
59979E44513J562N26j133k795l818m044l901l920m253m795n408n778n420m313
$$ 544513 546075 546601 545468 542673 538855 534811 530910 526990 522737 517942 512534 506756 501336 497023
59965D97023l210k793k806k506j701p68N0P54J193J196J030J136J504J779J866
$$ 497023 493813 491020 488214 485708 484007 483239 483289 484043 485236 486432 487462 488598 490102 491881 493747
59950D93747J886J789J546J521K075K892L316L179K786K210J273J33p34j203j669
$$ 493747 495633 497422 498968 500489 502564 505456 508772 511951 514737 516947 518220 518353 517619 516416 514747
59935E14747k442l381m092m254l881l447l475l725l300j929o28m65j138j559j330
$$ 514747 512305 508924 504832 500578 496697 493250 489775 486050 482750 480821 480193 479728 478590 477031 475701
59920D75701r00n18pN81R30J067J227J264R08N76J078K403L542L638K840J895
$$ 475701 474801 474283 474276 474857 475787 476854 478081 479345 480253 480829 481907 484310 487852 491490 494330 496225
59904D96225J450J742K549L396M062M696N164M823L528K402K652L937M819M761
$$ 496225 497675 499417 501966 505362 509424 514120 519284 524107 527635 530037 532689 536626 541445 546206
59890E46206M686N413O397O433N151L396K373K444K773K373J511J464K666L925
$$ 546206 550892 556305 562702 569135 574286 577682 580055 582499 585272 587645 589156 590620 593286 597211
59876E97211M102L744M033M832M949L966K528R88r82l342n383o699p577q222q419
$$ 597211 601313 605057 609090 613922 618871 622837 625365 626353 625371 622029 616646 609947 602370 594148 585729
59861E85729q124p625p026o207n269m357l194j530Q7R60J416K371L745M555M620
$$ 585729 577605 569980 562954 556747 551478 547121 543927 542397 542484 543444 544860 547231 550976 555531 560151
59846E60151N053O692R096J1411J3146J3687J2121Q339L677j92k525l330k620
$$ 560151 565204 571896 580992 592403 605549 619236 631357 639696 643373 643181 640656 637326 634706
59833F34706n23K216M442N240M290J870j268m309o749q302q724q188p611p908
$$ 634706 634183 636399 640841 646081 650371 652241 650973 646664 639915 631613 622889 614701 607090 599182
59819E99182q945r809j0028r866r570r080q468p893p056n509l625k467k403k560
$$ 599182 590237 580428 570400 560534 550964 541884 533416 525523 518467 512958 509333 506866 504463 501903
59805E01903j927n15Q24J244M45j140k502k839k237j378p59n85j024j897k399
$$ 501903 499976 499461 500285 501529 501974 500834 498332 495493 493256 491878 491119 490534 489510 487613 485214
59790D85214j920r78n71q36j191j475j928k251j878j128r86j542j855j482j067
$$ 485214 483294 482316 481745 480909 479718 478243 476315 474064 472186 471058 470072 468530 466675 465193 464126
59775D64126j088j127q01m28l07j81J22L16L17N58J219J828K017K079K428L071
$$ 464126 463038 461911 461110 460682 460375 460194 460316 460632 460949 461507 462726 464554 466571 468650 471078 474149
59759D74149L783M289M212L503K866L030L660L847L608L786M486M855M628M608
$$ 474149 477932 482221 486433 489936 492802 495832 499492 503339 506947 510733 515219 520074 524702 529310
59745E29310N163N517N068M361M004L659K790J659Q43M25K25K42L64K55o2p5M02
$$ 529310 534473 539990 545058 549419 553423 557082 559872 561531 562374 562799 563024 563266 563630 563885 563823 563748 564150
59728E64150R85J488K115K642K386J402P30R22J246R89O01Q17J424J683J395R00
$$ 564150 565135 566623 568738 571380 573766 575168 575898 576820 578066 579055 579656 580473 581897 583580 584975 585875
59712E85875M98M27R11J747K360K530K572K590K298J810J662J781J396M25p3N85
$$ 585875 586373 586800 587711 589458 591818 594348 596920 599510 601808 603618 605280 607061 608457 608882 608809 609394
59696F09394J640J967J477Q40O37J260K741M155M112K436M90p14j646k863l713
$$ 609394 611034 613001 614478 615318 615955 617215 619956 624111 628223 630659 631149 630435 628789 625926 622213
59681F22213l418k437j653j059l52q5r77k532l514l543l325l496m043m533m420
$$ 622213 618795 616358 614705 613646 613294 613209 612232 609700 606186 602643 599318 595822 591779 587246 582826
59666E82826l461k336k245l427m712n063m766m454l977l037k103j581q86M92J748
$$ 582826 579365 577029 574784 571357 566645 561582 556816 552362 548385 545348 543245 541664 540778 541270 543018
59651E43018J802J143J254K543L980M631M387L312J450n96j906k323k661l588
$$ 543018 544820 545963 547217 549760 553740 558371 562758 566070 567520 566924 565018 562695 560034 556446
59637E56446m853n668n562m722l732k926j999o07P20J019L29j87M5J72n18j286
$$ 556446 551593 545925 540363 535641 531909 528983 526984 526377 527097 528116 528445 528258 528303 528475 527957 526671
59621E26671j090k33K09N5m0R9jn21j107j519j760j713j255n67J53R97J979K763
$$ 526671 525581 525348 525557 525612 525572 525671 525670 525149 524042 522523 520763 519050 517795 517228 517381 518378 520357 523120
59603E23120L165L422L542L045J823N81j79q85j945k800k737j947j117o01o58
$$ 523120 526285 529707 533249 536294 538117 538698 538519 537634 535689 532889 530152 528205 527088 526487 525829
59588E25829j588k831k890j225O05Q11l77j424j723j833k065k273k608l276l791
$$ 525829 524241 521410 518520 517295 517900 518711 518334 516910 515187 513354 511289 509016 506408 503132 499341
59573D99341l574l022k875k973k633j876j152l85O19J263R61L03K12L75m3o36
$$ 499341 495767 492745 489870 486897 484264 482388 481236 480851 481470 482733 483694 483997 484209 484584 484541 483905
59557D83905k63J005J954K138K131K068J461N71L98J110J836K160K500K898K842
$$ 483905 483642 484647 486601 488739 490870 492938 494399 494970 495368 496478 498314 500474 502974 505872 508714
59542E08714K436K482L219M241N621P704R958J1836J4728K0558K7625L0288K4554
$$ 508714 511150 513632 516851 521092 526713 534417 544375 556211 570939 591497 619122 649410 673964
59529F73964J2717J002o213q527p426m468j176J283K959M637O311O970O067M349
$$ 673964 686681 687683 681470 672943 665517 661049 659873 661156 664115 668752 675063 682033 688100 692449
59515F92449K788J386n83l409o516r056j0664j1550j2100j2547j2886j2861j2094
$$ 692449 695237 696623 696040 692631 686115 677059 666395 654845 642745 630198 617312 604451 592357
59502E92357j0543q872p887p520o919n675m348l456k714j808j183j222j312o61
$$ 592357 581814 572942 565055 557535 550616 544941 540593 537137 534423 532615 531432 530210 528898 528237
59488E28237L52P56N57P13J621K703L494M163M819N197N294N605O471P716R100
$$ 528237 528589 529345 529902 530615 532236 534939 538433 542596 547415 552612 557906 563511 569982 577698 586798
59473E86798J0568J1965J2884J2892J1694R298O264L450J151j005k899l504k352
$$ 586798 597366 609331 622215 635107 646801 656099 662363 665813 666964 665959 663060 659556 657204
59460F57204o55J49M45J758M465P454R856J1856J3800J5686J7540J9285K0338
$$ 657204 656549 656698 657143 658901 663366 670820 680676 692532 706332 722018 739558 758843 779181
59447G79181K0351K0137K0711K1552K1026J8390J3997P775p66j0683j9368k4843
$$ 779181 799532 819669 840380 861932 882958 901348 915345 923120 922354 911671 892303 867460
59435H67460k7101k6900k4577k0726j6772j3988j2621j2337j2629j2593j1411
$$ 867460 840359 813459 788882 768156 751384 737396 724775 712438 699809 687216 675805
59424F75805r425p669o113l645o3L520O726J0580J5193J8648J9599J9449K0168
$$ 675805 666380 658711 652598 648953 648890 652410 659136 669716 684909 703557 723156 742605 762773
59411G62773K1386K1889K2872K6560L1256L0752K0434K712j5045k6976l2030l2051
$$ 762773 784159 806048 828920 855480 886736 917488 937922 940634 925589 898613 866583 834532
59399H34532k8873k3548j6543p642L138J3339J7746J2307j346j6543k7141l1574
$$ 834532 805659 782111 765568 757926 761064 774403 792149 804456 803110 786567 759426 727852
59387G27852l1592k9037k5061k0967j7752j5140j2366r655p767o474m859k946
$$ 727852 696260 667223 642162 621195 603443 588303 575937 566282 558515 552041 547182 544236
59375E44236j737j596j769j581j035j99R09J793J916J709K033K716K782K199K055
$$ 544236 542499 540903 539134 537553 536518 536319 537228 539021 540937 542646 544679 547395 550177 552376 554431
59360E54431K769L511L805M437O088Q186R856J1131J2485J3923J5215J6539J8205
$$ 554431 557200 560711 564516 568953 575041 583227 593083 604214 616699 630622 645837 662376 680581
59347F80581K0129K1924K3269K4003K4269K4508K4866K4707K3302K0826J7911
$$ 680581 700710 722634 745903 769906 794175 818683 843549 868256 891558 912384 930295
59336I30295J4478R985M739j62m184p669j0800j3376j5660j8211k0694k2004k1895
$$ 930295 944773 954758 959497 959335 955151 947482 936682 923306 907646 889435 868741 846737 824842
59323H24842k1335k0939k0233j8810j7079j5438j3699j1825j0271r224q327p472
$$ 824842 803507 782568 762335 743525 726446 711008 697309 685484 675213 665989 657662 650190
59311F50190o905o373n293l902l104k855k048l60J144J727K039K885M187N774
$$ 650190 643285 636912 631619 627717 624613 621758 619710 619350 620494 622221 624260 627145 631332 637106
59297F37106P997J0967J4215J7486K0494K1533J8130J0127O89o826j1720j4755
$$ 637106 645103 656070 670285 687771 708265 729798 747928 758055 758744 751918 740198 725443
59285G25443j5795j4327j1221q180n904l968k044q5K131M602O673P938R049J0777
$$ 725443 709648 695321 684100 675920 670016 666048 664004 663919 666050 670652 677325 685263 694312 705089
59271G05089J2801J4330J5249J5871J6104J5751J5052J4082J2195Q942M968J186
$$ 705089 717890 732220 747469 763340 779444 795195 810247 824329 836524 845466 850434 851620
59259H51620k324n832r016j1508j3676j5916j7671j8117j7441j6470j5476j4220
$$ 851620 849296 843464 834448 822940 809264 793348 775677 757560 740119 723649 708173 693953
59247F93953j2788j1489j0169q458o471m540k555k65K033L813N111O349P607Q546
$$ 693953 681165 669676 659507 651049 644578 640038 637483 637218 639251 643064 648175 654524 662131 670677
59233F70677Q946Q913Q724Q577Q184O646L400o78l989o110p937r860j1128j1462
$$ 670677 679623 688536 697260 705837 714021 720667 724067 723389 719400 713290 705353 695493 684365 672903
59219F72903j1874j2978j3819j3355j2057j0895r808q314o771n714m695l094j551
$$ 672903 661029 648051 634232 620877 608820 597925 588117 579803 573032 567318 562623 559529 557978
59206E57978j221j999k636k414j706j058o00k50J57P93J451J680J565J789K528
$$ 557978 556757 554758 552122 549708 548002 546944 546344 546094 546251 547044 548495 550175 551740 553529 556057
59191E56057L146L432M093N356O242O094N792O365P461Q235Q750R204Q738O559
$$ 556057 559203 562635 566728 572084 578326 584420 590212 596577 604038 612273 621023 630227 638965 645524
59177F45524L628J729J288J445J744K466L629M972O603Q530R949J0224J0138J0930
$$ 645524 649152 650881 652169 653614 655358 657824 661453 666425 673028 681558 691507 701731 711869 722799
59163G22799J2416J3299J3048J2192J0984R094O558L899J253j616m505o914q875
$$ 722799 735215 748514 761562 773754 784738 793832 800390 804289 805542 803926 799421 792507 783632
59150G83632j0777j2488j3572j4116j4488j4529j3821j2531j1102r475p560o062
$$ 783632 772855 760367 746795 732679 718191 703662 689841 677310 666208 656733 649173 643111
59138F43111n762o229o267n464m379l460k736k326k249j943r39K61R17J306K217
$$ 643111 637349 631120 624853 619389 615010 611550 608814 606488 604239 602296 601357 601618 602535 603841 606058
59123F06058L504M274M402M655N424O303P013P748Q601R374R993J0404J0303R662
$$ 606058 609562 613836 618238 622893 628317 634620 641633 649381 657982 667356 677349 687753 698056 707718
59109G07718R119R091Q898P767O307N850O501O982O454N414M697M439M212L487
$$ 707718 716837 725928 734826 742593 748900 754750 761251 768233 774687 780101 784798 789237 793449 796936
59095G96936J982J2j575k253k343k311k042j407q77p98p33l00j40j103l050n297
$$ 796936 798918 798930 797355 795102 792759 790448 788406 786999 786122 785324 784591 784291 784151 783048 779998 774701
59079G74701p632r898j1309j1433j1260j1993j3187j3428j2481j1374j0565r488
$$ 774701 767069 757171 745862 734429 723169 711176 697989 684561 672080 660706 650141 640653
59067F40653p873o259n075m240l783l919m370m504m206l890l740l544l186k747
$$ 640653 632780 626521 621446 617206 613423 609504 605134 600630 596424 592534 588794 585250 582064 579317
59053E79317k327k155k515l123l227k739k380k270j537j13N53l09j216n93P49
$$ 579317 576990 574835 572320 569197 565970 563231 560851 558581 557044 556931 557484 557175 555959 555366 556115
59038E56115J059M86M94J227J563J345J550K362K966L078L150L235L253L984O136
$$ 556115 557174 557660 558154 559381 560944 562289 563839 566201 569167 572245 575395 578630 581883 585867 592003
59023E92003Q730J0179J0681J1696J3374J4470J4624J4606J4276J2438R109N968
$$ 592003 600733 610912 621593 633289 646663 661133 675757 690363 704639 717077 726186 732154
59011G32154M000K429N27j178k073k469k797k973k821k153l97K622N720P522Q387
$$ 732154 736154 738583 739110 737932 735859 733390 730593 727620 724799 722646 722249 724871 730591 738113 746500
58996G46500R592J0878J0742R150P828P559P226O083M927M274L185Q62k069m795
$$ 746500 756092 766970 777712 786862 794690 802249 809475 815558 820485 824759 827944 828806 826737 821942
58982H21942p400r895j1449j1510j0690r712q477o730m762k760m35K242M790P053
$$ 821942 814542 804647 793198 781688 770998 761286 752809 746079 741317 738557 738122 740364 745154 752207
58968G52207R351J1556J2966J3448J3765J4456J5322J6165J7026J7501J6767J4580
$$ 752207 761558 773114 786080 799528 813293 827749 843071 859236 876262 893763 910530 925110
58956I25110J1438P699L412j079n350r542j3849j7582j9863k0816k1032k0362
$$ 925110 936548 944247 947659 946580 941230 931688 917839 900257 880394 859578 838546 818184
58944H18184j8655j7033j6653j6658j5297j2721j0640r408p753n427l838l590
$$ 818184 799529 782496 765843 749185 733888 721167 710527 701119 693366 687939 684101 680511
58932F80511l603l234l250l993m436l899l041k501k057j688j914k575k734k238
$$ 680511 676908 673674 670424 666431 661995 658096 655055 652554 650497 648809 646895 644320 641586 639348
58918F39348j883j807j334n93m77p32n3J562K573K442K440L354M408N076N927
$$ 639348 637465 635658 634324 633731 633254 632522 632469 634031 636604 639046 641486 644840 649248 654324 660251
58903F60251P048P667Q056R680J2669J5205J6290J6980J8002J8335J7332J6181
$$ 660251 667299 674966 683022 692702 705371 720576 736866 753846 771848 790183 807515 823696
58891H23696J5986J6307J6818J8430K1500K4725K7099K9243L1513L2592L1377
$$ 823696 839682 855989 872807 891237 912737 937462 964561 993804 1025317 1057909 1089286
58880A089286K8483K4651J9464J3026P009K376k303q536j5410k1029k5089k8378
$$ 1089286 1117769 1142420 1161884 1174910 1181919 1184295 1181992 1173456 1158046 1137017 1111928 1083550
58868A083550l0892l2074l1945l0713k8201k4783k1685j9389j7051j4400j2644
$$ 1083550 1052658 1020584 988639 957926 929725 904942 883257 863868 846817 832417 819773
58857H19773j2390j2400j1688j1151j1664j2196j1505j0241r638r384q510p237
$$ 819773 807383 794983 783295 772144 760480 748284 736779 726538 716900 707516 699006 691769
58845F91769o389n918n507n593o458p286p370p174p142o729n736n181n571n815
$$ 691769 685380 679462 673955 668362 661904 654618 647248 640074 632932 626203 620467 615286 609715 603900
58831F03900n147m639n185n634m584k755j702j368p12K77R23J401K254L181L654
$$ 603900 598753 594114 588929 583295 578711 575956 574254 572886 572174 572451 573374 574775 577029 580210 583864
58816E83864L993M585M971M809M710N023N038M421M064M298L880K189O64N53Q22
$$ 583864 587857 592442 597413 602222 606932 611955 616993 621414 625478 629776 633656 635845 636509 637062 637884
58801F37884J68n88j67N80j5j653k811l359m254n353n606n002m485m286l851k981
$$ 637884 638052 637464 637297 637877 637862 636209 633398 630039 625785 620432 614826 609824 605339 601053 597202 594221
58785E94221j815k67J418K375K433K700L759M565M306L884M163M298L348K042
$$ 594221 592406 592139 593557 595932 598365 601065 604824 609389 613695 617579 621742 626040 629388 631430
58771F31430J192l2k354m352m378l248k961l778m584n003n222m729l327k324k663
$$ 631430 632622 632590 630236 625884 621506 618258 615297 611519 606935 601932 596710 591981 588654 586330 583667
58756E83667k941j408J101K473K564K819L473L468K726K268K403K645L048L901
$$ 583667 580726 579318 580419 582892 585456 588275 591748 595216 597942 600210 602613 605258 608306 612207
58742F12207M662M728M699N343O113O253O318O987P462O834N906N753N698M712
$$ 612207 616869 621597 626296 631639 637752 644005 650323 657310 664772 671606 677512 683265 688963 693675
58728F93675L621L827M850N320N361N768N888M677K952K273K371K034J607K272
$$ 693675 697296 701123 705973 711293 716654 722422 728310 732987 735939 738212 740583 742617 744224 746496
58714G46496L594M276M659O013P898Q611P842O637N226L083O17j293l052n577
$$ 746496 750090 754366 759025 765038 772936 781547 789389 796026 801252 804335 804952 803659 800607 795030
58700G95030q438j0713j2848j5608j8039j8721j8237j8075j7953j6548j4182j2272
$$ 795030 786592 775879 763031 747423 729384 710663 692426 674351 656398 639850 625668 613396
58688F13396j0882r137p399o596o177n084m010m276n253n450n235n863o651n920
$$ 613396 602514 593377 585978 579382 573205 568121 564111 559835 554582 549132 543897 538034 531383 525463
58674E25463m031k723k096j034J44M31P67K862N886P505P819R067J1673J3694
$$ 525463 521432 518709 516613 515579 515723 516154 516921 519783 525669 533174 540993 550060 561733 575427
58660E75427J4121J3633J2169Q807M267P08j180k435l356l404l248m115n399n597
$$ 575427 589548 603181 615350 624157 628424 629132 627952 625517 622161 618757 615509 611394 605995 600398
58646F00398n279o129p590p549o098n276n283m329k248q53n17K91J829K693K867
$$ 600398 595119 588990 581400 573851 567753 562477 557194 552865 550617 549764 549247 549538 551367 554060 556927
58631E56927L866N532N933M855M077L832K381l18j899j437q09j247j522n04J259
$$ 556927 560793 566325 572258 577113 581190 585022 587403 587085 585186 583749 582940 581693 580171 579667 580926
58616E80926L333O192R434J1675J2780J3788J4428J3356J0961R059P640M994J289
$$ 580926 584259 590451 599885 611560 624340 638128 652556 665912 676873 685932 693572 698566 699855
58603F99855j226j960k674l994m514l944l909m949n806o240p297q377p455m836
$$ 699855 698629 696669 693995 690001 685487 681543 677634 672685 666879 660639 653342 644965 637510 632674
58589F32674l175l066k189L78K719L977N891R187J1933J2986J3683J4670J4412
$$ 632674 629499 626433 624244 624622 627341 631318 637209 646396 658329 671315 684998 699668 714080
58576G14080J2367J0404R469P982N219L250L789N845P932R978J1798J2510J2750
$$ 714080 726447 736851 746320 754302 759521 762771 766560 772405 780337 790315 802113 814623 827373
58563H27373J4604J8154K1000K2230K3665K6048K7359K6324K4245K1769J7246
$$ 827373 841977 860131 881131 903361 927026 953074 980433 1006757 1031002 1052771 1070017
58552A070017J0179L154j626m924p866r623r509q724q185p165n590n192o786r004
$$ 1070017 1080196 1083350 1081724 1076800 1068934 1059311 1049802 1041078 1032893 1025728 1020138 1014946 1008160 999156
58538I99156j0964j3656j7386k0607k2448k3766k4616k3597k0684j7741j5347
$$ 999156 988192 974536 957150 936543 914095 890329 865713 842116 821432 803691 788344
58527G88344j2235q664o748o526n437k790q53k96J186M088N405L730J897K172
$$ 788344 776109 767445 760697 754171 748734 745944 745091 744795 745981 750069 755474 759204 761101 763273
58513G63273K821J901O82O54P49J03J84J569J997K12j628j747j654k775l659l074
$$ 763273 766094 767995 768677 769331 770080 770183 770367 771936 773933 774145 772517 770770 769116 766341 762682 759608
58497G59608k515l100l316k334k123l663m546l088j342j266j359O1J625J939K442
$$ 759608 757093 753993 750677 748343 746220 742557 738011 734923 733581 732315 730956 731017 732642 734581 737023
58482G37023M352O051O489P748J1243J4742J6197J7107J8880J9388J6614J2452
$$ 737023 741375 747426 753915 761663 772906 787648 803845 820952 839832 859220 875834 888286
58470H88286R297O014Q62m594q082j0345j2798j4219j3158j1003r482p725m818
$$ 888286 897583 903597 904459 899865 891783 881438 868640 854421 841263 830260 820778 813053 808235
58457H08235k334j241N96M661Q618J0079J0413J1574J2333J1046Q902P020L579
$$ 808235 805901 804660 805256 809917 818535 828614 839027 850601 862934 873980 882882 889902 893481
58444H93481k490q183j0552j1055j2164j2868j1343r031q031p254m977k402j108
$$ 893481 890991 882808 872256 861201 849037 836169 824826 815795 807764 800510 795533 793131 792023
58431G92023J96K828N105N556O023Q040R646R321R493J2210J5026J5166J4105
$$ 792023 792219 795047 800152 805708 811731 819771 829417 838738 848231 860441 875467 890633 904738
58418I04738J3816J2372P843K858M74r41l993o988p359o896q434j0558j0685j0190
$$ 904738 918554 930926 938769 941627 942101 941160 937167 930179 922820 915924 907490 896932 886247 876057
58404H76057j1353j2370j0695q212p844q018n840k801j896j919o2K533L169K785
$$ 876057 864704 852334 841639 833427 825583 817565 811725 808924 807028 805109 805047 807580 810749 813534
58390H13534L558M182K745J316K322L476J781n74k1J877J666O28J987M358M247
$$ 813534 817092 821274 824019 825335 827657 831133 832914 832340 832319 834196 835862 836490 838477 842835 847082
58375H47082K464J980K038M60q53J040M117M629L756M988P503Q328Q413J0340
$$ 847082 849546 851526 853564 854024 853171 854211 858328 862957 866713 871701 879204 887532 895945 906285
58361I06285J2683J2891J2886J5499J8274J7371J4565J3728J3477J0298N831L780
$$ 906285 918968 931859 944745 960244 978518 995889 1010454 1024182 1037659 1047957 1053788 1057568
58349A057568K716o25l938k966K25N97r57L9K903L573K845M691Q364J0045J0383
$$ 1057568 1060284 1059659 1055721 1052755 1052980 1053577 1052620 1052659 1055562 1059135 1061980 1066671 1075035 1085080 1095463
58334A095463J2631J5509J5691J4919J6821J9306J8231J5704J6232J7591J4619
$$ 1095463 1108094 1123603 1139294 1154213 1171034 1190340 1208571 1224275 1240507 1258098 1272717
58323A272717R240P285P907N814J758R39K883K781J107K158M814M563K941N002
$$ 1272717 1281957 1289242 1297149 1302963 1304721 1305660 1308543 1311324 1312431 1314589 1319403 1323966 1326907 1331909
58309A331909R218J0011Q453J0093J3991J4547J2550J3521J6671J6516J3990J4741
$$ 1331909 1341127 1351138 1359591 1369684 1383675 1398222 1410772 1424293 1440964 1457480 1471470 1486211
58297A486211J7755J7093J3579J3255J5519J4650J1859J3543J8533J9566J6794
$$ 1486211 1503966 1521059 1534638 1547893 1563412 1578062 1589921 1603464 1621997 1641563 1658357
58286A658357J7265K1479K3073K1572K2715K6347K6723K4606K6319L1083L2192
$$ 1658357 1675622 1697101 1720174 1741746 1764461 1790808 1817531 1842137 1868456 1899539 1931731
58275A931731L0217L1833L6266L6625L3963L5804M1297M2533M0074M2121M8535
$$ 1931731 1961948 1993781 2030047 2066672 2100635 2136439 2177736 2220269 2260343 2302464 2350999
58264B350999N1212N0107N2990N9371O1017N8554O0751O7045O8038O3759O3713
$$ 2350999 2402211 2452318 2505308 2564679 2625696 2684250 2745001 2812046 2880084 2943843 3007556
58253C007556O8153O7690O2415O2570O8972P1886P0772P5420Q5908R1599R1874
$$ 3007556 3075709 3143399 3205814 3268384 3337356 3409242 3480014 3555434 3641342 3732941 3824815
58242C824815R7228J08042J13578J13974J20983J34849J43403J46335J56358J73744
$$ 3824815 3922043 4030085 4143663 4257637 4378620 4513469 4656872 4803207 4959565 5133309
58232E133309J84826J88727J99584K18900K32750K40225K56336K82406L02956
$$ 5133309 5318135 5506862 5706446 5925346 6158096 6398321 6654657 6937063 7240019
58223G240019L16783L40464L75791M05758M28705M62944N11271N56048N96299
$$ 7240019 7556802 7897266 8273057 8678815 9107520 9570464 10081735 10637783 11234082
58214A1234082O52520P27253Q00186Q70548R62730J081154J204237J332879J497362
$$ 11234082 11886602 12613855 13414041 14284589 15247319 16328473 17532710 18865589 20362951
58205B0362951J705662J936626K196609K527667K947206L440614M028536M775798
$$ 20362951 22068613 24005239 26201848 28729515 31676721 35117335 39145871 43921669
58197D3921669N719035O858213Q232362R918972J1949929J4338337J7208578K0773709
$$ 43921669 49640704 56498917 64731279 74650251 86600180 100938517 118147095 138920804
58189A38920804K5158442L0355847L6216997M1967715M5475588M3567566L4048781
$$ 138920804 164079246 194435093 230652090 272619805 318095393 361662959 395711740
58182C95711740J7877649q34130j7219041k8218778l3346392l3877079l1786783
$$ 395711740 413589389 412755259 395536218 367317440 333971048 300093969 268307186
58175B68307186k8981082k6652885k4954823k3366932k1449966j9205492j6852341
$$ 268307186 239326104 212673219 187718396 164351464 142901498 123696006 106843665
58168A06843665j4544757j2375333j0449217q824201p460573o301660n340026
$$ 106843665 92298908 79923575 69474358 60650157 53189584 46887924 41547898
58161D1547898m565404l922157l364874k897961k523823k206082j917004j671085
$$ 41547898 36982494 33060337 29695463 26797502 24273679 22067597 20150593 18479508
58153A8479508j480219j320190j169634j040530r43565q61091p78714p08233o56794
$$ 18479508 16999289 15679099 14509465 13468935 12525370 11664279 10885565 10177332 9520538
58144I520538o06536n46030m90562m51532m15495l72145l33906l09512k85831
$$ 9520538 8914002 8367972 7877410 7425878 7010383 6638238 6304332 5994820 5708989
58135E708989k54141k28400k19547k15920k06009j97248j95988j91369j75619
$$ 5708989 5454848 5226448 5006901 4790981 4584972 4387724 4191736 4000367 3824748
58126C824748j59519j52123j44849j30327j17648j14249j11193j00708r0815q8812
$$ 3824748 3665229 3513106 3368257 3237930 3120282 3006033 2894840 2794132 2703317 2614505
58116B614505q7076p8707p1057p0712p0580o4405n9102o0454o1227n5302m9523
$$ 2614505 2527429 2448722 2377665 2306953 2236373 2171968 2112866 2052412 1991185 1935883 1886360
58105A886360m9954n0241m4852m0424m2745m5438m2454l9190m0749m1535l6823
$$ 1886360 1836406 1786165 1741313 1700889 1658144 1612706 1570252 1531062 1490313 1448778 1411955
58094A411955l2527l3369l3351k7774k2807k3324k3221j7703j3323j5675j8645
$$ 1411955 1379428 1346059 1312708 1284934 1262127 1238803 1215582 1197879 1184556 1168881 1150236
58083A150236j6224j3800j7221k1359k0083j7519j8991k0582j7836j5347j7618
$$ 1150236 1134012 1120212 1102991 1081632 1061549 1044030 1025039 1004457 986621 971274 953656
58072I53656j9673j6700j3831j6408j9414j6787j2575j2684j3805j0807p282q352
$$ 953656 933983 917283 903452 887044 867630 850843 838268 825584 811779 800972 793690 785338
58060G85338j0296p626l727m493p605p777o736q607j1079j0114q134q929r920
$$ 785338 775042 767416 763689 759196 751591 743814 737078 728471 717392 707278 699144 690215 680295
58047F80295p539m859n789p238n038k138k955n068m365l120n042p560o768n010
$$ 680295 672756 667897 662108 654870 649832 647694 644739 639671 635306 632186 627144 619584 612816 607806
58033F07806n951p230n547l825n789q512p903o507q259j0517r132o558p121q818
$$ 607806 601855 594625 589078 585253 579464 570952 563049 556542 548283 537766 528634 522076 514955 506137
58019E06137p663n584o245p360n079j881k245m306l620j510j950l710l135j480
$$ 506137 498474 492890 486645 479285 474206 472325 470080 465774 462154 460644 458694 454984 451849 450369
58005D50369k015l094j415J003L97j365j94K458K498Q75J182K332R11j723j835
$$ 450369 448354 445260 443845 444848 445245 443880 443686 446144 448642 449517 450699 453031 453942 452219 450384
57990D50384n30j565m106m435k851k303k135K10L129L002O60l80k93j622l449
$$ 450384 449854 448289 444183 439748 436897 434594 432459 432669 435798 438800 439460 439080 438787 437165 433716
57975D33716k965j069o62j071J61J908J503J91R19K674K606J680K538L827K516
$$ 433716 430751 429682 429020 427949 428110 430018 431521 431712 432631 435305 437911 439591 442129 445956 448472
57960D48472j12n68N93L60q43n22M29n83k470k436j599k887n133n019l277l119
$$ 448472 448360 447792 448385 448745 447902 447380 447809 447226 444756 442320 440721 437834 432701 427682 424405 421286
57944D21286m061l167j003n05j178j46K151K903K475L454N381N857N703P494J0106
$$ 421286 417225 414058 413055 412550 411372 411226 413377 416280 418755 422209 427590 433447 439150 446644 456750
57929D56750J0280Q507P892Q229O798L983K592K391Q38j657k581k588m430p468
$$ 456750 467030 475537 483429 491658 498456 502439 505031 507422 508260 506603 504022 501434 497004 489536
57915D89536q630q013q181q806p543n385n417o936o517m364l798m909m601k819
$$ 489536 480906 472893 464712 455906 448363 442978 437561 430625 424108 419744 415946 411037 406436 403617
57901D03617k812m977o106n232m830n748o064n406n467n925m681k343j685k536
$$ 403617 400805 395828 389722 384490 379660 373912 367848 362442 356975 351050 346369 344026 342341 339805
57887C39805k086k59K06r18j044N4n3j358j200M29N64j185j916q85o09j744j935
$$ 339805 337719 337460 337666 336748 335704 335758 335705 334347 333147 333576 334140 332955 331039 330154 329545 327801 325866
57870C25866p78q75k808l799k692j719k136k360j710j602k002q72J693K988K405
$$ 325866 325088 324213 321405 317606 314914 313195 311059 308699 306989 305387 303385 302513 304206 307194 309599
57855C09599K496M267N582N338N220O154O852O944P640Q446P216M361K931L605
$$ 309599 312095 316362 321944 327282 332502 338656 345508 352452 360092 368538 375754 380115 383046 386651
57841C86651L748K414J862K923L208J515j52n34j112k572l154k211j735k655l114
$$ 386651 390399 392813 394675 397598 400806 402321 402169 401635 400523 397951 394797 392586 390851 388196 385082
57826C85082k112j364j948k449k006j879k526k394j054l00p55o25P81J657J252
$$ 385082 382970 381606 379658 377209 375203 373324 370798 368404 367350 367050 366295 365670 366451 368108 369360
57811C69360J416K973L794K200o41l273n921q414r177p877o416n917n328m057
$$ 369360 370776 373749 377543 379743 379102 375829 369908 361494 352317 344440 338024 332107 326779 322722
57797C22722l216l158k674j662j545k184j584K72P77q65k042j062L25L82P1M97
$$ 322722 319506 316348 313674 312012 310467 308283 306699 306971 307748 306883 304841 303779 304104 304486 304557 305054
57781C05054P33J01j83N93J228J117J514K887L766L617L965N233N411L497J423
$$ 305054 305787 305888 305705 306298 307526 308643 310157 313044 316810 320427 324392 329625 335036 338533 339956
57766C39956Q26O79k78j477k417l946o016o877o046n411n987o346n692n495o387
$$ 339956 340782 341461 341183 339706 337289 333343 327327 320450 314404 308993 303006 296660 290968 285473 279086
57751B79086o491m693k779k299k031n79J127J901K376L069K822J152k09n9L25
$$ 279086 272595 267902 265123 262824 260793 260214 261341 263242 265618 268687 271509 272661 272452 272393 272718
57736B72718l01r84p81o75j431j881j238q43j705k530k079j201p73J03J953L217
$$ 272718 272417 271433 270652 269977 268546 266665 265427 264584 262879 260349 258270 257069 256296 256399 258352 261569
57720B61569K737J760J636J542M45q60j475k108l187l338j770j55j96j177j701
$$ 261569 264306 266066 267702 269244 269689 268829 267354 265246 262059 258721 256951 256796 256600 255423 253722
57705B53722j953k453k498j765j510k407l008k149r87q81j123n63K82M54K18n2
$$ 253722 251769 249316 246818 245053 243543 241136 238128 235979 234992 234111 232988 232425 232707 233161 233379 233327
57689B33327q98k273k843k144j512j607j175L66J517J430J626L245M986N669O506
$$ 233327 232429 230156 227313 225169 223657 222050 220875 221241 222758 224188 225814 229059 234045 239714 246220
57674B46220Q818J1735J4244J7454K2671K9119L5723M3363N3228O4112P2588P4308
$$ 246220 255038 266773 281017 298471 321142 350261 385984 429347 482575 546687 619275 693583
57662F93583O4745M1853J0074k0880m3371n6359o1952o1166n5288m7826m1585
$$ 693583 758328 800181 810255 789375 746004 689645 627693 566527 511239 463413 421828
57651D21828l5861k9235k2947j8814j5992j2837r985q750q204o689m613l180j940
$$ 421828 385967 356732 333785 314971 298979 286142 276157 267407 259203 252514 247901 244721 242781
57638B42781k33P73M2r17l05R83J181Q03J315K232K239J717J580J147k97j403
$$ 242781 242548 243321 243363 242446 242141 243124 244305 245108 246423 248655 250894 252611 254191 255338 255041 253638
57622B53638r49m33j697l529l587k299j767k041j650p58p66j469j467p71n40q18
$$ 253638 252689 252256 250559 247030 243443 241144 239377 237336 235686 234928 234162 232693 231226 230455 229915 229097
57606B29097q91j032j657j811p22K62l57j520j304q6L87l0m08r87k338l465l264
$$ 229097 228206 227174 225517 223706 222984 223246 222889 221369 220065 219979 220366 220336 219928 218941 216603 213138 209874
57589B09874k692l019l312k321j312k010l181k495p10n00j962k689j842q61m72
$$ 209874 207182 204163 200851 198530 197218 195208 192027 189532 188822 188322 186360 183671 181829 180968 180496
57574A80496n4K08n33j705j981j711k146k810k367j444j718k651k203m37N84L02
$$ 180496 180442 180650 180117 178412 176431 174720 172574 169764 167397 165953 164235 161584 159381 158944 159528 159830
57558A59830J49O24P09K32Q2Q8o95j656j236L01J283J618K546L631L021Q56n65
$$ 159830 159979 160603 161312 161544 161626 161714 161019 159363 158127 158428 159711 161329 163875 167506 170527 171383 170818
57541A70818l68n1m41m73M16J212J318J437J771J509N14l52r24j805k655k453
$$ 170818 170450 170399 169958 169485 169901 171113 172431 173868 175639 177148 177662 177310 176386 174581 171926 169473
57525A69473j545j254j424o21J050J740Q74L3L53J084J390J611K152K741L231
$$ 169473 167928 166674 165250 164629 165679 167419 168293 168326 168679 169763 171153 172764 174916 177657 180888
57510A80888L679L563K444J253J232J757J159n22j612j518j278j416j372j168
$$ 180888 184567 188130 190574 191827 193059 194816 195975 195453 193841 192323 191045 189629 188257 187089
57496A87089j603k618l287l492l836m036l342k367k447l341l526k635j621q09
$$ 187089 185486 182868 179581 176089 172253 168217 164875 162508 160061 156720 153194 150559 148938 148129
57482A48129J20O07m0p38J27J830K187J052L00M75L03m74o67k58o16j679j748
$$ 148129 148249 148856 148816 148078 148205 150035 152222 153274 153574 154049 154352 153878 153211 152953 152337 150658 148910
57465A48910n81J7o79j207o93j40j92q4M46M94%P7O92L86r59j532n76L72J68l56
$$ 148910 148329 148346 147667 146460 145767 145627 145435 145351 145797 146291 146291 146368 147060 147446 146487 144955 144379 144751 144919 144563
57445A44563m22o65j404j582o13N82J196J524J666J129K57Q2L34k83j453j307
$$ 144563 144141 143476 142072 140490 139877 140459 141655 143179 144845 145974 146231 146313 146647 146364 144911 143604
57429A43604L46J403Q86L64R86J636J296Q35J035J054K43m60l52k36o82q77m33
$$ 143604 143950 145353 146239 146603 147589 149225 150521 151356 152391 153445 153688 153228 152876 152640 151958 151081 150648
57412A50648m08j282j799j052N8O07J039J647J614P59L43Q60R35j61r54j46J205
$$ 150648 150240 148958 147159 146107 146165 146772 147811 149458 151072 151831 152174 153034 153969 153808 152854 152708 153913
57395A53913J520J052Q50Q51N76L63M63K35m86n86N34J769K104K147K652L067
$$ 153913 155433 156485 157335 158186 158762 159125 159588 159823 159337 158751 159285 161054 163158 165305 167957 171024
57379A71024K853K690L045K969J766M36O3J25k17n12j62J29m68j351j552j244
$$ 171024 173877 176567 179612 182581 184347 184783 184846 184971 184754 184242 184080 184209 183741 182390 180838 179594
57363A79594j006o57j13j61j064j559o56O44Q15N6l22J23R08J733K414K370J437
$$ 179594 178588 177931 177818 177657 176593 175034 174378 175022 175837 175893 175571 175694 176602 178335 180749 183119 184556
57346A84556N45O73J654K674L249L048J775m5j068o45M32J179J405J148L17n93
$$ 184556 185101 185774 187428 190102 193351 196399 198174 198129 197061 196416 196848 198027 199432 200580 200897 200304
57330B00304p01j56M6j37K76J163J056k76j091m49K48k88j107q18J85P57Q96J155
$$ 200304 199603 199447 199493 199356 199632 200795 201851 201575 200484 200035 200283 199995 198888 198070 198255 199012 199908 201063
57312B01063J401J457J761K318K227J331Q57J375J712J010K95O08J192J016O27
$$ 201063 202464 203921 205682 208000 210227 211558 212415 213790 215502 216512 216807 217415 218607 219623 220250
57297B20250R33J491J534J482J916K320K213K320L156L736L216K542K931L815
$$ 220250 221183 222674 224208 225690 227606 229926 232139 234459 237615 241351 244567 247109 250040 253855
57283B53855L926L372L050K927K423J713J278R29M60L57Q22J072O39K13K20r5
$$ 253855 257781 261153 264203 267130 269553 271266 272544 273473 273933 274290 275112 276184 276823 277036 277256 277161
57267B77161j096j664r90L3M19O88J450K012J824J780K473K692J496K48O48K025
$$ 277161 276065 274401 273411 273444 273863 274551 276001 278013 279837 281617 284090 286782 288278 288526 289174 291199
57251B91199K667K610L071M038M569M678M977N139M538L746L673L920L652L305
$$ 291199 293866 296476 299547 303585 308154 312832 317809 322948 327486 331232 334905 338825 342477 345782
57237C45782L774M650M958M903N132N131M187L237L792N505O641O598O286O321
$$ 345782 349556 354206 359164 364067 369199 374330 378517 381754 385546 391051 397692 404290 410576 416897
57223D16897O433O475O644O850O961P237P661P529O697O236O844P642P800Q022
$$ 416897 423330 429805 436449 443299 450260 457497 465158 472687 479384 485620 492464 500106 507906 515928
57209E15928R017R815R317Q399Q624R751J0407J0372J0368J0320R708R078R465
$$ 515928 524945 534760 544077 552476 561100 570851 581258 591630 601998 612318 622026 631104 640569
57196F40569J0688J1761J2406J2835J2844J2514J2918J4533J5867J5375J3810
$$ 640569 651257 663018 675424 688259 701103 713617 726535 741068 756935 772310 786120
57185G86120J2996J3228J3624J4125J5148J6100J6223J6171J6884J7695J7477
$$ 786120 799116 812344 825968 840093 855241 871341 887564 903735 920619 938314 955791
57174I55791J6892J7354J8500J8945J8901J9769K1513K2711K2953K3143K3575
$$ 955791 972683 990037 1008537 1027482 1046383 1066152 1087665 1110376 1133329 1156472 1180047
57163A180047K3749K3936K4912K6294K7066K7622K9279L1860L3732L4363L4898
$$ 1180047 1203796 1227732 1252644 1278938 1306004 1333626 1362905 1394765 1428497 1462860 1497758
57152A497758L6119L7536L8769M0103M1505M2477M3109M4031M5309M6551M7920
$$ 1497758 1533877 1571413 1610182 1650285 1691790 1734267 1777376 1821407 1866716 1913267 1961187
57141A961187M9804N1727N2953N3831N5248N7025N8296N9096O0189O1597O2724
$$ 1961187 2010991 2062718 2115671 2169502 2224750 2281775 2340071 2399167 2459356 2520953 2583677
57130B583677O3603O4683O5707O6192O6786O8733P2302P6929Q2527Q9363R7041
$$ 2583677 2647280 2711963 2777670 2843862 2910648 2979381 3051683 3128612 3211139 3300502 3397543
57119C397543J04792J12460J20126J27415J34320J42010J51711J63520J77452
$$ 3397543 3502335 3614795 3734921 3862336 3996656 4138666 4290377 4453897 4631349
57110D631349J94692K16390K42196K71432L04942L44417L90964M46084N13310
$$ 4631349 4826041 5042431 5284627 5556059 5861001 6205418 6596382 7042466 7555776
57101G555776N97380P02296Q31644R90310J184871J422870J712161K059298K466963
$$ 7555776 8153156 8855452 9687096 10677406 11862277 13285147 14997308 17056606 19523569
57092A9523569K933028L451761M013983M605780N208866N801619O356388O835928
$$ 19523569 22456597 25908358 29922341 34528121 39736987 45538606 51894994 58730922
57084E8730922P196387P392982P376775P088394O471777N509436M244262K761453
$$ 58730922 65927309 73320291 80697066 87785460 94257237 99766673 104010935 106772388
57076A06772388J153407m92257k081986l517072m717150n640509o281594o657618
$$ 106772388 107925795 107433538 105351552 101834480 97117330 91476821 85195227 78537609
57068G8537609o800455o750916o549346o229172n819470n349131m845324m330890
$$ 78537609 71737154 64986238 58436892 52207720 46388250 41039119 36193795 31862905
57060C1862905l825880l348573k912044k521762k178540j881762j628580j413223
$$ 31862905 28037025 24688452 21776408 19254646 17076106 15194344 13565764 12152541
57052A2152541j229832j074425r43113q31046p34523o51785n80401n16507m57885
$$ 12152541 10922709 9848284 8905171 8074125 7339602 6687817 6107416 5590909 5133024
57043E133024m05359l59750l19901k84677k54275k28256k04793j83135j64277
$$ 5133024 4727665 4367915 4048014 3763337 3509062 3280806 3076013 2892878 2728601
57034B728601j48285j33445j18955j05692r3520q0719o6791n2779l8149k0600
$$ 2728601 2580316 2446871 2327916 2222224 2128704 2047985 1981194 1928415 1890266 1869666
57024A869666Q37K6189N7133R2299J18254J13385O7654m414p4975j24582j50001
$$ 1869666 1870503 1896692 1953825 2046124 2164378 2277763 2345417 2341003 2266028 2141446 1991445
57013A991445j56346j49460j35171j18986j03720q9663p7228o7310n9538n2680
$$ 1991445 1835099 1685639 1550468 1431482 1327762 1238099 1160871 1093561 1034023 981343
57003I81343m6590m1821l7936l4049l0337k7373k4912k2906k2375k3446k3939
$$ 981343 934753 892932 854996 820947 790610 763237 738325 715419 693044 669598 645659
56992F45659k1884j8264j5233j2916j0013o329k499J811P184J2629J6255J7113
$$ 645659 623775 605511 590278 577362 567349 561020 558521 560332 567516 580145 596400 613513
56980F13513J4889R024Rr451j6470k0519k2630k3172k2075k0047j7913j5527j2730
$$ 613513 628402 637426 637435 627984 611514 590995 568365 545193 523118 503071 485158 469631 456901
56967D56901j0308q609o569l481l70J854M199P916J2511J7070K1907K6885K9470
$$ 456901 446593 437984 431415 427934 427564 429418 433617 441533 454044 471114 493021 519906 549376
56954E49376K6629J8024N829p298j8648k5603k7588k6881k5802k4242k1363j7979
$$ 549376 576005 594029 599858 592560 573912 548309 520721 493840 468038 443796 422433 404454
56942D04454j5192j2244q065l623m82J870N032R089J3228J7902K4082L1069L6881
$$ 404454 389262 377018 368953 365330 364848 366718 371750 380839 394067 411969 436051 467120 504001
56929E04001L9934L8600L0596J5525k751j8595k9131l4752l6400l4783l1490k8348
$$ 504001 543935 582535 613131 628656 625905 607310 578179 543427 507027 472244 440754 412406
56917D12406k5631k2665j9646j7213j4923j2009r136p557p157o903o567o381n789
$$ 412406 386775 364110 344464 327251 312328 300319 291183 283626 276469 269566 262999 256618 250829
56904B50829m207k321j053j22R88J762J919K559M328N807N757N480O791R042J0531
$$ 250829 246622 244301 243248 243126 244114 245876 247795 250354 254682 260489 266246 271726 278517 287559 298090
56889B98090J1580J3667J6582J9090K1338K3758K4332K0060J1006M08q945j6148
$$ 298090 309670 323337 339919 359009 380347 404105 428437 448497 459503 459911 450966 434818
56877D34818k0554k1531j9917j7455j4751j1503q278n944l783l40M251Q802J3398
$$ 434818 414264 392733 372816 355361 340610 329107 320829 314885 311102 310762 315013 323815 337213
56864C37213J8944K5046L0796L7167M5921N6006O3221O3483N4836L7253J3386
$$ 337213 356157 381203 411999 449166 495087 551093 614314 677797 732633 769886 783272
56853G83272j0764k8898l8918m2898m3099m0272l5310k9627k3501j6285q510j613
$$ 783272 772508 743610 704692 661794 618695 578423 543113 513486 489985 473700 465190 463577
56841D63577M439J1099J8767K6618L4912M5196N7987P2275Q6933R9810J05249
$$ 463577 468016 479115 497882 524500 559412 604608 662595 734870 821803 921613 1026862
56830A026862R5879O8898K9559j2150m7176p0439q1369q2952p9082p1975o2509
$$ 1026862 1122741 1191639 1221198 1209048 1161872 1091433 1010064 927112 848030 776055 713546
56819G13546n2244m3120l5330k7438j8836j0320k252O063J5000K4249L4056M5183
$$ 713546 661302 618182 582852 555414 536578 526258 524006 530069 545069 569318 603374 648557
56807F48557N7292O8189P4270P0911N4247K5261q342l6875n5533o5291o8521o6576
$$ 648557 705849 774038 848308 919219 973466 998727 990385 953510 897977 832686 764165 697589
56795F97589o1072n4099m6508l8208l0216k4094j9439j4429q818l860O82O592
$$ 697589 636517 582418 535910 497702 467486 443392 423953 409524 400706 396846 397528 404120
56783D04120J4054K1265K7463L3380L7967L7591K9741J5625j464j8138l1017l7751
$$ 404120 418174 439439 466902 500282 538249 575840 605581 621206 619742 601604 570587 532836
56771E32836l9126l8170l6535l3685k9730k6280k3796k0867j7090j4106j2780
$$ 532836 493710 455540 419005 385320 355590 329310 305514 284647 267557 253451 240671
56760B40671j1787j0153q740q098p117n257l847l827m126l628k868k534k116j240
$$ 240671 228884 218731 209991 201893 194776 189519 185672 181845 177719 174091 171223 168689 166573 165333
56746A65333o47p07o48k56n24j663k310j756j146j342j493q45j60j43j90J38J16
$$ 165333 164686 163979 163331 163075 162551 160888 158578 156822 155676 154334 152841 151996 151836 151693 151503 151641 151757
56729A51757n25p09K1M28k92r07q5J496K315K048J292M65o5J45P85R95Q31J151
$$ 151757 151232 150523 150544 150972 150680 149773 149688 151184 153499 155547 156839 157304 157239 157384 158169 159164 159995 161146
56711A61146J677J030p54j751j011J34N08P30J366J499N71k78p9L71J51k41k91
$$ 161146 162823 163853 163099 161348 160337 160471 160979 161709 163075 164574 165145 164867 164788 165159 165310 165069 164778
56694A64778p21j916k695k102j041p25q36n97l39o18j052j173j378j823j733q11
$$ 164778 164057 162141 159446 157344 156303 155578 154742 154145 153806 153188 152136 150963 149585 147762 146029 145218
56678A45218n1r4q9O97J515J515J177J303J812K476L507M504M388L255K777L687
$$ 145218 145167 145073 144984 145681 147196 148711 149888 151191 153003 155479 158986 163490 167878 171133 173910 177597
56662A77597M539M055L080K873L082K739J986J399Q94M34N66J185J144J28n15
$$ 177597 182136 186191 189271 192144 195226 197965 199951 201350 202244 202678 203244 204429 205573 205701 205186
56647B05186J20J004R33K77j36l90o45l59N30J063Q75R04J602K090J941J929K157
$$ 205186 205306 206310 207243 207520 207384 206994 206349 205990 206520 207583 208458 209362 210964 213054 214995 216924 219081
56630B19081J478j13p40L87J467J057K64K97J65j133k270j762o58o79j221p38
$$ 219081 220559 220446 219706 220093 221560 222617 222881 223178 223343 222210 219940 218178 217520 216841 215620 214882
56614B14882L08K87q05j665j916j952j414Q3J491J463L52n37r24j264j414j138
$$ 214882 215190 215477 214672 213007 211091 209139 207725 207808 209299 210762 211114 210577 209653 208389 206975 205837
56598B05837j159k087l115l116k229j159PJ130J345M38l34j34J01n20j144p81
$$ 205837 204678 202591 199476 196360 194131 192972 192979 194109 195454 195892 195558 195424 195525 195005 193861 193080
56582A93080q8pq1K53K73m18m89J000K583K467J300P83Q76N25M2N15J739K688
$$ 193080 192992 192985 192904 193157 193430 193012 192523 193523 196106 198573 199873 200656 201532 202057 202099 202614 204353 207041
56564B07041L274L924M386M535N337P369R592J1074J2473J4094J4188J1227O493
$$ 207041 210315 214239 218625 223160 228497 235866 245458 256532 269005 283099 297287 308514 315007
56551C15007K435k26j803j863m25N58n04k343k917k621k995l713l550l041l332
$$ 315007 317442 317216 315413 313550 313125 313683 313179 310836 307919 305298 302303 298590 295040 291999 288667
56536B88667l581k415r61j365l079l667k753k161k516k655k193j917j759r75j54
$$ 288667 285086 282671 281710 280345 277266 273599 270846 268685 266169 263514 261321 259404 257645 256670 256516
56521B56516n16j448j274k88l26j435j739q07m63j748l367l875l337k377j263
$$ 256516 256000 254552 253278 252990 252664 251229 249490 248683 248220 246472 243105 239230 235893 233516 232253
56506B32253m57n36j225j701j793j778j454o99l36r51j601j245n58o57j002n34
$$ 232253 231796 231260 230035 228334 226541 224763 223309 222610 222274 221323 219722 218477 217919 217262 216260 215726
56490B15726P0m72j552j576o83k89n43m97k17m16n93J48J044P50r9J35J189J438
$$ 215726 215796 215324 213772 212196 211513 211224 210681 210184 209967 209551 208958 209106 210150 210900 210801 210936 212125 213563
56472B13563Q16O02Q44O09L70J346K760K605J051L34J163J929J694J277J127O06
$$ 213563 214379 214981 215825 216434 216804 218150 220910 223515 224566 224900 226063 227992 229686 230963 232090 232696
56456B32696j92k24N20Q65N08K80L74K13M2N63J252J042M23O47J183M12j369k091
$$ 232696 232504 232280 232800 233665 234173 234453 234827 235040 235082 235645 236897 237939 238362 239009 240192 240604 239235 237144
56438B37144j047M20J284J675J572R09O97J801K966K432R21M16O74j03j649j921
$$ 237144 236097 236517 237801 239476 241048 241957 242654 244455 247421 249853 250774 251190 251864 251761 250112 248191
56422B48191q57n03j265j289J15J430J780J916J949R99m45o96K53O58J44k1J70
$$ 248191 247334 246831 245566 244277 244392 245822 247602 249518 251467 252466 252021 251325 251578 252236 252380 252359 252529
56405B52529p02k336k642j388p18j383j614n30M45N73J050K202K437J256M36R37
$$ 252529 251827 249491 246849 245461 244743 243360 241746 241216 241661 242234 243284 245486 247923 249179 249615 250552
56389B50552J340O64J23O77J306J125R78J558K069J902J656J575R89J22K60J361
$$ 250552 251892 252556 252679 253356 254662 255787 256765 258323 260392 262294 263950 265525 266514 266636 266896 268257
56373B68257J766J034O88J356J625P13j48k2L20K66N06J327J863J807J904K158
$$ 268257 270023 271057 271745 273101 274726 275439 275291 275269 275589 275855 276361 277688 279551 281358 283262 285420
56357B85420J704Q35Q91J703J633N58J76R33J360R47Q23J065L72r47q67P23J504
$$ 285420 287124 287959 288850 290553 292186 292744 292920 293853 295213 296160 296983 298048 298420 297473 296606 297329 298833
56340B98833P46N34J840K755K038J244J701K407K523K995M125M388L282K627L357
$$ 298833 299579 300113 301953 304708 306746 307990 309691 312098 314621 317616 321741 326129 329411 332038 335395
56325C35395L823K892J967K155K217J153K63O86J325R44J38m00j180k087j689
$$ 335395 339218 342110 344077 346232 348449 349602 349865 350551 351876 352820 352958 352558 351378 349291 347602
56310C47602J31J329Q70L15Q86J569J459J377J756J642J119J933M274N877N625
$$ 347602 347733 349062 349932 350247 351133 352702 354161 355538 357294 358936 360055 361988 366262 372139 377764
56295C77764N116N218M420K292J163K292L578L205K485K859L187K372J731K382
$$ 377764 382880 388098 392518 394810 395973 398265 401843 405048 407533 410392 413579 415951 417682 420064
56281D20064L090L013L711O005P733P194O080O473P515P640P546Q346R201R273
$$ 420064 423154 426167 429878 435883 443616 450810 456890 463363 470878 478518 486064 494410 503611 512884
56267E12884R672J1192J2497J2735J3391J5328J6793J6694J6993J9395K2433K4483
$$ 512884 522556 533748 546245 558980 572371 587699 604492 621186 638179 657574 680007 704490
56255G04490K6789L0800L5287L8899M3024M9228N6372O2990P0040P8553Q7089
$$ 704490 731279 762079 797366 836265 879289 928517 984889 1047879 1117919 1196472 1283561
56244A283561R4291J01315J09019J15410J18726J20341J21714J21120J16473J08657
$$ 1283561 1377852 1479167 1588186 1703596 1822322 1942663 2064377 2185497 2301970 2410627
56234B410627R8974Q6006O8340M7967K7641P226j4149l4728n2218o6996q0114
$$ 2410627 2509601 2595607 2663947 2711914 2739555 2746781 2732632 2697904 2645686 2578690 2498576
56223B498576r0391r6674j00599j03963j05641j04177j01021r8047r4315q8523
$$ 2498576 2408185 2311511 2210912 2106949 2001308 1897131 1796110 1698063 1603748 1515225
56213A515225q2135p6900p1756o5454n9564n5594n1796m6381m1107l8032l5524
$$ 1515225 1433090 1356190 1284434 1218980 1159416 1103822 1052026 1005645 964538 926506 890982
56202H90982l1346k7016k4984k4087k1898j9237j8040j7137j4466j1387j0410
$$ 890982 859636 832620 807636 783549 761651 742414 724374 707237 692771 681384 670974
56191F70974j0492q963o385n257n489n133m170l787l440k194j266j858k461j532
$$ 670974 660482 651519 645134 639877 634388 629255 625085 621298 617858 615664 614398 612540 610079 608547
56177F08547o11j319j885l24J611J574R36J882K989K096Q45J824L745M036L659
$$ 608547 607936 606617 604732 604408 606019 607593 608529 610411 613400 615496 616341 618165 621910 625946 629605
56162F29605M744O060N592M997O651Q845Q906Q367R904J1888J1468J0437J2247
$$ 629605 634349 640409 646001 650998 657649 666494 675400 683767 693671 705559 717027 727464 739711
56149G39711J5653J7173J7623K0122K3770K5500K6474L0359L6804M2562M7620
$$ 739711 755364 772537 790160 810282 834052 859552 886026 916385 953189 995751 1043371
56138A043371N4387O2370O9694P8203R0800J05018J15097J19060J17870J09996
$$ 1043371 1097758 1160128 1229822 1308025 1398825 1503843 1618940 1738000 1855870 1965866
56128A965866R3798P4016N8769N0625M6589M5246M6832M7455M0950K6878J0556
$$ 1965866 2059664 2133680 2192449 2243074 2289663 2334909 2381741 2429196 2470146 2497024 2507580
56117B507580m315j6983k5014k5799k2755k3347l0714m2817n8618p8151r7112
$$ 2507580 2503265 2486282 2461268 2435469 2412714 2389367 2358653 2315836 2257218 2179067 2081955
56106B081955j08832j12081j10755j06242r6723q3609p1539o1660n1324m0536
$$ 2081955 1973123 1861042 1750287 1644045 1547322 1463713 1392174 1330514 1279190 1238654
56096A238654l2286k6679k1025j5594j2883j1765q749m540k730k829j365J134
$$ 1238654 1206368 1179689 1158664 1143070 1130187 1118422 1109673 1105133 1102403 1099574 1098209 1099343
56084A099343J336J76J342L816L619J920L270O750P382N604O491R979J0968R137
$$ 1099343 1100679 1100855 1102197 1106013 1109632 1111552 1114822 1121572 1128954 1134558 1141049 1151028 1161996 1171133
56070A171133R472J2654J4051J2945J3662J6763J7981J6773J7167J9377J9342
$$ 1171133 1180605 1193259 1207310 1220255 1233917 1250680 1268661 1285434 1302601 1321978 1341320
56059A341320J7273J7644K0189K0043J7380J7357J9966J9701J6126J4794J6661
$$ 1341320 1358593 1376237 1396426 1416469 1433849 1451206 1471172 1490873 1506999 1521793 1538454
56048A538454J6785J4589J5053J8456J9414J7547J8484K2735K4432K2745K3609
$$ 1538454 1555239 1569828 1584881 1603337 1622751 1640298 1658782 1681517 1705949 1728694 1752303
56037A752303K8199L0855L0374L2065L6527L7869L5384L5404L9246M0985L9497
$$ 1752303 1780502 1811357 1841731 1873796 1910323 1948192 1983576 2018980 2058226 2099211 2138708
56026B138708M0710M5576M8032M7265M9369N4419N5127N0969N0129N4573N7083
$$ 2138708 2179418 2224994 2273026 2320291 2369660 2424079 2479206 2530175 2580304 2634877 2691960
56015B691960N6127N9094O7257P2430P2508P5321Q2968Q7726Q7853R1587J00710
$$ 2691960 2748087 2807181 2874438 2946868 3019376 3094697 3177665 3265391 3353244 3444831 3545541
56004C545541J06323J06023J08693J17070J22593J23027J27650J39023J47737
$$ 3545541 3651864 3757887 3866580 3983650 4106243 4229270 4356920 4495943 4643680
55995D643680J51384J60069J76556J90162J97181K07550K24313K37375K45125
$$ 4643680 4795064 4955133 5131689 5321851 5519032 5726582 5950895 6188270 6433395
55986F433395K60325K86321L10024L27069L50233L83860M14989M39873M73092
$$ 6433395 6693720 6980041 7290065 7617134 7967367 8351227 8766216 9206089 9679181
55977I679181N19614N65332O06774O61106P34188Q09490Q82214R71897J086728
$$ 9679181 10198795 10764127 11370901 12032007 12766195 13575685 14457899 15429796 16516524
55968A6516524J210305J339770J499976J702798J932886K192688K518310K931068
$$ 16516524 17726829 19066599 20566575 22269373 24202259 26394947 28913257 31844325
55960C1844325L422471M010533M758223N711301O876331Q283996J0003169J2068280
$$ 31844325 35266796 39277329 44035552 49746853 56623184 64907180 74910349 86978629
55952H6978629J4487591J7364763K0906704K5264432L0471150L6454508M2617433
$$ 86978629 101466220 118830983 139737687 165002119 195473269 231927777 274545210
55945B74545210M7015719M6355019L7814329K1567235J444602j7230644l0683563
$$ 274545210 321560929 367915948 405730277 427297512 428742114 411511470 380827907
55938C80827907l7997305m0259311l9113154l6001415l2024367k7903583k3989102
$$ 380827907 342830602 302571291 263458137 227456722 195432355 167528772 143539670
55931A43539670k0415714j7260758j4552654j2243658j0271772q618646p268541
$$ 143539670 123123956 105863198 91310544 79066886 68795114 60176468 52907927
55924E2907927o162745n239349m476728l861091l350864k908331k531806k224990
$$ 52907927 46745182 41505833 37029105 33168014 29817150 26908819 24377013 22152023
55916B2152023j965521j731426j528358j363741j221013j084128r62101q65839
$$ 22152023 20186502 18455076 16926718 15562977 14341964 13257836 12295735 11429896
55908A1429896p84047p03717o32171n77990n30943m80647m35610m04873l79111
$$ 11429896 10645849 9942132 9309961 8731971 8201028 7720381 7284771 6879898 6500787
55899F500787l47892l18151k98431k81362k58405k36197k22379k10153j92240
$$ 6500787 6152895 5834744 5536313 5254951 4996546 4760349 4537970 4327817 4135577
55890D135577j75679j67848j61707j49333j36740j31073j25956j13753j00256
$$ 4135577 3959898 3792050 3630343 3481010 3344270 3213197 3087241 2973488 2873232
55881B873232r3193q7565p6135o4067n9835o1118o1914o4254p0935p5877p3498
$$ 2873232 2780039 2692474 2616339 2552272 2492437 2431319 2369405 2305151 2234216 2158339 2084841
55870B084841o9252o9849p1473o8192o3420o2386o1504n5812m9195m6899m5460
$$ 2084841 2015589 1945740 1874267 1806075 1742655 1680269 1618765 1562953 1513758 1466859 1421399
55859A421399m0038l4357l3540l4200l1238k7499k7270k7136k2794j8249j8904
$$ 1421399 1381361 1347004 1313464 1279264 1248026 1220527 1193257 1166121 1143327 1125078 1106174
55848A106174k1799k1790k1071k3506k5818k3643k0483k1500k3913k2542j9516
$$ 1106174 1084375 1062585 1041514 1018008 992190 968547 948064 926564 902651 880109 860593
55837H60593j9584k0813j8821j5537j5144j5832j3855j1409j2218j3610j1158
$$ 860593 841009 820196 801375 785838 770694 754862 741007 729598 717380 703770 692612
55826F92612p111o244p253o249m906p115j0958j1828j0478j0602j1460j0096p899
$$ 692612 685501 679257 672004 665755 660849 653734 642776 630948 620470 609868 598408 588312 580413
55813E80413q006r030p976o338o893p654n520k666k723l859k273O65J470J485
$$ 580413 572407 563377 555401 549063 542170 534516 528996 526330 523607 519748 517475 518140 519610 521095
55799E21095L915O948O762M717M657N595L961P73k62J17j735n451p620q110r247
$$ 521095 525010 531958 538720 543437 548094 553689 557650 558423 558161 558278 556543 551092 543472 535362 526115
55784E26115j0253q492m939k786k181j656k752p480j3062j5000j3810j3099j2768
$$ 526115 515862 507370 502431 499645 497464 495808 493056 485576 472514 457514 443704 430605 417837
55771D17837j0022n501k426p07K361O381Q253P416N668K906j927o762q402p662
$$ 417837 407815 402314 399888 399181 401542 407923 416176 423592 429260 432166 430239 423477 415075 407413
55757D07413p839r201r616r351j0236j1403j0680r090r186j0196r612q180q343
$$ 407413 399574 390373 380757 371406 361170 349767 339087 329997 320811 310615 301003 292823 284480
55744B84480r134p760n086m285m999m131j579j12j22L85J254N25j129j196o6l19
$$ 284480 275346 267586 262500 258215 253216 249085 247506 247394 247272 247657 248911 249436 248307 247111 247045 246726
55728B46726j831k270j849k821m751n054l854l594m193l392j546j269k403k150
$$ 246726 244895 242625 240776 237955 233204 228150 224296 220702 216509 213117 211571 210302 207899 205749
55714B05749k09Q38L94N70J874K552K424L111M406M517L870M405N231L482m69
$$ 205749 205540 206378 206772 207342 209216 211768 214192 217303 221709 226226 230096 234501 239732 243214 242745
55699B42745l197l787m710o744p660o677n775n666m618k270p27q29r19k21O5k58
$$ 242745 239548 235761 231051 224307 216647 209970 204195 198529 193911 191641 190914 190085 189166 188945 189010 188752
55683A88752K86J786K520K185K320L175L392L060L609M503L561R46p76q75j091
$$ 188752 189038 190824 193344 195529 197849 201024 204416 207476 211085 215588 219149 220095 219319 218444 217353
55668B17353j809j434j41k19j943k789j696m54M1J157L099L772K432J164J379
$$ 217353 215544 214110 213969 213750 211807 209018 207322 206868 206909 208066 211165 214937 217369 218533 219912
55653B19912J905J745J758K382K517J812J377J375N56j092k009k085k987m838
$$ 219912 221817 223562 225320 227702 230219 232031 233408 234783 235339 234247 232238 230153 227166 222328
55639B22328n633m805m257m967n507n024m642m922m725l737l296l731l597k539
$$ 222328 216695 211890 207633 202666 197159 192135 187493 182571 177846 174109 170813 167082 163485 160946
55625A60946k095k706k723j421l11l56n15q3P8m05o48o05j361k626k698j538j044
$$ 160946 158851 156145 153422 152001 151690 151334 150819 150736 150814 150409 149761 149156 147795 145169 142471 140933 139889
55608A39889j574j329L8M93o33j308n31r1j006j467k45Q98K57j011j251j100j727
$$ 139889 138315 136986 137024 137517 136884 135576 135045 134954 133948 132481 132236 133134 133391 132380 131129 130029 128302
55591A28302k456k208j455r71l27P62J309P31M1P7K54J54M64J290J459O11k7J16
$$ 128302 125846 123638 122183 121212 120885 121647 122956 123687 123728 123805 124059 124213 124677 125967 127426 128037 128010 128126
55573A28126J2o48n44P40J585J060N88J461K799L387L454L388K644J261M42M44
$$ 128126 128138 127490 126946 127686 129271 130331 130919 132380 135179 138566 142020 145408 148052 149313 149755 150199
55557A50199q1j578k605k425k219k528k086n52J74r49k165j852r41o25j02J330
$$ 150199 150118 148540 145935 143510 141291 138763 136677 136125 136299 135350 133185 131333 130392 129767 129665 130995
55541A30995K210J301kJ14J036J285J089J249J111J2p99k4J248J152o6r06j224
$$ 130995 133205 134506 134504 134618 135654 136939 138028 139277 140388 140400 139601 139577 140825 141977 141911 141005 139781
55524A39781j838k500k311j523j118j246j469j828k348k405j818j549k214k959
$$ 139781 137943 135443 133132 131609 130491 129245 127776 125948 123600 121195 119377 117828 115614 112655
55510A12655k935k563k287j508m6Q90N18j23N0M78L76K71O78Q23J95k43N9j29
$$ 112655 109720 107157 104870 103362 103316 104206 104724 104601 104651 105129 105505 105776 106454 107277 107472 107229 107288 107159
55492A07159j594k753j953k11M20r5m04k71l48m16J17P48O93M35P87J212P71j33
$$ 107159 105565 102812 100859 100648 101068 100973 100569 100298 99950 99534 99651 100399 101092 101527 102314 103526 104297 104164
55474A04164m95l68l09r6M86O47j45r40q20n35j048j652j280m71k08J1R78J716
$$ 104164 103669 103301 102992 102896 103382 104029 103884 102944 102124 101589 100541 98889 97609 97138 96930 96941 97919 99635
55456I9635Q14r69j639r19k25j34R8P09J027Q16N79N30N13O12Q06M83n77j486
$$ 99635 100449 99480 97841 96922 96697 96563 96661 97370 98397 99213 99792 100322 100835 101447 102253 102736 102159 100673
55438A00673j520j309j515j461m24O92O05k61o01l03o9J93Q89J373P91k42n04
$$ 100673 99153 97844 96329 94868 94444 95136 95741 95480 94879 94576 94507 94700 95589 96962 97753 97511 97007
55421I7007j30j53n52m80J05N26P54J176J492J201P33O72N19l14j065o67L19M93
$$ 97007 96877 96724 96172 95692 95797 96323 97077 98253 99745 100946 101679 102351 102870 102556 101491 100824 101143 101636
55403A01636k16p77q89r74p84J81J221J148K59OP78J462J202L60l09l96O1M52
$$ 101636 101420 100643 99754 98780 97996 98177 99398 100546 100805 100811 101589 103051 104253 104613 104304 103908 103969 104421
55385A04421m1j196j649q05Q1j39p23n14K3k00p96o39J19N40O38R41J065N01L3
$$ 104421 104380 103184 101535 100730 100811 100672 99949 99435 99458 99258 98462 97823 97942 98482 99120 100061 101126 101627 101660
55366A01660O21J493J289L74O9K68j28r50j052m79k73m63k25K70K03k3O61J788
$$ 101660 102281 103774 105063 105437 105506 105774 105646 104696 103644 103165 102892 102429 102204 102474 102677 102654 103315 105103
55348A05103J854Q41J70J82j78j086j401p67j82k06m00o19j123j341m53P29N25
$$ 105103 106957 107798 107968 108150 107972 106886 105485 104718 104536 104330 103930 103311 102188 100847 100394 101123 101648
55331A01648q15j215l8R60N27l47m45k06n25j083j005j44J011J902J989J145J60
$$ 101648 100833 99618 99580 100540 101067 100720 100275 100069 99544 98461 97456 97312 98323 100225 102214 103359 103519
55314A03519q0J32j25p52q93n63n16o65k31N70P11K44K60Q67J049O19N03P83M25
$$ 103519 103439 103571 103446 102694 101801 101238 100722 100057 99826 100396 101107 101351 101611 102478 103527 104146 104649 105432 105857
55295A05857o48j090l10O19Q48Q58J035Q52J73j69K13O31P00Q49J042N24n60r61
$$ 105857 105209 104119 103809 104428 105276 106134 107169 108021 108194 108025 108238 108869 109569 110418 111460 111984 111424 110463
55277A10463l47J19j74l61K6P9o07q55Q2R82M90p61j233o55J72P54J008P70K55
$$ 110463 110116 110235 110061 109700 109726 109805 109198 108343 108425 109407 109897 109136 107903 107248 107420 108174 109182 109952 110207
55258A10207K31Q73J211N54l89o80m94m52m51p8N21R28J079Q64m5j376k047j470
$$ 110207 110438 111311 112522 113076 112687 112007 111513 111061 110610 110532 111053 111981 113060 113924 113879 112503 110456 108986
55240A08986l34M76Q98J086O93l17j040o57M21J183J220P35j4o55p33l27j05l27
$$ 108986 108652 109128 110026 111112 111805 111488 110448 109791 110212 111395 112615 113350 113336 112681 111948 111621 111516 111189
55222A11189m44o1M33O57Q35J114J075M98j14k77j47pJ57J88l43j270j722j336
$$ 111189 110745 110684 111117 111774 112609 113723 114798 115296 115182 114905 114758 114751 114908 115096 114753 113483 111761 110425
55204A10425q15p62p58k04O22R71N98j05n65l29N65J406J540J187R41O86J1o21
$$ 110425 109610 108848 108090 107886 108508 109479 110077 109972 109407 109078 109643 111049 112589 113776 114717 115403 115414 114793
55186A14793l98K50Q2q58j193m90P0k21n65l53k62p36r16j66P04Q11N73O82R00
$$ 114793 114395 114645 114727 113869 112676 112186 112256 112035 111470 111117 110855 110119 109203 109037 109741 110552 111125 111807 112707
55167A12707Q52R29J306J201K60m80j54M47K03n25o81k87r1r9K07P29R76R13P22
$$ 112707 113559 114488 115794 116995 117255 116775 116621 117068 117271 116746 116065 115778 115687 115588 115795 116524 117500 118413 119135
55148A19135K25m82o41L8N55Pr58j160o55k70r0L33P73O09kl87m40m53k56M31
$$ 119135 119360 118878 118237 118275 118830 118837 117879 116719 116064 115794 115704 116037 116810 117419 117417 117030 116590 116137 115881 116312
55128A16312J131J151O58K74K7l73o41m09j73o37j417j517q84l43j64J72Q30J296
$$ 116312 117443 118594 119252 119526 119553 119180 118539 118130 117957 117320 115903 114386 113502 113159 112995 113167 113997 115293
55110A15293J292J138J057Q97O23M35L21P1k47l08K9O72J542K404K758K354J565
$$ 115293 116585 117723 118780 119677 120300 120735 121056 121127 120880 120572 120601 121273 122815 125219 127977 130331 131896
55093A31896Q78L29j44k79N8M37M01O8k77o77j070r52j44O39O57J13l57o37q63
$$ 131896 132774 133103 132959 132680 132738 133175 133576 133644 133367 132690 131620 130668 130524 131163 131820 131933 131576 130939 130076
55074A30076p78j96L31J45n79j193j546j758j541n18R19J876J980J497P46q0p52
$$ 130076 129298 129102 129433 129578 128999 127806 126260 124502 122961 122443 123362 125238 127218 128715 129461 129381 128629
55057A28629j138j317j220o60J8J2p21j179p67j93j83k39L22R35N93n06j265j259
$$ 128629 127491 126174 124954 124294 124312 124324 123603 122424 121657 121464 121281 121042 121364 122299 122892 122386 121121 119862
55039A19862r32n36P2P49J122J167J034O66J59JK65K58k75m96R7N14k01j159q97
$$ 119862 118930 118394 118466 119215 120337 121504 122538 123204 123363 123364 123629 123887 123612 123116 123213 123727 123526 122367 121470
55020A21470K09N72k9k84K94O71J43n79o70k68J58M64N04J20k97j02N11O40P5
$$ 121470 121679 122251 122222 121938 122232 122903 123046 122467 121797 121529 121687 122151 122655 122775 122478 122376 122887 123527 123602
55001A23602l20N5O86P66J79n84r61o16K69J018J185J177J521J924J725J025M56
$$ 123602 123282 123337 124023 124789 124968 124384 123423 122807 123076 124094 125279 126456 127977 129901 131626 132651 133107
54984A33107R3m07q41o79j49%k25j02M60P31M57K42M55O96O85O85Q14P78N43M81
$$ 133107 133200 132793 131952 131273 131124 131124 130899 130797 131257 131988 132445 132687 133142 133838 134523 135208 136022 136800 137343 137824
54964A37824O52O68M62L81M41L45K88P55J417J295L01m37k15K96J71m99j038j099
$$ 137824 138476 139144 139606 139987 140428 140773 141061 141816 143233 144528 144829 144392 144177 144473 144644 144145 143107 142008
54946A42008o48K54J167J367O65l41j085j605k005k067j681j121n46K04J109J783
$$ 142008 141360 141614 142781 144148 144813 144472 143387 141782 139777 137710 136029 134908 134362 134566 135675 137458
54930A37458K042K044J800J176N47O45J473K188K324K394K893L591M252N216O603
$$ 137458 139500 141544 143344 144520 145067 145712 147185 149373 151697 154091 156984 160575 164827 170043 176646
54915A76646P647P632O937O357N760M248J540j556m013n465o149o413o446o319
$$ 176646 184293 191925 198862 205219 210979 215227 216767 215211 211198 205733 199584 193171 186725 180406
54901A80406o078n719n124m221l313k919k999k736j568j59L65m3l63ON47O24L20
$$ 180406 174328 168609 163485 159264 155951 153032 150033 147297 145729 145570 145935 145892 145529 145535 146082 146706 147026
54884A47026Q4J09M11R92J697K287K840L615M437M811M774N009N856O745O920
$$ 147026 147110 147219 147630 148622 150319 152606 155446 159061 163498 168309 173083 178092 183948 190693 197613
54869A97613O257N116L827K515J099o82k881m964o234o633o626o350n603m642
$$ 197613 203870 208986 212813 215328 216427 215745 212864 207900 201666 195033 188407 182057 176454 171812
54855A71812m195m441m720m478l881l234k523j833j513j495j225n64j33l00n42
$$ 171812 167617 163176 158456 153978 150097 146863 144340 142507 140994 139499 138274 137710 137577 137277 136735
54840A36735l71j80n24j098j217q73n57l74m4L56M73M49Q92J861K494J980O00
$$ 136735 136364 136184 135660 134562 133345 132472 131915 131541 131497 131853 132326 132775 133667 135528 138022 140002 140602
54823A40602n57p89l48J29L80M97M14p0p05p95o4Q79J312J230R38L16q30j907
$$ 140602 140045 139256 138908 139037 139417 139914 140328 140258 139553 138758 138694 139573 140885 142115 143053 143369 142539 140632
54805A40632j929p84O09J489J881J955J481L35r53j626j458q61m04l16l14nN23
$$ 140632 138703 137919 138528 140017 141898 143853 145334 145669 144716 143090 141632 140771 140367 140051 139737 139732 140255
54788A40255O91L18K9L89J034J297J288J508J730J290M19J13N59Q00K64l14m3
$$ 140255 140946 141264 141293 141682 142716 144013 145301 146809 148539 149829 150248 150361 150920 151720 151984 151670 151627
54771A51627Q65J594J890K131K630L393M281N111N714O132O499O674O360N600
$$ 151627 152492 154086 155976 158107 160737 164130 168411 173522 179236 185368 191867 198541 204901 210501
54757B10501M797M112L232J821j26k351m426n914o734p206p401o813n249l594
$$ 210501 215298 219410 222642 224463 224337 221986 217560 211646 204912 197706 190305 183492 178243 174649
54743A74649k841k768k427j677j134q62l37K94K05o83j396j329q13p1J123K341
$$ 174649 171808 169040 166613 164936 163802 162940 162603 162897 163102 162419 161023 159694 158881 158810 159933 162274
54727A62274K414J082k80l77N89J761K963M333N522O141O403O619O569N984N076
$$ 162274 164688 165770 165490 165113 165702 167463 170426 174759 180281 186422 192825 199444 206013 211997 217073
54712B17073M014K493L61j868l710n242o481o993o678o210n985n404l980k501
$$ 217073 221087 223580 223941 222073 218363 213121 206640 199647 192969 186759 180774 175370 171390 168889
54698A68889k111k657k906k183j023l12l02n07k72M37P41j40j611k202j500o86
$$ 168889 166778 164121 161215 159032 158009 157697 157395 156888 156616 157053 157794 157654 156043 153841 152341 151655
54682A51655p40j149j046o29o03r24j066r86r42p38l5Q90J411J345Q65N7q52j318
$$ 151655 150915 149766 148720 148091 147488 146564 145498 144512 143570 142832 142797 143687 145098 146443 147308 147365 146513 145195
54664A45195j093p26p76r77p53j73K52L18J34k67p10o71R4J069J615J715J626
$$ 145195 144102 143376 142600 141623 140870 140697 140949 141267 141401 141134 140424 139753 139847 140916 142531 144246 145872
54647A45872J320Q31N89P83Q71L46m35q03o63l56o7M3k84q32q89l31m5n21r39
$$ 145872 147192 148023 148612 149395 150266 150612 150177 149374 148711 148355 148288 148331 148047 147215 146326 145995 145950 145429 144490
54628A44490m83K42K27k28j04N53P52K59j49o2J18J54L42P39R18O43J73k69o32
$$ 144490 144007 144249 144476 144248 144144 144697 145449 145708 145559 145497 145615 145769 146111 146850 147768 148411 148584 148315 147683
54609A47683o98k28M87Q42O59K36j86n17n29j48J79l2n71q52p55n80l88j9M57
$$ 147683 146985 146757 147244 148086 148745 148981 148795 148278 147749 147601 147780 147748 147177 146325 145570 144990 144602 144583 145040
54590A45040Q13J082J317J147K24j036j725j407m39M79P53L08j79J08R80J343
$$ 145040 145853 146935 148252 149399 149623 148587 146862 145455 145016 145495 146248 146556 146377 146485 147465 148808
54574A48808P94K78N17Q01K47o07o31J47Q29J133J390J447Q99J06k21k21m43n83
$$ 148808 149602 149880 150397 151198 151445 150838 150207 150354 151183 152316 153706 155153 156052 156158 155937 155716 155273 154690
54556A54690O5J019R36l57j527j612j044n23l8N41Q92P79M56K11L6o8k5L5K1L33
$$ 154690 154755 155774 156710 156353 154826 153214 152170 151647 151609 152150 153042 153821 154277 154488 154524 154456 154431 154466 154487 154820
54536A54820J387K709L252K613J365L10oO22J661J909P53q89j768j927k073j959
$$ 154820 156207 158916 162168 164781 166146 166456 166450 167072 168733 170642 171395 170506 168738 166811 164738 162779
54520A62779q42P37J311O81K11O49J172R88M70J71n5m15o91q83j300j637j074
$$ 162779 161937 162674 163985 164666 164877 165526 166698 167686 168156 168327 168272 167857 167166 166283 164983 163346 162272
54503A62272K45R95M49n74j071j093j034p87l19j32l54k80M72J111P79j61p38
$$ 162272 162517 163512 163961 163387 162316 161223 160189 159402 159083 158951 158597 158317 158789 159900 160679 160518 159780
54486A59780o12j08M64P75M44l35o71p2P02O31j88o75j27J044J772J336J51m48
$$ 159780 159168 159060 159524 160299 160743 160408 159737 159665 160367 160998 160810 160135 160008 161052 162824 164160 164311 163863
54468A63863L47J715K144J396O15N29O63N54N20P33O31m9o01m57j13k34o01p28
$$ 163863 164210 165925 168069 169465 170080 170609 171272 171826 172346 173079 173710 173661 173060 172603 172490 172256 171655 170927
54450A70927p52q92p14J59J112J173L05o76j145j089p33l61k79n24q19r91j028
$$ 170927 170175 169283 168569 168728 169840 171013 171318 170642 169497 168408 167675 167314 167035 166511 165692 164701 163673
54433A63673o74L60J543J745P91j18JO11O51K9o25r68r86n62J48M74J47j05L73
$$ 163673 162999 163359 164902 166647 167438 167320 167321 167932 168583 168612 167987 167019 166033 165471 165619 166093 166240 166135 166508
54414A66508J029R03J10l92k39Q2K12K98M09L18o5m09k67N31J609K072J348R8
$$ 166508 167537 168440 168550 168158 167919 168001 168213 168511 168920 169238 169173 168764 168497 169028 170637 172709 174057 174155
54396A74155l31L84J116J024P71J271K097K178J487R51R49R53N74N3k83l91l26
$$ 174155 173824 174208 175324 176348 177119 178390 180487 182665 184152 185103 186052 187005 187579 187632 187349 186958 186632
54379A86632k44m36r12j161q08k55p5j59k0L17M21J65k60p80j274j333p91k02
$$ 186632 186388 185952 185040 183879 183071 182816 182741 182582 182562 182879 183300 183465 183205 182425 181151 179818 179027 178825
54361A78825j16j91K20R29J199R51P83R05Q67M30j05m88p73q67n22J01M16J08
$$ 178825 178709 178518 178738 179667 180866 181817 182600 183505 184372 184802 184697 184209 183436 182569 182047 182148 182564 182672
54343A82672n82j310j873k018j511n58K56N63M85L12K23L16N64P30N61J00l27
$$ 182672 182090 180780 178907 176889 175378 174820 175076 175639 176124 176436 176659 176975 177539 178269 178830 178930 178603
54326A78603m34j10N06J046J247J391J982K935L578L614L499L547L441L075L042
$$ 178603 178169 178059 178565 179611 180858 182249 184231 187166 190744 194358 197857 201404 204845 207920 210962
54311B10962L579L787K801J184J78r0o22j925l398m251m256l549k445j487j126
$$ 210962 214541 218328 221129 222313 222491 222401 221779 219854 216456 212205 207949 204400 201955 200468 199342
54296A99342j261j500j703j870j768j292q27p26p80p86j057j623j553k08J330
$$ 199342 198081 196581 194878 193008 191240 189948 189121 188395 187615 186829 185772 184149 182596 182388 183718
54281A83718J404J37p69n61k91q65j630j585q18j0O31J196J483J299R08O11K58
$$ 183718 185122 185259 184490 183929 183638 182773 181143 179558 178740 178730 179361 180557 182040 183339 184247 184858 185116
54264A85116l41r00r78n80n3L30M21J91j21r1L97R69J289J454J669J830J619R94
$$ 185116 184775 183875 182897 182317 182264 182594 183015 183206 183085 182994 183391 184360 185649 187103 188772 190602 192221 193215
54246A93215K97RK44N35K74m48q20m12J29k8o93r84o02r3O6j31n59j012r89j90
$$ 193215 193512 193521 193765 194300 194574 194126 193306 192894 193023 192995 192302 191318 190716 190623 190689 190558 189999 188987 187998 187808
54226A87808P83J017N13O4o1l71j005j386j235j037j077r27l76Qk13n70m25J49
$$ 187808 188591 189608 190121 190185 190124 189753 188748 187362 186127 185090 184013 183086 182710 182718 182505 181935 181510 181659
54208A81659P12J115J215O21o01j482j178r2P10R04J012J316J388P74l35j256
$$ 181659 182371 183486 184701 185322 184721 183239 182061 181969 182679 183583 184595 185911 187299 188073 187738 186482
54192A86482j380o35M02Q71M18m85j064r60l48L39O80N67M20P77J481J717J103
$$ 186482 185102 184467 184869 185740 186158 185673 184609 183649 183301 183640 184320 184887 185307 186084 187565 189282 190385
54175A90385K80M2L04M10J59q9j45k33m97p23o84m04l8L00M55K14m48j221j635
$$ 190385 190665 190707 191011 191421 191580 191491 191346 191113 190616 189893 189209 188805 188767 189067 189522 189736 189288 188067 186432
54156A86432j496j104r43j070j013m58J70K65lJ37P97J059K28j075j647j154l27
$$ 186432 184936 183832 182889 181819 180806 180348 180518 180783 180780 180917 181714 182773 183001 181926 180279 179125 178798
54139A78798J51K77L00K73K44M34Q68J176J034O80N83O76L51o00j453j326l58
$$ 178798 178949 179226 179526 179799 180043 180477 181345 182521 183555 184235 184818 185494 185845 185245 183792 182466 182108
54122A82108M56N53M21P19J292J520J305J122J241J413J376J175R22O05K83J31
$$ 182108 182564 183117 183538 184257 185549 187069 188374 189496 190737 192150 193526 194701 195623 196228 196511 196642
54106A96642K01L02K50L5k80o22q86j042j209j495j721j555q51K64J431K111J831
$$ 196642 196843 197145 197395 197430 197150 196528 195642 194600 193391 191896 190175 188620 187769 188033 189464 191575 193406
54089A93406P90j12k24J25K33P3J00L10K71K4J09O35J095J267J496J831J685Q17
$$ 193406 194196 194084 193860 193985 194218 194291 194391 194701 194972 194996 195105 195740 196835 198102 199598 201429 203114 203931
54071B03931p7l12j65k79n58l93K85Q19P14J84j98r3M03Q90J003P40M30L19L42
$$ 203931 203854 203542 203377 203098 202540 202147 202432 203251 203965 204149 203951 203858 204261 205151 206154 206894 207324 207643 207985
54052B07985M10O54J138J584J622J274R54J048J615K389L014L270L229L137L196
$$ 207985 208395 209049 210187 211771 213393 214667 215621 216669 218284 220673 223687 226957 230186 233323 236519
54037B36519L497M060M797N444N783N932O230O832P494P749P263O141N015M491
$$ 236519 240016 244076 248873 254317 260100 266032 272262 279094 286588 294337 301600 307741 312756 317247
54023C17247M421M018K995K086J947K068J535N28N6L37M34k91j327j983k380k949
$$ 317247 321668 325686 328681 330767 332714 334782 336317 336845 336901 337238 337672 337381 336054 334071 331691 328742
54007C28742l622m063m267m415m479m362m120l736l055k210j656j455r57K68J683
$$ 328742 325120 321057 316790 312375 307896 303534 299414 295678 292623 290413 288757 287302 286345 286613 288296
53992B88296K531L020M079O051Q310J0328J2505J5350J7992J8070J3734N715k936
$$ 288296 290827 293847 297926 303977 312287 322615 335120 350470 368462 386532 400266 405981 403045
53979D03045r434j3214j5183j5890j5277j3723j2109j0709r086p328o371o555
$$ 403045 393611 380397 365214 349324 334047 320324 308215 297506 288420 281092 274721 268166
53967B68166o796n956m385l313l085k877j975o75J82J60m01p06k81N62J131J159
$$ 268166 261370 255414 251029 247716 244631 241754 239779 239104 239286 239446 239045 238339 238058 238620 239751 240910
53951B40910R21O46L38K09O62J690K781L680M551N251N125M027K844K553L179
$$ 240910 241831 242477 242815 243024 243686 245376 248157 251837 256388 261639 266764 270791 273635 276188 279367
53936B79367M123M981N512N383M620L952M073M767N227M998M217L212K331J890
$$ 279367 283490 288471 293983 299366 303986 307938 312011 316778 322005 327003 331220 334432 336763 338653
53922C38653J936K235K760L778N191O259O383N791N168N041N688P036Q386Q878
$$ 338653 340589 342824 345584 349362 354553 360812 367195 372986 378154 383195 388883 395919 404305 413183
53908D13183Q604Q462Q596P954O022L853K436J153r00k944l512k843k603l325
$$ 413183 421787 430249 438845 446799 452821 456674 459110 460263 459363 456419 452907 450064 447461 444136
53894D44136l830l342k678k867l892n303o996q723r788r874r568r420r180q411
$$ 444136 440306 436964 434286 431419 427527 422224 415228 406505 396717 386843 377275 367855 358675 350264
53880C50264p340o449n762n071m504m287m198l808l148k687k700k930k948k616
$$ 350264 342924 336475 330713 325642 321138 316851 312653 308845 305697 303010 300310 297380 294432 291816
53866B91816k219k121k332k474k304k094k262k764l166l206k945k466j856j425
$$ 291816 289597 287476 285144 282670 280366 278272 276010 273246 270080 266874 263929 261463 259607 258182
53852B58182j407j473j026r7N69M69%j40J52L86J97k83o62p58p13p00o23k48L46
$$ 258182 256775 255302 254276 254179 254748 255217 255217 255077 255229 255615 255812 255529 254867 254109 253396 252696 252073 251825 252171
53833B52171P48Q21J000J701K740L630M239M759N202N452N723O506Q051J0219
$$ 252171 252919 253740 254740 256441 259181 262811 267050 271809 277011 282463 288186 294692 302743 312962
53819C12962J2863J6146K0514K6218L2327L5963L3464K3402Q428o527j7774k4271
$$ 312962 325825 341971 362485 388703 421030 456993 490457 513859 522287 515760 497986 473715
53807D73715k6404k4932k1227j7168j3908j1274q694o060l421o65J919L479L651
$$ 473715 447311 422379 401152 383984 370076 358802 350108 344048 340627 339962 341881 345360 349011
53794C49011L352L710M593M968M510M044M253M781M968M972N511O692P712P865
$$ 349011 352363 356073 360666 365634 370144 374188 378441 383222 388190 393162 398673 405365 413077 420942
53780D20942P319O521N222K733r31m874q365j1400j3900j5184j4802j3416j2049
$$ 420942 428261 434782 440004 442737 441806 436932 428567 417167 403267 388083 373281 359865 347816
53767C47816j0904r630q395p743p493o831n548m378l853l654l303k866k532k235
$$ 347816 336912 327282 318887 311144 303651 296820 291272 286894 283041 279387 276084 273218 270686 268451
53753B68451k013k211k871l382l107k083p92L33R11O88m6n33m34k66n31q57n40
$$ 268451 266438 264227 261356 257974 254867 252784 251992 252325 253236 253924 253878 253345 252911 252645 252114 251257 250717
53736B50717L89J240J646J846K100K357K589K881K997K400R92m24q82l37L85O64
$$ 250717 251106 252346 253992 255838 257938 260295 262884 265765 268762 271162 272154 271730 270848 270511 270896 271560
53720B71560P43J074J497J488J035P05P54Q07O00N06R26J593K015K248K691L290
$$ 271560 272303 273377 274874 276362 277397 278102 278856 279663 280263 280769 281695 283288 285303 287551 290242 293532
53704B93532L535L223K711K411K435K701K976K879K223J390R82J159J647K256
$$ 293532 297067 300290 303001 305412 307847 310548 313524 316403 318626 320016 320998 322157 323804 326060
53690C26060K951L482L508L100K665K362J958J344P21K34k25p83j429k054k398
$$ 326060 329011 332493 336001 339101 341766 344128 346086 347430 348151 348385 348160 347377 345948 343894 341496
53675C41496k189j612j344j661j898j358m39k3j52j67L5Jj39K39Q76O32p13j904
$$ 341496 339307 337695 336351 334690 332792 331434 330995 330972 330820 330653 330688 330689 330550 330789 331665 332297 331584 329680
53657C29680k001j604j530j336k80J039J310M12m49m16J17L80K15j5RK93N80O29
$$ 329680 327679 326075 324545 323209 322929 323968 325278 325690 325241 324825 324942 325322 325537 325522 325531 325824 326404 327033
53639C27033N21N90Q69R46O12K80M42R75J422J703K090K632L024L000K626K176
$$ 327033 327554 328144 329013 329959 330571 330851 331293 332268 333690 335393 337483 340115 343139 346139 348765 350941
53623C50941J901J841J807J722J904K650L525L639K910K365K901M195N244N558
$$ 350941 352842 354683 356490 358212 360116 362766 366291 369930 372840 375205 378106 382301 387545 393103
53609C93103N278M616L826L456L950M973N647N442M541L495K817K738K964K808
$$ 393103 398381 402997 406823 410279 414229 419202 424849 430291 434832 438327 441144 443882 446846 449654
53595D49654J953R33M99O64P56L25m30j046j287j218j042r44r22r04j011j513
$$ 449654 451607 452540 453039 453703 454459 454784 454354 453308 452021 450803 449761 448817 447895 446991 445980 444467
53579D44467k362l091l353l249k943k393j775j651k237k863k776k191j896k011
$$ 444467 442105 439014 435661 432412 429469 427076 425301 423650 421413 418550 415774 413583 411687 409676
53565D09676j893j306q67j085j487j221k24O64Q14N98Q17J530J919J481R33J275
$$ 409676 407783 406477 405610 404525 403038 401817 401593 402257 403071 403669 404486 406016 407935 409416 410349 411624
53549D11624K275K692K046J255J196J552J759K185L451N159O384P158Q334J0024
$$ 411624 413899 416591 418637 419892 421088 422640 424399 426584 430035 435194 441578 448736 457070 467094
53535D67094J1317J1704J1784J2105J2245J1617J0537R741R280Q608P584O742
$$ 467094 478411 490115 501899 514004 526249 537866 548403 558144 567424 576032 583616 590358
53523E90358O588P087P912Q778R532J0249J1334J3177J5511J7437J8395J8874
$$ 590358 596946 604033 611945 620723 630255 640504 651838 665015 680526 697963 716358 735232
53511G35232J9844K1534K3264K4497K5508K6742K7970K8597K8590K8480K8501
$$ 735232 755076 776610 799874 824371 849879 876621 904591 933188 961778 990258 1018759
53500A018759K8239K7324K5960K4640K3654K3072K2919K3081K3265K3245K3014
$$ 1018759 1046998 1074322 1100282 1124922 1148576 1171648 1194567 1217648 1240913 1264158 1287172
53489A287172K2610K2028K1376K0915K0800K0909K1034K1060K0944K0743K0616
$$ 1287172 1309782 1331810 1353186 1374101 1394901 1415810 1436844 1457904 1478848 1499591 1520207
53478A520207K0629K0614K0405J9980J9047J6853J3023Q417M448J576q09l091
$$ 1520207 1540836 1561450 1581855 1601835 1620882 1637735 1650758 1659175 1663623 1665199 1664390 1661299
53466A661299m978o508q477j1372j4580j7172j8795j9360j8672j7049j5724j5818
$$ 1661299 1656321 1649813 1641336 1629964 1615384 1598212 1579417 1560057 1541385 1524336 1508612 1492794
53454A492794j7237j9105k0906k2640k4209k5294k5658k5225k4099k2735k1671
$$ 1492794 1475557 1456452 1435546 1412906 1388697 1363403 1337745 1312520 1288421 1265686 1244015
53443A244015k0866j9838j8648j7964j7741j6758j4153j0710p782n704m083k963
$$ 1244015 1223149 1203311 1184663 1166699 1148958 1132200 1118047 1107337 1099555 1093851 1089768 1086805
53431A086805k607k510j738q9J928L936N730O891P265P577Q645J0269J1810J3419
$$ 1086805 1084198 1081688 1079950 1079861 1081789 1085725 1091455 1098346 1105611 1113188 1121833 1132102 1143912 1157331
53417A157331J5659J8229K0254K1698K3227K4838K5825K6257K7195K9144L1447
$$ 1157331 1172990 1191219 1211473 1233171 1256398 1281236 1307061 1333318 1360513 1389657 1421104
53406A421104L3521L5621L7960M0045M1487M2713M4408M6741M9509N2465N5247
$$ 1421104 1454625 1490246 1528206 1568251 1609738 1652451 1696859 1743600 1793109 1845574 1900821
53395A900821N7519N9377O1117O2527O3132O3137O3355O3983O4272O3666O2438
$$ 1900821 1958340 2017717 2078834 2141361 2204493 2267630 2330985 2394968 2459240 2522906 2585344
53384B585344O0937N8965N6295N3195N0078M7143M4497M2010L8919L4382K8594
$$ 2585344 2646281 2705246 2761541 2814736 2864814 2911957 2956454 2998464 3037383 3071765 3100359
53373C100359K2682J7316J2261P402L098q43n489j1510j8473k5939l4203m3166
$$ 3100359 3123041 3140357 3152618 3160020 3163118 3162275 3156786 3145276 3126803 3100864 3066661 3023495
53361C023495n1400n7355o0940o3103o4375o4689o4209o3329o2100o0344n8250
$$ 3023495 2972095 2914740 2853800 2790697 2726322 2661633 2597424 2534095 2471995 2411651 2353401
53350B353401n6178n4048n1519m8643m5963m4118m3640m4689m6599m8025m8038
$$ 2353401 2297223 2243175 2191656 2143013 2097050 2052932 2009292 1964603 1918004 1869979 1821941
53339A821941m6803m4926m2628l9930l7131l4486l1878k9216k6719k4403k1851
$$ 1821941 1775138 1730212 1687584 1647654 1610523 1576037 1544159 1514943 1488224 1463821 1441970
53328A441970j9073j6909j5948j5627j5155j4727j4894j5341j5352j5052j5094
$$ 1441970 1422897 1405988 1390040 1374413 1359258 1344531 1329637 1314296 1298944 1283892 1268798
53317A268798j5280j4690j3139j1381r862q250o392m653l052j051J402L477M633
$$ 1268798 1253518 1238828 1225689 1214308 1204446 1196196 1189804 1185151 1182099 1181048 1182450 1185927 1190560
53304A190560N508P034R245J1438J3129J4399J5616J7222J9464K2000K4031K5174
$$ 1190560 1196068 1203102 1212347 1223785 1236914 1251313 1266929 1284151 1303615 1325615 1349646 1374820
53292A374820K5988K7376K9602L2072L3834L4193L3126L1320K9558K7957K6060
$$ 1374820 1400808 1428184 1457786 1489858 1523692 1557885 1591011 1622331 1651889 1679846 1705906
53281A705906K3702K1321J9193J6946J4142J0948P711M223R2m305p938j0315j2046
$$ 1705906 1729608 1750929 1770122 1787068 1801210 1812158 1819869 1824092 1824184 1819879 1811941 1801626 1789580
53268A789580j4032j6468j8931k1156k3263k5339k7145k8322k8776k8784k8852
$$ 1789580 1775548 1759080 1740149 1718993 1695730 1670391 1643246 1614924 1586148 1557364 1528512
53257A528512k9427l0557l1794l2610l2933l3047l2969l2273l0783k9153k8197
$$ 1528512 1499085 1468528 1436734 1404124 1371191 1338144 1305175 1272902 1242119 1212966 1184769
53246A184769k7865k7412k6595k6074k6390k7131k7539k7460k7146k6529k5318
$$ 1184769 1156904 1129492 1102897 1076823 1050433 1023302 995763 968303 941157 914628 889310
53235H89310k3746k2469k1673k0809j9398j7555j5483j3039j0271q001p287q259
$$ 889310 865564 843095 821422 800613 781215 763660 748177 735138 724867 716866 709579 701320
53223G01320r896j1027j1288j1098j1045j1449j2295j3289j4063j4438j4494j4292
$$ 701320 691424 680397 669109 658011 646966 635517 623222 609933 595870 581432 566938 552646
53211E52646j3675j2494j1010r792r164q936q758q542q390q295q150p934p682
$$ 552646 538971 526477 515467 505675 496511 487575 478817 470275 461885 453590 445440 437506 429824
53198D29824p346o832o194n628n295n262n486n700n477m727l988l867m286m588
$$ 429824 422478 415646 409452 403824 398529 393267 387781 382081 376604 371877 367889 364022 359736 355148
53184C55148m446m140l835l140j812n24l86j678l474m523m288l130j799q44k97
$$ 355148 350702 346562 342727 339587 337775 337251 336865 335187 331713 327190 322902 319772 317973 317129 316832
53169C16832J58P10J062Q03J11k38K14R36J013L39k71k33N2j22o86r91p46k97
$$ 316832 316990 317700 318762 319565 319676 319438 319652 320588 321601 321940 321669 321436 321488 321366 320680 319689 318943 318646
53151C18646J8J67L1o00j491j941j641j028n72k46j7k05q31j249j069q63j231
$$ 318646 318664 318831 318862 318262 316771 314830 313189 312161 311589 311343 311326 311121 310290 309041 307972 307109 305878
53134C05878j621j112N3P09M30o1j53j8O8J78K76J34o9J34N78N21j22m90m7O79
$$ 305878 304257 303145 303198 303907 304337 304276 304123 304105 304173 304351 304627 304761 304692 304826 305404 305925 305803 305313 305266 305945
53114C05945J016J005Q12K26o47r74l05M88K17j076k285k637k279j775j641k092
$$ 305945 306961 307966 308778 309004 308357 307383 307078 307566 307783 306707 304422 301785 299506 297731 296090 293998
53098B93998k689k553j370N5P19N15k5n00o59j71Q15J368Q17k21o48l90k42m48
$$ 293998 291309 288756 287386 287441 288160 288675 288650 288150 287491 287320 288135 289503 290320 290099 289451 289061 288819 288371
53080B88371m65o4K61J32k65o91j097j263r12l61m01j248k140k251j550o27q3
$$ 288371 287906 287842 288103 288235 287970 287279 286182 284919 284007 283646 283245 281997 279857 277606 276056 275429 275346
53063B75346k02p78j142p53J06O41N73M15O97J399K272L134L667L463K595J742
$$ 275346 275144 274366 273224 272471 272577 273218 273791 274206 274903 276302 278574 281708 285375 288838 291433 293175
53047B93175J473J705K009K075J742J021K85Q7M48P58N36Lm25p81j286j799j916
$$ 293175 294648 296353 298362 300437 302179 303200 303485 303572 304020 304778 305314 305317 304892 304111 302825 301026 299110
53030B99110j550j016o41n72q51j402j940k158j970j522j027p28p92j077j116
$$ 299110 297560 296544 295903 295331 294480 293078 291138 288980 287010 285488 284461 283733 282941 281864 280748
53015B80748n40M85J418J811J547Q26J30N1P07J408J274L02n61o36l86p38j725
$$ 280748 280208 280693 282111 283922 285469 286295 286425 286476 287183 288591 289865 290167 289606 288970 288584 287846 286121
52998B86121k400k034r57j5L80L59J50o5l1M66J256J906K108J861J360R64J018
$$ 286121 283721 281687 280730 280715 281095 281454 281604 281539 281508 281974 283230 285136 287244 289105 290465 291429 292447
52981B92447J434J644J313Q41P37P37J94q67j691j782j204oJ787L509M132L548
$$ 292447 293881 295525 296838 297679 298416 299153 299347 298480 296789 295007 293803 293797 295584 299093 303225 306773
52965C06773K780K563K488J993J294P84K86k92l58M87J497J652R46O2p86j680
$$ 306773 309553 312116 314604 316597 317891 318675 318961 318669 318311 318798 320295 321947 322893 322955 322169 320489
52949C20489k210j979j627k145l217l425k221o74K9j62o24j012j275j394j484
$$ 320489 318279 316300 314673 312528 309311 305886 303665 302991 303020 302858 302234 301222 299947 298553 297069
52934B97069j659j607q86J83O26J08n56n83k92m48j032j335r72k91J67J66k03
$$ 297069 295410 293803 292917 293100 293726 293834 293278 292695 292403 291955 290923 289588 288616 288325 288492 288658 288455
52917B88455o29p33l25L29O37K17n99r07j38J145J689R91j32o75o60o72o73j64
$$ 288455 287826 287093 286768 287097 287734 287951 287352 286445 286307 287452 289141 290132 290000 289325 288665 287993 287320 287156
52899B87156P00J033M65l18n52k77L9J98K38J65M3J15N01R72J134P28k37j386
$$ 287156 287856 288889 289354 289036 288484 288207 288246 288444 288682 288847 288890 289005 289506 290478 291612 292340 292103 290717
52881B90717k093j989j400r50q57r11j017j185j160o30J30M50J70j87k28p7J23
$$ 290717 288624 286635 285235 284285 283428 282517 281500 280315 279155 278525 278655 279105 279275 279088 278860 278783 278906
52864B78906N25J120J599J847K170K711L117L012K500J876J264O71J07m74j048
$$ 278906 279431 280551 282150 283997 286167 288878 291995 295007 297507 299383 300647 301318 301425 300951 299903
52849B99903j307j055p89j253k343l085k986k677k864l253l054k168j266q94r56
$$ 299903 298596 297541 296752 295499 293156 290071 287085 284408 281544 278291 275237 273069 271803 270909 269953
52834B69953r80p17l85m50j045j745k031j775j009L42J933K645J705Pp73l90k02
$$ 269953 268973 268256 267871 267421 266376 264631 262600 260825 259816 260158 262091 264736 266441 266448 265675 265285 265083
52817B65083r65j736j536q60o38o33j3J122J873J867J519J213J092J454K481L617
$$ 265083 264118 262382 260846 259986 259348 258715 258702 259824 261697 263564 265083 266296 267388 268842 271323 274940
52801B74940L880K940J358j50j254j885k131k230k316k236j893j582j589j677
$$ 274940 278820 281760 283118 282968 281714 279829 277698 275468 273152 270916 269023 267441 265852 264175
52787B64175j400q43m92n26o50o35n55m53j42N15J314J830J739J132N05L54O60
$$ 264175 262775 261932 261440 260914 260264 259629 259074 258621 258479 258994 260308 262138 263877 265009 265514 265868 266528
52770B66528R85J042R18O84J93n07r66q34k89K42O06Q35Q85P25N21M65N36N53
$$ 266528 267513 268555 269473 270157 270350 269843 268877 268043 267754 267996 268602 269437 270322 271047 271568 272033 272569 273122
52752B73122L32j89p75q89k83M52M70k11p34o01j68J61M09N07J76k89rJ179K184
$$ 273122 273454 273265 272490 271601 271318 271770 272240 272029 271295 270694 270526 270687 271096 271603 271779 271490 271481 272660 274844
52733B74844K045J182N94N20O40R21J410J681J368Q68P05N77p6r63j311j076q73
$$ 274844 276889 278071 278665 279185 279825 280746 282156 283837 285205 286073 286778 287355 287279 286316 285005 283929 283056
52716B83056q97p79m36j87o2K54P49J079J160J154R32K64n56r01o64l16j76j92
$$ 283056 282159 281380 280944 280757 280695 280949 281698 282777 283937 285091 286023 286287 285731 284830 284166 283850 283674 283482
52698B83482l38o32q25o70m15m60o78o56m36l32j91M36J443K210K383K043J257
$$ 283482 283144 282512 281687 281017 280602 280142 279464 278808 278372 278040 277849 278285 279728 281938 284321 286364 287621
52681B87621K66j30P03K096K630J861P34J71J34J99K34K02O5Q8N81J211J253O67
$$ 287621 287887 287757 288460 290556 293186 295047 295781 295952 296086 296285 296519 296721 296786 296874 297455 298666 299919 300586
52663C00586J85J46O3l81p40n66j18J08Q7J72P24J908L370M198L880L140K909
$$ 300586 300771 300917 300980 300599 299859 299293 299175 299283 299370 299542 300266 302174 305544 309742 313622 316762 319671
52646C19671K655J006j809l685l445k475k557l337l244k075j116j031j178r76
$$ 319671 322326 323332 321523 317838 314393 311918 309361 306024 302780 300705 299589 298558 297380 296404
52632B96404p26p65p53j98Q58K043L092L882M281M147L380K036M79p57j418j706
$$ 296404 295678 294913 294160 293962 294820 296863 299955 303837 308118 312265 315645 317681 318160 317403 315985 314279
52616C14279j826j696j304r70r80j191j381j599j884j965j681j344j214r39q8
$$ 314279 312453 310757 309453 308483 307503 306312 304931 303332 301448 299483 297802 296458 295244 294305 294217
52601B94217J048J796K007K006J777J005o6n55k3R12J384J248R46P43N44L49M56
$$ 294217 295265 297061 299068 301074 302851 303856 303790 303235 303212 304124 305508 306756 307702 308445 308989 309338 309794
52584C09794J064J862K248K001J555J451J631J596J209R43J184J662J867J645
$$ 309794 310858 312720 314968 316969 318524 319975 321606 323202 324411 325354 326538 328200 330067 331712
52570C31712J160N09j84n90n29l78o59j332j875k045k080k190k256k099j666r39
$$ 331712 332872 333381 333197 332607 332078 331700 331041 329709 327834 325789 323709 321519 319263 317164 315498 314559
52554C14559l6N83M89o1l13lK55j20q17j086p62k70J28N59R79R86M44j41k07Q8
$$ 314559 314523 315106 315595 315534 315221 315218 315473 315353 314536 313450 312688 312418 312546 313105 314084 315070 315514 315373 315166 315254
52534C15254J10l76q40o85M4P35R03N81J25k20m82p00o72r5R30J745J674P56k84
$$ 315254 315364 314988 314148 313463 313507 314242 315145 315726 315851 315631 315149 314449 313777 313682 314612 316357 318031 318787 318503
52515C18503p76o54k22K98Q60J443K072K805L569M081M152L922L593L056K048
$$ 318503 317727 317073 316851 317149 318009 319452 321524 324329 327898 331979 336131 340053 343646 346702 348750
52500C48750N32j277l160m829n743n427m121k745k039j855j520p29J41N37L64
$$ 348750 349282 348005 344845 340016 334273 328846 324725 321980 319941 318086 316566 315837 315978 316515 316879
52485C16879j3k55l20k98j58J08L31L98N16R28J472J756J742J696J619J260P86
$$ 316879 316866 316611 316291 315993 315835 315943 316274 316672 317188 318116 319588 321344 323086 324782 326401 327661 328447
52468C28447P81J314J714J546J282J505K105K780L615M478M526L269J623Q17O14
$$ 328447 329228 330542 332256 333802 335084 336589 338694 341474 345089 349567 354093 357362 358985 359802 360416
52453C60416k98k233m035m705m446l889l311k933l004l233k914k051j522j796
$$ 360416 360118 357885 353850 349145 344699 340810 337499 334566 331562 328329 325415 323364 321842 320046
52439C20046k260k216j778j315q25l82l91q00p53K00J176J083J25o09o55l42J09
$$ 320046 317786 315570 313792 312477 311652 311270 310879 310079 309326 309526 310702 311785 311910 311301 310646 310304 310413
52422C10413P56J257J036J63n73o07j19M61R00J105J095J202J800K760L523L874
$$ 310413 311169 312426 313462 313625 313052 312445 312326 312787 313687 314792 315887 317089 318889 321649 325172 329046
52406C29046M281N354P230R624J2182J4600J6486J7274J6285J3029P665J207m948
$$ 329046 333327 338681 345911 355535 367717 382317 398803 416077 432362 445391 453056 454263 449315
52393D49315r717j2626j3579j2688j0482q008o368n833n593m613k822j167l56
$$ 449315 439598 426972 413393 400705 390223 382215 375847 370014 364421 359808 356986 355819 355463
52380C55463l5M35Q94P81L29M75J466K489K984L489M673O149O926O710O033N356
$$ 355463 355428 355863 356757 357538 357867 358342 359808 362297 365281 368770 373443 379592 386518 393228 399261 404617
52364D04617M583L481K133Q71m1o35j187j815k269k325k254k340k102q16J056
$$ 404617 409200 412681 414814 415685 415644 415009 413822 412007 409738 407413 405159 402819 400717 399901 400957
52349D00957J940J113j93l60O21J560J909K208K932L829M464M772M958N235N676
$$ 400957 402897 404010 403817 403457 404078 405638 407547 409755 412687 416516 420980 425752 430710 435945 441621
52334D41621O051N968N551N660O932Q937J0774J2189J3470J4613J5426J6294J7921
$$ 441621 447672 453640 459191 464851 471783 480720 491494 503683 517153 531766 547192 563486 581407
52321E81407K0177K1994K2578K2190K1521K0939K0458J9993J9356J8512J7917
$$ 581407 601584 623578 646156 668346 689867 710806 731264 751257 770613 789125 807042
52310H07042J8165J9137J9984K0175K0006J9906J9761J9300J8671J8201J7802
$$ 807042 825207 844344 864328 884503 904509 924415 944176 963476 982147 1000348 1018150
52299A018150J7119J6074J4935J3910J2926J1824J0417Q350N253J290k578n222
$$ 1018150 1035269 1051343 1066278 1080188 1093114 1104938 1115355 1123705 1128958 1130248 1127670 1122448
52287A122448o377o871p628q678r424r659r674r433q394o456m418k996j864l69
$$ 1122448 1116071 1109200 1101572 1092894 1083470 1073811 1064137 1054704 1046310 1039854 1035436 1032440 1030576 1030207
52273A030207J274K317K794L619N252P027Q133Q724R670J1539J4093J6553J8119
$$ 1030207 1031481 1033798 1036592 1040211 1045463 1052490 1060623 1069347 1079017 1090556 1104649 1121202 1139321
52260A139321J8412J7672J6517J5513J4963J4944J5359J5935J6422J6742J6866
$$ 1139321 1157733 1175405 1191922 1207435 1222398 1237342 1252701 1268636 1285058 1301800 1318666
52249A318666J6572J5574J3731J1146Q070M900K014n30k912n028o387o818o885
$$ 1318666 1335238 1350812 1364543 1375689 1383759 1388659 1390673 1390143 1387231 1382203 1375816 1368998 1362113
52236A362113p165p496p413p096p199p823q243p793o554n181m334m325m863n182
$$ 1362113 1354948 1347452 1340039 1332943 1325744 1317921 1309678 1301885 1295331 1290150 1285816 1281491 1276628 1271446
52222A271446m676l485k222j270n97m9N30J318K233K865L119L603M849O368P191
$$ 1271446 1266770 1263285 1261063 1259793 1259196 1259147 1259677 1260995 1263228 1266093 1269212 1272815 1277664 1284032 1291223
52207A291223P208P301Q110R352J0341J0596R924Q587P410P013O938O295N338
$$ 1291223 1298431 1305732 1313842 1323194 1333535 1344131 1354055 1362642 1370052 1377065 1384003 1390298 1395636
52194A395636N386O858Q393Q535P549O757O680O683O218N489M789L884K381M00
$$ 1395636 1401022 1407880 1416273 1424808 1432357 1439114 1445794 1452477 1458695 1464184 1468973 1472857 1475238 1475638
52180A475638j443k809m250o781j0514j4022j5562j4980j3798j3298j3099j2043
$$ 1475638 1474195 1471386 1467136 1460355 1449841 1435819 1420257 1405277 1391479 1378181 1365082 1353039
52168A353039r919p697o256n475m608l172j359K78J445K432L704N246O541P084
$$ 1353039 1343120 1335423 1329167 1323692 1319084 1315912 1314553 1314831 1316276 1318708 1322412 1327658 1334199 1341283
52154A341283O687N284K985N06j015j064l56j0l03o54o48n59p13q20l13P60J487
$$ 1341283 1347970 1353254 1356239 1356745 1355730 1354666 1354310 1354300 1353997 1353343 1352695 1352136 1351423 1350603 1350290 1351050 1352537
52137A352537R27r36l234n030n897n764m684k918q78J295L841O736R350J1230
$$ 1352537 1353464 1352528 1349294 1344264 1338367 1332603 1327919 1325001 1324123 1325418 1329259 1335995 1345345 1356575
52123A356575J2928J5438J8966K2798K6274K9238L1571L2984L3426L3131L2158
$$ 1356575 1369503 1384941 1403907 1426705 1452979 1482217 1513788 1546772 1580198 1613329 1645487
52112A645487L0454K8442K6871K5853K4624K2650K0343J8321J6474J4372J2225
$$ 1645487 1675941 1704383 1731254 1757107 1781731 1804381 1824724 1843045 1859519 1873891 1886116
52101A886116J0818J0532J0889J1113J0851J0255R463Q230O180L494R35j059l043
$$ 1886116 1896934 1907466 1918355 1929468 1940319 1950574 1960037 1968267 1974447 1977941 1978876 1977817 1974774
52088A974774n934r887j4236j8290k1524k3219k2797k0644j7898j5170j2173q781
$$ 1974774 1968840 1958953 1944717 1926427 1904903 1881684 1858887 1838243 1820345 1805175 1793002 1784221
52076A784221n587l125j221M59J862L055M608O893R500J1838J3908J5913J7573
$$ 1784221 1778634 1775509 1774288 1774747 1776609 1779664 1784272 1791165 1800665 1812503 1826411 1842324 1859897
$$ [...]
##END NTUPLES=NMR SPECTRUM
##END=
