
##TITLE=AC1392_ETIA12204_7519551_AAaSXA3IKH
##JCAMPDX= 6.0         $$ Bruker NMR JCAMP-DX V2.0
##DATA TYPE= NMR SPECTRUM
##DATA CLASS= NTUPLES
##ORIGIN= BRUKER
##OWNER= Administrator
$$ 1.72 TOPSPIN		Version 2.1
$$ 2013-02-19 18:53:22.062 -0500  Administrator@X
$$ Compression mode = diff/dup
##.OBSERVE FREQUENCY= 400.02188249412
##.OBSERVE NUCLEUS= ^1H
##.ACQUISITION MODE= SIMULTANEOUS (DQD)
##.ACQUISITION SCHEME= undefined
##.AVERAGES= 64
##.DIGITISER RES= 22
##SPECTROMETER/DATA SYSTEM= spect
##.PULSE SEQUENCE= noesygpps1d.comp
##.SOLVENT NAME= COFFEE_meoh
##.SHIFT REFERENCE= INTERNAL, COFFEE_meoh, 1, 14.96107
##AUDIT TRAIL= $$ (NUMBER, WHEN, WHO, WHERE, PROCESS, VERSION, WHAT)
$$ ##TITLE= Audit trail, TOPSPIN		Version 2.1
$$ ##JCAMPDX= 5.01
$$ ##ORIGIN= Bruker BioSpin GmbH
$$ ##OWNER= Administrator
$$ $$ E:\/data/COFFEE/nmr/AC1392_ETIA12204_7519551_AAaSXA3IKH/12/pdata/1/auditp.txt
$$ ##AUDIT TRAIL=  $$ (NUMBER, WHEN, WHO, WHERE, PROCESS, VERSION, WHAT)
(   1,<2013-02-19 18:53:15.746 -0500>,<Administrator>,<X>,<go>,<TOPSPIN 2.1>,
      <created by zg
	started at 2013-02-19 18:41:46.461 -0500,
	POWCHK enabled, PULCHK disabled,
       configuration hash MD5:
       86 BA 57 50 F2 9D 5C 9B 26 00 A9 28 5F 66 2E 89
       data hash MD5: 64K
       94 79 6F 34 22 AB F1 7D EA 62 1C D0 21 E7 98 D3>)
(   2,<2013-02-19 18:53:18.962 -0500>,<Administrator>,<X>,<proc1d>,<TOPSPIN 2.1>,
      <Start of raw data processing
       efp LB = 0.3 FT_mod = 6 PKNL = 1 PHC0 = 0 PHC1 = 0 SI = 128K 
       data hash MD5: 128K
       72 D1 B2 F4 7B F1 05 75 A2 B6 02 74 E3 67 6D E3>)
(   3,<2013-02-19 18:53:20.158 -0500>,<Administrator>,<X>,<proc1d>,<TOPSPIN 2.1>,
      <pk PHC0 = 255.5475 PHC1 = 0 
       data hash MD5: 128K
       99 D8 BF 3F E7 89 21 75 6D 1E 83 8A 98 77 0F FD>)
(   4,<2013-02-19 18:53:20.967 -0500>,<Administrator>,<X>,<proc1d>,<TOPSPIN 2.1>,
      <abs ABSG = 1 
       data hash MD5: 128K
       ED 58 BB 1E AE 2D 09 05 1C 27 EC 4F 47 37 43 32>)
(   5,<2013-02-19 18:53:21.135 -0500>,<Administrator>,<X>,<proc1d>,<TOPSPIN 2.1>,
      <abs ABSG = 2 
       data hash MD5: 128K
       C9 2E E3 21 36 95 89 D6 FE 6B 15 F7 4D A8 EC 4B>)
(   6,<2013-02-19 18:53:21.304 -0500>,<Administrator>,<X>,<proc1d>,<TOPSPIN 2.1>,
      <abs ABSG = 3 
       data hash MD5: 128K
       B4 3C 85 B3 E6 97 E5 A7 50 89 1E 55 F7 99 FF 31>)
(   7,<2013-02-19 18:53:21.489 -0500>,<Administrator>,<X>,<proc1d>,<TOPSPIN 2.1>,
      <abs ABSG = 4 
       data hash MD5: 128K
       4E 93 73 A2 8E 3A 05 FD DE 5C 41 BA BB D2 EA 26>)
(   8,<2013-02-19 18:53:21.691 -0500>,<Administrator>,<X>,<proc1d>,<TOPSPIN 2.1>,
      <abs ABSG = 5 
       data hash MD5: 128K
       CD E8 04 E0 F8 07 28 E1 6F ED 21 E5 50 32 BD 8E>)
$$ ##END=
$$ 
$$ $$ hash MD5
$$ $$ 9F 95 6F 6A 7A A0 DA 33 49 99 18 CA 11 AE 52 02
##$RELAX= 
##$RELAX= 
##$RELAX= 
##$RELAX= 
##$RELAX= 
##$RELAX= 
##$RELAX= 
##$RELAX= 
$$ Bruker specific parameters
$$ --------------------------
##$DU= <E:\>
##$EXPNO= 12
$$ [...]
150 150 150 150 150 150 150 150
##$TP07= 0
##$TPNAME0= <>
##$TPNAME1= <>
##$TPNAME2= <>
##$TPNAME3= <>
##$TPNAME4= <>
##$TPNAME5= <>
##$TPNAME6= <>
##$TPNAME7= <>
##$TPOAL= (0..7)
0.5 0.5 0.5 0.5 0.5 0.5 0.5 0.5
##$TPOFFS= (0..7)
0 0 0 0 0 0 0 0
##$TUNHIN= 0
##$TUNHOUT= 0
##$TUNXOUT= 0
##$USERA1= <user>
##$USERA2= <user>
##$USERA3= <user>
##$USERA4= <user>
##$USERA5= <user>
##$V9= 5
##$VALIST= <valist>
##$VCLIST= <CCCCCCCCCCCCCCC>
##$VD= 0
##$VDLIST= <DDDDDDDDDDDDDDD>
##$VPLIST= <PPPPPPPPPPPPPPP>
##$VTLIST= <TTTTTTTTTTTTTTT>
##$WBST= 1024
##$WBSW= 4
##$XGAIN= (0..3)
0 0 0 0
##$XL= 0
##$YL= 0
##$YMAX_a= 5861275
##$YMIN_a= -9662150
##$ZGOPTNS= <>
##$ZL1= 120
##$ZL2= 120
##$ZL3= 120
##$ZL4= 120
##$ABSF1= 14.96107
##$ABSF2= -5.597112
##$ABSG= 5
##$ABSL= 3
##$ALPHA= 0
##$AQORDER= 0
##$ASSFAC= 0
##$ASSFACI= 0
##$ASSFACX= 0
##$ASSWID= 0
##$AUNMP= <proc_prof1d_extract.lims>
##$AXLEFT= 0
##$AXNAME= <>
##$AXNUC= <1H>
##$AXRIGHT= 0
##$AXTYPE= 0
##$AXUNIT= <>
##$AZFE= 0.1
##$AZFW= 0.1
##$BCFW= 0
##$BC_mod= 0
##$BYTORDP= 0
##$COROFFS= 0
##$CY= 15
##$DATMOD= 1
##$DC= 0
##$DFILT= <>
##$DTYPP= 0
##$F1P= 0
##$F2P= 0
##$FCOR= 0.5
##$FTSIZE= 131072
##$FT_mod= 6
##$GAMMA= 0
##$GB= 0
##$INTBC= 1
##$INTSCL= 1
##$ISEN= 128
##$LB= 0.3
##$LEV0= 0
##$LPBIN= 0
##$MAXI= 10000
##$MC2= 0
##$MEAN= 0
##$ME_mod= 0
##$MI= 0
##$NCOEF= 0
##$NC_proc= -2
##$NLEV= 6
##$NOISF1= 0
##$NOISF2= 0
##$NSP= 0
##$NTH_PI= 0
##$NZP= 0
##$OFFSET= 14.96107
##$PC= 1
##$PHC0= 255.5475
##$PHC1= 0
##$PH_mod= 1
##$PKNL= yes
##$PPARMOD= 0
##$PPDIAG= 0
##$PPIPTYP= 0
##$PPMPNUM= 2147483647
##$PPRESOL= 1
##$PSCAL= 4
##$PSIGN= 0
##$PYNMP= <proc.py>
##$REVERSE= no
##$SF= 400.020009609284
##$SI= 131072
##$SIGF1= 0
##$SIGF2= 0
##$SINO= 400
##$SIOLD= 131072
##$SPECTYP= <>
##$SREGLST= <1H.CDCl3>
##$SSB= 0
##$STSI= 131072
##$STSR= 0
##$SW_p= 8223.68421052631
##$SYMM= 0
##$S_DEV= 0
##$TDeff= 65536
##$TDoff= 0
##$TI= <>
##$TILT= no
##$TM1= 0
##$TM2= 0
##$TOPLEV= 0
##$USERP1= <user>
##$USERP2= <user>
##$USERP3= <user>
##$USERP4= <user>
##$USERP5= <user>
##$WDW= 1
##$XDIM= 131072
##$YMAX_p= 356800558
##$YMIN_p= -15135
##$CURPLOT= <Network HP LaserJet P1505>
##$CURPRIN= <$Network HP LaserJet P1505>
##$DFORMAT= <normdp>
##$LAYOUT= <+/1D_H.xwp>
##$LFORMAT= <normlp>
##$PFORMAT= <normpl>
##$SURQMSG= 1
$$ End of Bruker specific parameters
$$ ---------------------------------
##NTUPLES= NMR SPECTRUM
##VAR_NAME=  FREQUENCY,     SPECTRUM/REAL,   SPECTRUM/IMAG
##SYMBOL=    X,             R,               I
##VAR_TYPE=  INDEPENDENT,   DEPENDENT,       DEPENDENT
##VAR_FORM=  AFFN,          ASDF,            ASDF
##VAR_DIM=   131072,        131072,          131072
##UNITS=     HZ,            ARBITRARY UNITS, ARBITRARY UNITS
##FACTOR=    0.0627417313425164, 1,          1
##FIRST=     8223.62146879497, 2620,         -62603
##LAST=      0,             4880,            -62552
##MIN=       0,             -15135,          0
##MAX=       8223.62146879497, 356800558,    0
$$ Real data points
##PAGE= N=1
##DATA TABLE= (X++(R..R)), XYDATA
$$ [...]
61689D50140m025l394k338j944k213k506k556k458k148j642j431j872k384k031
$$ 450140 446115 442721 440383 438439 436226 433720 431164 428706 426558 424916 423485 421613 419229 417198
61675D17198q81j02n23j657k366k136j431j050j313j840k017j659j148q73p92
$$ 417198 416317 416215 415692 414035 411669 409533 408102 407052 405739 403899 401882 400223 399075 398202 397410
61660C97410o18k71J10L88M91L88J95J77M43Q28J230J761K429K949L187L424L835
$$ 397410 396792 396521 396631 397019 397510 397898 398093 398270 398713 399541 400771 402532 404961 407910 411097 414521 418356
61643D18356L995L431K422J741J702J951K164K321K359K046J422Q78N96K30n99
$$ 418356 422351 425782 428204 429945 431647 433598 435762 438083 440442 442488 443910 444788 445384 445614 445015
61628D45015j747k703l110k991k553j978j387r16p75j112j744k212k195j829j469
$$ 445015 443268 440565 437455 434464 431911 429933 428546 427630 426855 425743 423999 421787 419592 417763 416294
61613D16294j287j276j435j780k229k691l187l760m399n116n865o320o051n217
$$ 416294 415007 413731 412296 410516 408287 405596 402409 398649 394250 389134 383269 376949 370898 365681
61599C65681m607m726n154n217m911m655m491m115l518k975k504j951j456j279
$$ 365681 361074 356348 351194 345977 341066 336411 331920 327805 324287 321312 318808 316857 315401 314122
61585C14122j280j180j145j472j821j613j122j235k011k425j871r80n73n40m19
$$ 314122 312842 311662 310517 309045 307224 305611 304489 303254 301243 298818 296947 295967 295394 294854 294435
61570B94435l13n24p80n54J00O13O41L12l3l1M56R86Q15j23q72o04L27R07P71
$$ 294435 294122 293598 292818 292264 292364 292977 293618 293930 293897 293866 294322 295308 296123 296000 295128 294524 294851 295758 296529
61551B96529L63J47K26N77J112J570J745J756J752J594J240J075J411J890K001
$$ 296529 296892 297039 297265 297842 298954 300524 302269 304025 305777 307371 308611 309686 311097 312987 314988
61536C14988J889K040K369K411K211K241K437K156J239L00k29o46j285j962k406
$$ 314988 316877 318917 321286 323697 325908 328149 330586 332742 333981 334281 334052 333406 332121 330159 327753
61521C27753k648k672k289j658j362j550j662j380j215j572j896j502p39m21m97
$$ 327753 325105 322433 320144 318486 317124 315574 313912 312532 311317 309745 307849 306347 305608 305187 304690
61506C04690k30N03J023R93Q17P63N55J18j11O8K11R0K06R18J615J512Q21L80
$$ 304690 304460 304963 305986 306979 307796 308559 309114 309232 309121 309189 309400 309490 309696 310614 312229 313741 314562 314942
61488C14942L86L56K05M66J212J643J168L13K3M39R09J012R91J200J632K125K595
$$ 314942 315328 315684 315889 316355 317567 319210 320378 320691 320714 321153 322062 323074 324065 325265 326897 329022 331617
61471C31617K898K756K076J182M82N7k06k30J03M52J57q93j891j995j348p65n42
$$ 331617 334515 337271 339347 340529 341011 341068 340862 340632 340735 341187 341344 340451 338560 336565 335217 334452 333910
61454C33910j53P90J841K328K219J950J686J295Q70P74J060J350J401J385J513
$$ 333910 333757 334547 336388 338716 340935 342885 344571 345866 346736 347510 348570 349920 351321 352706 354219
61439C54219J749K069K572L144L289K704J841J528K094L012L446K926J724O56
$$ 354219 355968 358037 360609 363753 367042 369746 371587 373115 375209 378221 381667 384593 386317 386973
61425C86973M70J164J972K157J708J134P69N70M88O46J065J451J433R39K68j68
$$ 386973 387443 388607 390579 392736 394444 395578 396347 396917 397405 398051 399116 400567 402000 402939 403207 403039
61409D03039k02q1k33q31j548j909j806j625j818k386k795k460j413m43l61j127
$$ 403039 402837 402756 402523 401692 400144 398235 396429 394804 392986 390600 387805 385345 383932 383489 383128 382001
61393C82001j875j872j274p79p55r22p78j89M58O19J94k39PQ80J629J711J375
$$ 382001 380126 378254 376980 376201 375446 374524 373746 373557 374015 374634 374828 374589 374596 375476 377105 378816 380191
61376C80191J110R79P49M44L23M71P83J213J704K042K100K125K376K672K609K111
$$ 380191 381301 382280 383029 383473 383796 384267 385050 386263 387967 390009 392109 394234 396610 399282 401891 404002
61360D04002J433P82M00P68K157M006N358N968O445P180P790P832P504P307P365
$$ 404002 405435 406217 406617 407385 409542 413548 418906 424874 431319 438499 446289 454121 461625 468932 476297
61345D76297P460P389P015O203N024L871L089K625K212J778J490J514J772J878
$$ 476297 483757 491146 498161 504364 509388 513259 516348 518973 521185 522963 524453 525967 527739 529617
61331E29617J355J98q40r70m08k25j073k444l474l899l979l842l401k635j593
$$ 529617 530972 531170 530330 529360 528952 528727 527654 525210 521736 517837 513858 510016 506615 503980 502387
61316E02387l13R60J789K098K482L538N170O848Q297R480J0203J0348J0325J0681
$$ 502387 502074 503034 504823 506921 509403 512941 518111 524959 533256 542736 552939 563287 573612 584293
61302E84293J1244J1231J0248Q630O677M230J229j786m171n861p266q662r998
$$ 584293 595537 606768 617016 625646 632323 636553 637782 635996 631825 625964 618698 610036 600038
61289F00038j1068j1578j1262j0213q956p883o851n666m689m432m581m100k529
$$ 600038 588970 577392 566130 555917 546961 539078 532227 526561 521872 517440 512859 508759 506230
61276E06230o36N68J091J727K868M098M901N272N444N522N574N752O125O546O879
$$ 506230 505594 506162 507253 508980 511848 515946 520847 526119 531563 537085 542659 548411 554536 561082 567961
61261E67961P182P567Q089Q804R665J0279J0144R350Q598Q284P886O671M648K457
$$ 567961 575143 582710 590799 599603 609268 619547 629691 639041 647639 655923 663809 670480 675128 677585
61247F77585O23o23j054p01k44n82j807l111l763l872m041m600n160m922l502
$$ 677585 678208 677585 676531 675830 675586 675004 673197 670086 666323 662451 658410 653810 648650 643728 640226
61232F40226j629o55j052j865k022j644j379j066j91P78Q57L26N74J920L003K906
$$ 640226 638597 637942 636890 635025 633003 631359 629980 628914 628723 629501 630358 630684 631258 633178 636181 639087
61216F39087K478K685K907K085N98l00l38j68J19J011K211K566J632K83m57m04
$$ 639087 641565 644250 647157 649242 649840 649540 649202 649034 649153 650164 652375 654941 656573 656856 656399 655995
61200F55995K34J479L397N773Q297J0698J2626J3811J4347J4443J3993J2891J1662
$$ 655995 656229 657708 661105 666878 675175 685873 698499 712310 726657 741100 755093 767984 779646
61187G79646J1031J0800R913P851N288L136J581L97m09q03j148j891l009m200
$$ 779646 790677 801477 811390 819241 824529 827665 829246 829643 829234 828431 827283 825392 822383 818183
61173H18183n318o297o872o881o749p248q608j0123j0775j0234r209q754r216
$$ 818183 812865 806568 799696 792815 786066 778818 770210 760087 749312 739078 729869 721115 711899
61160G11899j0004j0425j0493j0611j0722j0273r023p416n924m504k858r93O89
$$ 711899 701895 691470 680977 670366 659644 649371 640348 632932 627008 622504 619646 618653 619342
61147F19342J681J637P09l14n67j36j84j724m450p020q391q569q181p612o711
$$ 619342 621023 622660 623369 623055 622488 622352 622168 620444 615994 608974 600583 592014 583833 576221 569510
61132E69510n274l610k388j804j170K59K248L875M825N709O937Q110Q956J0208
$$ 569510 564236 560626 558238 556434 555264 555523 557771 561646 566471 572180 579117 587227 596183 606391
61118F06391J2676J5826J8129J8860J8836J9277K0557K2183K3429K3732K2992
$$ 606391 619067 634893 653022 671882 690718 709995 730552 752735 776164 799896 822888
61107H22888K1769K0870K0446J9849J8577J6922J5268J3226J0083N945J730j987
$$ 822888 844657 865527 885973 905822 924399 941321 956589 969815 979898 985843 987573 985586
61095I85586n522r248j2764j5303j6706j7608j8778k0478k2300k3453k3348k2169
$$ 985586 980064 970816 958052 942749 926043 908435 889657 869179 846879 823426 800078 777909
61083G77909k0790j9952j9578j9098j8230j7103j5809j4255j2538j1028r954r177
$$ 777909 757119 737167 717589 698491 680261 663158 647349 633094 620556 609528 599574 590397
61071E90397q474p764o904n634l957k392j528j388j476j251m37J000K811M417
$$ 590397 581923 574159 567255 561621 557664 555272 553744 552356 550880 549629 549192 550192 553003 557420
61057E57420N241N204M852M875N603O889Q353R653J0670J1538J2511J3658J4726
$$ 557420 562661 567865 572717 577592 583195 590084 598437 608090 618760 630298 642809 656467 671193
61044F71193J5443J5990J6995J8818K0951K2504K3302K4066K5367K6864K7925
$$ 671193 686636 702626 719621 738439 759390 781894 805196 829262 854629 881493 909418
61033I09418K8601K9432L0558L1680L2739L3988L5359L6381L6935L7527L8621
$$ 909418 938019 967451 998009 1029689 1062428 1096416 1131775 1168156 1205091 1242618 1281239
61022A281239M0185M2070M4361M7138N0271N3734N7800O2827O9277P7977Q9751
$$ 1281239 1321424 1363494 1407855 1454993 1505264 1558998 1616798 1679625 1748902 1826879 1916630
61011A916630J04719J22610J44118J71297K06357K50794L06022L74103M57322
$$ 1916630 2021349 2143959 2288077 2459374 2665731 2916525 3222547 3596650 4053972
61002D053972N58274O81165Q30670J004671J184522J333908J414104J409589J344219
$$ 4053972 4612246 5293411 6124081 7128752 8313274 9647182 11061286 12470875 13815094
60993A3815094J268788J221816J193317J127128R66207P02416L84867Q2196j60111
$$ 13815094 15083882 16305698 17499015 18626143 19592350 20294766 20679633 20761829 20601718
60984B0601718l28405m22337m46997m31038m40704n53275p99612j129148j435927
$$ 20601718 20273313 19850976 19403979 18972941 18532237 17978962 17179350 16050202 14614275
60975A4614275j625067j662438j573986j411357j220693j031721q59707p09855
$$ 14614275 12989208 11326770 9752784 8341427 7120734 6089013 5229306 4519451
60967D519451n81856m74288l86202l15664k59076k13052j76005j47265j25549
$$ 4519451 3937595 3463307 3077105 2761441 2502365 2289313 2113308 1966043 1840494
60958A840494j08967r5741q4406p3881o3905n4884m7101m0410l4713l0007k5943
$$ 1840494 1731527 1635786 1551380 1477499 1413594 1358710 1311609 1271199 1236486 1206479 1180536
60947A180536k2139j8993j7280j6739j6132j5001j4317j4821j5730j5863j5194
$$ 1180536 1158397 1139404 1122124 1105385 1089253 1074252 1059935 1045114 1029384 1013521 998327
60936I98327j4430j3695j2548j0983r526q482p694o883n770m014j544J256L918
$$ 998327 983897 970202 957654 946671 937145 928663 920969 914086 908316 904302 902758 904014 907932
60923I07932O357Q675J0873J3034J5404J7977K0279K1910K2953K3606K3826K3682
$$ 907932 914289 922964 933837 946871 962275 980252 1000531 1022441 1045394 1069000 1092826 1116508
60911A116508K3561K3517K2777K0541J7087J3456J0031O107J048m525r210j2429
$$ 1116508 1140069 1163586 1186363 1206904 1223991 1237447 1247478 1253585 1254633 1250108 1240898 1228469
60899A228469j5102j8400k2109k4867k6065k6634k7522k8238k7869k6838k6366
$$ 1228469 1213367 1194967 1172858 1147991 1121926 1095292 1067770 1039532 1011663 984825 958459
60888I58459k6428k5753k3951k2302k1847k1984k1586k0561j9490j8584j7763
$$ 958459 932031 906278 882327 860025 838178 816194 794608 774047 754557 735973 718210
60877G18210j7154j6681j5728j3961j2075j1029j0857j0769j0146q929p429o109
$$ 718210 701056 684375 668647 654686 642611 631582 620725 609956 599810 590881 583452 577343
60865E77343n282m723m011l297l099l258l026k440k460l288l764l206k621l109
$$ 577343 572061 567338 563327 560030 556931 553673 550647 548207 545747 542459 538695 535489 532868 529759
60851E29759m149m645m689m959n161m608l723l527m009m416m790n714o783o940
$$ 529759 525610 520965 516276 511317 506156 501548 497825 494298 490289 485873 481083 475369 468586 461646
60837D61646o240n826o028o017n505n319n848o254n799m793l726k459q81N15J305
$$ 461646 455406 449580 443552 437535 432030 426711 420863 414609 408810 404017 400291 397832 396951 397466 398771
60822C98771J620J627J309J075J622K749L259K607J773J808K331K264J454O96
$$ 398771 400391 402018 403327 404402 406024 408773 412032 414639 416412 418220 420551 422815 424269 424965
60808D24965N35Q09J098J070N49k77r28j191j337j487j303o42q8k43q67j243j210
$$ 424965 425500 426309 427407 428477 429026 428749 427821 426630 425293 423806 422503 421861 421773 421530 420663 419420 418210
60791D18210j297j922k886l672l951l791l512l361l286l131k929k796k692k620
$$ 418210 416913 414991 412105 408433 404482 400691 397179 393818 390532 387401 384472 381676 378984 376364
60777C76364k870l581m202l980k990k023j476j102q29r69j319j043J06J256J699
$$ 376364 373494 369913 365711 361731 358741 356718 355242 354140 353311 352342 351023 349980 350086 351342 353041
60762C53041J873K413L002L027K753K839L078K664J535N36K70N95J266K236L224
$$ 353041 354914 357327 360329 363356 366109 368948 372026 374690 376225 376761 377031 377626 378892 381128 384352
60747C84352L756L866M107M580M592L639K190J044K73p35k351m298o014p059p170
$$ 384352 388108 391974 396081 400661 405253 408892 411082 412126 412399 411664 409313 405015 399001 391942 384772
60732C84772o409n335m757n003n565n660n075m246l561k946k258j731j691j987
$$ 384772 378363 373028 368271 363268 357703 352043 346968 342722 339161 336215 333957 332226 330535 328548
60718C28548k175k162k236k477k521k137j621j369j349j246r25m80m1K64K96J56
$$ 328548 326373 324211 321975 319498 316977 314840 313219 311850 310501 309255 308330 307850 307809 308073 308369 308525
60702C08525K29P62J463J816J652J236Q45O03N95Q87J284J433J294J294J822K717
$$ 308525 308754 309516 310979 312795 314447 315683 316528 317131 317726 318613 319897 321330 322624 323918 325740 328457
60686C28457L449L743L831M043M408M726M851M763M519M342M603N387O222O568
$$ 328457 331906 335649 339480 343523 347931 352657 357508 362271 366790 371132 375735 381122 387344 393912
60672C93912O542O707P055O857N723M295L326K578J258o52k203k702k502k463
$$ 393912 400454 407161 414216 421073 426796 431091 434417 436995 438253 437601 435398 432696 430194 427731
60658D27731k980l735m109l736k895k294k302k473k181j541j234j503j796j583
$$ 427731 424751 421016 416907 413171 410276 407982 405680 403207 401026 399485 398251 396748 394952 393369
60644C93369j002n50m96p80j217j669k166k877l674l955l271k091j400j491j671
$$ 393369 392367 391817 391321 390541 389324 387655 385489 382612 378938 374983 371712 369621 368221 366730 365059
60629C65059j315o10j04Q7K31M99Q33J103J212J184J224J494J832J946J813J605
$$ 365059 363744 363134 363030 363117 363348 363847 364680 365783 366995 368179 369403 370897 372729 374675 376488 378093
60613C78093J308P97K35q2k73o90j185j198o33k2K80M78O41L50n99j657k145j925
$$ 378093 379401 380198 380433 380351 380078 379388 378203 377005 376372 376350 376630 377108 377749 378099 377500 375843 373698 371773
60595C71773j186p7J059J649J519J189J116J093Q01M48L29K20j79n48l70J70M57
$$ 371773 370587 370510 371569 373218 374737 375926 377042 378135 378936 379384 379713 379933 379754 379206 378836 379006 379463
60578C79463M42O83J352J815J502P50N34J507L396N299O477O921P122P415P714
$$ 379463 379905 380588 381940 383755 385257 386007 386541 388048 391444 396743 403220 410141 417263 424678 432392
60563D32392P853P797P466O702N657M816M403L921K602J83k769n153n962n069
$$ 432392 440245 448042 455508 462210 467867 472683 477086 481007 483609 483792 481023 475870 469908 464839
60549D64839l435k198j474m90J136K853M095N073O246P612Q893J0034J1036J1719
$$ 464839 461404 459206 457732 457242 458378 461231 465326 470399 476645 484257 493150 503184 514220 525939
60535E25939J1941J1780J1218J0190R035Q287P682O157L341K54j996l542n036
$$ 525939 537880 549660 560878 571068 580103 588390 596072 602229 605570 605824 603828 600286 595250
60522E95250o350o875o677o355o147n944n850n825n195l493j492m03k32R0J067
$$ 595250 588900 582025 575348 568993 562846 556902 551052 545227 540032 536539 535047 534644 534412 534502 535569
60507E35569K190L105M091N264O392P723J0039J3469J7086K0088K2607K4974K6968
$$ 535569 537759 540864 544955 550219 556611 564334 574373 587842 604928 625016 647623 672597 699565
60494F99565K8344K9472L0787L2026L2529L2022L0605K8209K4573J9657J3808
$$ 699565 727909 757381 788168 820194 852723 884745 915350 943559 968132 987789 1001597
60483A001597P443P92o087j3036j9514k4789k8613l1430l3595l4660l4026l2129
$$ 1001597 1009040 1009832 1003745 990709 971195 946406 917793 886363 852768 818108 784082 751953
60471G51953l0220k8871k7391k4991k1909j9049j6952j5541j4514j3645j2787
$$ 751953 721733 692862 665471 640480 618571 599522 582570 567029 552515 538870 526083
60460E26083j1906j0972r917q761p789p234o878o311n495m711m009l191k366j984
$$ 526083 514177 503205 493288 484527 476738 469504 462626 456315 450820 446109 442100 438909 436543 434559
60446D34559k207k714l166l430l322k740k072j852j872j378l05M04J50m06l31
$$ 434559 432352 429638 426472 423042 419720 416980 414908 413056 411184 409806 409501 409905 410055 409649 409318
60431D09318L06P52P57O97P57P11M61K59L36O29R29J062J002R31J057J253J167
$$ 409318 409624 410376 411133 411830 412587 413298 413759 414018 414354 414983 415912 416974 417976 418907 419964 421217 422384
60414D22384P52M25M37N60O31R49J689K313K216J659J433J699J810J368Q16P53
$$ 422384 423136 423561 423998 424558 425189 426138 427827 430140 432356 434015 435448 437147 438957 440325 441141 441894
60398D41894J160J618J957K297K654K863K855K812K897L045L013K661K121J748
$$ 441894 443054 444672 446629 448926 451580 454443 457298 460110 463007 466052 469065 471726 473847 475595
60384D75595J878K546L397L880L698L088K614K617K917L112L006K676K261J875
$$ 475595 477473 480019 483416 487296 490994 494082 496696 499313 502230 505342 508348 511024 513285 515160
60370E15160J630J537J472J396J463J761K010J920J699J921K783L876M671M994
$$ 515160 516790 518327 519799 521195 522658 524419 526429 528349 530048 531969 534752 538628 543299 548293
60356E48293M989N002N530O926Q911J0685J1673J2013J2120J2114J1848J1201
$$ 548293 553282 558284 563814 570740 579651 590336 602009 614022 626142 638256 650104 661305
60344F61305J0047Q154N478K531N1j789l583n908q503j0426j1068j0757j0196
$$ 661305 671352 679506 684984 687515 687566 685777 682194 676286 667783 657357 646289 635532 625336
60331F25336r545q434o802n292m542m485m581m458m066l471k958k973l555m044
$$ 625336 615791 607357 600555 595263 590721 586236 581655 577197 573131 569660 566702 563729 560174 556130
60317E56130l822l135k618k220j324J74J730L175N022P503R983J1833J3255J4722
$$ 556130 552308 549173 546555 544335 543011 543185 544915 548090 553112 560615 570598 582431 595686 610408
60303F10408J6061J6711J6589J6152J5589J4416J1951Q015L194j586n752r382
$$ 610408 626469 643180 659769 675921 691510 705926 717877 725892 729086 727500 721748 712366
60291G12366j2695j5459j7279j8234j8648j8300j6603j3744j0849q640o658m404
$$ 712366 699671 684212 666933 648699 630051 611751 595148 581404 570555 561915 555257 550853
60279E50853k474j801k234k802l138l723m672n237m842l936l361l271l157k727
$$ 550853 548379 546578 544344 541542 538404 534681 530009 524772 519930 515994 512633 509362 506205 503478
60265E03478k302k318k732l094l052k618j960j226o65o54j305k126k393j837p81
$$ 503478 501176 498858 496126 493032 489980 487362 485402 484176 483511 482857 481552 479426 477033 475196 474415
60250D74415K89R42Q45J34k81N47K292L459L069J756Q10O09N40P1o66j226j260
$$ 474415 474704 475646 476491 476625 476344 476891 479183 482642 485711 487467 488277 488886 489426 489497 488831 487605 486345
60233D86345p55j34M0k48l54J89R71J320J245J322J790K333K676K871L041L246
$$ 486345 485590 485456 485496 485248 484894 485083 486054 487374 488619 489941 491731 494064 496740 499611 502652 505898
60217E05898L606M184M779N158N408N765O185O478O775P398Q258Q847Q865Q580
$$ 505898 509504 513688 518467 523625 529033 534798 540983 547461 554236 561634 569892 578739 587604 596184
60203E96184Q417Q431Q318P798O979O295O004N744M934L656K668K283J785M37
$$ 596184 604601 613032 621350 629148 636127 642422 648426 654170 659104 662760 665428 667711 669496 669933
60189F69933j424k903l736m241m491m487m842o209p961q617p859o992p010p237
$$ 669933 668509 665606 661870 657629 653138 648651 643809 637600 629639 621022 613163 606171 599161 591924
60175E91924o639n546n021n171n146m544l776l173k696k551l122m058m304l419
$$ 591924 585285 579739 574718 569547 564401 559857 556081 552908 550212 547661 544539 540481 536177 532758
60161E32758k273j869k055j948j207k85L49O66P62O34L85K69M35Q15J312J767
$$ 532758 530485 528616 526561 524613 523406 523121 523470 524136 524898 525532 525917 526186 526621 527436 528748 530515
60145E30515J897J584J254J486K225K894L416M457O220P701P781O748N858N708
$$ 530515 532412 533996 535250 536736 538961 541855 545271 549728 555948 563649 571430 578178 584036 589744
60131E89744N864O006O381O867O552M951K923J745J611J774J788J908K306K684
$$ 589744 595608 601614 607995 614862 621414 626365 629288 631033 632644 634418 636206 638114 640420 643104
60117F43104K813K961L464M160M524M221L414K581K082J908J829J717J597J309
$$ 643104 645917 648878 652342 656502 661026 665247 668661 671242 673324 675232 677061 678778 680375 681684
60103F81684M94r68k664l989m629m600m132l736m024n008n810n556m487l647l523
$$ 681684 682178 681210 678546 674557 669928 665328 661196 657460 653436 648428 642618 637062 632575 628928 625405
60088F25405l467k703j389m27m30j116j676j578j048p38r95j509j822j913k030
$$ 625405 621938 619235 617846 617419 616989 615873 614197 612619 611571 610833 609838 608329 606507 604594 602564
60073F02564k180k193k201k528l112l457l440l598m351n285n672n482n312n355
$$ 602564 600384 598191 595990 593462 590350 586893 583453 579855 575504 570219 564547 559065 553753 548398
60059E48398m979l644j959j268k088l319l331j781LN62n4m75L49K149L943N125
$$ 548398 543419 539775 537816 536548 534460 531141 527810 526029 526032 526594 526540 526065 526414 528563 532506 537631
60043E37631N691N713N162M278L698L901M629N060M619L453K152J130L91k84j058
$$ 537631 543322 549035 554197 558475 562173 566074 570703 575763 580382 583835 585987 587117 587508 587224 586166
60028E86166j907k692l359m101n173o442p305p296o732o446o855p492p604o999
$$ 586166 584259 581567 578208 574107 568934 562492 555187 547891 541159 534713 527858 520366 512762 505763
60014E05763o177n664n382m737l407j982j482k138l001l091k616k422k560k230
$$ 505763 499586 493922 488540 483803 480396 478414 476932 474794 471793 468702 466086 463664 461104 458874
60000D58874j171k09p3m03n19m40m87l20O90K281L346L249K555K258K734L604
$$ 458874 457703 457494 457421 457018 456499 456059 455572 455252 455942 458223 461569 464818 467373 469631 472365 475969
59984D75969M213M125L369K466J995K032K118J802J043J06p88j622k507l451m141
$$ 475969 480182 484307 487676 490142 492137 494169 496287 498089 499132 499238 498450 496828 494321 490870 486729
59969D86729m094l168j897j088j089j564j891j659q71J49J000J510J753J855J842
$$ 486729 482635 479467 477570 476482 475393 473829 471938 470279 469408 469557 470557 472067 473820 475675 477517
59954D77517J754J657J485J076M67l9j99m5L36Q88J345J307P79L12K84L81J76
$$ 477517 479271 480928 482413 483489 483956 483917 483718 483673 484009 484897 486242 487549 488328 488640 488924 489305 489481
59937D89481j46j66p4m73j359j912j505m92L22O98J126K027L117L762L885M131
$$ 489481 489335 489169 489095 488622 487263 485351 483846 483354 483676 484374 485500 487527 490644 494406 498291 502422
59921E02422M967N949O261N925N778O277O901O980O545O026N591N233N003M739
$$ 502422 507389 513338 519599 525524 531302 537579 544480 551460 558005 564031 569622 574855 579858 584597
59907E84597L913K186q1k222l817m580m348l580l316l999m804m765l969k966j647
$$ 584597 588510 590696 590615 588393 584576 579996 575648 572068 568752 564753 559949 555184 551215 548249 546602
59892E46602K88K182K985K858L071M177N343N683N347M999M978N320O000O764
$$ 546602 546890 549072 552057 554915 557986 562163 567506 573189 578536 583535 588513 593833 599833 606597
59878F06597P195P163O832O269N464M692M189L542K085o9k083l487m511n301n702
$$ 606597 613792 620955 627787 634056 639520 644212 648401 651943 654028 653959 651876 648389 643878 638577 632875
59863F32875n911o426p121p211o487n705n355m920l834k408j256m30L04R91J738
$$ 632875 626964 620538 613417 606206 599719 594014 588659 583739 579905 577497 576241 575811 576115 577106 578844
59848E78844K837M108M724M303L613L551M004M300M233L926L174J749J06r82j342
$$ 578844 581681 585789 590513 594816 598429 601980 605984 610284 614517 618443 621617 623366 623472 622490 621148
59833F21148j362j267j062r87j431k345l284l944m331m478m409m240m026l650
$$ 621148 619786 618519 617457 616470 615039 612694 609410 605466 601135 596657 592248 588008 583982 580332
59819E80332l151k864k895k818k317j722j510j596j672j824k208k400j880j067
$$ 580332 577181 574317 571422 568604 566287 564565 563055 561459 559787 557963 555755 553355 551475 550408
59805E50408j035k109l435m039l849l420l135k954k648k062j280o44m40o00p95
$$ 550408 549373 547264 543829 539790 535941 532521 529386 526432 523784 521722 520442 519798 519358 518758 517963
59790E17963p90n38j57P4j37o71r68o77q8L90Q63J541K039J693N51m91o57l4O66
$$ 517963 517173 516635 516478 516552 516415 515744 514776 514099 514011 514401 515264 516805 518844 520537 521088 520597 519940 519906 520572
59771E20572Q05K75l60k93O61J773K270K231K218K274K037J605J476J579J297
$$ 520572 521377 521652 521292 520999 521660 523433 525703 527934 530152 532426 534463 536068 537544 539123 540420
59756E40420O76P07J897L374M086M212M543M939M550L396K625K857L273K901K100
$$ 540420 541096 541803 543700 547074 551160 555372 559915 564854 569404 572800 575425 578282 581555 584456 586556
59741E86556J948K548K844K133R77L60M31N60K32m50j034j202j024r12j187j554
$$ 586556 588504 591052 593896 596029 597006 597366 597797 598357 598589 598139 597105 595903 594879 593967 592780 591226
59725E91226j288j44J172J742J432P81K29j43k86j90j55m90r25q98m40k12m67
$$ 591226 589938 589794 590966 592708 594140 594921 595150 595007 594721 594531 594376 593886 592961 592063 591623 591411 590944
59708E90944o17n5J063K168K933L292L272L123L251L691L989L916L807L903L873
$$ 590944 590327 590272 591335 593503 596436 599728 603000 606123 609374 613065 617054 620970 624777 628680 632553
59693F32553L421K926K911L189L228L070L178L438L042J599k12j343j441r63n61
$$ 632553 635974 638900 641811 645000 648228 651298 654476 657914 660956 662555 662343 661000 659559 658596 658035
59678F58035n90j081j883k749l376l582l500l510l862m417m874n094n055m619
$$ 658035 657445 656364 654481 651732 648356 644774 641274 637764 633902 629485 624611 619517 614462 609843
59664F09843l688k517j484o27K27R53J272J372J783K543L116L301L591M332N131
$$ 609843 606155 603638 602154 601527 601754 602707 603979 605351 607134 609677 612793 616094 619685 624017 629148
59649F29148N462N289M820M064L104K207J323nj829l442m344m967n904o976p653
$$ 629148 634610 639899 644719 648783 651887 654094 655417 655412 653583 650141 645797 640830 634926 627950 620297
59634F20297p880p795p124n735m356l862m054l958l243k537k445k916l598m175
$$ 620297 612417 604622 597498 591763 587407 583545 579491 575533 572290 569753 567308 564392 560794 556619
59620E56619m312l894l241k782k558k509k855l626m184l932l242k911k938k598
$$ 556619 552307 548413 545172 542390 539832 537323 534468 530842 526658 522726 519484 516573 513635 511037
59606E11037j633m62O49J757K558K493J696J000P38L65m46j122r82j99N32P91
$$ 511037 509404 508942 509591 511348 513906 516399 518095 519095 519833 520198 519752 518630 517648 517449 517981 518772
59590E18772O61N00O70J162J447J096N12M54Q89J004M45k33n95r90j873k984l706
$$ 518772 519433 519933 520603 521765 523212 524308 524820 525274 526163 527167 527612 527379 526784 525794 523921 520937 517231
59573E17231l778l322k558j792j294r78n63j80l38j079j706j649j127o49l73k68
$$ 517231 513453 510131 507573 505781 504487 503509 502946 502766 502428 501349 499643 497994 496867 496218 495845 495577
59557D95577m31q20j020o72M8O99J025J040R58J136J743K404K652K765L514M980
$$ 495577 495146 494326 493306 492634 492682 493381 494406 495446 496404 497540 499283 501687 504339 507104 510618 515598
59541E15598O409P521R062J1416J3487J3865J2647J1253J0691J0772J0817J0243
$$ 515598 522007 529528 538590 550006 563493 577358 590005 601258 611949 622721 633538 643781
59529F43781Q428M954L50l843o178o339n074l416k009r72j34N51Q56N41l71j675
$$ 643781 652209 657163 657513 653670 647492 641153 636079 632663 630654 629682 629548 630099 630955 631496 631125 629450
59513F29450l200m788o185p155p638p688p424p147p287p942q558q415p360n918
$$ 629450 626250 621462 615277 608122 600484 592796 585372 578225 570938 562996 554438 546023 538663 532745
59499E32745m629l559k516j577j094j182j387j143n10j19k59l66K21J310K116
$$ 532745 528116 524557 522041 520464 519370 518188 516801 515658 515148 515029 514770 514404 514625 515935 518051
59484E18051K377K657L476M578N262N154M491L832L577L612L533L336L604M631
$$ 518051 520428 523085 526561 531139 536401 541555 546046 549878 553455 557067 560600 563936 567540 572171
59470E72171N643N511M184K699J751R84p2j070j349q39k5O96J224J589J891K279
$$ 572171 577814 583325 587509 590208 591959 592943 592871 591801 590452 589613 589588 590284 591508 593097 594988 597267
59454E97267K828L584M735O332P813Q335P730O649N600M396K840J273L0j126k530
$$ 597267 600095 603679 608414 614746 622559 630894 638624 645273 650873 655269 658109 659382 659412 658286 655756
59439F55756m013n250o362p638q981j0034j0570j0344q989o647m398l350l356
$$ 655756 651743 646493 640131 632493 623512 613478 602908 592564 583575 576928 572530 569180 565824
59426E65824l161j783O16L170N184O612P950R691J1731J3524J4927J6552J8916
$$ 565824 562663 560880 561496 564666 569850 576462 584412 594103 605834 619358 634285 650837 669753
59413F69753K1549K3271K3096K0708J6602J2188R154P884O705L484j962p616j1237
$$ 669753 691302 714573 737669 758377 774979 787167 796321 804205 810910 814394 812432 804816 793579
59400G93579j2072j0832q839p330o772o476n334l343k058l253p243j2588j7129
$$ 793579 781507 770675 761836 754506 747734 741258 735924 732581 730523 727270 720027 707439 690310
59387F90310j9302j8905j6966j4789j2925j1123r104o986m939k864p46J038K071
$$ 690310 671008 652103 635137 620348 607423 596300 587196 580210 575271 572407 571661 572699 574770
59374E74770K491K857L511M258M754N020N395O019O550O585O284O312P030Q031
$$ 574770 577261 580118 583629 587887 592641 597661 603056 609075 615625 622210 628494 634806 641836 649867
59360F49867Q692R014R566J0660J1911J2702J2810J2502J2214J2261J2680J3183
$$ 649867 658559 667573 677139 687799 699710 712412 725222 737724 749938 762199 774879 788062
59348G88062J3387J3216J2976J2932J2944J2704J2182J1523J0552Q831O403M119
$$ 788062 801449 814665 827641 840573 853517 866221 878403 889926 900478 909309 915712 919831
59336I19831K745J955O83j531m134o528q826j1226j3260j4265j4240j3852j3683
$$ 919831 922576 924531 925214 923683 919549 913021 904195 892969 879709 865444 851204 837352 823669
59323H23669j3962j4628j5131j4501j2377r722p843o818n735m318l271k909k537
$$ 823669 809707 795079 779948 765447 753070 743348 735505 728687 722952 718634 715363 712454 709917
59310G09917j621o06p0K42Q85J872K986M382O201Q004R243R996J0513J0360Q770
$$ 709917 708296 707690 707620 707862 708747 710619 713605 717987 724188 732192 741435 751431 761944 772304 781074
59295G81074N837K711L95j345l666p328j1770j5456j7253j7306j6438j5001j2908
$$ 781074 786911 789622 790017 788672 785006 777678 765908 750452 733199 715893 699455 684454 671546
59282F71546j0508q511o933n044k717q85j43K78J453L333N148O618P958R096R771
$$ 671546 661038 652527 645594 640550 637833 636948 636805 637083 638536 641869 647017 653635 661593 670689 680460
59267F80460J0118J0428J0545J0095R075P678N848L574J223r60l284n878q060
$$ 680460 690578 701006 711551 721646 730721 738399 744247 747821 749044 748084 744800 738922 730862
59254G30862r209r770j0501j1124j0771r477q165p255o355n238m135k967j368
$$ 730862 721653 711883 701382 690258 679487 670010 661845 654590 648235 642997 638862 635895 634527
59241F34527L38J189R06L79N10J299K277L094L385K833J773J121J343J965K258
$$ 634527 634865 636054 636960 637339 637849 639148 641425 644519 647904 650737 652510 653631 654974 656939 659197
59226F59197J913R05n99j933k336j999k032k955l862l647k493j542j401j606j427
$$ 659197 661110 662015 661416 659483 657147 655148 653116 650161 646299 642652 640159 638617 637216 635610 634183
59211F34183o93K06Q27J152J542K166K624K457J951J903K516L093L029K595K449
$$ 634183 633490 633696 634523 635675 637217 639383 642007 644464 646415 648318 650834 653927 656956 659551 662000
59196F62000K773L215L358K944J950P28j38l34j4N27J134J631J760J418P92J10
$$ 662000 664773 667988 671346 674290 676240 676968 676830 676496 676482 677009 678143 679774 681534 682952 683744 683854
59180F83854m15m87M8Q24J238J263J497K256L069L329L085K913L300M340N771
$$ 683854 683439 682952 683000 683824 685062 686325 687822 690078 693147 696476 699561 702474 705774 710114 715885
59165G15885P049P672P612P308P180P344P734Q036P578N800L005K76j526k390
$$ 715885 722934 730606 738218 745526 752706 760050 767784 775820 783398 789198 792203 792479 790953 788563
59151G88563k814l325m363n979p553q332q345q265q306q079p650p793q695r357
$$ 788563 785749 782424 778061 772082 764529 756197 747852 739587 731281 723202 715552 707759 699064 689707
59137F89707q986q259q330r083r367q608p326o188n359m767m252l424j952j42
$$ 689707 680721 672462 664132 655049 645682 637074 629748 623560 618201 613434 609182 605758 603806 603664
59123F03664J273J984K352K833L697N186P356R588J0894J1064J1024J1682J2721
$$ 603664 604937 606921 609273 612106 615803 620989 628345 637933 648827 659891 670915 682597 695318
59110F95318J3008J2083J0758J0106J0198J0104R023P163N331L954K815J642N33
$$ 695318 708326 720409 731167 741273 751471 761575 770598 777761 783092 787046 789861 791503 792036
59097G92036l24r85j551j928k035k090k349k714k915k940k987l025k824k487k553
$$ 792036 791712 790727 789176 787248 785213 783123 780774 778060 775145 772205 769218 766193 763369 760882 758329
59082G58329l323m382n095n474o189p593r067r608q952p819p081o973p171p274
$$ 758329 755006 750624 745529 740055 733866 726273 717206 707598 698646 690827 683746 676773 669602 662328
59068F62328p013o311n416m832m785m899m670m135l697l483l233k832k512k448
$$ 662328 655315 649004 643588 638756 633971 629072 624402 620267 616570 613087 609854 607022 604510 602062
59054F02062k523k544k453k260j981j653j270p49j72J28J0j49K2K66R4l34l86
$$ 602062 599539 596995 594542 592282 590301 588648 587378 586629 586457 586585 586595 586446 586468 586734 586828 586494 586108
59037E86108K3L02J50J4K97P57J018J189J574K229L112M252N504O551P512Q967
$$ 586108 586131 586433 586583 586597 586894 587651 588669 589858 591432 593661 596773 601025 606529 613080 620592 629559
59021F29559J1027J2796J3356J2901J2349J2078J1642J0615R105P348N372L208
$$ 629559 640586 653382 666738 679639 691988 704066 715708 726323 735428 742776 748148 751356
59009G51356J114o14j915k901l578l731l116j781j41J368K621L638M243M228L826
$$ 751356 752470 751856 749941 747040 743462 739731 736615 734834 734693 736061 738682 742320 746563 750791 754617
58994G54617L571L609L494K817J663L76q52j956k918l838m784n446n350m525l595
$$ 754617 758188 761797 765291 768108 769771 770147 769295 767339 764421 760583 755799 750353 745003 740478 736883
58979G36883k960k321j273J18J589L101M576N652O163O557P360Q472R411J0033
$$ 736883 733923 731602 730329 730447 732036 735137 739713 745365 751528 758085 765445 773917 783328 793361
58965G93361J0496J0714J0352R331P921O412M991L849K924J678m41l202n761p659
$$ 793361 803857 814571 824923 834254 842175 848587 853578 857427 860351 862029 861588 858386 852625 844966
58951H44966r324j1310j3445j5052j5867j6252j6404j5802j3847j1001q656p620
$$ 844966 835642 824332 810887 795835 779968 763716 747312 731510 717663 706662 698006 690386
58939F90386p234o366m923l732l200k920k599k497k748k989l074l390m041m369
$$ 690386 683152 676786 671863 668131 664931 662011 659412 656915 654167 651178 648104 644714 640673 636304
58925F36304l955l470l764m511m591l627k316j304n70j17m01j563k701k563r34
$$ 636304 632349 628879 625115 620604 616013 612386 610070 608766 608196 608079 607678 606115 603414 600851 599917
58910E99917J101K348K713L092M233O011P795R152J0002J0371J0482J0876J1942
$$ 599917 601018 603366 606079 609171 613404 619415 627210 636362 646364 656735 667217 678093 690035
58897F90035J3233J3771J3248J2530J2667J3649J4496J4436J3747J3365J3867
$$ 690035 703268 717039 730287 742817 755484 769133 783629 798065 811812 825177 839044
58886H39044J4902J5713J6086J6409J6679J6050J3856J0698P717N086K080j432
$$ 839044 853946 869659 885745 902154 918833 934883 948739 959437 967154 972240 974320 972888
58874I72888m527o515p698q552q968q886q931r696j0759j1093j0235q717p508
$$ 972888 968361 961846 954148 945596 936628 927742 918811 909115 898356 887263 877028 868311 860803
58861H60803p283p955q726q940q917r470j0598j1424j1545j1654j2323j3009j2874
$$ 860803 853520 845565 836839 827899 818982 809512 798914 787490 775945 764291 751968 738959 726085
58848G26085j1953j0880j0013r403r131r108q916q399p922p648p144o238n583
$$ 726085 714132 703252 693239 683836 674705 665597 656681 648282 640360 632712 625568 619330 613747
58835F13747n715o153o168n873n750n600m845l538k268j295n44j16j15j92K5M26
$$ 613747 608032 601879 595711 589838 584088 578488 573643 570105 567837 566542 565998 565882 565767 565575 565600 566026
58819E66026R04J835L312M402M145K933J959J665J681J919K486K775J948M25l27
$$ 566026 566930 568765 572077 576479 580624 583557 585516 587181 588862 590781 593267 596042 597990 598415 598088
58804E98088K86J271J541J084L19o91j849k619k674k467k677l395m112m262l613
$$ 598088 598374 599645 601186 602270 602589 601898 600049 597430 594756 592289 589612 586217 582105 577843 574230
58789E74230k429j340p37k54P66K340L827M774N308N725O170O704P149O913N504
$$ 574230 571801 570461 569724 569470 570236 572576 576403 581177 586485 592210 598380 605084 612233 619146 624650
58774F24650L273J150l29j234j715j960k645m466o974q625q484p335o646o818
$$ 624650 627923 629073 628744 627510 625795 623835 621190 616724 609750 601125 592641 585306 578660 571842
58760E71842o924o037m351k925k452k566k409j758j111p03q5J035K156K694K835
$$ 571842 564918 558881 554530 551605 549153 546587 544178 542420 541309 540606 540521 541556 543712 546406 549241
58745E49241L084L472L849M467N520O533P014P306P913Q410Q096P361P292Q041
$$ 549241 552325 555797 559646 564113 569633 576166 583180 590486 598399 606809 614905 622266 629558 637599
58731F37599Q737Q974R092Q986Q013O420N575O057O607N865M318L572M186N139
$$ 637599 646336 655310 664402 673388 681401 687821 693396 699453 706060 711925 716243 719815 724001 729140
58717G29140N363N099N527P250R348J0150R024P059N611M619L051O66j641l306
$$ 729140 734503 739602 745129 752379 761727 771877 780901 787960 793571 798190 801241 801907 800266 796960
58703G96960m943p391j0536j3480j5475j6528j7304j8423j9611j9806j8541j6750
$$ 796960 792017 784626 774090 760610 745135 728607 711303 692880 673269 653463 634922 618172
58691F18172j5621j5026j4032j2522j1212j0266r112p729o840o591o130m892l415
$$ 618172 602551 587525 573493 560971 549759 539493 530381 522652 515812 509221 503091 498199 494784
58678D94784k464k176k372k831l011k334j081j64K59J080K825M860O450P685Q879
$$ 494784 492320 490144 487772 484941 481930 479596 478515 478351 478610 479690 482515 487375 493825 501510 510389
58663E10389R810J0122R911R449Q805P958O799M927K122r44l311m998o668q133
$$ 510389 520199 530321 540232 549681 558486 566444 573243 578170 580292 579348 576037 571039 564371 556238
58649E56238q455p691p080p074o637n170l654k983k504j394l02k38p13l90Q93
$$ 556238 547783 540092 533012 525938 519301 514131 510477 507494 504990 503596 503294 503056 502343 501953 502846
58634E02846K021K268J987J800J946K303K440J827N37o20j068j092j048o82J90
$$ 502846 504867 507135 509122 510922 512868 515171 517611 519438 519975 519355 518287 517195 516147 515465 515655
58619E15655J011J293J488K262L370M079M298M439M535M203L351K264J280P65
$$ 515655 516666 517959 519447 521709 525079 529158 533456 537895 542430 546633 549984 552248 553528 554293
58605E54293J036J780K099J611J012R81J173R39L95Rk45n79p04l83j22m20p50
$$ 554293 555329 557109 559208 560819 561831 562812 563985 564924 565319 565328 565083 564504 563800 563417 563295 562875 562125
58588E62125j81J358L267N317P544R452J0396J0621J0957J1540J1735J1287J0683
$$ 562125 561944 563302 566569 571886 579430 588882 599278 609899 620856 632396 644131 655418 666101
58575F66101J0293R917R308Q532P788P355P706R107J1161J3253J5318J7650K0127
$$ 666101 676394 686311 695619 704151 711939 719294 727000 736107 747268 760521 775839 793489 813616
58562H13616K2296K4082K5748K7074K7320K6206K4361K2496K0491J7587J3331
$$ 813616 835912 859994 885742 912816 940136 966342 990703 1013199 1033690 1051277 1064608
58551A064608Q119K854j746n477q380j0420j1651j2412j2997j3369j3626j4444
$$ 1064608 1072727 1075581 1073835 1068358 1059978 1049558 1037907 1025495 1012498 999129 985503 971059
58539I71059j6279j8389j9634k0152k1122k2715k3591k2900k1516k0537j9673
$$ 971059 954780 936391 916757 896605 875483 852768 829177 806277 784761 764224 744551
58528G44551j8086j5930j3956j2256j0421q468o659m820k751r80k63n78j263j880
$$ 744551 726465 710535 696579 684323 673902 665434 658775 653955 651204 650224 649961 649383 648120 646240
58514F46240k254k144j563j154j476k188k508k176j495p53j42J11J1j77m39j044
$$ 646240 643986 641842 640279 639125 637649 635461 632953 630777 629282 628529 628387 628498 628509 628332 627893 626849
58498F26849j760j817j127o03p03n78N12J830K226J911K112L426N393P306Q697
$$ 626849 625089 623272 622145 621542 620839 620261 620773 622603 624829 626740 628852 632278 637671 644977 653674
58483F53674R427R961J1101J2867J4289J4791J4947J5238J5124J4179J3097J2470
$$ 653674 663101 673062 684163 697030 711319 726110 741057 756295 771419 785598 798695 811165
58471H11165J1515R165N630J771k156n981q767r887j0109j0329r969q106n284
$$ 811165 822680 831845 837475 839246 837090 831109 822342 812455 802346 792017 782048 773942 768658
58458G68658k686k52K709N696P600Q584R626J0568J0369R029P383N354K224j472
$$ 768658 765972 765720 768429 774125 781725 790309 799935 810503 820872 829901 837284 842638 844862 843390
58444H43390m230n826p411r318j0552j0740j0709j0696r672p137m140j860l04
$$ 843390 839160 833334 825923 816605 806053 795313 784604 773908 764236 757099 752959 751099 750795
58431G50795R77K038K979M287O118P929R130R582R442R102R118R470R223P710
$$ 750795 751772 753810 756789 761076 767194 775123 784253 793835 803277 812379 821497 830967 840190 847900
58417H47900N566L611J422j622m631o209o764p926r863j1072j0877j0258r891
$$ 847900 853466 857077 858499 856877 852246 846037 839273 831347 821484 810412 799535 789277 779386
58404G79386r243q029o871n955m552k468o19L43Q21J287J714K284L352M442M528
$$ 779386 770143 762114 755243 749288 744736 742268 741649 741992 742813 744100 745814 748098 751450 755892 760420
58389G60420L630K904K904K952K485J703P42m29j161n95P92J507J232J188K102
$$ 760420 764050 766954 769858 772810 775295 776998 777740 777311 776150 775555 776347 777854 779086 780274 782376
58374G82376L356M421N558O628O847O317O323P469Q913R939J0940J2232J3318
$$ 782376 785732 790153 795711 802339 809186 815503 821826 829295 838208 848147 859087 871319 884637
58361H84637J3952J4629J5459J5718J5047J3930J2632J0880Q906P461O491N168
$$ 884637 898589 913218 928677 944395 959442 973372 986004 996884 1005790 1013251 1019742 1024910
58349A024910L471K314J862J379R52J628L425M974N700O560Q079R417J0150J1163
$$ 1024910 1028381 1030695 1032557 1033936 1034888 1036516 1039941 1044915 1050615 1057175 1065254 1074671 1084821 1095984
58335A095984J2917J4487J5197J5632J6211J6269J5476J4570J3884J2578J0307
$$ 1095984 1108901 1123388 1138585 1154217 1170428 1186697 1202173 1216743 1230627 1243205 1253512
58324A253512Q113O798N729M137K304O69q70k014j877n26O52Q62R55J901L569
$$ 1253512 1261625 1268423 1274152 1278289 1280593 1281262 1280392 1278378 1276501 1275975 1276627 1277489 1278444 1280345 1283914
58309A283914N516P697R783J1156J1944J2839J3693J3878J3942J5043J6666J7069
$$ 1283914 1289430 1297127 1306910 1318066 1330010 1342849 1356542 1370420 1384362 1399405 1416071 1433140
58297A433140J6199J5803J6391J6548J5740J5207J5429J5375J5038J5987J8445
$$ 1433140 1449339 1465142 1481533 1498081 1513821 1529028 1544457 1559832 1574870 1590857 1609302
58286A609302K0494K1246K2069K3643K4677K4736K5426K7349K8798K8960K9516
$$ 1609302 1629796 1651042 1673111 1696754 1721431 1746167 1771593 1798942 1827740 1856700 1886216
58275A886216L1348L2710L2539L2706L4826L7581L9347M0868M3168M5379M6798
$$ 1886216 1917564 1950274 1982813 2015519 2050345 2087926 2127273 2168141 2211309 2256688 2303486
58264B303486M8667N1737N4476N5796N7008N9132O0868O1320O1955O3659O4701
$$ 2303486 2352153 2403890 2458366 2514162 2571170 2630302 2691170 2752490 2814445 2878104 2942805
58253B942805O3958O3351O4618O6482O7506O8966P2251P6210P9643Q3664Q9128
$$ 2942805 3006763 3070114 3134732 3201214 3268720 3337686 3409937 3486147 3565790 3649454 3738582
58242C738582R4576R9188J04792J12477J20403J27417J35320J45039J54413J62480
$$ 3738582 3833158 3932346 4037138 4149615 4270018 4397435 4532755 4677794 4832207 4994687
58232D994687J71996J84673J98146K10866K25524K44174K64543K84810L07259
$$ 4994687 5166683 5351356 5549502 5760368 5985892 6230066 6494609 6779419 7086678
58223G086678L33327L60127L86168M15194M49923M87678N26984N72386O27441
$$ 7086678 7420005 7780132 8166300 8581494 9031417 9519095 10046079 10618465 11245906
58214A1245906O89497P57334Q37143R34407J047074J173962J322547J501055J711177
$$ 11245906 11935403 12692737 13529880 14464287 15511361 16685323 18007870 19508925 21220102
58205B1220102J957440K255720K624950L082024L655525M390690N325148O470889
$$ 21220102 23177542 25433262 28058212 31140236 34795761 39186451 44511599 50982488
58197E0982488P836058R453103J1372336J3648969J6349778J9507434K2955134
$$ 50982488 58818546 68271649 79643985 93292954 109642732 129150166 152105300
58190A52105300K6161701K8307964K8671411K7081336K4097888K0723708J7732304
$$ 152105300 178267001 206574965 235246376 262327712 286425600 307149308 324881612
58183C24881612J4997303J1387229N534414k955703j2864635k1937996k8233686
$$ 324881612 339878915 351266144 356800558 353844855 340980220 319042224 290808538
58176B90808538l1113634l1199828k9608630k7239642k4551195k1710435j8812043
$$ 290808538 259694904 228495076 198886446 171646804 147095609 125385174 106573131
58169A06573131j5985848j3381906j1106098r186695p597419o296865n242649
$$ 106573131 90587283 77205377 66099279 56912584 49315165 43018300 37775651
58162C7775651m389203l694496l129181k671142k296134j982261j718357j499200
$$ 37775651 33386448 29691952 26562771 23891629 21595495 19613234 17894877 16395677
58154A6395677j316330j160659j029041r20236q28192p46435o75118o16503n66866
$$ 16395677 15079347 13918688 12889647 11969411 11141219 10394784 9719666 9103163 8536297
58145H536297n19726m74127m33115l96635l62305l30838l04547k82159k60565
$$ 8536297 8016571 7542444 7109329 6712694 6350389 6019551 5715004 5432845 5172280
58136E172280k39989k22697k08428j95657j85301j78556j73042j65504j56416
$$ 5172280 4932291 4709594 4501166 4305509 4120208 3941652 3768610 3603106 3446690
58127C446690j47868j39190j29001j19252j12539j07351j00591r2951q7144q2598
$$ 3446690 3298822 3159632 3030631 2911379 2798840 2691489 2590898 2497947 2410803 2328205
58117B328205p6796p0472o6504o4514o1375n6631n2924n1162m9501m7108m5135
$$ 2328205 2251409 2180937 2114433 2049919 1988544 1931913 1878989 1827827 1778326 1731218 1686083
58106A686083m3809m2057m0230l9930m0975m1388m0467l9172l7709l5439l2963
$$ 1686083 1642274 1600217 1559987 1520057 1479082 1437694 1397227 1358055 1320346 1284907 1251944
58095A251944l1525l0615k8677k5923k3834k2316k0084j7457j5968j5392j4005
$$ 1251944 1220419 1189804 1161127 1135204 1111370 1089054 1068970 1051513 1035545 1020153 1006148
58084A006148j1707j0164r857r628r355j0402j3089j5944j7860j8949j9186j8358
$$ 1006148 994441 984277 974420 964792 955437 945035 931946 916002 898142 879193 860007 841649
58072H41649j7384j7567j8360j7916j5944j3990j2858j1902j0911j0582j0750
$$ 841649 824265 806698 788338 770422 754478 740488 727630 715728 704817 694235 683485
58061F83485j0256q963p982p636p025o031n892p246r148j0533j1181j1015r905
$$ 683485 673229 664266 656284 648648 641623 635592 629700 622454 613306 602773 591592 580577 570672
58048E70672q441p514o991o125n211n261n971n819m371k917k481k749l291m240
$$ 570672 562231 554717 547726 541601 536390 531129 525158 519339 514968 512051 509570 506821 503530 499290
58034D99290n394o036o162o586p480q059p998p920q219q617r021r537r539q119
$$ 499290 493896 487860 481698 475112 467632 459573 451575 443655 435436 426819 417798 408261 398722 390603
58020C90603n735m007l651l907m202m791n434n072l498k023j690k013k114k000
$$ 390603 384868 380861 377210 373303 369101 364310 358876 353804 350306 348283 346593 344580 342466 340466
58006C40466k102k438k842l224l178k305j135p35j070q73M31J903K722L423M739
$$ 340466 338364 335926 333084 329860 326682 324377 323242 322507 321437 320564 320995 322898 325620 329043 333782
57991C33782O260P144P368P344O867N411L140R07o30j490k059k574k863k575j839
$$ 333782 340042 347186 354554 361898 368765 374176 377316 378223 377593 376103 374044 371470 368607 366032 364193
57976C64193j356j534j880j839j749k171k642k255j152k99J01O77J338J090k46
$$ 364193 362837 361303 359423 357584 355835 353664 351022 348767 347615 347316 347417 348094 349432 350522 350276
57961C50276j448j613j309j412j806j990k081k406k738k685k375k183k149k139
$$ 350276 348828 347215 345906 344494 342688 340698 338617 336211 333473 330788 328413 326230 324081 321942
57947C21942k180k205j852q99L89J616K715L803M918O054P210Q325R384J0476
$$ 321942 319762 317557 315705 314806 315195 316811 319526 323329 328247 334301 341511 349836 359220 369696
57933C69696J1460J1781J1136J0110R483R153Q314O643M573K472L06j896l876
$$ 369696 381156 392937 404073 414183 423666 432819 441133 447776 452349 454821 455127 453231 449355
57920D49355n451o536p018p125p544q476r038q432p281o725o664o144n181m765
$$ 449355 443904 437368 430350 423225 415681 407205 398167 389735 382454 375729 369065 362921 357740 352975
57906C52975n072n139m445l535k902k529k654l628m778m859l920l268l220k533
$$ 352975 347903 342764 338319 334784 331882 329353 326699 323071 318293 313434 309514 306246 303026 300493
57892C00493o69J011J274Q24R74J711K218K378K557K664K451K187K112J811R03
$$ 300493 299824 300835 302109 302933 303907 305618 307836 310214 312771 315435 317886 320073 322185 323996 324899
57877C24899j78q09j015r92n79J12K84m93j464j709j349r68m86L93J245J416J086
$$ 324899 324721 323912 322897 321905 321326 321438 321722 321229 319765 318056 316707 315739 315253 315646 316891 318307 319393
57860C19393R41J084J141J179J652K612L571M140M242L880L151K305J455M88n36
$$ 319393 320334 321418 322559 323738 325390 328002 331573 335713 339955 343835 346986 349291 350746 351234 350698
57845C50698j294j760k315l091l743m145m572m985m977m710m936n591n561m395
$$ 350698 349404 347644 345329 342238 338495 334350 329778 324793 319816 315106 310170 304579 299018 294623
57831B94623l157k745k533j723q65o63k86J492M054N477N111M137L702L829M149
$$ 294623 291466 288721 286188 284465 283600 282937 282651 284143 288197 293674 298785 302922 306624 310453 314602
57816C14602M470M414L581K251J117K81p40k117l593n103o627p706p942p826p989
$$ 314602 319072 323486 327067 329318 330435 330716 329976 327859 324266 319163 312536 304830 296888 289062 281073
57801B81073p895o494m085k208j584j408r60n95o35m91L13J206J465J411J880
$$ 281073 273178 266684 262599 260391 258807 257399 256439 255844 255209 254718 255031 256237 257702 259113 260993
57786B60993K957L967M418M413M307M430M941N657O126O140N963N809N430M471
$$ 260993 263950 267917 272335 276748 281055 285485 290426 296083 302209 308349 314312 320121 325551 330022
57772C30022L057J700O65l00j511k741l290k913k588l829o940j0372j2309j2542
$$ 330022 333079 334779 335444 335144 333633 330892 327602 324689 322101 318272 311332 300960 288651 276109
57758B76109j2282j2382j2496j1922j0567q794o884m892k747l53K197M430N797
$$ 276109 263827 251445 238949 227027 216460 207666 200782 195890 193143 192790 194987 199417 205214
57745B05214O138N732M926M034L339K871K277J299J98o26j271k081k897l055k185
$$ 205214 211352 217084 222010 226044 229383 232254 234531 235830 236028 235402 234131 232050 229153 226098 223913
57730B23913o57P46J385J130N35L51N77L40q33k092k262j410o00m00n26q73j766
$$ 223913 223256 224002 225387 226517 227052 227403 227980 228320 227487 225395 223133 221723 221123 220723 220197 219324 217558
57713B17558l051l905l924l574l311k928k261j759j836k146k083j689j442j428
$$ 217558 214507 210602 206678 203104 199793 196865 194604 192845 191009 188863 186780 185091 183649 182221
57699A82221j219n65J80M28L0n35o38j95L01M23K63J20P0J51N55J226J610J416
$$ 182221 181002 180437 180617 181045 181075 180540 179902 179707 180008 180431 180694 180814 180884 181035 181590 182816 184426 185842
57681A85842J340K407M734P596J0522J3579J6744J9845K3249K7797L3816M0715
$$ 185842 187182 189589 194323 201919 212441 226020 242764 262609 285858 313655 347471 388186
57669C88186M7526N3161N6143N5056M9937M2695L5657K9582K2947J2878k682k2674
$$ 388186 435712 488873 545016 600072 650009 692704 728361 757943 780890 793768 791086 768412
57657G68412m2609n7296o4264o4447o0069n3030m5089l7943l2245k7352k2583
$$ 768412 725803 668507 604243 539796 479727 426697 381608 343665 311420 284068 261485
57646B61485j8108j4221j0716p576n396m413l819k801j715j352j542j357m65M90
$$ 261485 243377 229156 218440 210864 205468 201055 197236 194435 192720 191368 189826 188469 188004 188494
57632A88494Q21N11J2k83l44m82q96j302j306j091j109j195p59o2j96j357k255
$$ 188494 189315 189826 189838 189555 189211 188729 187833 186531 185225 184134 183025 181830 181071 181009 180813 179456 177201
57615A77201j933j218j373k170k427j923j516j628j798j684j513j482j499j636
$$ 177201 175268 174050 172677 170507 168080 166157 164641 163013 161215 159531 158018 156536 155037 153401
57601A53401k040k412k262j727j440j525j457r80n22n15q13j048j135j233j472
$$ 153401 151361 148949 146687 144960 143520 141995 140538 139558 139036 138521 137708 136660 135525 134292 132820
57586A32820j830k092j969j462r43o18j99N34J182J214O69j21j109k211k803k381
$$ 132820 130990 128898 126929 125467 124524 123906 123707 124241 125423 126637 127306 127185 126076 123865 121062 118681
57570A18681j485j085j199j062n40l54p78j193j205j202j339r58K98J568J814
$$ 118681 117196 116111 114912 113850 113310 112956 112178 110985 109780 108578 107239 106281 106579 108147 109961
57555A09961J206Q08J147J866K447K689K566K247K138K438K741K454J606P48J68
$$ 109961 111167 111975 113122 114988 117435 120124 122690 124937 127075 129513 132254 134708 136314 137062 137230
57540A37230l83j067j564j451p83j20k3n71j286j555j278r83j224j863k227j932
$$ 137230 136847 135780 134216 132765 131982 131862 131839 131268 129982 128427 127149 126166 124942 123079 120852 118920
57524A18920j365j149j381j523j161o23p12j815l421m577m796m371l880l526l100
$$ 118920 117555 116406 115025 113502 112341 111718 111006 109191 105770 101193 96397 92026 88146 84620 81520
57509H1520k467j916j866k357k906k979k490j736j010l49L67J313K539L739M255
$$ 81520 79053 77137 75271 72914 70008 67029 64539 62803 61793 61444 61811 63124 65663 69402 73657
57494G3657L670K375J237P22O26O39P20Q05P00M79N56J034J390J166O20L14L60
$$ 73657 77327 79702 80939 81661 82287 82926 83646 84451 85151 85630 86186 87220 88610 89776 90396 90710 91070
57477I1070N23P19R70J057P38J83k58n61q65j016p94m98o75j250j468q76Q4O46
$$ 91070 91593 92312 93282 94339 95077 95260 95002 94441 93576 92560 91766 91268 90593 89343 87875 86999 87083 87729
57459H7729N92L28L69Q26J299J331J002R24J418J962J862J191O45N87P71R09R21
$$ 87729 88321 88649 89018 89844 91143 92474 93476 94400 95818 97780 99642 100833 101478 102065 102836 103745 104666
57442A04666P11K11k01M2Q21J281Q41p0n84l96J06L93K67r5l96n00n38o36o77
$$ 104666 105377 105588 105387 105429 106250 107531 108372 108302 107718 107322 107428 107821 108088 107993 107597 107097 106559 105923 105246
57423A05246n28l19k23j11J68L72J33m02p27p16o93p40n03J23O98Q12O13N20P09
$$ 105246 104718 104399 104176 104065 104233 104605 104738 104336 103609 102893 102200 101460 100957 101080 101778 102590 103203 103723 104432
57404A04432J064J324J210P07K28J89M20M38K40K85O81R70R11Q09Q44P46M65N13
$$ 104432 105496 106820 108030 108737 108965 109154 109574 110012 110252 110537 111218 112188 113099 113908 114752 115498 115963 116476
57386A16476J153J781J732J300J318J944K440K141J215L90K61P85J300J070l7
$$ 116476 117629 119410 121142 122442 123760 125704 128144 130285 131500 131890 132151 132936 134236 135306 135269
57371A35269j486k738l722m525m916m540l474k333j806k068k553k369j175L54
$$ 135269 133783 131045 127323 122798 117882 113342 109868 107535 105729 103661 101108 98739 97564 97918
57357I7918J206J094N88K50J59K61N95J016J178J041R55R98P89J66m08n35m20
$$ 97918 99124 100218 100806 101056 101215 101476 102071 103087 104265 105306 106261 107259 108048 108214 107806 107271 106851
57340A06851m32n03m35l40l27j36M39J050J190R01O41O71R14J197J222O37m45
$$ 106851 106419 105916 105481 105141 104814 104678 105117 106167 107357 108258 108899 109570 110484 111681 112903 113540 113095
57323A13095j228r57J76J248J598J283P61L97K20m2n46r02n32L84Q67M18k05K5
$$ 113095 111867 110910 111086 112334 113932 115215 115976 116373 116593 116551 116005 115103 114571 114955 115822 116240 116035 116060
57305A16060J034J899K133K016J873J661J315J016R99J389K095K693K688K227
$$ 116060 117094 118993 121126 123142 125015 126676 127991 129007 130006 131395 133490 136183 138871 141098
57291A41098K153K894L713L609K659J820J591J641J570J330Q91K48k06M7Q87J562
$$ 141098 143251 146145 149858 153467 156126 157946 159537 161178 162748 164078 164969 165217 165011 165058 165945 167507
57275A67507J598J179O19m0p40j272j631k045k501k573j996j071l48j32l79p98
$$ 167507 169105 170284 170903 170863 170123 168851 167220 165175 162674 160101 158105 157034 156686 156554 156175 155377
57259A55377r53n63K13R34J381J671J950K220K435K538K471K322K351K557K501
$$ 155377 154424 153861 154074 155008 156389 158060 160010 162230 164665 167203 169674 171996 174347 176904 179405
57244A79405J875J132R91J468J904J938J892K099K352K256J764J219J032J355
$$ 179405 181280 182412 183403 184871 186775 188713 190605 192704 195056 197312 199076 200295 201327 202682
57230B02682J931K293K335K483L031L551L413K732K252K349K666K782K722K712
$$ 202682 204613 206906 209241 211724 214755 218306 221719 224451 226703 229052 231718 234500 237222 239934
57216B39934K825L033L243L261K927K396K002J906K060K443L022L681M379N190
$$ 239934 242759 245792 249035 252296 255223 257619 259621 261527 263587 266030 269052 272733 277112 282302
57202B82302N888N958N408N092N599O240N998N113M807N541O527P009P065P034
$$ 282302 288190 294148 299556 304648 310247 316487 322485 327598 332405 337946 344473 351482 358547 365581
57188C65581P066P446Q522R962J0872J0940J0811J1104J1793J2723J3928J5068
$$ 365581 372647 380093 388615 398577 409449 420389 431200 442304 454097 466820 480748 495816
57176D95816J5421J4965J4707J5384J6376J6523J5474J3708J1653R394P048M907
$$ 495816 511237 526202 540909 556293 572669 589192 604666 618374 630027 639421 646469 651376
57164F51376L420L144M330O350Q025Q873R631J1143J3250J5151J6533J7827J9549
$$ 651376 654796 657940 662270 668620 676645 685518 695149 706292 719542 734693 751226 769053 788602
57151G88602K1736K3946K5595K6434K6716K6850K6949K7014K7276K7850K8214
$$ 788602 810338 834284 859879 886313 913029 939879 966828 993842 1021118 1048968 1077182
57140A077182K7675K6366K5177K4763K5183K6391K8302L0429L2291L4108L6310
$$ 1077182 1104857 1131223 1156400 1181163 1206346 1232737 1261039 1291468 1323759 1357867 1394177
57129A394177L8546M0270M2119M5407N0187N5179N9933O5615P3225Q2392R2484
$$ 1394177 1432723 1472993 1515112 1560519 1610706 1665885 1725818 1791433 1864658 1947050 2039534
57118B039534J03485J14992J25757J35138J43963J53224J63007J73492J85823
$$ 2039534 2143019 2258011 2383768 2518906 2662869 2816093 2979100 3152592 3338415
57109C338415K01192K20377K45010K77890L20854L73296M33958N03439N84489
$$ 3338415 3539607 3759984 4004994 4282884 4603738 4977034 5410992 5914431 6498920
57100F498920O81379P99906R46810J128298J349918J617100J932662K292843K688499
$$ 6498920 7180299 7980205 8927015 10055313 11405231 13022331 14954993 17247836 19936335
57091A9936335L111137L554646M010515M466220M910325N333793N723360O059752
$$ 19936335 23047472 26602118 30612633 35078853 39989178 45322971 51046331 57106083
57083E7106083O324354O492876O507307O265343N670143M711085L489975K157481
$$ 57106083 63430437 69923313 76430620 82695963 88366106 93077191 96567166 98724647
57075I8724647Q24998m63888j697999k859406l917079m836773n584783o130205
$$ 98724647 99549645 99085757 97387758 94528352 90611273 85774500 80189717 74059512
57067G4059512o454413o559044o462828o194010n788151n287825m737105m174020
$$ 74059512 67605099 61046055 54583227 48389217 42601066 37313241 32576136 28402116
57059B8402116l627916l120497k665380k267244j924393j633153j389666j189171
$$ 28402116 24774200 21653703 18988323 16721079 14796686 13163533 11773867 10584696
57051A0584696j025686q92562p82756o89560o08277n36835m74237m19194l70726
$$ 10584696 9559010 8666448 7883692 7194132 6585855 6049020 5574783 5155589 4784863
57042D784863l28724k92800k61513k33725k09751j90030j73434j58129j43385
$$ 4784863 4456139 4163339 3901826 3668101 3458350 3268320 3094886 2936757 2793372
57033B793372j29358j15621j01276q6190p0918n5667m0638k7433j8775j5937j6705
$$ 2793372 2664014 2548393 2447117 2360927 2290009 2234342 2193704 2166271 2147496 2131559 2114854
57022B114854j6554j2651p645r341k4872n3536q5681j09629j19840j18325j09883
$$ 2114854 2098300 2085649 2078004 2068663 2043791 1990255 1904574 1794945 1675105 1556780 1446897
57011A446897r7988q4745p2030o1192n2422m5357l9826l5642l2285k9409k7238
$$ 1446897 1348909 1264164 1192134 1130942 1078520 1033163 993337 957695 925410 896001 868763
57000H68763k6065k5669k5584k5527k5289k4607k3468k2221k0996j9336j6750
$$ 868763 842698 817029 791445 765918 740629 716022 692554 670333 649337 630001 613251
56989F13251j3398r877o564l505q38J084K028K183K077K185K378J758p08n036
$$ 613251 599853 589976 583412 579907 579069 580153 582181 584364 586441 588626 591004 592762 592054 587018
56975E87018r873j3483j5082j5066j4213j2898j1046q551n567k448N43L412O274
$$ 587018 577145 563662 548580 533514 519301 506403 495357 486806 481239 478791 479334 482746 489020
56962D89020R080J1613J3608J4694J4432J2779J0595R123Q651P961N427M87o088
$$ 489020 498100 509713 523321 538015 552447 565226 575821 584944 593595 601556 606983 607470 601382
56949F01382j3038j9166k3383k4941k3926k1226j7782j3994r949n869k104J287
$$ 601382 588344 569178 545795 520854 496928 475702 457920 443926 433977 428108 426004 427291
56937D27291M648Q387J2501J6426J9281K0390J9712J7882J5788J3925J1929Q615
$$ 427291 431939 440326 452827 469253 488534 508924 528636 546518 562306 576231 588160 596775
56925E96775K803n638j5330k4128l0287l3122l2908l0495k6985k3352k0101j7282
$$ 596775 599578 593940 578610 554482 524195 491073 458165 427670 400685 377333 357232 339950
56913C39950j4811j2624j0585q564o695n391m862m794m666m276l822l485l144
$$ 339950 325139 312515 301930 293366 286671 281280 276418 271624 266958 262682 258860 255375 252231
56900B52231k542j594m37P96K134L660N355P159R204J1666J4369J6721J8326J9352
$$ 252231 249689 248095 247658 248454 250588 254248 259603 266762 275966 287632 302001 318722 337048 356400
56886C56400J9995J9889J8600J6599J4915J3593J1201O465l6o293j0661j2710
$$ 356400 376395 396284 414884 431483 446398 459991 471192 477657 477621 471328 460667 447957
56874D47957j2696j1045q363n184j432L289Q740J3984J8596K3348K9075L5135
$$ 447957 435261 424216 415853 410669 409237 412526 421266 435250 453846 477194 506269 541404
56862E41404L9564M0774L8754L4799L0484K6793K3618J9680J3182L086r778k2756
$$ 541404 580968 621742 660496 695295 725779 752572 776190 795870 809052 812138 802360 779604
56850G79604l2736l7939l8587l5844l0361k2325j2731l504M296J1775K0867L1948
$$ 779604 746868 708929 670342 634498 604137 581812 569081 565577 569873 581648 602515 634463
56838F34463M3534N3889O1814O5933O4832N8803N0507M2822L6232K8808J8258
$$ 634463 677997 731886 793700 859633 924465 983268 1033775 1076597 1112829 1141637 1159895
56827A159895L322j5858l7262n6799p0017p4867p2607o5954n6951m6561l5330
$$ 1159895 1163217 1147359 1110097 1053298 983281 908414 835807 769853 712902 666341 631011
56816F31011k3682j1956n27J0247K0373K9972L8349M3792M4775M1347L5207K8673
$$ 631011 607329 595373 594846 605093 625466 655438 693787 737579 782354 823701 858908 887581
56804H87581K3375J9084J3401L422j1397k8232m3029n3288n8465n8798n4948m8445
$$ 887581 910956 930040 943441 946863 935466 907234 864205 810917 752452 693654 638706 590261
56792E90261m1085l3622k5815j7723j0059l140L506J0071J5766J9570K1111K0457
$$ 590261 549176 515554 489739 472016 461957 458817 462323 472394 488160 507730 528841 549298
56780E49298J7822J3983J0276P405M459k21p339j6092k4943l2398l7217l8692
$$ 549298 567120 581103 591379 598784 603243 603022 595683 579591 554648 522250 485033 446341
56768D46341l7017l3269k8804k4592k0947j7733j4895j2753j1540j0793r655p906
$$ 446341 409324 376055 347251 322659 301712 283979 269084 256331 244791 233998 224343 216437
56756B16437o218n204m656m023l231k610k312k220k220k210j986j473r16o08o33
$$ 216437 210219 205015 200359 196336 193105 190495 188183 185963 183743 181533 179547 178074 177158 176550 175917
56741A75917r84j645k275k219j323l81k91q95j200o45L86J232J626J645J459J355
$$ 175917 174933 173288 171013 168794 167471 167090 166799 165904 164704 164059 164445 165677 167303 168948 170407 171762
56725A71762J610K132K398J991J100M45O27J553K537K988K944K714K231J189j44
$$ 171762 173372 175504 177902 179893 180993 181438 182065 183618 186155 189143 192087 194801 197032 198221 198077
56710A98077q73n18L46Q16P16M94M71O05P74Q64P24L89J21ok30n32m22K61Q10
$$ 198077 197204 196686 197032 197848 198564 199058 199529 200134 200908 201772 202496 202885 203006 203000 202770 202238 201816 202077 202887
56691B02887N57p6k04J94L23j13n37m88k41k58n77r13q96k14R74J831J627P75
$$ 202887 203444 203368 203164 203358 203681 203568 203031 202543 202302 202044 201467 200554 199658 199444 200418 202249 203876 204651
56673B04651M00Q61J325J025J96m91q20r27q42n56k53r5o3j50m13p05p25n64p22
$$ 204651 205051 205912 207237 208262 208458 207967 207147 206220 205378 204822 204569 204474 204411 204261 203848 203143 202418 201854 201132
56654B01132j380k024k117j771j421j200r71o96l76K06J192K266K881K953K949
$$ 201132 199752 197728 195611 193840 192419 191219 190248 189552 189176 189382 190574 192840 195721 198674 201623
56639B01623L248L611L479K716J864J486J459J128J87r89j945k615k940k580j512
$$ 201623 204871 208482 211961 214677 216541 218027 219486 220614 220801 219812 217867 215252 212312 209732 208220
56624B08220n86p56j874k806k776k008j149o53p09j199j568j337q26q51j566k130
$$ 208220 207634 206878 205004 202198 199422 197414 196265 195612 194903 193704 192136 190799 189973 189122 187556 185426
56608A85426j672k30J330K005J336j09r77n00M69M79n66j260o74N02J119J047
$$ 185426 183754 183524 184854 186859 188195 188086 187109 186609 187078 187557 186991 185731 185057 185559 186678 187725
56592A87725R36J149J512J733J617J164P12O61Q77Q51N32M26P55J153J427J821
$$ 187725 188661 189810 191322 193055 194672 195836 196548 197209 198086 198937 199469 199895 200650 201803 203230 205051
56576B05051K246K125J452J130J691K431K536K274K327K616K775L139M256N776
$$ 205051 207297 209422 210874 212004 213695 216126 218662 220936 223263 225879 228654 231793 236049 241825
56562B41825O850P466Q315R423R895R238Q076P294O981O532N330L164K89k688
$$ 241825 248675 256141 264456 273879 283774 293012 301088 308382 315363 321895 327225 330389 330678 327990
56548C27990n137o718p338p058o138n028m025l131k414k134k348k716k944l075
$$ 327990 322853 316135 308797 301739 295601 290573 286548 283417 281003 278869 276521 273805 270861 267786
56534B67786l064k638j914j553j777j784q55M12P72n0j107j480j064k80L44L19
$$ 267786 264722 262084 260170 258617 256840 255056 254201 254613 255385 255335 254228 252748 251684 251404 251748 252067
56518B52067m44j474k351l238m306m969m439k895j308k24N61J151J287J003P63
$$ 252067 251623 250149 247798 244560 240254 235285 230846 227951 226643 226419 226980 228131 229418 230421 231184
56503B31184P25M87j13o30p33p55j145j760k116k034j781j693j839j953j622p45
$$ 231184 231909 232396 232283 231653 230920 230165 229020 227260 225144 223110 221329 219636 217797 215844 214222 213477
56487B13477J77M38r1p60p72O0J169J706J254K39m64m14P7N27Q38J049J045Q16
$$ 213477 213654 214092 214001 213241 212469 212529 213698 215404 216658 216897 216433 216019 216096 216623 217461 218510 219555 220371
56469B20371O91Q56J022R56Q81Q94N12m45j046k88J327K216J668M42n90j280j594
$$ 220371 221062 221918 222940 223896 224777 225671 226183 225738 224692 224404 225731 227947 229615 230057 229467 228187 226593
56452B26593j167OJ245K003K391K507K033R82J96M03J231J761J676J302Q52L10
$$ 226593 225426 225432 226677 228680 231071 233578 235611 236593 236789 237192 238423 240184 241860 243162 244014 244324
56436B44324j58l19l75p47j317j460r56l54k00k86n0N40R58R05O82O28N89K57
$$ 244324 244166 243847 243472 242725 241408 239948 238992 238638 238438 238152 238102 238642 239600 240505 241187 241815 242404 242661
56418B42661k00k67K04P85R62N96j03p63r63n62M7L36L04M29Q98J363J533J471
$$ 242661 242461 242194 242398 243183 244145 244741 244638 243875 242912 242350 242397 242733 243037 243466 244364 245727 247260 248731
56400B48731J235Q02N45J034K069K607K156J539J703K370K598K139J458Q28K08
$$ 248731 249966 250768 251313 252347 254416 257023 259179 260718 262421 264791 267389 269528 270986 271814 272022
56385B72022k43k93q9J28N17J236J908K154K303K824L390L384K994K881K918K240
$$ 272022 271779 271486 271397 271525 272042 273278 275186 277340 279643 282467 285857 289241 292235 295116 298034 300274
56369C00274N41j555l422m861n691n734n221m486l322j492K41O88j00q03n88M1
$$ 300274 300815 299260 295838 290977 285286 279552 274331 269845 266523 265031 265272 265960 265860 265057 264469 264510
56353B64510L99M90M56J30l46l52L00J010J397J771K224K110J116O2j02M93J144
$$ 264510 264909 265399 265855 265985 265639 265287 265587 266597 267994 269765 271989 274099 275215 275277 275175 275668 276812
56336B76812J730K605L663M310M235L648K941K466K486K882L081K659J866J257
$$ 276812 278542 281147 284810 289120 293355 297003 299944 302410 304896 307778 310859 313518 315384 316641
56322C16641J007Q76O92N08L58J53j87n62o80l06L36N86J14m89l24O40J486J537
$$ 316641 317648 318524 319216 319724 320082 320235 320048 319486 318806 318500 318836 319422 319536 319047 318723 319363 320849 322386
56304C22386J101R66J523K546L506L936L785L495L507L749L869L800L690L511
$$ 322386 323487 324453 325976 328522 332028 335964 339749 343244 346751 350500 354369 358169 361859 365370
56290C65370L221L062L211L291K899K370K313K633K917L459M833O524P257O899
$$ 365370 368591 371653 374864 378155 381054 383424 385737 388370 391287 394746 399579 406103 413360 420259
56276D20259O706P351P938P710P401Q011R180R881J0062J0460J1219J1829J2255
$$ 420259 426965 434316 442254 449964 457365 465376 474556 484437 494499 504959 516178 528007 540262
56263E40262J3150J4852J6920J8822K0566K2505K4900K7796L1071L4573L8350
$$ 540262 553412 568264 585184 604006 624572 647077 671977 699773 730844 765417 803767
56252H03767M2683M7723N3217N8772O4297O9968P5809Q1426Q6206Q9763R2140
$$ 803767 846450 894173 947390 1006162 1070459 1140427 1216236 1297662 1383868 1473631 1565771
56241A565771R3505R3651R1996Q8097Q1919P3518O3016N0957L8085K4411R319
$$ 1565771 1659276 1752927 1844923 1933020 2014939 2088457 2151473 2202430 2240515 2264926 2274245
56230B274245o787k1825l4074m4227n4054o3443p0450p4263p6470p8750q0669
$$ 2274245 2267458 2245633 2211559 2167332 2113278 2049835 1979385 1905122 1828652 1749902 1669233
56219A669233q0720p8610p5510p2426o9254o5390o0762n6056n1985m8491m4987
$$ 1669233 1588513 1509903 1434393 1361967 1292713 1227323 1166561 1110505 1058520 1010029 965042
56208I65042m1441l8582l6641l4644l1742k8511k5944k3761k1081j8268j6516
$$ 965042 923601 885019 848378 813734 781992 753481 727537 703776 682695 664427 647911
56197F47911j5678j4235j1578q882p256o413n629m798m038l278k708k684k934
$$ 647911 632233 617998 606420 597538 590282 583869 578240 573442 569404 566126 563418 560734 557800
56184E57800k794k331k160k111j433l84p5n02l88N82J113N53Q0O92J652J956K014
$$ 557800 555006 552675 550515 548404 546971 546587 546512 546010 545622 546204 547317 547870 547950 548642 550294 552250 554264
56167E54264K632L535M116M638N587O684P531Q397R526J0519J1174J2041J3411
$$ 554264 556896 560431 564547 569185 574772 581456 588987 597384 606910 617429 628603 640644 654055
56154F54055J4724J5696J6909J8678K0480K2433K5887L1543L8227M4691N1518
$$ 654055 668779 684475 701384 720062 740542 762975 788862 820405 858632 903323 954841
56143I54841N9934O9838Q0264R0832J01303J10576J17462J22006J24835J25909
$$ 954841 1014775 1084613 1164877 1255709 1357012 1467588 1585050 1707056 1831891 1957800
56133A957800J24926J22131J17499J09838R8095Q3197O7646N3632M2271L3890
$$ 1957800 2082726 2204857 2322356 2432194 2530289 2613486 2681132 2734764 2777035 2810925
56123B810925K7898K2658J6364P891l311j7154l2216m6131n7543o7046p5823q4467
$$ 2810925 2838823 2861481 2877845 2885736 2882425 2865271 2833055 2786924 2729381 2662335 2586512 2502045
56111B502045r3567j03818j14493j22981j26939j26041j20952j12090j00386q7876
$$ 2502045 2408478 2304660 2190167 2067186 1940247 1814206 1693254 1581164 1480778 1392902
56101A392902p6120o5041n4326m4748l7004l0463k4363j9143j5391j2581r950
$$ 1392902 1316782 1251741 1197415 1152667 1115663 1085200 1060837 1041694 1026303 1013722 1003772
56090A003772p596n682l685j489L4N88J234K604L794M154M603N899P151P376P063
$$ 1003772 996176 990494 986809 985320 985354 985942 987176 989780 993574 997728 1002331 1008230 1015381 1022757 1029820
56075A029820O914O625O149O517Q032R362R798J0555J2421J4141J4671J4918J5657
$$ 1029820 1036734 1043359 1049508 1056025 1064057 1073419 1083217 1093772 1106193 1120334 1135005 1149923 1165580
56062A165580J5992J5666J6354J8539J9687J8007J5581J5040J5577J5206J4591
$$ 1165580 1181572 1197238 1213592 1232131 1251818 1269825 1285406 1300446 1316023 1331229 1345820
56051A345820J5247J6002J4947J3228J3280J4723J5443J5565J6772J8838K0230
$$ 1345820 1361067 1377069 1392016 1405244 1418524 1433247 1448690 1464255 1481027 1499865 1520095
56040A520095K1236K3204K5626K7031K7839K9294L0839L1492L2416L4888L7241
$$ 1520095 1541331 1564535 1590161 1617192 1645031 1674325 1705164 1736656 1769072 1803960 1841201
56029A841201L7276L6222L6699L8303L8948L9133M0818M3334M4470M4572M5586
$$ 1841201 1878477 1914699 1951398 1989701 2028649 2067782 2108600 2151934 2196404 2240976 2286562
56018B286562M7239M8161M9530N3308N8086O1088O3103O6892P1830P4960P6442
$$ 2286562 2333801 2381962 2431492 2484800 2542886 2603974 2667077 2733969 2805799 2880759 2957201
56007B957201P9108Q3304Q6990R0173R4563R9522J03098J06290J11557J18149
$$ 2957201 3036309 3119613 3206603 3296776 3391339 3490861 3593959 3700249 3811806 3929955
55997C929955J23781J29632J38514J49297J58675J67153J77755J90219K02315
$$ 3929955 4053736 4183368 4321882 4471179 4629854 4797007 4974762 5164981 5367296
55988E367296K15410K32454K52035K70820K90197L13807L40435L66622L94182
$$ 5367296 5582706 5815160 6067195 6338015 6628212 6942019 7282454 7649076 8043258
55979H043258M27297M64424N01625N41714N91070O49599P13624P86395Q75240
$$ 8043258 8470555 8934979 9436604 9978318 10569388 11218987 11932611 12719006 13594246
55970A3594246R80653J099658J237545J404348J602890J834151K111950K458645
$$ 13594246 14574899 15674557 16912102 18316450 19919340 21753491 23865441 26324086
55962B6324086K891678L432341M122159N007415O109205P432305R001907J0868313
$$ 26324086 29215764 32648105 36770264 41777679 47886884 55319189 64321096 75189409
55954G5189409J3085320J5714227J8808705K2270609K5637624K8076363K8743805
$$ 75189409 88274729 103988956 122797661 145068270 170705894 198782257 227526062
55947B27526062K7304281K4192575K0394205J6833586J3698472J0167405M908018
$$ 227526062 254830343 279022918 299417123 316250709 329949181 340116586 345024604
55940C45024604k825319j2326153k1619528k8605903l2193795l2573371l0688785
$$ 345024604 342199285 329873132 308253604 279647701 247453906 214880535 184191750
55933A84191750k7572061k4000776k0455420j7183504j4283945j1788467r701390
$$ 184191750 156619689 132618913 112163493 94979989 80696044 68907577 59206187
55926E9206187p995316o613018n495087m596580l876421l291351k808883k412534
$$ 59206187 51210871 44597853 39102766 34506186 30629765 27338414 24529531 22116997
55918B2116997k087958j815803j582307j384572j219865j079411r56517q51264
$$ 22116997 20029039 18213236 16630929 15246357 14026492 12947081 11990564 11139300
55910A1139300p63033o86540o18447n60277n11934m69277m30171l96204l66821
$$ 11139300 10376267 9689727 9071280 8511003 7999069 7529792 7099621 6703417 6336596
55901F336596l38498l11045k87940k69108k50175k30160k13072k00291j88016
$$ 6336596 5998098 5687053 5399113 5130005 4879830 4649670 4436598 4236307 4048291
55892D048291j74168j61426j51427j41895j31691j23054j16690j09851j01455
$$ 4048291 3874123 3712697 3561270 3419375 3287684 3164630 3047940 2938089 2836634
55883B836634r4215q9637q5472q0097p5051p1444o8028o4633o3440o5055o6947
$$ 2836634 2742419 2652782 2567310 2487213 2412162 2340718 2272690 2208057 2144617 2079562 2012615
55872B012615o7232o6483o4780o0889n5580n1885n0682m9578m7303m5430m4613
$$ 2012615 1945383 1878900 1814120 1753231 1697651 1645766 1595084 1545506 1498203 1452773 1408160
55861A408160m2994l9831l7030l5572l3821l0914k8443k7285k5974k3746k2014
$$ 1408160 1365166 1325335 1288305 1252733 1218912 1187998 1159555 1132270 1106296 1082550 1060536
55850A060536k1419k0416j8299j6678j6555j6770j6610j7066j8227j8399j7163
$$ 1060536 1039117 1018701 1000402 983724 967169 950399 933789 916723 898496 880097 862934
55839H62934j6470j7277j7963j7436j6919j7096j6490j4390j2651j2652j2951
$$ 862934 846464 829187 811224 793788 776869 759773 743283 728893 716242 703590 690639
55828F90639j1852j0063q969q375p685p391p740p805p338p650r281j0739j0895
$$ 690639 678787 668724 659755 651380 643695 636304 628564 620759 613421 605771 596490 585751 574856
55815E74856j0616j0670j0099q293o665o450o636n744m113k747j459K32J751K521
$$ 574856 564240 553570 543471 535178 528513 522063 515427 509683 505570 502823 501364 501596 503347 505868
55801E05868L190M414N638O254O727P433P687O983N883M683K721n3k386l675m972
$$ 505868 509058 513472 519110 525364 532091 539524 547211 554194 560077 564760 567481 567428 565042 561367 556395
55786E56395o907q413q735q986j0078j0866j0132q985r329j0987j2251j2433j2040
$$ 556395 549488 541075 532340 523354 513276 502410 492278 483293 473964 462977 450726 438293 426253
55773D26253j1129r228o689m614l501k921k295j287J57J454J595K94j575l082
$$ 426253 415124 405896 399207 394593 391092 388171 385876 384589 384746 386200 387795 388089 386514 383432
55759C83432m075m575m304l415k730k670k814k910l331m065m415m193m086m381
$$ 383432 379357 374782 370478 367063 364333 361663 358849 355939 352608 348543 344128 339935 335849 331468
55745C31468m557m617n330o524o717n334l848l617m028l847l115k441j635m65
$$ 331468 326911 322294 316964 310440 303723 298389 294541 290924 286896 283049 279934 277493 275858 275393
55731B75393K49k62j334j808j697j782k234k749l404m326n026m999m516m038l435
$$ 275393 275642 275380 274046 272238 270541 268759 266525 263776 260372 256046 251020 246021 241505 237467 234032
55716B34032k528j746j493j491j319r79m32N49J569J714J079R60J840K410J572
$$ 234032 231504 229758 228265 226774 225455 224476 224044 224593 226162 227876 228955 229915 231755 234165 235737
55701B35737J33o42j004j947l383m506n187n708n706m687l176k152j740j404j003
$$ 235737 235870 235228 234224 232277 228894 224388 219201 213493 207787 203100 199924 197772 196032 194628 193625
55686A93625p17m23k4R5j44K5J073K115K097J401J128J296R88J4q12r53p24o17
$$ 193625 192908 192485 192461 192556 192412 192437 193510 195625 197722 199123 200251 201547 202535 202549 201737 200784 200060 199443
55668A99443p70j106j386j249p26l65m44n53l88l51o87p10L09J942L070L216K774
$$ 199443 198673 197567 196181 194932 194206 193841 193397 192844 192456 192105 191418 190708 191017 192959 196029 199245 202019
55651B02019K361K456L185L908L619K272J034O87N77j37j151j792k265l072l884
$$ 202019 204380 206836 210021 213929 217548 219820 220854 221541 222118 221981 220830 219038 216773 213701 209817
55636B09817m131m136m541n083n031m478m101l906l308k214j107j97N86R61N05
$$ 209817 205686 201550 197009 191926 186895 182417 178316 174410 171102 168888 167781 167584 168170 169131 169636
55621A69636n64j551k057k077j636j008q94j713k954l883m378m515l937k610j560
$$ 169636 169072 167521 165464 163387 161751 160743 159849 158136 155182 151299 146921 142406 138469 135859 134299
55606A34299j738k507k338r46M15P27K85j02j30J6P7j27n19o94l74J65L89J22
$$ 134299 132561 130054 127716 126770 127185 127912 128197 128095 127965 127981 128058 127931 127412 126718 126344 126509 126898 127020
55588A27020m09q84j003o83l50n66j098r89R4J314J891K087K305K116J119O5Q6
$$ 127020 126611 125727 124724 124041 123691 123125 122027 121038 121132 122446 124337 126424 128729 130845 131964 132029 132115
55571A32115J194K419L076L076K454J491R73J368K002J802O90m81j057j082r15
$$ 132115 133309 135728 138804 141880 144334 145825 146798 148166 150168 151970 152660 152179 151122 150040 149125
55556A49125j065j932l154l639k943k011j836j995j512n06J26K36M30P76P07J53
$$ 149125 148060 146128 142974 139335 136392 134381 132545 130550 129038 128532 128658 128894 129324 130100 130807 130960
55540A30960k57j05M98J392K290K492J557J78n03l82l53r19j729k422l006l335
$$ 130960 130703 130598 131096 132488 134778 137270 138827 139005 138502 138120 137767 136848 135119 132697 129691 126356
55524A26356l068k334j779j831k396l202l994m483m644m812n066m828l667k106
$$ 126356 123288 120954 119175 117344 114948 111746 107752 103269 98625 93813 88747 83919 80252 78146
55510G8146r93l72K44Q33R48N93K40P4j10l73n81o65n17L8O95P16P2j48P63J938
$$ 78146 77153 76781 77025 77858 78806 79399 79639 79713 79603 79230 78649 77984 77467 77505 78200 78916 78988 78840 79603 81541
55490H1541K191J725J548J748J619J027M86J77J1K60R67J203J72j242j430l22
$$ 81541 83732 85457 87005 88753 90372 91399 91885 92062 92073 92333 93300 94503 94675 93433 92003 91681
55474I1681O99Q88P56O52K75k61l38K7J81P5K41M67q8j215j562o51L20K92k65
$$ 91681 92380 93268 94024 94676 94951 94690 94352 94379 94560 94635 94876 95343 95255 94040 92478 91827 92147 92439 92174
55455I2174m12j12J06P6qL3L90R95J171L47q23j056k86K09k00o01j15P22R11M41
$$ 92174 91762 91650 91756 91832 91824 91857 92247 93242 94413 94760 93937 92881 92595 92804 92604 92003 91888 92610 93521 93962
55435I3962N9J56M79N63J20o31q93j23J055J444P87m7l97l98k94j37k56r55j608
$$ 93962 94021 94177 94656 95219 95339 94708 93815 93692 94747 96191 96978 96931 96534 96136 95842 95705 95449 94494 92886
55416I2886j186J49J040Q67M17L38K02l37p39o32o04j112j545j170k45N10R27
$$ 92886 91700 91849 92889 93756 94173 94511 94713 94376 93637 93005 92401 91289 89744 88574 88329 88839 89766
55399H9766J194J376J582J946J995R62p85j641p88N93R77M39M6J02N8k77m72j81
$$ 89766 90960 92336 93918 95864 97859 98821 98036 96395 95607 96200 97177 97616 97662 97764 97822 97545 97073 96892
55381I6892N48J424J900J410J54q76j083r18r23q32k54M50P05O03N02K55l49r02
$$ 96892 97440 98864 100764 102174 102328 101452 100369 99451 98528 97696 97442 97892 98597 99200 99702 99957 99608 98706
55363I8706q71n24n21q73r74n32J51N95M50l50j363j789j311m53J50M66P07Q10
$$ 98706 97835 97311 96790 95917 94943 94411 94562 95157 95607 95257 93894 92105 90794 90341 90491 90957 91664 92474
55345I2474O80N27M75K81j31l80k77k50o06r08o48j17M1k40n10m86k13K00N66
$$ 92474 93154 93681 94156 94437 94306 93926 93649 93399 92793 91885 91237 91120 91161 90921 90411 89925 89712 89912 90478
55326I0478O38M56L15K27r1m80k94N39J167J003N52M39M12j2o14r26j054j184
$$ 90478 91116 91572 91887 92114 92023 91543 91249 91788 92955 93958 94510 94949 95361 95349 94735 93809 92755 91571
55308I1571q87J81J376J767J401R98P57L65q9k16j48l66p74p54j88K97K02k92
$$ 91571 90684 90865 92241 94008 95409 96407 97164 97529 97440 97224 97076 96710 95936 95182 94994 95291 95493 95201
55290I5201p06p03k56L11N08K74J12L18N09M14N38J338K147J875N90n10o48k17
$$ 95201 94495 93792 93536 93847 94355 94629 94741 95059 95568 95982 96520 97858 100005 101880 102470 101960 101312 101095
55272A01095J21K61L37K42j74o66p20j10P08Q72P9q02n90N96J310O69m58p77l72
$$ 101095 101216 101477 101814 102056 101882 101216 100496 100386 101094 101966 102045 101243 100653 101249 102559 103228 102770 101993 101621
55253A01621l70j216k204k449j647r8J370J727P80l86o36k06j48o60r18m35K88
$$ 101621 101251 100035 97831 95382 93735 93637 95007 96734 97514 97128 96492 96286 96138 95478 94560 94125 94413
55236I4413N90L19l55j108j383p92K17P36N16J80J88L04J84p5k77n39r45j144
$$ 94413 95003 95322 94967 93859 92476 91684 91901 92637 93153 93333 93521 93825 94009 93934 93657 93118 92173 91029
55218I1029o49M42J380J431O77mO3N53P14N48P05J175J070P2p48l75O48J035M95
$$ 91029 90380 90822 92202 93633 94310 94306 94369 94922 95636 96184 96889 98064 99134 99206 98458 98083 98731 99766 100261
55199A00261k57p82j181j325q60LO15P70P99Q16N95J76j28k64l40j47N07J149
$$ 100261 100004 99222 98041 96716 95856 95859 96474 97244 98043 98859 99454 99630 99502 99238 98898 98751 99258 100407
55181A00407J078L51l67q12j155j246o82K86Q98R28Q60R27Q53N91M75N31M40L27
$$ 100407 101485 101836 101469 100657 99502 98256 97574 97860 98758 99686 100546 101473 102326 102917 103392 103923 104363 104690
55163A04690O97J396J538O94n40j447j855j720r18J69O71L01k71m09k80k81m07
$$ 104690 105387 106783 108321 109015 108475 107028 105173 103453 102535 102704 103375 103676 103405 102996 102716 102435 102028
55146A02028n41o89n51L74J797K472J675K09o57p40p54j006j089o50J11O89O23
$$ 102028 101487 100798 100247 100621 102418 104890 106565 106774 106117 105377 104623 103617 102528 101878 101989 102678 103301
55129A03301j78j228j707j316o00k08j06J16M93O83N58L70L81N45O12M11P5p3
$$ 103301 103123 101895 100188 98872 98272 98064 97958 98074 98567 99250 99808 100178 100559 101104 101716 102127 102202 102129
55111A02129M4P9j85l15K66J317J937J694J033M61L5k04j0M50M43l38j161j139
$$ 102129 102173 102252 102067 101752 102018 103335 105272 106966 107999 108460 108495 108291 108281 108731 109174 108836 107675 106536
55093A06536l10O26J147J043K19r35j413o04P91J524J352J083J173J084L41n76
$$ 106536 106226 106852 107999 109042 109261 108326 106913 106309 107100 108624 109976 111059 112232 113316 113657 113081
55077A13081p96k05N34Q60Q56Q32P52K98n27j202j232p64l98m39n78l83J53P00
$$ 113081 112285 112080 112614 113474 114330 115162 115914 116212 115685 114483 113251 112487 112089 111650 111072 110689 110842 111542
55059A11542R85R30N30j62q91j232q77J7Q35R60L64l35m93m5N67Q76P22L12J01
$$ 111542 112527 113457 113987 113825 112934 111702 110825 110842 111677 112637 113001 112666 112173 112128 112695 113571 114293 114605 114706
55040A14706L68P52N44l14r61p65k44k34n84m64K04N39Kr33j542j577j077j80
$$ 114706 115074 115826 116370 116056 115095 114330 114086 113852 113268 112804 113008 113547 113549 112616 111074 109497 108420 108240
55022A08240O09O46j6n60m51k7J75Q8j55n03o66k16O44J031O39K89O82J261J151
$$ 108240 108849 109495 109479 108919 108468 108441 108616 108704 108549 108046 107380 107164 107808 108839 109478 109767 110449 111710 112861
55003A12861O25O35J191J298N58j69jP76J218R55M96M57Q50J163R46K41n32j023
$$ 112861 113486 114121 115312 116610 117168 116999 116998 117774 118992 119947 120443 120900 121750 122913 123859 124100 123568 122545
54985A22545j196j167r98p36m39r2K88M90K82j18j02N94J467J785J369O47J27
$$ 122545 121349 120182 119184 118448 118009 117917 118205 118695 118977 118859 118757 119351 120818 122603 123972 124619 124746
54968A24746KJ32K77L99O83J151J341Q54N0k96j06j00n90r39o45k42m53r31p45
$$ 124746 124748 124880 125157 125556 126239 127390 128731 129585 129635 129339 129233 129133 128543 127604 126959 126717 126264 125333 124588
54949A24588J63Q44O88J29j85k83n98j151j501j327q06l40j03M2K26L16J71QK70
$$ 124588 124751 125595 126283 126412 126227 125944 125346 124195 122694 121367 120561 120221 120118 120160 120386 120702 120873 120881 121151
54930A21151J040J860K247K220K194K498L121L827M421M896N293N427N074M527
$$ 121151 122191 124051 126298 128518 130712 133210 136331 140158 144579 149475 154768 160195 165269 169796
54916A69796M555N318N853N293M207L721L613K539K47j891k998l915n455o791
$$ 169796 174351 179669 185522 190815 195022 198743 202356 204895 205142 203251 200253 196338 190883 184092
54902A84092o813o049n752n814n232m211l974m542m407k895j269p80r27n66K64
$$ 184092 177279 171230 165478 159664 154432 150221 146247 141705 137298 134403 133134 132354 131427 130861 131125
54887A31125P75Q96J161J503J325P19O82J800L462M723N420O053O845P380P216
$$ 131125 131900 132796 133957 135460 136785 137504 138186 139986 143448 148171 153591 159644 166489 173869 181085
54872A81085O471N663N002M188K916J438K63n81j608l121m705n743o183o474o794
$$ 181085 187556 193219 198221 202409 205325 206763 207026 206445 204837 201716 197011 191268 185085 178611 171817
54857A71817o772o101n096m386m134l898l271k399j697j319j139j105j274j543
$$ 171817 165045 158944 153848 149462 145328 141430 138159 135760 134063 132744 131605 130500 129226 127683
54843A27683j652j551j469j565j693j666j462j115n76J24P60J054Q68K94l10m92
$$ 127683 126031 124480 123011 121446 119753 118087 116625 115510 114934 115058 115818 116872 117740 118034 117724 117232
54827A17232j71J22r7m62j81P01J184P32O4J4L05J82k64l10Q7K32j20l78j05L04
$$ 117232 117061 117183 117086 116624 116443 117144 118328 119060 119124 119138 119443 119625 119361 119051 119138 119370 119250 118872 118767 119071
54807A19071L66K11J77J64q2l66k07M25R74R55N24K98O69J326J501P51m83j268
$$ 119071 119437 119648 119825 119989 119907 119541 119334 119759 120733 121688 122212 122510 123179 124505 126006 126757 126274 125006
54789A25006j084k42N74J002J137J159J077Q36N52M32M88M90L09J79L98Q43J136
$$ 125006 123922 123680 124254 125256 126393 127552 128629 129465 130017 130449 130937 131427 131736 131915 132313 133156 134292
54772A34292J268J659K504L395L881M090M486N234O117O867P256P086O396N582
$$ 134292 135560 137219 139723 143118 146999 151089 155575 160809 166926 173793 181049 188135 194531 200113
54758B00113M912M131K855J248j84j358k665m256n721o625o926o740o080n123
$$ 200113 205025 209156 212011 213259 213075 211717 209052 204796 199075 192450 185524 178784 172704 167581
54744A67581m364m167m261l969k960j588n47l02p90j545j967j631n45Q36J882
$$ 167581 163217 159050 154789 150820 147860 146272 145725 145423 144633 143088 141121 139490 138945 139781 141663
54729A41663K216J909J304Q12R30K114M168N981O412N634M975N294N952N807M705
$$ 141663 143879 145788 147092 147904 148834 150948 155116 161097 167509 173143 178118 183412 189364 195171 199876
54714A99876L480K720K191J327j67k217m443o258p212p312o885o187n354m534
$$ 199876 203356 206076 208267 209594 209427 207210 202767 196509 189297 181985 175100 168913 163559 159025
54700A59025l812l140k624k557k889k954k233j177o78q40r48o23k82k89l42q2
$$ 159025 155213 152073 149449 146892 144003 141049 138816 137639 136961 136121 135173 134550 134268 133979 133637 133555
54684A33555J87o2p66j345j453j285j118r52o45k38M0L4j28j47J03L96M31J97
$$ 133555 133742 133680 132914 131569 130116 128831 127713 126761 126116 125878 125918 125952 125824 125677 125780 126176 126607 126804
54666A26804pN4L14M72K71k82q68j116r46n92k98j03J9N7J9NP6K61O14J035J069
$$ 126804 126797 126851 127165 127637 127908 127626 126758 125642 124696 124104 123806 123703 123722 123779 123798 123803 123879 124140 124754 125789 126858
54645A26858L73o36j080p75m49n66o05m6O26N90o9o09p76q59q34l80L30O79N31
$$ 126858 127231 126595 125515 124740 124291 123725 123120 123074 123700 124290 124221 123612 122836 121977 121143 120763 121093 121772 122303
54626A22303L78N17P48R93J380J650J234K01n61m84OK52K29K69M13N09N21M06
$$ 122303 122681 123198 123946 124939 126319 127969 129203 129404 128843 128359 128365 128617 128846 129115 129528 130037 130558 130964
54608A30964mo26r54o28J30Q04J062P80N2n94m85L44R64N80m86j206r61j7Q60
$$ 130964 130960 130334 129380 128752 128882 129686 130748 131528 131580 130986 130501 130845 131809 132389 131903 130697 129736 129719 130579
54589A30579R71J73r37j497j262p12k34L02R44J198O72k04o67n48k36J9K85N49
$$ 130579 131550 131723 130786 129289 128027 127315 127081 127383 128327 129525 130197 129993 129326 128778 128542 128561 128846 129395
54571A29395O35M89K06j13k96j31K82M42J24j67Q4N24M26j48l93k8L12J84J03
$$ 129395 130030 130519 130725 130612 130316 130185 130467 130909 131033 130866 130950 131474 131900 131752 131359 131331 131643 131827 131930
54552A31930P14J724K229J849R83J04o05r68p84k59j4k52l82J94J167J727J718
$$ 131930 132644 134368 136597 138446 139429 139533 138928 137960 137176 136917 136903 136651 136269 136463 137630 139357 141075
54535A41075J720J949J797Q72j70l91J89P93J020J065R26K08j048k014j935r83
$$ 141075 142795 144744 146541 147413 147243 146852 147041 147834 148854 149919 150845 151053 150005 147991 146056 145073
54519A45073L9N49N44L71L76N80O15J79n00r59j148j326j366q86j32K2o96j392
$$ 145073 145112 145661 146205 146576 146952 147532 148147 148326 147826 146867 145719 144393 143027 142141 142009 142031 141335 139943
54501A39943j175l09L18M12K68Rm64r06q28j60O65J253J431J077K60m47m14K89
$$ 139943 138768 138459 138777 139189 139457 139466 139002 138096 137268 137108 137773 139026 140457 141534 141794 141347 140933 141222
54483A41222R28R56M58j91o52o57j84L35M34K92N54J320J857J546P24K26M32J029
$$ 141222 142150 143106 143564 143373 142721 142064 141880 142215 142649 142941 143495 144815 146672 148218 148942 149168 149600 150629
54465A50629J495J522J148P70Q66J420J773J333L91k09j18J45om41o20m17k63
$$ 150629 152124 153646 154794 155564 156430 157850 159623 160956 161347 161138 161020 161165 161159 160718 160098 159681 159418
54448A59418n14j006j323j251q51l58r9k86p45r87p91m84m32n17l88j05l0j83
$$ 159418 158904 157898 156575 155324 154473 154115 154016 153730 152985 151998 151207 150723 150291 149774 149386 149281 149251 149068
54430A49068j48K75P67R46Q03N29K74J95L83O32N93L43L81Q26J031L87p49j382
$$ 149068 148920 149195 149962 150908 151711 152240 152514 152709 153092 153724 154317 154660 155041 155867 156898 157285 156536 155154
54412A55154r75R7J026J205N30n31j222j175p07l16j6M80J109J421J213Q22O64
$$ 155154 154179 154276 155302 156507 157037 156506 155284 154109 153402 153086 153070 153550 154659 156080 157293 158115 158779
54395A58779P97J035J250J372J246P25n5o24n38J28P50Q00L91N9Kj03n26j029
$$ 158779 159576 160611 161861 163233 164479 165204 165149 164525 163987 164115 164865 165665 166056 166115 166117 166014 165488 164459
54377A64459j260j190r59n26J57Q30J082Q07K52k64m69j93M26R06R70R70J432
$$ 164459 163199 162009 161050 160524 160681 161511 162593 163400 163652 163388 162919 162726 163152 164058 165028 165998 167430
54360A67430K247K679K303J553J215J530J998J957J252L79KK96Q05R73P15L19
$$ 167430 169677 172356 174659 176212 177427 178957 180955 182912 184164 184543 184545 184841 185646 186619 187334 187653
54344A87653m5n43j389k424l148l143k522j852j553j516j481j543j880k170j793
$$ 187653 187608 187065 185676 183252 180104 176961 174439 172587 171034 169518 168037 166494 164614 162444 160651
54329A60651p53K11N78N71M96J88l76o00o0O33N84p5m64m08o18j362j836j315
$$ 160651 159898 160109 160687 161258 161754 161942 161566 160966 160906 161539 162123 162048 161584 161176 160558 159196 157360 156045
54311A56045k79K20q4m88l38K21N59L49r8k56o9%l59p61o44p7K85L2n61r42q22
$$ 156045 155766 155986 155902 155414 155076 155297 155856 156205 156107 155851 155782 155782 155423 154662 154018 153941 154226 154258 153697 152755 151933
54290A51933k23N58R68N43n36j473j603r24J31J185J943K164J865J429J227J188
$$ 151933 151710 152268 153236 153779 153243 151770 150167 149243 149374 150559 152502 154666 156531 157960 159187 160375
54274A60375R38L05m71r90j021o69l22l11n68o75l29K86O75N57J38q0K86J151
$$ 160375 161313 161618 161147 160157 159136 158467 158145 157834 157266 156591 156262 156548 157223 157780 157918 157838 158124 159275
54256A59275K010K376K177J720J275Q47L26l13r81j527j766j575j061n30k05k7
$$ 159275 161285 163661 165838 167558 168833 169680 170006 169693 168712 167185 165419 163844 162783 162253 162048 162021
54240A62021J60L08K22r5l09j04L49M85k9q50j309j116n61n9K58M38M35K08p7
$$ 162021 162181 162489 162711 162616 162307 162203 162552 163037 163008 162158 160849 159733 159172 159113 159371 159809 160244 160452 160375
54221A60375j41O3K69J98q7k13P7M98M52k11q52p54p4L45M1o15j076j277j296
$$ 160375 160234 160297 160566 160764 160677 160464 160541 161039 161491 161280 160428 159674 159600 159945 159986 159371 158295 157018 155722
54202A55722r31m8Q91J165O77J02J05O28J054R25L78j58n56j045j578j544n65
$$ 155722 154791 154743 155634 156799 157476 157578 157683 158311 159365 160290 160668 160510 159954 158909 157331 155787 155222
54185A55222O73J048M58r6K6L29K41Q9M37J033J189Q18M09J92N8JJ10K39K02J90
$$ 155222 155895 156943 157401 157305 157331 157660 157901 157990 158427 159460 160649 161467 161876 162068 162126 162127 162237 162476 162678 162868
54165A62868M25O84O06K65o1l48o02n84l41n27j401j973j157N17J432R44j15r04
$$ 162868 163293 163977 164583 164848 164787 164439 163837 163253 162912 162385 160984 159011 157854 158371 159803 160747 160632 159728
54147A59728j320j260m44O66J011M29m2K25N57K64k48l97m36o91p31k70j7n74
$$ 159728 158408 157148 156704 157370 158381 158810 158768 158993 159550 159814 159566 159169 158733 158042 157311 157041 157024 156450
54129A56450j109m44R96J675J158N70P46J188J132O21N2n01r76r56k02Q36J539
$$ 156450 155341 154897 155893 157568 158726 159296 160042 161230 162362 162983 163035 162534 161558 160602 160400 161236 162775
54112A62775J771J760J605J362J262J439J593J334P25J69j53l57m46k60P4Q7m11
$$ 162775 164546 166306 167911 169273 170535 171974 173567 174901 175626 175795 175642 175285 174839 174579 174653 174740 174329
54095A74329r71j006n04J00N47Q55Q86L64n33j070p64j3M31L98L92Q51J660K329
$$ 174329 173358 172352 171848 171948 172495 173350 174236 174600 174067 172997 172233 172220 172651 173049 173441 174292 175952 178281
54077A78281K445K085J836K246L086L578L508L592M271M809M337L303K922L354
$$ 178281 180726 182811 184647 186893 189979 193557 197065 200657 204928 209737 214074 217377 220299 223653
54063B23653L565K984K130J345P6j937l781m511m510m786n343n197l901k206j073
$$ 223653 227218 230202 232332 233677 233753 231816 228035 223524 219014 214228 208885 203688 199787 197581 196508
54048A96508o04j98O01J624K386K658K641K512K133J470J069J560K765L849M382
$$ 196508 195904 195706 196307 197931 200317 202975 205616 208128 210261 211731 212800 214360 217125 220974 225356
54033B25356M613M735M633M541N016N896O132N223M007L407L170K617J869J401
$$ 225356 229969 234704 239337 243878 248894 254790 260922 266145 270152 273559 276729 279346 281215 282616
54019B82616R25j12j338j825j579j524k069k649k799k792k922l031l029l173l563
$$ 282616 283541 283429 282091 280266 278687 277163 275094 272445 269646 266854 263932 260901 257872 254699 251136
54004B51136l837l684l256k843k532k303k048j505o00J40P3o13j025o91m1L63
$$ 251136 247299 243615 240359 237516 234984 232681 230633 229128 228528 228668 228741 228128 227103 226412 226371 226734
53988B26734M02J26m40r89j086q41q69j308j563j378j358j898k413k277j943k178
$$ 226734 227136 227262 226822 225833 224747 223906 223037 221729 220166 218788 217430 215532 213119 210842 208899 206721
53972B06721k673k435j360m29k14j68L02Q34P51J77n7N16J459K009J854J321R44
$$ 206721 204048 201613 200253 199824 199610 199442 199744 200578 201329 201506 201449 201965 203424 205433 207287 208608 209552
53955B09552R28J066J117J179J522K155K736K942K808K627K659K951L349L652
$$ 209552 210480 211546 212663 213842 215364 217519 220255 223197 226005 228632 231291 234242 237591 241243
53941B41243L876M286N014N721N898N505N034M830M736M559M504M736M832M219
$$ 241243 245119 249405 254419 260140 266038 271543 276577 281407 286143 290702 295206 299942 304774 308993
53927C08993L183K829L859N782P647R168J0723J2428J3727J4030J3409J2510J1768
$$ 308993 312176 315005 318864 324646 332293 341461 352184 364612 378339 392369 405778 418288 430056
53914D30056J0914R228O296K483j369m568o830q079q332p813o891n827m854m446
$$ 430056 440970 450198 456494 458977 457608 453040 446210 438131 429799 421986 415095 409268 404414 399968
53900C99968m951n897o211n536m706m526m667m493m322m876n845o134n498m849
$$ 399968 395017 389120 382909 377373 372667 368141 363474 358981 354659 349783 343938 337804 332306 327457
53886C27457m787m938n036n476o232o341n321m202m145m700m563l589k867k896
$$ 327457 322670 317732 312696 307220 300988 294647 289326 285124 280979 276279 271716 268127 265260 262364
53872B62364k933k385j802k009k916l708l811l284k525k006k057k572k991k824
$$ 262364 259431 257046 255244 253235 250319 246611 242800 239516 236991 234985 232928 230356 227365 224541
53858B24541k168j508j127q68n58l89o67j241j552j327r15o97m96m3K77j58j090
$$ 224541 222373 220865 219738 218870 218312 217923 217256 216015 214463 213136 212221 211524 211028 210985 211262 211104 210014
53841B10014j470q54J9L20J74J10J38n5m13o84r11j182j174n41M56J253J663J706
$$ 210014 208544 207690 207709 208029 208203 208313 208451 208396 207983 207299 206388 205206 204032 203491 203947 205200 206863 208569
53823B08569J156o7j246j437o58J76M87N82Q43J121J179J200J521K172K881L391
$$ 208569 209725 209658 208412 206975 206317 206493 206980 207562 208405 209526 210705 211905 213426 215598 218479 221870
53807B21870L613L664L780M070M389M589M694M719M541M235M176M479M639M146
$$ 221870 225483 229147 232927 236997 241386 245975 250669 255388 259929 264164 268340 272819 277458 281604
53793B81604L137K076J163N91Q11J828K643K338J378R47J129Q73k90j620k433
$$ 281604 284741 286817 287980 288571 289382 291210 293853 296191 297569 298516 299645 300518 300228 298608 296175
53778B96175k943l490l892m022m200m527m590m252m031m230m384m060l608l466
$$ 296175 293232 289742 285850 281828 277628 273101 268511 264259 260228 255998 251614 247554 243946 240480
53764B40480l322k657j681j083j093j349j477j379j175j213j834k747l024k180
$$ 240480 237158 234501 232820 231737 230644 229295 227818 226439 225264 224051 222217 219470 216446 214266
53750B14266r18l31o07r76p34J04R44J055J10j332k103j592m31L46N52P59J227
$$ 214266 213348 213017 212410 211434 210700 210804 211748 212803 212913 211581 209478 207886 207455 207801 208353 209112 210339
53733B10339J553J477J399J840K589K788J923N52j78J57P51O63J32J79J054J877
$$ 210339 211892 213369 214768 216608 219197 221985 223908 224460 224282 224439 225190 225853 225985 226164 227218 229095
53717B29095J978J766J880K227K397K434K547K467J897J221J133J660K203K401
$$ 229095 231073 232839 234719 236946 239343 241777 244324 246791 248688 249909 251042 252702 254905 257306
53703B57306K399K337K144J841J634J680K073K904L984M661M443L658L074K906
$$ 257306 259705 262042 264186 266027 267661 269341 271414 274318 278302 282963 287406 291064 294138 297044
53689B97044K683K092J400R87Q45O92L04l65j118j587j529j130q13q49j274j993
$$ 297044 299727 301819 303219 304206 305051 305743 306047 305682 304564 302977 301448 300318 299505 298656 297382 295389
53673B95389k667k746j983p82K29Q12R99O92r9q07p60q5M29L51l6m54j011j608
$$ 295389 292722 289976 287993 287211 287440 288252 289251 289943 289844 289037 288277 288192 288621 288972 288936 288482 287471 285863
53655B85863j654q11L39R16P66M65M31M59J94l20o82n74m4O23J193J598J818J773
$$ 285863 284209 283398 283737 284653 285419 285884 286315 286774 286968 286648 285966 285392 285348 285971 287164 288762 290580 292353
53637B92353J440R68N72L56L56O17J082J473J538J386J390J727K177K459K602
$$ 292353 293793 294761 295333 295689 296045 296662 297744 299217 300755 302141 303531 305258 307435 309894 312496
53622C12496K832L244L647L777L600L389L451L820M194M250L917L464L327L769
$$ 312496 315328 318572 322219 325996 329596 332985 336436 340256 344450 348700 352617 356081 359408 363177
53608C63177M554N093N104M935N026N217N101M838N010N549N603M739L601K904
$$ 363177 367731 372824 377928 382863 387889 393106 398207 403045 408055 413604 419207 423946 427547 430451
53594D30451K405J454M4j352k539l498l901l556l128l445m228m367l542k653k440
$$ 430451 432856 434310 434354 433002 430463 426965 423064 419508 416380 412935 408707 404340 400798 398145 395705
53579C95705k511k143j333n85j88j94o83j525k227k385k058j483p78j51Ok97m64
$$ 395705 393194 391051 389718 389133 388945 388751 388068 386543 384316 381931 379873 378390 377612 377461 377467 377170 376706
53562C76706j12L40M03M29J025J836J826Q35k5J72R96J447J367J399J909K510
$$ 376706 376594 376934 377337 377766 378791 380627 382453 383288 383263 383435 384431 385878 387245 388644 390553 393063
53546C93063K733K538K163J847J824K278L074L854M438M906N204N099M767M935
$$ 393063 395796 398334 400497 402344 404168 406446 409520 413374 417812 422718 427922 433021 437788 442723
53532D42723O060P621Q753R350R987J0857J1504J1648J1657J1953J2490J3104
$$ 442723 448783 456404 465157 474507 484494 495351 506855 518503 530160 542113 554603 567707
53520E67707J3849J4642J5091J5171J5633J7128J9167K0595K0994K1098K1791
$$ 567707 581556 596198 611289 626460 642093 659221 678388 698983 719977 741075 762866
53509G62866K3248K5058K6700K7713K7802K7140K6305K5782K5574K5398K5059
$$ 762866 786114 811172 837872 865585 893387 920527 946832 972614 998188 1023586 1048645
53498A048645K4555K3948K3290K2599K1867K1114K0471K0123K0143K0331K0261
$$ 1048645 1073200 1097148 1120438 1143037 1164904 1186018 1206489 1226612 1246755 1267086 1287347
53487A287347J9639J8731J8254J8576J9108J8904J7841J6669J5874J5053J3785
$$ 1287347 1306986 1325717 1343971 1362547 1381655 1400559 1418400 1435069 1450943 1465996 1479781
53476A479781J2376J1288J0212Q519O231L921J752o41l374o031q235r995j1492
$$ 1479781 1492157 1503445 1513657 1522176 1528407 1532328 1534080 1533439 1530065 1524034 1515799 1505804 1494312
53463A494312j2983j4842j7149j9223k0182k0028j9710j9926k0513k1108k1792
$$ 1494312 1481329 1466487 1449338 1430115 1409933 1389905 1370195 1350269 1329756 1308648 1286856
53452A286856k2723k3632k4096k4078k3781k3294k2614k1816k0872j9522j7610
$$ 1286856 1264133 1240501 1216405 1192327 1168546 1145252 1122638 1100822 1079950 1060428 1042818
53441A042818j5379j3245j1343r546p848o467n527m748l584j762L46K077L232
$$ 1042818 1027439 1014194 1002851 993305 985457 978990 973463 968715 965131 963369 963715 965792 969024
53428I69024M230N371O459P439Q898J1284J3889J5469J5886J6329J7746J9800
$$ 969024 973254 978625 985084 992523 1001421 1012705 1026594 1042063 1057949 1074278 1092024 1111824
53416A111824K1695K3320K5067K6982K8689K9943L0828L1592L2548L4007L5996
$$ 1111824 1133519 1156839 1181906 1208888 1237577 1267520 1298348 1329940 1362488 1396495 1432491
53405A432491L8247M0536M2851M5055M6786M7962M9087N0764N3027N5339N7132
$$ 1432491 1470738 1511274 1554125 1599180 1645966 1693928 1743015 1793779 1846806 1902145 1959277
53394A959277N8154N8618N9044N9804O0623O0789N9965N8467N6709N4773N2700
$$ 1959277 2017431 2076049 2135093 2194897 2255520 2316309 2376274 2434741 2491450 2546223 2598923
53383B598923N0664M8560M5841M2188L8070L4209L0703K7010K2605J7406J1748
$$ 2598923 2649587 2698147 2743988 2786176 2824246 2858455 2889158 2916168 2938773 2956179 2967927
53372B967927O183J044l965r478j5573k1584k7099l2635l8861m5443n1233n5444
$$ 2967927 2974110 2975154 2971189 2961711 2946138 2924554 2897455 2864820 2825959 2780516 2729283 2673839
53360B673839n8157n9850o0904o1501o1609o1068n9979n8805n7842n6794n5257
$$ 2673839 2615682 2555832 2494928 2433427 2371818 2310750 2250771 2191966 2134124 2077330 2022073
53349B022073n3319n1272m9063m6625m4514m3456m3281m2942m1753l9978l8102
$$ 2022073 1968754 1917482 1868419 1821794 1777280 1733824 1690543 1647601 1605848 1565870 1527768
53338A527768l6079l3614l0721k7715k4912k2519k0552j8739j6783j4798j3221
$$ 1527768 1491689 1458075 1427354 1399639 1374727 1352208 1331656 1312917 1296134 1281336 1268115
53327A268115j2200j1466j0915j0800j1159j1491j1393j1054j0714r986q354o205
$$ 1268115 1255915 1244449 1233534 1222734 1211575 1200084 1188691 1177637 1166923 1156937 1148583 1142378
53315A142378m651m165l914k826q81J030K343L383M666O159P466Q491R534J0857
$$ 1142378 1137727 1133562 1129648 1126822 1125941 1126971 1129314 1132697 1137363 1143522 1150988 1159479 1169013 1179870
53301A179870J2474J4363J6534J8768K0663K2078K3359K4866K6463K7690K8338
$$ 1179870 1192344 1206707 1223241 1242009 1262672 1284750 1308109 1332975 1359438 1387128 1415466
53290A415466K8603K8762K8912K9005K8851K8089K6366K3678K0465J7318J4579
$$ 1415466 1444069 1472831 1501743 1530748 1559599 1587688 1614054 1637732 1658197 1675515 1690094
53279A690094J2227J0061P851N340K248j515n485q825j1184j3268j6086j9609
$$ 1690094 1702321 1712382 1720233 1725573 1727821 1726306 1720821 1711996 1700812 1687544 1671458 1651849
53267A651849k2692k4536k5668k7096k8920l0388l1106l1520l2172l3018l3656
$$ 1651849 1629157 1604621 1578953 1551857 1522937 1492549 1461443 1429923 1397751 1364733 1331077
53256A331077l3798l3433l2782l2293l2335l2724l2732l1768k9965k8038k6674
$$ 1331077 1297279 1263846 1231064 1198771 1166436 1133712 1100980 1069212 1039247 1011209 984535
53245I84535k6107k6057k5976k5484k4670k3910k3340k2661k1552k0109j8757
$$ 984535 958428 932371 906395 880911 856241 832331 808991 786330 764778 744669 725912
53234G25912j7737j6837j5614j3852j1808r975q631p693o973o538o648p461q808
$$ 725912 708175 691338 675724 661872 650064 640089 631458 623765 616792 610254 603606 596145 587337
53221E87337j0233j1176j1302j0837j0423j0507j0900j1136j1116j1096j1129
$$ 587337 577104 565928 554626 543789 533366 522859 511959 500823 489707 478611 467482
53210D67482j0875j0158r350q971r028r029q616p921p270o749o254n850n759n939
$$ 467482 456607 446449 437099 428128 419100 410071 401455 393534 386264 379515 373261 367411 361652 355713
53196C55713n993n660n246n190n375n252m697m270m455m998n236m821l854k605
$$ 355713 349720 344060 338814 333624 328249 322997 318300 314030 309575 304577 299341 294520 290666 288061
53182B88061j418p08p14j258j997k713l166k989k108j090o14o34n15N9P20R48
$$ 288061 286643 285935 285221 283963 281966 279253 276087 273098 270990 269900 269286 268652 268137 268196 268916 269864
53166B69864N87k25j176j810j816j468j360j571j536r18k20j69p40j229j163q03
$$ 269864 270451 270226 269050 267240 265424 263956 262596 261025 259489 258571 258351 258182 257442 256213 255050 254247
53150B54247p29j125j603j645j212q33r78j388j344n97K67N89M43M23Q10J332
$$ 254247 253518 252393 250790 249145 247933 247100 246122 244734 243390 242793 243060 243649 244092 244515 245325 246657
53134B46657J597J469J035M77J9j86j65Q2P23J736K517K312J253M71P83J610J646
$$ 246657 248254 249723 250758 251235 251254 251068 250903 250985 251708 253444 255961 258273 259526 259997 260780 262390 264036
53117B64036M95r15j574j430j008n59o3K37l2p75j432j595j292p15r7J35l36j181
$$ 264036 264531 263616 262042 260612 259604 259045 258982 259219 259187 258412 256980 255385 254093 253378 253281 253416 253080 251899
53099B51899j663j607j603j991k217j679p72m02p05r48n80J84Q60J213J143N55
$$ 251899 250236 248629 247026 245035 242818 241139 240367 239965 239260 238312 237732 237916 238776 239989 241132 241687
53083B41687l58j053j092n32K19P82R22N64j19p20q65m93R4M42K93j16k69k1J82
$$ 241687 241329 240276 239184 238652 238871 239653 240575 241139 241020 240300 239435 238942 239036 239478 239771 239655 239386 239365 239547
53064B39547j9k84o5M18L35n46j399j377p15l06m82o99m14J44L06j23n88m71J46
$$ 239547 239528 239244 239179 239597 239932 239386 237987 236610 235895 235589 235107 234408 233994 234138 234444 234321 233733 233262 233408
53045B33408O76Q30Q61R09O08k60j161j395j102j025j363j568j354j137j166r19
$$ 233408 234084 234914 235775 236684 237292 237032 235871 234476 233374 232349 230986 229418 228064 226927 225761 224842
53029B24842K7J085J312P13K01L27O59N50l8p01j105j110o33K45J142J634J628
$$ 224842 224869 225954 227266 227979 228180 228507 229166 229716 229678 228977 227872 226762 226129 226374 227516 229150 230778
53012B30778J399J225J157J171J329J654J907J680Q06l84j281j483j055m42j51
$$ 230778 232177 233402 234559 235730 237059 238713 240620 242300 243106 242722 241441 239958 238903 238461 238310
52997B38310m37j100j617j552r12n8O14Q95P74M16J35K12N99Q74O91K67L43J280
$$ 238310 237873 236773 235156 233604 232692 232634 233248 234143 234917 235333 235468 235680 236279 237153 237844 238111 238454 239734
52979B39734K374K418J174j33j83R02J929K251K201K048J606J093J347K509L383
$$ 239734 242108 244526 245700 245567 245384 246286 248215 250466 252667 254715 256321 257414 258761 261270 264653
52964B64653K941J644M98n10j845k905k555r76L61O79N47M19j22j194k041k256
$$ 264653 267594 269238 269736 269226 267381 264476 261921 260945 261306 261985 262532 262951 262829 261635 259594 257338
52948B57338k510l252l689k984j700j015j090j153q19l48R1M90N31m6p12n80L76
$$ 257338 254828 251576 247887 244903 243203 242188 241098 239945 239126 238778 238869 239359 239890 239844 239132 238552 238928
52931B38928J248J306O50j98p80p94k77K52K89l7k55l03m43n80l49J49L55J44
$$ 238928 240176 241482 242132 241934 241154 240360 240083 240335 240624 240587 240332 240029 239586 239006 238657 238806 239161 239305
52913B39305P7M90Q78M89o86j854k155j422l23K47M8l38l47r9O3K86Q40J372J258
$$ 239305 239382 239872 240750 241239 240553 238699 236544 235122 234799 235046 235094 234756 234409 234310 234373 234659 235499 236871 238129
52894B38129O37K80M15M55O0l27k77l7L3P5L60P14P85N49J80k39o07o68l34J56
$$ 238129 238766 239046 239461 239916 239976 239649 239372 239335 239368 239443 239803 240517 241302 241851 242031 241792 241185 240517 240183 240339
52874B40339N69Q66Q76M40K6O55K496M207M332L125K148K247K692K439J432L72
$$ 240339 240908 241774 242650 243090 243116 243771 246267 250474 254806 257931 260079 262326 265018 267457 268889 269261
52858B69261k70n04m37o3N20R06O07m62j723k381k221j871k072k897l808m273
$$ 269261 268991 268487 268050 267987 268507 269413 270020 269558 267835 265454 263233 261362 259290 256393 252585 248312
52842B48312m101l368k361j543j212j240j308j314j254r17o1J071J848J855J166
$$ 248312 244211 240843 238482 236939 235727 234487 233179 231865 230611 229694 229633 230704 232552 234407 235573
52827B35573J20q74j377j247r38r98j272j081l38J41k29r31j024l81K85M13Q6
$$ 235573 235693 234819 233442 232195 231257 230259 228987 227906 227568 227709 227480 226549 225525 225144 225429 225842 225928
52810B25928k92l99p0N19Q35N17r6l08N4N36P50P47M99l33j741k945l050k075
$$ 225928 225636 225237 225167 225686 226521 227038 226942 226634 226688 227224 227974 228721 229220 228887 227146 224201 221151 219076
52792B19076r03l21m08q01j144j224r45m24M4K41J99J31K18N25R95J465J747J752
$$ 219076 218173 217852 217444 216643 215499 214275 213330 212906 212950 213191 213390 213521 213739 214264 215259 216724 218471 220223
52774B20223J485R56J74p02j303j271o29J69O45P33P09P06N15k0n77o82l84k62
$$ 220223 221708 222664 222838 222136 220833 219562 218933 219102 219747 220480 221189 221895 222410 222390 221813 221131 220747 220485
52756B20485o70j329j761j775j347m12Q17J633J452O02M4L27J103J734J906J719
$$ 220485 219815 218486 216725 214950 213603 213191 214008 215641 217093 217695 217739 218066 219169 220903 222809 224528
52740B24528J508J689K378L082L147K589K089J957J707Q96p6n05l58k11m37r09
$$ 224528 226036 227725 230103 233185 236332 238921 241010 242967 244674 245570 245494 244989 244631 244420 243983 243074
52724B43074j384j653j511j049q87j522k443k569j727r97j272k026k084j229l30
$$ 243074 241690 240037 238526 237477 236590 235068 232625 230056 228329 227332 226060 224034 221950 220721 220391
52709B20391m4r3K9K47J85j15k28oK55L38M05N86N66pq13j024l38N59P96L75L0
$$ 220391 220347 220254 220283 220530 220715 220600 220372 220366 220621 220959 221364 221950 222516 222509 221696 220672 220334 220893 221689 222064 222094
52688B22094J69M68N41O12J129J941K341J874R27K73K59N21M70j04q89j395j351
$$ 222094 222263 222731 223272 223884 225013 226954 229295 231169 232096 232369 232628 233149 233619 233515 232626 231231 229880
52671B29880q33j38M13O51O58O84R18J260J364R72K62k05NP44J400J604J663K110
$$ 229880 229047 228909 229322 229973 230631 231315 232233 233493 234857 235829 236091 235886 235891 236635 238035 239639 241302 243412
52653B43412K862L145K396J036N7o3K28K14k84r40j444j742j823j616j214r55
$$ 243412 246274 249419 251815 252851 252908 252845 253073 253287 253003 252063 250619 248877 247054 245438 244224 243269
52637B43269j032j117n93P08K199L068L008K318J475P95M54N43R16J184J064P36
$$ 243269 242237 241120 240527 241235 243434 246502 249510 251828 253303 254098 254552 255095 256011 257195 258259 258995
52621B58995O72J022J303Q55m35j910k742k645j961j199p11o63r74j213q96r2
$$ 258995 259667 260689 261992 262847 262412 260502 257760 255115 253154 251955 251244 250581 249607 248394 247498 247406
52605B47406N62O79O47J028J684J994J744J308R32M71r2m21l63k44l15k95J56
$$ 247406 247968 248647 249294 250322 252006 254000 255744 257052 257984 258455 258363 257942 257579 257335 257020 256725 256881
52588B56881P99J071Q24M67M43Q18J319J523J174N06J58M98J166J471J175O80
$$ 256881 257680 258751 259575 260042 260485 261303 262622 264145 265319 265825 265983 266481 267647 269118 270293 270973
52572B70973M80O11O48J09r74j936k102j643j365j576j648j053k82j35n05o01
$$ 270973 271453 272064 272712 272821 271847 269911 267809 266166 264801 263225 261577 260524 260242 260107 259602 259001
52556B59001k15L1k93q48j133j061p35k11K13N0p37j468j522j020n12k50j38j5
$$ 259001 258786 258817 258524 257676 256543 255482 254747 254536 254749 254799 254062 252594 251072 250052 249540 249290 249152 249137
52538B49137K58P57J211J094L77j66J26Q34R55K78l58j96O22J473J936J854J225
$$ 249137 249395 250152 251363 252457 252834 252668 252794 253628 254583 254861 254503 254307 254929 256402 258338 260192 261417
52521B61417M58L13J096K051K125J284O10R36J834K241J852J414J740K741L597
$$ 261417 261875 262188 263284 265335 267460 268744 269354 270290 272124 274365 276217 277631 279371 282112 285709
52506B85709L649K913J879R55K28m66j302k246l020l280k994k532k313k362k336
$$ 285709 289358 292271 294150 295105 295333 294867 293565 291319 288299 285019 282025 279493 277180 274818 272482
52491B72482k000j496j061p04l07Q0L61N85P58O22O3l57O6J041J365M74p11j051
$$ 272482 270482 268986 267925 267221 266914 266994 267355 267940 268698 269320 269383 269026 269092 270133 271498 271972 271261 270210
52473B70210o31j93L11J518L167L940L074J296p6l37N18K044L358L598K886K172
$$ 270210 269579 269386 269697 271215 274382 278322 281396 282692 282616 282279 282797 284841 288199 291797 294683 296855
52457B96855J819J145k06j341j444j230j938l356m052l435k463k167k488k861
$$ 296855 298674 299819 299613 298272 296828 295598 293660 290304 286252 282817 280354 278187 275699 272838
52443B72838l080l136k843k157j499j349j689k077k121j753j182o38j14N62J268
$$ 272838 269758 266622 263779 261622 260123 258774 257085 255008 252887 251134 249952 249314 249200 249762 251030
52428B51030J514J030K47j78o9L84J096J907K261J796J051R38J522K051K106K034
$$ 251030 252544 253574 253821 253643 253574 253958 255054 256961 259222 261018 262069 263007 264529 266580 268686 270720
52412B70720K176K500L014L873M908N798O690P891Q838Q471O896N651N677N966
$$ 270720 272896 275396 278410 282283 287191 292989 299679 307570 316408 324879 331775 337426 343103 349069
52398C49069M956K471n01l272n678p395p986p559o616n419m156l361l370l506
$$ 349069 354025 356496 355995 352723 347045 339650 331664 324105 317489 312070 307914 304553 301183 297677
52384B97677k741j151P2K26n2K06J081J899K168J964J673J627J953K580L374M221
$$ 297677 294936 293785 293857 294083 294031 294237 295318 297217 299385 301349 303022 304649 306602 309182 312556 316777
52368C16777M886N021M556L951L661L461K754J487L11l06o57j204j800j903j379
$$ 316777 321663 326684 331240 335191 338852 342313 345067 346554 346865 346559 345902 344698 342898 340995 339616
52353C39616o98l32k97l39k88j00K82Q46J388J675J737J797J959K199K655L547
$$ 339616 338918 338586 338289 337950 337662 337562 337844 338690 340078 341753 343490 345287 347246 349445 352100 355647
52337C55647M675N397N450N384N864O768P569Q240R178J0363J1359J2127J3112
$$ 355647 360322 365719 371169 376553 382417 389185 396754 404994 414172 424535 435894 448021 461133
52324D61133J4379J5379J5878J6392J7376J8546J9393J9770J9618J8729J7316
$$ 461133 475512 490891 506769 523161 540537 559083 578476 598246 617864 636593 653909
52313F53909J6242J6051J6250J6109J5755J5733J5911J5665J4928J4272J3974
$$ 653909 670151 686202 702452 718561 734316 750049 765960 781625 796553 810825 824799
52302H24799J3724J3222J2500J1573J0391R145Q068O889N083K755O84o48j649
$$ 824799 838523 851745 864245 875818 886209 895354 903422 910311 915394 918149 918833 918185 916536
52289I16536k925m573o373q217r964j1156j1336j0569r309p818o026l963k034
$$ 916536 913611 909038 902665 894448 884484 873328 861992 851423 842114 834296 828270 824307 822273
52276H22273o63K63J357L000M813O102O781P504Q737J0086J0880J1124J1459J2219
$$ 822273 821610 821873 823230 826230 831043 837145 843926 851430 860167 870253 881133 892257 903716 915935
52262I15935J2922J2920J2263J1678J1723J2213J2571J2575J2414J2063J1096
$$ 915935 928857 941777 954040 965718 977441 989654 1002225 1014800 1027214 1039277 1050373
52251A050373R429P773O798O145M882K801M91j712l967o165p861r203j0878j2778
$$ 1050373 1059802 1067575 1074373 1080518 1085400 1088201 1088692 1086980 1083013 1076848 1068987 1059784 1048906 1036128
52237A036128j3774j3393j2741j3003j3858j4253j3942j3247j2103j0483r220
$$ 1036128 1022354 1008961 996220 983217 969359 955106 941164 927917 915814 905331 896111
52226H96111r131r637r431q269o946n792m458l131k541k557k027m63J206J952
$$ 896111 886980 877343 867912 859643 852697 846905 842447 839316 836775 834218 832191 831728 832934 834886
52212H34886J907J862K251L013L832M243M043L786M225N242N964N965N450M414
$$ 834886 836793 838655 840906 843919 847751 851994 856037 859823 864048 869290 875254 881219 886669 891083
52198H91083K713J125J062K658M331M790M545M708N325N719N689N403M694L410
$$ 891083 893796 894921 895983 898641 902972 907762 912307 917015 922340 928059 933748 939151 943845 947255
52184I47255J964Q20k20j505k797l745m667o023p477q278q295p981p541o909o291
$$ 947255 949219 950039 949819 948314 945517 941772 937105 931082 923605 915327 907032 899051 891510 884601 878310
52169H78310n965n645m735l141j328K86J475K032K086K366L394M580M873M211
$$ 878310 872345 866700 861965 858824 857496 857782 859257 861289 863375 865741 869135 873715 878588 882799
52155H82799L473L030K321J051j16n24m66n19m89K23J452K225J965J195P74Q27
$$ 882799 886272 889302 891623 892674 892558 892034 891568 891049 890560 890783 892235 894460 896425 897620 898394 899221
52139H99221Q24N89P11J765L460M980N934O620P349Q093Q866J0001J1775J4070
$$ 899221 900045 900634 901345 903110 906570 911550 917484 924104 931453 939546 948412 958413 970188 984258
52125I84258J6618J9284K1911K4202K6070K7752K9269L0154L0053K9325K8592
$$ 984258 1000876 1020160 1042071 1066273 1092343 1120095 1149364 1179518 1209571 1238896 1267488
52114A267488K7896K6754K4864K2342J9356J6013J2647R877Q115P156O285M803
$$ 1267488 1295384 1322138 1347002 1369344 1388700 1404713 1417360 1427237 1435352 1442508 1448793 1453596
52102A453596K587K85j227j691j692k034l095m766o652q288r472j0545j1958j3561
$$ 1453596 1456183 1456468 1455241 1453550 1451858 1449824 1446729 1441963 1435311 1427023 1417551 1407006 1395048 1381487
52088A381487j4819j5789j7153j8946k0045j9441j7467j5162j2932j0604q288
$$ 1381487 1366668 1350879 1333726 1314780 1294735 1275294 1257827 1242665 1229733 1219129 1210841
52077A210841o316m515k374R7K360M177N844P604R387J1069J2569J3684J4322
$$ 1210841 1204525 1200010 1197636 1197733 1200093 1204270 1210114 1217718 1227105 1238174 1250743 1264427 1278749
52064A278749J4758J5175J5190J4363J3051J2030J1422J0697R722Q959Q461P579
$$ 1278749 1293507 1308682 1323872 1338235 1351286 1363316 1374738 1385435 1395157 1404116 1412577 1420156
52052A420156N988M339L315K521R26j875n276q461j1160j3530j5574j6985j7635
$$ 1420156 1426144 1430483 1433798 1436319 1437245 1435370 1430094 1421633 1410473 1396943 1381369 1364384 1346749
52039A346749j8015j8772j9866k0574k0484j9981j9441j8523j6861j4994j3811
$$ 1346749 1328734 1309962 1290096 1269522 1249038 1229057 1209616 1191093 1174232 1159238 1145427
52028A145427j3364j2941j2208j1436j0744r921r100q741q818q760q392q163q193
$$ 1145427 1132063 1119122 1106914 1095478 1084734 1074813 1065713 1056972 1048154 1039394 1031002 1022839 1014646
52015A014646p893o957o130o349p518q613q806q176p484p504q367r486j0269j0860
$$ 1014646 1006753 999796 993666 987317 979799 971186 962380 954204 946720 939216 930849 921363 911094 900234
52001I00234j1800j3087j4100j4431j4263j3868j3357j3007j3076j3094j2145
$$ 900234 888434 875347 861247 846816 832553 818685 805328 792321 779245 766151 754006
51990G54006j0184q332p458p190o865o733p427q792j0022j0750j1243j1707j2031
$$ 754006 743822 735490 728032 720842 713977 707244 699817 691025 681003 670253 659010 647303 635272
51977F35272j2141j2104j1915j1575j1244j0921j0238q959p458o210n042l365
$$ 635272 623131 611027 599112 587537 576293 565372 555134 546175 538717 532507 527465 524100
51965E24100j039J488L759N473O287O113N598N676O362O550N286K929P53m16q84
$$ 524100 523061 524549 528308 533781 540068 546181 551779 557455 563817 570367 575653 578582 579335 578919 578035
51950E78035j534k817m327n279n259m416l023j153J146L647O116Q513J0749J2525
$$ 578035 576501 573684 569357 564078 558819 554403 551380 550227 551373 555020 561136 569649 580398 592923
51936E92923J3565J3926J3789J3192J2158J0908R568P847N289J862j954n561q562
$$ 592923 606488 620414 634203 647395 659553 670461 680029 687876 693165 695027 693073 687512 678950
51923F78950j0896j2865j4796j6437j6990j6069j4310j2584j0884q590n640k680
$$ 678950 668054 655189 640393 623956 606966 590897 576587 564003 553119 544529 538889 536209
51911E36209n0K622N580Q293J0026J0623J0423R740Q780P705O366M191P90l391
$$ 536209 536159 538781 544361 552654 562680 573303 583726 593466 602246 609951 616317 620508 621298 617907
51897F17907p312j0193j1916j2692j2775j2537j2451j2796j3458j4113j4477j4257
$$ 617907 610595 600402 588486 575794 563019 550482 538031 525235 511777 497664 483187 468930
51885D68930j3143j1076q542o258m530l069j539j2J278K423L718N095O081O438
$$ 468930 455787 444711 436169 429911 425381 422312 420773 420761 422039 424462 428180 433275 439356 445794
51871D45794O506O698O880O483N196L304J407l8r63j627k349l165l723l610k756
$$ 445794 452300 458998 465878 472361 477557 480861 482268 482230 481267 479640 477291 474126 470403 466793 464037
51856D64037j526l89M51J127J816K415K634K399J909J216Oj851l781m997n454
$$ 464037 462511 462122 462573 463700 465516 467931 470565 472964 474873 476089 476095 474244 470463 465466 460012
51841D60012n755o174o338o079n922o282o629n969m066j794l22j85q84j313p63
$$ 460012 454257 448083 441745 435666 429744 423462 416833 410864 406798 405004 404682 404497 403613 402300 401537
51826D01537L35R45P13K82J28j27r26j887k430k687l002k986k012m68N47O87O58
$$ 401537 401872 402817 403530 403812 403940 403813 402887 401000 398570 395883 392881 389895 387883 387415 387962 388649 389307
51809C89307R13J110J053J202J781K192J928J388J143R31J29j093j848j658q97
$$ 389307 390220 391330 392383 393585 395366 397558 399486 400874 402017 402948 403077 401984 400136 398478 397581
51794C97581j61K20R4n70j488k169k429k496k534k317j592o22p4k84p95q18j71
$$ 397581 397420 397640 397734 397164 395676 393507 391078 388582 386048 383731 382139 381517 381443 381159 380364 379546 379375
51777C79375M75M77P2K8N39J023J081J148J832L101M484N838P318Q760R614R598
$$ 379375 379850 380327 380399 380427 380966 381989 383070 384218 386050 389151 393635 399473 406791 415551 425165 434763
51761D34763Q938P876O296M117J765j05j299k199l210m310n282o128o994p740
$$ 434763 443701 451577 457873 461990 463755 463650 462351 460152 456942 452632 447350 441222 434228 426488
51747D26488p920p364o493n765n041l876k334j061l40M09J926M143O238P479P720
$$ 426488 418568 411204 404711 398946 393905 390029 387695 386634 386294 386703 388629 392772 399010 406489 414209
51732D14209P233O411N607N017M651M510M590M574L747J747o41j972j646o00k82
$$ 414209 421442 427853 433460 438477 443128 447638 452228 456802 460549 462296 461655 459683 458037 457437 457155
51717D57155j177k576l554l847l831l962m287m396l866k775j739j195q77k23P73
$$ 457155 455978 453402 449848 446001 442170 438208 433921 429525 425659 422884 421145 419950 419073 418850 419623
51702D19623J505J658J724K335L369M099M039L327K291J150K06j60O3K70j85j263
$$ 419623 421128 422786 424510 426845 430214 434313 438352 441679 443970 445120 445326 445166 445229 445499 445314 444051
51686D44051k304k778k799k927l566m568n349n465n015m424l791k793j316J72
$$ 444051 441747 438969 436170 433243 429677 425109 419760 414295 409280 404856 401065 398272 396956 397128
51672C97128J100J488J866K654L920N527P152Q263Q471P991P375O799N920M507
$$ 397128 398228 399716 401582 404236 408156 413683 420835 429098 437569 445560 452935 459734 465654 470161
51658D70161K810J141m67k010l132l369k644j361q4Q12J296J618K054K587K898
$$ 470161 472971 474112 473645 471635 468503 465134 462490 461129 461045 461857 463153 464771 466825 469412 472310
51643D72310K571J253j258m689q076j0274j0897j0559j0049r570q909q009p004
$$ 472310 474881 476134 474876 470187 462111 451837 440940 430381 420332 410762 401853 393844 386840
51630C86840n888m506k895j410n22m32p76p28K93J904L044L046K192J061j66j466
$$ 386840 380952 376446 373551 372141 371619 371187 370411 369683 369976 371880 374924 377970 380162 381223 381057 379591
51614C79591k460k688k183j387o03M7M28N61Q40J468J842J223J8l32R54L030M487
$$ 379591 377131 374443 372260 370873 370270 370317 370745 371306 372146 373614 375456 376679 376697 376365 377319 380349 384836
51597C84836M921M932N043N204N204M977M501L803L127K693K214J004j150l491
$$ 384836 389757 394689 399732 404936 410140 415117 419618 423421 426548 429241 431455 432459 431309 427818
51583D27818m880m843l831k540j197M46K613N149P620R655J1261J2835J4821J7195
$$ 427818 422938 418095 414264 411724 410527 410973 413586 418735 426355 436010 447271 460106 474927 492122
51569D92122J9289K0222J9630J8014J6496J6218J7702K0363K2703K3462K2822
$$ 492122 511411 531633 551263 569277 585773 601991 619693 640056 662759 686221 709043
51558G09043K2240K2841K4328K5615K6165K6065K5105K2575J8185J2546O357m48
$$ 709043 731283 754124 778452 804067 830232 856297 881402 903977 922162 934708 941065 940617
51546I40617q280j6777k4565l0271l3550l5075l5670l5554l4422l2207k9534k7209
$$ 940617 932337 915560 890995 860724 827174 792099 756429 720875 686453 654246 624712 597503
51534E97503k5285k3027j9950j6606j4007j2466j1355j0026q553p370o502n575
$$ 597503 572218 549191 529241 512635 498628 486162 474807 464781 456228 448858 442356 436781
51522D36781m468l575l166k876k201j318r28j155j168k62J114J966K095K171K518
$$ 436781 432313 428738 425572 422696 420495 419177 418249 417094 415926 415664 416778 418744 420839 423010 425528
51507D25528K583J881Q54K85K64J72m46j454k417k936k789k135j539j470j718
$$ 425528 428111 429992 430846 431131 431395 431567 431121 429667 427250 424314 421525 419390 417851 416381 414663
51492D14663j641j002k74k7k89o55q31q97j097j528k068k536k861l087l201l147
$$ 414663 413022 412020 411746 411719 411430 410775 409944 409047 407950 406422 404354 401818 398957 395870 392669 389522
51476C89522k998k979l155l277l176l090l398l989m251l809l019k549k618k739
$$ 389522 386524 383545 380390 377113 373937 370847 367449 363460 359209 355400 352381 349832 347214 344475
51462C44475k284j157Q6P84P21K36j58q8N10J383K110K535L007L874M865N445
$$ 344475 342191 341034 341120 341904 342625 342861 342703 342615 343125 344508 346618 349153 352160 356034 360899 366344
51446C66344N780O710Q537J0475J1774J2690J3645J4040J2972J0858R181Q521
$$ 366344 372124 378834 387371 397846 409620 422310 435955 449995 462967 473825 483006 491527
51434D91527P769N667K274j411m521o572p308o979o382o168o398p041q262r770
$$ 491527 499296 504963 507237 505826 501305 494733 487425 480446 474064 467896 461498 454457 446195 436425
51420D36425j0481r560p508n520m054k730j369l40J60M94J064J869K695L414L987
$$ 436425 425944 416384 408876 403356 399302 396572 395203 394863 395023 395517 396581 398450 401145 404559 408546
51405D08546M402M625M465L641K216P96k6k36m8N49J487K200K246K132K688L790
$$ 408546 412948 417573 422038 425679 427895 428691 428665 428429 428381 428930 430417 432617 434863 436995 439683 443473
51389D43473M546M827N674P886J1028J4274J7474K0861K4330K7691L1235L5344
$$ 443473 448019 452846 458520 466406 477434 491708 509182 530043 554373 582064 613299 648643
51377F48643L9679M3286M5419M5942M5063M3139M0528L7251L2740K6205J7340
$$ 648643 688322 731608 777027 822969 868032 911171 951699 988950 1021690 1047895 1065235
51366A065235O610m938j5988k5342l2407l7418m1023m3698m5535m6338m5844m3993
$$ 1065235 1071845 1066907 1050919 1025577 993170 955752 914729 871031 825496 779158 733314 689321
51354F89321m1130l7736l3962k9676k5059k0764j7317j4696j2579j0708q886p114
$$ 689321 648191 610455 576493 546817 521758 500994 483677 468981 456402 445694 436808 429694
51342D29694n883n739o264o175m870l338k807l131l227k821k656l132l618l415
$$ 429694 423811 418072 411808 405633 400763 397425 394618 391487 388260 385439 382783 379651 376033 372618
51328C72618k638j869j401j135r17o67m32l60n05o84p10o28m59j0O71J003O41
$$ 372618 369980 368111 366710 365575 364658 363991 363559 363199 362694 362010 361300 360672 360213 360203 360874 361877 362518
51311C62518K61Q17K087K839K480J705J330J327J397J584J818J543N45m41o71
$$ 362518 362779 363596 365683 368522 371002 372707 374037 375364 376761 378345 380163 381706 382251 381810 381139
51296C81139m99q01j591k112k127k267k892l426l151k280j672j726j889j359n9
$$ 381139 380640 379839 378248 376136 374009 371742 368850 365424 362273 359993 358321 356595 354706 353347 353288
51281C53288J322K195K744L457M204M328L696L059L056L326L142K489J951J724
$$ 353288 354610 356805 359549 363006 367210 371538 375234 378293 381349 384675 387817 390306 392257 393981
51267C93981J501J189J071J180J111P75O76J151J745J775J183L77m82j517k559
$$ 393981 395482 396671 397742 398922 400033 400808 401484 402635 404380 406155 407338 407715 407233 405716 403157
51252D03157l123l075k900l017l119k639j690j115j450k205k416j750p05Q7M52
$$ 403157 400034 396959 394059 391042 387923 385284 383594 382479 381029 378824 376408 374658 373953 374040 374492
51237C74492N00L33K1l48q40j607k476k876k522j929j747j827j388j82J040J393
$$ 374492 374992 375325 375346 374998 374158 372551 370075 367199 364677 362748 361001 359174 357786 357604 358644 360037
51221C60037Q55P4m13n14k70L52J349K538L511L771L132K107J610K012K652K674
$$ 360037 360892 360966 360553 360039 359769 360121 361470 364008 367519 371290 374422 376529 378139 380151 382803 385477
51205C85477K139J846K145K506K460K311K475K596J949N49p63j395j588j845k229
$$ 385477 387616 389462 391607 394113 396573 398884 401359 403955 405904 406453 405690 404295 402707 400862 398633
51190C98633k556k838l198l465l268k466j328l24J99K14O7K05P02J138J072M99
$$ 398633 396077 393239 390041 386576 383308 380842 379514 379190 379389 379603 379670 379875 380577 381715 382787 383286
51174C83286k19o91o57q4O91J107R60O34N90Q24J108J422J836K163K232K260K511
$$ 383286 383067 382376 381719 381635 382326 383433 384393 385027 385617 386441 387549 388971 390807 392970 395202 397462 399973
51157C99973K749K575K073J614J126K97n50o53RN21K99k06n12r67j952k841k671
$$ 399973 402722 405297 407370 408984 410110 410407 409857 409204 409213 409734 410033 409827 409315 408348 406396 403555 400884
51140D00884j543o02o34j328j941k126j957j615j193o94j27L25L79P7j19J38O43
$$ 400884 399341 398739 398105 396777 394836 392710 390753 389138 387945 387251 387124 387449 387828 387905 387786 387924 388567
51123C88567R97J194J515K073K783L557M173M175L373K325J809J944K263K525
$$ 388567 389564 390758 392273 394346 397129 400686 404859 409034 412407 414732 416541 418485 420748 423273
51109D23273K925L456L691L382K858K588K634K731K644K323J886J495J148O06
$$ 423273 426198 429654 433345 436727 439585 442173 444807 447538 450182 452505 454391 455886 457034 457640
51095D57640k68j178j672j676j474j262j038r00j003j228j299j261j408j744j836
$$ 457640 457372 456194 454522 452846 451372 450110 449072 448172 447169 445941 444642 443381 441973 440229 438393
51080D38393j352m07O10J242J080J88o38n58L04J131J631K314L385M222M388M415
$$ 438393 437041 436634 437244 438486 439566 439754 439116 438558 438862 439993 441624 443938 447323 451545 455933 460348
51064D60348N035O215P582R193J1153J2831J3410J3077J2916J3623J4872J5909
$$ 460348 465383 471598 479180 488373 499526 512357 525767 538844 551760 565383 580255 596164
51052E96164J6128J5145J3007J0565R049R025J0030J1218J1877J1362R249N982
$$ 596164 612292 627437 640444 651009 660058 669083 679113 690331 702208 713570 722819 728801
51040G28801K829O63j011l417o975j0768j3471j4556j4481j3954j3252j2383j1779
$$ 728801 731630 732293 731282 727865 720890 710122 696651 682095 667614 653660 640408 628025 616246
51027F16246j2261j3994j5719j5744j3726j0953q711o913m732k049L51J894K836
$$ 616246 603985 589991 574272 558528 544802 533849 525138 518225 513493 511444 511795 513689 516525
51014E16525L790M998O261P255P806Q042Q314Q830R405R687R625R403R019Q307
$$ 516525 520315 525313 531574 538829 546635 554677 562991 571821 581226 590913 600538 609941 618960 627267
51000F27267P477P148P571Q175Q244P769P284O947O368N345M298L801L927M280
$$ 627267 634744 641892 649463 657638 665882 673651 680935 687882 694250 699595 703893 707694 711621 715901
50986G15901M488M512M613N131O172P415Q412R104R778J0478J0912J1134J1835
$$ 715901 720389 724901 729514 734645 740817 748232 756644 765748 775526 786004 796916 808050 819885
50973H19885J3472J5473J7015J8330K0500K3923K7825L1520L5353L9843M4505
$$ 819885 833357 848830 865845 884175 904675 928598 956423 987943 1023296 1063139 1107644
50962A107644M8302N1008N3352N5876N8258N9850O0334N9686N7906N5056N1306
$$ 1107644 1155946 1206954 1260306 1316182 1374440 1434290 1494624 1554310 1612216 1667272 1718578
50951A718578M6781M1503L5606K9413K3241J7288J1722O678K069k300o342r631
$$ 1718578 1765359 1806862 1842468 1871881 1895122 1912410 1924132 1930810 1932879 1930579 1924237 1914606
50939A914606j1848j3145j3930j4570j5374j6595j8190j9727k0791k1434k2075
$$ 1914606 1902758 1889613 1875683 1861113 1845739 1829144 1810954 1791227 1770436 1749002 1726927
50928A726927k3125k4801k7077k9575l1743l3455l5228l7552m0052m1804m2394
$$ 1726927 1703802 1679001 1651924 1622349 1590606 1557151 1521923 1484371 1444319 1402515 1360121
50917A360121m2278m2069m1855m1315m0101l7959l4876l1360k8238k5863k3762
$$ 1360121 1317843 1275774 1233919 1192604 1152503 1114544 1079668 1048308 1020070 994207 970445
50906I70445k1347j8722j6426j4704j3394j2405j1772j1302j0638r777r109q842
$$ 970445 949098 930376 913950 899246 885852 873447 861675 850373 839735 829958 820849 812007
50894H12007q738q517q171p679o772n282l489j888p64j50Nl9K27J072K110K759
$$ 812007 803269 794752 786581 778902 772130 766848 763359 761471 760707 760557 760562 760523 760750 761822 763932 766691
50878G66691L044L634M923O458P497P902Q221Q971J0120J1273J2222J3078J4052
$$ 766691 769735 773369 778292 784750 792247 800149 808370 817341 827461 838734 850956 864034 878086
50865H78086J5263J6839J8964K1672K4663K7540L0179L2778L5674L9290M4069
$$ 878086 893349 910188 929152 950824 975487 1003027 1033206 1065984 1101658 1140948 1185017
50854A185017N0004N6319O2200O7919P4625Q2789R1458R9455J06745J13934J20952
$$ 1185017 1235021 1291340 1353540 1421459 1496084 1578873 1670331 1769786 1876531 1990465 2111417
50843B111417J27056J31900J35640J37970J37960J35122J29835J22476J12867
$$ 2111417 2238473 2370373 2506013 2643983 2781943 2917065 3046900 3169376 3282243
50834C282243J00859Q6789P0828N2739L2936J3312l976j8293l0358m0522m8112
$$ 3282243 3383102 3469891 3540719 3593458 3626394 3639706 3635730 3617437 3587079 3546557 3498445
50823C498445n2512n3993n3129n0115m5188l9317l3907k9875k7418k6589k7706
$$ 3498445 3445933 3391940 3338811 3288696 3243508 3204191 3170284 3140409 3112991 3086402 3058696
50812C058696l1063l6480m3362n1241o0071o9767p9567q8163r4759r9652j03439
$$ 3058696 3027633 2991153 2947791 2896550 2836479 2766712 2687145 2598982 2504223 2404571 2301132
50801B301132j05877j06047j03557r8987r3044q5896p7698o9119o0765n2409m3540
$$ 2301132 2195255 2089208 1985651 1886664 1793620 1707724 1630026 1560907 1500142 1447733 1404193
50790A404193l4577k6812k0983j6413j1884o984k301J356L577M407M250L643K818
$$ 1404193 1369616 1342804 1321821 1305408 1293524 1286540 1284239 1285595 1289172 1293579 1297829 1301472 1304290
50777A304290J536l77k498m219n603p297r564j1864j3622j4874j5887j6607j7030
$$ 1304290 1305826 1305449 1302951 1298732 1293129 1285832 1276268 1264404 1250782 1235908 1220021 1203414 1186384
50764A186384j7667j9015k0673k1693k1777k1449k1025k0079j8260j6042j4117
$$ 1186384 1168717 1149702 1129029 1107336 1085559 1064110 1043085 1023006 1004746 988704 974587
50753I74587j2522j0808q789o576m105j141K215N513Q461J1148J3737J6323J9133
$$ 974587 962065 951257 942468 935892 931787 930646 932861 938374 946835 957983 971720 988043 1007176
50740A007176K2510K6606L1198L5954M0627M5022M9076N3107N7624O2665O7483
$$ 1007176 1029686 1056292 1087490 1123444 1164071 1209093 1258169 1311276 1368900 1431565 1499048
50729A499048P1143P3371P4644P5488P5886P5434P3815P1020O7113O2033N5737
$$ 1499048 1570191 1643562 1718206 1793694 1869580 1945014 2018829 2089849 2156962 2218995 2274732
50718B274732M8376M0186L1222K1419J0919R6j0739k1314l0962l8611m3602m6185
$$ 2274732 2323108 2363294 2394516 2415935 2426854 2426950 2416211 2394897 2363935 2325324 2281722 2235537
50706B235537m6814m5229m0989l4743k8255k2786j8180j3882j0353q783r686j2485
$$ 2235537 2188723 2143494 2102505 2067762 2039507 2016721 1998541 1984659 1974306 1965523 1955837 1943352
50694A943352j6423k1252k6872l2773l8278m3066m7194n0642n3107n4193n3679
$$ 1943352 1926929 1905677 1878805 1846032 1807754 1764688 1717494 1666852 1613745 1559552 1505873
50683A505873n1526m7842m2873l6985l0542k3696j6421q782j133O076J2700J8882
$$ 1505873 1454347 1406505 1363632 1326647 1296105 1272409 1255988 1247206 1246073 1252149 1264849 1283731
50671A283731K4564K9246L2530L4738L6659L8514L9514L8736L6257L3096L0076
$$ 1283731 1308295 1337541 1370071 1404809 1441468 1479982 1519496 1558232 1594489 1627585 1657661
50660A657661K7084K3637J9879J6659J4629J3653J3146J2788J2647J2830J3299
$$ 1657661 1684745 1708382 1728261 1744920 1759549 1773202 1786348 1799136 1811783 1824613 1837912
50649A837912J4052J5146J6488J7932J9727K2562K6772L1653L5992L9319M2218
$$ 1837912 1851964 1867110 1883598 1901530 1921257 1943819 1970591 2002244 2038236 2077555 2119773
50638B119773M5263M8047M9675M9908M9433M8929M8321M7022M4647M1267L7140
$$ 2119773 2165036 2213083 2262758 2312666 2362099 2411028 2459349 2506371 2551018 2592285 2629425
50627B629425L2397K6858K0062J1714K461n996j2051j5824j9475k5503l4373m3714
$$ 2629425 2661822 2688680 2708742 2720456 2722917 2716921 2704870 2689046 2669571 2644068 2609695 2565981
50615B565981m9826n0224m5044l6421k6728j7394q997j942L207N867N706K835
$$ 2565981 2516155 2465931 2420887 2384466 2357738 2340344 2331347 2329405 2332612 2338479 2344185 2347020
50603B347020k147q488j5809k4216l3726m3737n3274o1610o8299p2881p4997p4886
$$ 2347020 2344873 2336385 2320576 2296360 2262634 2218897 2165623 2104013 2035714 1962833 1887836 1812950
50591A812950p3353p1037o7959o3903n8952n3551m8233m3358l8989l4855l0752
$$ 1812950 1739597 1668560 1600601 1536698 1477746 1424195 1375962 1332604 1293615 1258760 1228008
50580A228008k6957k3987k1864j9978j7834j5516j3315j1243r243p428n759l819
$$ 1228008 1201051 1177064 1155200 1135222 1117388 1101872 1088557 1077314 1068071 1060643 1054884 1051065
50568A051065j340J376L894O227Q519J0566J2165J3680J5594J7794J9977K2519
$$ 1051065 1049725 1051101 1054995 1061222 1069741 1080307 1092472 1106152 1121746 1139540 1159517 1182036
50556A182036K6009K9989L3180L5171L6905L9029M0804M1255M0704M0157L9758
$$ 1182036 1208045 1238034 1271214 1306385 1343290 1382319 1423123 1464378 1505082 1545239 1584997
50545A584997L8804L7161L5694L5184L5600L6626L8351M1095M5004M9981N5806
$$ 1584997 1623801 1660962 1696656 1731840 1767440 1804066 1842417 1883512 1928516 1978497 2034303
50534B034303O2065O8333P4581Q1216Q8516R6217J03772J10886J17561J23800
$$ 2034303 2096368 2164701 2239282 2320498 2409014 2505231 2609003 2719889 2837450 2961250
50524B961250J29453J34293J38084J40513J41067J39100J34180J26411J16269
$$ 2961250 3090703 3224996 3363080 3503593 3644660 3783760 3917940 4044351 4160620
50515D160620J03991Q9271P1774N1811L0209P678j5335l8115n9561p8717r5179
$$ 4160620 4264611 4353882 4425656 4477467 4507676 4515354 4500019 4461904 4402343 4323626 4228447
50504D228447j08702j18719j24540j25809j22537j14831j02914q7416o9373m9912
$$ 4228447 4119745 4001026 3876486 3750677 3628140 3513309 3410395 3322979 3253606 3203694
50494C203694l0085j0898O656K1647L3168M0333M2498L9497L1571J9148K818j6601
$$ 3203694 3173609 3162711 3169367 3191014 3224182 3264515 3307013 3346510 3378081 3397229 3400047 3383446
50482C383446l8155o0732q2815j02481j18189j29635j37408j41743j42133j38354
$$ 3383446 3345291 3284559 3201744 3099263 2981074 2851439 2714031 2572288 2430155 2291801
50472B291801j31419j22937j13852j04269r4401q4942p6350o8268o0177n2307
$$ 2291801 2160382 2037445 1923593 1819324 1724923 1639981 1563631 1495363 1435186 1382879
50462A382879m5501m0154l5702l1281k6636k2134j8043j4149j0226o589l818k050
$$ 1382879 1337378 1297224 1261522 1230241 1203605 1181471 1163428 1149279 1139053 1132464 1128646 1126596
50450A126596p88M56J654K538L088L597M353N515P108Q836J0080J0408J0156J0124
$$ 1126596 1125808 1126264 1127918 1130456 1133544 1137141 1141494 1147009 1154117 1162953 1173033 1183441 1193597 1203721
50436A203721J0658J1265J1201J0290R015Q066P919Q667J0093J1913J4021J6406
$$ 1203721 1214379 1225644 1236845 1247135 1256150 1264216 1272135 1280802 1290895 1302808 1316829 1333235
50424A333235J8864K1037K2781K4372K6188K8341L0655L2927L5154L7596M0599
$$ 1333235 1352099 1373136 1395917 1420289 1446477 1474818 1505473 1538400 1573554 1611150 1651749
50413A651749M4260M8333N2562N6974O1544O5732O8803P0599P1582P1981P1389
$$ 1651749 1696009 1744342 1796904 1853878 1915422 1981154 2049957 2120556 2192138 2264119 2335508
50402B335508O9359O5931O1269N5175M7360L7958K7385J5919L691r068k2082l5082
$$ 2335508 2404867 2470798 2532067 2587242 2634602 2672560 2699945 2715864 2719555 2710487 2688405 2653323
50390B653323m7489n8390o7165p3937p8937q1608q0932p6615o9507o0817n1226
$$ 2653323 2605834 2547444 2480279 2406342 2327405 2245797 2164865 2088250 2018743 1957926 1906700
50379A906700m0819k9648j8215p480J684R088J4870J8582J9227J6605J1922O369
$$ 1906700 1865881 1836233 1818018 1810538 1812222 1821310 1836180 1854762 1873989 1890594 1902516 1908885
50367A908885m27r506k0460l1309m0549m8302n5142o0773o4380o5663o4981o2939
$$ 1908885 1908458 1898952 1878492 1847183 1806634 1758332 1703190 1642417 1578037 1512374 1447393 1384454
50355A384454o0192n7190n3850m9856m5502m1633l8515l5426l1778k7972k4602
$$ 1384454 1324262 1267072 1213222 1163366 1117864 1076231 1037716 1002290 970512 942540 917938
50344I17938k1471j8057j4461j1060p679l842L20M164P380J0050J1969J2657J2142
$$ 917938 896467 878410 863949 852889 845210 841368 841688 845852 853232 863282 875251 887908 900050
50331I00050J1041R751Q141O127L935J557j474n258q824j0701j0297q373o173
$$ 900050 911091 920842 928983 935110 939045 940602 939128 933870 925046 914345 904048 895675 889502
50318H89502m216k137L61K775M255M675M735M975N217N119M800M542M394M450
$$ 889502 885286 883149 883510 886285 890540 895215 899950 904925 910142 915261 920061 924603 928997 933447
50304I33447N052O154O911O687O092O256P212P880P688P314P684Q968J0858J3101
$$ 933447 938499 944653 951564 958251 964343 970599 977811 985691 993379 1000693 1008377 1017345 1028203 1041304
50290A041304J5420J7549J9768K2964K7547L2563L6082L6342L2722K6428K0400
$$ 1041304 1056724 1074273 1094041 1117005 1144552 1177115 1213197 1249539 1282261 1308689 1329089
50279A329089J7326J6579J3701M192j1811k9113m1679m6793m5473m0221l3222
$$ 1329089 1346415 1362994 1376695 1380887 1369076 1339963 1298284 1251491 1206018 1165797 1132575
50268A132575k6086k0050j5774j3093j1283r659q016o534n402m527l652k675j734
$$ 1132575 1106489 1086439 1070665 1057572 1046289 1036630 1028614 1022080 1016678 1012151 1008499 1005824 1004090
50255A004090r63j48J247L571O557R474J1831J3832J6055J8780K1812K4796K7519
$$ 1004090 1003127 1002979 1004226 1007797 1014354 1023828 1035659 1049491 1065546 1084326 1106138 1130934 1158453
50242A158453K9872L1788L3241L4172L4459L4072L3207L2022L0339K7898K4816
$$ 1158453 1188325 1220113 1253354 1287526 1321985 1356057 1389264 1421286 1451625 1479523 1504339
50231A504339K1483J8006J4191J0065N879J380m241j1295j8878k5732l1510l6647
$$ 1504339 1525822 1543828 1558019 1568084 1573963 1575343 1571102 1559807 1540929 1515197 1483687 1447040
50219A447040m1233m4624m6125m5599m3289l9667l5486l1575k8218k5076k1890
$$ 1447040 1405807 1361183 1315058 1269459 1226170 1186503 1151017 1119442 1091224 1066148 1044258
50208A044258j9052j7282j6963j7910j9535k1034k1672k1207k0086j8950j7944
$$ 1044258 1025206 1007924 990961 973051 953516 932482 910810 889603 869517 850567 832623
50197H32623j6600j4504j1915r697q587q536q773q527p687o760o250o217o354
$$ 832623 816023 801519 789604 779907 771320 762784 754011 745484 737797 731037 724787 718570 712216
50184G12216o349o116n787n549n477n506n584n757n959n862n133l922k874k518
$$ 712216 705867 699751 693964 688415 682938 677432 671848 666091 660132 654270 649137 645215 642341 639823
50170F39823k762k991k590j360L49J844K585K644K559K742L163L707M436N350
$$ 639823 637061 634070 631480 630120 630469 632313 634898 637542 640101 642843 646006 649713 654149 659499
50156F59499O176O777P565Q995J0714J1759J1740J1347J1430J2008J2441J2274
$$ 659499 665675 672452 680017 689012 699726 711485 723225 734572 746002 758010 770451 782725
50144G82725J1446R945P886N882M771M843N654O770Q295J0469J3204J6384K0304
$$ 782725 794171 804116 812002 817884 822655 827498 833152 839922 848217 858686 871890 888274 908578
50131I08578K5317L1144L7019M2554M7922N3142N7562O0529O2240O3568O5085
$$ 908578 933895 965039 1002058 1044612 1092534 1145676 1203238 1263767 1326007 1389575 1454660
50120A454660O6574O7454O7328O6002O3351N9460N4790M9865M4721L8944L2212
$$ 1454660 1521234 1588688 1656016 1722018 1785369 1844829 1899619 1949484 1994205 2033149 2065361
50109B065361K4587J6113O370n204j8491l2378m5326n6209o4682p0927p5212p7493
$$ 2065361 2089948 2106061 2112431 2107227 2088736 2056358 2011032 1954823 1890141 1819214 1744002 1666509
50097A666509p7449p4879p0228o4528n8804n3574m8904m4643m0389l5565k9968
$$ 1666509 1589060 1514181 1443953 1379425 1320621 1267047 1218143 1173500 1133111 1097546 1067578
50086A067578k4308j9762j6867j5045j3321j1308r297p682o597n950n579n255
$$ 1067578 1043270 1023508 1006641 991596 978275 966967 957670 949988 943391 937441 931862 926607
50074I26607m856m514m450m594m623m399m178m294m810n606o509p203p282o753
$$ 926607 921751 917237 912787 908193 903570 899171 894993 890699 885889 880283 873774 866571 859289 852536
50060H52536o331o686p502p761p076o143n649n303m480l347k594k273j659l11
$$ 852536 846205 839519 832017 824256 817180 811037 805388 800085 795605 792258 789664 787391 785732 785421
50046G85421J413L031M497N808O695P113P530Q272R028R421R671J0103J0350R822
$$ 785421 786834 789865 794362 800170 806865 813978 821508 829780 838808 848229 857900 868003 878353 888175
50032H88175Q795Q240Q494Q885Q823Q570Q512Q339P567O478N858N828N533M258
$$ 888175 896970 905210 913704 922589 931412 939982 948494 956833 964400 970878 976736 982564 988097 992355
50018I92355K427J230J324K227L084L781N019P284J0119J2647J4598J6507J9008
$$ 992355 994782 996012 997336 999563 1002647 1006428 1011447 1018731 1028850 1041497 1056095 1072602 1091610
50005A091610K2269K6014K9689L2588L4247L4869L5113L5349L5408L5067L4344
$$ 1091610 1113879 1139893 1169582 1202170 1236417 1271286 1306399 1341748 1377156 1412223 1446567
49994A446567L3127L1014K7788K3686J8857J2860N184l941j3644k3221l2472m1361
$$ 1446567 1479694 1510708 1538496 1562182 1581039 1593899 1599083 1595142 1581498 1558277 1525805 1484444
49982A484444m9687n7069o2900o6309o6571o3747n8843n3182m7654m2370l7010
$$ 1484444 1434757 1377688 1314788 1248479 1181908 1118161 1059318 1006136 958482 916112 879102
49971H79102l1573k6783k3424k1198j8852j5797j3033j1746j1467j0549q377o067
$$ 879102 847529 820746 797322 776124 757272 741475 728442 716696 705229 694680 686303 680236
49959F80236m762m191l424k210r22K48J340K279L133M370O221Q066R047R159R002
$$ 680236 675474 671283 667859 665649 664727 664975 666315 668594 671727 676097 682318 690384 699431 708590 717592
49944G17592Q700P867O602N626N203M679L418J584l59k296m212n809o959q143
$$ 717592 726292 734159 740761 746387 751590 756269 759687 761271 760912 758616 754404 748595 741636 733493
49930G33493r818j1649j2891j3380j3580j3731j3514j2570j0953q953o901n135
$$ 733493 723675 712026 699135 685755 672175 658444 644930 632360 621407 612454 605553 600418
49918F00418l822k727j481q7J100J915K558L233L954M697N362N634N393N319O426
$$ 600418 596596 593869 592388 592301 593401 595316 597874 601107 605061 609758 615120 620754 626147 631466 637892
49903F37892Q718J0908J1832J1718J1540J1601J1427J0770R983R306Q447P098
$$ 637892 646610 657518 669350 681068 692608 704209 715636 726406 736389 745695 754142 761240
49891G61240N402L634J690o91l380n733p152p706q177r347j1267j3179j4242j4178
$$ 761240 766642 770276 771966 771275 767895 762162 755010 747304 739127 729780 718513 705334 691092 676914
49877F76914j3248j1843j0355r175q489q086p571o746n661m413l161k120j275
$$ 676914 663666 651823 641468 632293 623804 615718 608147 601401 595740 591327 588166 586046 584771
49864E84771k24J302K841L663L797M139N355P095Q582R573J0373J1181J1847J2193
$$ 584771 584547 585849 588690 592353 596150 600289 605644 612739 621321 630894 641267 652448 664295 676488
49850F76488J2179J1741J0827R632Q514P529O271M360J950n03k780m978o962q246
$$ 676488 688667 700408 711235 720867 729381 736910 743181 747541 749491 748988 746208 741230 734268 726022
$$ [...]
##END NTUPLES=NMR SPECTRUM
##END=
