
##TITLE=AC1394_GUALH12206_7519375_CDclRzSWxz
##JCAMPDX= 6.0         $$ Bruker NMR JCAMP-DX V2.0
##DATA TYPE= NMR SPECTRUM
##DATA CLASS= NTUPLES
##ORIGIN= BRUKER
##OWNER= Administrator
$$ 1.72 TOPSPIN		Version 2.1
$$ 2013-02-19 22:52:54.056 -0500  Administrator@X
$$ Compression mode = diff/dup
##.OBSERVE FREQUENCY= 400.02188249412
##.OBSERVE NUCLEUS= ^1H
##.ACQUISITION MODE= SIMULTANEOUS (DQD)
##.ACQUISITION SCHEME= undefined
##.AVERAGES= 8
##.DIGITISER RES= 22
##SPECTROMETER/DATA SYSTEM= spect
##.PULSE SEQUENCE= zg30
##.SOLVENT NAME= COFFEE_meoh
##.SHIFT REFERENCE= INTERNAL, COFFEE_meoh, 1, 14.98509
##AUDIT TRAIL= $$ (NUMBER, WHEN, WHO, WHERE, PROCESS, VERSION, WHAT)
$$ ##TITLE= Audit trail, TOPSPIN		Version 2.1
$$ ##JCAMPDX= 5.01
$$ ##ORIGIN= Bruker BioSpin GmbH
$$ ##OWNER= Administrator
$$ $$ E:\/data/COFFEE/nmr/AC1394_GUALH12206_7519375_CDclRzSWxz/10/pdata/1/auditp.txt
$$ ##AUDIT TRAIL=  $$ (NUMBER, WHEN, WHO, WHERE, PROCESS, VERSION, WHAT)
(   1,<2013-02-19 22:52:45.885 -0500>,<Administrator>,<X>,<go>,<TOPSPIN 2.1>,
      <created by zg
	started at 2013-02-19 22:51:39.242 -0500,
	POWCHK enabled, PULCHK disabled,
       configuration hash MD5:
       86 BA 57 50 F2 9D 5C 9B 26 00 A9 28 5F 66 2E 89
       data hash MD5: 64K
       C3 37 1A 51 05 0E 0E 59 30 67 59 B0 17 E8 E0 53>)
(   2,<2013-02-19 22:52:49.056 -0500>,<Administrator>,<X>,<proc1d>,<TOPSPIN 2.1>,
      <Start of raw data processing
       efp LB = 0 FT_mod = 6 PKNL = 1 PHC0 = 0 PHC1 = 0 SI = 32K 
       data hash MD5: 32K
       69 72 B1 8E 5E 80 13 E4 6E 5F 88 DD 27 22 D0 83>)
(   3,<2013-02-19 22:52:49.525 -0500>,<Administrator>,<X>,<proc1d>,<TOPSPIN 2.1>,
      <pk PHC0 = 71.9989 PHC1 = 0 
       data hash MD5: 32K
       BE 42 B1 FB 36 84 D8 B9 83 3B 58 01 6D 28 D9 17>)
(   4,<2013-02-19 22:52:49.744 -0500>,<Administrator>,<X>,<proc1d>,<TOPSPIN 2.1>,
      <abs ABSG = 1 
       data hash MD5: 32K
       6A 42 85 8F 27 E0 24 67 61 C3 4B D5 6C 57 E9 F7>)
(   5,<2013-02-19 22:52:49.885 -0500>,<Administrator>,<X>,<proc1d>,<TOPSPIN 2.1>,
      <abs ABSG = 2 
       data hash MD5: 32K
       3A 90 4E 7C F0 AA 69 74 47 53 B5 6A AE 62 9C 87>)
(   6,<2013-02-19 22:52:50.041 -0500>,<Administrator>,<X>,<proc1d>,<TOPSPIN 2.1>,
      <abs ABSG = 3 
       data hash MD5: 32K
       DE C7 AF B6 71 8A 72 50 C6 0D F9 CA 5D F9 DB 7A>)
(   7,<2013-02-19 22:52:50.197 -0500>,<Administrator>,<X>,<proc1d>,<TOPSPIN 2.1>,
      <abs ABSG = 4 
       data hash MD5: 32K
       46 BC 2E 91 F2 A0 00 80 BF 58 FB 58 40 36 7A F7>)
(   8,<2013-02-19 22:52:50.353 -0500>,<Administrator>,<X>,<proc1d>,<TOPSPIN 2.1>,
      <abs ABSG = 5 
       data hash MD5: 32K
       DF 0F 1A 7E 28 96 AF 35 BD E1 9F E6 45 80 D1 28>)
$$ ##END=
$$ 
$$ $$ hash MD5
$$ $$ 81 39 41 12 1D 7A E1 FD 67 CE 40 4A 9F 07 B7 0E
##$RELAX= 
##$RELAX= 
##$RELAX= 
##$RELAX= 
##$RELAX= 
##$RELAX= 
##$RELAX= 
$$ Bruker specific parameters
$$ --------------------------
##$DU= <E:\>
##$EXPNO= 10
##$NAME= <AC1394_GUALH12206_7519375_CDclRzSWxz>
$$ [...]
##$TP= (0..7)
150 150 150 150 150 150 150 150
##$TP07= 0
##$TPNAME0= <>
##$TPNAME1= <>
##$TPNAME2= <>
##$TPNAME3= <>
##$TPNAME4= <>
##$TPNAME5= <>
##$TPNAME6= <>
##$TPNAME7= <>
##$TPOAL= (0..7)
0.5 0.5 0.5 0.5 0.5 0.5 0.5 0.5
##$TPOFFS= (0..7)
0 0 0 0 0 0 0 0
##$TUNHIN= 0
##$TUNHOUT= 0
##$TUNXOUT= 0
##$USERA1= <user>
##$USERA2= <user>
##$USERA3= <user>
##$USERA4= <user>
##$USERA5= <user>
##$V9= 5
##$VALIST= <valist>
##$VCLIST= <CCCCCCCCCCCCCCC>
##$VD= 0
##$VDLIST= <DDDDDDDDDDDDDDD>
##$VPLIST= <PPPPPPPPPPPPPPP>
##$VTLIST= <TTTTTTTTTTTTTTT>
##$WBST= 1024
##$WBSW= 4
##$XGAIN= (0..3)
0 0 0 0
##$XL= 0
##$YL= 0
##$YMAX_a= 526610
##$YMIN_a= -524464
##$ZGOPTNS= <>
##$ZL1= 120
##$ZL2= 120
##$ZL3= 120
##$ZL4= 120
##$ABSF1= 14.98509
##$ABSF2= -5.573092
##$ABSG= 5
##$ABSL= 3
##$ALPHA= 0
##$AQORDER= 0
##$ASSFAC= 0
##$ASSFACI= 0
##$ASSFACX= 0
##$ASSWID= 0
##$AUNMP= <proc_prof1d_extract_pilot.lims>
##$AXLEFT= 0
##$AXNAME= <>
##$AXNUC= <1H>
##$AXRIGHT= 0
##$AXTYPE= 0
##$AXUNIT= <>
##$AZFE= 0.1
##$AZFW= 0.1
##$BCFW= 0
##$BC_mod= 0
##$BYTORDP= 0
##$COROFFS= 0
##$CY= 15
##$DATMOD= 1
##$DC= 0
##$DFILT= <>
##$DTYPP= 0
##$F1P= 0
##$F2P= 0
##$FCOR= 0.5
##$FTSIZE= 32768
##$FT_mod= 6
##$GAMMA= 0
##$GB= 0
##$INTBC= 1
##$INTSCL= 1
##$ISEN= 128
##$LB= 0
##$LEV0= 0
##$LPBIN= 0
##$MAXI= 10000
##$MC2= 0
##$MEAN= 0
##$ME_mod= 0
##$MI= 0
##$NCOEF= 0
##$NC_proc= -8
##$NLEV= 6
##$NOISF1= 0
##$NOISF2= 0
##$NSP= 0
##$NTH_PI= 0
##$NZP= 0
##$OFFSET= 14.98509
##$PC= 1
##$PHC0= 71.9989
##$PHC1= 0
##$PH_mod= 1
##$PKNL= yes
##$PPARMOD= 0
##$PPDIAG= 0
##$PPIPTYP= 0
##$PPMPNUM= 2147483647
##$PPRESOL= 1
##$PSCAL= 4
##$PSIGN= 0
##$PYNMP= <proc.py>
##$REVERSE= no
##$SF= 400.02
##$SI= 32768
##$SIGF1= 0
##$SIGF2= 0
##$SINO= 400
##$SIOLD= 32768
##$SPECTYP= <>
##$SREGLST= <1H.CDCl3>
##$SSB= 0
##$STSI= 32768
##$STSR= 0
##$SW_p= 8223.68421052631
##$SYMM= 0
##$S_DEV= 0
##$TDeff= 65536
##$TDoff= 0
##$TI= <>
##$TILT= no
##$TM1= 0
##$TM2= 0
##$TOPLEV= 0
##$USERP1= <user>
##$USERP2= <user>
##$USERP3= <user>
##$USERP4= <user>
##$USERP5= <user>
##$WDW= 1
##$XDIM= 32768
##$YMAX_p= 456792793
##$YMIN_p= -680534
##$CURPLOT= <Network HP LaserJet P1505>
##$CURPRIN= <$Network HP LaserJet P1505>
##$DFORMAT= <normdp>
##$LAYOUT= <+/1D_H.xwp>
##$LFORMAT= <normlp>
##$PFORMAT= <normpl>
##$SURQMSG= 1
$$ End of Bruker specific parameters
$$ ---------------------------------
##NTUPLES= NMR SPECTRUM
##VAR_NAME=  FREQUENCY,     SPECTRUM/REAL,   SPECTRUM/IMAG
##SYMBOL=    X,             R,               I
##VAR_TYPE=  INDEPENDENT,   DEPENDENT,       DEPENDENT
##VAR_FORM=  AFFN,          ASDF,            ASDF
##VAR_DIM=   32768,         32768,           32768
##UNITS=     HZ,            ARBITRARY UNITS, ARBITRARY UNITS
##FACTOR=    0.250966925370066, 1,           1
##FIRST=     8223.43324360094, -126263,      4060
##LAST=      0,             41939,           -316471
##MIN=       0,             -680534,         0
##MAX=       8223.43324360094, 456792793,    0
$$ Real data points
##PAGE= N=1
##DATA TABLE= (X++(R..R)), XYDATA
$$ [...]
19536b40267j6670L5601j55106B3768a72610j34735A6811b08550j8201j40196
19526c66947d8687j22465e5551C9020N0594c4496n4955r1015B870b02861l6869
19515b39730F3459k8226d11101d7910I6085K1381b3331B1762b62235A8031L08218
19504C26249b55226g6605A1484d33269e9800l46993F3508J47129a38941A51593
19493I3908a97465E2958a72169m2928b6029j06213m8327I4887D621a52948H3757
19481A47001j7295J9777b43283h8074c2494A6740d4595q7598f1753j21324j61856
19470c44933J51153j12041g8745j26167A28112f9325i395C58057k5063c37924
19459h929l34164a11227C23309a0653k83245b9801E306R580b63651g1259k1582
$$ y = [-240267, -256937, -221336, -376442, 23768, -172610, -307345, 16811, -208550, -226751, -366947, -48687, -171152, -55551, 39020, 89614, -34496, -89451, -180466, 2870, -202861, -239730, 63459, 35233, -411101, -47910, 96085, 117466, -23331, 21762, -262235, 18031, 326249, -255226, -76605, 11484, -433269, -59800, -406793, 63508, 210637, -138941, 151593, 93908, -197465, 52958, -172169, -215097, -26029, -132242, -180569, 94887, 4621, -152948, 83757, 147001, 129706, 149483, -243283, -88074, -32494, 16740, -44595, -132193, -61753, -183077, -344933, -193780, -305821, -78745, -204912, 128112, -69325, -9395, 358057, 332994, -337924, -8929, -343093, -111227, 323309, -10653, -293898, -29801, 5306, 14886, -263651, -71259, -92841]
19448i2841o7743e3567a0884D1672J28727d8813k65101J30079A5779a51168o0864
19437b12032n4061i9275B96900a25095q8356B3186K22141b23522A91032b82536
19426a02509C3161K28259n0407e05436J04609B4052L3653L95592c7056j71262
19416b08318F7802a66801B83576h214G8771b69935g9708j47468P6372d7769r4549
19405a42318A91787a70176j25896e1430j441A01442B2393J23836a47185j13830
19395b61015n731a08942k26517M3897C44313c6177B2733b14442A09882b22857
19384A14474g0516E0235b81425C63655a06434j00601k45380a51013e5898q9069
19374a44967A39021A7760K85417e7267o6507j59428a21429j24362B3630J51741
$$ y = [-92841, -160584, -53567, -10884, 41672, 170399, -48813, -313914, -183835, 15779, -151168, -212032, -266093, -99275, 296900, -125095, -213451, 23186, 245327, -223522, 191032, -282536, -102509, 33161, 261420, 211013, -505436, -400827, 24052, 57705, 453297, -37056, -208318, 67802, -166801, 283576, -8214, 78771, -269935, -79708, -227176, -150804, -47769, -142318, 191787, -170176, -296072, -51430, -52871, 101442, 22393, 146229, -147185, -261015, -266746, -108942, -335459, -291562, 344313, -36177, 22733, -214442, 109882, -222857, 114474, -70516, 50235, -281425, 363655, -106434, -207035, -452415, -151013, -55898, -144967, 139021, 17760, 303177, -57267, -123774, -283202, -121429, -245791, 23630, 175371]
19364A75371b46605f0782H9839d14916a27746L4124l649p6674l00522b20915B5580
19352e2632M712A0927e21540A14673j6358R1141e476l5022j26581e6674D2673
19340A51469a10414o729K263C46691b30455A2223K88110c23064a12557k6091e5669
19328A53140a26938o6685B97229D4881k2177c73331M106E4054b22846A07055g7318
19316D4069J55459a35136B71299d77389e0649A16661g2886A30618C3984e547l08516
19305c14063D1125J08629l4665l2843a68809g6230k05989A42966f6539A75387
19294C13587b49651d9949l21716a51460k2633Q2619A2811e4936a6995A77118G920
19282f2293M499G4409h5619K7949r9858A64387M9994I3840b4550k55898j22454
$$ y = [175371, -246605, -60782, 89839, -414916, -127746, -93622, -97271, -173945, -474467, -220915, 25580, -52632, -47920, 10927, -521540, 114673, 98315, 189456, -5476, -40498, -167079, -56674, 42673, 151469, -110414, -117143, -114880, 346691, -230455, 12223, 300333, -323064, -112557, -138648, -55669, 153140, -126938, -193623, 297229, 44881, 22704, -373331, -369225, 54054, -222846, 107055, -77318, 44069, 199528, -135136, 271299, -477389, -50649, 116661, -72886, 130618, 33984, -5547, -314063, 41125, 149754, 115089, 82246, -168809, -76230, -282219, 142966, -66539, 175387, 313587, -249651, -49949, -371665, -151460, -174093, -91474, 12811, -54936, -16995, 177118, 7920, -62293, -57794, 74409, -85619, -57670, -157528, 164387, 214381, 93840, -24550, -280448, -402902]
19271d02902a99422P4831E4070a35312j85486l4482D9879b82297A34480i8567
19260a17707D7437j7404c21083J06305i5462c4568j66810j9277e5925A51853i7692
19248a13688D6467d73363A49334O390a29809o9915N0048o935p5775C72764A26388
19236A09682m444b6645D2589A9147K29798O0147D4168c06697P5685c7284j86579
19225b23863b6469q5750l85241i1496a2794m236B14336k7398E2845d6428m3356
19214h9784q2224k17024D4633i0338k66237E332K4588b40580L29q9342P6580c447
19201A213c23619a5331j84005b2205j91743o4303D0546f3400A54371o6688b34144
19189a703j67146A42881g3362r6681E7188g1470D14504B622J9079e3557p3838
$$ y = [-402902, -199422, -124591, 54070, -135312, -320798, -355280, 49879, -282297, 134480, -98567, -117707, 47437, 30033, -321083, -214778, -95462, -34568, -201378, -220655, -55925, 151853, -97692, -113688, 46467, -473363, 149334, 155724, -129809, -199724, -149676, -156611, -232386, 372764, 126388, 109682, 105238, -26645, 42589, 19147, 248945, 309092, 44168, -306697, -231012, -37284, -223863, -26469, -112219, -497460, -91496, -12794, -17030, 214336, 186938, 52845, -46428, -89784, -172008, -389032, 44633, -90338, -356575, 5332, 29920, -240580, -240251, -329593, -253013, -3447, 1213, -323619, -15331, -199336, -22205, -213948, -278251, 40546, -63400, 154371, 87683, -234144, -1703, -168849, 142881, -73362, -170043, 57188, -71470, 414504, 2622, 21701, -53557, -127395]
19178a27395k13336a21374L4738D1075B0449f3201q036C23403a790A03409a27026
19166A00554a42454o9394m673A90875A0333a75181A02612a24892F7448l2136b01123
19154I915a92078M6115D2485N2115J02645g7680I690e3291H5200a07573j87388
19143b94961A72600c3015l1583B13639p0253b81149E9079b74867A3384J9937b28369
19131C0596g2970p4435a9152A69280b13123e7123j10102k2461E6787M3413J18944
19120B19144E4899J6120C4273a35018l15673P0285g4406l10794a83103j53696
19110c36799C04930J16469A58277b34624C9989a34985p1645A77107a60605k77882
19100d38487d1491k28982A5097a78247e6524I6128h0904j11888i1438k1708l9046
$$ y = [-127395, -340731, -121374, -86636, 41075, 20449, -63201, -71237, 323403, -1790, 103409, -127026, 100554, -142454, -211848, -216521, 190875, 10333, -175181, 102612, -124892, 67448, 35312, -201123, 9915, -192078, -145963, 42485, 94600, 197245, -77680, 9690, -53291, 85200, -107573, -294961, 172600, -33015, -64598, 213639, 143386, -281149, 59079, -274867, 13384, 33321, -228369, 30596, -72970, -147405, -19152, 169280, -213123, -57123, -167225, -189686, 56787, 100200, 219144, 54899, 71019, 34273, -135018, -450691, -380406, -74406, -385200, -183103, -336799, 304930, 421399, 158277, -234624, 39989, -134985, -206630, 177107, -160605, -438487, -41491, -270473, 15097, -178247, -56524, 96128, -80904, -192792, -91438, -113146, -152192]
19089a52192j24637c2005j89313e4147q6671E8694i9068o889G7877N0408D3941
19077e14052J26754P428E3674J50927e6331j66787D37619E4603d5298l09943d7526
19065a16835k24724B39635b75747C76634a13901C2210N6611a26697E1342i3214
19054h0849B540a24970q2183R8877p1383C03912d78040d7311j57402N8845C2880
19042B58742a74842O1026E20238A09758e9159C8278a72167j11759A25614K6155
19032A51769J12562B5820L19533j33453a45354K5937A48380J71000a72628f5409
19021b3006C16006a66645B3433a97202D9280f4484p2368O2642k27690b4133I9474
19009e825F9853b07506b4680j76928B27556e20942E2668c69525E334J3147K6857
$$ y = [-152192, -276829, -32005, -221318, -54147, -140818, 58694, -99068, -105957, 77877, 128285, 43941, -514052, -387298, -379870, 53674, 204601, -56331, -223118, 437619, 54603, -45298, -355241, -47526, -116835, -341559, 239635, -275747, 376634, -113901, 32210, 88821, -126697, 51342, -93214, -80849, 2540, -124970, -207153, -108276, -179659, 303912, -478040, -47311, -204713, -145868, 32880, 258742, -174842, -113816, 520238, 109758, -59159, 38278, -172167, -283926, 125614, 151769, 264331, 25820, 345353, 211900, -145354, -119417, 148380, 319380, -172628, -65409, -23006, 316006, -166645, 23433, -197202, 49280, -64484, -136852, -74210, -301900, -24133, 99474, -5825, 69853, -207506, -24680, -201608, 227556, -520942, 52668, -369525, 5334, 18481, 45338]
18998D5338a03399D0368J0821c3201j11106J8342j63616d4902b716A94243b65881
18986G414J26249c10932E8950a24854d014A40490n5611g8416h627B27971i246
18974d7480k19379j82021a13079L5996E3251h9474B19705b88987c1747j48514
18964a80261j32286i9637K9569j50832k00474b8042l8940A76476E3741a53380
18953b95698c411l84376B32899a68135L5139a154A2432K11025a71848j09930I8409
18941b10677B98349a04473r3129f3945K8297j4773k78712a41561r7348A37879
18930A45903F5449K07650A10094R5535F5548d818B31664b52047E6183b7012j07973
18919a34985j46218l8665e4029D1189J89853i8683b513j04985c5551C13323j37703
$$ y = [45338, -103399, 40368, 51189, -33201, -144307, -125965, -289581, -44902, -2716, 194243, -265881, 7414, 133663, -310932, 58950, -124854, -4014, 140490, 84879, -78416, -8627, 227971, -9246, -47480, -266859, -448880, -113079, -77083, 53251, -89474, 219705, -288987, -31747, -180261, -312547, -99637, -70068, -220900, -421374, -28042, -66982, 176476, 53741, -153380, -295698, -3411, -387787, 232899, -168135, -132996, -1154, 12432, 223457, -171848, -281778, 98409, -210677, 298349, -104473, -197602, -63945, -35648, -50421, -329133, -141561, -238909, 137879, 145903, 65449, 273099, 110094, 205629, 65548, -4818, 231664, -252047, 56183, -27012, -134985, -281203, -319868, -54029, 41189, 231042, -98683, -2513, -107498, -35551, 313323, 175620]
18908A75620B090e8243J0407A3351J4381L0425K21907b73298J25119N1839m1672
18897a38012b2716E6624J77804b4643B04238a19571k0305k68652a71624k97056
18887d68680a47864O0243J3212n1524o7330A02136l5566O1705c37151h9254m66193
18876e55447B09932f6050C20668d7135I6324f1514A00853c1503A86323a72736
18865B3232a90776j30328a20202L9367o6205I2617j9078N0433c69093a26227D8283
18853a80692k5135D5819a95719D9488B4108K75429o7466c03274f0226D08869a5442
18841a61603k44287a29067C14866f5584j18126L627h757j69281E4135g412A3566
18829A7873d102E0904H570e71400a14590p6270G0803B999Q2529P4808O8631c7420
$$ y = [175620, 2090, -58243, -47836, 13351, 27732, 58157, 280064, -273298, -148179, -96340, -138012, -22716, 56624, 234428, -24643, 204238, -119571, -139876, -408528, -171624, -468680, -147864, -87621, -74409, -125933, -193263, 102136, 66570, 128275, -337151, -89254, -555447, 209932, -66050, 320668, -47135, 96324, -61514, 100853, -31503, 186323, -172736, 23232, -190776, -321104, -120202, -80835, -147040, 92617, 73539, 123972, -369093, -126227, 48283, -180692, -205827, 45819, -195719, 49488, 24108, 299537, 232071, -303274, -60226, 408869, -15442, -161603, -405890, -129067, 314866, -65584, -183710, -180083, -8757, -178038, 54135, -7412, 13566, 17873, -4102, 50904, 8570, -571400, -114590, -190860, 70803, 2999, 85528, 160336, 228967, -37420]
18816B5950O3282b6408B20387K4754A16449K0164J16403J14910j13189E0461a78856
18804C03422h8792K0455G8527J35856P1762b71462l467R4010A69296a93782A5178
18792A3026a61656o6027P4088J7030A15260D926K72392a25513d0659j40140C8690
18780C81853b38775M0042B9706J37553a10608A28922m2842Q1a68696A02295n0407
18769E1888b42760r725R8726C0732a32458D7535c08074Q0880A73043Q2745A17416
18757b9297j68153C04983a50677L1740c604j22698k69361a21910G2530a28303
18746b47260h7205B37843q9338n3417b88988b7531l469B00054a36696A99338E570
18734b84948D9397b15007i2942C29611d1370B37300a73592m6144c6837B77188
$$ y = [25950, 89232, -26408, 220387, 245141, 116449, 136613, 253016, 367926, 254737, 50461, -178856, 303422, -88792, -68337, 78527, 214383, 286145, -271462, -274929, -180919, 169296, -193782, 15178, 13026, -161656, -227683, -153595, -136565, 115260, 4926, 277318, -125513, -40659, -180799, 38690, 381853, -238775, -198733, 29706, 167259, -110608, 128922, 86080, 86161, -168696, 102295, 51888, -242760, -252485, -153759, 30732, -132458, 47535, -308074, -227194, 173043, 255788, 117416, -29297, -197450, 304983, -150677, -118937, -3604, -126302, -395663, -121910, 72530, -128303, -247260, -87205, 237843, 148505, 95088, -288988, -27531, -31000, 200054, -136696, 199338, 5570, -284948, 49397, -215007, -92942, 329611, -41370, 237300, -173592, -219736, -36837, 277188]
18723a04643B4795c11163P2041F7430b9889j18802o3485M7621r7290E4162a42071
18711a36210A44589A1350b45636j81643A09253b09638r6263E8153j0486a05972
18700c34970c2474G2918d4700A85274J23092C6572a3988k31205i6293b2907A77966
18688a07754A10281b99897J14029C42944g3781A58418O1102A9545b14245B5429
18677B14160A932d38470e7081j9856c4069k60137H3351b50255k10624a37596j87937
18666c25533a46694P3309A16752d11219a91853h598A6357a15744A17488a41725
18655a0764A17630b75759j72420C18423b43957e2999k00019A97811a16027j38165
18645b54192b1227l70435r3785a45407A22154K1924a81286k147A11693c5428R299
$$ y = [-104643, 24795, -311163, -239122, 67430, -29889, -148691, -212176, -164555, -261845, 54162, -142071, -136210, 144589, 11350, -245636, -427279, 109253, -209638, -305901, 58153, 47667, -105972, -334970, -32474, 72918, -44700, 185274, 308366, 36572, -13988, -245193, -96293, -22907, 177966, -107754, 110281, -299897, -185868, 342944, -73781, 158418, 219520, 19545, -214245, 25429, 214160, 1932, -438470, -57081, -76937, -34069, -294206, 83351, -250255, -460879, -137596, -325533, -146694, -73385, 116752, -411219, -191853, -8598, 16357, -115744, 117488, -141725, -10764, 117630, -275759, -448179, 318423, -243957, -52999, -253018, 197811, -116027, -254192, -21227, -391662, -485447, -145407, 122154, 144078, -181286, -183433, 111693, -35428, -26129]
18634b6129A54976a24A33944n0557j1353b53889a23133B69596a14154M8859m497
18623f9792j51460C3597a90539h5009A02891h7560C8431J06262a03574e0791j589
18612e2380l79997c0312j15741A19279b65201F4953g2953j50465j04475r4913
18602d22806P9628J62277e4287k17001D5051J78742Q8030p4637g6647K8746m89878
18591e37779a43406F4868B0315J30409K910a29441C9039J37357f3960A07709a4838
18579C5078a15653k03243p8038J93816k124j8419B0244G995e6637A95991a59976
18567H8727J85691q3670r3934a30379K8864B55823B2309h8663b6452Q342k43825
18556b61935Q7225E2896m345a94622P6256A27383b08388h9889M959j74772a4850
$$ y = [-26129, 154976, -124, 133944, 83387, 72034, -253889, -123133, 269596, -114154, -65295, -69792, -221252, 33597, -190539, -85009, 102891, -87560, 38431, 144693, -103574, -50791, -52380, -432377, -30312, -146053, 119279, -265201, 64953, -72953, -223418, -327893, -422806, -343178, -180901, -54287, -271288, 45051, 223793, 311823, 237186, -76647, -47901, -537779, -143406, 64868, 20315, 150724, 153634, -129441, 39039, 176396, -63960, 107709, -14838, 35078, -115653, -318896, -396934, -203118, -205242, -223661, 20244, 7995, -56637, 195991, -159976, 88727, 274418, 190748, 96814, -130379, -101515, 255823, 22309, -88663, -26452, -18110, -261935, -174710, 52896, 48551, -194622, -118366, 127383, -208388, -89889, -84930, -259702, -14850]
18544B45295b60931D6120i5009b8054j31252K7734A64655B7748J2716d8234A1058
18532g9526k1917a0491G0156d40066K07347j3290G7394J40278G4448b7963p8613
18521a06576D1554a48094o8940i7178m6393j06873B46250f5258j29657j7175E21246
18509f5900K9829j30694C9137i5594q8015j8112d8469J1378p3535m1173k27542
18498c79341F479d37813a02656E4957P9538a84136C40g2648m8696a6955j68403
18487a85358e6106q9415k7912G11c1579A31040b08720j39629c7221k5827q961
18476g2009k49795a20427p0584P9378q3486N8086d3224j02748g697k51206J16010
18465a42893j90041c149G4723a55159A33029b32292J8443F4165L1116B0545a36729
$$ y = [245295, -260931, 46120, -95009, -28054, -159306, -131572, 164655, 27748, 40464, -48234, 11058, -79526, -101443, -10491, 70156, -440066, -232719, -246009, 77394, 217672, 74448, -27963, -106576, 41554, -148094, -217034, -97178, -143571, -250444, 246250, -65258, -194915, -212090, 521246, -65900, -36071, -166765, 39137, -95594, -183609, -201721, -48469, -37091, -110626, -151799, -379341, 6479, -437813, -102656, 54957, 134495, -184136, 340, -72648, -121344, -16955, -185358, -56106, -145521, -173433, 711, -31579, 131040, -208720, -348349, -37221, -63048, -72009, -321804, -120427, -191011, -111633, -195119, -137033, -43224, -145972, -7697, -258903, -142893, -332934, -3149, 74723, -155159, 133029, -232292, -213849, 64165, 95281, 20545, -136729]
18453I5973e6650j48928A91450a63196g8388D5858a0906F6233a77723Q197B000
18441d04369C15a34429k5005B09860Q042e6828A94395I2741D6131d3442J0397
18430c3045C4484J57859a45309A11984c1888j05967J9268q5246A79623c5640A9657
18418a87333m3661A06408a39117A35659c76923a0508A9033a06246L5663o7155
18408a37738e4902l31668C17925b66798D00363a3792p4612A78087a50681m9534
18398b00215B7330c84478c7401k64956D9546c7496H3438N0544A7922a40348q465
18387a48813D9711J41208a66066L1170j55735H0895J35025l2259i9054q0766A05024
18375a49358r1802a08376B03720o4194K2287a38872c6737C245K02056f8528m91243
$$ y = [95973, -56650, -205578, 191450, -163196, -78388, 45858, -10906, 66233, -177723, -169526, 2000, -404369, 315, -134429, -159434, 209860, 217902, -56828, 194395, 92741, 46131, -43442, -33045, 34484, 192343, -145309, 111984, -31888, -137855, -118587, -203833, 179623, -35640, 19657, -187333, -230994, 106408, -139117, 135659, -376923, -10508, 19033, -106246, -70583, -137738, -54902, -386570, 317925, -266798, 400363, -13792, -88404, 178087, -150681, -200215, 27330, -384478, -37401, -302357, 49546, -37496, 83438, 133982, 17922, -140348, -148813, 49711, 190919, -166066, -134896, -290631, 80895, 215920, 183661, -99054, -179820, 105024, -149358, -241160, -108376, 203720, 139526, 161813, -138872, -36737, 3245, 205301, -68528, -559771]
18364e59771g9528k9242L0298J410K8750l577l16583d0378k5429j6188l24742
18353d06737a95653l9680n5374j6799A24635a38920B75132b431A4257b49348J02437
18342a46911A6173a04298A10810b00665m9116a21283J1756d0172l28486C8782
18331A56716a09327E2336c23133B85314A32874C3279J68340j7382n2520J40755
18321B72472A00830c36748E2120R2331c6850o4475C71240j26780a94720Q7132
18311a07588A25164q56a85506q7828H9531a96976j65660B58566b30420A8561D029
18299b25615f3501n0107l21614g3121A39294c39005E812J62570c42140c7939C1589
18287A2798f6628k38400C9376a27703j27259P5775O1518L8864g283q5456l33323
$$ y = [-559771, -79528, -108770, -78472, -77062, -48312, -51889, -368472, -40378, -65807, -81995, -406737, -195653, -235333, -290707, -307506, 124635, -138920, 275132, -2431, 14257, -249348, -146911, 16173, -104298, 110810, -200665, -249781, -121283, -109527, -40172, -368658, 38782, 156716, -109327, 52336, -323133, 285314, 132874, 33279, 201619, 184237, 131717, 272472, 100830, -336748, 52120, 144451, -36850, -101325, 371240, 244460, -194720, -107588, 125164, 124308, -185506, -273334, 89531, -196976, -362636, 258566, -230420, 18561, 4029, -225615, -63501, -113608, -435222, -73121, 139294, -339005, 5812, 168382, -342140, -37939, 31589, 12798, -66628, -305028, 39376, -127703, -254962, -179187, -117669, -78805, -7283, -92739, -426062]
18276d26062J63427A27030e8546B05596b26090i3253b0243j80945k56982A11023
18265a88432d8711j95256o7184f3853C3307a55119C19479A45421h6796A05638
18254A22681h3083A6588a00966m8695l93628h0703G6298b87764J16347B70337
18243a84145c3894j64828C0823J42246b4595n2663j49143a08753A68723j8543
18233A50180e8211b8918A88693e3519J3885A82767J3850f7329B69902a65428O4483
18222a00945l3935A14259K16642a39187N0923k5562j24041C5339K24161R31G4233
18210c63633f8025n16446A70712f9751a7987l18313A59344a10137I1814J07042
18200A98856a84646G8410J50448D0701a49427o3707n600j86895a40131N0358A3389
$$ y = [-426062, -262635, 127030, -58546, 205596, -226090, -93253, -20243, -201188, -458170, 111023, -188432, -48711, -243967, -311151, -63853, 33307, -155119, 319479, 145421, -86796, 105638, 122681, -83083, 16588, -100966, -149661, -543289, -80703, 76298, -287764, -171417, 270337, -184145, -33894, -198722, 30823, 173069, -24595, -77258, -226401, -108753, 168723, 150180, -58211, -28918, 188693, -53519, -39634, 182767, 196617, -67329, 269902, -165428, -100945, -134880, 114259, 330901, -139187, -88264, -113826, -237867, 35339, 259500, 260431, 74233, -363633, -68025, -584471, 170712, -69751, -17987, -336300, 159344, -110137, 91814, 198856, -184646, 78410, 228858, 40701, -149427, -213134, -218734, -405629, -140131, -89773, 13389]
18188B9316p054b28650F4509J29704a827A88897m6538a30831L8b1936F448c30851
18175a1091l8913J4230m8478j60458J4543L530m7909a09425o5398O9687j3310
18164a18446k16990a20580H5209A7101L65999l5522a25054B3263J20614A7012
18153h1763o7096j39017I966c178j6899P043A61504a06858m9383P0040B69416
18141F7009d1310j46450D3861K3043h4788A26442a57731g2050H372e2170k57507
18130c09677l03704g0154p0531G8868c74613i1400a9623j47488j85652A2882J31017
18119A43899b29219D9468c47544a5817D0737c46612r3540B9551f5794H9416a06955
18107a43032B49999K9120b60411c9048A35919F6828b6337j43087k9493K2623A25861
$$ y = [29316, 22262, -228650, 64509, 194213, -1827, 188897, 142359, -130831, -130793, -21936, 6448, -330851, -11091, -50004, -35774, -84252, -244710, -230167, -226637, -274546, -109425, -174823, -105136, -118446, -335436, -120580, 85209, 17101, 383100, 347578, -125054, 23263, 143877, 17012, -81763, -148859, -287876, 9966, -3178, -20077, -13034, 161504, -106858, -156241, -86201, 269416, 67009, -41310, -187760, 43861, 66904, -84788, 126442, -157731, -72050, 8372, -52170, -309677, -613381, -70154, -140685, 78868, -374613, -91400, -19623, -167111, -352763, 12882, 143899, -229219, 49468, -347544, -15817, 40737, -346612, -440152, 29551, -65794, 89416, -106955, -143032, 249999, 279119, -260411, -39048, 135919, 66828, -26337, -169424, -198917, -176294, 125861]
18095c12354A51603J29736a60775A25450n6655d31510B71405f5918q6582C981
18084a65264A10926P8360o0738K07553A42609b4471C36606A11517K41541a87547
18073E4057h7938j06942j91961J04482A59030e148j53048F3285A6422M5236a74821
18061C1902c22830Q2525A71950E5729b37126L7580J9880C083M8189d2346k59447
18050c01793n946C5276a88026A39512b74934K4003C12789b69443j8546C0532a02525
18038h0845k188k17356a4250n3544j16831F1707i3881q9806A7061b01192B37778
18026C1025a91091A61149O8196a30860B6611L64199A87964a63733B05703F9384
18015b95899d7512k29671J9456J00787i929A24783b41182A71504C5114J9901a9359
$$ y = [-312354, 151603, 281339, -160775, 125450, 68795, -431510, 271405, -65918, -152500, 3981, -165264, 110926, 189286, 128548, 336101, 142609, -24471, 336606, 111517, 353058, -187547, 54057, -87938, -194880, -386841, -282359, 159030, -5148, -158196, 63285, 16422, 61658, -174821, 31902, -322830, -240305, 171950, 55729, -237126, -199546, -179666, 3083, 51272, -42346, -301793, -307739, 35276, -188026, 139512, -274934, -250931, 312789, -269443, -287989, 30532, -102525, -80845, -83033, -300389, -14250, -67794, -184625, 61707, -93881, -183687, 17061, -201192, 237778, 31025, -191091, 161149, 229345, -130860, 26611, 390810, 187964, -163733, 205703, 69384, -295899, -47512, -277183, -257727, -156940, -9929, 124783, -241182, 171504, 35114, 55015, -19359]
18003b04788A36399f1566n0400l0516C093a97263A03169h4304B61014a81560j34725
17992c16285j88358A18665B2237b88353G7853a8048j16974B5614b88710j93108
17982d81818E8269A8647g0008B20668I35K99469H3657a77775I1058K7761J3227
17971A32046b43283J9431g050A23740b51286Q6075K2466A93496a63744A79941
17960H1878a42665N9712q1588j12579e1819B16118b14059a01402k73320H5957
17949B74542a03678l4810A5343J23559b59636B9789b08451B31924j03790a33094
17938b13818f0696A47184p0199M6055a12142A11284b09271C51406b19186C2916
17927a88271D1024A7844b02933l6043I1978b5884D64207b49164L5498d2258m6531
$$ y = [-204788, 136399, -61566, -111966, -142482, 3093, -197263, 103169, -84304, 261014, -181560, -316285, -504643, 118665, 22237, -288353, 77853, -18048, -135022, 25614, -288710, -481818, 58269, 18647, -70008, 220668, 935, 300404, 83657, -177775, 91058, 118819, 132046, -243283, -223852, -7050, 123740, -251286, -165211, -142745, 193496, -163744, 179941, 81878, -142665, -82953, -164541, -277120, -51819, 216118, -214059, -101402, -374722, 85957, 274542, -103678, -138488, 15343, 138902, -259636, 29789, -208451, 231924, 128134, -133094, -213818, -60696, 147184, 76985, 123040, -112142, 111284, -209271, 351406, -219186, 32916, -188271, 41024, 17844, -202933, -238976, 91978, -25884, 464207, -249164, -213666, -42258, -88789]
17916h8789m5119B4016a03793d9442k67870d4427B69512c491B70562a21781l9572
17905a61353l17914g7131B6220a42758j10858b6148A53630n964b8011k53057a25852
17893A92458q6802C2505a27675b0413j17414H0874b05052E6143B5880L23855B5072
17881f2168k26042C03242A7313J08422L322a0756A77693J08286E2254J29962i4998
17869A10714a00573n7672A69973L1396L29396a57800K5070G8266j8830B4651d7288
17857a50023k34188C45428I7369j5985N2290J07931a12611A87462k0238h8812
17846a01475d0616D39584b77349g1857B32771a68827b5929l09970E3488E232b59269
17834A65154b05802J02330M0979j18818A17935a25544l03386I8388b5536Q160
$$ y = [-88789, -133908, 24016, -103793, -49442, -317312, -44427, 269512, -3491, 270562, -121781, -161353, -479267, -77131, 26220, -142758, -253616, -26148, 153630, 147666, -28011, -281068, -125852, 192458, 105656, 32505, -127675, -20413, -137827, 80874, -205052, 56143, 25880, 349735, 25072, -62168, -288210, 303242, 17313, 125735, 129057, -10756, 177693, 285979, 52254, 182216, -94998, 110714, -100573, -158245, 169973, 201369, 530765, -157800, -132730, 78266, 59436, 24651, -47288, -150023, -384211, 345428, 97369, 81384, 133674, 241605, -112611, 187462, 167224, -88812, -101475, -40616, 439584, -277349, -71857, 232771, -168827, -25929, -335899, 53488, 5232, -259269, 165154, -205802, -103472, -62493, -181311, 117935, -125544, -428930, 98388, -25536, -17376]
17824a7376B14126m5472b07414A61935a20994A87804a45939H8913C7072K31568
17814B68640e2527b4410A85671H0290C113Q8039c5301k3951A36499c35600a65186
17802C78950a94918J7426E7601a63459p3680I9660D6627c7917l48562B27411a62145
17790A07232h4237k29832a48300A27602b69937N4690e7361a3655A78454a15091
17779c921j56742b9016j14463B24356K9824A00871d0951h744j01643K4318A72227
17767A00282B1432n197J05167i1662a4616C94769a08387e2803C9035f28482c8989
17755B20899c7242A08953c51372F461J52867p0920e8082j87492A8168f7742k37873
17744c05615a20505A58376p6958J00542H7940c93101B87995A17473k4847K47835
$$ y = [-17376, 214126, 168654, -207414, 161935, -120994, 187804, -145939, 88913, 37072, 268640, -52527, -24410, 185671, 80290, 3113, 91152, -35301, -59252, 136499, -335600, -165186, 378950, -194918, -177492, 57601, -163459, -237139, 99660, 46627, -37917, -386479, 227411, -162145, 107232, -84237, -314069, -148300, 127602, -269937, -215247, -57361, -13655, 178454, -115091, -3921, -160663, -29016, -143479, 224356, 254180, 100871, -40951, -8744, -110387, -86069, 172227, 100282, 21432, 16235, 121402, -91662, -14616, 394769, -108387, -52803, 39035, -628482, -38989, 220899, -37242, 108953, -351372, 6461, 159328, 88408, -58082, -245574, 18168, -67742, -305615, -120505, 158376, 81418, 181960, 87940, -393101, 287995, 117473, 92626, 340461]
17734C40461f9729n0314p2141l8518A65879d430B53883i5875P350b4085D6037
17722h8458F9385a60530E4766K01286b43293F0042d2339k0583A94590f4418C08794
17710B87511m0956B5602R7620b84846R8190b7237m1159A50258M8142i0174r4869
17699a85043O8314B44576d9881J7393p8754A77761a39294K8098A66361c1702D4504
17687d2364C09997a81653A12827O9383L3324G9391f715p1695k29154Q5088I1290
17675b56774D744a7760j66122b7033j17218a0956j65059B09735f6280r289q3972
17664a59541F7872K66283G8903i1067B8537j3314a4479F4709Q5409F2772J28232
17653A91004F1955c07743a21652j76363D2553a16512A65954D7503a33210E8614
$$ y = [340461, -69729, -120043, -192184, -230702, 165879, -4430, 253883, -95875, -88525, -24085, 46037, -88458, 69385, -160530, 54766, 256052, -243293, 60042, -42339, -62922, 194590, -64418, 308794, 287511, 246555, 25602, 123222, -284846, -186656, -27237, -68396, 150258, 198400, -90174, -185043, -116729, 244576, -49881, -32488, -111242, 177761, -139294, -111196, 166361, -31702, 44504, -42364, 309997, -181653, 112827, 182210, 215534, 79391, -6715, -78410, -307564, -222476, 91290, -256774, 4744, -17760, -183882, -27033, -144251, -10956, -176015, 209735, -66280, -75569, -159541, 67872, 334155, 78903, -91067, 28537, 15223, -14479, 64709, 150118, 62772, 191004, 61955, -307743, -121652, -298015, 42553, -116512, 165954, 47503, -133210, 58614]
17642E11235A53245A4892N2022a77658O6879e1806A02162J03637A8575b2894q5760
17631a08654l408k3683A06587K1272J07878N7761Q135a78987C943d3527k77766
17620c21293P1572e1955B20821H5546Q4639a6679B43569A15572a05500l122j20014
17609b28636Q0179b7596n6062B30424c771C5082b49962J23803I5094B7833a38597
17597C306f0081B43850c53657A23184O7631a28174E7317L9849a11596c9372B33869
17585a17631B5324c156l30154a39956c9680j14881A30629d08944a69876h3827
17574a27358A16042m1955b33506a9918G2105J14761c2823j55078e7991A27184
17563A20755D0502Q1580C2756a08613C29709H4009j9071e1013G0221L3860J05044
$$ y = [511235, 153245, 14892, 66914, -177658, -110779, -51806, 102162, 205799, 18575, -22894, -108654, -112062, -135745, 106587, 127859, 235737, 293498, 301633, -178987, 3943, -43527, -321293, -249721, -51955, 220821, 85546, 170185, -16679, 243569, 115572, -105500, -108622, -228636, -148457, -27596, -83658, 230424, -3771, 35082, -249962, -126159, 95094, 27833, -138597, 3306, -60081, 243850, -353657, 123184, 190815, -128174, 57317, 97166, -111596, -39372, 233869, -117631, 25324, -3156, -333310, -139956, -39680, -154561, 130629, -408944, -169876, -83827, -127358, 116042, 74087, -233506, -19918, 72105, 186866, -32823, -187901, -57991, 127184, 120755, 40502, 122082, 32756, -108613, 329709, 84009, 64938, -51013, 70221, 104081, 209125]
17552B09125D0042J27262E09h2888B12573I1595c6303j25168B38242a34880O3450
17541g1430j7705H1782M1306b33983G8329J03685G0913J16172N7345j05058D9283
17529i6302A65714D552a30444N0467o2294k37373A92517G7851k0855K35721A29433
17517E0008P1549a52852A2520k317R3318A4244i7088C3156K55315H964N9653K09472
17505B78089j03485g350l3260D04429b10877A80093h9355I4282R6776K58913B00036
17493A06236N1686J4208A5539L10099C5481J17829J27758K8699j46031d3696l6317
17482h0013B20150P222D7614J41980b07643C9162J26839F8663e5221A69488A0364
17470A89132P3696A29775a14023n7327H6532a89165B62029j17837n1967f4230
$$ y = [209125, 40042, 167304, 509, -82888, 212573, 91595, -36303, -161471, 238242, -134880, -71430, -89135, 81782, 123088, -233983, 78329, 182014, 70913, 187085, 244430, 139372, 49283, -96302, 165714, 4552, -130444, -79977, -142271, -379644, 192517, 77851, 56996, 292717, 129433, 50008, 121557, -152852, 12520, 10203, 103521, 14244, -97088, 33156, 288471, 8964, 68617, 278089, 174604, -7350, -40610, 404429, -210877, 180093, -89355, 94282, 191058, 449971, 200036, 106236, 157922, 172130, 15539, 325638, 35481, 153310, 281068, 309767, 163736, -43696, -80013, 220150, 227372, 47614, 189594, -207643, 39162, 166001, 68663, -55221, 169488, 10364, 189132, 262828, 129775, -114023, -171350, 86532, -189165, 262029, 144192, 92225, -64230]
17459A77542K82858A77964a59900A68449k6423J9277l9132K90443j68765K48522
17449D92371e171B92714O0393L776A76181N3982j9541K82768A13732n1835b4816
17437C91761K12731A43647J22962L8470j16129Q8495L4786F0256K68123G2542
17426F3322K46530I3762J85813c8162A04085e2207A03644K47174r7748n4045D8168
17414C77448P6118q7754j27789H4069d43776d7964H0553J13249A5262J66744F0894
17402a77037J0824j00990C47241r2869J44507A56286b65090E3239a9907D12591
17391B78700G0661m589b0331A97429j134J48104b55892a10813B51933A01345b21011
17379a1245B1421h1914D13405j008d7582B34411o6746J12145a92779D68004f3701
$$ y = [177542, 460400, 177964, -159900, 168449, 142026, 161303, 122171, 412614, 243849, 492371, -5171, 292714, 353107, 356883, 176181, 230163, 210622, 493390, 113732, 61897, -24816, 391761, 604492, 143647, 266609, 305079, 188950, 277445, 312231, 60256, 328379, 72542, 63322, 309852, 93762, 279575, -38162, 104085, -52207, 103644, 350818, 253070, 199025, 48168, 377448, 453566, 365812, 238023, 84069, -443776, -47964, 80553, 193802, 15262, 182006, 60894, -177037, -166213, -267203, 347241, 254372, 398879, 156286, -265090, 53239, -19907, 412591, 278700, 70661, 66072, -20331, 197429, 196295, 344399, -255892, -110813, 251933, 101345, -221011, -11245, 21421, -81914, 413405, 412397, -47582, 234411, 167665, 279810, -192779, 468004, -63701]
17367A25656E1408K57228a11864A40856a26379d0424A88259f9897G9683L33069
17357D12752e9526C25309F7911J49355f6940l8113C84891b02201J3456e2117q3207
17346a35324B27541L24515k50218j0063A5579L38284j66690O1365j03918f333
17335a4533o7979C04042A41916b5845A4538J3260K63363g9006K1946E1253J84924
17324B36177J65554C4424K977A7002c51460H6092c511D8964J62479A02266M1546
17313A43812J87400F4224P2847e9770J1082B45349b5175C59087A19257L7615J66963
17302C23835f1406C12421A05123n1371R7865o1557a264C73048I8127K65440A29894
17290h2770g923G2630M31370d9414A6874P2691K09715b9805B62537j31083b01233
$$ y = [125656, 51408, 308636, -111864, 140856, -126379, -40424, 188259, -69897, 79683, 412752, -59526, 325309, 67911, 217266, -66940, -105053, 384891, -202201, -188745, -52117, -135324, 227541, 552056, 301838, 291775, 15579, 353863, 187173, 248538, 144620, -6333, -14533, -82512, 304042, 141916, -25845, 14538, 27798, 291161, -79006, -57060, 51253, 236177, 401731, 34424, 37401, 17002, -351460, 86092, -3511, 48964, 211443, 102266, 143812, 331212, 64224, 137071, -59770, -48688, 245349, -25175, 359087, 119257, 156872, 323835, -61406, 312421, 105123, 53752, 151617, 90060, -1264, 373048, 98127, 363567, 129894, -82770, -7923, 72630, 504000, -49414, 16874, 89565, 299280, -29805, 262537, 131454, -201233]
17278B24334A02035J2447c7546D61482A37287M9708Q1392r3911j7380J4089P9570
17267B50755R5040f6711J0461H5814A2919Q4762c92754A12877D8046J72562G0017
17255A28330K79159C2322Q2071J82283D6413N8047i6507C7371J41923H405K63391
17244B71796r4953K24116F0923J28718J652c9864B52142h1757e706C81460D3496
17232A86006O9897c8004j7172a4442B45353A20815J81643O426j00293J70443j380
17221C77654A85558J36529A59722J504J43846j15655l6792N3024l0199L10999
17211D86449A09549N7817Q7834k4676b8908I9325L00071j61913K20632c6183B25067
17199A87547N4816k464m6777Q9692K1194K47453A76743o3044k4125J98779o5623
$$ y = [224334, 102035, 114482, -37546, 461482, 137287, 186995, 268387, 174476, 157096, 171185, 250755, 345795, -66711, -56250, 85814, 12919, 97681, -392754, 112877, 48046, 220608, 70017, 128330, 407489, 32322, 114393, 296676, 46413, 104460, -96507, 37371, 179294, 8405, 271796, 176843, 400959, 60923, 189641, 191293, -39864, 252142, -81757, -5706, 381460, 43496, 186006, 255903, -38004, -55176, -14442, 245353, 120815, 302458, 308884, 208591, 379034, 377654, 185558, 322087, 159722, 161226, 305072, 189417, 152625, 205649, 175450, 486449, 109549, 167366, 255200, 230524, -28908, 99325, 399396, 237483, 458115, -36183, 225067, 187547, 242363, 239899, 193122, 282814, 304008, 551461, 176743, 113699, 89574, 288353, 222730]
17188B22730i0300A77211L238q8733k6012J02603P3611k4176I2517J59656j14225
17177A37948H703L22039A35812J5658J16322J96464j72134l5711J11082k7562
17167C39931j00101I9473l413K51316r867I8876K34218K07809k24930n2467l4881
17156B28625M07542A23036K85977j98388K32102h4631B25997L05762m5216A38491
17145E01121E4838M5085K48003j00633J4328c9400B20790J0995g5848F2102K99286
17134C61388j9494C9175K27181q3950B7183M98916B9092K67289P5695A65747R321
17123A75068J48325M9891A23429K65479l9411N6303n9607J94081j01446P6357
17113E15185n3540n4800j3386j57610M27268a9345B6306e9498F31769k71595j73404
$$ y = [222730, -90300, 177211, 180449, 91716, 65704, 168307, 241918, 217742, 92517, 252173, 137948, 8703, 330742, 135812, 151470, 267792, 464256, 292122, 256411, 367493, 339931, 239830, 99473, 96060, 347376, 337509, 98876, 333094, 540903, 315973, 263506, 228625, 636167, 123036, 409013, 210625, 442727, -84631, 225997, 531759, 486543, 138491, 501121, 54838, 99923, 347926, 247293, 261621, -39400, 220790, 231785, -75848, 62102, 361388, 341894, 39175, 266356, 182406, 27183, 526099, 29092, 296381, 372076, 165747, 175068, 323393, 373284, 123429, 388908, 349497, 405800, 346193, 540274, 438828, 515185, 461645, 406845, 393459, 235849, 663117, -19345, 26306, -59498, 631769, 360174, 186770]
17102A86770K43097B13906L44179B45255N1940j25356l0062K06077J72819J93215
17092G13888l04442j78077j09070K04136o0266L27628k58550J76324k03427Q6091
17082C94235j79014N3805K01225B02506J30268k4980A31679O2770K30855n3855
17072C71449K0486L00214k82268O5462j84528J39428j42927O5427j47861N0994
17062B55876J37334A70149L64868j35599r2492K35599J07574k13216O7490J6406
17052E20779A89399N26423C34944L31145B24608N07832K299A58207M49472j68829
17042D38850A72479J20367M90713A60694L78278j66437A73470K82967A37245M04300
17032E41545Q5306C01364K44851l2150O1853m3486K86205k67785O5860q4864k37777
$$ y = [186770, 429867, 213906, 558085, 245255, 297195, 171839, 141777, 347854, 520673, 713888, 409446, 231369, 122299, 326435, 266169, 593797, 335247, 511571, 308144, 394235, 215221, 269026, 470251, 202506, 332774, 307794, 131679, 194449, 425304, 371449, 391935, 692149, 409881, 475343, 290815, 430243, 287316, 352743, 204882, 255876, 393210, 170149, 535017, 399418, 306926, 542525, 650099, 436883, 504373, 520779, 189399, 715822, 334944, 666089, 224608, 732440, 734739, 158207, 607679, 438850, 172479, 292846, 783559, 160694, 538972, 372535, 173470, 456437, 137245, 541545, 626851, 301364, 546215, 514065, 575918, 532432, 818637, 550852, 616712, 531848, 294071]
17021B94071J49261J85378J3353k8452l8307k0483l2600J9103m0424K34082j28096
17010F06886K5792K63356C25970J98903K74001C70455A39453L24705N5207L68245
17000H87610q7574k41649R071l3057J35253l7934L8628J15685J52839J3370o3838
16989H88404k19273p8845k00911L09321K58564r9200l29706J44846o9426J05394
16979G09168j89790o3830L61895l14165R9254K11844L20270k93965J82335k87217
16969G35799J10606j74092J6437J93282J93509m01257J69057J96979j69518l54839
16959E15963K79458J82465j75751K14066j17153j2660q6383j42624K32182J36343
16949A025906L30718l28327k89401K10312n6594l9240J69102J37069m81711J08747
$$ y = [294071, 443332, 628710, 642063, 613611, 575304, 554821, 522221, 541324, 500900, 734982, 606886, 632678, 896034, 325970, 524873, 798874, 370455, 139453, 464158, 519365, 887610, 800036, 558387, 567458, 534401, 669654, 631720, 670348, 786033, 938872, 952242, 888404, 669131, 590286, 389375, 698696, 957260, 858060, 528354, 673200, 603774, 709168, 519378, 455548, 817443, 503278, 602532, 814376, 1134646, 840681, 1023016, 735799, 846405, 672313, 688750, 882032, 1075541, 674284, 843341, 1040320, 870802, 515963, 795421, 977886, 802135, 1016201, 899048, 886388, 800005, 657381, 889563, 1025906, 1356624, 1028297, 738896, 949208, 892614, 853374, 1022476, 1159545, 677834, 786581]
16939G86581L6670K41220O4644k2958k38296J12341J43826M5695k27675K82460
16929A224508j9386n2955Q1386J43153j92259J09861j91508k59048J21311M30561
16919A395624k36175K15837k20928k63053P86409l43780k84191L89483N890m21476
16909A023640M35854J21371k87490r9522O37404m00185N0745J29136j9979P8912
16899A669886o9299j39433K2627K01352q2892J18603l7952J17521k74921o7927
16889A457565J84909L4509l43076M65059P5524r9291J13082n3148L02676j78884
16879A958925k20618M29364J985j30277J89917K10684m09937K25536j1041L17562
16869B562100j66640l79198K25437K25154O7057k31763L93801k65625j31776O2368
$$ y = [786581, 823251, 1064471, 1129115, 1106157, 867861, 980202, 1124028, 1169723, 942048, 1224508, 1205122, 1152167, 1233553, 1376706, 1184447, 1294308, 1102800, 843752, 965063, 1395624, 1159449, 1375286, 1154358, 891305, 1677714, 1333934, 1049743, 1439226, 1445116, 1023640, 1459494, 1580865, 1293375, 1193853, 1831257, 1431072, 1481817, 1610953, 1590974, 1669886, 1600587, 1461154, 1483781, 1685133, 1602241, 1720844, 1682892, 1800413, 1525492, 1457565, 1642474, 1676983, 1333907, 1798966, 1874490, 1775199, 1888281, 1835133, 2137809, 1958925, 1738307, 2167671, 2169656, 2039379, 2229296, 2439980, 2030043, 2255579, 2244538, 2562100, 2395460, 2016262, 2241699, 2466853, 2533910, 2302147, 2695948, 2430323, 2298547, 2360915]
16859B360915L33929K32708m87938M1808R8609o7553j6715L13429k19814M28180
16849C017558J0373j40194J95439j74106j22352L01744K62185L7543n7114P0256
16839C401332j20716M24303k09386J40152j91504L03814J2763J62770m3185j65753
16829C714590L69838l2361J83705o3598K71661j65975K19019q1060J54395J33456
16819D703670M2824M18549m9558m4983j5779L06845K90372J49703k02719K93098
16809E892022j06171M61326k67920L26214J39445Q6944M48082k23249K68682K38197
16799G263572J72141M13540j39419L22033N57367k54769K86024j06718N51921
16790I065692J94359N21076K52484J05136M01176O9516K69511M85852L66332L67915
$$ y = [2360915, 2694844, 2927552, 2439614, 2481422, 2580031, 2512478, 2495763, 2809192, 2589378, 3017558, 3027931, 2887737, 3083176, 2909070, 2786718, 3088462, 3350647, 3388190, 3331076, 3401332, 3280616, 3704919, 3495533, 3635685, 3444181, 3747995, 3760758, 3923528, 3880343, 3714590, 4084428, 4052067, 4235772, 4172174, 4443835, 4277860, 4496879, 4415819, 4570214, 4703670, 4746494, 5165043, 5115485, 5070502, 5054723, 5361568, 5651940, 5801643, 5598924, 5892022, 5785851, 6247177, 5979257, 6305471, 6444916, 6531860, 6979942, 6756693, 7025375, 7263572, 7435713, 7849253, 7709834, 8031867, 8589234, 8334465, 8620489, 8513771, 9065692, 9260051, 9781127, 10033611, 10138747, 10539923, 10609439, 10878950, 11364802, 11731134, 12099049]
16780A2099049K31226L63389P45372J92588L50989O95533N79033M59412N63847
16771A6280438O01529N17604O45085N84869N60827P86636J018208N47209Q78373
16762B2420778R58829J266107Q97998J121431R01463J229348J568687R42928J686646
16753C2994215J756009J552233K167450J995549J929732K412727K407375K623366
16745D9838656L171944K496920L314000L612646L683782M084353M308880M566621
16737G9077802N245510N133689N524840O452872O525622P048554O685161P440296
16729A29134346P663423P808176P896391P977909P573373P269155O405238N697705
16721A87425716M464779L496558K206981J90403j009092k597419m164328m918413
$$ y = [12099049, 12330275, 12693664, 13439036, 13631624, 13982613, 14678146, 15257179, 15716591, 16280438, 16881967, 17399571, 18044656, 18629525, 19190352, 19976988, 20995196, 21542405, 22420778, 23379607, 24645714, 25543712, 26665143, 27566606, 28795954, 30364641, 31307569, 32994215, 34750224, 36302457, 38469907, 40465456, 42395188, 44807915, 47215290, 49838656, 53010600, 55507520, 58821520, 62434166, 66117948, 70202301, 74511181, 79077802, 84323312, 89457001, 94981841, 101434713, 107960335, 115008889, 121694050, 129134346, 136797769, 144605945, 152502336, 160480245, 168053618, 175322773, 181728011, 187425716, 191890495, 195387053, 197594034, 197784437, 196775345, 194177926, 190013598, 185095185]
16713A85095185o247666o931356p890466p946276q132097p922641q242953p927172
16705A23854558p614769p196029o987250o173594n670870n864656n252975m959226
16697G4135189m284322m334892l772144l705314l211112k887084k739741k810978
16689D6389602k678269k183597k107842j724589j925090k139189j299123j143519
16681C1188384j770090j254803j099884j419328j190858p39692j252803o77971
16673B1782955r39042q79338l75294j033419o28591r83980o75912n45661m86129
16664A5235589k83378n13254p68850k99709o44239n6776l96575m13264l38437
16655A1521107m92016k50189m55730M6267m51036j27696o74542k82091q4979l02589
$$ y = [185095185, 178847519, 171916163, 164025697, 156079421, 147947324, 140024683, 131781730, 123854558, 116239789, 109043760, 102056510, 95882916, 90212046, 84347390, 79094415, 74135189, 69850867, 65515975, 61743831, 58038517, 54827405, 51940321, 49200580, 46389602, 43711333, 41527736, 39419894, 37695305, 35770215, 33631026, 32331903, 31188384, 29418294, 28163491, 27063607, 25644279, 24453421, 23713729, 22460926, 21782955, 20843913, 19964575, 19589281, 18555862, 17927271, 16943291, 16267379, 15721718, 15235589, 14952211, 14438957, 13670107, 13370398, 12726159, 12669383, 12272808, 11859544, 11521107, 11029091, 10778902, 10323172, 10369439, 9918403, 9790707, 9116165, 8834074, 8749095, 8446506]
16645H446506k05621k43623K8863m02736j66705k73343L03810q58175L43054o30055
16635F341975j26803K08380j93816n44158J65659J31375o28319J65119m72708
16626E046704L37297n51238J53117j06933j292o01631L94202l720l6170j31460
16616D498876l93317N738q1706l2172K76350l47344K3785l30160k23301L77647
16606C774396o9636k46449J52308o89416K11340j07975L9327q3745q5085K04711
16596C099776m79332J25287J64388l50048L14036m70356O25255l14301l26487
16587B388218J43478J00977k90981k06045L59288k80915J09390j42570l1847Q5918
16577B234911o1149J99440n46049J53228k05506K66234J09356k91659R9463n1605
$$ y = [8446506, 8240885, 7997262, 8026125, 7623389, 7456684, 7183341, 7487151, 6628976, 6972030, 6341975, 6215172, 6423552, 6229736, 5685578, 5851237, 5982612, 5354293, 5519412, 5046704, 5384001, 4832763, 4985880, 4878947, 4877655, 4276024, 4670226, 4666506, 4630336, 4498876, 4105559, 4111297, 4029591, 3997419, 4273769, 3926425, 3950210, 3620050, 3396749, 3774396, 3704760, 3458311, 3610619, 2921203, 3132543, 3024568, 3063895, 2980150, 2895065, 3099776, 2620444, 2745731, 2910119, 2560071, 2874107, 2403751, 3029006, 2714705, 2388218, 2531696, 2632673, 2341692, 2135647, 2494935, 2214020, 2323410, 2180840, 2148993, 2234911, 2173762, 2373202, 1827153, 1980381, 1774875, 2041109, 2150465, 1858806, 1958269, 1906664]
16567A906664o6130M9349l86190K26141J27084q4604j57482j0819O20415m08867
16557A815561m84265N58725n33525N55874n26835J0039J24713j89169N0778Q9561
16547A471457j24338j03546P8189l38373O99834l72417o144K68440l22564N3454
16537A303992J92223p4518k53807J48199k1902J66212m24922K75241j0944J48930
16527A448704r3337j50357J63500o3541l99836J02581K20368l73366R4552l5067
16517I14201j94002M09433l10131J94455k80719K35954j88090N8051j72683J58492
16507H24961J71979k10381N727J75622L385n8334k50473L99491k28628l2323j850
16496G99176N643J16086k05105J22550J49973j54509J39954k76772P0152j06725
$$ y = [1906664, 1840534, 1889883, 1503693, 1729834, 1856918, 1772314, 1614832, 1604013, 2224428, 1815561, 1331296, 1890021, 1356496, 1912370, 1385535, 1395574, 1520287, 1331118, 1381896, 1471457, 1347119, 1243573, 1321762, 983389, 1683223, 1310806, 1304662, 1573102, 1250538, 1303992, 1496215, 1421697, 1167890, 1316089, 1294187, 1460399, 1035477, 1310718, 1299774, 1448704, 1355367, 1205010, 1368510, 1304969, 905133, 1007714, 1228082, 854716, 949268, 914201, 720199, 1129632, 819501, 1013956, 733237, 969191, 781101, 839152, 666469, 824961, 996940, 786559, 792286, 967908, 971293, 912959, 662486, 1061977, 833349, 801026, 799176, 804819, 920905, 715800, 838350, 988323, 833814, 973768, 696996, 767148, 660423]
16486F60423O4077K92339L27842E48615N43733n40751K73309k91390J45243J71875
16476H50634j28281J8256k67072J05823J52716Q73J89643m25091M3052k4308n6811
16465D59434L66361J1177O5794A89462N26364k2632L10998l09783B83630J24330
16455D07960K14682j33147K23568j46713K28662l24460J61414K16092j53386k52807
16445D41865J05570l3885n6088j5420M3629p5684R9095L15743B42297K96499j5775
16434E23021B33664N08210R6741B77462J41305K29917j32076E3423N77882C15348
16423D46248j97987K49051k7146A16070O50695k66540k28206J69278L6843J5390
16413D93530B10158j8673M87358k73422J55813k04613Q501A18213L0480I823L10169
$$ y = [660423, 724500, 1016839, 1344681, 548615, 1092348, 551597, 824906, 533516, 678759, 850634, 722353, 740609, 473537, 579360, 732076, 732949, 922592, 497501, 540553, 516245, 459434, 825795, 836972, 902766, 189462, 715826, 693194, 1004192, 694409, 283630, 407960, 622642, 489495, 713063, 566350, 795012, 470552, 631966, 848058, 694672, 441865, 547435, 513550, 457462, 442042, 485671, 409987, 509082, 824825, 242297, 538796, 523021, 233664, 741874, 838615, 277462, 418767, 648684, 516608, 53423, 631305, 315348, 446248, 248261, 497312, 470166, 116070, 766765, 500225, 272019, 441297, 478140, 493530, 210158, 191485, 678843, 405421, 561234, 356621, 365122, 118213, 148693, 9823, 319992]
16402C19992L4163J48949A87554N33739C29365J49968B08299J50631L09380n4065
16392F14245j86521M4747A99729J51840j33120K26690m9729j32665K63638o9251
16382D57132m3474l1722j9758K98957C05838j02301K19100j34470K8635O7982
16372C84784j87647j2950M90770B62720J85102k06499l2531p2360J81921E3371
16361B89436n763j30207J61178I9822J71254h804E6318J13634d3187A79830b1625
16349C17055j9551a17243A10897K42542j930g546A09088L83938A37663L33316
16339D70979F8438A0334K63376G3220M3997K74632j93465J10946A13960d8810
16328B1234J26171R1946b5646B43420a45243J7950A78209K32484A83499K67081
$$ y = [319992, 354155, 503104, 187554, 721293, 329365, 479333, 208299, 358930, 668310, 614245, 427724, 472471, 199729, 351569, 218449, 445139, 395410, 262745, 526383, 457132, 413658, 381936, 362178, 661135, 305838, 203537, 422637, 288167, 316802, 384784, 197137, 184187, 674957, 262720, 447822, 241323, 208792, 136432, 318353, 53371, 289436, 283673, 153466, 314644, 99822, 271076, -8804, 56318, 169952, -43187, 179830, -21625, 317055, 297504, -117243, 110897, 353439, 351509, -7546, 109088, 493026, 137663, 470979, 68438, 10334, 273710, 73220, 117217, 391849, 198384, 309330, 113960, -48810, 21234, 147405, 239351, -25646, 243420, -145243, -127293, 178209, 410693, 183499, 450580]
16318D50580A3143N81459a78567A45226a33485B60449C4671h685G7726d6592F6020
16306B32224F8844L69277b36819A17645C2942M38851A19527D0237i2052L4517
16296e7535A59120J7419e0341D71744j93306A28975r368K83682e2274C2132J4353
16285D6485j876K05836F9690K09862J58547H5856L60015O0206k12087a53388A31633
16273B17387c4584j07821D3669K42021F2893J3452L8069J37326J15301A59908
16262C52042b86013A48234N5585l2427O323D4980M2903N4706k2935L35254A34491
16250B62222m9998K12495F2325J62830B1836L19060d0754A45783a23054J4533
16240a08521C81006o4644c45412h8331A49257F8112e8355k9080A82146m1036k5327
$$ y = [450580, 13143, 594602, -178567, 145226, -133485, 260449, 34671, -8685, 77726, -46592, 66020, 232224, 68844, 438121, -236819, 117645, 32942, 471793, 119527, 40237, -92052, -57535, 159120, 176539, -50341, 471744, 278438, 128975, 119607, 403289, -52274, 32132, 46485, 44609, 250445, 69690, 279552, 438099, 85856, 445871, 506077, 293990, -153388, 131633, 217387, -34584, -142405, 43669, 285690, 62893, 76345, 114414, 251740, 367041, 159908, 352042, -286013, 148234, 203819, 171392, 177715, 44980, 87883, 142589, 119654, 454908, 134491, 262222, 212224, 424719, 62325, 225155, 21836, 340896, -40754, 145783, -123054, -108521, 381006, 316362, -345412, -88331, 149257, 68112, -58355, -87435, 182146, 141110, 115783]
16229A15783C1275K74946D7473K32147D6697M4271d1530p2601A36909Q2227Q0885
16218C00021j08238b06947A70152D0291K3702R1063e5661A71779Q1658p5375b31997
16206A39403n2647a030E5492a14683B96799G8080L2201b29847B57555G8599M11165
16195D89764A60066J79073C1899a7204j24870I2741c46892C2878K5686a12798
16184A40157F5609e9266j2563B15662a77264b416k03416i7437D57263a0700B03468
16172F003i8035B821J43517k493h3732A5412J30877F1307p769b09436a2310j26532
16160a38842F6614i4889C40723a5621A228L56543j18976B6419e7879B25297d0177
16148B20931a58170B12140f3942c0455C8964J08478j2247f8273j2102a7552E1606
$$ y = [115783, 31275, 306221, 47473, 279620, 46697, 90968, -41530, -114131, 136909, 219136, 300021, 191783, -206947, 170152, 40291, 63993, 155056, -55661, 171779, 253437, 178062, -231997, 139403, 86756, -1030, 55492, -114683, 296799, 78080, 110281, -229847, 257555, 78599, 489764, 160066, 339139, 31899, -17204, -142074, 92741, -346892, 32878, 58564, -112798, 140157, 65609, -59266, -71829, 215662, -177264, -2416, -205832, -97437, 457263, -10700, 203468, 6003, -98035, 2821, 146338, 143845, -83732, 15412, 146289, 61307, 53538, -209436, -12310, -138842, 66614, -94889, 340723, -15621, 1228, 357771, 238795, 26419, -57879, 225297, -40177, 220931, -158170, 212140, -63942, -30455, 38964, 147442, 135195, -68273, -80375, -17552, 51606]
16136a58855A20825a17257l39187a60364A72924J82300e8405j55462i5594j29545
16126b25139a7304G1772J2936g4745b3274G2165d18866a93293g470C2144L62130
16115C94274A8797D356a16066A04867C6953J71946a02671G4585B2650c86286J32531
16104b53755B14742h0958B23954a0472A31749D661J03476k5720b7240n2850j3357
16093i3447c4348A07918P8217g9786H2237a16589j3260B39274G7292a29406A2844
16081A60973m2251f7156C1674L10788a43372D087P2827C5129a97953q5304J24932
16070a58325A31972b26388A70970a31628B84509m0074a22263B23042b78121g7585
16059A63396K1511K5622r0177l6619a57168I8597K94634h2038A99376a38836A44037
$$ y = [-158855, 120825, -117257, -456444, -160364, 172924, 355224, -58405, -213867, -95594, -225139, -17304, 71772, 84708, -74745, -23274, 72165, -418866, -193293, -7470, 32144, 394274, 18797, 4356, -116066, 104867, 36953, 208899, -102671, 74585, 22650, -386286, -253755, 214742, -80958, 223954, -10472, 131749, 4661, 108137, 82417, -27240, -80090, -93447, -34348, 107918, 186135, -79786, 82237, -116589, -129849, 239274, 77292, -129406, 12844, 160973, 118722, -67156, 31674, 342462, -143372, 4087, 76914, 35129, -197953, -283257, -158325, 131972, -226388, 170970, -131628, 284509, 244435, -122263, 223042, -278121, -77585, 163396, 184907, 210529, 120352, 83733, -157168, 98597, 393231, -82038, 199376, -138836, 144037]
16047A13882C8847c78A26745M8053H2325a0656B57811D5688e6171j56000M0586
16036a71585E1198P2188a60217N7894A6798b59571C23399a39012e7738B91583
16025d7062B9349L3033a92786d4408E424J00084a03279j3442m3383M1054L1097
16014h7953q2494a4734n6609A43392e6091k6771k04540a43696A14367i490B32750
16002b29720A11731g6329j53066g1494A7411R4984b45880a14133d536k4001I0664
15990F0656a69935A13822m361m9095k2167a50298B010K58554c6310B73178c294
15978B730J14618D1013A3636n966J65772b0250C1337M7194K46710E8849h5801
15966a40087e9655A43196a32500p0928D62286A18676a12489b2681k26566b8724
$$ y = [113882, 38847, -378, 126745, 174798, 82325, -10656, 257811, 45688, -56171, -212171, -171585, 51198, 123386, -160217, -102323, 16798, -259571, 323399, -139012, -57738, 291583, -47062, 29349, 62382, -192786, -44408, 5424, 105508, -103279, -116721, -160104, -119050, -87953, -170447, -14734, -71343, 143392, -56091, -82862, -287402, -143696, 114367, -9490, 232750, -229720, 111731, -76329, -229395, -71494, 17411, 112395, -245880, -114133, -4536, -28537, 90664, 60656, -169935, 113822, 109461, 60366, 38199, -150298, 2010, 260564, -36310, 273178, -3294, 2730, 117348, 41013, 13636, 7670, 173442, -20250, 31337, 78531, 325241, 58849, -85801, -140087, -59655, 143196, -132500, -203428, 462286, 118676, -112489, -22681, -249247, -28724]
15955a22947J3390b360k559D6207a6689k70907j2395A98320b95072j466E4716
15943I9962g8955o8405O8941o4652m27734a28175Q88j43874o8152J68950f4456
15931a15749p5539L0841A65553h0727Q808C162d78103a58808e6142a9920F9477
15919b27061A22778h7671j93960j14214H8253a87517i3568c7911f465n0218l7269
15908i3952k70834D3369J1309k3455a36089M7408D1491a16888A2347f3350j42149
15897b05499A29848C2440L3857b21695E9608g4378A13199B7614a27431j87257
15887c14688g5821A65458D7857J83582r5168a33398B02544I1327i5806k22775
15877c18581m7616A7228b65761c7906B84714a98003I2949a25984L4384b0011F6560
$$ y = [-122947, -109557, -2360, -4919, 46207, -16689, -287596, -299991, 198320, -295072, -296538, 54716, 99962, -78955, -147360, -78419, -143071, -570805, -128175, -127287, -271161, -339313, -170363, -64456, -115749, -191288, -160447, 165553, -80727, -71919, 3162, -478103, -158808, -56142, -19920, 69477, -227061, 122778, -87671, -281631, -395845, 88253, -187517, -93568, -37911, -6465, -56683, -93952, -364786, 43369, 54678, 31223, -136089, -88681, 41491, -116888, 12347, -63350, -205499, 129848, 32440, 66297, -221695, 59608, -74378, 113199, 27614, -127431, -314688, -75821, 165458, 47857, 231439, 136271, -133398, 202544, 91327, -95806, -318581, -366197, 17228, -265761, -37906, 284714, -198003, 92949, -125984, -91600, -20011, 66560]
15865A64730b0390H5198a51933r9419d5932k08591M7257a67j51569J6020m8163
15854a83879C1873g8931i878B57736e8021A92641h669j18730B15920a52632d7159
15842e3354B24038F1485N9095a44997k61264A17884K7177g8797B35137b41799
15831i670F5079L0340L55732a88934j15498E2424J38705a453l13825e7718J3186
15820d4532k9876F8611b96291k18332g3374j80368k4183n8258L3960J30429A4447
15808a11827q1113f4561C80684g9200g005A63556a49881b2224k60188L8678C41266
15796a47295A68642D9775J73958N0140a35067d4587B10054a4382o4476B81594
15785A79196b45730k1827A55258b26211J486B15543G7647c24237d2147m7269p2189
$$ y = [164730, -20390, 85198, -151933, -251352, -45932, -254523, -207266, -167, -151736, -135716, -183879, 31873, -78931, -9878, 257736, -58021, 192641, -8669, -127399, 215920, -152632, -47159, -53354, 224038, 61485, 120580, -144997, -406261, 117884, 145061, -78797, 235137, -241799, -9670, 65079, 95419, 451151, -188934, -304432, 52424, 191129, -1453, -315278, -57718, -44532, -74408, 68611, -296291, -514623, -73374, -253742, -277925, -336183, -302223, -171794, 14447, -111827, -192940, -64561, 380684, -79200, -7005, 163556, -149881, -22224, -282412, -243734, 341266, -147295, 168642, 49775, 223733, 273873, -135067, -44587, 210054, -14382, -78858, 281594, 179196, -245730, -267557, 155258, -226211, -224725, 215543, 77647, -324237, -42147, -89416, -161605]
15774a61605b1425l84258J54265B38057B2623J8716c05495C1623b92683J44958
15764a47725I4094b33537A57808A8888a58813k6387B78468I4492J44651B7933
15753b17225B42742b2153H2613b88692A09509m8027Q4865b88342F3745K16379
15743B80124l1802A1683J41015m5603a00214f524k04920A02759b06043c5694G3420
15731e3533j64261J03569A91073F4015a27363k9067f7221H8620B7131a96466e5583
15719A8173a8710r4020A49439a96337f9670D0526J07502l5600C2453f1412b7374
15707d6556j3217p9707b59k50999R5863b5158j74579C36443D7011R4183c7665
15695a42149m8069E4480J7856G065g2405A28983d3541j3928A45368b76842c4381
$$ y = [-161605, -21425, -405683, -251418, 238057, 22623, 41339, -305495, 31623, -292683, -147725, 94094, -233537, 157808, 18888, -158813, -185200, 278468, 94492, 239143, 27933, -217225, 242742, -22153, 82613, -288692, 109509, 61482, 146347, -288342, 63745, 280124, 248322, 11683, 152698, 107095, -100214, -6524, -211444, 102759, -206043, -35694, 73420, -53533, -217794, -114225, 191073, 64015, -127363, -156430, -67221, 88620, 27131, -196466, -55583, 18173, -18710, -112730, 149439, -196337, -69670, 40526, 148028, 112428, 32453, -61412, -27374, -46556, -59773, -139480, -259, -251258, -155395, -25158, -199737, 336443, 47011, 141194, -37665, -142149, -190218, 54480, 72336, 7065, -72405, 128983, -43541, -57469, 145368, -276842, -34381]
15683B19708b01440h8129r4390D9289d9844A73371k9060c20248A93220K0129b89934
15671b8068B19100j08726B4006J99768F2871J57136m5444a51676k8560B2135L24052
15660C46187a87131A64217G6371l8015O5712K3570e44261I8443j5361d0475k06086
15649b46561O4566A2180a74173G5654a3656j81854P8798b3472A97230a08821E5087
15637D1510b4566B79248a8081k18649A0644a92017h0007k42451J26104D681L3128
15626C7809j7287b42018l4465i6437L2666l1177j99498Q9538q1612A06857N9662
15615A66519E2875a14067l0692B94050h8488B5332L3895L302B1573b20151h7533
15603b06812i159j68024c9751j58854N4886j58644a40327A96562d04413b00717
$$ y = [219708, -201440, -88129, -182519, 49289, -49844, 173371, 144311, -320248, 193220, 213349, -289934, -28068, 219100, 110374, 24006, 223774, 62871, 220007, 174563, -151676, -180236, 22135, 346187, -187131, 164217, 76371, 38356, 104068, 127638, -544261, 98443, 83082, -40475, -246561, -181995, 12180, -174173, 75654, -13656, -195510, -116712, -23472, 197230, -108821, 55087, 41510, -24566, 279248, -18081, -236730, 10644, -192017, -80007, -322458, -196354, 4681, 37809, 20522, -242018, -276483, -96437, -63771, -94948, -294446, -204908, -286520, 106857, 166519, 52875, -114067, -144759, 294050, -88488, 25332, 59227, 62529, 21573, -220151, -87533, -206812, -9159, -177183, -39751, -198605, -143719, -302363, -140327, 196562, -404413, -200717]
15592a4160j37091H7539a41006j41625a40011I4074j6895K3105b50824a892B6324
15580c73973a61514e7246D7273a37257M745H905R9055a2184H50b15443A3392b01976
15567b17666A04009N5015B27Q9486J19047I7314g5880E1957a28932A49436L637
15556A53073a04731c8221B7108I92e56447K19334A61984N5220a18337l901k8692
15545a50930B24655a85058C7154a1969r021B2411N0055a7952j72372j42118J18628
15534b13814F4790a48541N4494j32768N7187l7624a02825A28572K81641a70745
15523A04508a48360D8855R607J2861a81613B2284J22996b00853E3744J01493f1566
15511d87671a40720l9934N8899A84365a2763H4099a09362j08062Q0307A72184
$$ y = [-14160, -151251, 87539, -141006, -282631, -140011, 94074, 77179, 100284, -250824, -1892, 26324, -373973, -161514, -57246, 47273, -137257, -132512, 8905, 107960, -12184, 850, -215443, 13392, -201976, -217666, 104009, 159024, 227, 89713, 208760, 97314, -75880, 51957, -128932, 149436, 153073, -104731, -38221, 27108, 992, -556447, -337113, 161984, 217204, -118337, -122238, -150930, 224655, -185058, 37154, -11969, -20990, 22411, 72466, -17952, -190324, -332442, -213814, 64790, -148541, -94047, -226815, -169628, -207252, -102825, 128572, 410213, -170745, 104508, -148360, 48855, 58462, 71323, -181613, 22284, 145280, -200853, 53744, 155237, -61566, -487671, -140720, -180654, -121755, 184365, -12763, 84099, -109362, -217424, -137117, 172184]
15500a52403N6488I9601e4558B9771c6931B08169h4329K4900j15612A02173j6353
15489H5820K1161k3841c42759A76326e9327A34181b8311B59800I9508a95724B9799
15477a6809C44036B486a15837o0275A04391O4052f4449F8787L0408a77821A95040
15465g9848H4440a07438K3877C04626r3271h1484C9173d3042B26683j00402N6415
15454A82696b91222B94267b41935C15535A31362C8596J80720B3699c66472b9179
15443A29771b14683C8185d428C83948E9159a3652j17501H9420m056a08363A82506
15431b2019q8738n1204I7995a41553D5737d81953D1771M1219a06296c7090C6124
15419h0256B95874a05810j99342J08365R7792k35964h2839j67958c2653j91082
$$ y = [-152403, -95915, 99601, -54558, 29771, -36931, 208169, -84329, -59429, -175041, 102173, 85820, 106981, 83140, -342759, 176326, -59327, 134181, -28311, 259800, 99508, -195724, 29799, -16809, 344036, 2486, -115837, -176112, 104391, 168443, -64449, 68787, 99195, -177821, 195040, -79848, 84440, -107438, -83561, 304626, 211355, -81484, 39173, -43042, 226683, 126281, 182696, -291222, 294267, -241935, 315535, 131362, 38596, 219316, 23699, -366472, -29179, 129771, -214683, 38185, -4428, 383948, 59159, -13652, -131153, 89420, 85364, -108363, 182506, -22019, -110757, -161961, 97995, -141553, 45737, -481953, 41771, 82990, -106296, -37090, 36124, -80256, 295874, -105810, -305152, -196787, -98995, -334959, -82839, -250797, -32653, -223735]
15409b23735r774I7569d3909n7148A0064K76644A39263M544o3811J66976o8497
15398A78475j6693L5767c10035c6956j7969k04405E7437c4180m8670k0955l3463
15387a37268b2006A23003m4844b6327F4449J23142M6837c4790B3930P9899j8218
15376H5611a42999C8199i1503j71522Q5454M8868j34762e4673q6795A34601b01793
15364d92374P4184B61480g0498l54282D5856J15924a81252M5014c8201j15380
15354a53581A68186f0273k5367B37529l2198a22524b4203k04017d0851C8543c71664
15342B25760j40h1438B44334a24566e4772f118A33992b28555P3548E167O0567
15331F5734c0405E56396B0757J25088b43014N8422C9189a57288E2373R4568g6637
$$ y = [-223735, -233509, 97569, -43909, -101057, 10064, 286708, 139263, 143807, 79996, 246972, 178475, 161782, 197549, -310035, -36956, -54925, -259330, 57437, -34180, -82850, -103805, -137268, -22006, 123003, 78159, -26327, 64449, 187591, 234428, -34790, 23930, 103829, 85611, -142999, 38199, -91503, -263025, -177571, -128703, -263465, -54673, -141468, 134601, -201793, -492374, -418190, 261480, -70498, -424780, 45856, 161780, -181252, -136238, -38201, -153581, 168186, -60273, -85640, 237529, 205331, -122524, -24203, -228220, -40851, 38543, -371664, 225760, 225620, -81438, 244334, -124566, -54772, -6118, 133992, -228555, -155007, 5167, 65734, -30405, 556396, 20757, 145845, -243014, -184592, 39189, -157288, 52373, 146941, -76637]
15319b1155m2260k64548r439C35577D4632b76550B3191f6611b2636E712J84015
15308A89727k163b80298A7207J73462O3091b06566l61h0270c6692A84262a06716
15296b23120A96190m1408K10647b29766A79946a1220I4313a73726h4682j06478
15286a91160B37944e5057j12469A7964f91D1045Q070a06586E224O0176N535h8090
15273G6050J82874e933p0121j2994j66385J04233A22108N9390m2007a09481F5112
15261B8341L47982a26985a351n5899j67128c0847C68737d9771B33202G9706J2913
15250I2619M39995L70954j65804K6971K02266B51756K27109I1268d3088j32934
15240a76022B16069c3751H8860J04932r5751A0556J47134l4200K26755b81889
$$ y = [-21155, -63415, -327963, -337402, 335577, 44632, -276550, 23191, -66611, -22636, 5712, 189727, 187564, -280298, 17207, 190669, 253760, -206566, -206927, -80270, -36692, 184262, -106716, -223120, 196190, 154782, 365429, -229766, 179946, -11220, 94313, -173726, -84682, -191160, 237944, -55057, -167526, 17964, -691, 41045, 49115, -106586, 5224, 65400, 70935, -88090, 76050, 258924, -5933, -76054, -89048, -255433, -151200, 122108, 181498, 139491, -109481, 65112, 28341, 376323, -126985, -1351, -57250, -224378, -30847, 368737, -49771, 233202, 79706, 92619, 532614, 903568, 737764, 764735, 967001, 251756, 478865, 91268, -43088, -176022, 216069, -33751, 88860, 193792, 98041, 10556, 157690, 123490, 350245, -281889]
15229A1276j167i413B09419b05584C5541K21081G0514l1380a73052A68649N6956
15218B25605r8239C2340J5241J22029f6484B16809f4147B15654D4460R9960K05875
15207C50295C2760K01642a82188K2121f7594r8808b3480M842A9775b1044A01152
15195D9515C394b02708A72754e9072C12106o1548o4903D7860a19018B52635N2438
15184C05073b9119A18274i1509E3992Q2137n1238C3161L60873j79026k0357a85979
15172a76097g1271A33502m1361A7214J96864J44243E6634i554A58115F6962l1096
15161C5866P9092h9595G3879J47780p3922m8289B6491R4271f0660C8725J32208
15150A70933K63502j60729l2116g1154B16238n5217p8028K47723I7081J95609
$$ y = [11276, 10109, -9413, 209419, -205584, 35541, 256622, 70514, 39134, -173052, 168649, 225605, 127366, 32340, 47581, 169610, -66484, 216809, -64147, 215654, 44460, 144420, 350295, 32760, 234402, -182188, -160067, -67594, -166402, -23480, -18638, 19775, -21044, 101152, 49515, 3394, -202708, 172754, -59072, 312106, 250558, 185655, 47860, -119018, 252635, 305073, -29119, 118274, -91509, 53992, 136129, 84891, 33161, 394034, 215008, 194651, -185979, -176097, -71271, 133502, 92141, 17214, 214078, 358321, 56634, -9554, 158115, 66962, 35866, 114958, -89595, 73879, 221659, 147737, 99448, 26491, 120762, -60660, 38725, 170933, 434435, 273706, 241590, -71154, 216238, 161021, 82993, 330716, 97081, 292690]
15140B92690A44688b17519B3826d04690a79123A73246a39470A95124C0892b03721
15129a4105q0785D21398C7269c84044J89183D5166h0299A91625J41978c21476
15118h2278A2711a6975l1754G7085g4708B84847a40302D4111M1260a99666F5931
15106A79403n9969j0435B1217g8455I1051K24850A06892b7450B02686g2409C42937
15094E2896J46330n7131O7435K5869P8416d1081A95364q431L20340H704J38806
15083A47510N6247H617a95867G2192b4323I1805o020J03041b20952a9876G8743
15071H8066a30146I4859a1659C28824A20336f0581j16781C24393F1548K79344
15061C40892j44168J46056A48354n8757J5074D612g2969A16490a02197B4317J12950
$$ y = [292690, 144688, -217519, 23826, -404690, -179123, 173246, -139470, 195124, 30892, -203721, -14105, -94890, 421398, 37269, -384044, -194861, 45166, -80299, 191625, 333603, -321476, -82278, 12711, -16975, -48729, 77085, -74708, 284847, -140302, 44111, 85371, -199666, 65931, 179403, 119434, 108999, 21217, -78455, 91051, 315901, 106892, -27450, 202686, -72409, 342937, 52896, 199226, 142095, 209530, 235399, 313815, -41081, 195364, 186933, 507273, 8704, 147510, 203757, 8617, -195867, 72192, -24323, 91805, 85785, 188826, -220952, -19876, 78743, 88066, -130146, 94859, -11659, 328824, 120336, -60581, -177362, 324393, 61548, 340892, 196724, 342780, 148354, 89597, 104671, 4612, -72969, 116490, -102197, 24317, 137267]
15050A37267c60654C4351a05224B29767M0965b65224a6911C83100r4788Q2470
15040C70782c6152A11807a32467D66133a09259A83976a1580B93766j05641J62616
15030C50741A63272h4625I968J37350e121D1957K91454j45427K33846a76057A34676
15018D23703A74779D525K8063K77006b9559A48873a06649A82883J07997G4732
15007A30334O394l6332L94396H7970J15222m8395l1073K88694r4603a00320b7825
14995B69975A09638m6050J41653J0527l656j6511C4145e2620B85373a0332A42996
14983C97125a2110B93441p4281G6308J25975J73153P2832F1591O959J61590C354
14971A81772p3198M2256J50931p4602J48719b65272g9679F2603k9599K83678A4556
$$ y = [137267, -360654, 34351, -105224, 229767, 270732, -265224, -16911, 383100, 288312, 370782, -36152, 111807, -132467, 466133, -109259, 183976, -11580, 293766, 188125, 350741, 163272, -84625, 9968, 147318, -5121, 41957, 333411, 187984, 421830, -176057, 134676, 423703, 174779, 4525, 32588, 309594, -29559, 148873, -106649, 182883, 290880, 74732, 130334, 136728, 100396, 494792, 87970, 203192, 154797, 123724, 412418, 317815, -100320, -27825, 269975, 109638, 63588, 205241, 215768, 212112, 195601, 34145, -52620, 285373, -10332, 142996, 397125, -12110, 293441, 219160, 76308, 202283, 375436, 448268, 61591, 68550, 230140, 3354, 181772, 108574, 150830, 301761, 227159, 375878, -265272, -79679, 62603, 33004, 316682, 14556]
14959E2501K26683L33086j88970A90211k7726Q2656b9344n1459A80172b9550E32936
14947D12037A92610M21677B82492A03797N0482l4921N48005E9507J80130J5545
14937B55182L40101j80875p1933H2459K44497f6157C60657q2897q1814Q0436r4416
14926A81966J23021l3292R6832A77293K62012A49911J16263j23359M17806A51357
14915H7914J57087k2704L11778k14599j20410J16242K63879k45421M9804R7472
14905D81042k33496J50416D5396b0028B78085j03816G2879K79560a53035e868
14894A19639J41941b5436B10799N7047R6007j62687J26302E6824K49444r891d593
14882C97344p9572j20359K81707O2420j9485A51981J20511r9947J92837j56960
$$ y = [52501, 279184, 612270, 423300, 190211, 162485, 245141, -29344, -80803, 180172, -29550, 532936, 412037, 192610, 614287, 282492, 103797, 154279, 119358, 667363, 59507, 239637, 255182, 595283, 414408, 342475, 82459, 326956, -66157, 360657, 277760, 195946, 276382, 181966, 304987, 271695, 368527, 177293, 439305, 149911, 266174, 142815, 560621, 151357, 87914, 245001, 222297, 534075, 319476, 199066, 315308, 579187, 333766, 383570, 481042, 247546, 397962, 45396, -20028, 278085, 174269, 72879, 352439, -153035, -5868, 119639, 261580, -25436, 210799, 267846, 363853, 201166, 327468, 56824, 306268, 296377, -4593, 397344, 317772, 197413, 479120, 541540, 522055, 151981, 272492, 172545, 365382, 208422]
14872B08422K53816J0529A88445K16800J71446j35358j6989L25998B30051j02969
14862A27082D1744J16465N43545C45277J84470A87224K45718o1014N7445j12408
14852C16965K28114j93664J70191J88688k82561B09945N5330J38145J25407R89
14842E29816j68487j03663J52564j45947P6301J8693L56376k43747j07822j6418
14832C47666J26227k583B12534J78209j80630K80408Q3750k28200J55358j38163
14822C63266N6420J03742k13098K07254j62066K01869L947k70755J78924L4115
14812E03618B35927K19369J08106M1210E1918P2173K80081j60033K26615K76871
14802G47625B80112J51773N6276B20537K55795j80584M26153l02958J28720A86290
$$ y = [208422, 462238, 472767, 188445, 405245, 576691, 441333, 424344, 750342, 230051, 127082, 41744, 158209, 701754, 345277, 529747, 187224, 432942, 371928, 429373, 316965, 545079, 351415, 521606, 710294, 427733, 209945, 265275, 403420, 528827, 529816, 361329, 257666, 410230, 264283, 340584, 359277, 715653, 471906, 364084, 347666, 473893, 471310, 212534, 390743, 210113, 490521, 574271, 346071, 501429, 363266, 419686, 523428, 310330, 517584, 355518, 557387, 561334, 290579, 469503, 503618, 235927, 455296, 563402, 604612, 51918, 124091, 404172, 244139, 470754, 747625, 280112, 431885, 488161, 220537, 476332, 295748, 721901, 418943, 547663, 186290]
14791B28021K47720K92767j95673K3119j18767Q541J19224K3665j8822k2089k12985
14780C74721J58868o4136L4895P4929k45195K84395k93082K15746O6440n2806
14770E54775j87612M38660C75886L0946K77094k94207K29753O5029B17689L71187
14760E88876j12095j17868L1360P8145j08972K89473K9842r505J93773j05287
14750G57742l13569K88114j13107K2478L6981L5394P6910j7108q6870P2032C62872
14738I01423l04571J9135o1122Q8050K11793o2108C66265L25416L4454K9678N3762
14727H09575J51316r912m60003K17081q433K7062J44363j89616n710p6630J24726
14716G23819k02949L34842M0543p4294C18966L41964k25515J93685k5986A80733
$$ y = [228021, 475741, 768508, 572835, 595954, 477187, 485728, 604952, 628617, 609795, 587706, 374721, 533589, 469453, 504348, 579277, 334082, 618477, 325395, 541141, 607581, 554775, 367163, 805823, 375886, 406832, 683926, 389719, 619472, 684501, 217689, 588876, 476781, 358913, 390273, 468418, 359446, 648919, 678761, 669256, 863029, 757742, 444173, 732287, 619180, 641658, 678639, 714033, 790943, 773835, 686965, 758997, 362872, 901423, 596852, 615987, 554865, 642915, 854708, 792600, 366265, 691681, 726135, 755813, 809575, 960891, 950979, 490976, 708057, 699624, 726686, 871049, 681433, 675723, 599093, 723819, 520870, 855712, 896255, 821961, 318966, 660930, 435415, 629100, 603114, 180733]
14705I04543k25564Q858J83330r9678m8161j10643k38990L51343M0904K99022
14695A064964j79873r2571j58345K57694J28716k56218l4119k77878P2164M09270
14685I33804l87462K42523J24481m6907r6890M7226q6559M1321J00531j83177
14675F88891P1746K89529l38288L68573M4267j89349N7725j38833j2072j6128
14665H26061K32796k1646j06987J02262l32847Q9554J88009k80316K17174J24892
14655A038952L6256r9589k06311N91996F13526N77110l22073J42056J9503l7365
14645I92757q9639J34823j38335m30166J084760j77379l77020K74041J27573k94473
14635A106942K03748l20741l9878k6437L46804K53973k18231j78090o922M1766
$$ y = [904543, 678979, 687837, 871167, 771489, 723328, 612685, 373695, 725038, 765942, 1064964, 885091, 792520, 634175, 891869, 1020585, 764367, 730248, 452370, 524534, 933804, 546342, 788865, 913346, 866439, 769549, 816775, 730216, 771537, 872068, 688891, 760637, 1050166, 711878, 1080451, 1124718, 935369, 993094, 854261, 842189, 826061, 1058857, 1037211, 930224, 1032486, 699639, 789193, 977202, 696886, 914060, 1038952, 1075208, 975619, 769308, 1361304, 613526, 1190636, 868563, 1010619, 1030122, 992757, 903118, 1037941, 899606, 469440, 1554200, 1376821, 999801, 1273842, 1401415, 1106942, 1310690, 989949, 950071, 923634, 1270438, 1524411, 1306180, 1128090, 1121168, 1162934]
14625A162934O4054L8872l7184L16859l34441n1887J77484O904q6062K03054l72238
14614A088349P5184L67439l54264K8335J48084L9753l9160K25578L8421M7769
14604A665488j65023J57409M2227l97786L58616j67141J63565p8777o9804J27326
14594A636100j45336K09715l05556K02065j70517J93067K02457o26146P03106
14585A898955l37838K31296j94288j46778L79141j30055J78285j06177J09816
14576A882357j71397j4265K77675k6583J21604j44207J86188K06553j11760K66354
14566B472519k2109l16766l0599N4467L13824k58299M27023j14091L11542N9061
14556B896572K43797J86755m2885N82035L61345P07294R21040J708099K707182
$$ y = [1162934, 1226988, 1265860, 1228676, 1545535, 1211094, 1159207, 1336691, 1343595, 1257533, 1460587, 1088349, 1163533, 1530972, 1176708, 1205043, 1353127, 1392880, 1353720, 1579298, 1617719, 1665488, 1500465, 1657874, 1700101, 1302315, 1660931, 1493790, 1657355, 1578578, 1508774, 1636100, 1490764, 1700479, 1394923, 1596988, 1426471, 1619538, 1821995, 1195849, 1898955, 1561117, 1792413, 1598125, 1451347, 1830488, 1700433, 1878718, 1772541, 1882357, 1710960, 1696695, 1974370, 1947787, 2069391, 1925184, 2111372, 2317925, 2206165, 2472519, 2450410, 2133644, 2103045, 2157512, 2471336, 2213037, 2640060, 2525969, 2837511, 2896572, 3140369, 3327124, 3284239, 3866274, 4227619, 4934913, 5855953, 7564052, 10271234]
14547A0271234O786341J7355463R852492B1579923H698763D294094j265285p90900
14539B237909L0421k64661l58134J64353P8708n1537L5152J91074J12366l95880
14529A779771O63047l62961q8260n5710J84384l26093O04716k22010L07584k80255
14519B204213j4584J89769n3519L23083k32289q2600K22496l53826J40499L01232
14509B644474j82646R0895l967q7422K11277k24392K37819J84510Q7794j76103
14499B782239j01330L25975k02041N25477j49084k49767K89603J9470p0596K2345
14489C192291J0344l604N7212K93523k41242j1020j9041K65741k48283K76848
14479C572769m6057O800K16395Q6401k79363K38972k77815K78381J45401j3776
$$ y = [10271234, 17057575, 34413038, 44265530, 21579923, 8698763, 4294094, 3028809, 2237909, 2268330, 2003669, 1645535, 1809888, 1888596, 1837059, 1872211, 2063285, 2175651, 1779771, 2442818, 2079857, 1991597, 1935887, 2120271, 1794178, 2398894, 2176884, 2484468, 2204213, 2189629, 2379398, 2325879, 2648962, 2416673, 2334073, 2556569, 2202743, 2343242, 2644474, 2461828, 2552723, 2548756, 2461334, 2672611, 2448219, 2686038, 2870548, 2958342, 2782239, 2680909, 3006884, 2804843, 3330320, 3181236, 2931469, 3221072, 3240542, 3169946, 3192291, 3202635, 3199031, 3256243, 3549766, 3308524, 3297504, 3278463, 3544204, 3295921, 3572769, 3526712, 3533512, 3749907, 3836308, 3556945, 3795917, 3518102, 3796483, 3941884, 3928108]
14469C928108L30791k32976J15876l56674M44662q8950K43563J8099J9624P19
14459D422842m7461K77673N1904j04789J8714p7526n6733L55167O3221J36716
14449E039728j58299M30606l03103n6896J64011K73876l68630L80720K04812N4846
14439E661671j33218R2269L95678j51617L91535j29353j93000L30840k13022N37538
14429F589321k4683Q8178m5009Q1590N30559M5142l45285N57764k06542l4045
14419G236990M14822l04703M51393k03331q3612L41084K33879J24971L49846n2814
14409H508525L2802J11588j7707K77703O6581M6873p29N17632n4161M49550j60151
14398I778506L53937K15908o4558L54880K48551J38301J04820K41393L65916O4199
$$ y = [3928108, 4258899, 4025923, 4141799, 3785125, 4229787, 4140837, 4384400, 4402499, 4422123, 4422842, 4375381, 4653054, 4704958, 4600169, 4618883, 4541357, 4484624, 4839791, 4903012, 5039728, 4881429, 5312035, 5008932, 4952036, 5116047, 5389923, 5021293, 5402013, 5606825, 5661671, 5528453, 5620722, 6016400, 5864783, 6256318, 6126965, 5933965, 6264805, 6051783, 6589321, 6564638, 6652816, 6607807, 6689397, 7219956, 7265098, 6919813, 7477577, 7271035, 7236990, 7651812, 7347109, 7798502, 7595171, 7511559, 7852643, 8086522, 8211493, 8561339, 8508525, 8541327, 8652915, 8635208, 8912911, 8979492, 9026365, 9025636, 9543268, 9489107, 9938657, 9778506, 10132443, 10348351, 10283793, 10638673, 10887224, 11025525, 11130345, 11371738, 11737654, 11801853]
14388A1801853N8994J71203J1693N43939K80692L1101N53815j33467K03414N2279
14378A3575516M30211M26065n4699Q06023j9101O77474J24885L25619J86856L94016
14368A6872865L38024L18658K68876M93476K60048M96367L33489L89157M22598
14359B0193558N48602M19328K99523O99289M54034P00800K59767P03156P92879
14350B5070936K86346P48351N98471N05581J095784K06276R51345N15789J210935
14341C1189814Q38852R29972P02081J276454N93551J317460J066838J131059Q80383
14332C9926464J462479J296935J108922J273967J324298J632862J701097J821404
14324E1548428J763707J781569J848096K064706J927345K414375K325223K221614
$$ y = [11801853, 11860847, 12032050, 12043743, 12587682, 12868374, 12899475, 13453290, 13319823, 13523237, 13575516, 14005727, 14431792, 14377093, 15183116, 15164015, 15841489, 15966374, 16291993, 16478849, 16872865, 17210889, 17529547, 17798423, 18291899, 18551947, 19048314, 19381803, 19770960, 20193558, 20742160, 21161488, 21461011, 22160300, 22614334, 23315134, 23574901, 24278057, 25070936, 25357282, 26105633, 26704104, 27209685, 28305469, 28511745, 29463090, 29978879, 31189814, 32028666, 32958638, 33660719, 34937173, 35530724, 36848184, 37915022, 39046081, 39926464, 41388943, 42685878, 43794800, 45068767, 46393065, 48025927, 49727024, 51548428, 53312135, 55093704, 56941800, 59006506, 60933851, 63348226, 65673449, 67895063]
14316F7895063K748183K571088K589732L326603L427135L306653L265001L920982
14308I3050440L773533M566141M482143M778933N484036M657031N753426O225732
14300A32771415O065371P288266O680647P410094Q201489Q724560R144882R506460
14292A95793184J0089532J0917015J1138661J1842877J2317271J2860320J3565236
14285B78524096J3887019J4378345J4769281J5006418J4502350J4971363J3860446
14278C79899318J3711865J2691750J1265764J0203711R078463P322573N728748
14271D49902192M301672K138955M49974j826884l948338o176744q601021j0591045
14263D25648761j2139130j3800759j4698976j5239333j5965781j5727073j5473480
$$ y = [67895063, 70643246, 73214334, 75804066, 79130669, 82557804, 85864457, 89129458, 93050440, 96823973, 101390114, 105872257, 110651190, 116135226, 120792257, 126545683, 132771415, 138836786, 146125052, 152805699, 160215793, 168417282, 177141842, 186286724, 195793184, 205882716, 216799731, 227938392, 239781269, 252098540, 264958860, 278524096, 292411115, 306789460, 321558741, 336565159, 351067509, 366038872, 379899318, 393611183, 406302933, 417568697, 427772408, 436850871, 444173444, 449902192, 454203864, 456342819, 456792793, 454965909, 451017571, 444840827, 436239806, 425648761, 413509631, 399708872, 385009896, 369770563, 353804782, 338077709, 322604229]
14256C22604229j4896483j4963642j4176687j3952697j3318659j2506824j2335786
14249B26453451j1364247j0881693r929707r683664r152627p978681p955838p755065
14241A51751929p326895o615410o291459n671080n601543n246685n024198m524048
14233A05450611m510216m129323l492747l626815l971268l478802k893949l170160
14225G6177331l019141k722234k535850k339514k388471j733935k153108k340572
14217E6944506j817887j517892j854732j383046j354542j561473j867049j253330
14209D4334555j589461j164715o04993j242960j081120j301697p36485j444153
14201C5168971p62543l58864j189484j009232q83579p00226q41042o57561p76265
$$ y = [322604229, 307707746, 292744104, 278567417, 264614720, 251296061, 238789237, 226453451, 215089204, 204207511, 194277804, 184594140, 175441513, 167462832, 159506994, 151751929, 144425034, 137809624, 131518165, 125847085, 120245542, 114998857, 109974659, 105450611, 100940395, 96811072, 93318325, 89691510, 85720242, 82241440, 79347491, 76177331, 73158190, 70435956, 67900106, 65560592, 63172121, 61438186, 59285078, 56944506, 55126619, 53608727, 51753995, 50370949, 49016407, 47454934, 45587885, 44334555, 42745094, 41580379, 40975386, 39732426, 38651306, 37349609, 36613124, 35168971, 34406428, 34047564, 32858080, 31848848, 30965269, 30265043, 29424001, 28766440, 27990175]
14192B7990175p88517l06664r74064p32831n44474m07766m60316m68273j068997
14183B2238273n0637p65922l41399m97521k32643q57065L799m42773l30565m45202
14173A8278345j26795n33328m95586l71385l25061k90618l77086r9720k29706
14164A5429060j92191m16319l00059j28853k63600n83594r0358o0901l78704l35536
14154A2678945P759k54390l92688o8061l69282m69341M26534k67477l04020j46385
14144A0841594k12173j09517J24241o99288J68575k2467o39254L00232l00015
14135I451928k70154l57741K13512j83418j17874j10004r5323L23131o87704J96701
14125H363054l50856k04336l91553K59071j22346j54030L04367j55961n88936
$$ y = [27990175, 27201658, 26894994, 25920930, 25188099, 24643625, 24235859, 23775543, 23307270, 22238273, 22187636, 21421714, 21080315, 20582794, 20350151, 19493086, 19496885, 19054112, 18723547, 18278345, 18151550, 17618222, 17122636, 16751251, 16426190, 16135572, 15758486, 15658766, 15429060, 15236869, 14820550, 14520491, 14391638, 14128038, 13544444, 13454086, 13393185, 13014481, 12678945, 12686704, 12432314, 12039626, 11971565, 11602283, 11132942, 11559476, 11291999, 10987979, 10841594, 10629421, 10519904, 10644145, 9944857, 10113432, 10090965, 9451711, 9751943, 9451928, 9181774, 8824033, 9037545, 8854127, 8736253, 8626249, 8530926, 8854057, 8166353, 8363054, 8012198, 7807862, 7416309, 7675380, 7553034, 7399004, 7703371, 7547410, 6958474]
14116F958474L02498j64439J78472k04915J61112l52229n35010K03574j34518
14107F413019J81016j37206l56983M2598j98107R4370k51332K52553j66849q6956
14097E786123J49166l34013J47335m08052j52963J12777K05202R1341l63701k50198
14087D983017M451O031J49717k30456K76817k79662j73581N9038Q3477l45408
14077D533441L34760n03755L5561N2369J15985k82322j04509J96661m4167r4131
14067D239893j13681R0352k46737k02157K85821l45324J91971L8007m7426j84837
14057C705882J63703m4631Q1314k08083J14156k42789j62808K91947j34021r9551
14047C465119j21925J98754j99505J9827p3149p7058p3542l29463N65209j82108
$$ y = [6958474, 7260972, 7096533, 7275005, 7070090, 7231202, 6878973, 6343963, 6547537, 6413019, 6594035, 6456829, 6099846, 6142444, 5944337, 6038707, 5787375, 6039928, 5873079, 5786123, 5935289, 5601276, 5748611, 5340559, 5187596, 5300373, 5505575, 5596916, 5233215, 4983017, 4987468, 4993499, 5143216, 4912760, 5189577, 4909915, 4736334, 4795372, 4878849, 4533441, 4868201, 4364446, 4400007, 4452376, 4568361, 4286039, 4181530, 4378191, 4334024, 4239893, 4126212, 4216564, 3969827, 3767670, 4053491, 3708167, 3900138, 3938145, 3890719, 3705882, 3869585, 3824954, 3906268, 3698185, 3812341, 3569552, 3406744, 3698691, 3564670, 3465119, 3343194, 3541948, 3342443, 3362270, 3289121, 3212063, 3138521, 2809058, 3374267, 3192159]
14037C192159k25061j8067Q4056k70O2398N3147n29646L39870j07200J0825r3148
14026B769063M653J07996k93984J05774M487j81597J19130O787m1596K2139j37098
14015B485754k4752K54278n70643j27172M85478K3293k33257o8934K26191k6359
14005B423877J11147m57615m1133J75337J82747r4096k50611J36308r3296l1808
13995B060857L70999j72319p7851M74456q8359M78205J271966J646019N116312
13986A1080285J5618805J8253917j7681592j3337957n828970j738953j517296
13979D848239p74435p08895k73302N51067p34795K9907l88127R0960q1464j20417
13969B438738J09595j78334J98336k90565L3248k17840j72242L91982p9945J18673
$$ y = [3192159, 2967098, 2949031, 3033087, 3032817, 3095215, 3148362, 2618716, 2958586, 2851386, 2862211, 2769063, 2773716, 2881712, 2587728, 2693502, 2697989, 2516392, 2635522, 2642309, 2600713, 2622852, 2485754, 2461002, 2715280, 2144637, 2017465, 2502943, 2526236, 2292979, 2224045, 2450236, 2423877, 2535024, 2077409, 2036276, 2211613, 2394360, 2300264, 2049653, 2185961, 2092665, 2060857, 2431856, 2259537, 2181686, 2656142, 2567783, 3045988, 4317954, 5963973, 11080285, 26699090, 44953007, 27271415, 13933458, 8104488, 6365535, 4848239, 4073804, 3364909, 3091607, 3642674, 2907879, 2937786, 2549659, 2640619, 2559155, 2438738, 2548333, 2369999, 2568335, 2277770, 2311018, 2093178, 1920936, 2312918, 2232973, 2351646]
13959B351646n4996n31343l2289j58697M90619m61619K74869M3745o995J71439
13949B086379o74644N53142j12152k07578O8598J51050n0335l6074j25404K9408
13939A682390O4909k95267j13716L13253Q4344N9478j23427L5940j72462r0710
13929A444732n0290K37894j04252K26361l41454J52296N9933o4054j7981K26990
13919A770175m32888M3395L42369k34897K68688j35019L5559j29099J30319k15445
13909A443157k04040L4191M04426m06245j98084J16195K16036j28896K45978q4786
13899A437932q011k37036j11363K33324k35652L15464K016l48776P6806n3090
13889A071614L62180j6613M1978j26864L8053j66359K41836k07701j03827J05691
$$ y = [2351646, 2296650, 1765307, 1733018, 1574321, 2064940, 1603321, 1878190, 1921935, 1914940, 2086379, 1411735, 1964877, 1852725, 1645147, 1713745, 1864795, 1814460, 1778386, 1652982, 1682390, 1747299, 1452032, 1338316, 1651569, 1735913, 1795391, 1671964, 1707904, 1535442, 1444732, 1394442, 1632336, 1528084, 1754445, 1412991, 1565287, 1625220, 1561166, 1543185, 1770175, 1337287, 1380682, 1723051, 1488154, 1756842, 1621823, 1657382, 1528283, 1658602, 1443157, 1239117, 1273308, 1677734, 1271489, 1073405, 1189600, 1405636, 1276740, 1522718, 1437932, 1429921, 1192885, 1081522, 1314846, 1079194, 1394658, 1396674, 1047898, 1124704, 1071614, 1433794, 1417181, 1459159, 1332295, 1370348, 1203989, 1445825, 1238124, 1134297, 1239988]
13879A239988l22096L24498q8199K16643m44282R1937L3131j09873K904K39922
13869A184573j18723l07603K75924P2476k2869j05857j97286K57178j65525J9290
13859H91578J97372L6713j61172J9580r4327r533N9736J19364R4548k01710m08292
13848E43857O21074l29374k15570M05315J8178j85513p6298L40828L1149m25420
13838G28226J99103J13801P2596k57591Q8986l03649J53479R5253M6743K59105
13828A196052l37619n0035m8588J52586l726q4445J6846K15300k27344K97291
13818A126318m99776L56479j29668P0894j17375L0840j08935k0778M31603k35948
13808I03654J62855k97951L80600m37145k3733M45415m15235K7957K31105m51605
$$ y = [1239988, 917892, 1242390, 1154191, 1370834, 926552, 1018489, 1051620, 941747, 944651, 1184573, 1065850, 758247, 1034171, 1106647, 1083778, 977921, 780635, 1037813, 872288, 891578, 1088950, 1125663, 964491, 984071, 889744, 880211, 939947, 1059311, 1153859, 952149, 543857, 1164931, 835557, 619987, 1025302, 1043480, 857967, 781669, 1122497, 1153646, 728226, 927329, 1041130, 1113726, 856135, 945121, 641472, 794951, 890204, 936947, 1196052, 858433, 808398, 759810, 912396, 908670, 824225, 841071, 1056371, 829027, 1126318, 626542, 983021, 853353, 924247, 806872, 837712, 728777, 707999, 1139602, 903654, 1066509, 768558, 1149158, 712013, 688280, 1133695, 718460, 746417, 977522, 525917]
13798E25917L14296k9730K27857m70016J02623p8711q9222N24228k26724j0382
13788G90136k72586K578K62644q9948r673j9464m0774L34559p0444j2348k04337
13777F70343R5299O2005n7553j83027k73721P3429L22783q040J8090j90731l0673
13766D98204K41468r2236J22959l83955J57832j25937J41307O32j29051P11166
13756A142389m71898J26613J895j34257R3064m011M4252q3092p4047P1260L244
13745G15412j38393J03720J52514k85166K21055l72450J43497L09379l57435l8365
13735D53768J70374j44618k999L23365n3465C62766K20375k48230L30145k42306
13725D22750L87890B25173N14305j35827j1152k16381N7876O5886J9834j73709
$$ y = [525917, 840213, 810483, 1038340, 568324, 670947, 592236, 503014, 1027242, 800518, 790136, 517550, 520128, 782772, 692824, 683151, 663687, 622913, 957472, 887028, 874680, 670343, 765642, 827647, 770094, 587067, 313346, 386775, 709558, 701518, 719608, 528877, 498204, 739672, 647436, 770395, 386440, 544272, 418335, 559642, 560274, 431223, 1142389, 670491, 797104, 798999, 664742, 757806, 753795, 798047, 714955, 640908, 712168, 715412, 577019, 680739, 833253, 548087, 769142, 396692, 540189, 849568, 492133, 453768, 624142, 479524, 476525, 799890, 746425, 362766, 583141, 334911, 665056, 422750, 810640, 225173, 739478, 603651, 592499, 376118, 433994, 499880, 519714, 346005]
13715C46005J3485q2065L45856C03193J59486R7046j13802J76707B19891M30852
13705F50743j94630J524K99799j62706j8642k57006M98969l52201N2187O7612
13695E85649j45206j228M8545Q936J03245j38240L87102l29272J5827p606R3393
13684F21145m6113L7916B31164M6611J99401j69213J5079K55935k59569L62074
13674F81482j61569j85734L05741j66802l1557J88509C04182K23726j78591L20046
13664F69363k2717O3994B37212J58387l5846K26827A14346M18842M6538j97055
13654C82671A71710N38284p6128B21744K37513M02854j89190k17809j54831K2404
13644C22685J9238K59053Q8296B24737P528J59440r8845r861J83147j09644O6812
$$ y = [346005, 359490, 277425, 623281, 303193, 462679, 559725, 445923, 622630, 219891, 650743, 456113, 457637, 757436, 594730, 576088, 319082, 818051, 465850, 518037, 585649, 440443, 439215, 487760, 496696, 599941, 461701, 848803, 519531, 535358, 527752, 621145, 575032, 612948, 231164, 277775, 477176, 307963, 323042, 578977, 319408, 681482, 519913, 334179, 639920, 473118, 441561, 630070, 304182, 527908, 349317, 669363, 646646, 710640, 237212, 395599, 359753, 586580, 114346, 533188, 579726, 382671, 171710, 709994, 633866, 221744, 459257, 862111, 672921, 455112, 300281, 322685, 341923, 600976, 689272, 224737, 232265, 391705, 292860, 282999, 466146, 356502, 423314]
13633D23314K0479r1317L70930k19798E2140N04314j88281j3113N459l5561J81307
13622E06265j61677m9360O7167K95146l08267R8621j31164A43967K93057J6950
13612D53974p0470j09112n5896M70145k71139j04163K2041J45107j5340j74693
13602B90454K10426A81812L40205R451A49039L54526j32087Q4917J05045H1573
13591C75034j75848L63428r5900A96428J5145L24264m0041j7963k14558J35619
13581C98894N5035J4519j26565j16661p8Q3210K25232k44311j43079L46968j78721
13570C14443J28351A89139J51160m7002J73116m3857j73274H745K95041K01296
13560E05082B29236n9144L60268j52514J60323j22645E0909J60313J09762j03457
$$ y = [423314, 443793, 352476, 723406, 503608, 52140, 556454, 368173, 355060, 360519, 324958, 506265, 344588, 295228, 362395, 657541, 349274, 447895, 316731, 143967, 437024, 453974, 383504, 274392, 218496, 688641, 417502, 313339, 335380, 480487, 465147, 290454, 500880, 181812, 522017, 531468, 149039, 503565, 371478, 456395, 561440, 81573, 375034, 199186, 562614, 466714, 196428, 211573, 535837, 495796, 477833, 263275, 398894, 453929, 468448, 341883, 225222, 225144, 308354, 533586, 289275, 146196, 493164, 314443, 442794, 189139, 340299, 293297, 466413, 422556, 249282, 8745, 303786, 505082, 229236, 170092, 530360, 377846, 538169, 415524, 50909, 211222, 320984, 217527]
13550B17527J6834R5031K01221j24535j01804r2263F8373K68965J46863P4990
13540E59191k60244J90717E571N6703J33079J86746J65368j59644j67231q9545
13530A31047L9587k1424F2763M42219M0462A55043O9940J58209l530l0395j3947
13519C35320l2603o7474G5563K73345j16655K08497A84594K82821F5997M87273
13509E53270k42936A10574J210N3365J66522j46321L48216B47411j08419L15490
13499D54482l5747J0009J9918B14328c03622B75842J82256q5377j4933J3739l2940
13488C38587L7049j37094p6957N8740m3896J76695K48934A85460J17309J60995
13478D63764B17078L0848E8861M20128D4896J90788C7462J58039a764B47334K99595
$$ y = [217527, 234361, 329392, 530613, 406078, 304274, 212011, 68373, 337338, 484201, 559191, 298947, 489664, 5571, 62274, 195353, 382099, 547467, 387823, 220592, 131047, 170634, 149210, 62763, 504982, 545444, 155043, 224983, 383192, 379662, 349267, 335320, 302717, 235243, 75563, 348908, 232253, 440750, 184594, 467415, 65997, 553270, 310334, 110574, 111784, 165149, 331671, 185350, 533566, 247411, 138992, 454482, 418735, 428744, 448662, 214328, -303622, 275842, 458098, 372721, 357788, 371527, 338587, 375636, 238542, 161585, 220325, 176429, 353124, 602058, 185460, 302769, 463764, 217078, 247926, 58861, 478989, 44896, 235684, 37462, 195501, -1764, 247334, 546929]
13467E46929k62959A26253J76816L8696A35804K09124A49481J55799n4931j02337
13457A48012p0623J05966o7497K01693j5270A19031a38587A04751K2843K84907
13447D12501r2828j19196J71019c6970A17553K3350J35902n2539j0340J05552
13437C19478J12130A59958n8596M3614A9114L39373I3444h3230E5802g5260C04273
13425B80110k2029B814K82448J47767g3175B90570l0498m1512o9534L9095q4227
13414A03894L03917G3092J40276L2343J08550j38772K38936o5488j23846Q3243
13404C48334j46711J77456j38522m9376L613E651J57791J74679A19760K10631
13394C30391A38544D3567K69876N5468F2567J07528J5468m5877M1451J64802i4826
$$ y = [546929, 283970, 126253, 303069, 341765, 135804, 344928, 149481, 305280, 250349, 148012, 77389, 183355, 115858, 317551, 302281, 119031, -138587, 104751, 127594, 412501, 319673, 200477, 371496, -36970, 117553, 140903, 276805, 224266, 213926, 319478, 431608, 159958, 101362, 144976, 19114, 358487, 93444, -83230, 55802, -75260, 304273, 280110, 258081, 2814, 285262, 433029, -73175, 290570, 260072, 218560, 149026, 188121, 103894, 407811, 73092, 213368, 245711, 354261, 215489, 454425, 388937, 265091, 348334, 201623, 379079, 240557, 191181, 194794, 5651, 163442, 338121, 119760, 330391, 138544, 43567, 313443, 368911, 62567, 170095, 185563, 139686, 181137, 345939, -94826]
13382B04291l0387J81752E5437b3347A40089l2637M77653j86841C7995J61887
13372A99882J86350j58151D4725N9719J27725K53877A68457J43542o7671j0297
13362B34031e2938n440A05124J45025M1777D2819J9205O4715J16000K8581j28112
13351A43208n3229J29623a88086G0602M78570k01173n0063r5552L79190O764j4180
13340E74158A99925K06460D3256L80483j46449n3462J80461A48381O8175j02876
13330A13680m9807J98709I5531a8801C52639a05877J6664B73646r7960m9922J42949
13319B68713l035G4408J34645H3061R5685C4163B184J01468J52453c5794B22304
13307C10616q7121M76228k94800l8220I8089a9572B20123c3314B15971I8578O0426
$$ y = [204291, 173904, 355656, 55437, -23347, 140089, 107452, 585105, 398264, 37995, 199882, 386232, 228081, 44725, 104444, 232169, 486046, 168457, 311999, 244328, 234031, -52938, -58378, 105124, 250149, 291926, 42819, 62024, 126739, 242739, 271320, 143208, 89979, 219602, -188086, 70602, 549172, 347999, 297936, 202384, 581574, 588338, 574158, 199925, 406385, 43256, 423739, 277290, 223828, 404289, 148381, 216556, 113680, 63873, 262582, 95531, -18801, 352639, -105877, -89213, 273646, 175686, 125764, 268713, 265678, 74408, 209053, 83061, 178746, 34163, 2184, 103652, 256105, -35794, 222304, 310616, 223495, 699723, 404923, 366703, 98089, -19572, 220123, -33314, 215971, 98578, 159004]
13296A59004C660f9683F780K24787l5770Q3230A9462b7421n3468B74948a04173
13284h8168M2943j77146A0859K97853h84p0905A82447l9560F166M59949A61259
13272C24665F3715J86774p7652D2620L11664l9061C1992K05760j0286p2217l3097
13261A22152a623m1711A05481R1276F155J71224J28793o1351p5374o2596a75334
13249B32902L56042B79792M7537i0936a7394C33643J83724g6433C35113G403R4858
13238A02261A7560J61876M04507i0279F53203a91514A77622m9996P7604J64022
13228C69252a86698C31512f0348B9253O7086L09204r6736d3094A53511E9617a77629
13216E835L83751A70303c52795D11571b3383n7995j99137A81174D2032J59996
$$ y = [159004, 3660, -69683, 6780, 231567, 195797, 279027, 19462, -27421, -80889, 274948, -104173, -88168, -45225, -222371, 10859, 308712, -884, -71789, 182447, 142887, 6166, 466115, 161259, 324665, 63715, 250489, 172837, 42620, 354284, 315223, 31992, 237752, 227466, 155249, 122152, -1623, -43334, 105481, 196757, 6155, 177379, 306172, 244821, 169447, 106851, -175334, 232902, 588944, 279792, 327329, -90936, -17394, 333643, 517367, -76433, 335113, 7403, 102261, 17560, 179436, 583943, -90279, 653203, -191514, 177622, 127626, 205230, 369252, -186698, 331512, -60348, 29253, 96339, 405543, 308807, -43094, 153511, 59617, -177629, 5835, 389586, 170303, -352795, 411571, -23383, -81378, -280515, 181174, 42032, 202028]
13206B02028a20883A74084c1218l13458A10022P1200I0012j3305K62906q2191
13196B57422A00112h2905b1461B52339C5182K37256b03845A14103O8702L8200
13186B21005n7741a26723B19195D7464R8624J51023H8828Q603C2398N5261B965
13174F6345h8777A15726J91711A07049L36638b6235A84802c8272l8965A14237
13163A43361n7503D1206R0291J68261b56603B76245A11768A1895K36086J8596
13153B66577a30199m6660B45997m1071L1366i737k2405G9924d07678A72608F8833
13141d1369B53556n0635q1447K3766K4155l4374g5207A35612a6671j31065A96440
13129a7330B11342h9040A97575a64313I1351R4673a25371B3438J41787m2482D3200
$$ y = [202028, -120883, 174084, -31218, -344676, 110022, 181222, 90012, 76707, 339613, 257422, 100112, -82905, -21461, 252339, 35182, 272438, -203845, 114103, 182805, 221005, 163264, -126723, 219195, 47464, 146088, 297111, 88828, 97431, 32398, 87659, 2965, 66345, -88777, 115726, 307437, 107049, 443687, -26235, 184802, -38272, -77237, 114237, 143361, 85858, 41206, 131497, 299758, -256603, 276245, 111768, 11895, 247981, 266577, -130199, -176859, 245997, 204926, 236292, -9737, -32142, 79924, -407678, 172608, 68833, -41369, 253556, 202921, 121474, 145240, 169395, 135021, -75207, 135612, -16671, -147736, 196440, -17330, 211342, -89040, 197575, -164313, 91351, 186024, -125371, 23438, 165225, 122743, 43200]
13117G701R8862b21759B98143b40020E722J27659d7922A47940D5123b6073E72724
13105G7263k5355J6338C2665O5820o862O0405J41675b35887d4799A65344p0987
13094I4357P5737l8950a45706H5940p415M0192D0583L97855a56804F6610b32080
13082B0242R4266J42001b28254I9272J42750A17909c8118C34291I4566J68136
13072B62702E2636j0572K13487a2338l1419A67774c1951B07612m9365o8827l3861
13061E5559L42217B8537N8337i3164A20959D8915L03622j47205a77267B46247
13050f2828F5317K58339n9333E838P2939a8728k76667I9506m2922N565b7789B50209
13037B71368b07260A46603a16413C26611b0827j82404H9783K52219A33962K31328
$$ y = [7701, 106563, -221759, 298143, -240020, 5722, 133381, -47922, 147940, 45123, -26073, 572724, 77263, 51908, 68246, 32665, 98485, 91623, 152028, 293703, -235887, -44799, 165344, 94357, 170094, 131144, -145706, 85940, 78525, 118717, 40583, 438438, -156804, 66610, -232080, 20242, 114508, 256509, -228254, 99272, 242022, 117909, -38118, 334291, 94566, 262702, 52636, 42064, 255551, -12338, -43757, 167774, -31951, 207612, 158247, 89420, 55559, 397776, 28537, 86874, -93164, 120959, 48915, 352537, 205332, -177267, 246247, -62828, 65317, 323656, 264323, 5838, 78777, -18728, -295395, 99506, 56584, 62149, -27789, 250209, 271368, -207260, 146603, -116413, 326611, -20827, -203231, 89783, 342002, 133962, 365290]
13027C65290a9703A40989h1599q1488B24878J13233h744r9340I84J80567F4764
13015C36564a4630M433A08212N7356J12219a42743B49594J4714i9632A72081p8417
13004I3664M5957b66526B24413A7998a00067I7738J77106K471A1240J64073J0516
12993A85829N7360A10275a96252o335h7329B50550F2960J95665p7330C4864J4395
12982D9259a20343D3285K82816g6364D8997Q8618o598K63075b7524D22899a42169
12970a92092E49308j38041d8892j0537I3898J50429a88269O2269d6003A61510
12959C07663G9948P8976b3915j60708A80677g6230A36206H997b98910E9003a99522
12947B12014J44568A26054F2402K39343A38017h7089A33549j2603a69475H5702
$$ y = [365290, -19703, 140989, -81599, -163087, 224878, 338111, -8744, -108084, 984, 181551, 64764, 336564, -14630, -10197, 108212, 165568, 277787, -142743, 249594, 264308, -99632, 172081, 93664, 139621, -266526, 224413, 17998, -100067, 97738, 274844, 277315, 11240, 175313, 185829, 243189, 110275, -196252, -202587, -87329, 250550, 62960, 258625, 181295, 34864, 49259, -120343, 43285, 326101, -76364, 48997, 137615, 131017, 394092, -27524, 422899, -142169, -192092, 549308, 411267, -48892, -59429, 93898, 244327, -188269, -126000, -46003, 161510, 307663, 79948, 158924, -23915, -184623, 180677, -76230, 136206, 8997, -298910, 59003, -199522, 212014, 356582, 126054, 62402, 301745, 138017, -87089, 133549, 120946, -169475, 85702]
12936a46290L3152B8876L4781b4469C12271f1451j72611i8855A91271R6103C1213
12924g2546H7949b01972P3891o301A77467i1578A37802b34331N3996C46963D5216
12912A38579k1381n1041d5901C31714K64342A28504m1555K7840J51349G4880J40494
12901B15374O6498b04658C35175d1182C1644J63260J15626A31610i365H8447L35599
12890D24046a28235B65848b1659F2880L87113H1943f8763j9424B23034e7428B9875
12878B20970H4125m1593g612k5650j31351e8725j31055l739e1197j02830A028
12866B21097N9911a52020I2218J55121E4863Q7596h2461C16758N9273a4174k07261
12855b21435B898J35516a42905H3544L7641L8027m4427F513J08572J32374e8269
$$ y = [-146290, -113138, 28876, 63657, -24469, 312271, -61451, -234062, -98855, 191271, 287374, 31213, -72546, 87949, -201972, -128081, -134382, 177467, -91578, 137802, -234331, -180335, 346963, 45216, 138579, 117198, 66157, -45901, 331714, 596056, 128504, 86949, 114789, 266138, 74880, 215374, 281872, -204658, 335175, -41182, 31644, 194904, 310530, 131610, -9365, 88447, 424046, -128235, 265848, -21659, 62880, 449993, 81943, -68763, -88187, 223034, -57428, 29875, 220970, 84125, 42532, -7612, -33262, -164613, -58725, -189780, -193519, -51197, -154027, 1028, 221097, 281008, -152020, 92218, 247339, 54863, 142459, -82461, 316758, 376031, -14174, -221435, 2898, 138414, -142905, 83544, 121185, 159212, 114785, 6513, 115085, 247459, -58269]
12843F3361J04648M63L0419D8168O6824k0782K86999F339K00836a32453G8279
12831B94057a16168r0686F2358r221K61105C7877L66927j36983G2856K29904K02315
12820E05075e7435B59063I0526g5970l4344C96338a0458n8680A48128a80413E8557
12808A47793b37094A25635J571a15580a0355p7160B14263a47091N4672p2288A39652
12796d5879E7910j0314N0980K68416c1892k08402H9524J63895a15499c24A50373
12784h4191A07284f4776b1567B00521j7224n5154e2784k27456B21050b1877A24578
12772A1649i748C73595b88428a42835b6818k677k5264j86003D6678P7961K52070
12761C76709A23496Q0610b15475i9005d5730k14888b8591F8812M1492b37948p9170
$$ y = [63361, 168009, 168472, 198891, 48168, 114992, 94210, 381209, 6339, 207175, -132453, 78279, 294057, -116168, -206854, 62358, 53137, 314242, 37877, 404804, 267821, 72856, 302760, 505075, -57435, 259063, 90526, -75970, -110314, 396338, -10458, -69138, 148128, -180413, 58557, 147793, -237094, 125635, 127206, -115580, -10355, -87515, 214263, -147091, -92419, -164707, 139652, -45879, 57910, 47596, 98576, 366992, -31892, -240294, 89524, 253419, -115499, -324, 150373, -84191, 107284, -64776, -21567, 200521, 183297, 128143, -52784, -280240, 221050, -21877, 124578, 11649, -9748, 373595, -288428, -142835, -26818, -29495, -54759, -240762, 46678, 124639, 376709, 123496, 204106, -215475, -99005, -45730, -260618, -28591, 68812, 110304, -237948, -317118]
12750c17118N3272E2565a20508j8074a8617A53990m253m0475K22743A40127P302
12739A47429m4177J5117l4097k7121Q8299J02971a46777A85421P825b43224B3475
12727C01967i1757G6567O5162J46953G1854K54418o6558G0639J01016J69119Q2280
12716D23054a62645F720J30894a590k05353A85768d0279m1255l5492A74694K85826
12705D60520B24508i9443B42937Q3990b72261f9891A06760k2258Q0161b01517
12694E7428J9134b2263B28607i8807C22906b35333A37814a53446D3244L88711
12684D31955a20373N2061A86115i386A88825L5705B8467p56K19260L67168k13344
12673D00795A50276k4247a64403f8844B10363b02776B39607k657b72627A61587
$$ y = [-317118, -263846, 52565, -120508, -138582, -18617, 153990, 149737, 109262, 332005, 140127, 147429, 103252, 118369, 84272, 57151, 145450, 248421, -146777, 185421, 193246, -243224, 23475, 301967, -91757, 76567, 141729, 288682, 71854, 326272, 259714, 70639, 171655, 340774, 423054, -162645, 6720, 137614, -1590, -206943, 185768, -40279, -81534, -117026, 174694, 460520, 224508, -99443, 242937, 326927, -272261, -69891, 106760, 84502, 164663, -201517, 57428, 76562, -22263, 228607, -98807, 322906, -235333, 137814, -153446, 43244, 431955, -120373, -68312, 186115, -9386, 188825, 224530, 28467, 27711, 246971, 614139, 400795, 150276, 126029, -164403, -68844, 210363, -202776, 239607, 236950, -272627, 161587]
12662a16138n4344f2340G6962A4668J4243K76573M2111m5052a72405C61578D8912
12650b9040B19033k2623a89406B02155a1053a096B14363b5437j30719A88787a37504
12638i7174j89994A49972K99849B02466n4044I267K04214m6305M9374h8269B42894
12626A84175p6804M8441J71603J73180e1076H4198C8345K34427f0736m0j80263
12615b41039A03453K1953J43095I3351b65317B6703i3370q2892G4153k0014K45266
12604B99405p1789N2494I9022a645j09489A89137b3862k3864J8095A86747l8980
12593A47767B6300L7430q368J23387n37b70360j79837A15552E0967J82006a29717
12581a681G7488I505b1197A98948r2907G557K06232E5469a33151j00203A6376
$$ y = [-116138, -170482, -62340, 76962, 14668, 28911, 305484, 347595, 302543, -172405, 361578, 48912, -29040, 219033, 196410, -189406, 202155, -11053, -1096, 214363, -25437, -156156, 188787, -137504, -97174, -287168, 149972, 449821, 202466, 148422, 9267, 213481, 167176, 216550, -88269, 242894, 184175, 107371, 155812, 327415, 500595, -51076, 84198, 38345, 272772, -60736, -60776, -241039, 103453, 125406, 268501, 93351, -265317, 26703, -93370, -176262, 74153, 54139, 299405, 227616, 280110, 99022, -1645, -111134, 189137, -23862, -47726, -29631, 186747, 147767, 26300, 63730, 55362, 178749, 178212, -270360, -450197, 115552, 50967, 232973, -129717, -1681, 77488, 9505, -21197, 198948, 106041, 7557, 213789, 55469, -133151, -233354, 16376]
12569a60274E3400M6176c0675A47666P9808g7712B39689a44492N0610l1184a1081
12557A4232J77595a45872P205B03930d84854i0961H990J43500l0004f0074B236
12545A9252J55228i2375I692h649j33645A69024H711g8147B1622J84202E0980
12533c38885B9501L71620j94836g6172j3088l4546j47197O3317q4734C35633A64307
12521a8416C79985j23874G1963h4357A22848D4732K43478A18374B6149L433j1104
12510A8478O3046j2339m176J78831k2130I1396a40018k55017A29883E6472j8272
12499C8200d991k35209Q8389P4257B67322c26526A48488c00757B19635m3198F507
12487b19220I9472k297a43225C30061b8615k4626B56114B7048J96969a82499A33924
$$ y = [-160274, 53400, 99576, -30675, 147666, 227474, -77712, 239689, -144492, -93882, -125066, -11081, 14232, 191827, -145872, -138667, 203930, -484854, -90961, 8990, 152490, 122486, -60074, 2236, 19252, 174480, -92375, 9692, -8649, -142294, 169024, 8711, -78147, 21622, 205824, 50980, -338885, 29501, 401121, 206285, -76172, -89260, -123806, -271003, -207686, -292420, 335633, 164307, -18416, 379985, 256111, 71963, -84357, 122848, 44732, 288210, 118374, 26149, 29582, 18478, 81524, 69185, 65009, 243840, 221710, 91396, -140018, -395035, 129883, 56472, 38200, -4991, -240200, -151811, -77554, 267322, -326526, 148488, -300757, 219635, 176437, 6507, -219220, 99472, 97175, -143225, 330061, -28615, -53241, 256114, 27048, 224017, -182499, 133924]
12475B8837b55111A98743N6063e5215k25444N8041C81583b4415j47046A30222
12464a00111Q576F2725B3771N9490A192a10389C6831g0153n4098O144J1062p97
12452a07842j23997C119h6984A01850f8443m5777B7926L08499A94K43261F1182
12440i5894I6048a21950D5141J34866E8050B1211b7964O852C61993A11564J84925
12429B96489A01116b19455A41737a31747M8768B7627i017q6872d4294E0721m190
12418D6531K6500J46072P9316l9066c01015B90744A33330J71974f4287C72373
12407e8042H0526K71174G6730J10003a17n7458l53797B58059d5591j00322D2533
12395i1332A8118i8828j4332J823j57069B3337d3292C87969C929K93372b21316
$$ y = [28837, -255111, 198743, 254806, -55215, -280659, -222618, 381583, -24415, -171461, 130222, -100111, -91535, 62725, 23771, 83261, 1192, -110389, 36831, -70153, -124251, -118107, -107045, -107842, -231839, 3119, -86984, 101850, -68443, -114220, 27926, 336425, 194, 243455, 61182, -95894, 96048, -121950, 45141, 180007, 58050, 21211, -27964, -21112, 361993, 111564, 296489, 101116, -219455, 141737, -131747, -82979, 27627, -9017, -95889, -44294, 50721, 46531, 73031, 219103, 298419, 259353, -301015, 290744, 133330, 305304, -64287, 372373, -58042, 80526, 351700, 76730, 186733, -117, -57575, -411372, 258059, -45591, -145913, 42533, -91332, 18118, -98828, -113160, -111337, -268406, 23337, -43292, 387969, 3929, 297301, -221316]
12383E635P1839a14690j61555c2321q497o3495j95738e4709k05841H1324b75873
12371I8417m333c48539e7067a6673B02668e7385k43841C35956C7569K05004a45547
12359E75457B65778q7229h5200A18313K93046E4276g5994B41327a04933A05354
12348c47895a6754A79355J4990n2552a84021G1919e4897A76097c11083B17928
12337a52648C6028a75603a0248C19807k0251f2375B02280b29735J9794B08930
12326i3700A15055a61800E1903Q5931C4032N9167a68009N3995c8316B2315J60841
12315A83156a07376q7735j59845E8416b17545E35935k49110a28583B66269C5951
12304C26401b4826I2508Q1008a23749I7619a8595j9494l2440A7310b495q2278
$$ y = [5635, 77474, -114690, -276245, -32321, -40818, -104313, -300051, -54709, -260550, 81324, -275873, 98417, 94084, -348539, -57067, -16673, 202668, -57385, -301226, 335956, 37569, 242573, -145547, 575457, 265778, 178549, -85200, 118313, 411359, 54276, -75994, 241327, -104933, 105354, -347895, -16754, 179355, 194345, 141793, -184021, 71919, -54897, 176097, -311083, 217928, -152648, 36028, -175603, -10248, 319807, 299556, -62375, 202280, -229735, -209941, 208930, -93700, 115055, -161800, 51903, 137834, 34032, 93199, -168009, -114014, -38316, 22315, 183156, -107376, -195111, -354956, 58416, -217545, 535935, 286825, -128583, 266269, 35951, 326401, -24826, 92508, 173516, -123749, 97619, -18595, -38089, -70529, 17310, -2495, -84773]
12293h4773l8340j51857A75599p4207k3868j2061j456J24790a11655A28675m8918
12282G9757k3491N84419B0276h678p6898B41255j01926k650A118N59140B06460
12270d962B2323P625L21674a40915A68647P7373E9293a26576A03971m6220J48148
12259B05899C7606J8664L8513a55957N6142I9894J7070K25103F2351J02029a40452
12247F1862i847A15353J13450M4973a24214B48261a13812F2366h4376F0927J41286
12236B02213J8620F5054A5774a32691A18011P5621a36627C16333r2283b32938
12225C82267l9031P5576K09920A23078j1978J37962B7839A3312J86424K8297C1561
12213A12224f862F0888L3239a89628A29221C4607J19753M65109a4925o4418A2161
$$ y = [-84773, -123113, -274970, 175599, 101392, 77524, 65463, 64007, 188797, -111655, 128675, 79757, 56266, 640685, 20276, -8678, -85576, 241255, 139329, 136679, 1118, 560258, 206460, -4962, 22323, 29948, 351622, -140915, 168647, 246020, 59293, -126576, 103971, 57751, 205899, 37606, 56270, 94783, -155957, -99815, 99894, 116964, 342067, 62351, 164380, -140452, 61862, -9847, 115353, 228803, 273776, -124214, 248261, -113812, 62366, -84376, 60927, 202213, 220833, 65054, 15774, -132691, 118011, 193632, -136627, 316333, 224050, -232938, 382267, 343236, 418812, 628732, 123078, 111100, 249062, 27839, 13312, 199736, 228033, 31561, 112224, -6862, 60888, 94127, -189628, 129221, 34607, 154360, 619469, -14925, -79343, 12161]
12201A23623D5764K52401o6583d9603B06837E7351L00546j70005k6779K11149
12191C72262G0329f0803j295I6261J08426A2890f978A14853K08312a16090b9530
12179B63442e0797d943A39898J90920J31284B6801P8104b13653F8259n264L69197
12168D32192C3892a08817A81770O457o3696O8252J0346c9007j63677A53663R2650
12157B46313g2770K2139A10659P5903J1359i1067K0069D0755K77653f8257C868
12145A7549J7441f5943C4597B672K60013a66401H5746L15473a28799K622r6099
12134b22276A71417d559B75678H4363Q0036J07079j22383F1889g6393K6414A26268
12122c65104P3502B60391f3285j34537C0992J44746g2507A03495b00797A98890
$$ y = [123623, 45764, 298165, 231582, -49603, 206837, 57351, 357897, 187892, 161113, 372262, 70329, -60803, -62098, 96261, 204687, 12890, -6978, 114853, 323165, -116090, -29530, 263442, -50797, -4943, 139898, 330818, 462102, 26801, 104905, -213653, 68259, 62995, 432192, 33892, -108817, 181770, 188227, 124531, 192783, 203129, -39007, -202684, 153663, 246313, -72770, -50631, 110659, 186562, 197921, -91067, -70998, 40755, 318408, -68257, 3868, 17549, 34990, -65943, 34597, 2672, 262685, -166401, 85746, 401219, -128799, -126177, -222276, 171417, -4559, 275678, 84363, 164399, 271478, 149095, 61889, -76393, -49979, 126268, -365104, -291602, 260391, -63285, -197822, 30992, 175738, -72507, 103495, -200797, 198890]
12111A4914O3540g2846B42707J29410a18565j03876A23472b6949E5602a36822
12100a73763C5456J5636J87759i7139H7968i6385B5244J84914r4379a76220D3417
12088B20348N0012I8714J73088a25765H0448K9667J2172a09624I82L60343A6897
12076D0484h4252A28069j1708n4565c08766d9562j01639L936A546a5907r8701
12065a14608o1432A18170a54835A07156N15243q1914J369558p13629D06713a1218
12054A80013G7779J42907Q138b06900o1811I7116a87241A37517e5636b0599A08540
12042a7997j85208O2317B40912I8529b25790I9345b26538k02006B18055i1461
12031G4078J45821a40127j35523C43962a27502M2333A23281K5348a6169j70844
$$ y = [14914, 78454, -72846, 242707, 372117, -118565, -222441, 123472, -26949, 55602, -136822, -173763, 35456, 51092, 238851, -97139, 87968, -96385, 25244, 210158, 115779, -176220, 43417, 220348, 270360, 98714, 271802, -125765, 80448, 110115, 122287, -109624, 982, 361325, 16897, 40484, -84252, 128069, 116361, 61796, -308766, -49562, -151201, -147265, 1546, -15907, -114608, -176040, 118170, -154835, 107156, 622399, 540485, 1910043, 1196414, 406713, -11218, 180013, 77779, 220686, 228824, -206900, -268711, 97116, -187241, 137517, -55636, -20599, 108540, -17997, -203205, -140888, 240912, 98529, -225790, 99345, -226538, -428544, 218055, -91461, 74078, 219899, -140127, -275650, 343962, -127502, -85169, 123281, 148629, -16169, -187013]
12021a87013A37424L9437e827k55907D6473f4700k04078C0149J15126l9000n2743
12010E3532J18629a83726c9884G5104a42268J814K0160I631O229e4061A19536
11998b62836A26602a68666A57877l7594a64706j7836E2628D294K16363F5323c9141
11986g0334A93568C8712b36688c1169r3131j01715P9605M75A09114L6022R8557
11975B43693A07297l4770g9617B38355b99756D11545A12552B9392M9452R6291
11965A75135J20682A44590l833l6355k2990a3755o2727D43400a43362C67875j39310
11954B28565g9671c1420A3460b38390A86798K45787h5959j9703j13437A87789
11943a4047m5612j24270h1112A80019Q8197B560R5487a09813B44691a16073k4327
$$ y = [-187013, 137424, 176861, -5827, -261734, 46473, -64700, -268778, 30149, 145275, 106275, 53532, 172161, -183726, -39884, 75104, -142268, -140454, -120294, 9631, 15860, -54061, 119536, -262836, 126602, -168666, 157877, 120283, -164706, -182542, 52628, 4294, 220657, 65323, -39141, -70334, 193568, 38712, -236688, -31169, -124300, -226015, -146410, -145935, 109114, 145136, 243693, 107297, 72527, -79617, 238355, -299756, 411545, 112552, 29392, 78844, 175135, 295817, 144590, 140757, 104402, 81412, -13755, -76482, 443400, -143362, 367875, 228565, -79671, -31420, 13460, -238390, 186798, 432585, -85959, -105662, -219099, 187789, -14047, -59659, -183929, -81112, 180019, 268216, 2560, 98047, -109813, 244691, -116073, -140400]
11932a40400G059M7557f0827B12501A1927c1637j11706j10318d8538o8750G8668
11920A19988c95933f3922B33859d8672B56903D0780c3693j2542B94558a53971
11909A32335c52510J73813B4757Q7331D1920M32918a37509m6444A91039g8464
11898A01525c4624j56520B26953c36966b735B8338c42481a11952N4679A67534
11887A74687f7347A14510K3566E2024J0354b30059a00853A0374b27770n1733G487
11875e6837l88222a82899g5116j15418N1619k16641a28776G6951e1606G7281a0468
11863A30935a71683P8889a8327k22746L7931o4446e9798j65560k2920C8562J07229
11852A45791c9105G8417e5742A11318J6695g482A26906h8225j38681f7195B92170
$$ y = [-140400, 7059, 54616, -60827, 212501, 11927, -31637, -143343, -253661, -48538, -117288, 78668, 119988, -395933, -63922, 233859, -48672, 256903, 40780, -33693, -46235, 294558, -153971, 132335, -352510, -178697, 24757, 112088, 41920, 474838, -137509, -183953, 191039, -78464, 101525, -34624, -191144, 226953, -336966, -2735, 28338, -342481, -111952, -57273, 167534, 174687, -67347, 114510, 138076, 52024, 62378, -230059, -100853, 10374, -227770, -279503, 7487, -56837, -445059, -182899, -75116, -190534, -138915, -355556, -128776, 76951, -51606, 77281, -10468, 130935, -171683, -92794, -18327, -241073, -203142, -267588, -59798, -225358, -248278, 38562, 145791, -39105, 78417, -55742, 111318, 128013, -7482, 126906, -88225, -226906, -67195, 292170]
11840B56328b27938q3598g8307k5171A11899d354A70382b26458J1510O0591a6475
11828f1475l6980j41170A7752K9757p78J19476a10367j33058d9615n8829A79945
11816e4275C9021N7639J10668a21376K5441m7168A88145o6375J66839n1385k8491
11805B08733b30368A55532a94346C3996b7108j08551b6726C56572c5348j69812
11795b05160A55107a20459j37270I1651R8045b06534Q2970R982B7192K00809A01160
11783c12961J48652N0344K3368A01381e5764F8113N5521j356O8450b83108Q8866
11772a94242O7730A79260H5287C9137J13573A2049Q2754b77149J6701a11979B02389
11760h8595E22928E548b03065i693A48067j7130b57862n8458c9502B36399j03030
$$ y = [256328, -227938, -311536, -78307, -103478, 111899, -4354, 170382, -226458, -214948, -154357, -16475, -61475, -98455, -239625, 17752, 47509, 46731, 166207, -110367, -243425, -49615, -108444, 179945, -54275, 39021, 96660, 207328, -121376, -95935, -143103, 188145, 121770, 288609, 237224, 208733, -230368, 155532, -194346, 33996, -27108, -135659, -26726, 356572, -35348, -205160, 155107, -120459, -257729, 91651, 189696, -206534, -123564, -113582, 27192, 228001, 101160, -312961, -164309, -113965, -90597, 101381, -55764, 68113, 123634, 122278, 190728, -283108, -194242, -126512, 179260, 85287, 39137, 152710, 12049, 94803, -277149, -260448, -111979, 202389, -88595, 522928, 5548, -203065, -9693, 148067, 130937, -257862, -316320, -39502, 236399, 133369]
11749A33369A2773J61937m5574a54887A09355L9854f6424A8829a00272j48604
11739b48876M3942o0378J6684C8154J06025a4515B28879a15061A35438g1321a2177
11727a10023B07760B5099b56894l49483C39526A17994h6108p5466j45867J32088
11717a75353n2617g7783c019B59758A10429K0541J23290a04913A91934i9822q1721
11706a81543K1652J9105A12374N4320k3299o4706a06512A20369a64627k2260C21972
11694h2606B60106b8377I9232O739a2610j7524O221C97540a36223B59157j03496
11683A55661G5571c6156C7038a29081L7745H8483J10593a76614B18070j00990
11673A17080j4290i2348b9452k05095B38744F0779J40374f7808D67562G058e23036
$$ y = [133369, 12773, 174710, 129136, -154887, 109355, 149209, -66424, 18829, -100272, -248876, -204934, -265312, -248628, 38154, 144179, -14515, 228879, -115061, 135438, -71321, -12177, -110023, 207760, 25099, -256894, -606377, 339526, 117994, -86108, -161574, -307441, -175353, -227970, -77783, -3019, 259758, 110429, 130970, 254260, -104913, 191934, -99822, -181543, -159891, -140786, 112374, 166694, 143395, 78689, -106512, 120369, -164627, -186887, 321972, -82606, 260106, -28377, 99232, 105971, -12610, -30134, -23913, 397540, -136223, 259157, 155661, 75571, -36156, 37038, -129081, -91336, 88483, 199076, -176614, 218070, 117080, 102790, -92348, -29452, -234547, 238744, 60779, 201153, -67808, 467562, 7058, -523036]
11661b45571a2226B17729b77017D2889J46792K21481A38932d3441k90765c3361
11650B64945h8362A3168a35262B5085a12514K3119A69018c6796f055l4613C88099
11638A28072C2929a63386g4787A4882K03518j5692e6585n8218E155g5757A94383
11626H9702J64626i6091D054c2099F7972J08069b68136A05820b77554J00631A51912
11614b2303l1049G4368e9688A91018J95735D9844d9642F3075a23581l7866A26693
11602A20030b07576N5498G3204G385K40533A0440a0275A17038J49228d0880k12353
11591b53233e2649n8229D6851J6362j7223K93526O748a89347j8274A10306J20307
11580B30613c49118J74304H3867a02067j7098A85681b10614h9118I4492M2635
$$ y = [-245571, -12226, 217729, -277017, 42889, 189681, 411162, 138932, -43441, -334206, -33361, 264945, -88362, 13168, -135262, 25085, -112514, -89395, 169018, -36796, -6055, -40668, 388099, 128072, 32929, -163386, -74787, 14882, 218400, 202708, -56585, -114803, 5155, -75757, 194383, 89702, 254328, -96091, 4054, -32099, 67972, 176041, -268136, 105820, -277554, -176923, 151912, -22303, -53352, 74368, -59688, 191018, 386753, 49844, -49642, 63075, -123581, -161447, 126693, 120030, -207576, -152078, 73204, 7385, 247918, 10440, -10275, 117038, 266266, -40880, -253233, -52649, -110878, 46851, 63213, 45990, 339516, 346264, -189347, -207621, 110306, 230613, -349118, -174814, 83867, -102067, -119165, 185681, -210614, -89118, 94492, 137127]
11570A37127n4352b00291E9361c9791i313F6910B2107J55573a06598B35309i0836
11558A88642j5243a21917E3471J38141b96382A08923i099r5713D5171a56826A63765
11546A27253Q4735a75461A91588E0898a8394A91016l1858K6664J07778O1562G1805
11534A93063b43536A20482K12014a4250I4779M48926f1213B23927r466l937o8426
11523A42098g5122B52884A0581K6375J32166p1843J24707h2736I8067L6784J50074
11512B84925A10813K04985B1762o247E106J80326E3054J38694a96270D58360A04693
11500f4831a813D01365D0358a23464r9538E40075k31262n3289l4399A08843l8223
11489G0620g2774E4034K06998J32070j22388n0086J77062j15530a34612B29024
$$ y = [137127, 82775, -200291, 59361, -39791, -9313, 66910, 22107, 177680, -106598, 235309, -90836, 188642, 173399, -121917, 53471, 191612, -296382, 108923, -9099, -104812, 45171, -156826, 163765, 127253, 211988, -175461, 191588, 50898, -18394, 191016, 159158, 185822, 293600, 355162, 71805, 193063, -243536, 120482, 332496, -14250, 94779, 543705, -61213, 223927, 214461, 210524, 142098, -75122, 252884, 10581, 36956, 169122, 97279, 221986, -82736, 98067, 134851, 284925, 110813, 315798, 21762, 15515, 5106, 185432, 53054, 191748, -196270, 458360, 104693, -64831, -1813, 401365, 40358, -123464, -223002, 540075, 308813, 255524, 221125, 108843, 70620, -72774, 54034, 261032, 393102, 270714, 220628, 397690, 282160, -134612, 229024]
11478A46981E7085K8691K00175q9288g466D52662A63501J67077A33656c4810A40937
11466A12455m9867J70146D9655h9379n443C33541o7770j20523C9946g2084F9775
11454C818K99038J43666j80123C3907K43593l9112d4864F5675e5274C37256A49849
11442b0531E2773L26348H3376a65460B35534a93141A4832g9025j45857A78561
11431b417j67303E5507L8196B6118Q4690m2076c1009k99186g4271A11421M9654
11420A61075b47899q1873a23661k9491A38167c49982J63520C1561b9762C03532
11409d5572H1696q288k9149e9368B47543C530b28612d8014B7114J17713d183B7899
11396e0852C20972A42295a8098D4978a02065B42347E3187a95164E8010c3345C2857
$$ y = [146981, 57085, 85776, 285951, 196663, -7466, 452662, 163501, 330578, 133656, -34810, 140937, 112455, 62588, 232734, 49655, -89379, -94822, 333541, 265771, 145248, 39946, -72084, 69775, 3818, 302856, 446522, 266399, 33907, 277500, 238388, -44864, 65675, -55274, 337256, 149849, -20531, 52773, 379121, 83376, -165460, 235534, -193141, 14832, -79025, -224882, 178561, -2417, -169720, 55507, 93703, 26118, 110808, 68732, -31009, -330195, -74271, 111421, 161075, -247899, -329772, -123661, -153152, 138167, -349982, -186462, 31561, -29762, 303532, -45572, 81696, 73408, 44259, -59368, 247543, 3530, -228612, -48014, 27114, 144827, -4183, 27899, -50852, 320972, 142295, -18098, 44978, -102065, 242347, 53187, -195164, 58010, -33345, 32857]
11384B6045K8720d22851e8986j7295A48674a93677h6909A8119R828O0201B5875
11372A07150d718j63913K8246a4819o3598l0130B7916N133L35608b10786d9480
11360B33326e9560A73590J48961a8283k32036a06968B06057e5909A9492a53326
11349A73559E4616K9421I271R3270R5553n6547a6381C43915C7152J05797b5148
11337f9384k068A31122J98838E5030j2560e3007A00647a05889B1901a34592f7137
11325d1888D3744a50701R070H6429d8371D0373J54599R9267E034a91266N3714
11314a37552A3833J11312c00063I639a13631j3660o8689A6763i1456b5784k08266
11303b34050A12128i101q6075A8782a62238f5764o2128D7053b05242A90857r0684
$$ y = [26045, 54765, -422851, -58986, -76281, 148674, -193677, -86909, 18119, 27947, 88148, 25875, 107150, -4718, -168631, -140385, -14819, -78417, -108547, 27916, 33049, 368657, -210786, -49480, 233326, -59560, 173590, 322551, -18283, -250319, -106968, 206057, -55909, 19492, -153326, 173559, 54616, 84037, 9271, 102541, 198094, 141547, -16381, 343915, 37152, 142949, -25148, -69384, -71452, 131122, 329960, 55030, 42470, -53007, 100647, -105889, 21901, -134592, -67137, -41888, 43744, -150701, -141631, 86429, -48371, 40373, 194972, 294239, 5034, -191266, -137552, 13833, 125145, -300063, 9639, -113631, -127291, -195980, 16763, -91456, -25784, -234050, 112128, -9101, -95176, 18782, -162238, -65764, -127892, 47053, -205242, 190857, 100173]
11292A00173B5991b86992R6292B22819b78140B5485L66820b16965C4964L3105
11282F8069B3926a62304A88489i7880j20833a02774C09001c5073C76597p9637
11272B96960A29901i4962J5075A46709c0693B43168j11918a60476P9462p966k68313
11261c57293I543a94825j46078A5008c98361A0391B731c34215D5719J83454L4595
11250B63768G85a34397B58387D8795a18181B93643b52432E805a11709k35975h8306
11238a78363A06633b18666A5268a73180C2461a24256K2183A57666F1938J24236
11228A86174a83592j46396a33734E4439O2783l1654N6415a12371B86370b01359
11217A02162L6397i5834L3810r1884A62071c84332A4693a40608a795E909J02697
$$ y = [100173, 25991, -286992, -190700, 222819, -278140, 25485, 392305, -216965, 34964, 68069, 23926, -162304, 188489, -97880, -218713, -102774, 309001, -35073, 376597, 296960, 129901, -94962, -79887, 146709, -30693, 243168, 131250, -160476, -81014, -88980, -357293, 9543, -194825, -340903, 15008, -398361, 10391, 2731, -334215, 45719, 229173, 263768, 785, -134397, 258387, 48795, -118181, 293643, -252432, 5805, -111709, -347684, -88306, -178363, 106633, -218666, 15268, -173180, 32461, -124256, -102073, 157666, 61938, 186174, -183592, -329988, -133734, 54439, 117222, 85568, 141983, -112371, 286370, -201359, 102162, 138559, -95834, -62024, -153908, 162071, -384332, 14693, -140608, -1795, 5909, 108606]
11206A08606l5026B6346K03269p1362b11626b0797C36931c71225h6303k8037N0228
11195f4112k98868a52220l24121a86749e1010k25156B1659N2499d33412A18184
11184c61909D72071A01060B1539b2989j72850A0747a97324f2089A78210E2641
11173c5663k1666D3818L7240M5365J13476r5146E1149a91328c8900B4534b02745
11161a94275A04096J6788k1609a05289k44557B48949a43903m9642G7263b2506
11150f9251l4749A1634J66057M3907h3889A63048F0929g4044D39M8589P3688R1870
11138B14586F5139L701l1377L650a10426b2044B09742I1008N7982C9894c757A88570
11125g2571k04643A02277J89129A37296f7040j20555j2979O3582j59939A17321
$$ y = [108606, 73580, 26346, 229615, 158253, -211626, -20797, 336931, -371225, -86303, -114340, -64112, -362980, -152220, -476341, -186749, -51010, -276166, 21659, 74158, -433412, 118184, -361909, 472071, 101060, 21539, -22989, -195839, 10747, -197324, -62089, 178210, 52641, -35663, -57329, 43818, 81058, 126423, 239899, 144753, 51149, -191328, -38900, 24534, -202745, -194275, 104096, 120884, 99275, -105289, -349846, 248949, -143903, -193545, 77263, -22506, -69251, -104000, 11634, 177691, 221598, -83889, 163048, 60929, -74044, 439, 49028, 122716, 214586, 65139, 68840, 37463, 41113, -110426, -22044, 209742, 91008, 148990, 39894, -3757, 188570, -72571, -277214, 102277, 291406, 137296, -67040, -187595, -200574, -136992, -296931, 117321]
11114A6222a62895f1504l3051K2296P716B16998m3019J5614E8692O2809a0235
11102B19964I297M0855M5729b02238B8796a6266B4844J1549L75884A5672M89942
11091E05614c31944B56466J85791B15149P9344J35436F4761J52255O3870E594
11080B54728k6802a1846A58615L66030A55292j7151k998M5956D1566J416K25005
11069B67987k4830J24696r8432E5602J56752L26966p6528J07645j23529J51156
11059E98064j48516M29129K0775C39173M32601I8641P16523j01352J03804k40791
11049E76825M13868R1892j23199C89215J61525J33418J9458J57041K54156m29869
11039F84944K25604l24295M2673J98401r8412j9302k19610N5616R6584J2777j16734
$$ y = [16222, -162895, -61504, -94555, -72259, -64543, 216998, 173979, 189593, 58692, 121501, -10235, 219964, 9297, 50152, 95881, -202238, 28796, -16266, 24844, 36393, 412277, 15672, 505614, -331944, 256466, 442257, 215149, 294493, 429929, 64761, 217016, 280886, 5594, 254728, 227926, -11846, 158615, 524645, 155292, 138141, 135143, 181099, 41566, 42982, 267987, 243157, 367853, 269421, 55602, 212354, 539320, 462792, 570437, 446908, 598064, 449548, 878677, 899452, 339173, 771774, 98641, 815164, 713812, 817616, 576825, 990693, 1082585, 959386, 389215, 550740, 684158, 703616, 860657, 1114813, 684944, 910548, 586253, 628926, 827327, 728915, 709613, 490003, 545619, 642203, 654980, 538246]
11028E38246O3316Q5447j85612l0696j51337M43185j73886k48497K32115j00950
11018D71331K04378P2173k36970J26931l845l5306R1601p6432j58481J15597j52714
11007D18263P0993j83533K36442p1151J22751K58714j57408q0636j06293J21712
10997F29854Q6876J07753j66239J3386B71569L21507K46212r1429O4994N2139
10987H64992O2922K38108k71833R2319J32867L44062k93775L01832R1123k72634
10977A289983M78052R1550K11672K40892L81892J31741P249k00378J8364l71587
10967B279430J48241l99452k21377k50520L31215j23998r8068k93413L65152j49764
10957A587446j85774P7113J6878m62882p9276j44304l33772n0114J12302j84095
$$ y = [538246, 601562, 687009, 501397, 470701, 319364, 762549, 588663, 340166, 572281, 471331, 675709, 747882, 510912, 637843, 633998, 598692, 690293, 613861, 455380, 570977, 418263, 489256, 305723, 542165, 471014, 593765, 852479, 695071, 614435, 508142, 629854, 716730, 824483, 658244, 671630, 271569, 593076, 839288, 747859, 812853, 864992, 927914, 1166022, 894189, 986508, 1119375, 1463437, 1169662, 1471494, 1562617, 1289983, 1768035, 1859585, 2071257, 2312149, 2694041, 2825782, 2833031, 2632653, 2651017, 2279430, 2427671, 2028219, 1806842, 1556322, 1887537, 1763539, 1665471, 1372058, 1737210, 1587446, 1401672, 1478785, 1495663, 1032781, 953505, 809201, 475429, 425315, 537617, 353522]
10947C53522K19411H2029K58547j31551H8802R4468L4632m6239J7686a41829f454
10935B3550K70343e922B0265K1108K33260a38749A62236a73512A87865g2487a6643
10923C8023J8099K81218g3902m1231C81743C8792H633L33761A60233a78395B22836
10911G7847J8715a13458A40485K1719a61759q0017A9654N2954P215e1611A27030
10899H0969A6453c93166h2654j73207J07076I3020b00140B83152I7395m5771a76722
10887a1081G8143a05759J8898o2742D8077A8253e1778j71363A08777f5710A75666
10875a58894F1681e1251A05433J39745a99337A18625e0300k7193k49319B32519
10864a02652a374l46337J54070I0964C4885a1951j17038A71620c23472e75j01058
$$ y = [353522, 572933, 82029, 340576, 209025, 88802, 183270, 217902, 171663, 189349, -141829, -6454, 23550, 293893, -5922, 20265, 41373, 274633, -138749, 162236, -173512, 187865, -72487, -16643, 38023, 56122, 337340, -73902, -115133, 381743, 38792, 8633, 342394, 160233, -178395, 222836, 77847, 96562, -113458, 140485, 162204, -161759, -241776, 19654, 72608, 79823, -51611, 127030, 80969, 16453, -393166, -82654, -255861, -148785, 93020, -200140, 283152, 97395, 51624, -176722, -11081, 78143, -105759, -86861, -149603, 48077, 18253, -51778, -223141, 108777, -65710, 175666, -158894, 61681, -51251, 105433, 245178, -199337, 118625, -50300, -77493, -326812, 232519, -102652, -1374, -347711, -193641, 90964, 34885, -11951, -128989, 171620, -323472, -575, -101633]
10853a01633k01887i1003A44906J14297B1766a47552C17387A03965D781J01517
10843A06298a27821D6117b35075A96089D3239j152A0930f6324q2918a4491k0653
10832c5144o2664j27702A68538l0910c2191l2919k09693e5959B80752a38231A67128
10820D0406J47154D0234J72640b14952A85385b33189j64976a38715O046r2714
10810b25383c809D9045b4415m4651A52769L397h6593j05448B1518f2525B04474
10798a05353j7715l692L2977C6373a10119j17115A87657a34368A00012J09537
10788B09549q1420F2809b25538d3570B42563b00674k9006m7136A53671c63997
10777i1218c544A13723a58957C2327d9809j71230a4204n1575A465b42453C04302
$$ y = [-101633, -303520, -91003, 144906, 259203, 21766, -147552, 317387, 103965, 4781, 106298, -127821, 46117, -235075, 196089, 43239, 42087, 10930, -66324, -149242, -14491, -35144, -97808, -225510, 168538, 137628, -32191, -65110, -274803, -55959, 280752, -138231, 167128, 40406, 187560, 40234, 212874, -214952, 185385, -233189, -398165, -138715, -132669, -225383, -3809, 49045, -24415, -69066, 152769, 156166, -86593, -192041, 21518, -62525, 204474, -105353, -123068, -126760, -93783, 36373, -110119, -227234, 187657, -134368, 100012, 209549, 128129, 62809, -225538, -43570, 242563, -200674, -229680, -276816, 153671, -363997, -91218, -3544, 113723, -158957, 32327, -49809, -221039, -14204, -65779, 1465, -242453, 304302]
10765B31545A11383E1558b0842k70874P5783A449J38308D1737Q2668f834B21068
10753b03138A71724D1318P0336a75454f8483k35082p343Q6111B68583H9485C8338
10741B80802j34479d15409c7789j28324O584B29155b78349A81446e7951B14751
10730b05354b4556j00837N6079G2695b2958G4267d0650C22968C8581g1127M025
10719f7102j07709H431N2060d09451g5024A2867a48812D4153g192j0207r3574
10708a10973B91064f6703B55130J1652a3657E9522c1630m41215h6521A70369h4712
10696B6395a74526a4731B999K08503c21575A15785l9993J00088G6957K3552a10203
10684a7742A14504a59739F6485K5784c2193A16902R0587A3956b18350A5243b8171
$$ y = [231545, 111383, 51558, -20842, -291716, -215933, 1449, 139757, 41737, 124405, -6834, 221068, -203138, 171724, 41318, 111654, -175454, -68483, -303565, -310908, -224797, 268583, 89485, 38338, 280802, 146323, -415409, -37789, -166113, -159529, 229155, -278349, 181446, -57951, 214751, -205354, -24556, -125393, -69314, 72695, -22958, 74267, -40650, 322968, 38581, -71127, -67102, -174811, 8431, 60491, -409451, -75024, 12867, -148812, 44153, -7192, -17399, -110973, 291064, -66703, 255130, 266782, -13657, 59522, -31630, -472845, -86521, 170369, -84712, 26395, -174526, -14731, 2999, 211502, -321575, 115785, 75792, 175880, 76957, 100509, -110203, -17742, 114504, -159739, 66485, 92269, -32193, 116902, 207489, 13956, -218350, 15243, -28171]
10672a50434A94761A7039b17602f562A40018g7106B0373J36907a69553j70359
10662c39912a13776E9844P2871m0376c55274K7706a50137O8622g455j0212A19511
10650I707K5988K76438g0592I1842a26555F9916B4292J32270c8383o8622d6119
10638i6905j60760O6476K5857N12F9219d58275J73948e610k18299l6814e510k14586
10626b20096r718a12320l7834e8313J9347B39016a20517c6324l8661b8807C21089
10614d46720b6624o1493a3258r1796j21778J291d6479B165R978d21986a51045
10602b08686N842I185N8626J40910n0333a62425j24419A80520b12899a5619B62233
10590E0278a54818d5282J1139B1459d6412p557m2328B16469q1331c73974B95519
$$ y = [-150434, 194761, 17039, -217602, -6562, 140018, -77106, 20373, 157280, -169553, -339912, -113776, 59844, 132715, 92339, -355274, -327568, -150137, -81515, -7455, -17667, 119511, 9707, 35695, 312133, -70592, 91842, -126555, 69916, 24292, 156562, -38383, -107005, -46119, -96905, -257665, -191189, -165332, -164820, 69219, -458275, -284327, -5610, -223909, -260723, -5510, -220096, -229814, -112320, -150154, -58313, -38966, 239016, -120517, -36324, -74985, -28807, 321089, -446720, -26624, -88117, -13258, -105054, -226832, -225541, -46479, 2165, 12143, -421986, -151045, -208686, -202844, 9185, 67811, 208721, 158388, -162425, -286844, 180520, -212899, -15619, 262233, 50278, -154818, -45282, -34143, 21459, -46412, -53969, -96297, 216469, 135138, -373974, 295519]
10578A52241J13641I1500c43664k10609A3955J47691c31833A16312a73415j53224
10568c26639a44062b2516m6734j71420i6670A09555a25144r9298k32992E0291
10557h6704j47686d5441j20152b4344q0401A19292H710O0677g6370Q088B26175
10545C78773H4320c12420H812a37406H8727h5199n1399R957r8565a03549k5959
10534a29508E2259b03922J01379K7821A06931h6485j2888j75539A57447O1621
10524B19068a6738j33987A71444K8858h8276C370c21617C75b1881o3767P757I569
10511c2131D76867d3567j76341H5157J13218b95935i1768C65Q732d4826r3405
10500a38231K5727d932A23200A8814m788L8448J83062g9421j1078C1408c22873
$$ y = [152241, 265882, 91500, -343664, -554273, 13955, 161646, -331833, 116312, -173415, -326639, -144062, -22516, -69250, -240670, -96670, 109555, -125144, -224442, -457434, 50291, -86704, -234390, -45441, -165593, -24344, -104745, 119292, 8710, 69387, -76370, -68282, 226175, 378773, 84320, -312420, 8812, -137406, 88727, -85199, -136598, -126641, -225206, -103549, -129508, 52259, -203922, -102543, -74722, 106931, -86485, -99373, -274912, 157447, 219068, -16738, -150725, 171444, 200302, -88276, 3370, -321617, 375, -21881, -85648, -77891, 9569, -32131, 476867, -43567, -219908, 85157, 198375, -295935, -91768, 365, 9097, -44826, -138231, -112504, -4932, 123200, 18814, 14026, 52474, 235536, -79421, -90499, 31408, -322873]
10488b8529k13265B52399i7470F9747J4102j026J07012R3293A27465N5230b16192
10476b0258l5503A00140h1522C07470a27521n748A83589j5723a27916k2792A57602
10464A89024H6295a02806k87938A26477a08915K4612D17534m8623a13206B35288
10453A11590J64422i271F4057b86263g5829a7920B9326d0640l5565m87664A96886
10441A9365M5026K03717j16494f9952A60514e2705C7366j5145b42667j14008E9480
10429B49894j09551J8033j688D3584b18559B5114m891O4546d15454i0575n500
10418i6075d0056p104H3321b05903n5999F9201B0231b6999r2113D51233f4453
10406A01485J06648M4431q5823a15748B604c59412C6627D668J25444d2471E8993
$$ y = [-28529, -241794, 252399, -97470, 69747, 83849, 82823, 189835, 283128, 127465, 182695, -216192, -20258, -55761, 100140, -81522, 307470, -127521, -133269, 183589, 167866, -127916, -150708, 157602, 189024, 86295, -102806, -390744, 126477, -108915, -84303, 417534, 368911, -113206, 235288, 111590, 276012, -9271, 64057, -286263, -75829, -17920, 29326, -40640, -76205, -563869, 196886, 19365, 64391, 268108, 151614, -69952, 160514, -52705, 37366, 22221, -242667, -356675, 59480, 249894, 140343, 158376, 156688, 43584, -218559, 25114, 20223, 84769, -415454, -90575, -96075, -40056, -47160, 83321, -205903, -261902, 69201, 20231, -26999, -119112, 451233, -64453, 101485, 208133, 252564, 166741, -115748, 2604, -359412, 36627, 4668, 130112, -42471, 58993]
10394b25979A53249K62066A27138E4260Q4150K25060e8585j2929a9376B00033
10383d8758A71705F6181Q537K30625A21808J21454A04868N9879O9369K00824r0802
10372C44138C2384a6779B8633L85338o7809J83858l4522J39080A67671M3823J9129
10361B30623M39705A47915K32316A44885C2583a04210D61778j1924A45287J76057
10351C21344J0203Q5025j5694O3923A73781J27536D9087L39655q5605J7646A34015
10339F6261R8988J2021M5185L767D0917J71603l997k2735a28037A24057E1444
10327i1004p696C05441i0982A07055h9194E78989F2570R1578M0898c7856D33521
10315F0804K28182J84646A4603h5913I9226J3279d9387l34521A22594c96504A40982
$$ y = [-225979, 153249, 415315, 127138, 54260, 138410, 363470, -58585, -71514, -19376, 200033, -48758, 171705, 66181, 74718, 305343, 121808, 243262, 104868, 164747, 234116, 434940, 344138, 32384, -16779, 28633, 413971, 346162, 530020, 495498, 634578, 167671, 211494, 230623, 670328, 147915, 380231, 144885, 32583, -104210, 461778, 449854, 145287, 321344, 331547, 416572, 400878, 464801, 173781, 301317, 49087, 388742, 303137, 320783, 134015, 66261, 165249, 177270, 222455, 226222, 40917, 212520, 208523, 185788, -128037, 124057, 51444, -91004, -98700, 305441, -90982, 107055, -89194, 578989, 62570, 154148, 195046, -37856, 433521, 60804, 288986, 473632, 14603, -85913, 99226, 112505, -49387, -383908, 122594, -396504, 140982]
10303a67447e6490K0318A65926A2472K48989a01153e073I9030J31548c2716A10749
10291a19517G0209A434c2763A57892L7716b6424j90056n8767e79C7627a59973
10279I8867j7437d05225a61500a1752a702n1577D132b35210K6292A59022G154
10267a97476i546D4191a01778q5520A94417k4975K9547L0628J72177A31587L60621
10256D92208B32430R9505j07399d7502l88167c55B16554A00084J2932h0518d655
10244A1565N8727d266A02097A462b4733j02405a8318j94387a563m48179A43524
10232h5360J4609q9430c2263j91867A49537g570l2478D22700b52228A63696m8991
10221A14705D9610J24224B2740J03543E1690b29914F4475c9705j57677h8257n6750
$$ y = [-167447, -56490, -36172, 165926, 12472, 261461, -101153, -5073, 99030, 230578, -32716, 110749, -119517, 70209, 1434, -32763, 157892, 195608, -26424, -216480, -275247, -579, 37627, -159973, 98867, 81430, -405225, -161500, -11752, -1702, -53279, 4132, -235210, -208918, 159022, 7154, -197476, -9546, 44191, -101778, -187298, 194417, 169442, 198989, 229617, 401794, 131587, 492208, 232430, 331935, 224536, -47502, -435669, -355, 216554, 100084, 113016, -80518, -4655, 11565, 70292, -4266, 102097, 1462, -24733, -127138, -18318, -212705, -1563, -449742, 143524, -85360, -70751, -160181, -32263, -224130, 149537, -7570, -40048, 422700, -252228, 163696, 114705, 49610, 173834, 22740, 126283, 51690, -229914, 64475, -39705, -197382, -88257, -145007]
10210a45007J1019H8746g8460D4148a7270r5100j75024E8180g4559A67181b07824
10198A74929i551o9307A54426b06725P3648k31393A28597I084Q5708B5638J35975
10187A61613a22026d7895p6878C9661O7301a19452M0596k6847j00439d3050B34582
10175G6548c1188j47724A4186b7618a3545k11889g7265E4709L01362b03168a5893
10163a07304M2580A74216b18299P0530E9271C497Q9094h174k17300o9047h4938
10151A11551E557a83916b3051A448J26711A6574c7914A90918a2097B39487c51230
10139B39386I5280a39159B30169a73831B42520E0559b4037k50934F0152a87213
10128I8044a94043e8794l2536A23444P6213d9622k38810g3050j4749a0816j35895
$$ y = [-145007, -133988, 88746, -78460, 44148, -17270, -112370, -287394, 58180, -74559, 167181, -207824, 174929, -9551, -78858, 154426, -206725, -133077, -364470, 128597, 9084, 94792, 25638, 161613, -122026, -47895, -124773, 39661, 106962, -119452, -78856, -105703, -206142, -43050, 234582, 76548, -31188, -178912, 14186, -27618, -13545, -225434, -77265, 54709, 356071, -203168, -15893, -107304, -64724, 174216, -218299, -147769, 59271, 3497, 92591, -8174, -225474, -294521, -84938, 111551, 5557, -183916, -23051, 1448, 128159, 16574, -37914, 190918, -12097, 239487, -351230, 239386, 95280, -139159, 230169, -173831, 242520, 50559, -24037, -274971, 60152, -187213, 98044, -194043, -58794, -91330, 123444, 199657, -49622, -288432, -73050, -87799, -10816, -146711]
10117a46711J0588D2006O7367e2475j48804n205A45634L79180A94374J56797a61495
10105C2135c1248A77391j8128g0198J444k62797j6431a22836c0529p0884j0998
10094a12411k3119p4605A9531a37217k1427A79816a20911k47736H9519b95374
10083a97004j2901G5871K04917j10599E5003J31408C5966J18606B6549e2400q2354
10072a34754M0998A0160J39826e7686k693p2011f2392H5020N7739K9455a06038
10060b70058J31328c2309p6941l25609C0151R9803d91405D256h4336k8943J842
10049a11437j54273J04195b0676A53863G3348d0388j79742g8280o4411q7294C1430
10037C16170d7828E5011b01169G5511b09271F6294a5733j89088f2022K5821q8728
$$ y = [-146711, -136123, 42006, 109373, -52475, -201279, -206484, 145634, 524814, 194374, 351171, -161495, 32135, -31248, 177391, 159263, -70198, -68754, -331551, -347982, -122836, -30529, -101413, -112411, -135530, -210135, 19531, -137217, -158644, 179816, -120911, -368647, 89519, -295374, -197004, -209905, 75871, 280788, 170189, 55003, 186411, 35966, 154572, 26549, -52400, -134754, -93756, 10160, 149986, -57686, -60379, -132390, -62392, 85020, 142759, 172214, -106038, -270058, -138730, -32309, -109250, -434859, 30151, 129954, -491405, 4256, -84336, -113279, -111437, -265710, -161515, -20676, 153863, 73348, -40388, -220130, -78280, -142691, -229985, 31430, 316170, -47828, 55011, -201169, 75511, -209271, 66294, -15733, -204821, -62022, -36201, -124929]
10026a24929J874k91729a02991b4031l28699a64919N3489j46790h9289j58757
10016b48046k4587n8989a39527C44922c918A20838i557m14H15a93140E1027c5144
10003g2264l11093A96436a31915F9405f7164j40973C47508b15606e4268m8618
9993a02886A71728f8682G7597b04470c8505j80840G5169a30450n2110j2416j75232
9982c70208G2798a55903L0906J7085M5075k7229k09378G3071A4031K06117b03067
9970g9282j08419l0043a07915l3757A58517a82158l4181E4002J81412i7343J0690
9959h6653l18512A3745a84372j13371i0129j8824l57775A32211F423K24500A00524
9947A51788b5678B58244d7094C56992A41988J50777g5991l61925C28229F20J64464
$$ y = [-124929, -123055, -414784, -102991, -24031, -352730, -164919, -111430, -258220, -89289, -248046, -272633, -331622, -139527, 344922, -3918, 120838, -9557, -9971, 815, -193140, 51027, -35144, -72264, -383357, 196436, -131915, 69405, -67164, -208137, 347508, -215606, -54268, -102886, 171728, -68682, 77597, -204470, -38505, -219345, 75169, -130450, -182560, -194976, -370208, 72798, -155903, -124997, -107912, -62837, -90066, -299444, 73071, 14031, 220148, -203067, -79282, -187701, -217744, -107915, -141672, 158517, -182158, -216339, 54002, 235414, -97343, -86653, -405165, 13745, -184372, -297743, -90129, -108953, -466728, 132211, 6423, 230923, 100524, 151788, -25678, 258244, -47094, 356992, 141988, 292765, -75991, -437916, 328229, 620, 165084]
9936A65084p5659J8824J00199i5512n7650j72827i211C172R8808J70513g6961
9924D0648c54054I7833a09306j65125J35484r6852i7302I6695J24029H0112b36072
9912a80264A96453b51907A23558a95405C95632i3913B6121b00204B09570F9931
9901A6246a15726M6150n7887K3091j85586h5088A11638b12658a8143p2479R688
9890h0934D9845a0654G8456e16358h3003r8214B895e2899k82909a65646l8422
9879b04068B37604b82830j34268a18609j927j91417L4730J23624J6274j05315
9869b42640B11090j7341B8781a73589m8908A32221D221J75235g6348j48401k96848
9858e21597H8587a73290A14506b14341M0612j10900a20513b2778j35386j3865
$$ y = [165084, 89425, 108249, 208448, -95512, -153162, -325989, -9211, 3172, 101980, 272493, -76961, 40648, -354054, 97833, -109306, -274431, -138947, -235799, -97302, 96695, 220724, 80112, -236072, -180264, 196453, -251907, 123558, -195405, 395632, -93913, 26121, -200204, 209570, 69931, 16246, -115726, -69576, -127463, -104372, -289958, -85088, 111638, -212658, -18143, -90622, -80934, 49845, -10654, 78456, -516358, -83003, -181217, 2895, -52899, -335808, -165646, -204068, 237604, -282830, -417098, -118609, -120536, -311953, -277223, -153599, -137325, -242640, 211090, 193749, 28781, -173589, -222497, 132221, 4221, 179456, -76348, -224749, -521597, 88587, -173290, 114506, -214341, -173729, -284629, -120513, -22778, -158164, -172029]
9848a72029G1394b12983I9220J43204J0399B4208K41735a38499j2938H1766h5958
9836a05357l4752A24887J12118H3130a65263b9390k74117a36515A95361a89780
9825C4471d24520b04048M942a7419B02126J8664O834B2258b39918M6209K320c1034
9812i5234K8110A03936a6609p4836K9606A49491e2407m4232q3880n5689J15395
9801a20813o771e7430k60409B2635L4417h972k52784J14515D3873d9861A1188
9789A64157b80112J3767Q4647l1737k8396D3461A841J5797P953K17094b46393
9777b32019B03827D1743a53360E1385b32604k14356b9383m0591j22878M9524c4605
9765D6834d2649j29333M5298p702L9272A34417i2067j15617d80j56300a3668C51090
$$ y = [-172029, 71394, -212983, 99220, 242424, 252823, 24208, 265943, -138499, -151437, 81766, -85958, -105357, -140109, 124887, 237005, 83130, -165263, -29390, -303507, -136515, 195361, -189780, 34471, -424520, -204048, -199106, -17419, 202126, 220790, 227624, 22258, -239918, -193709, -191389, -31034, -95234, -67124, 103936, -16609, -91445, -61839, 149491, -52407, -96639, -180519, -236208, -120813, -127584, -57430, -317839, 22635, 57052, -8972, -261756, -147241, 43873, -49861, 11188, 164157, -280112, -266345, -181698, -213435, -241831, 43461, 1841, 17638, 25591, 242685, -246393, -232019, 203827, 41743, -153360, 51385, -232604, -446960, -29383, -69974, -192852, -143328, -34605, 46834, -42649, -171982, -126684, -134386, -95114, 134417, -92067, -207684, -480, -156780, -13668, 351090]
9752a681j44137A27M14767c30997C22757a6243j06294J7538B9156K09303a58121
9740a15887I075J9866f495n8388K9023r8769P596P907L8266E1791a05216A08723
9727B17b6743A21662f1272l45355a34113A23920j5140J74527A03213m2641e8644
9715c37664a66196b0523A0394a71902g1481F000P0604a76580o6337L9069A54219
9703b0587A56699C4192K60901A40291b00028A54072b1463l23390b1049n0851C53574
9691f6342A37243e1999k51993J38371l28678c1195a5413I3739J63459D5099R5743
9680A40842h7119k98024Q3641p667A77055o2737c31129g1815m4397A37551c21183
9668b40284A15440l0469K50264F6150L939a77510A08879f0344j21768L3416a0854
$$ y = [-1681, -145818, 127, 414894, -330997, 322757, -16243, -122537, -104999, 29156, 238459, -158121, -115887, 9075, 28941, -6495, -64883, -35860, -134629, -127033, -119126, -80860, 51791, -105216, 108723, 217, -26743, 121662, -61272, -406627, -134113, 123920, 108780, 283307, 103213, 60572, -58644, -337664, -166196, -20523, 10394, -171902, -71481, 6000, 76604, -176580, -242917, -203848, 154219, -20587, 156699, 34192, 295093, 140291, -200028, 154072, -21463, -344853, -21049, -71900, 353574, -66342, 137243, -51999, -303992, -165621, -494299, -31195, -15413, 93739, 257198, 45099, 140842, -87119, -385143, -301502, -309169, 177055, 114318, -331129, -71815, -116212, 137551, -321183, -240284, 115440, 84971, 335235, 66150, 70089, -177510, 108879, -60344, -182112, -148696, -10854]
9656H0623a27232H974K64368b12515B9973a92528j9269H511M6305c22565i7242
9644E61a77146M2246k8361A9997a93439m3470a18296m8257C1878h585l62313K6115
9632c44783J01054G4168N4643a1965p1350c5265j18066f0781J1575j58664K0093
9621a87777q7192g7522A72341c52n0947A95571c14753c6097A09321O4263l2589
9610A40995C077a63453H811c8595A19314a85539j43688C0429d08173g3462b9570
9598c31225O268B12952i9984B5436a64497K6496j31018G4976a45809A90215d02391
9586d8836b0861E0915b82017K8945d2238A07974b5264l2414H2536b5248m9485
9575g4733A1172J78741b12887Q0145A54021O2673a60755H5560b16273p2061A25711
$$ y = [80623, -127232, 8974, 273342, -212515, 29973, -192528, -211797, 8511, 54816, -322565, -97242, 561, -177146, -134900, -163261, 19997, -193439, -236909, -118296, -166553, 31878, -8585, -370898, -344783, -243729, 74168, 128811, -11965, -83315, -35265, -153331, -60781, -49206, -207870, -187777, -274969, -77522, 172341, -352, -51299, 195571, -314753, -36097, 109321, 173584, 140995, 3077, -163453, 8811, -38595, 119314, -185539, -329227, 30429, -408173, -73462, -29570, -331225, -324957, 212952, -99984, 25436, -164497, -138001, -269019, 74976, -145809, 190215, -402391, -48836, -20861, 50915, -282017, -253072, -42238, 107974, -25264, -57678, 82536, -25248, -74733, 11172, 189913, -212887, -132742, 154021, 216694, -160755, 85560, -216273, -288334, 125711]
9563D7389a05375A69017L153b7279I8498c94944I309g6578K8379j67136i2531
9551d5425I3521b77967C5322g9644q336n2185C42263a94017a8107A72699a32421
9539a57121P8026j13657A55272L6659a21893o909a5625j86874A01341b96231g720
9527c14867C4325a8120F9417B5350b14297Q8863b9472k76611J27443C25019a4269
9515b56913e1686B9834b8368p9903b1434A51048N9605b79740A9784b74692A38963
9503c01695d6980k05978a14669C8769M0315I904g2482G0521f3051r587A04093
9491b1099B15688O6204E9686a13877m6187j8807C3005M207b13128m8324m095A09746
9478e8738D0980J43104B9176h0234k52526d0628F2892a90528R2917C8620h5858
$$ y = [47389, -105375, 169017, 172170, -27279, 98498, -394944, 9309, -76578, -48199, -215335, -92531, -45425, 93521, -277967, 35322, -79644, -87980, -140165, 342263, -194017, -18107, 172699, -132421, -157121, -79095, -192752, 155272, 191931, -121893, -128802, -15625, -202499, 101341, -296231, -7720, -314867, 34325, -18120, 69417, 25350, -214297, -125434, -29472, -306083, -178640, 325019, -14269, -256913, -51686, 29834, -28368, -108271, -21434, 151048, 210653, -279740, 19784, -274692, 138963, -301695, -46980, -252958, -114669, 38769, 79084, 9904, -72482, 70521, -63051, -72638, 104093, -21099, 215688, 281892, 59686, -113877, -160064, -178871, 33005, 37212, -213128, -261452, -265547, 109746, -58738, 40980, 184084, 29176, -80234, -332760, -40628, 62892, -190528, -97611, 38620, -85858]
9466c75863J67317B2057h0142c8687I5349l7706d8161a8333q702k33340A60014
9454a3534F7542K0602a2082A39986F1540a48726J0678c7027j5174A21795m1052
9443H0743M2027a32179e0813j50788C7864J8050A560e3599n4623k1311D5342A1781
9430c86618B6084e6582j77739B42079A16143a03280A90141b69751e4491p5978
9420a30469l23787J41253B13741b26728j09848d7356q3133n9881B31516d3506
9409B0542N0412f674k21320b223j36459K0707B07830a56351k6694B1698K04886
9398B26584r1180k1072J97946A09102i3970K0050E9665b99411D93528A0820b15367
9386i2702j43877H0811i0516j22988d571A34979a73144j03072P3057E862a25646
$$ y = [-375863, -208546, 22057, -80142, -38687, 95349, 57643, -48161, -18333, -27035, -260375, 160014, -13534, 67542, 88144, -12082, 139986, 61540, -148726, -138048, -37027, -52201, 121795, 80743, 122770, -132179, -50813, -201601, 37864, 55914, 1560, -53599, -108222, -129533, 45342, 11781, -386618, 26084, -56582, -234321, 242079, 116143, -103280, 190141, -269751, -54491, -130469, -454256, -313003, 213741, -226728, -336576, -47356, -130489, -190370, 231516, -43506, 20542, 70954, -6674, -227994, -2223, -138682, -117975, 207830, -156351, -183045, 21698, 226584, 135404, 114332, 312278, 109102, -93970, -73920, 59665, -299411, 493528, 10820, -215367, -92702, -236579, 80811, -90516, -213504, -4571, 134979, -173144, -276216, -203159, 5862, -125646]
9374h9811k7456O991D56039f6385L0043j03131H4070L4570N7271a98378j7107
9363b15485a1652p29A67859h6815n606A96143f74842B11470j02296f9466k40148
9352c09614Q0285C56499c02208I3376G245c05905e0881G3635h8939a4067k35395
9341b49462i8380k5338j27950a21069m2770A72184e5913A23443J553l2932a67428
9329C24899a85915f8427f729j63433d4005C11700a1913j19782A80366b397A54735
9317b6715j6320k21221g6871j26517B72948e3047G7948M1739b10817K9185E0261
9305c3170j25180F078J75576c08039J02980C3418d46127B26867k0516e9233p4813
9294a34046l1915A82907a87229L040j44520p5717h4654j43048D4482A6676a42936
$$ y = [-89811, -117267, -110276, 456039, -66385, -36342, -139473, 84070, 118640, 175911, -198378, -215485, -11652, -12381, 167859, -86815, -92421, 196143, -674842, 211470, 109174, -69466, -309614, -229329, 356499, -302208, 93376, 7245, -305905, -50881, 73635, -88939, -14067, -249462, -98380, -123718, -251668, -121069, -163839, 172184, -55913, 123443, 124996, 92064, -167428, 324899, -185915, -68427, -6729, -170162, -44005, 311700, -11913, -131695, 180366, -2397, 154735, -26715, -43035, -264256, -76871, -203388, 272948, -53047, 77948, 119687, -210817, -181632, 50261, -33170, -158350, 6078, 181654, -308039, -205059, 33418, -446127, 226867, 206351, -59233, -134046, -165961, 182907, -187229, -184189, -328709, -404426, -84654, -227702, 44482, 16676, -142936]
9282f8337Q82K8614k05011G3137i9195q3345D11682a96762M056c258A5909J6082
9270C1991J94829b19573a06548B8901a32376k09775c7982A85819a14030l5073
9260a49103q5268B35421A08640K00624F5280b31256A39954c12629J5530M7561
9250b49538J6365c1349m6669m03735B0897b44719A66748d8354A19798b66316J23317
9239a42999d6105A62560b40560a03236b7605j81558D41635d61597a25088A41186
9228e2547a1342E0011j8872O8731a89174F3268b95233L4082a8880k32849C2923
9216b1856j17150e0288q5284A96635f1378F8497a83687H0943J1681g2661M818
9205f7843B120b86692a41480A18013n0143b0344E5275b33388b2063K953H343a64996
$$ y = [-68337, -67455, -38841, -243852, 73137, -99195, -182540, 411682, -196762, -192706, -3258, 15909, 31991, 226820, -219573, -106548, 28901, -132376, -342151, -37982, 185819, -114030, -149103, -234371, 235421, 108640, 309264, 65280, -231256, 139954, -312629, -297099, -249538, -233173, -31349, -78018, -481753, 20897, -244719, 166748, -48354, 119798, -266316, -142999, -46105, 162560, -240560, -103236, -27605, -209163, 441635, -461597, -125088, 141186, -52547, -11342, 50011, 31139, 99870, -189174, 63268, -295233, -261151, -18880, -251729, 32923, -21856, -139006, -50288, -135572, 196635, -61378, 68497, -183687, 80943, 92624, -72661, -67843, 2120, -286692, -141480, 118013, 67870, -20344, 55275, -233388, -22063, -19110, 8343, -164996]
9192a12293k70606a78332O8457F5333e4138m0890n480G2526a48881D11398a53867
9180i8071l4928C24471C5114f9142j26037A02300b02530E2975C720J48472J75855
9169C28047a52199D1472c40434a52318G1964a5466A5681a39467L8657a0983r9180
9158a10163j79834C91092B1188a04092I1273a2262A94918a13172j68807A91122
9147d4654j9293h942j60191A13398D6686b58624Q8166b297k8683G986h422D6272
9134I8037a07107A0798a45480K4715h096k71874g527k24553Q1671e8443k0801
9123g9244q2196D8027a95953I8169K41111f2281E2896a55777n2005a8784E4506
9111d19741E7488c05080A12028C5245f0708a879C42842A43178f7790o4889A04850
$$ y = [-112293, -382899, -178332, -109875, 65333, -54138, -95028, -100508, 72526, -148881, 411398, -153867, -98071, -132999, 324471, 35114, -69142, -195179, 102300, -202530, 52975, 3720, 152192, 328047, -152199, 41472, -340434, -152318, 71964, -15466, 15681, -139467, -100810, -10983, -110163, -289997, 391092, 21188, -104092, 91273, -12262, 194918, -113172, -281979, 191122, -44654, -63947, -8942, -169133, 113398, 46686, -258624, -170458, -2297, -30980, 7986, -8422, 46272, 98037, -107107, 10798, -145480, -120765, -8096, -279970, -7527, -232080, -150409, -58443, -79244, -161440, 48027, -195953, 98169, 339280, -62281, 52896, -155777, -207782, -18784, 54506, -419741, 57488, -305080, 112028, 35245, -60708, -1879, 342842, 143178, -67790, -132679, 104850]
9099h9289A2084b04659g6408j73150c2849j6703j63648i4833c8048h051A89969
9087a60234A10449k0503k4604d7104f551A21909l7992a74669c1169A8265h2436
9075a02398k75814a48378o58A00294a59474D1121a9144I4885B2174h5691j38080
9064b23771A88874J68410i8142L3939C001b72605B16965g9134L5902k11162E1495
9052I7997a88381J7867K1333F3457f4084b4283B2981K07660D6911P822a9248E7310
9039A72772p7509C1946f840A49928C6230g8989j9598C67186e6170d734k42396
9028b47130j54086J35639M424h5652M0332n8836k66107H7038L1461d7931j32600
9017a80531F0053k6921N7101e624l81350J57053A85571a07276C20429a15068k76341
$$ y = [-89289, 12084, -204659, -76408, -249558, -32849, -49552, -213200, -94833, -38048, -8051, 189969, -160234, 110449, 89946, 65342, -47104, -6551, 121909, 83917, -174669, -31169, 18265, -82436, -102398, -378212, -148378, -149036, 100294, -159474, 41121, -19144, 94885, 22174, -85691, -223771, 188874, 357284, -98142, -64203, 3001, -272605, 216965, -79134, -43232, -254394, 51495, 97997, -188381, -170514, -149181, 63457, -64084, -24283, 22981, 230641, 46911, 54733, -19248, 57310, 172772, 95263, 31946, -6840, 149928, 36230, -78989, -98587, 367186, -56170, -4734, -247130, -401216, -265577, -261153, -85652, -45320, -104156, -370263, 87038, 118499, -47931, -180531, 60053, 33132, 90233, -5624, -386974, -229921, 185571, -107276, 320429, -115068, -391409]
9006c91409B74507a59229j41385A02411l6970L7390a58519R508E53529c57117
8995f7029J0046k59398A63442c9613A69505b75378j48119b11292g9828A13184
8984A18833a47289N0544k64368C4011K53856b59013A19246k2529Q5317b77779
8973A56909a26457q2569a4605j28734B49124c4133n45j27026e4484p3862A79847
8961b0247k07527E7466M569b76114f5004o4639d1425B07353d6597J339r8888b1650
8948a38124j80711o9280A2622a83887d6873E9729b99038J11871C2766N8690d429
8936c19300A33680K17774A62342b28763g9104K5373P181A27330e3016A08334K42271
8925C50605q5805R03883J491577Q412055l18040C332551A058948m33056j19390
$$ y = [-391409, 274507, -159229, -300614, 102411, 65441, 102831, -158519, -149011, 553529, -357117, -67029, -56983, -316381, 163442, -39613, 169505, -275378, -423497, -211292, -79828, 113184, 118833, -147289, -96745, -361113, 34011, 287867, -259013, 119246, 96717, 182034, -277779, 156909, -126457, -209026, -14605, -143339, 249124, -34133, -34678, -161704, -54484, -128346, 179847, -20247, -227774, 57466, 62035, -276114, -65004, -129643, -41425, 207353, -46597, -45258, -144146, -21650, -138124, -318835, -388115, 12622, -183887, -46873, 59729, -299038, -187167, 32766, 91456, -4429, -319300, 133680, 351454, 162342, -228763, -79104, -53731, -46550, 127330, -53016, 108334, 350605, 264800, 1168683, 2660260, 11072315, 10754275, 3332551, 1058948, 625892, 506502]
8916E06502H9081a34307A95688h4800D84001A9168M7986Q4632J20317a88675p8236
8905b66911h8263B6803b30152D377c63098B03406G3973c06969A30045c1659A82921
8893a34982C50977E6775c02283J32318A8543Q9861b3775A37191f2586j39494M6328
8882a55752A03990O1468a42094k0102F1580c76983D3571a34942A1181J09587e0238
8870b1763G5238b72579A63664b10273M8996B0600J30767a27602f3655j98461B33155
$$ y = [506502, 89081, -134307, 195688, -84800, 484001, 19168, 67154, 151786, 272103, -188675, -266911, -88263, 26803, -230152, 4377, -363098, 203406, 73973, -306969, 130045, -31659, 182921, -134982, 350977, 56775, -302283, -169965, 18543, 108404, -23775, 137191, -62586, -202080, -155752, 103990, 165458, -142094, -162196, 61580, -376983, 43571, -134942, 11181, 120768, -50238, -21763, 75238, -272579, 163664, -210273, -161277, 20600, 151367, -127602, -63655, -262116, 233155]
$$ [...]
##END NTUPLES=NMR SPECTRUM
##END=
