
##TITLE=AC1394_GUALH12206_7519375_CDclRzSWxz
##JCAMPDX= 6.0         $$ Bruker NMR JCAMP-DX V2.0
##DATA TYPE= NMR SPECTRUM
##DATA CLASS= NTUPLES
##ORIGIN= BRUKER
##OWNER= Administrator
$$ 1.72 TOPSPIN		Version 2.1
$$ 2013-02-19 23:05:56.966 -0500  Administrator@X
$$ Compression mode = diff/dup
##.OBSERVE FREQUENCY= 400.02188249412
##.OBSERVE NUCLEUS= ^1H
##.ACQUISITION MODE= SIMULTANEOUS (DQD)
##.ACQUISITION SCHEME= undefined
##.AVERAGES= 64
##.DIGITISER RES= 22
##SPECTROMETER/DATA SYSTEM= spect
##.PULSE SEQUENCE= noesygpps1d.comp
##.SOLVENT NAME= COFFEE_meoh
##.SHIFT REFERENCE= INTERNAL, COFFEE_meoh, 1, 14.96088
##AUDIT TRAIL= $$ (NUMBER, WHEN, WHO, WHERE, PROCESS, VERSION, WHAT)
$$ ##TITLE= Audit trail, TOPSPIN		Version 2.1
$$ ##JCAMPDX= 5.01
$$ ##ORIGIN= Bruker BioSpin GmbH
$$ ##OWNER= Administrator
$$ $$ E:\/data/COFFEE/nmr/AC1394_GUALH12206_7519375_CDclRzSWxz/12/pdata/1/auditp.txt
$$ ##AUDIT TRAIL=  $$ (NUMBER, WHEN, WHO, WHERE, PROCESS, VERSION, WHAT)
(   1,<2013-02-19 23:05:51.122 -0500>,<Administrator>,<X>,<go>,<TOPSPIN 2.1>,
      <created by zg
	started at 2013-02-19 22:54:21.166 -0500,
	POWCHK enabled, PULCHK disabled,
       configuration hash MD5:
       86 BA 57 50 F2 9D 5C 9B 26 00 A9 28 5F 66 2E 89
       data hash MD5: 64K
       C7 E3 0C 4E 83 4D FA E9 C0 64 5B 1D 33 08 73 0F>)
(   2,<2013-02-19 23:05:54.201 -0500>,<Administrator>,<X>,<proc1d>,<TOPSPIN 2.1>,
      <Start of raw data processing
       efp LB = 0.3 FT_mod = 6 PKNL = 1 PHC0 = 0 PHC1 = 0 SI = 128K 
       data hash MD5: 128K
       4D B7 D8 0C 99 E7 96 7E E0 E4 32 A7 5A 0D 57 C7>)
(   3,<2013-02-19 23:05:55.279 -0500>,<Administrator>,<X>,<proc1d>,<TOPSPIN 2.1>,
      <pk PHC0 = 254.5093 PHC1 = 0 
       data hash MD5: 128K
       1E 22 61 62 78 5C 1E 4D 64 78 DA 5E B4 5E 21 60>)
(   4,<2013-02-19 23:05:55.951 -0500>,<Administrator>,<X>,<proc1d>,<TOPSPIN 2.1>,
      <abs ABSG = 1 
       data hash MD5: 128K
       0D E3 40 D4 E9 09 14 48 04 B8 A4 C8 54 06 83 81>)
(   5,<2013-02-19 23:05:56.122 -0500>,<Administrator>,<X>,<proc1d>,<TOPSPIN 2.1>,
      <abs ABSG = 2 
       data hash MD5: 128K
       E7 DE 94 25 EE 88 FD AF 17 95 FC D6 BD 0D 40 78>)
(   6,<2013-02-19 23:05:56.263 -0500>,<Administrator>,<X>,<proc1d>,<TOPSPIN 2.1>,
      <abs ABSG = 3 
       data hash MD5: 128K
       C1 9F 61 CA 28 31 EC 5F DE 2C C8 6C FD EF 7C 7A>)
(   7,<2013-02-19 23:05:56.466 -0500>,<Administrator>,<X>,<proc1d>,<TOPSPIN 2.1>,
      <abs ABSG = 4 
       data hash MD5: 128K
       80 92 97 56 74 95 71 3C A0 74 A1 2E 54 33 03 14>)
(   8,<2013-02-19 23:05:56.638 -0500>,<Administrator>,<X>,<proc1d>,<TOPSPIN 2.1>,
      <abs ABSG = 5 
       data hash MD5: 128K
       79 8C 29 13 5C C5 1D 30 8E 8E EA 36 66 39 52 49>)
$$ ##END=
$$ 
$$ $$ hash MD5
$$ $$ B0 CF 4B 59 41 40 F3 EB F8 BC 93 B3 8B 81 C1 7E
##$RELAX= 
##$RELAX= 
##$RELAX= 
##$RELAX= 
##$RELAX= 
##$RELAX= 
##$RELAX= 
##$RELAX= 
$$ Bruker specific parameters
$$ --------------------------
##$DU= <E:\>
##$EXPNO= 12
$$ [...]
150 150 150 150 150 150 150 150
##$TP07= 0
##$TPNAME0= <>
##$TPNAME1= <>
##$TPNAME2= <>
##$TPNAME3= <>
##$TPNAME4= <>
##$TPNAME5= <>
##$TPNAME6= <>
##$TPNAME7= <>
##$TPOAL= (0..7)
0.5 0.5 0.5 0.5 0.5 0.5 0.5 0.5
##$TPOFFS= (0..7)
0 0 0 0 0 0 0 0
##$TUNHIN= 0
##$TUNHOUT= 0
##$TUNXOUT= 0
##$USERA1= <user>
##$USERA2= <user>
##$USERA3= <user>
##$USERA4= <user>
##$USERA5= <user>
##$V9= 5
##$VALIST= <valist>
##$VCLIST= <CCCCCCCCCCCCCCC>
##$VD= 0
##$VDLIST= <DDDDDDDDDDDDDDD>
##$VPLIST= <PPPPPPPPPPPPPPP>
##$VTLIST= <TTTTTTTTTTTTTTT>
##$WBST= 1024
##$WBSW= 4
##$XGAIN= (0..3)
0 0 0 0
##$XL= 0
##$YL= 0
##$YMAX_a= 5830179
##$YMIN_a= -9758886
##$ZGOPTNS= <>
##$ZL1= 120
##$ZL2= 120
##$ZL3= 120
##$ZL4= 120
##$ABSF1= 14.96088
##$ABSF2= -5.597301
##$ABSG= 5
##$ABSL= 3
##$ALPHA= 0
##$AQORDER= 0
##$ASSFAC= 0
##$ASSFACI= 0
##$ASSFACX= 0
##$ASSWID= 0
##$AUNMP= <proc_prof1d_extract.lims>
##$AXLEFT= 0
##$AXNAME= <>
##$AXNUC= <1H>
##$AXRIGHT= 0
##$AXTYPE= 0
##$AXUNIT= <>
##$AZFE= 0.1
##$AZFW= 0.1
##$BCFW= 0
##$BC_mod= 0
##$BYTORDP= 0
##$COROFFS= 0
##$CY= 15
##$DATMOD= 1
##$DC= 0
##$DFILT= <>
##$DTYPP= 0
##$F1P= 0
##$F2P= 0
##$FCOR= 0.5
##$FTSIZE= 131072
##$FT_mod= 6
##$GAMMA= 0
##$GB= 0
##$INTBC= 1
##$INTSCL= 1
##$ISEN= 128
##$LB= 0.3
##$LEV0= 0
##$LPBIN= 0
##$MAXI= 10000
##$MC2= 0
##$MEAN= 0
##$ME_mod= 0
##$MI= 0
##$NCOEF= 0
##$NC_proc= -2
##$NLEV= 6
##$NOISF1= 0
##$NOISF2= 0
##$NSP= 0
##$NTH_PI= 0
##$NZP= 0
##$OFFSET= 14.96088
##$PC= 1
##$PHC0= 254.5093
##$PHC1= 0
##$PH_mod= 1
##$PKNL= yes
##$PPARMOD= 0
##$PPDIAG= 0
##$PPIPTYP= 0
##$PPMPNUM= 2147483647
##$PPRESOL= 1
##$PSCAL= 4
##$PSIGN= 0
##$PYNMP= <proc.py>
##$REVERSE= no
##$SF= 400.020009685751
##$SI= 131072
##$SIGF1= 0
##$SIGF2= 0
##$SINO= 400
##$SIOLD= 131072
##$SPECTYP= <>
##$SREGLST= <1H.CDCl3>
##$SSB= 0
##$STSI= 131072
##$STSR= 0
##$SW_p= 8223.68421052631
##$SYMM= 0
##$S_DEV= 0
##$TDeff= 65536
##$TDoff= 0
##$TI= <>
##$TILT= no
##$TM1= 0
##$TM2= 0
##$TOPLEV= 0
##$USERP1= <user>
##$USERP2= <user>
##$USERP3= <user>
##$USERP4= <user>
##$USERP5= <user>
##$WDW= 1
##$XDIM= 131072
##$YMAX_p= 381499764
##$YMIN_p= -11374
##$CURPLOT= <Network HP LaserJet P1505>
##$CURPRIN= <$Network HP LaserJet P1505>
##$DFORMAT= <normdp>
##$LAYOUT= <+/1D_H.xwp>
##$LFORMAT= <normlp>
##$PFORMAT= <normpl>
##$SURQMSG= 1
$$ End of Bruker specific parameters
$$ ---------------------------------
##NTUPLES= NMR SPECTRUM
##VAR_NAME=  FREQUENCY,     SPECTRUM/REAL,   SPECTRUM/IMAG
##SYMBOL=    X,             R,               I
##VAR_TYPE=  INDEPENDENT,   DEPENDENT,       DEPENDENT
##VAR_FORM=  AFFN,          ASDF,            ASDF
##VAR_DIM=   131072,        131072,          131072
##UNITS=     HZ,            ARBITRARY UNITS, ARBITRARY UNITS
##FACTOR=    0.0627417313425164, 1,          1
##FIRST=     8223.62146879497, 2293,         -58346
##LAST=      0,             3960,            -57953
##MIN=       0,             -11374,          0
##MAX=       8223.62146879497, 381499764,    0
$$ Real data points
##PAGE= N=1
##DATA TABLE= (X++(R..R)), XYDATA
$$ [...]
61679D20414j414o71M26R12K55q09j043k50N24M60m5j69O6k5o62j327j632j804
$$ 420414 419000 418329 418755 419667 419922 419113 418070 417820 418344 418804 418759 418590 418656 418631 417969 416642 415010 413206
61661D13206k137k433k327j845j276p56l30k33o10j035q74j89K50N1k49k9N35
$$ 413206 411069 408636 406309 404464 403188 402432 402102 401869 401259 400224 399350 399161 399411 399462 399213 399184 399719
61644C99719Q80R50J085J357J575J809K286K880L217L228L017K365J044m59j319
$$ 399719 400599 401549 402634 403991 405566 407375 409661 412541 415758 418986 422003 424368 425412 424953 423634
61629D23634j578k098l182m140m512m815n465n743m719k718r90k08j8Q9K03L09
$$ 423634 422056 419958 416776 412636 408124 403309 397844 392101 387382 384664 383674 383466 383448 383537 383740 384049
61613C84049N85J132J755K035J576K96j392k822l650m019m120m045m099m670n495
$$ 384049 384634 385766 387521 389556 391132 391428 390036 387214 383564 379545 375425 371380 367281 362611 357116
61598C57116n725n113m464m427m548m201l758l856m098l657k792k528k910k887
$$ 357116 351391 346278 341814 337387 332839 328638 324880 321024 316926 313269 310477 307949 305039 302152
61584C02152k043j274j323j690j628j313j367j821k231k406k434k258j750j054
$$ 302152 300109 298835 297512 295822 294194 292881 291514 289693 287462 285056 282622 280364 278614 277560
61570B77560n37m81r91j886k619k621j923j093n38j87P0J89L01O36R61P07p3o17
$$ 277560 277023 276542 275551 273665 271046 268425 266502 265409 264871 264684 264754 264943 265244 265880 266841 267548 267475 266858
61552B66858n90n92j040j282n91N61J094P51J80j30j12L61J341K225K215J449
$$ 266858 266268 265676 264636 263354 262763 263324 264418 265169 265349 265219 265107 265468 266809 269034 271249 272698
61536B72698R10J078J392J279J009J128J610J979J943J524Q40O6n66r70j221j336
$$ 272698 273608 274686 276078 277357 278366 279494 281104 283083 285026 286550 287390 287456 286890 285920 284699 283363
61520B83363j304j368j842k552k787k162j126l83p9R3K50K43L1k53n88j084j687
$$ 283363 282059 280691 278849 276297 273510 271348 270222 269839 269760 269853 270103 270346 270377 270124 269536 268452 266765
61503B66765k086k045j652j256j178j444j701j503q22k02k40r49j726j931j448
$$ 266765 264679 262634 260982 259726 258548 257104 255403 253900 253078 252876 252636 251687 249961 248030 246582
61488B46582p12k56j64n0L73R07J285J702K408K874K157K93j371j736j140m94
$$ 246582 245870 245614 245450 245400 245773 246680 247965 249667 252075 254949 257106 257399 256028 254292 253152 252658
61472B52658R6R76J786J813J307J299J981K360J747P04P4k6J94P45J359J283K78
$$ 252658 252754 253730 255516 257329 258636 259935 261916 264276 266023 266727 266801 266775 266969 267714 269073 270356 270634
61455B70634o97o69K8L61J40L2L16N58M96L99M55M93M52N29P97J110J408J672
$$ 270634 269937 269268 269296 269657 269797 269829 270145 270703 271199 271598 272053 272546 272998 273527 274324 275434 276842 278514
61437B78514J677J382J356K117L153L444K915K512K693K841K505K212K423K571
$$ 278514 280191 281573 282929 285046 288199 291643 294558 297070 299763 302604 305109 307321 309744 312315
61423C12315J916P78O3jJ50L77R60J870K652L038L132K977K439J594P64J56k45
$$ 312315 314231 315009 315072 315071 315221 315598 316558 318428 321080 324118 327250 330227 332666 334260 335024 335180 334935
61406C34935m61n76r53j906l114l846l863l695l836m035l704k797j893j512j593
$$ 334935 334474 333898 332945 331039 327925 324079 320216 316521 312685 308650 304946 302149 300256 298744 297151
61391B97151j708j573j219q28n72n91q46r75n32M09J165J228R04Q13R70Q86M30
$$ 297151 295443 293870 292651 291823 291251 290660 289814 288839 288307 288716 289881 291109 292013 292826 293796 294682 295112
61374B95112J4r0J6L61J145K053K278J633J012J214J890K197K021J863J919K012
$$ 295112 295126 295036 295052 295413 296558 298611 300889 302522 303534 304748 306638 308835 310856 312719 314638 316650
61358C16650K188K636L142L302L222L436M115M956N742O545P347Q017Q657R437
$$ 316650 318838 321474 324616 327918 331140 334576 338691 343647 349389 355934 363281 371298 379955 389392
61344C89392J0057R925Q997P946P344P101O865O586O452O507O496O060N095M040
$$ 389392 399449 409374 418371 426317 433661 440762 447627 454213 460665 467172 473668 479728 484823 488863
61330D88863L513L497L168J920J98j210k343l771n387o362o357n932n548n013
$$ 488863 492376 495873 499041 500961 501159 499949 497606 493835 488448 482086 475729 469797 464249 459236
61316D59236m158l367k925k452j467j50R57J635K003K132K016J809J770K148L174
$$ 459236 455078 451711 448786 446334 444867 444717 445674 447309 449312 451444 453460 455269 457039 459187 462361
61301D62361M881O791Q103Q396P829O593M632K098l65k122k997l105k702k432
$$ 462361 467242 474033 482136 490532 498361 504954 509586 511684 511319 509197 506200 503095 500393 497961
61287D97961l053m462n520n322m255l299k817k631k763l245l464k634r06P84J986
$$ 497961 494908 490446 484926 479604 475349 472050 469233 466602 463839 460594 457130 454496 453590 454374 456360
61272D56360L032M057M560M378M242M810N681O009N689N308N159N033M956N391
$$ 456360 459392 463449 468009 472387 476629 481439 487120 493129 498818 504126 509285 514318 519274 524665
61258E24665O492P699Q454Q936R726J0921J1913J2056J1204R715Q194P165O685
$$ 524665 531157 538856 547310 556246 565972 576893 588806 600862 612066 621781 629975 637140 643825
61245F43825O137M780K563K03j706l289m922o532p693q216q254p948p331o565
$$ 643825 649962 654742 657305 657508 655802 652513 647591 641059 633366 625150 616896 608948 601617 595052
61231E95052n921n567n535n787o075n808m539k601r27j80k28m57k61O70K152L520
$$ 595052 589131 583564 578029 572242 566167 560359 555820 553219 552292 552112 551884 551427 551166 551836 553988 557508
61215E57508M143L997L545L115K741K492K551K871L163L279L281L093K524J691
$$ 557508 561651 565648 569193 572308 575049 577541 580092 582963 586126 589405 592686 595779 598303 599994
61201E99994J006O76O12R15J977L912O325Q757J0969J2733J3943J5072J6852J9171
$$ 599994 601000 601676 602288 603203 605180 609092 615417 624174 635143 647876 661819 676891 693743 712914
61187G12914K0885K1052J9829J7793J5158J2225R903Q910Q828Q682Q243P969P887
$$ 712914 733799 754851 774680 792473 807631 819856 829759 838669 847497 856179 864422 872391 880278
61174H80278P450O422N167L900K358M01j721l780n767p460q423q755r334j0857
$$ 880278 887728 894150 899317 903217 905575 905976 904255 900475 894708 887248 878825 870070 860736 849879
61160H49879j2996j4813j5793j6146j6277j6384j6498j6558j6365j5646j4306
$$ 849879 836883 822070 806277 790131 773854 757470 740972 724414 708049 692403 678097
61149F78097j2591j0871r257p512n425l298j875j696k644m174n827p303q302q614
$$ 678097 665506 654635 645378 637866 632441 629143 627268 625572 622928 618754 612927 605624 597322 588708
61135E88708q337p758o981n909m542l068j590o3J488K892M078N234O581Q098R575
$$ 588708 580371 572613 565632 559723 555181 552113 550523 550460 551948 554840 558918 564152 570733 578831 588406
61120E88406J0858J2012J3278J4869J6761J8686K0452K2195K4175K6265K7864
$$ 588406 599264 611276 624554 639423 656184 674870 695322 717517 741692 767957 795821
61109G95821K8499K8450K8507K9056K9619K9437K8366K6849K5107K2815J9766
$$ 795821 824320 852770 881277 910333 939952 969389 997755 1024604 1049711 1072526 1092292
61098A092292J6384J3115R681N498O90l923p886j1506j5098j8392k1037k3123
$$ 1092292 1108676 1121791 1131472 1136970 1137660 1133737 1125851 1114345 1099247 1080855 1059818 1036695
61086A036695k4866k6172k6876k7152k7309k7400k7346k7129k6625k5577k3993
$$ 1036695 1011829 985657 958781 931629 904320 876920 849574 822445 795820 770243 746250
61075G46250k2330k0893j9450j7718j5874j4213j2631j0915r237p837o509m907
$$ 746250 723920 703027 683577 665859 649985 635772 623141 612226 602989 595152 588643 583736
61063E83736l162j724p73k24p8k29j39O99K081L387M389N291O155O912P748Q858
$$ 583736 580574 578850 578077 577853 577775 577546 577407 578106 580187 583574 587963 593254 599409 606321 614069 622927
61047F22927J0049J1159J2628J4894J7402J9177K0215K1442K3302K5484K7920
$$ 622927 632976 644135 656763 671657 689059 708236 728451 749893 773195 798679 826599
61036H26599L0846L3704L5345L5884L6986L9523M2125M3052M2559M2266M3023
$$ 826599 857445 891149 926494 962378 999364 1038887 1081012 1124064 1166623 1208889 1251912
61025A251912M4578M6716M9396N2144N4583N7372O1432O6527P1781P7433Q4797
$$ 1251912 1296490 1343206 1392602 1444746 1499329 1556701 1618133 1684660 1756441 1833874 1918671
61014A918671R4651J07151J23283J44737J71988K04377K42796K90695L51862M29495
$$ 1918671 2013322 2120473 2243756 2388493 2560481 2764858 3007654 3298349 3650211 4079706
61004D079706N28049O50855P89698R17207R96288J001473R30042P93030O03666
$$ 4079706 4607755 5258610 6048308 6965515 7961803 8963276 9893318 10686348 11290014
60995A1290014L82974J72680K6796k2748O765O0520Q5149N4458l6536j86971l88194
$$ 11290014 11672988 11845668 11872464 11849716 11856481 11917001 12002150 12056608 12020072 11833101 11444907
60984A1444907o10888q07730r37422r86546r68267r04874q14887p12195o08460
$$ 11444907 10834019 10026289 9088867 8102321 7134054 6229180 5414293 4702098 4093638
60975D093638n12040m26609l53018k91714k42397k03007j70877j44624j23854
$$ 4093638 3581598 3154989 2801971 2510257 2267860 2064853 1893976 1749352 1625498
60966A625498j07666r4564q3619p4633o7221o0595n4335m8621m3606l9089l4951
$$ 1625498 1517832 1423268 1339649 1265016 1197795 1137200 1082865 1034244 990638 951549 916598
60955I16598l1305k8174k5406k3035k1299k0235j9555j8858j7731j5859j3511
$$ 916598 885293 857119 831713 808678 787379 767144 747589 728731 711000 695141 681630
60944F81630j1700j1119j1070j0236q550p331p355p795p658p370p986r393j0395
$$ 681630 669930 658811 647741 637505 628955 621624 614269 606474 598816 591446 583460 574067 563672
60931E63672j0372r911r660r494r053q493q208q147p910p364o837o645o660o443
$$ 563672 553300 543389 533729 524235 515182 506689 498481 490334 482424 475060 468223 461578 454918 448475
60917D48475n773m883m190l802l431k778j847q93j32M27J013J833K732L149K765
$$ 448475 442702 437819 433629 429827 426396 423618 421771 420878 420746 421173 422186 424019 426751 429900 432665
60902D32665K032J713J936K179K194K326K740K948K520J751J111N04l67j257j682
$$ 432665 434697 436410 438346 440525 442719 445045 447785 450733 453253 455004 456115 456619 456252 454995 453313
60887D53313j736j973k561l221l902m830n805o155n669n048n052n558n728m991
$$ 453313 451577 449604 447043 443822 439920 435090 429285 423130 417461 412413 407361 401803 396075 391084
60873C91084l564k194j502j468j512j181p15o55r39p87L31J910K954L118K954
$$ 391084 387520 385326 383824 382356 380844 379663 378948 378293 377354 376567 376898 378808 381762 384880 387834
60858C87834L060L379L489L353L352L613L710L320K836K927L511L733L065K005
$$ 387834 390894 394273 397762 401115 404467 408080 411790 415110 417946 420873 424384 428117 431182 433187
60844D33187J491J922K931L846M092L513K482J507O52l49j405k003k053k122k519
$$ 433187 434678 436600 439531 443377 447469 450982 453464 454971 455623 455274 453869 451866 449813 447691 445172
60829D45172k811k643k398k455k477k130j936k430l047k888k245k198k890l447
$$ 445172 442361 439718 437320 434865 432388 430258 428322 425892 422845 419957 417712 415514 412624 409177
60815D09177l578l934m667m894m142l183k807k634j900o93L08Q34J084J167J152
$$ 409177 405599 401665 396998 392104 387962 384779 381972 379338 377438 376745 377053 377887 378971 380138 381290
60800C81290J265J572J780J738J838K403L120L534L721L999M280M286M119M100
$$ 381290 382555 384127 385907 387645 389483 391886 395006 398540 402261 406260 410540 414826 418945 423045
60786D23045M281M543M944N513N944N967N883O178O803P273P364P291P319P646
$$ 423045 427326 431869 436813 442326 448270 454237 460120 466298 473101 480374 487738 495029 502348 509994
60772E09994Q457R662J0703J1149J1354J1953J2848J3302J3053J2712J2833J3145
$$ 509994 518451 528113 538816 549965 561319 573272 586120 599422 612475 625187 638020 651165
60760F51165J3077J2607J2168J2021J2047J2065J2036J2001J1999J2030J1934
$$ 651165 664242 676849 689017 701038 713085 725150 737186 749187 761186 773216 785150
60749G85150J1528J0998J0979J1871J3072J3354J2216J0457Q999P476M662L26
$$ 785150 796678 807676 818655 830526 843598 856952 869168 879625 888624 896100 900762 901088
60737I01088m096p012q348r166j0201j1434j2853j4607j6337j7236j7077j6614
$$ 901088 896992 889980 881632 872466 862265 850831 837978 823371 807034 789798 772721 756107
60725G56107j6535j6619j6373j6050j6326j7116j7442j6520j4656j2847j1675
$$ 756107 739572 722953 706580 690530 674204 657088 639646 623126 608470 595623 583948
60714E83948j0837r769q529p780p814p975p460o452n830n841n736m985m208m405
$$ 583948 573111 563342 554813 547033 539219 531244 523784 517332 511502 505661 499925 494940 490732 486327
60700D86327n600o749o910o165n430n474o154o640o472o153o276o476n888m594
$$ 486327 480727 473978 467068 460903 455473 449999 443845 437205 430733 424580 418304 411828 405940 401346
60686D01346l662l621l789l525l181l180l026k130j042p68j268j568j270r44r74
$$ 401346 397684 394063 390274 386749 383568 380388 377362 375232 374190 373422 372154 370586 369316 368372 367398
60671C67398r94o86m18o17j014r54k70M14K66q48k074k352j600q10p35r86q50
$$ 367398 366404 365718 365300 364683 363669 362715 362445 362859 363125 362277 360203 357851 356251 355441 354706 353720 352870
60654C52870m67m62o88k73J082K672L802M485M945N059M713M125L456K569J446
$$ 352870 352403 351941 351253 350980 352062 354734 358536 363021 367966 373025 377738 381863 385319 387888 389334
60639C89334N19J54J68J89K14M32P48Q86Q33Q13Q85Q27M47j12m53k69K26L46k92
$$ 389334 389853 390007 390175 390364 390578 391010 391758 392644 393477 394290 395175 396002 396449 396337 395884 395615 395841 396187 395895
60620C95895j096j073k49J06q57k238k446j382o20j306k754l546l352k919k746
$$ 395895 394799 393726 393477 393583 392726 390488 388042 386660 386040 384734 381980 378434 375082 372163 369417
60605C69417k562k079j466r66o55p31j444k438k725j763j86R69J416J564J681
$$ 369417 366855 364776 363310 362344 361689 360958 359514 357076 354351 352588 352402 353371 354787 356351 358032
60590C58032J668J430R91L16n14j143j389j597k030k229j661o84q4J56O48J285
$$ 358032 359700 361130 362121 362437 361923 360780 359391 357794 355764 353535 351874 351190 351106 351262 351910 353195
60574C53195J223L61k40K39J461K803M170N521O518P218Q194R298R281P472M975
$$ 353195 354418 354779 354539 354778 356239 359042 363212 368733 375251 382469 390663 399961 409242 416714 421689
60559D21689L246K191P50j255k981l906m245m206l806l280k829k091o76J000K198
$$ 421689 424935 427126 427876 426621 423640 419734 415489 411283 407477 404197 401368 399277 398601 399601 401799
60544D01799K912L648M429M960N461O348P194P099O066N006M304L460K214J019
$$ 401799 404711 408359 412788 417748 423209 429557 436751 443850 449916 454922 459226 462686 464900 465919
60530D65919J53o84j625k328k605k612k212j079M10J250J092N98K80Lj35N33K089
$$ 465919 466072 465388 463763 461435 458830 456218 454006 452927 453337 454587 455679 456277 456557 456560 456425 456958 459047
60513D59047L481L820L434L043K645J958J214P53L93k0R8J372L472N570P542R973
$$ 459047 462528 466348 469782 472825 475470 477428 478642 479395 479788 479768 479866 481238 484710 490280 497822 507795
60497E07795J3130J6576J9711K2182K3876K4907K5459K5250K3389J9196J3057
$$ 507795 520925 537501 557212 579394 603270 628177 653636 678886 702275 721471 734528
60486G34528O042j088q160j5079k1470k6669k9867l0506k8933k6335k3732k1247
$$ 734528 740570 739482 731322 716243 694773 668104 638237 607731 578798 552463 528731 507484
60474E07484j8620j5982j3720j1938j0589r769r401q938p958o787n954n326m400
$$ 507484 488864 472882 459162 447224 436635 426866 417465 408527 400569 393782 387828 382502 378102
60461C78102l299k720k902l319l406l025k206j099k61l70j342k261k389j853j122
$$ 378102 374803 372083 369181 365862 362456 359431 357225 356126 355865 355495 354153 351892 349503 347650 346528
60446C46528l56L05L55n29j665j859q42K36O8j288k568k789k174j498j100q70
$$ 346528 346172 346477 346832 346303 344638 342779 341937 342173 342241 340953 338385 335596 333422 331924 330824 329954
60430C29954q96j457k315k610j714LJ487J929J299K52l91k25M25Q69P91N24N59
$$ 329954 329058 327601 325286 322676 320962 320965 322452 324381 325680 325932 325541 325316 325741 326610 327401 327925 328484
60413C28484J019J610J926J724J164P55Q72J286J468J252R02N60J52k33l70m14
$$ 328484 329503 331113 333039 334763 335927 336682 337554 338840 340308 341560 342462 343022 343174 342941 342571 342157
60397C42157o89r27l89R36K003K025J527J473J961K433K684K884K905K449J733
$$ 342157 341468 340541 340152 341088 343091 345116 346643 348116 350077 352510 355194 358078 360983 363432 365165
60382C65165J299J214J100R10J029J491J692J182K81k35J28J194K256K632K305
$$ 365165 366464 367678 368778 369688 370717 372208 373900 375082 375363 375128 375256 376450 378706 381338 383643
60367C83643J908J889J940J542Q50M77N96Q08Q53Q60Q71P36O10R70J885K775L117
$$ 383643 385551 387440 389380 390922 391772 392249 392845 393653 394506 395366 396237 396973 397583 398553 400438 403213 406330
60350D06330L080L127L394L815M545N749P050P698P347O356N166L751J953O0j385
$$ 406330 409410 412537 415931 419746 424291 430040 437090 444788 452135 458491 463657 467408 469361 469421 468036
60335D68036k415l704n511p022p239o294n218m537l831k793j897j619j660j494
$$ 468036 465621 461917 456406 449384 442145 435851 430633 426096 422265 419472 417575 415956 414296 412802
60321D12802j202j174j325j220q14n20o55j174j775j956j266J56J527K342L010
$$ 412802 411600 410426 409101 407881 407067 406547 405892 404718 402943 400987 399721 399877 401404 403746 406756
60306D06756M207N995Q068J0336J2639J4270J4638J4086J3257J1948R514O255
$$ 406756 410963 416958 425026 435362 448001 462271 476909 490995 504252 516200 525714 531969
60294E31969L270R93j051k922l931m012m163m948n538n079m187m097m946n833
$$ 531969 535239 536232 535181 532259 528328 524316 520153 515205 509667 504588 500401 496304 491358 485525
60280D85525o244o419o479o104n265m520m388m811n346n558n201m368l596l455
$$ 485525 479281 472862 466383 460279 455014 450494 446106 441295 435949 430391 425190 420822 417226 413771
60266D13771l972m595m782m442l769k926j958r36j07K15n7n50p50n96m93o53p12
$$ 413771 409799 405204 400422 395980 392211 389285 387327 386391 386284 386499 386442 385892 385142 384546 384053 383400 382688
60249C82688k53M99Q93O53J46j31l2K94O56Q90Q71O14L10K14M65J023J699K238
$$ 382688 382435 382934 383827 384480 384626 384495 384463 384757 385413 386303 387174 387788 388098 388312 388777 389800 391499 393737
60231C93737K465K338J931J388Q94O55P96J304K002K611K916K971K997K994K632
$$ 393737 396202 398540 400471 401859 402753 403408 404204 405508 407510 410121 413037 416008 419005 421999 424631
60216D24631J770R44R48J905L071L712L873M146M878N830O488O584O321O129O149
$$ 424631 426401 427345 428293 430198 433269 436981 440854 445000 449878 455708 462196 468780 475101 481230 487379
60201D87379O064N621N103M961N038M747L969L220K691J857N18m09N3J400K063
$$ 487379 493443 499064 504167 509128 514166 518913 522882 526102 528793 530650 531168 530759 530812 532212 534275
60186E34275J367K18l34m39q45j635k286k699l375m520n588n948n590m888m060
$$ 534275 535642 535860 535526 535087 534242 532607 530321 527622 524247 519727 514139 508191 502601 497713 493653
60171D93653l235k709k650k657k210j513j396k094k750k477j494o52j59N64J811
$$ 493653 490418 487709 485059 482402 480192 478679 477283 475189 472439 469962 468468 467816 467657 468221 470032
60156D70032L054L605L303K424J378P26R71J947K763K736K125J596J357J275J497
$$ 470032 473086 476691 479994 482418 483796 484522 485493 487440 490203 492939 495064 496660 498017 499292 500789
60141E00789K238L100L331K990L146M502O331P308P082O432N983N437M283K667
$$ 500789 503027 506127 509458 512448 515594 520096 526427 533735 540817 547249 553232 558669 562952 565619
60127E65619J156k0j085k092k728k761k382j951j581j112l84N54J353J550J077
$$ 565619 566775 566755 565670 563578 560850 558089 555707 553756 552175 551063 550679 551233 552586 554136 555213
60112E55213N23N35R53J019N57L44Q91J471J050k33j317j702j847k113k290k343
$$ 555213 555736 556271 557224 558243 558800 559144 560035 561506 562556 562323 561006 559304 557457 555344 553054 550711
60096E50711k749l602m211m100l751l661l351k129m27O86J066J595K642L469L495
$$ 550711 547962 544360 540149 536049 532298 528637 525286 523157 522730 523416 524482 526077 528719 532188 535683
60081E35683L232L373L660L358K516J920J994K312K264J625L76j468l562n152
$$ 535683 538915 542288 545948 549306 551822 553742 555736 558048 560312 561937 562313 560845 557283 552131
60067E52131n674n321m805m602m679m810m867m801m596m360m306m534m900n200
$$ 552131 546457 541136 536331 531729 527050 522240 517373 512572 507976 503616 499310 494776 489876 484676
60053D84676n324n281n146n028m909m408l028q20J368K659L058L290L782M218
$$ 484676 479352 474071 468925 463897 458988 454580 451552 450732 452100 454759 457817 461107 464889 469107
60039D69107M174L831L770M302N205N986O180N570M360L080K155J534Q28k84j837
$$ 469107 473281 477112 480882 485184 490389 496375 502555 508125 512485 515565 517720 519254 520082 519798 517961
60024E17961l562n027n888o279o719p522q391q871q955q915q723q135p310o746
$$ 517961 514399 509372 503484 497205 490486 482964 474573 465702 456747 447832 439109 430974 423664 416918
60010D16918o476n839m426k816j912j820j832j365m44N91J424J733J409Q97R40
$$ 416918 410442 404603 400177 397361 395449 393629 391797 390432 389988 390579 392003 393736 395145 396042 396982
59995C96982J758K813L505L759L783L607L229K850K627K459K276K313K643K820
$$ 396982 398740 401553 405058 408817 412600 416207 419436 422286 424913 427372 429648 431961 434604 437424
59981D37424K467J991K028K331J951O52o25j036r38j267k209l079l299k978k602
$$ 437424 439891 441882 443910 446241 448192 448844 448219 447183 446245 444978 442769 439690 436391 433413 430811
59966D30811k456k458k309j883j431j281j281r16j61K51k37j153j551j205p31
$$ 430811 428355 425897 423588 421705 420274 418993 417712 416796 416635 416886 416649 415496 413945 412740 412009
59951D12009n92n34j43N40J158J554J876K296K765L016K851K399J956J506O88
$$ 412009 411417 410883 410740 411280 412438 413992 415868 418164 420929 423945 426796 429195 431151 432657 433345
59936D33345o15j908k622k787k844k960l004l000l102l111k602j637p91l55k5
$$ 433345 432730 430822 428200 425413 422569 419609 416605 413605 410503 407392 404790 403153 402362 402007 401982
59921D01982L70L47m60j432j479m42O70R09M42J24L63Q18J102J301J726K384K959
$$ 401982 402352 402699 402239 400807 399328 398886 399556 400465 400907 401031 401394 402212 403314 404615 406341 408725 411684
59904D11684L108K619J532L35j57M34J476J985J824J798K503L635M621N264N476
$$ 411684 414792 417411 418943 419278 419121 419555 421031 423016 424840 426638 429141 432776 437397 442661 448137
59889D48137M973L829K867K864L633M399M813N031N075M861M688M954N412N390
$$ 448137 453110 456939 459806 462670 466303 470702 475515 480546 485621 490482 495170 500124 505536 510926
59875E10926M743L975L345K521J263k01j641l116m629n932o876p507p663p083
$$ 510926 515669 519644 522989 525510 526773 526572 524931 521815 517186 511254 504378 496871 489208 482125
59861D82125o001n128m756m393l509k140n74J002K278K831K737K696L193L946
$$ 482125 476124 470996 466240 461847 458338 456198 455624 456626 458904 461735 464472 467168 470361 474307
59847D74307M432M475M050L097J945J316J429J602J229N62m7r93k660m310m737
$$ 474307 478739 483214 487264 490361 492306 493622 495051 496653 497882 498444 498397 497404 494744 490434 485697
59832D85697l866k759k136j729j128l50N56J655K601K675J693L31q09j932l478
$$ 485697 481831 479072 476936 475207 474079 473729 474285 475940 478541 481216 482909 483240 482431 480499 477021
59817D77021n310o842p646p589o728n436m313l573k828j838j156j391k078k033
$$ 477021 471711 464869 457223 449634 442906 437470 433157 429584 426756 424918 423762 422371 420293 418260
59803D18260q97L43O69K62k1N4l9o42j461k160k708l027k750j806q35n59q96j199
$$ 418260 417363 417706 418375 418637 418616 418670 418631 417989 416528 414368 411660 408633 405883 404077 403242 402683 401787 400588
59785D00588j222j326j710k003j773j084k89L53N89J17j031k137k305j348N8J086
$$ 400588 399366 398040 396330 394327 392554 391470 391181 391534 392123 392240 391209 389072 386767 385419 385477 386563
59769C86563J464J469J454J497J503J472J589J952K324K346K025J792J981K435
$$ 386563 388027 389496 390950 392447 393950 395422 397011 398963 401287 403633 405658 407450 409431 411866
59755D11866K731K669K355J962J578J324J347J627J916J964J806J717J898K284
$$ 411866 414597 417266 419621 421583 423161 424485 425832 427459 429375 431339 433145 434862 436760 439044
59741D39044K678K947L034K890K538K072J471N82m58j034p19pK36lP6O69R43M21
$$ 439044 441722 444669 447703 450593 453131 455203 456674 457256 456798 455764 455045 455038 455274 455271 455347 456016 456959 457380
59723D57380m7N09J705K398K271J855J358O12k5J46R92J653J882K270K941L083
$$ 457380 457333 457842 459547 461945 464216 466071 467429 468041 468016 468162 469154 470807 472689 474959 477900 480983
59707D80983K230J126P20J063J601J932J862J274M30k06o68j427k332k430j239
$$ 480983 483213 484339 485059 486122 487723 489655 491517 492791 493221 493015 492347 490920 488588 486158 484919
59692D84919M95J753K269K160J426L04o12j204j979k852k783j406l7Q2l96p8Q39
$$ 484919 485414 487167 489436 491596 493022 493326 492714 491510 489531 486679 483896 482490 482453 482535 482139 482061 482900
59675D82900R18j68j227j465j440j851k557l226l981m852n362n171m625m284m180
$$ 482900 483818 483650 482423 480958 479518 477667 475110 471884 467903 463051 457689 452518 447893 443609 439429
59660D39429l885l034j709m82rk93n41j04O86J082J072J311K083K996L609L724
$$ 439429 435544 432510 430801 430319 430310 430017 429476 429372 430058 431140 432212 433523 435606 438602 442211 445935
59644D45935L153J860L60o17r67j167j400j392j102q99r31q73m73J02N78Q06O92
$$ 445935 449088 450948 451308 450691 449724 448557 447157 445765 444663 443764 442833 441960 441487 441589 442167 442973 443665
59627D43665L46K61P78J434J442P60J26OJ66K98L59K04m22j347j982k073j885
$$ 443665 444011 444272 445050 446484 447926 448686 448812 448818 448984 449282 449641 449845 449423 448076 446094 444021 442136
59610D42136j581j017l18J49M82J254K552L630L931L725L368K538Q56j179k483
$$ 442136 440555 439538 439220 439369 439851 441105 443657 447287 451218 454943 458311 460849 461705 460526 458043
59595D58043k496j732j248j701k688l044k150q06l14p62r88l14N27N34k56j119
$$ 458043 455547 453815 452567 450866 448178 445134 442984 442178 441864 441102 440114 439800 440327 440861 440605 439486
59579D39486j656j895j931k032k631l688m389m073l117k356j950j398n33K08M55
$$ 439486 437830 435935 434004 431972 429341 425653 421264 417191 414074 411718 409768 408370 407837 408045 408500
59564D08500L28J53J43L69Q07J277J535J483J174P56M85O95J543K789L901M373
$$ 408500 408828 408981 409124 409493 410300 411577 413112 414595 415769 416525 417010 417705 419248 422037 425938 430311
59548D30311M068L402L007L013K854K161J576K027L335M408M940O055Q799J2724
$$ 430311 434379 437781 440788 443801 446655 448816 450392 452419 455754 460162 465102 471157 479956 492680
59534D92680J6468J9056J9932J8312J3671O921L52l937n313m458k486l02J608
$$ 492680 509148 528204 548136 566448 580119 587040 587392 583455 578142 573684 571198 570896 572504
59521E72504L092M126M714M965N053M941M332L042J271p46l066n747q373j0250
$$ 572504 575596 579722 584436 589401 594454 599395 603727 606769 608040 607294 604228 598481 590108 579858
59507E79858j1096j1279j1326j1354j1081j0234q875p405o241n521n077m648m102
$$ 579858 568762 557483 546157 534803 523722 513488 504613 497208 490967 485446 480369 475721 471619
59494D71619l498k975k484j703m51P97J235P72L15O05J256J481J439K000L352
$$ 471619 468121 465146 462662 460959 460508 461305 462540 463312 463627 464232 465488 466969 468408 470408 473760
59479D73760M677N273N290N270N710P153R761J2455J3406J1964R440P437O027
$$ 473760 478437 483710 489000 494270 499980 507133 516894 529349 542755 554719 564159 571596 577623
59466E77623M317K148K80q20j439j794j570n16J092K899M947P346R686J1267J1971
$$ 577623 581940 584088 584368 583548 582109 580315 578745 578229 579321 582220 587167 594513 604199 615466 627437
59451F27437J2547J3740J5376J6680J7397J8028J8734J8707J7139J4259J0726
$$ 627437 639984 653724 669100 685780 703177 721205 739939 758646 775785 790044 800770
59440H00770O419P49n966j2371j7348k0598k1958k1235j9005j6601j4824j3375
$$ 800770 807189 807938 801972 789601 772253 751655 729697 708462 689457 672856 658032 644657
59428F44657j1888j0706j0068r349p879n925m152k539n03K190N282Q469J1501
$$ 644657 632769 622063 611995 602646 594767 588842 584690 582151 581648 583838 589120 597589 609090
59415F09090J4045J6024J7967K0475K3440K6042K7408K6963K4300J9040J0973
$$ 609090 623135 639159 657126 677601 701041 727083 754491 781454 805754 824794 835767
59404H35767N53j0598j9968k5568k7066k5200k0452j3253n193J275M650M859J773
$$ 835767 836320 825722 805754 780186 753120 727920 707468 694215 689022 690297 694947 699806 701579
59391G01579n122j4745k3600k8349k8631k6366k3112j9329j5497j2351j0025q100
$$ 701579 696457 681712 658112 629763 601132 574766 551654 532325 516828 504477 494452 486352
59379D86352o469n353m546l573k509j849j607j267o18L0M53P54J093J571K221
$$ 486352 479883 474530 469984 466411 463902 462053 460446 459179 458561 458591 459044 459798 460891 462462 464683
59364D64683K739K652K167K228L232M255M392M150M597N707O689P484Q672J0147
$$ 464683 467422 470074 472241 474469 477701 481956 486348 490498 495095 500802 507491 514975 523647 533794
59350E33794J1228J1972J3199J5091J6889J8082J8939J9758K0500K1174K1662
$$ 533794 545022 556994 570193 585284 602173 620255 639194 658952 679452 700626 722288
59339G22288K1246J9315J6511J3970J1495P795K743k104n670q634j1854j4832
$$ 722288 743534 762849 779360 793330 804825 812620 815363 813259 807589 798955 787101 772269
59327G72269j6754j7987j9390k0770k1130k0094j8194j6074j4167j2813j2002
$$ 772269 755515 737528 718138 697368 676238 656144 637950 621876 607709 594896 582894
59316E82894j1087r504p627o326n755n156l827j784N93L021N215O647O852N933
$$ 582894 571807 562303 554676 548350 542595 537439 533612 531828 532421 535442 540657 547304 554156 560089
59302E60089M535L092J303j362m586p143q146p934p412o861o007m821l608k426
$$ 560089 564624 567716 569019 567657 563071 555928 547782 539848 532436 525575 519568 514747 511139 508713
59288E08713j122J42R88J408J682J811J689J667K222L127L722L981M462N189N644
$$ 508713 507591 507733 508721 510129 511811 513622 515311 516978 519200 522327 526049 530030 534492 539681 545325
59273E45325N953O995Q942J0683J1384J1670J2557J3862J4518J3967J2473J0373
$$ 545325 551278 558273 567215 577898 589282 600952 613509 627371 641889 655856 668329 678702
59261F78702P784M934K147o01l633p067j0523j3286j4659j4377j2953j1403j0452
$$ 678702 686486 691420 693567 692966 689333 682266 671743 658457 643798 629421 616468 605065 594613
59248E94613j0042r685r023q040o902n737m434k775q80P29J850K999M598O134
$$ 594613 584571 574886 565863 557823 550921 545184 540750 537975 537095 537824 539674 542673 547271 553405
59234E53405O906P296Q249R614J0123R175P545N902L794P27k654n317p128q647
$$ 553405 560311 567607 575856 585470 595593 604768 612313 618215 622009 622736 620082 614765 607637 598990
59220E98990j0135j1437j2394j2762j2137j0551q795p623o990o483o022n600m886
$$ 598990 588855 577418 565024 552262 540125 529574 520779 513156 506166 499683 493661 488061 483175
59207D83175l781k958l092l787l980l253k160j341r25o84l66J67Q08J299J634
$$ 483175 479394 476436 473344 469557 465577 462324 460164 458823 457898 457214 456848 457015 457823 459122 460756
59192D60756K121K836L411L641L865M375M889N081N142N297N211M576L937M057
$$ 460756 462877 465713 469124 472765 476630 481005 485894 490975 496117 501414 506625 511201 515138 519195
59178E19195M703M799L874K593J805J667J880K287K965M026N440O906P921Q330
$$ 519195 523898 528697 532571 535164 536969 538636 540516 542803 545768 549794 555234 562140 570061 578391
59164E78391Q669R624J1094J2165J2073J0894R221P418N391K971L52k000l944
$$ 578391 587060 596684 607778 619943 632016 642910 652131 659549 664940 667911 668263 666263 662319
59151F62319n940q378j0744j1961j1733j0954j0551j0432j0001r190q352p562
$$ 662319 656379 648001 637257 625296 613563 602609 592058 581626 571625 562435 554083 546521
59139E46521o731o112o050o217n892m992m167l800l464k728j920j681k010k197
$$ 546521 539790 533678 527628 521411 515519 510527 506360 502560 499096 496368 494448 492767 490757 488560
59125D88560j655n34N74J329J878K474L112L676M255N041N930O579O887P131P510
$$ 488560 486905 486371 486945 488274 490152 492626 495738 499414 503669 508710 514640 521219 528106 535237 542747
59110E42747P899Q199Q553R013R284R064Q432P626O706N720M980M792N000N077
$$ 542747 550646 558845 567398 576411 585695 594759 603191 610817 617523 623243 628223 633015 638015 643092
59096F43092M669L847K886J971J080J22q58j595j857j687j269o47J13N37jj557
$$ 643092 647761 651608 654494 656465 657545 657667 656809 655214 653357 651670 650401 649754 649867 650404 650403 648846
59080F48846l501n188o440p335p926q298q613q939r291r719r987r395p530n229
$$ 648846 645345 640157 633717 626382 618456 610158 601545 592606 583315 573596 563609 554214 546684 541455
59066E41455m015m392n333n638n145m363l578k821k158j642j303j331j829k308
$$ 541455 537440 533048 527715 522077 516932 512569 508991 506170 504012 502370 501067 499736 497907 495599
59052D95599k146j580j467j912k071j589j169j282j392j068p93q36m58P96K015
$$ 495599 493453 491873 490406 488494 486423 484834 483665 482383 480991 479923 479130 478294 477836 478632 480647
59037D80647K206J818J823K042J767J365J752K690L089K860K995L818M544M769
$$ 480647 482853 484671 486494 488536 490303 491668 493420 496110 499199 502059 505054 508872 513416 518185
59023E18185N102N971O950P625Q254R142J0043J0573J0623J0211R451Q636P847
$$ 518185 523287 529258 536208 543833 552087 561229 571272 581845 592468 602679 612130 620766 628613
59010F28613O520M169J399n61j294j388j311r52k64O00J821L698N789P285Q249
$$ 628613 635133 639302 640701 640140 638846 637458 636147 635195 634931 635531 637352 641050 646839 654124 662373
58995F62373R451J0808J1146R949Q276P380P298P315P003O186M556K080p31l444
$$ 662373 671824 682632 693778 703727 712003 719383 726681 733996 740999 747185 751741 753821 753090 749646
58981G49646o066q470j0048j0475j0217r777q977p545n847m386l026j318O45K382
$$ 749646 743580 735110 725062 714587 704370 694593 685616 678071 672224 667838 664812 663494 664139 666521
58967F66521L755N085O593Q149R499J0444J0928J1156J1461J1965J2457J2626
$$ 666521 670276 675361 681954 690103 699602 710046 720974 732130 743591 755556 768013 780639
58955G80639J2015R899N903Q80l490o422q731j1436j4260j6118j6601j6251j5622
$$ 780639 792654 802553 808456 809336 805846 799424 790693 779257 764997 748879 732278 716027 700405
58942G00405j4740j3484j1964j0399q903p431n841m138k697k048k300l039l897
$$ 700405 685665 672181 660217 649818 640915 633484 627643 623505 620808 618760 616460 613421 609524
58929F09524m841n797o403o444o135n696m973l822k573j745j570j969k661l058
$$ 609524 604683 598886 592483 586039 579904 574208 569235 565413 562840 561095 559525 557556 554895 551837
58915E51837k470q77Q43J894K404K886L320L403L452M221N864P774R495J1120
$$ 551837 549367 548490 549333 551227 553631 556517 559837 563240 566692 570913 576777 584551 594046 605166
58901F05166J2716J4032J5034J6086J7210J7706J7108J6018J5367J5073J4273
$$ 605166 617882 631914 646948 663034 680244 697950 715058 731076 746443 761516 775789
58890G75789J2821J1798J2222J4000J6472J9458K3050K6709K9331L0208K9370
$$ 775789 788610 800408 812630 826630 843102 862560 885610 912319 941650 971858 1001228
58879A001228K7051K3344J8511J3127P700K460k591p766j3722k0641k7275l1654
$$ 1001228 1028279 1051623 1070134 1083261 1090961 1093421 1090830 1083064 1069342 1048701 1021426 989772
58867I89772l3041l2581l1748l0775k9016k6135k2472j8854j6401j5781j6149
$$ 989772 956731 924150 892402 861627 832611 806476 784004 765150 748749 732968 716819
58856G16819j5672j3788j1974j1555j1769j1252j0395j0592j1665j1880j0481
$$ 716819 701147 687359 675385 663830 652061 640809 630414 619822 608157 596277 585796
58845E85796q569p205o168n042m194l959l892l503k943k529k270k227k617l215
$$ 585796 577227 570022 563854 558812 554618 550659 546767 543264 540321 537792 535522 533295 530678 527463
58831E27463l400l115l030l393l551k996k139j528j025k50O89J358J467R77K57
$$ 527463 524063 520948 517918 514525 510974 507978 505839 504311 503286 503036 503725 505083 506550 507527 507784
58816E07784J74J323L072M145M249M222M492M537M138L880L910L391J968O41K90
$$ 507784 507958 509281 512353 516498 520747 524969 529461 533998 538136 542016 545926 549317 551285 551926 552216
58801E52216L75l2p76j214j441j886k317k282k030k051k225k289k531l076l143
$$ 552216 552591 552559 551783 550569 549128 547242 544925 542643 540613 538562 536337 534048 531517 528441 525298
58786E25298k045m30O40J321K502M065M982M996M886N024M887M194L415K860K174
$$ 525298 523253 522823 523463 524784 527286 531351 536333 541329 546215 551239 556126 560320 563735 566595 568769
58771E68769J140J03p64j829l221m278m315l504k634k238k307k566k777k835k737
$$ 568769 569909 570012 569248 567419 564198 559920 555605 552101 549467 547229 544922 542356 539579 536744 534007
58756E34007k420j784r59l44j00L10J597L739N854P003O943O090N016M065L355
$$ 534007 531587 529803 528844 528500 528400 528710 530307 534046 539900 546903 553846 559936 564952 569017 572372
58741E72372L038L366M217M888M784M232M019M227M256M011M073M528M664M259
$$ 572372 575410 578776 582993 587881 592665 596897 600916 605143 609399 613410 617483 622011 626675 630934
58727F30934M104M648N157N080N083N749O158N170L391K419K522K589K175K073
$$ 630934 635038 639686 644843 649923 655006 660755 666913 672083 675474 677893 680415 683004 685179 687252
58713F87252K759L679M385N213O388P407P772P566O997N951M330K293l8k620n230
$$ 687252 690011 693690 698075 703288 709676 717083 724855 732421 739418 745369 749699 751992 751954 749334 744104
58698G44104p678j0167j2842j5114j6275j6609j6997j7411j6792j4678j1969r766
$$ 744104 736426 726259 713417 698303 682028 665419 648422 631011 614219 599541 587572 577806
58686E77806q256p105o249n728n347m907m462m104l888l975m420m825m711m167
$$ 577806 569550 562445 556196 550468 545121 540214 535752 531648 527760 523785 519365 514540 509829 505662
58672E05662l495k429n79J468K641L006L785N452P039P797Q336R408J0609J1156
$$ 505662 502167 499738 499159 500627 503268 506274 510059 515511 522550 530347 538683 548091 558700 569856
58658E69856J1025J0358Q609N410J711j048k551l353l525k711j372o83j078j885
$$ 569856 580881 591239 599848 605258 606969 605921 603370 600017 596492 593781 592409 591726 590648 588763
58644E88763k568l359m313m740m101k838j759j082o44n18p62p78K72K359M398
$$ 588763 586195 582836 578523 573783 569682 566844 565085 564003 563359 562841 562079 561301 561573 563932 568330
58629E68330N342N148M509L996L649L184K355J204J89j00M68J414K268L180M626
$$ 568330 573672 578820 583329 587325 590974 594158 596513 597717 597906 597806 598274 599688 601956 605136 609762
58614F09762O672Q905J0986J2774J3954J4091J3244J1939J0339P945M467N99k575
$$ 609762 616434 625339 636325 649099 663053 677144 690388 702327 712666 720611 725078 725677 723102
58601G23102m607n786o575p308q121q745q689p987p403p412p450o785n706n006
$$ 723102 718495 712709 706134 698826 690705 681960 673271 665284 657881 650469 643019 636234 630528 625522
58587F25522m571l427j237J164K948M217N529P123Q977J1052J2960J3785J2829
$$ 625522 620951 617524 616287 617451 620399 624616 630145 637268 646245 657297 670257 684042 696871
58574F96871J0453P905O276N685N491N139M747M826N596O890Q626J0842J3164
$$ 696871 707324 715229 721505 727190 732681 737820 742567 747393 752989 759879 768505 779347 792511
58561G92511J4903J6048J7499J9711K1755K2386K1600K0125J7941J4437R945N798
$$ 792511 807414 823462 840961 860672 882427 904813 926413 946538 964479 978916 988861 994659
58549I94659K611l61l739o734q069p537o165n120m930n479o417p625r340j1658
$$ 994659 997270 996909 993170 986436 978367 970830 964665 959545 954615 949136 942719 935094 925754 914096
58535I14096j4032j5674j6373j6520j6361j5819j4900j3726j2057r496o312l450
$$ 914096 900064 884390 868017 851497 835136 819317 804417 790691 778634 769138 762826 759376
58523G59376j487r7J270K650L721M316M505M513M600M760M577L786K810K280K151
$$ 759376 757889 757792 759062 761712 765433 769749 774254 778767 783367 788127 792704 796490 799300 801580 803731
58508H03731J935J622J635J892J765J037Q9r90k539m317n293m983m242m159m738
$$ 803731 805666 807288 808923 810815 812580 813617 813706 812716 810177 805860 800567 795584 791342 787183 782445
58493G82445n175n030m551m241m445n099n565n080l606j950q54l48k1N62J871
$$ 782445 777270 772240 767689 763448 759003 753904 748339 743259 739653 737703 736849 736501 736480 737042 738913
58478G38913M185P060R516J1037J1947J2602J2842J2381J1187R165O043J988k146
$$ 738913 743098 750158 759674 770711 782658 795260 808102 820483 831670 840835 846878 848866 846720
58465H46720n558q053r628j0039r170p505n828m657m032l440j995P67M088O592
$$ 846720 841162 833109 823481 813442 804272 796767 790939 786282 782250 778810 776815 777582 781670 788262
58451G88262P825Q525R262R537Q655O714M238J392j775m793p091q546r291r127
$$ 788262 796087 804612 813874 823411 832066 838780 843018 844410 842635 837842 830751 822205 812914 803787
58437H03787p716n293k882j540j370j313j75J979L855M610M886N689O920P893
$$ 803787 796071 790778 787896 786356 784986 783673 783498 785477 789332 793942 798828 804517 811437 819330
58423H19330Q804J0449J2730J4634J5643J5941J5286J2997R326N612K781O88r56
$$ 819330 828134 838583 851313 865947 881590 897531 912817 925814 935140 940752 943533 944221 943265
58410I43265k190l434n208o908p337o771p011q818j0829j1602j1282j0403q668
$$ 943265 941075 937641 932433 925525 918188 911417 904406 895588 884759 873157 861875 851472 842804
58397H42804o018l529k022q73O91K138K674K651K830L073K927K589K229J334j28
$$ 842804 836786 833257 831235 830362 831053 833191 835865 838516 841346 844419 847346 849935 852164 853498 853370
58382H53370q81pJ501K157K109K399K871K529J461P99R54J303J631K508M153N841
$$ 853370 852489 852482 853983 856140 858249 860648 863519 866048 867509 868308 869262 870565 872196 874704 878857 884698
58366H84698O712O577O014O058P411R614J1502J2720J3974J5440J6164J5712J5019
$$ 884698 891410 897987 904001 910059 917470 927084 938586 951306 965280 980720 996884 1012596 1027615
58353A027615J4685J3701J1112P755M989K883J036O6O02J727K184K344L290M676
$$ 1027615 1042300 1056001 1067113 1074868 1079857 1082740 1083776 1083842 1084444 1086171 1088355 1090699 1093989 1098665
58339A098665N406N787P092R348J1333J2559J3564J4534J5207J5898J7056J8068
$$ 1098665 1104071 1109858 1116950 1126298 1137631 1150190 1163754 1178288 1193495 1209393 1226449 1244517
58327A244517J8019J7277J6751J5995J3796J0413P428N571M322L514L529M010
$$ 1244517 1262536 1279813 1296564 1312559 1326355 1336768 1344196 1349767 1354089 1357603 1361132 1365142
58315A365142M073L873M328N387O128O541P493R032J0412J1752J3850J6355J7851
$$ 1365142 1369215 1373088 1377416 1382803 1388931 1395472 1402965 1411997 1422409 1434161 1448011 1464366 1482217
58302A482217J8016J8019J8582J9254J9712K0193K0431J9763J8490J7722J7711
$$ 1482217 1500233 1518252 1536834 1556088 1575800 1595993 1616424 1636187 1654677 1672399 1690110
58291A690110J7789J7830J8387J9395K0298K1276K2811K4328K4945K5277K6573
$$ 1690110 1707899 1725729 1744116 1763511 1783809 1805085 1827896 1852224 1877169 1902446 1929019
58280A929019K8397K9268K9415L0534L2908L5087L6598L8507M0972M2708M3442
$$ 1929019 1957416 1986684 2016099 2046633 2079541 2114628 2151226 2189733 2230705 2273413 2316855
58269B316855M4574M6718M8755N0089N1695N4197N6883N9324O2101O5297O8088
$$ 2316855 2361429 2408147 2456902 2506991 2558686 2612883 2669766 2729090 2791191 2856488 2924576
58258B924576P0427P3215P6282P8216P8675P8995P9974Q1063Q2150Q4071Q6882
$$ 2924576 2995003 3068218 3144500 3222716 3301391 3380386 3460360 3541423 3623573 3707644 3794526
58247C794526Q9699R2673R7039J02920J09252J16059J24409J33916J42860J51078
$$ 3794526 3884225 3976898 4073937 4176857 4286109 4402168 4526577 4660493 4803353 4954431
58237D954431J60110J70271J80401J90749K02962K16815K30219K43131K58128
$$ 4954431 5114541 5284812 5465213 5655962 5858924 6075739 6305958 6549089 6807217
58228F807217K76370K96300L17178L40397L66465L94112M23352M56041M92614
$$ 6807217 7083587 7379887 7697065 8037462 8403927 8798039 9221391 9677432 10170046
58219A0170046N31865N74587O23544O79260P40038Q06687Q82522R67932J060169
$$ 10170046 10701911 11276498 11900042 12579302 13319340 14126027 15008549 15976481 17036650
58210A7036650J159583J270722J396180J535455J691814J874304K091016K346225
$$ 17036650 18196233 19466955 20863135 22398590 24090404 25964708 28055724 30401949
58202C0401949K646157L001554L423236L922543M518751N240135O117664P186816
$$ 30401949 33048106 36049660 39472896 43395439 47914190 53154325 59271989 66458805
58194F6458805Q497992J0119780J2137725J4663944J7838122K1772629K6427727
$$ 66458805 74956797 85076577 97214302 111878246 129716368 151488997 177916724
58187A77916724L1440841L5938627L8436745L7090056L0492712J8719619L780971
$$ 177916724 209357565 245296192 283732937 320822993 351315705 370035324 373816295
58180C73816295j1107837k3047624l0639104l4065664l4345451l2570540k9597591
$$ 373816295 362708458 339660834 309021730 274956066 240610615 208040075 178442484
58173A78442484k6059406k2415071j8963111j5868811j3205743j0979400r145171
$$ 178442484 152383078 129968007 111004896 95136085 81930342 70950942 61805771
58166F1805771p641089o414032n418128m606350l938009l387199k934827k559148
$$ 61805771 54164682 47750650 42332522 37726172 33788163 30400964 27466137 24906989
58158B4906989k241130j971358j743749j548116j375164j222850j091365r76617
$$ 24906989 22665859 20694501 18950752 17402636 16027472 14804622 13713257 12736640
58150A2736640q74080p84108p07806o41820n82252n29793m86138m48848m14338
$$ 12736640 11862560 11078452 10370646 9728826 9146574 8616781 8130643 7681795 7267457
58141G267457l82707l55353l30773l06785k84256k64780k47189k29727k13313
$$ 7267457 6884750 6529397 6198624 5891839 5607583 5342803 5095614 4865887 4652574
58132D652574j99369j86830j74311j62826j53380j44361j34363j25160j18788
$$ 4652574 4453205 4266375 4092064 3929238 3775858 3631497 3497134 3371974 3253186
58123C253186j13899j08178j02171r7617r3910q9499q5025q1894p9214p5252p0655
$$ 3253186 3139287 3031109 2928938 2831321 2737411 2647912 2562887 2480993 2401779 2326527 2255872
58112B255872o7285o5004o2384n9497n7251n5009n1588m7828m5509m4466m3165
$$ 2255872 2188587 2123583 2061199 2001702 1944451 1889442 1837854 1790026 1744517 1700051 1656886
58101A656886m1433m0240l9378l7707l5279l3093l1144k8699k6058k4237k3315
$$ 1656886 1615453 1575213 1535835 1498128 1462849 1429756 1398612 1369913 1343855 1319618 1296303
58090A296303k2788k2857k3686k4147k3099k1298k0236j9817j9022j8097j8033
$$ 1296303 1273515 1250658 1226972 1202825 1179726 1158428 1138192 1118375 1099353 1081256 1063223
58079A063223j8521j8461j7969j7880j7836j6999j6201j6976j8691j9024j7467
$$ 1063223 1044702 1026241 1008272 990392 972556 955557 939356 922380 903689 884665 867198
58068H67198j6030j6086j6615j6215j4909j3251j1310r382q317q336q542q244
$$ 867198 851168 835082 818467 802252 787343 774092 762782 753400 745083 736747 728205 719961
58056G19961p824p844q212q729r533j0536j1168j1029j0254r111p844o836o226
$$ 719961 712137 704293 696081 687352 677819 667283 656115 645086 634832 625721 617877 611041 604815
58043F04815n468m127k949l111m435n455n389m945m907m993m579l782l306l666
$$ 604815 599347 595220 592271 589160 584725 579270 573881 568936 564029 559036 554457 550675 547369 543703
58029E43703m832o243p188p533p919q756r379q933p737o836o483o086n545n428
$$ 543703 538871 532628 525440 517907 509988 501232 491853 482920 475183 468347 461864 455778 450233 444805
58015D44805n755n729m945l933l236k871k826l221l688l503k624j822j488j148
$$ 444805 439050 433321 428376 424443 421207 418336 415510 412289 408601 405098 402474 400652 399164 398016
58001C98016m44J73J82k86q37j339j764k055k404l071l711l502k252p84N4K53
$$ 398016 397572 397745 397927 397641 396804 395465 393701 391646 389242 386171 382460 378958 376706 375922 375976 376229
57985C76229K80M96J045J815K201J582K03r17j219j102j092j133j036q77o51j04
$$ 376229 376509 377005 378050 379865 382066 383648 383851 382934 381715 380613 379521 378388 377352 376475 375824 375720
57969C75720O93J212J256J245J406J283N71k66o32n41j92O33K020L242L327K159
$$ 375720 376413 377625 378881 380126 381532 382815 383386 383120 382488 381947 381755 382388 384408 387650 390977 393136
57953C93136N04q93j791k270k530k785k985k870k481k287k433k306j411k70J68
$$ 393136 393640 392747 390956 388686 386156 383371 380386 377516 375035 372748 370315 368009 366598 366328 366496
57938C66496p9k4R55K361L397L965M548N404O281O799O827O412N567M255K618
$$ 366496 366417 366393 367348 369709 373106 377071 381619 387023 393304 400103 406930 413342 418909 423164 425782
57923D25782J062l9p40j436k332l218l870m458n270o150o498n983n014m354m339
$$ 425782 426844 426805 426065 424629 422297 419079 415209 410751 405481 399331 392833 386850 381836 377482 373143
57908C73143m576m440l602k207p94j84r57k680l990m024l544l888m967n321m331
$$ 373143 368567 364127 360525 358318 357524 357340 356383 353703 349713 345689 342145 338257 333290 327969 323638
57893C23638l215l186l681l386k306j575j588j656j350r71o04J26R94J006j41
$$ 323638 320423 317237 313556 310170 307864 306289 304701 303045 301695 300724 300120 300246 301240 302246 302105
57878C02105j319j365o23l95j224k376k886k636k366k761l556l745k869j835j834
$$ 302105 300786 299421 298798 298403 297179 294803 291917 289281 286915 284154 280598 276853 273984 272149 270315
57863B70315k694l048k155o79M98J283J884K189K247K538L246L780L739L712M400
$$ 270315 267621 264573 262418 261739 262237 263520 265404 267593 269840 272378 275624 279404 283143 286855 291255
57848B91255N444N893N518M905M424L885L104K270J660J361J252R92K48q27j603
$$ 291255 296699 302592 308110 313015 317439 321324 324428 326698 328358 329719 330971 331963 332211 331384 329781
57833C29781j822j940k300k460j979j342j236j352q63R2M66o9n94l34K70M10L2
$$ 329781 327959 326019 323719 321259 319280 317938 316702 315350 314487 314579 315045 314976 314382 314048 314318 314728 314760
57816C14760l87p03j118j644k093k452k859l347l840m263m451m207l701l524l978
$$ 314760 314373 313670 312552 310908 308815 306363 303504 300157 296317 292054 287603 283396 279695 276171 272193
57801B72193m578m586l926l097k370j552o19jj1k73j37N67J408J880J796J249
$$ 272193 267615 263029 259103 256006 253636 252084 251465 251464 251453 251180 251043 251610 253018 254898 256694 257943
57785B57943M89j32l34j06L36Q65J487K064K254J932J517J639K456L496M128M142
$$ 257943 258432 258300 257966 257860 258196 259061 260548 262612 264866 266798 268315 269954 272410 275906 280034 284176
57769B84176L769L327K849K116J018k23j306k234l225m173m630m465m230m524
$$ 284176 287945 291272 294121 296237 297255 297032 295726 293492 290267 286094 281464 276999 272769 268245
57755B68245n170n465n142m671m542m672m680m468m241m068l675k793j624p95
$$ 268245 263075 257610 252468 247797 243255 238583 233903 229435 225194 221126 217451 214658 213034 212239
57741B12239o78r47j007p77o94q92r36n33p4p7n10j003j320j294o95K79R04Q43
$$ 212239 211561 210614 209607 208830 208136 207244 206308 205775 205701 205624 205114 204111 202791 201497 200802 201081 201985 202828
57723B02828P32J113J373O69m54o36K32P76J73q02j189j149j220j237q28l31l69
$$ 202828 203560 204673 206046 206715 206261 205625 205857 206633 206806 206004 204815 203666 202446 201209 200381 200050 199681
57706A99681r43j579k045k334k324j937j339n78N22J721K158J447M79M17J110
$$ 199681 198738 197159 195114 192780 190456 188519 187180 186602 187124 188845 191003 192450 192929 193346 194456
57691A94456J335M61q22j487j313q43n85m72r1O78J375J533J386J596K317L123
$$ 194456 195791 196252 195430 193943 192630 191787 191202 190730 190639 191317 192692 194225 195611 197207 199524 202647
57675B02647L916N195P113R078J0703J2514J5201J8855K3422K9087L5217L9523
$$ 202647 206563 211758 218871 227949 238652 251166 266367 285222 308644 337731 372948 412471
57663D12471L9377L3842K3848J0844l606j7254k7590l3326l4916l3523l0184k5956
$$ 412471 451848 485690 509538 520382 516776 499522 471932 438606 403690 370167 339983 314027
57651C14027k1931j8557j5462j2304r506p788p278p291o919n707l912k246j279
$$ 314027 292096 273539 258077 245773 236267 228479 221201 213910 206991 201284 197372 195126 193847
57638A93847j051j222j398j251o15L50J277J976K405K325J503L13m91q30j363
$$ 193847 192796 191574 190176 188925 188310 188660 189937 191913 194318 196643 198146 198459 197968 197138 195775
57623A95775k158k239j090K84O84L47K09K62j40p94q29j99K82K71J22j98j055
$$ 195775 193617 191378 190288 190572 191256 191603 191812 192074 191934 191140 190311 190112 190394 190665 190787 190589 189534
57606A89534j967j843p38rl41q04n26j17n60j634k389k492k256j803j085l95j57
$$ 189534 187567 185724 184986 184977 184636 183832 183306 183189 182629 180995 178606 176114 173858 172055 170970 170575 170418
57589A70418l45o40r25j204j358j404j633k056k137j537p64n17p12p56n19l72
$$ 170418 170073 169433 168508 167304 165946 164542 162909 160853 158716 157179 156415 155898 155186 154430 153911 153539
57573A53539l98k60P8J15m59j181j332p68o0J90m3l40l47m5M27R00J115Q64L99
$$ 153539 153141 152881 152959 153074 152615 151434 150102 149334 149274 149464 149421 149081 148734 148689 149116 150016 151131 151995 152394
57554A52394L24P79J078N92k60m97J42R98J455J486J192N90o8l26j23J58L51P33
$$ 152394 152718 153497 154575 155167 154907 154410 154552 155550 157005 158491 159683 160273 160205 159879 159756 159914 160265 160998
57536A60998J377J889J984J821J555J062L92k9kM9l06q64j043n42M42J391J747
$$ 160998 162375 164264 166248 168069 169624 170686 171078 171049 171047 171096 170790 169926 168883 168341 168783 170174 171921
57519A71921J376R09J126J937K414K013J243Q37P85O00J10l97o00m53k43l79q77
$$ 171921 173297 174206 175332 177269 179683 181696 182939 183776 184561 185161 185271 184874 184274 183821 183578 183199 182322
57502A82322j077m13N60O29n09j824k409k539k828l128k948k381j891j532j084
$$ 182322 181245 180832 181392 182021 181512 179688 177279 174740 171912 168784 165836 163455 161564 160032 158948
57487A58948o88o96j082j438j461j073l05M99P60L87J09N95J421J535O32n06r96
$$ 158948 158260 157564 156482 155044 153583 152510 152205 152704 153464 153851 153960 154555 155976 157511 158143 157637 156641
57470A56641p05j23K61K62l4m20o66n64L7J011J875K193J999J618J151N93K80
$$ 156641 155936 155813 156074 156336 156302 155882 155216 154652 154689 155700 157575 159768 161767 163385 164536 165129 165409
57453A65409O02J271J521J154P38O07M04r6m57l28m5l9k15l33m47n17j71N98J086
$$ 165409 166011 167282 168803 169957 170695 171302 171706 171610 171153 170825 170780 170741 170526 170193 169746 169229 169058 169656 170742
57434A70742P97K23J32N63J071J455J661J447P86K30K65O63R65J136J225R71M14
$$ 170742 171539 171762 171894 172457 173528 174983 176644 178091 178877 179107 179372 180035 181000 182136 183361 184332 184746
57417A84746K72Q88J404R07r4m38j54l19j182j649r11M57J351J373Q78L93L31
$$ 184746 185018 185906 187310 188217 188123 187685 187531 187212 186030 184381 183470 183927 185278 186651 187529 187922 188253
57400A88253Q67J771K532K775K423J635Q52O12R70J308J081N25K43M40R50J639
$$ 188253 189120 190891 193423 196198 198621 200256 201108 201720 202690 203998 205079 205604 205847 206287 207237 208876
57384B08876K287K530K397K501L080L415K930K242K165K208J331j83r51n84j97
$$ 208876 211163 213693 216090 218591 221671 225086 228016 230258 232423 234631 235962 235779 234828 234244 234047
57369B34047n18p99j60R70J469R83J63j77K44R85J248P21J03L31J341K148K182
$$ 234047 233529 232730 232570 233540 235009 235992 236155 235978 236222 237207 238455 239176 239279 239610 240951 243099 245281
57352B45281J823J533J254R19R09J494K352K905K879K334J496P66N08O92J004
$$ 245281 247104 248637 249891 250810 251719 253213 255565 258470 261349 263683 265179 265945 266453 267145 268149
57337B68149J243J353J157O12J47J72L42k9q25j072k16J211K320K703K432J808
$$ 268149 269392 270745 271902 272514 272661 272833 273175 273146 272321 271249 271033 272244 274564 277267 279699 281507
57321B81507J278J139J234J318J573K149K492J962J086J132K285L287L159K397
$$ 281507 282785 283924 285158 286476 288049 290198 292690 294652 295738 296870 299155 302442 305601 307998
57307C07998J943J935K004K098K271K243J813J375J391J734J941J893J765J699
$$ 307998 309941 311876 313880 315978 318249 320492 322305 323680 325071 326805 328746 330639 332404 334103
57293C34103J808K251K933L398L344K992K738K696K745K745K623K538K926L966
$$ 334103 335911 338162 341095 344493 347837 350829 353567 356263 359008 361753 364376 366914 369840 373806
57279C73806N058N459N374N696O586P234P262P431Q375R427R446Q368P293P272
$$ 373806 378864 384323 389697 395393 401979 409213 416475 423906 432281 441708 451154 459522 466815 474087
57265D74087Q471J0204J1400J1422J0758J0521J1025J1332J0610R263Q234P701
$$ 474087 482558 492762 504162 515584 526342 536863 547888 559220 569830 579093 587327 595028
57253E95028P166O504O168O422O984P410P554P604P825Q231Q493Q396Q327Q870
$$ 595028 602194 608698 614866 621288 628272 635682 643236 650840 658665 666896 675389 683785 692112 700982
57239G00982R926J0793J1189J1504J1934J2142J2131J2635J4031J5490J5975J5525
$$ 700982 710908 721701 732890 744394 756328 768470 780601 793236 807267 822757 838732 854257
57227H54257J4972J4788J4867J5112J5527J5912J6082J6234J6644J7177J7580
$$ 854257 869229 884017 898884 913996 929523 945435 961517 977751 994395 1011572 1029152
57216A029152J7925J8427J9039J9672K0488K1475K2066K1736K0789J9988J9585
$$ 1029152 1047077 1065504 1084543 1104215 1124703 1146178 1168244 1189980 1210769 1230757 1250342
57205A250342J9164J8362J7308J6449J6250J6866J7855J8452J8387J8176J8290
$$ 1250342 1269506 1287868 1305176 1321625 1337875 1354741 1372596 1391048 1409435 1427611 1445901
57194A445901J8521J8592J8857J9797K1142K2164K2602K2699K2596K2346K2382
$$ 1445901 1464422 1483014 1501871 1521668 1542810 1564974 1587576 1610275 1632871 1655217 1677599
57183A677599K3184K4465K5319K5297K4819K4491K4479K4704K5146K5706K6140
$$ 1677599 1700783 1725248 1750567 1775864 1800683 1825174 1849653 1874357 1899503 1925209 1951349
57172A951349K6403K6849K7803K9023K9827K9918K9914L0734L2337L3482L3191
$$ 1951349 1977752 2004601 2032404 2061427 2091254 2121172 2151086 2181820 2214157 2247639 2280830
57161B280830L2168L2054L3382L5123L6304L7172L8337L9714M0950M2246M3926
$$ 2280830 2312998 2345052 2378434 2413557 2449861 2487033 2525370 2565084 2606034 2648280 2692206
57150B692206M5684M6943M7668M8191M8654M9169N0147N1770N3391N4253N4519
$$ 2692206 2737890 2784833 2832501 2880692 2929346 2978515 3028662 3080432 3133823 3188076 3242595
57139C242595N4919N5566N5829N5281N4158N3040N2829N4924O0564O9622Q0320
$$ 3242595 3297514 3353080 3408909 3464190 3518348 3571388 3624217 3679141 3739705 3809327 3889647
57128C889647R0083R6432R7658R3776Q7173Q1634Q0135Q3411R0354R9215J08412
$$ 3889647 3979730 4076162 4173820 4267596 4354769 4436403 4516538 4599949 4690303 4789518 4897930
57117D897930J16883J24264J30952J38061J47235J59894J76174J94769K14260
$$ 4897930 5014813 5139077 5270029 5408090 5555325 5715219 5891393 6086162 6300422
57108F300422K34541K56846K82891L14413L53200M00900M58951N29280O14872
$$ 6300422 6534963 6791809 7074700 7389113 7742313 8143213 8602164 9131444 9746316
57099I746316P19249Q45653R97509J179405J396789J654501J955965K303430K697507
$$ 9746316 10465565 11311218 12308727 13488132 14884921 16539422 18495387 20798817 23496324
57090B3496324L135033L606389M093920M572053N009142N370857N624162N740505
$$ 23496324 26631357 30237746 34331666 38903719 43912861 49283718 54907880 60648385
57082F0648385N697409N478683N074454M483167L716378K802562J783767P04906
$$ 60648385 66345794 71824477 76898931 81382098 85098476 87901038 89684805 90389711
57074I0389711l95304j483062k521054l464905m270377m904591n351221n608094
$$ 90389711 89994407 88511345 85990291 82525386 78255009 73350418 67999197 62391103
57066F2391103n682991n592181n360771n021538m610875m163331l707521l265010
$$ 62391103 56708112 51115931 45755160 40733622 36122747 31959416 28251895 24986885
57058B4986885k851170k475800k143160j852823j601833j386571j203158j047313
$$ 24986885 22135715 19659915 17516755 15663932 14062099 12675528 11472370 10425057
57050A0425057r14816q02104p06108o23737n52060m88971m33406l84868l42870
$$ 10425057 9510241 8708137 8002029 7378292 6826232 6337261 5903855 5518987 5176117
57041E176117l06665k75196k47298k22061j98846j76758j54481j31377j08945
$$ 5176117 4869452 4594256 4346958 4124897 3926051 3749293 3594812 3463435 3354490
57032C354490r0512p8788p3831p3798p7273q3816r2258r9754j03608j03414j00485
$$ 3354490 3263978 3185190 3111359 3037561 2960288 2876472 2784214 2684460 2580852 2477438 2376953
57021B376953r5680q8991q0978p3087o6154n9742n3447m7836m3452l9882l6528
$$ 2376953 2281273 2192282 2111304 2038217 1972063 1912321 1858874 1811038 1767586 1727704 1691176
57010A691176l3580l1386k9556k7550k5648k4474k3942k3425k2665k1781k0720
$$ 1691176 1657596 1626210 1596654 1569104 1543456 1518982 1495040 1471615 1448950 1427169 1406449
56999A406449j9433j8218j7274j6266j4990j4004j3807j3801j2987j1328r533
$$ 1406449 1387016 1368798 1351524 1335258 1320268 1306264 1292457 1278656 1265669 1254341 1244808
56988A244808p786n650l029k83K473N323P719Q553P045L132k691r239j4746j8075
$$ 1244808 1237022 1231372 1228343 1228060 1230533 1235856 1243575 1252128 1259173 1262305 1259614 1250375 1235629 1217554
56974A217554j9638k0388k0346j9094j7206j5716j4429j2202r028o326m829l569
$$ 1217554 1197916 1177528 1157182 1138088 1120882 1105166 1090737 1078535 1069507 1063181 1058352 1054783
56962A054783j483J263M205P724J2254J7003K0333K0969J8355J2504M225m795
$$ 1054783 1053300 1054563 1058768 1066492 1078746 1095749 1116082 1137051 1155406 1167910 1172135 1167340
56950A167340j2778j8743k2520k4331k4563k3591k1537j8429j4710j1162q280
$$ 1167340 1154562 1135819 1113299 1088968 1064405 1040814 1019277 1000848 986138 974976 966696
56939I66696n988l887j511J525N137Q795J2419J6833K2485K7958L0728K9297K3713
$$ 966696 960708 956821 955310 956835 961972 970767 983186 1000019 1022504 1050462 1081190 1110487 1134200
56926A134200J4447K215j0963k2067k9220l2668l3364l1688k8067k3810k0321
$$ 1134200 1148647 1150862 1139899 1117832 1088612 1055944 1022580 990892 962825 939015 918694
56915I18694j8031j6569j5454j4214j2527j0696r416q719p819o275m623l448k623
$$ 918694 900663 884094 868640 854426 841899 831203 821787 813068 805249 798974 794351 790903 788280
56902G88280j898j390j060m03P08J560J555J105J045J635K629L810N043O252P671
$$ 788280 786382 784992 783932 783529 784237 785797 787352 788457 789502 791137 793766 797576 802619 808871 816542
56887H16542R722J2402J5120J7114J7476J4967Q974Q67o659j1941j5169j6802
$$ 816542 826264 838666 853786 870900 888376 903343 912317 913184 906525 894584 879415 862613
56875H62613j6557j4491j1742r279o899m201j483J062M043P855J1904J5714J9927
$$ 862613 846056 831565 819823 810544 803645 799444 797961 799023 803066 810921 822825 838539 858466
56862H58466K5285L1535L8167M4982N0718N2173M6440L3731J6926r17j7444l0396
$$ 858466 883751 915286 953453 998435 1049153 1101326 1147766 1181497 1198423 1197506 1180062 1149666
56850A149666l8106m0660l9367l5189k8818k1730j5563j0388m968J246P648J4001
$$ 1149666 1111560 1070900 1031533 996344 967526 945796 930233 919845 914877 916123 923771 937772
56838I37772K1040K9242L8285M8104N9260P1333Q1517Q5408P9188O1482L4230
$$ 937772 958812 988054 1026339 1074443 1133703 1205036 1286553 1371961 1451149 1512631 1546861
56827A546861K378k7993n2047o7380p3835p3055o7929o1166n3862m5765l6838
$$ 1546861 1549239 1521246 1469199 1401819 1327984 1254929 1187000 1125834 1071972 1026207 989369
56816I89369k7846j9445j1578l950L540J1105J9149K7807L6866M6073N4652O0154
$$ 989369 961523 942078 930500 926550 930090 941195 960344 988151 1025017 1071090 1125742 1185896
56804A185896N8704M7455K7051J669k3231m3328n6537o2716o2906n8826n2610
$$ 1185896 1244600 1292055 1319106 1320775 1297544 1254216 1197679 1134963 1072057 1013231 960621
56793I60621m6120l9997l3683k6705j9643j3471q390l853O20N303J0606J6737
$$ 960621 914501 874504 840821 814116 794473 781002 772612 768759 769379 774682 785288 802025
56781H02025K3005K8034L0594K9775K4731J5174K282j1553k3952l3228l8227l8690
$$ 802025 825030 853064 883658 913433 938164 953338 955620 944067 920115 886887 848660 809970
56769H09970l5919l2256k9281k6866k4136k0857j7619j5074j3330j1906j0189
$$ 809970 774051 741795 712514 685648 661512 640655 623036 607962 594632 582726 572537
56758E72537q128o402n618n464n094m238l433l141l214l302l286l144k851k546
$$ 572537 564409 558007 552389 546925 541831 537593 534160 531019 527805 524503 521217 518073 515222 512676
56744E12676k429k417k219j878j743j897j999j853j683j676j665j463j204j098
$$ 512676 510247 507830 505611 503733 501990 500093 498094 496241 494558 492882 491217 489754 488550 487452
56730D87452j118j079q97o18m11n32j080j693j734j015j10J79l12r59j047n09
$$ 487452 486334 485255 484358 483740 483329 482797 481717 480024 478290 477275 477165 477344 477032 476073 475026 474517
56714D74517J31N14Q00J100R35j56j630k287j750r45p12p42l02N15J000Q61L75
$$ 474517 474648 475162 475962 477062 477997 477841 476211 473924 472174 471229 470517 469775 469473 469988 470988 471849 472224
56697D72224k02p96j209j293j243j294j288j036q17r58j187r66l93j21n45j476
$$ 472224 472022 471226 470017 468724 467481 466187 464899 463863 463046 462088 460901 459935 459542 459421 458876 457400
56681D57400k473l045k731j595m49RL9L34Q70J029O97M29N11N62K49k34n36m98
$$ 457400 454927 451882 449151 447556 447107 447116 447155 447489 448359 449388 450085 450514 451025 451587 451836 451602 451066 450568
56663D50568m4P70J460J415O55j13l32j27J22K85M17N14N25M51L02N9l10q57j540
$$ 450568 450524 451294 452754 454169 454824 454711 454379 454252 454374 454659 455076 455590 456115 456566 456868 456927 456617 455760 454220
56644D54220k057k016j493j086j209j594j763j644j427j173r21q09p63m16K50
$$ 454220 452163 450147 448654 447568 446359 444765 443002 441358 439931 438758 437837 437028 436265 435849 436099
56629D36099O08K07m86p00k93M05J195J890J967J092l12j511k220k424j949r19
$$ 436099 436707 436914 436428 435728 435435 435840 437035 438925 440892 441984 441672 440161 437941 435517 433568 432649
56613D32649j49k89r17j176j022j030j304j500j624j982k458k629k476k243j853
$$ 432649 432500 432211 431294 430118 429096 428066 426762 425262 423638 421656 419198 416569 414093 411850 409997
56598D09997j215q02j114j777k058j978k065k210j816r59m19n90j179j869k443
$$ 409997 408782 407980 406866 405089 403031 401053 398988 396778 394962 394003 393584 392994 391815 389946 387503
56583C87503k377j283K75J215J187O60M2m92o21k60m8m44p23K9J235J520Q21M10
$$ 387503 385126 383843 384118 385333 386520 387180 387222 386730 386109 385849 385801 385357 384634 384663 385898 387418 388239 388649
56565C88649Q73J498J812K257L100L959M752N824O961P475P441P497P177N158
$$ 388649 389522 391020 392832 395089 398189 402148 406900 412724 419685 427160 434601 442098 449275 454433
56551D54433J639j148j651q53m86p86j091j499k549l878m519m232l658l353l312
$$ 454433 456072 454924 453273 452420 451934 451148 450057 448558 446009 442131 437612 433380 429722 426369 423057
56536D23057l266l029k696k665l069l265k548j389j043j814k632k643k212j953
$$ 423057 419791 416762 414066 411401 408332 405067 402519 401130 400087 398273 395641 392998 390786 388833
56522C88833j793j439r81m92J36N43m5j630l051l320k561j386j61P08P72L08K26
$$ 388833 387040 385601 384620 384128 384264 384807 384762 383132 380081 376761 374200 372814 372653 373361 374133 374441 374667
56505C74667P32J000N62mk49o12j306j554p87K95P38N91M10K34j27n58j047j937
$$ 374667 375399 376399 376961 376957 376708 376096 374790 373236 372449 372744 373482 374073 374483 374717 374590 374032 372985 371048
56487C71048l049l406k610j662j545j768j307k91K57p2q18j484j846j715j146
$$ 371048 367999 364593 361983 360321 358776 357008 355701 355410 355667 355595 354777 353293 351447 349732 348586
56472C48586o57o13o97m02K69R76J416J270M13n12m44O57J482R26o11j905k116
$$ 348586 347929 347316 346619 346217 346486 347462 348878 350148 350561 350049 349605 350262 351744 352670 352059 350154 348038
56455C48038j050Q39K284K054M72q45j197j503k292k457j141N60J056M94J02J79
$$ 348038 346988 347827 350111 352165 352637 351792 350595 349092 346800 344343 343202 343762 344818 345312 345414 345593
56439C45593J54M4L85J086J527J574J503J258P13K65K64L07k6k55J68P41O10n5
$$ 345593 345747 345791 346176 347262 348789 350363 351866 353124 353837 354102 354366 354673 354647 354392 354560 355301 355911 355856
56421C55856m38m47o06r14q56m04j04k71p47j223j294o27L80P20J62k42K68J009
$$ 355856 355418 354971 354365 353451 352595 352191 352087 351816 351069 349846 348552 347925 348305 349025 349187 348945 349213 350222
56403C50222J065P61P57O51k20j255j374p75n00o07k54N74R09L32m92r10q82n21
$$ 350222 351287 352048 352805 353456 353236 351981 350607 349832 349332 348725 348471 349045 349954 350286 349794 348884 348002 347481
56385C47481OK20j72o88p62p17j103j548j338p85p33r95n93N24J272J128Q08J013
$$ 347481 347487 347707 347535 346847 346085 345368 344265 342717 341379 340594 339861 338866 338273 338797 340069 341197 342005 343018
56367C43018J463J543J170P38O52J001J334J018J51l02J20N56J59m25k9J208K179
$$ 343018 344481 346024 347194 347932 348584 349585 350919 351937 352088 351786 351906 352462 352621 352196 352167 353375 355554
56350C55554K602L052L456K917J251n58j574j698j126m2R68J103L08n60o83pR73
$$ 355554 358156 361208 364664 367581 368832 368274 366700 365002 363876 363834 364802 365905 366213 365653 364970 364963 365936
56333C65936J682J883K007K713L795M060K882J271O23J037J644J923J821J192
$$ 365936 367618 369501 371508 374221 378016 382076 384958 386229 386852 387889 389533 391456 393277 394469
56319C94469K15k16L68J007N92l78n73O3L52k53j112j565j486q76R5Q29J012J278
$$ 394469 394684 394468 394836 395843 396435 396057 395484 395547 395899 395646 394534 392969 391483 390607 390702 391531 392543 393821
56301C93821K158K935K681J849J578J937K232K528L271L824L135J680J062J652
$$ 393821 395979 398914 401595 403444 405022 406959 409191 411719 414990 418814 421949 423629 424691 426343
56287D26343K245K138J938K120K302K290K511L000L129K701K289K325K768L685
$$ 426343 428588 430726 432664 434784 437086 439376 441887 444887 448016 450717 453006 455331 458099 461784
56273D61784N139O518P047O871O732O792O799P062P936Q738Q599Q106Q613J0145
$$ 461784 466923 473441 480488 487359 494091 500883 507682 514744 522680 531418 540017 548123 556736 566881
56259E66881J1562J2602J4039J5961J7582J8861K0656K3114K5560K8072L1492
$$ 566881 578443 591045 605084 621045 638627 657488 678144 701258 726818 754890 786382
56248G86382L5729L9737M3406M7714N2664N6854N9605O1870O4389O6465O7184
$$ 786382 822111 861848 905254 952968 1005632 1062486 1122091 1183961 1248350 1314815 1381999
56237A381999O6468O4352O0438N4678M7565L9206K9286J8203O953m161j5401k6133
$$ 1381999 1448467 1512819 1573257 1627935 1675500 1714706 1743992 1762195 1769148 1764987 1749586 1723453
56225A723453l5023m1874m7703n2829n6456n8374n9375n9663n8590n6272n3761
$$ 1723453 1688430 1646556 1598853 1546024 1489568 1431194 1371819 1312156 1253566 1197294 1143533
56214A143533n1257m7971m4083m0860l8393l5310l1448k8592k7546k6614k4199
$$ 1143533 1092276 1044305 1000222 959362 920969 885659 854211 825619 798073 771459 747260
56203G47260k1069j8646j6798j4821j3104j2191j1323r505p180n535m825m463
$$ 747260 726191 707545 690747 675926 662822 650631 639308 629803 622623 617088 612263 607800
56191F07800m043l431k528j689j537j849j589n82mn16j153r50m34n21r22p07J95
$$ 607800 603757 600326 597798 596109 594572 592723 591134 590552 590548 590032 588879 587929 587495 586974 586052 585345 585540
56174E85540J020J209Q60O03J258K992M713N192M745M780N682O444O395O005N766
$$ 585540 586560 587769 588629 589232 590490 593482 598195 603387 608132 612912 618594 625038 631433 637438 643204
56159F43204N728O205P538R014R569R626J0592J2489J3959J4799J6324J8871K1076
$$ 643204 648932 655137 662675 671689 681258 690884 701476 713965 727924 742723 759047 777918 798994
56146G98994K2351K3988K6986L0727L4684L9521M5592N2118N8642O5642P2985
$$ 798994 821345 845333 872319 903046 937730 977251 1022843 1074961 1133603 1199245 1272230
56135A272230P9475Q4477Q8152Q9692Q7565Q2102P5480O8485N9915N0141M2258
$$ 1272230 1351705 1436182 1524334 1614026 1701591 1783693 1859173 1927658 1987573 2037714 2079972
56124B079972L8022L5154L0550K3932J6550Q553q2p858j3295j7068k0905k5569
$$ 2079972 2117994 2153148 2183698 2207630 2224180 2232733 2232651 2224793 2211498 2194430 2173525 2147956
56112B147956l1342l9063m9057o0178p0960q0431q7019q8692q5435p9858p3954
$$ 2147956 2116614 2077551 2028494 1968316 1897356 1816925 1729906 1641214 1555779 1475921 1401967
56101A401967o7098n8335m8670l9651l1643k4832j9981j6763j3372r201n868m343
$$ 1401967 1334869 1276534 1227864 1188213 1156570 1131738 1111757 1094994 1081622 1072421 1066553 1062210
56089A062210l319j758o00l29M94K452L651K993K456L825N610N717M918N045N786
$$ 1062210 1058891 1057133 1056533 1056204 1056698 1059150 1062801 1065794 1068250 1072075 1077685 1083402 1088320 1093365 1099151
56074A099151N970O124P189Q401Q842R386J0862J2131J2220J2439J4021J5714
$$ 1099151 1105121 1111245 1118434 1126835 1135677 1145063 1155925 1168056 1180276 1192715 1206736 1222450
56062A222450J6080J6167J7332J8503J8221J7505J8013J9143J9495J9453J9867
$$ 1222450 1238530 1254697 1272029 1290532 1308753 1326258 1344271 1363414 1382909 1402362 1422229
56051A422229K0057J9526J9588K1000K2120K1785K1600K2904K4138K3893K3766
$$ 1422229 1442286 1461812 1481400 1502400 1524520 1546305 1567905 1590809 1614947 1638840 1662606
56040A662606K5227K6541K6123K6067K8721L2437L4516L5772L8273M1073M2353
$$ 1662606 1687833 1714374 1740497 1766564 1795285 1827722 1862238 1898010 1936283 1977356 2019709
56029B019709M3395M6216M9370N0389N0321N1652N3745N4597N5088N7151N9698
$$ 2019709 2063104 2109320 2158690 2209079 2259400 2311052 2364797 2419394 2474482 2531633 2591331
56018B591331O0704O1328O3721O6754O8358O9919P3775P8593Q1910Q5060R0573
$$ 2591331 2652035 2713363 2777084 2843838 2912196 2982115 3055890 3134483 3216393 3301453 3392026
56007C392026R6943J01088J04040J08928J15331J20894J26535J34578J43633J50841
$$ 3392026 3488969 3590057 3694097 3803025 3918356 4039250 4165785 4300363 4443996 4594837
55997D594837J57358J66254J76896J86790J96855K09328K22905K35613K49921
$$ 4594837 4752195 4918449 5095345 5282135 5478990 5688318 5911223 6146836 6396757
55988F396757K68883K90080L09657L29493L53766L81580M09971M40796M77136
$$ 6396757 6665640 6955720 7265377 7594870 7948636 8330216 8740187 9180983 9658119
55979I658119N16383N55193N97771O50519P11915P76796Q47099R28438J019580
$$ 9658119 10174502 10729695 11327466 11977985 12689900 13466696 14313795 15242233 16261813
55970A6261813J115946J220507J340640J477637J630707J807609K019363K268555
$$ 16261813 17377759 18598266 19938906 21416543 23047250 24854859 26874222 29142777
55962B9142777K555814K893555L299725L783736M354960N040273N876499O892602
$$ 29142777 31698591 34592146 37891871 41675607 46030567 51070840 56947339 63839941
55954F3839941Q120644R620842J1479080J3796065J6711473K0414213K5027615
$$ 63839941 71960585 81581427 93060507 106856572 123568045 143982258 169009873
55947A69009873L0355617L5616086L9331402L9552709L4563653K3918131R152293
$$ 169009873 199365490 234981576 274312978 313865687 348429340 372347471 381499764
55940C81499764o591585k0014812k9157162l3843829l5018847l3827605l1176877
$$ 381499764 374908179 354893367 325736205 291892376 256873529 223045924 191869047
55933A91869047k7744518k4053946k0466480j7188172j4324379j1912172r922648
$$ 191869047 164124529 140070583 119604103 102415931 88091552 76179380 66256732
55926F6256732q288280o948706n860513m977028m248927l644476l147970k739633
$$ 66256732 57968452 51019746 45159233 40182205 35933278 32288802 29140832 26401199
55918B6401199k394785k099804j851230j640539j454705j289666j148759j029153
$$ 26401199 24006414 21906610 20055380 18414841 16960136 15670470 14521711 13492558
55910A3492558r22448q26774p45923o77939o15950n58889n10707m70287m32319
$$ 13492558 12570110 11743336 10997413 10319474 9703524 9144635 8633928 8163641 7731322
55901G731322l96792l67776l43903l19562k94555k73547k56732k39610k21462
$$ 7731322 7334530 6966754 6622851 6303289 6008734 5735187 5478455 5238845 5017383
55892E017383k05774j92704j78982j65013j54625j47934j41383j34554j30219
$$ 5017383 4811609 4618905 4439923 4274910 4120285 3972351 3830968 3696414 3566195
55883C566195j27991j24444j19268j15013j11166j04793r6644r0477q6474q1411
$$ 3566195 3438204 3313760 3194492 3079479 2968313 2863520 2766876 2676399 2589925 2508514
55873B508514p5139p0923o9313o7469o4710o3132o2535o0249n6272n3372n1764
$$ 2508514 2433375 2362452 2293139 2225670 2160960 2097828 2035293 1975044 1918772 1865400 1813636
55862A813636m8883m4657m1845m0719l8490l4620l1744l0675k9228k6808k5565
$$ 1813636 1764753 1720096 1678251 1637532 1599042 1564422 1532678 1502003 1472775 1445967 1420402
55851A420402k6044k6109k5148k5125k6520k7297k6872k7150k8578k8946k7248
$$ 1420402 1394358 1368249 1343101 1317976 1291456 1264159 1237287 1210137 1181559 1152613 1125365
55840A125365k5201k3900k2400k0486j9484j9380j8399j6373j5324j5908j6381
$$ 1125365 1100164 1076264 1053864 1033378 1013894 994514 976115 959742 944418 928510 912129
55829I12129j5857j5431j5301j4017j1545r965j0098j0377r977j0147j1426j2461
$$ 912129 896272 880841 865540 851523 839978 830013 819915 809538 799561 789414 777988 765527
55817G65527j2605j2988j3959j4162j3162j2297j1978j0802q460o856p104p863
$$ 765527 752922 739934 725975 711813 698651 686354 674376 663574 655114 648258 641154 633291
55805F33291p837p525p309o132l496p23J092K444L700L938K695J157M55L21K53
$$ 633291 625454 617929 610620 604488 600992 600269 601361 603805 607505 611443 614138 615295 615750 616071 616324
55790F16324L86M41m26j993k833k535k335k920l493l740m790p231r907j1652j2710
$$ 616324 616710 617151 616725 614732 611899 609364 607029 604109 600616 596876 592086 584855 574948 563296 550586
55775E50586j3542j3734j2955j1672j0173q142n713l620j969l13P26l17l380o408
$$ 550586 537044 523310 510355 498683 488510 480368 474655 471035 469066 468753 469479 469162 465782 459374
55761D59374p837q034p788p098o102n555n665n796n806o235o808o419n058m085
$$ 459374 451537 443503 435715 428617 422515 416960 411295 405499 399693 393458 386650 380231 375173 371088
55747C71088m118m257l924l769m196m615m722m850m720l550j888j384k207k671
$$ 371088 366970 362713 358789 355020 350824 346209 341487 336637 331917 328367 326479 325095 322888 320217
55733C20217k019j478j772j798q98l45j146k261k463k396l226m599n441n638n561
$$ 320217 318198 316720 314948 313150 312252 311907 310761 308500 306037 303641 300415 295816 290375 284737 279176
55718B79176m988l705k275j207k83N38O63J71K94J634L137L665L404K829J673
$$ 279176 274188 270483 268208 267001 266718 267256 267919 268090 268384 270018 273155 276820 280224 283053 284726
55703B84726k4j187j242j181j966l042l629m205n347o231n768m437l558l351l069
$$ 284726 284702 283515 282273 281092 279126 276084 272455 268250 262903 256672 250904 246467 242909 239558 236489
55688B36489k523k190k160k023j607j042l72L29Q93J463K386L362L477K525J372
$$ 236489 233966 231776 229616 227593 225986 224944 224572 224901 225794 227257 229643 233005 236482 239007 240379
55673B40379O52P7n61q48p23q70j437j617j111p86j115j235n37P7l55j183j155
$$ 240379 241031 241108 240547 239699 238976 238106 236669 235052 233941 233155 232040 230805 230268 230345 229990 228807 227652
55656B27652k18P34J183J148P64N36J151K286K544J402J28j3N51P68N66K86l88
$$ 227652 227434 228168 229351 230499 231263 231799 232950 235236 237780 239182 239310 239297 239848 240616 241182 241468 241080
55639B41080j691k897l411l855m914n982o190n886n839n754m940l741k978k593
$$ 241080 239389 236492 233081 229226 224312 218330 212140 206254 200415 194661 189721 185980 183002 180409
55625A80409k077j661j792k021j651j000p97q83p09n89j135j932k001j329p32
$$ 180409 178332 176671 174879 172858 171207 170207 169410 168527 167818 167229 166094 164162 162161 160832 160100
55610A60100n59o30j016j740k084j426m26k44q93j476j718k061k456k335j688
$$ 160100 159541 158911 157895 156155 154071 152645 152219 151975 151082 149606 147888 145827 143371 141036 139348
55595A39348j136r59q92p60m64K78J382J916J171j40p68n68l35m12n67q99j607
$$ 139348 138212 137253 136361 135601 135137 135415 136797 138713 139884 139744 138976 138408 138073 137661 137094 136195 134588
55578A34588k113j555r9J273K069K469K470J923J238J004J087J020J003J470J975
$$ 134588 132475 130920 130821 132094 134163 136632 139102 141025 142263 143267 144354 145374 146377 147847 149822
55563A49822J679P43Q4r1m06j026j457j531j596j711j632j537j769k094k108k134
$$ 149822 151501 152244 152328 152237 151831 150805 149348 147817 146221 144510 142878 141341 139572 137478 135370 133236
55547A33236k546k659j582J06R15O33M09P23Q25L72N1J76R8m66q00m04K47P01
$$ 133236 130690 128031 126449 126555 127470 128103 128512 129235 130060 130432 130483 130659 130757 130291 129491 129087 129334 130035
55529A30035J156J672J874J814K021K224J351o20k064j779n92Lj78l72l91o55
$$ 130035 131191 132863 134737 136551 138572 140796 142147 141527 139463 137684 137092 137095 136917 136545 136154 135499
55513A35499j289k047k798l363l300k513j720j601j944k107j977j853j761j502
$$ 135499 134210 132163 129365 126002 122702 120189 118469 116868 114924 112817 110840 108987 107226 105724
55499A05724j053m54M12J439K027J711P74j32o57p68m83p1o6n92r95o88%L81M51
$$ 105724 104671 104217 104629 106068 108095 109806 110580 110448 109791 109023 108540 108469 108403 107811 106816 106128 106128 106509 106960
55480A06960O69Q71K89j182k436k285q58N68R90N86J50J8r2l47m43j39K54L09
$$ 106960 107629 108500 108789 107607 105171 102886 102028 102596 103586 104172 104322 104340 104248 103901 103458 103319 103573 103882
55462A03882Q2j17l18p63j310j490j108m24K60P25P52L24j44k45j41j87k24J80
$$ 103882 103964 103847 103529 102766 101456 99966 98858 98434 98694 99419 100171 100495 100351 100106 99965 99778 99554 99734
55444I9734R17J420J504J342Q28k47j277j167J53J362J303K09r74j694j769j029
$$ 99734 100651 102071 103575 104917 105745 105498 104221 103054 103207 104569 105872 106081 105107 103413 101644 100615
55428A00615L24J463J688J184N39j3m58m64L08J507K238J946R02j47o47o07m69
$$ 100615 100939 102402 104090 105274 105813 105800 105342 104878 105186 106693 108931 110877 111779 111632 110985 110378 109909
55411A09909m70k93L90J125J004r7j243j628j548j704k121k183j581o77m0J10
$$ 109909 109439 109146 109536 110661 111665 111568 110325 108697 107149 105445 103324 101141 99560 98883 98843 98953
55395I8953O4K85Q30J091M60p74j604j458p28p4K30J16m41j087j177o34j83l04
$$ 98953 99017 99302 100132 101223 101683 100909 99305 97847 97119 97045 97275 97391 96950 95863 94686 94052 93869 93565
55377I3565m22K12J285J774J283M25q2j26RJ37L03O46J134J371Q85k10j090j077
$$ 93565 93143 93355 94640 96414 97697 98122 98040 97914 97923 98060 98363 99009 100143 101514 102399 102189 101099 100022
55359A00022l61L44O01M38J2m83p35o00l35k46j66K19P25P47J26n53p09m77m04
$$ 100022 99661 100005 100606 101044 101056 100573 99838 99238 98903 98657 98491 98710 99435 100182 100308 99755 99046 98569 98165
55340I8165o12o69l08P1o1n11n18J71Q40P43J21k72k90m16p04o24j7N55P12Q10
$$ 98165 97553 96884 96576 96647 96586 96075 95557 95728 96568 97311 97432 97160 96870 96454 95750 95126 95109 95664 96376 97186
55320I7186J125J161M44m63n20L98J331J455Q76J45m58r25j172j016m56K26O46
$$ 97186 98311 99472 99916 99453 98933 99331 100662 102117 102993 103138 102680 101755 100583 99567 99111 99337 99983
55303I9983O40L92K09K10K64K50J55j2k52m51m37j89J13L31M32L60O7l26o12p07
$$ 99983 100623 101015 101224 101434 101698 101948 102103 102091 101839 101388 100951 100762 100875 101206 101638 101998 102065 101739 101127 100420
55283A00420n77j08N95R59N26k53m23K04P63N28k80j080j641j857j422l64N56
$$ 100420 99843 99735 100330 101289 101815 101562 101139 101343 102106 102634 102354 101274 99633 97776 96354 95990 96546
55266I6546O23R2k03M8M43O09N44L73J94J90M89Q70R35N91J60KJ98N18O14L46
$$ 96546 97169 97261 97058 97106 97549 98158 98702 99075 99269 99459 99948 100818 101753 102344 102504 102506 102704 103222 103836 104182
55246A04182on4J17K2n10r96r71n91k71l7L48Q23J027P52J23n83j042r86n09j07
$$ 104182 104176 104122 104239 104261 103751 102755 101784 101193 100922 100885 101233 102056 103083 103835 103958 103375 102333 101347 100838 100731
55226A00731j53m65o02m33j66l9j75n61q90o69J88J074J285Q53M68N98J007J080
$$ 100731 100578 100113 99511 99078 98912 98873 98698 98137 97247 96578 96766 97840 99125 99978 100446 101044 102051 103131
55208A03131N40k12m95j18L52L28J9O5N35R02R78J105J308J048J95n38o36n51
$$ 103131 103671 103459 102964 102846 103198 103526 103545 103610 104145 105047 106025 107130 108438 109486 109681 109143 108507 107956
55190A07956q57j305j349j089r26q29n56k05Q8N44J182J367P07j47l71j53o7J37
$$ 107956 107099 105794 104445 103356 102430 101601 101045 100840 100928 101472 102654 104021 104728 104581 104210 104057 103990 104127
55172A04127R59J774J461K34n15l28k45r15j511j079N2R54J310J279Q64J29m76
$$ 104127 105086 106860 108321 108555 108040 107712 107467 106552 105041 103962 104014 104968 106278 107557 108421 108550 108074
55155A08074o41o45q33r92p69k80R9K72L36K75N5k08m44o82p55l47M32R67Q74
$$ 108074 107433 106788 105955 104963 104194 103914 104013 104285 104621 104896 104951 104743 104299 103617 102862 102515 102947 103914 104788
55136A04788M55J68P9P1J93M27N42M39L56L86K32l15r83j375j395j134o89l14
$$ 104788 105243 105411 105490 105561 105754 106181 106723 107162 107518 107904 108136 107821 106838 105463 104068 102934 102245 101931
55118A01931k42k43J60Q14R54L87r5Q5M43M01K62M58N06k13j144j198m33O6r3
$$ 101931 101689 101446 101606 102420 103374 103761 103666 103751 104194 104595 104857 105315 105821 105608 104464 103266 102833 102899 102806
55099A02806j88J91M65K54J88R20K003K469K091J466J113J061J127J176J127R64
$$ 102806 102618 102809 103274 103528 103716 104636 106639 109108 111199 112665 113778 114839 115966 117142 118269 119233
55083A19233P03K39n59j474j926j625r65m74j78K14O52P80N19J64j29n34j070
$$ 119233 119936 120175 119616 118142 116216 114591 113626 113152 112974 113188 113840 114620 115139 115303 115174 114640 113570
55066A13570j350j041l82Q0J46N2j5j46m23o85p97q74j015r57l63N75J175J036
$$ 113570 112220 111179 110797 110877 111023 111075 111060 110914 110491 109806 109009 108135 107120 106163 105800 106375 107550 108586
55048A08586N11K43M27P36Q12O36L68J45J0p5j33j12Q2L82M96K26k14m20l08k04
$$ 108586 109097 109340 109767 110503 111315 111951 112319 112464 112474 112399 112266 112154 112236 112618 113114 113340 113126 112706 112398 112194
55028A12194l35n05l65J60Q47J431J669J338M60m59p80m10Q3J65q6k92m02o60
$$ 112194 111859 111354 110989 111149 111996 113427 115096 116434 116894 116435 115655 115245 115328 115493 115407 115115 114713 114053
55010A14053j113j443j374r45l87M7J66K5j9K25L42j47q53p85K42J188J252R96
$$ 114053 112940 111497 110123 109178 108791 108838 109004 109029 109010 109235 109577 109430 108577 107792 108034 109222 110474 111470
54992A11470J355K095K187J491R30J037J247R12J89m29q17r62o64R7Q45J141J070
$$ 111470 112825 114920 117107 118598 119528 120565 121812 122724 122913 122484 121667 120705 120041 120138 120983 122124 123194
54975A23194R06O32K19o1l5pk71n12k23M36P19K44n59r51n60L98J298J580J269
$$ 123194 124100 124732 124951 124890 124855 124848 124577 124065 123842 124278 124997 125241 124682 123731 123171 123569 124867 126447 127716
54956A27716Q97Q07P29L08k95o57o94n75k34M33J057J053L98l28p30q88q89o50
$$ 127716 128613 129420 130149 130457 130162 129505 128811 128236 128002 128435 129492 130545 130943 130615 129885 128997 128108 127458
54938A27458l44m00p87q82l60K44L38J83L70P70P38K57N0M19P42N29L06P77J557
$$ 127458 127114 126714 125927 125045 124685 124929 125267 125450 125820 126590 127328 127585 127635 128054 128796 129325 129631 130408 131965
54919A31965J635R89Q26J927L480M164L809L309L178L019K447J718J174O02l89
$$ 131965 133600 134589 135415 137342 140822 144986 148795 152104 155282 158301 160748 162466 163640 164242 163853
54904A63853j710k866l543l819l890l885l813l570l065k392j769j232o30M0N43
$$ 163853 162143 159277 155734 151915 148025 144140 140327 136757 133692 131300 129531 128299 127669 127709 128252
54889A28252P60Q08P30L97n7j70K24O44O53M75N84R07J029R35R95J363J819K200
$$ 128252 129012 129820 130550 130947 130890 130720 130944 131588 132241 132716 133300 134207 135236 136171 137166 138529 140348 142548
54871A42548K507K708K833L144L767M177L602J971L9j486k427k795k540j928j607
$$ 142548 145055 147763 150596 153740 157507 161684 165286 167257 167296 165810 163383 160588 158048 156120 154513
54856A54513j966k699l245l405l283k942k439k041k035k256k077j044M40J253
$$ 154513 152547 149848 146603 143198 139915 136973 134534 132493 130458 128202 126125 125081 125521 126774
54842A26774O66p16j426q18K05M14j94o92o42m23k50J54P57R52M67j50l61l30
$$ 126774 127440 126724 125298 124480 124685 125099 124905 124213 123571 123148 122898 123052 123809 124761 125228 125078 124717 124387
54824A24387l99m33k36%J65O28J532K111J547K27o69p11o06r83j564j709j239
$$ 124387 123988 123555 123319 123319 123484 124112 125644 127755 129302 129529 128860 128149 127543 126560 124996 123287 122048
54807A22048m07M74J121J300J018N53J59o6l7K84O61O74J79n23j060j289j214
$$ 122048 121641 122115 123236 124536 125554 126107 126266 126200 126163 126447 127108 127782 127961 127438 126378 125089 123875
54790A23875q65m04q4N0J78L41L54K46M12J019J540J331N48PJ09M04M01L27O92
$$ 123875 123010 122606 122522 122572 122750 123091 123445 123691 124103 125122 126662 127993 128541 128548 128657 129061 129462 129789 130481
54771A30481J363J636J265R00J303K391L427L985M326M789N169M971M226L682
$$ 130481 131844 133480 134745 135645 136948 139339 142766 146751 151077 155866 161035 166006 170232 173914
54757A73914L972M673M549K946O77r19j614k423l921n304n552m922m433m232l552
$$ 173914 177886 182559 187108 190054 190731 189812 188198 185775 181854 176550 170998 166076 161643 157411 153859
54742A53859k330j686k372l559l839k954j815j155q18l29M25J094J215O84Lr0
$$ 153859 151529 149843 147471 143912 140073 137119 135304 134149 133331 133002 133427 134521 135736 136420 136423 136333
54726A36333N77J433J985K341K641K494J640P74R33K129L294L611L270K794K351
$$ 136333 136910 138343 140328 142669 145310 147804 149444 150218 151151 153280 156574 160185 163455 166249 168600
54711A68600J906J543J237O66m01j788l098l965m130l586k851k637l044l357k942
$$ 168600 170506 172049 173286 173952 173551 171763 168665 164700 160570 156984 154133 151496 148452 145095 142153
54696A42153k023j351j342j822k342k450j840o27O12J315J390J096O09Nm88n52
$$ 142153 140130 138779 137437 135615 133273 130823 128983 128356 128968 130283 131673 132769 133378 133383 132895 132343
54680A32343j22N02R50J032P38J76m70j018j394j507j167k52R21J628J313J61
$$ 132343 132221 132723 133673 134705 135443 135619 135149 134131 132737 131230 130063 129811 130732 132360 133673 133834
54664A33834r95j429j133o10k04J31M39M97K25N5M12R90R98K28n74o17L5P18J028
$$ 133834 132839 131410 130277 129667 129463 129594 130033 130530 130755 130810 131222 132212 133210 133438 132864 132247 132282 133000 134028
54645A34028J080J048Q25K33o37j381j604j259o49n7M90R30Q78Q6r08j132m41
$$ 134028 135108 136156 136981 137214 136577 135196 133592 132333 131684 131627 132117 133047 133925 134011 133103 131971 131530
54628A31530J97k1n88m93K47N98K0p97r26l44K88N93O93P00M67j04p76j104p75
$$ 131530 131727 131706 131118 130625 130872 131470 131490 130693 129767 129423 129711 130304 130997 131697 132164 132060 131284 130180 129405
54609A29405J60J191J611J077Rp79q95o21l46o6L32O14M68J11J15N16O41N7p25
$$ 129405 129565 130756 132367 133444 133453 132674 131779 131158 130812 130746 131078 131692 132160 132271 132386 132902 133543 133600 132875
54590A32875r28n66l32n68q90q56m75J9M95Q22Q17N01J63Nq7j99k08q4r1l62m81
$$ 132875 131947 131381 131049 130481 129591 128735 128260 128279 128774 129596 130413 130914 131077 131082 130995 130796 130588 130504 130413 130051 129570
54569A29570M5R83J449Q88k31q86n78K46Q53J134J515K022J948Q76l81n74L29
$$ 129570 129615 130598 132047 132935 132704 131818 131240 131486 132339 133473 134988 137010 138958 139834 139453 138879 139208
54552A39208J032O22l70r99j208j445j535q53N04J543J524P47K9j52J14N32R33
$$ 139208 140240 140862 140492 139493 138285 136840 135305 134452 134956 136499 138023 138770 138799 138647 138761 139293 140226
54535A40226J291J536J427Q40K16K84J075J632J173J58l79k90k87o07n95J16Q37
$$ 140226 141517 143053 144480 145320 145536 145820 146895 148527 149700 149858 149479 149189 148902 148295 147700 147816 148653
54518A48653P27r6q41j071r16n77j31K08J71j53k82Q4O40P47J07r09j617j685
$$ 148653 149380 149284 148443 147372 146456 145879 145748 145956 146127 145974 145692 145776 146416 147163 147270 146361 144744 143059
54500A43059j334r06m49J10O07Q14Q05Q13P74M51kn2M36Q94P65J97k54l32k13
$$ 143059 141725 140819 140370 140480 141087 141901 142706 143519 144293 144744 144742 144690 145126 146020 146785 146982 146728 146396 146183
54481A46183p4Q1K79M76O56Q39J035J175J116P05L6m33k64M03R70J048Q03N04
$$ 146183 146109 146190 146469 146945 147601 148440 149475 150650 151766 152471 152507 152074 151810 152213 153183 154231 155034 155538
54463A55538J78j85m52n83p19q11n54J0K52k33q66p55R2Q01Q49O46P61J139J321
$$ 155538 155716 155531 155079 154496 153777 152966 152412 152422 152674 152441 151575 150820 150912 151713 152562 153208 153969 155108 156429
54444A56429J074M51m41j441k222k467k130j440o99j35J41K17K66L32L53M02O98
$$ 156429 157503 157954 157513 156072 153850 151383 149253 147813 147114 146979 147120 147337 147603 147935 148288 148690 149388
54427A49388J169J278O45k63n35K2N17J37o90q02J20J051R42K5n96m21nl5m73
$$ 149388 150557 151835 152480 152217 151682 151704 152221 152358 151668 150866 150986 152037 152979 153004 152408 151987 151982 151947 151474
54408A51474q25p88l38M57J353J799J361L25m60m60P8O08R91J388J712J603J085
$$ 151474 150649 149861 149523 149980 151333 153132 154493 154818 154358 153898 153976 154584 155575 156963 158675 160278 161363
54391A61363P74J050J387R78k2n66j62M08J73p27j392j404j020l98N32J424J512
$$ 161363 162137 163187 164574 165552 165530 164964 164802 165210 165383 164656 163264 161860 160840 160442 160974 162398 163910
54374A63910N75o22j152q09m2N63N51j41r54j072l21O64J314J665J846J612P97
$$ 163910 164485 163863 162711 161902 161860 162423 162974 162833 161879 160807 160486 161150 162464 164129 165975 167587 168384
54357A68384k09r16j292j482j347q05j97J84N86J226J564Q68o63k024k537k300
$$ 168384 168175 167259 165967 164485 163138 162333 162136 162320 162906 164132 165696 166564 165901 163877 161340 159040
54341A59040j567m82N70R77N96j9k47mL27K97k31q01o35M38J514J650J118R36
$$ 159040 157473 156991 157561 158538 159134 159115 158868 158864 159191 159488 159257 158456 157821 158259 159773 161423 162541 163477
54323A63477J275J213K12r95j339n43J018K822M207M483L663K639K108J737Q62
$$ 163477 164752 165965 166177 165182 163843 163300 164318 167140 171347 175830 179493 182132 184240 185977 186839
54308A86839m05j375j753j773j575j100o23p25j603k757l458l332k523j569j015
$$ 186839 186434 185059 183306 181533 179958 178858 178235 177510 175907 173150 169692 166360 163837 162268 161253
54293A61253q92o57L7P43P32K8o12p56p21q65r39n92p7N8j67j68K94O53L37l51
$$ 161253 160361 159704 159741 160484 161216 161244 160632 159876 159155 158290 157351 156759 156682 156740 156573 156405 156699 157352 157689 157338
54273A57338n70q0M55M27P8L5L75O21N21K68L3k47m75l62N1L13K53K97P20J014
$$ 157338 156768 156688 157143 157570 157648 157683 158058 158679 159200 159468 159501 159254 158779 158417 158468 158781 159034 159331 160051 161065
54253A61065N94k31n13P1Q59J082O55Pm62n60l00J00L68M97O75Q60P41K61j40
$$ 161065 161659 161428 160915 160986 161845 162927 163582 163589 163127 162567 162267 162367 162735 163232 163907 164767 165508 165769 165629
54234A65629j15Om06j334j955j568l91O87J075R03O14L91J32j58j97K51R60J282
$$ 165629 165514 165520 165114 163780 161825 160257 159866 160553 161628 162531 163145 163536 163668 163510 163313 163564 164524 165806
54216A65806P67k33p63l05M57K86j131k667k957j819j98R12J125N04n50j280j083
$$ 165806 166573 166340 165577 165272 165729 166015 164884 162217 159260 157441 157243 158155 159280 159784 159234 157954 156871
54199A56871k28L90L37J11L19Q92J418J761J981J940J440N78l63j198j782j910
$$ 156871 156643 157033 157370 157481 157800 158692 160110 161871 163852 165792 167232 167810 167447 166249 164467 162557
54183A62557j595j164q11l39L59Q54P32K70L3Rk21n25k66O71J528J642J267J044
$$ 162557 160962 159798 158987 158648 159007 159861 160593 160863 160896 160905 160684 160159 159893 160564 162092 163734 165001 166045
54165A66045J103J092Q12L55k16r14j545j702j267p15o59j064j167m58M52L76
$$ 166045 167148 168240 169052 169407 169191 168277 166732 165030 163763 163048 162389 161325 160158 159700 160152 160528
54149A60528r09k185k181j062K6N69J078J864K269J569R5j079j319q90l38J09
$$ 160528 159619 157434 155253 154191 154217 154786 155864 157728 159997 161566 161661 160582 159263 158373 158035 158144
54133A58144N13R28J261J399J367J311J317J269J022O87N52O89P62L85m48j251
$$ 158144 158657 159585 160846 162245 163612 164923 166240 167509 168531 169218 169770 170459 171221 171606 171158 169907
54117A69907j428q53j22m8o73j032l05R81J515R15J88K15N32K17o30j081q30m72
$$ 169907 168479 167626 167504 167456 166783 165751 165446 166427 167942 168857 169045 169260 169792 170009 169379 168298 167468 166996
54099A66996l78j91K88M81n5o69l88O51J309J046N90P17J041O87k79q26l75N10
$$ 166996 166618 166427 166715 167196 167141 166472 166084 166735 168044 169090 169680 170397 171438 172125 171846 171020 170645 171155
54081A71155J034J105J040Q33L57l5K31J044J585J318N91Ll91q57j245j047k02
$$ 171155 172189 173294 174334 175167 175524 175489 175720 176764 178349 179667 180258 180261 179870 179013 177768 176721 176519
54064A76519N51M77k38o78k92M40O21K6p17r71p75n70n04l08K43J004J630J924
$$ 176519 177070 177547 177309 176631 176339 176779 177400 177426 176709 175738 174963 174393 173889 173581 173824 174828 176458 178382
54046A78382J991K103K358K571K500K260K204K455K751K863K818K649K351K254
$$ 178382 180373 182476 184834 187405 189905 192165 194369 196824 199575 202438 205256 207905 210256 212510
54032B12510K837L840M119L030J443O62P55Q84R43J621K780L096J878J55p42q56
$$ 212510 215347 219187 223306 226336 227779 228441 229196 230080 231023 232644 235424 238520 240398 240553 239811 238955
54016B38955j022j311j150o28n77j307k082k127j561j075j083j432j666j466r39
$$ 238955 237933 236622 235472 234844 234267 232960 230878 228751 227190 226115 225032 223600 221934 220468 219529
54001B19529n20m95o58n88r6O80J517K245K850L585M711N944O536O253N993O980
$$ 219529 219009 218514 217856 217268 217172 217852 219369 221614 224464 228049 232760 238704 245240 251493 257486 264466
53985B64466R473J2569J4954J5517J3627R588M660Mm313q704j2662j4849j4679
$$ 264466 273939 286508 301462 316979 330606 340194 344854 344858 340545 331841 319179 304330 289651
53972B89651j3112j1507j0341r364q381p420o453n453m443l299j833l69K11m99
$$ 289651 276539 265032 254691 245327 236946 229526 223073 217620 213177 209878 208045 207676 207887 207388
53958B07388j699k100j292K6R74J206Q55K83n5J38O99J146J174R49Q79J226J859
$$ 207388 205689 203589 202297 202323 203297 204503 205358 205641 205586 205724 206423 207569 208743 209692 210571 211797 213656
53941B13656K364K449K304K359K683K892K783K722L108L736M099M023L671L141
$$ 213656 216020 218469 220773 223132 225815 228707 231490 234212 237320 241056 245155 249178 252849 255990
53927B55990K556K360K898L716L897L154K120J399J002Q48J143J821K245K079
$$ 255990 258546 260906 263804 267520 271417 274571 276691 278090 279092 279940 281083 282904 285149 287228
53913B87228J983K754M047M770M530L889L171J912j09k118l178l283l095k958
$$ 287228 289211 291965 296012 300782 305312 309201 312372 314284 314175 312057 308879 305596 302501 299543
53899B99543k789k635k746l064l237l141l067l292l820m509n090n080m155k755
$$ 299543 296754 294119 291373 288309 285072 281931 278864 275572 271752 267243 262153 257073 252918 250163
53885B50163j853j993k743l272l131k390j441q04q19j231j433j280j285j728k072
$$ 250163 248310 246317 243574 240302 237171 234781 233340 232536 231717 230486 229053 227773 226488 224760 222688
53870B22688j693q37k38j01r1j25m98j134j441j134o97p11j117j431j340q43j50
$$ 222688 220995 220158 219920 219819 219728 219603 219105 217971 216530 215396 214699 213988 212871 211440 210100 209257 209107
53853B09107L27J64n61j149j020l85P7J40K38Q17J691K163J725O44j35J55J226
$$ 209107 209434 209598 209037 207888 206868 206483 206560 206700 206938 207755 209446 211609 213334 213978 213843 213998 215224
53836B15224J920J457L20l60j52L55N82P81J549K820L810M011L893M305N401O563
$$ 215224 217144 218601 218921 218561 218409 218764 219346 220127 221676 224496 228306 232317 236210 240515 245916 252479
53820B52479P404Q458J0554J3640J6572J8100J7786J5981J3208R713N459M99m598
$$ 252479 259883 268341 278895 292535 309107 327207 344993 360974 374182 383895 389354 389853 385255
53807C85255q765j1194j2092j2351j2463j2113j0980r389p804o164m235k349j086
$$ 385255 376490 365296 353204 340853 328390 316277 305297 295908 288104 281940 277705 275356 274270
53794B74270l66M87J657K464K340J709J444J864K602L181L394L273L093L264L818
$$ 274270 273904 274391 276048 278512 280852 282561 284005 285869 288471 291652 295046 298319 301412 304676 308494
53779C08494M169L818L136K921L105K582O28j994l875m557m834n571o783p902
$$ 308494 312663 316481 319617 322538 325643 328225 328853 326859 322984 318427 313593 308022 301239 293337
53765B93337q491q484q059p468o853o109n097l969l067k518k218k159k408k667
$$ 293337 284846 276362 268303 260835 253982 247873 242776 238807 235740 233222 231004 228845 226437 223770
53751B23770k364j442n66k90l81l83l33m14l08L60J217J522J308J329J884K429
$$ 223770 221406 219964 219398 219108 218727 218344 218011 217597 217289 217649 218866 220388 221696 223025 224909 227338
53735B27338K509K313K068J627J045Q77J369J902J760J087N28L72N39J012J707
$$ 227338 229847 232160 234228 235855 236900 237777 239146 241048 242808 243895 244423 244795 245334 246346 248053
53720B48053K163K027J597J384J333J117R42J304K074K575K538K333K234K182
$$ 248053 250216 252243 253840 255224 256557 257674 258616 259920 261994 264569 267107 269440 271674 273856
53706B73856K319K937L705L778L026K426K713L331L310K634K043J924K093K415
$$ 273856 276175 279112 282817 286595 289621 292047 294760 298091 301401 304035 306078 308002 310095 312510
53692C12510K852L088K859K594K963L687L544J911k88j582j540r72q13j244j807
$$ 312510 315362 318450 321309 323903 326866 330553 334097 336008 335720 334138 332598 331626 330813 329569 327762
53677C27762k019j801j513j556j895k023j575q15l79n40r37j023o50j80j45p60
$$ 327762 325743 323942 322429 320873 318978 316955 315380 314565 314186 313646 312709 311686 311036 310856 310711 309951
53661C09951j674k215k007j378j045j334j857j999j532p29N1O40J015J227J384
$$ 309951 308277 306062 304055 302677 301632 300298 298441 296442 294910 294181 294232 294872 295887 297114 298498
53646B98498J565J676J495R78L96R1K03O61J356K149K783K984K723K311K092K094
$$ 298498 300063 301739 303234 304212 304608 304699 304902 305563 306919 309068 311851 314835 317558 319869 321961 324055
53630C24055K045J780J555J811K587L283L273K705K422L030M166M897M680L774
$$ 324055 326100 327880 329435 331246 333833 337116 340389 343094 345516 348546 352712 357609 362289 366063
53616C66063K847K458K780L575M356M783M977N221N412N103M225L422L338L760
$$ 366063 368910 371368 374148 377723 382079 386862 391839 397060 402472 407575 411800 415222 418560 422320
53602D22320L815L035J879J154J162J585J974K059J789J305Q92O40J82r04k327
$$ 422320 426135 429170 431049 432203 433365 434950 436924 438983 440772 442077 442969 443609 443791 442887 440560
53587D40560l120k757j900j611k037k445k466k581l168l732l592k869k191j752
$$ 440560 437440 434683 432783 431172 429135 426690 424224 421643 418475 414743 411151 408282 406091 404339
53573D04339j276q58j071k054l093l420l067k600k289j906j236m73m6j69n54n13
$$ 404339 403063 402205 401134 399080 395987 392567 389500 386900 384611 382705 381469 380996 380950 380781 380227 379714
53557C79714M43J977L009K690J315P9j28N05J148J370J493K001K968M192N549
$$ 379714 380157 382134 385143 387833 389148 389227 389099 389604 390752 392122 393615 395616 398584 402776 408325
53542D08325O897P839Q082Q027Q538R912J1515J2597J3002J2835J2002J0598R294
$$ 408325 415222 423061 431143 439170 447708 457620 469135 481732 494734 507569 519571 530169 539463
53529E39463Q615Q153P245O271O383P814R392J0029J0003J0312J1343J2700J3911
$$ 539463 548078 556231 563476 569747 576130 583944 593336 603365 613368 623680 635023 647723 661634
53516F61634J4851J5707J6921J8868K1223K3010K3675K3793K4297K5222K5784
$$ 661634 676485 692192 709113 727981 749204 772214 795889 819682 843979 869201 894985
53505H94985K5475K4622K3872K3596K3789K4116K4073K3363K2249K1327K0920
$$ 894985 920460 945082 968954 992550 1016339 1040455 1064528 1087891 1110140 1131467 1152387
53494A152387K0792K0430J9472J8101J7117J7279J8335J9074J8685J7726J7200
$$ 1152387 1173179 1193609 1213081 1231182 1248299 1265578 1283913 1302987 1321672 1339398 1356598
53483A356598J7141J6821J6135J5724J5725J5340J4088J2594J1556J0550Q687
$$ 1356598 1373739 1390560 1406695 1422419 1438144 1453484 1467572 1480166 1491722 1502272 1510959
53472A510959O000L376J196j144m176p507j0378j2610j4523j6179j7203j7457
$$ 1510959 1516959 1520335 1521531 1520387 1516211 1508704 1498326 1485716 1471193 1455014 1437811 1420354
53460A420354j7433j7794j8700j9805k0845k1887k2976k3843k4167k3991k3597
$$ 1420354 1402921 1385127 1366427 1346622 1325777 1303890 1280914 1257071 1232904 1208913 1185316
53449A185316k3090k2354k1400k0489j9776j9093j8224j7221j6197j4920j3028
$$ 1185316 1162226 1139872 1118472 1097983 1078207 1059114 1040890 1023669 1007472 992552 979524
53438I79524j0669q583p262o301m944l139j529m02P79K517M486O067P262Q480
$$ 979524 968855 960272 953010 946709 941765 938626 937097 936695 937474 939991 944477 950544 957806 966286
53424I66286R740J0803J1947J3772J6146J8131J9236K0017K1181K2742K4445K6316
$$ 966286 976026 986829 998776 1012548 1028694 1046825 1066061 1086078 1107259 1130001 1154446 1180762
53412A180762K8221K9572L0121L0644L2098L4411L6742L8636M0330M2162M4324
$$ 1180762 1208983 1238555 1268676 1299320 1331418 1365829 1402571 1441207 1481537 1523699 1568023
53401A568023M6931M9741N1995N3253N4089N5370N6984N8121N8504N8607N8704
$$ 1568023 1614954 1664695 1716690 1769943 1824032 1879402 1936386 1994507 2053011 2111618 2170322
53390B170322N8575N8104N7364N6085N3930N1305M9057M7232M5066M2216L9087
$$ 2170322 2228897 2287001 2344365 2400450 2454380 2505685 2554742 2601974 2647040 2689256 2728343
53379B728343L5792L1903K7567K3673K0383J6585J1563O196J614k530p434j3438
$$ 2728343 2764135 2796038 2823605 2847278 2867661 2884246 2895809 2902005 2903619 2901089 2893655 2880217
53367B880217k0001k6856l4059m1155m7308n2241n6230n9264o1042o1740o1985
$$ 2880217 2860216 2833360 2799301 2758146 2710838 2658597 2602367 2543103 2482061 2420321 2358336
53356B358336o2051o1668o0703n9348n7661n5535n3207n1235m9836m8784m8027
$$ 2358336 2296285 2234617 2173914 2114566 2056905 2001370 1948163 1896928 1847092 1798308 1750281
53345A750281m7833m8152m8297m7562m5853m3612m1348l9338l7489l5443l2956
$$ 1750281 1702448 1654296 1605999 1558437 1512584 1468972 1427624 1388286 1350797 1315354 1282398
53334A282398l0198k7515k5039k2723k0625j8814j7158j5533j4100j3040j2187
$$ 1282398 1252200 1224685 1199646 1176923 1156298 1137484 1120326 1104793 1090693 1077653 1065466
53323A065466j1298j0492r931r250p907o090m687m195m049l259j465P90K660L862
$$ 1065466 1054168 1043676 1033745 1024495 1016588 1010498 1005811 1001616 997567 994308 992843 993633 996293 1000155
53309A000155M991O839R315J1391J2359J2706J3344J4450J5691J7149J9128K1303
$$ 1000155 1005146 1011985 1021300 1032691 1045050 1057756 1071100 1085550 1101241 1118390 1137518 1158821
53297A158821K2959K4043K5183K6611K7931K9026L0246L1455L1778L0744K8964
$$ 1158821 1181780 1205823 1231006 1257617 1285548 1314574 1344820 1376275 1408053 1438797 1467761
53286A467761K7241K5622K3763K1672J9564J7458J5316J3189J0889P962M347O47
$$ 1467761 1495002 1520624 1544387 1566059 1585623 1603081 1618397 1631586 1642475 1650437 1654784 1655431
53274A655431k556n226p559r710j2057j5034j8283k0738k2092k3418k5627k8072
$$ 1655431 1652875 1647649 1640090 1630380 1618323 1603289 1585006 1564268 1542176 1518758 1493131 1465059
53262A465059k9515k9889l0064l0370l0540l0789l1625l2638l2702l1686l0784
$$ 1465059 1435544 1405655 1375591 1345221 1314681 1283892 1252267 1219629 1186927 1155241 1124457
53251A124457l0741l0853l0337k9643k9509k9458k8472k6733k5609k5863k6807
$$ 1124457 1093716 1062863 1032526 1002883 973374 943916 915444 888711 863102 837239 810432
53240H10432k7375k7203k6361k4861k2988k1457k0540j9367j6952j3798j1574
$$ 810432 783057 755854 729493 704632 681644 660187 639647 620280 603328 589530 577956
53229E77956j1034j1051j0190q571p423p325p719q107q718r697j0419j0185r215
$$ 577956 566922 555871 545681 537110 529687 522362 514643 506536 497818 488121 477702 467517 458302
53216D58302q434q367q676q721q278p636p196p031o847o345n608m976m620m390
$$ 458302 449868 441501 432825 424104 415826 408190 400994 393963 387116 380771 375163 370187 365567 361177
53202C61177m102l828l766l932m032l697k994k615l169m193m432l527k738l190
$$ 361177 357075 353247 349481 345549 341517 337820 334826 332211 329042 324849 320417 316890 314152 310962
53188C10962m046l566j756m95q53j706j600p45j93j38j00q0m06q29q79o97o93
$$ 310962 306916 303350 301594 301099 300246 298540 296940 296195 296002 295864 295764 295684 295278 294449 293570 292873 292180
53171B92180o62k30K43K08L5M59J177J189M80P7L40M64Nl35k2L20n5p75r85o19
$$ 292180 291518 291288 291531 291739 291774 292233 293410 294599 295079 295156 295496 295960 295965 295630 295608 295928 295873 295098 294113 293494
53151B93494l06l68n73o41n22l49l91p50j022o82K4J92m78j251j535j751k373
$$ 293494 293188 292820 292247 291606 291084 290735 290344 289594 288572 287890 287914 288106 287628 286377 284842 283091 280718
53134B80718k906k620j780j165p67QR70J133J82r52j359j241j191j130n81K85
$$ 280718 277812 275192 273412 272247 271480 271488 272458 273591 273773 272821 271462 270221 269030 267900 267319 267604
53118B67604O63K36k88p1P72J293Q88j01r95j561j862j743j085m00m19r45r30
$$ 267604 268267 268503 268215 268144 268916 270209 271097 270996 270001 268440 266578 264835 263750 263350 262931 261986 261056
53101B61056J6R27P83j33q54j192j648k201k183j368l69K06L13L6o31j250r85
$$ 261056 261072 261999 262782 262649 261795 260603 258955 256754 254571 253203 252834 253040 253353 253389 252758 251508 250523
53084B50523L24J624J819J043L17J54J64q3m53o24n80m80l51j86j52m06p31o97
$$ 250523 250847 252471 254290 255333 255650 255804 255968 255885 255432 254808 254228 253748 253397 253211 253059 252653 251922 251225
53066B51225k59L2l24j033j244n90L27O74M16K20M83Q96J043J013J170J567J938
$$ 251225 250966 250998 250674 249641 248397 247807 248134 248808 249224 249444 249927 250823 251866 252879 254049 255616 257554
53049B57554K163K357K490K240J467O15L35O50Q15J48j115k090k244j860j500
$$ 257554 259717 262074 264564 266804 268271 268886 269221 269871 270686 270834 269719 267629 265385 263525 262025
53034B62025j392j448j594j754j685j237o58m08o33j027j247j231j066p81l11
$$ 262025 260633 259185 257591 255837 254152 252915 252257 251849 251216 250189 248942 247711 246645 245864 245553
53019B45553L51J037J412J228O95L96N94Q02L88n21j180j189r11p51n85j61K86
$$ 245553 245904 246941 248353 249581 250276 250672 251266 252068 252456 251935 250755 249566 248655 247904 247319 247158 247444
53002B47444K99j04l91j66L44N56J15p28j328j248o35P8P27J380J876J827J268
$$ 247444 247743 247639 247248 247082 247426 247982 248097 247369 246041 244793 244158 244236 244963 246343 248219 250046 251314
52985B51314Q12Q11Q04K18o21p65J97J653K592K372J007p59j808j573o90k20l22
$$ 251314 252126 252937 253741 253959 253338 252573 252770 254423 257015 259387 260394 259635 257827 256254 255564 255344 255022
52968B55022k01N49J369J778K169L024L923M071L387K357J168k29j371j511p18
$$ 255022 254821 255370 256739 258517 260686 263710 267633 271704 275091 277448 278616 278387 277016 275505 274787
52953B74787pj22q21j536k132k600k670k166j411p73k12L20L97l51j489k157k067
$$ 274787 274780 274658 273837 272301 270169 267569 264899 262733 261322 260549 260337 260657 261054 260703 259214 257057 254990
52936B54990j558q51O1Q17P72j12j059j438j435j428j285p16J0L22J09j84j49
$$ 254990 253432 252581 252642 253459 254231 254119 253060 251622 250187 248759 247474 246758 246768 247090 247199 247015 246866
52919B46866K32P05Q94N15k51p65o21j60N3M7J44J56m58j529k090j559m49M37
$$ 246866 247098 247803 248697 249212 248961 248196 247575 247415 247468 247515 247659 247815 247357 245828 243738 242179 241730 242167
52901B42167Q76R79O78Q5j26N63J596J958J476R31Q04P59M71K52M44P48O72K77
$$ 242167 243043 244022 244700 244785 244659 245222 246818 248776 250252 251183 251987 252746 253217 253469 253913 254661 255333 255610
52883B55610j1q5k15n91j156j811k425k686k312j401l84L59O52M38j98r03j233
$$ 255610 255599 255514 255299 254708 253552 251741 249316 246630 244318 242917 242533 242892 243544 243982 243784 242881 241648
52866B41648r81k51O92J513J898J855J769J925K079J838J291R07Q68R35R10Q08
$$ 241648 240667 240416 241108 242621 244519 246374 248143 250068 252147 253985 255276 256183 257051 257986 258896 259704
52850B59704N38j16j040j781k146k394k644k564j952j226r40j143j542j987k399
$$ 259704 260242 260126 259086 257305 255159 252765 250121 247557 245605 244379 243439 242296 240754 238767 236368
52835B36368k491k046j297p29n43o15p75q08l82N43J425J636J172N19n9o58j241
$$ 236368 233877 231831 230534 229805 229262 228647 227872 227064 226682 227225 228650 230286 231458 231977 231918 231260 230019
52818B30019j572j600j510j321q33k6R08J894K848L303K794J765J393K173L196
$$ 230019 228447 226847 225337 224016 223183 223157 224065 225959 228807 232110 234904 236669 238062 240235 243431
52803B43431L304K489J632J184P46j25j285k291k956l383l655l640l225k586k083
$$ 243431 246735 249224 250856 252040 252786 252661 251376 249085 246129 242746 239091 235451 232226 229640 227557
52788B27557j762j198j62Q01R57M31K0m1l83j232j701j038J17O10M70P14J591
$$ 227557 225795 224597 224435 225236 226193 226624 226644 226603 226220 224988 223287 222249 222366 222976 223446 224160 225751
52771B25751K140J707R44P44R17O35k22q58o16L05J201J578J375P61k6o77q82
$$ 225751 227891 229598 230542 231286 232203 232838 232616 231758 231142 231447 232648 234226 235601 236362 236336 235659 234777
52754B34777n49m4P5l29p44o38j30K45L02K81K69P4k25j83K97O33L79l3J57J015
$$ 234777 234228 234184 234259 233930 233186 232548 232418 232663 232965 233246 233515 233589 233364 233181 233478 234111 234490 234457 234614 235629
52734B35629J894K225J929J197M10R2M40R19Q82N04N34J014J045R4j113j517j052
$$ 235629 237523 239748 241677 242874 243284 243376 243816 244735 245617 246121 246655 247669 248714 248808 247695 246178 245126
52717B45126m91k64j18J41K32j53q35j324j293q92n78o38q00n78q7p1p51j186
$$ 245126 244635 244371 244253 244394 244626 244473 243638 242314 241021 240129 239551 238913 238113 237535 237448 237377 236626 235440
52699B35440m08J050J711J082J71p1Q7J6j57R9P38J271J499J568J520J356J288
$$ 235440 235032 236082 237793 238875 239046 238975 239062 239078 238921 239020 239758 241029 242528 244096 245616 246972 248260
52682B48260J473J682J696J674J688J299K67o83n97L20R31P11K02r4m00r21j261
$$ 248260 249733 251415 253111 254785 256473 257772 258039 257356 256759 257079 258010 258721 258923 258829 258429 257508 256247
52665B56247j062o29m76o67r36j036p13J99J333J894J597J104J138J658K201K574
$$ 256247 255185 254556 254080 253413 252477 251441 250728 250927 252260 254154 255751 256855 257993 259651 261852 264426
52649B64426K642J963L77j325k047j660j008p38o91n28l27k83k75m8L49O20O43
$$ 264426 267068 269031 269408 268083 266036 264376 263368 262630 261939 261411 261084 260801 260526 260478 260827 261447 262090
52632B62090O34Q62J322J733J832J571J083P06R59K064L218K915O34k054l012
$$ 262090 262724 263586 264908 266641 268473 270044 271127 271833 272792 274856 278074 280989 281623 279569 276557
52617B76557k005p83o52j028q02J3O64P64K04j181k910l539k209p5R81O25J5k13
$$ 276557 274552 273769 273117 272089 271287 271300 271964 272728 272932 271751 268841 265302 263093 263018 263999 264624 264639 264426
52599B64426m71q58p26L9N93M55K14M28P49P42P44J176J710J790J455J042N92
$$ 264426 263955 263097 262371 262410 263003 263458 263672 264100 264849 265591 266335 267511 269221 271011 272466 273508 274100
52582B74100P7k47k56k62m10l11J82M31n5o42l90N53J228J240R73O34K0o57p45
$$ 274100 274177 273930 273674 273412 273002 272691 272873 273304 273249 272607 272217 272770 273998 275238 276211 276845 276865 276208 275463
52563B75463j21N20O61N28L50j70j139j823j496n13J08K2j91n7K57M95Q04J243
$$ 275463 275342 275862 276523 277051 277401 277231 276092 274269 272773 272260 272368 272390 272199 272142 272399 272894 273698 274941
52545B74941J351P13l01q94q33n92m99l01J90N85M46j2k08j1K09K04R6k0k32m71
$$ 274941 276292 277005 276704 275810 274977 274385 273886 273585 273775 274360 274806 274794 274586 274575 274784 274988 275084 275064 274832 274361
52525B74361m55j39Q8j60q23j474j732j485r48n33m43l78J20J035J858K187K075
$$ 274361 273906 273767 273855 273695 272872 271398 269666 268181 267233 266700 266257 265879 265999 267034 268892 271079 273154
52508B73154J812J726K163L198M269M551L864K736J518Nj721k804k530j418p36
$$ 273154 274966 276692 278855 282053 286322 290873 294737 297473 298991 298996 297275 294471 291941 290523 289787
52493B89787j073j890k340k081j362p13n76r52j375j420j109p00k92J10M39P12
$$ 289787 288714 286824 284484 282403 281041 280328 279752 278800 277425 276005 274896 274196 273904 274014 274453 275165
52477B75165J103J598J835J611J237J007O70l0o45n20J63N17J93j65J73J224K523
$$ 275165 276268 277866 279701 281312 282549 283556 284226 284196 283551 283031 283194 283711 283904 283739 283912 285136 287659
52460B87659L654M296M275L740L066K379J480K93r59k120l258m316m944m866m123
$$ 287659 291313 295609 299884 303624 306690 309069 310549 310842 309883 307763 304505 300189 295245 290379 286256
52445B86256k932j634q05q89j531j780j273p37r39j585j780j240m73N6L26M25
$$ 286256 283324 281690 280885 279996 278465 276685 275412 274675 273736 272151 270371 269131 268658 268714 269040 269465
52429B69465L38K03L23P12R96Q97N98M15L71K82J47J80M93R17J181J153R27P71
$$ 269465 269803 270006 270329 271041 272037 272934 273532 273947 274318 274600 274747 274927 275420 276337 277518 278671 279598 280369
52411B80369J026J940L457N203O788Q184R629J1109J2043J1640R584O243K333
$$ 280369 281395 283335 286792 291995 298783 306967 316596 327705 339748 351388 360972 367215 369548
52398C69548j435m516o612p799q329q260p405n820m111k999k601k364j759q12
$$ 369548 368113 363597 356985 349186 340857 332597 325192 319372 315261 312262 309661 307297 305538 304726
52384C04726O0N94Q95J153J400J569J698J848J913J731J396J371K081L459M919
$$ 304726 304786 305380 306275 307428 308828 310397 312095 313943 315856 317587 318983 320354 322435 325894 330813
52369C30813N808N870N381M834M500M201L601K643J509K99r26j741j561n36K44
$$ 330813 336621 342491 347872 352706 357206 361407 365008 367651 369160 369459 368533 366792 365231 364695 364939
52354C64939Jo46n24M00R56N26n4L01J506K633L139L223L248L482M143N139N874
$$ 364939 364940 364294 363770 364170 365126 365652 365598 365899 367405 370038 373177 376400 379648 383130 387273 392412 398286
52337C98286N880N604N957P062Q075Q402Q528R282J0758J2404J3813J4967J5855
$$ 398286 404166 409770 415727 422789 430864 439266 447794 457076 467834 480238 494051 509018 524873
52324E24873J6382J6658J6984J7461J7887J8052J7935J7523J6719J5502J3998
$$ 524873 541255 557913 574897 592358 610245 628297 646232 663755 680474 695976 709974
52313G09974J2331J0590Q977P755O886O048N142M551M572M802M488L460K305J535
$$ 709974 722305 732895 741872 749627 756513 762561 767703 772254 776826 781628 786116 789576 791881 793416
52299G93416J006L20m85r51p61n5O84R24L29j008k597l928m819n331n440n005
$$ 793416 794422 794742 794257 793306 792545 792490 793174 794098 794427 793419 790822 786894 782075 776744 771304 766299
52283G66299l964k404m66J622L503M906N927O920Q075R266J0283J1011J1363J1317
$$ 766299 762335 759931 759465 761087 764590 769496 775423 782343 790418 799684 809967 820978 832341 843658
52269H43658J1116J1127J1418J1674J1687J1585J1374J0650R230P781P152P088
$$ 843658 854774 865901 877319 888993 900680 912265 923639 934289 943519 951300 958452 965540
52257I65540O366M472K452J625J925K250K165K345L254M179M013K557O81n48o77
$$ 965540 971906 976378 978830 980455 982380 984630 986795 989140 992394 996573 1000586 1003143 1003824 1003276 1002599
52242A002599j98k84j717l724m430k986p51L32O9q4P73K014K762L030L244L498
$$ 1002599 1002401 1002117 1000400 996676 992246 989260 988509 988841 988910 988826 989599 991613 994375 997405 1000649 1004147
52226A004147L854M591N611O230O161O097O625P144O719N613N066N708O986Q120
$$ 1004147 1008001 1012592 1018203 1024433 1030594 1036691 1043316 1050460 1057179 1062792 1067858 1073566 1080552 1088672
52212A088672Q845R217R377R581R878R819R032P993P555P686P504O588N520M873
$$ 1088672 1097517 1106734 1116111 1125692 1135570 1145389 1154421 1162414 1169969 1177655 1185159 1191747 1197267 1202140
52198A202140M463L909L316K970K891K961L061K858K057J060P47J250J661J325
$$ 1202140 1206603 1210512 1213828 1216798 1219689 1222650 1225711 1228569 1230626 1231686 1232433 1233683 1235344 1236669
52184A236669P09M04K9j100k766m190n200o215p330q271r051r827j0243r734q448
$$ 1236669 1237378 1237782 1237811 1236711 1233945 1229755 1224555 1218340 1211010 1202739 1193688 1183861 1173618 1163884 1155436
52169A155436p084n849m430k971k086j723r78M84J729J953J812K571M307N774
$$ 1155436 1148352 1142503 1138073 1135102 1133016 1131293 1130315 1130799 1132528 1134481 1136293 1138864 1143171 1148945
52155A148945N911M844L426K276J390L54j066k559l542l848l813l535k580q70
$$ 1148945 1154856 1159700 1163126 1165402 1166792 1167146 1166080 1163521 1159979 1156131 1152318 1148783 1146203 1145333
52141A145333O49R62L26r9R0J18n78j300j021K52J642K702L859N592P683R540
$$ 1145333 1145982 1146944 1147270 1147171 1147261 1147379 1146801 1145501 1144480 1144732 1146374 1149076 1152935 1158527 1166210 1175750
52125A175750J0872J1893J3030J4656J6928J9618K2059K3506K3690K3000K2040
$$ 1175750 1186622 1198515 1211545 1226201 1243129 1262747 1284806 1308312 1332002 1355002 1377042
52114A377042K1066J9903J8412J6757J5151J3426J1138Q115M775J845k11j506
$$ 1377042 1398108 1418011 1436423 1453180 1468331 1481757 1492895 1501010 1505785 1507630 1507419 1505913
52102A505913k526l624m600m894m272l236k487k094j528n00O45J523K196K689
$$ 1505913 1503387 1499763 1495163 1490269 1485997 1482761 1480274 1478180 1476652 1476152 1476797 1478320 1480516 1483205
52088A483205K519J233p21k341l204l668l849l166j231J340L574N267O937Q889
$$ 1483205 1485724 1486957 1486236 1483895 1480691 1477023 1473174 1470008 1468777 1470117 1473691 1478958 1485895 1494784
52074A494784J0831J2301J3014J2847J1991J1134J0983J1480J1853J1579J0859
$$ 1494784 1505615 1517916 1530930 1543777 1555768 1566902 1577885 1589365 1601218 1612797 1623656
52063A623656R952Q521O146L142M42j355k474l588n229p506j0024j2037j2994
$$ 1623656 1633608 1642129 1648275 1651417 1651859 1650504 1648030 1644442 1639213 1631707 1621683 1609646 1596652
52050A596652j3089j3071j3458j4092j4580j4860j5139j5479j5752j5949j6169
$$ 1596652 1583563 1570492 1557034 1542942 1528362 1513502 1498363 1482884 1467132 1451183 1435014
52039A435014j6323j6025j4927j3056j0761q493o607n157l802k086l6J776K848
$$ 1435014 1418691 1402666 1387739 1374683 1363922 1355429 1348822 1343665 1339863 1337777 1337741 1339517 1342365
52026A342365L294L507L522L044K007P04o93k281m042n636o759p412p710p740
$$ 1342365 1345659 1349166 1352688 1355732 1357739 1358443 1357750 1355469 1351427 1345791 1339032 1331620 1323910 1316170
52012A316170p772q261r361j0731j2102j3698j5725j7781j9204j9869k0172k0365
$$ 1316170 1308398 1300137 1290776 1280045 1267943 1254245 1238520 1220739 1201535 1181666 1161494 1141129
52000A141129k0426k0470k0786k1378k1927k2274k2523k2565k2000k0685j8920
$$ 1141129 1120703 1100233 1079447 1058069 1036142 1013868 991345 968780 946780 926095 907175
51989I07175j6993j4942j2983j1667j1239j1209j0906j0232r557r085q780q661
$$ 907175 890182 875240 862257 850590 839351 828142 817236 807004 797447 788362 779582 770921
51977G70921q821r222r781j0557j1585j2664j3575j4311j4735j4221j2200r098
$$ 770921 762100 752878 743097 732540 720955 708291 694716 680405 665670 651449 639249 630151
51965F30151o190m312l030j362J011L471N252O183O672P175P757Q087P800O738
$$ 630151 623961 619649 616619 615257 616268 619739 624991 631174 637846 645021 652778 660865 668665 675403
51951F75403M843K033j510m989p328q150q126q125q126p318n210k235P49L269
$$ 675403 680246 682279 680769 675780 668452 660302 652176 644051 635925 628607 623397 621162 621911 625180
51937F25180N377P290R188J1121J2834J3685J3084J1055Q210N135J890j806o080
$$ 625180 630557 637847 647035 658156 670990 684675 697759 708814 717024 722159 724049 722243 716163
51924G16163j0499j4140j6160j6599j6447j6602j6821j6210j4659j3149j2423
$$ 716163 705664 691524 675364 658765 642318 625716 608895 592685 578026 564877 552454
51913E52454j2049j1208r907q720p774o655n192l634k138o49P41J927L271N297
$$ 552454 540405 529197 519290 510570 502796 496141 490949 487315 485177 484528 485269 487196 490467 495764
51899D95764P790R899J1272J2462J3849J4793J4335J2268R054N013K00n046r844
$$ 495764 503554 513453 524725 537187 551036 565829 580164 592432 601486 606499 606699 601653 591809
51886E91809j3214j4601j4152j2598j0765q996p171n213l296j432P27L362O150
$$ 591809 578595 563994 549842 537244 526479 517483 510312 505099 501803 500371 501098 504460 510610
51873E10610Q691J1066J3584J6150J8157J9018J8612J7411J6176J5325J4448J2682
$$ 510610 519301 530367 543951 560101 578258 597276 615888 633299 649475 664800 679248 691930
51861F91930R652N764J537k871p282j1149j3970j5669j6263j5594j3766j1481
$$ 691930 701582 707346 708883 706012 698730 687581 673611 657942 641679 626085 612319 600838
51849F00838r418p640n968m634l967l840l961m415n321o265o749o984p470p952
$$ 600838 591420 583780 577812 573178 569211 565371 561410 556995 551674 545409 538660 531676 524206 516254
51835E16254p633o392m972l836k712j470o49n64n50L11K046L768M610M286K967
$$ 516254 508621 502229 497257 493421 490709 489239 488590 488026 487476 487787 489833 493601 498211 502497 505464
51820E05464J016j173l276n022o030n927m723k928j191J09R87J828L192N238P250
$$ 505464 506480 505307 502031 497009 490979 485052 480329 477401 476210 476319 477306 479134 482326 487564 494814
51805D94814Q034O969M536J771n57k244l553m863o211p047o802n726m773m576
$$ 494814 502848 509817 514353 516124 515567 513323 509770 504907 498696 491649 484847 479121 474348 469772
51791D69772m853m982m753m294l640k757j861j314j186j119o18M86J815K679K653
$$ 469772 464919 459937 455184 450890 447250 444493 442632 441318 440132 439013 438395 438881 440696 443375 446028
51776D46028J830N05j151k782l516k690q68N10P45O68J484L384N588P408Q804
$$ 446028 447858 448363 447212 444430 440914 438224 437356 437866 438611 439279 440763 444147 449735 457143 465947
51761D65947J0110J1562J2927J3420J2201R165N032N86l681p190r195r642r518
$$ 465947 476057 487619 500546 513966 526167 535332 540364 540950 537269 530079 520884 511242 501724
51748E01724r803j0355j0325r395q008o652n524m665l849k421Q7L252O215Q732
$$ 501724 491921 481566 471241 461846 453838 447186 441662 436997 433148 430727 430814 434066 440281 449013
51734D49013J1127J3274J4447J4308J3350J2029J0220P904N784M588M210M012
$$ 449013 460140 473414 487861 502169 515519 527548 537768 545672 551456 556044 560254 564266
51722E64266L665L041J673r47m417p452r026r130q312p021n613m508l890l492
$$ 564266 567931 570972 572645 571698 567281 559829 550803 541673 533361 526340 520727 516219 512329 508837
51708E08837l104l041l636m342l936j780J491M794P652J0055J1628J1637R914
$$ 508837 505733 502692 499056 494714 490778 488998 490489 495283 502935 512990 524618 536255 546169
51695E46169P226M521K171K53p80k71J766M261N779N481L447L05l248o612r264
$$ 546169 553395 557916 560087 560340 559560 559289 561055 565316 571095 576576 580023 580328 577080 570468 561204
51680E61204j0777j1090j0608r902r124p822n474k202J193L919N763O980P776
$$ 561204 550427 539337 528729 518827 509703 501881 496407 494205 495398 499317 505080 512060 519836
51667E19836Q188Q386Q774R531J0141R694P723M577R09k946o850j0348j2647j3185
$$ 519836 528024 536410 545184 554715 564856 574550 582273 586850 587759 584813 577963 567615 554968 541783
51653E41783j1997r482o121k506O01K547L144K650J474m0j618l126m650o357q162
$$ 541783 529786 520304 514183 511677 512278 514825 517969 520619 522093 522053 520435 517309 512659 506302 498140
51638D98140r620j0291j0210r784r245q421p241o136n560n216m301k673j193o49
$$ 498140 488520 478229 468019 458235 448990 440569 433328 427192 421632 416416 412115 409442 408249 407600
51624D07600p99r18q75j028j380j526j429j469j683j543p64L06J248K023K555
$$ 407600 406801 405883 405008 403980 402600 401074 399645 398176 396493 394950 394186 394492 395740 397763 400318
51609D00318K481J772J081R66J143J077R50J337K133K593K505K589L511N076O739
$$ 400318 402799 404571 405652 406618 407761 408838 409788 411125 413258 415851 418356 420945 424456 429532 436271
51594D36271Q435J0383J2280J3255J2667J0619P692M440J389q06j653j346p35
$$ 436271 444706 455089 467369 480624 493291 503910 511602 516042 517431 516625 514972 513626 512891
51581E12891n21n55j37J096K874M894P396J0848J5191J9626K3174K5404K6605
$$ 512891 512370 511815 511678 512774 515648 520542 527938 538786 553977 573603 596777 622181 648786
51568F48786K7389K8192K9154L0277L1415L2039L1402K9376K7052K6111K7503
$$ 648786 676175 704367 733521 763798 795213 827252 858654 888030 915082 941193 968696
51557I68696L0982L5882M1818M8290N3869N6365N4009M6451L4678K0146M163j1974
$$ 968696 999678 1035560 1077378 1125668 1179537 1235902 1289911 1336362 1371040 1391186 1395349 1383375
51545A383375k6714l8685m7589n4234n9349o2658o3509o2006n8911n4620m9072
$$ 1383375 1356661 1317976 1270387 1216153 1156804 1094146 1030637 968631 909720 855100 806028
51534H06028m2701l6669l1854k8191k5266k2917k0882j8548j5630j2731j0633
$$ 806028 763327 726658 694804 666613 641347 618430 597548 579000 563370 550639 540006
51523E40006r351q336p281o275n468n042n176n615n592m758l791l517l751l677
$$ 540006 530655 522319 515038 508763 503295 498253 493077 487462 481870 477112 473321 469804 466053 462376
51509D62376l113k577k285j969j655j818k526l201l426l396l290k884k034j050
$$ 462376 459263 456686 454401 452432 450777 448959 446433 443232 439806 436410 433120 430236 428202 427152
51495D27152k31M43R35J037R48J371K503L481L428K633K026J847J585J047N66
$$ 427152 426921 427364 428299 429336 430284 431655 434158 437639 441067 443700 445726 447573 449158 450205 450771
51480D50771J06r89k933m843n673n440n005m885m835m479l792k945k135j675j843
$$ 450771 450877 449888 446955 442112 436439 430999 425994 421109 416274 411795 408003 405058 402923 401248 399405
51465C99405k326k315j417j89O70J280K225L429M137M068L884M231M900N261N095
$$ 399405 397079 394764 393347 393158 393828 395108 397333 400762 404899 408967 412851 417082 421982 427243 432338
51450D32338M547L678K611J875J998K817L647M258N341P802J1706J5899J8687
$$ 432338 436885 440563 443174 445049 447047 449864 453511 457769 463110 470912 482618 498517 517204
51437E17204J9012J7095J3891J0022N712J686o79p78K52O30l00k087m511p815
$$ 517204 536216 553311 567202 577224 582936 584622 583943 583165 583417 584047 583747 581660 577149 569334
51423E69334j1520j4147j4657j3508j1837j0103q109n963m275l382k830j863k84
$$ 569334 557814 543667 529010 515502 503665 493562 485453 479490 475215 471833 469003 467140 466856
51410D66856J300K089J955J593J729K377L054L489L719L586K743J294jm72j69
$$ 466856 468156 470245 472200 473793 475522 477899 480953 484442 488161 491747 494490 495784 495783 495311 495142
51395D95142L71Q35J355K242L626N283O774P895Q964J0452J2338J4265J6341J9388
$$ 495142 495513 496348 497703 499945 503571 508854 515628 523523 532487 542939 555277 569542 585883 605271
51381F05271K4098L0211L6844M3456N0278N7757O5637P2706P7526P9443P8600
$$ 605271 629369 659580 696424 739880 790158 847915 913552 986258 1063784 1143227 1221827
51370A221827P4830O7141N4932L9423K3000P116q339k3486l7308m8658n7554o4631
$$ 1221827 1296657 1363798 1418730 1458153 1481153 1488269 1479930 1456444 1419136 1370478 1312924 1248293
51358A248293o9754p2066p1306o8381o4512o0322n5753n0499m4443l7988l1972
$$ 1248293 1178539 1106473 1035167 966786 902274 841952 786199 735700 691257 653269 621297
51347F21297k6993k2908j9288j6207j4168j3237j2711j1808j0422r007p917p076
$$ 621297 594304 571396 552108 535901 521733 508496 495785 483977 473555 464548 456631 449555
51335D49555o257n504n135n269n414m845l459k030j345j272r64N5J269J724J091
$$ 449555 443298 437794 432659 427390 421976 417131 413672 411642 410297 409025 408061 408116 409385 411109 412200
51320D12200R5j34P54J902K134J213p5r90j476j583r93L70J725K190J912J771
$$ 412200 412295 412161 412915 414817 416951 418164 418089 417099 415623 414040 413047 413417 415142 417332 419244 421015
51304D21015K029K017J262K63k25j05J68K23p7p97j873l002l950m697n135m877
$$ 421015 423044 425061 426323 426586 426361 426256 426424 426647 426570 425773 423900 420898 416948 412251 407116 402239
51288D02239l767k415j658j596j513q17M03J669K640L142L172L022L063L165K780
$$ 402239 398472 396057 394399 392803 391290 390473 390876 392545 395185 398327 401499 404521 407584 410749 413529
51273D13529J856J260J718K748L290L216L380M225N116N356N097M806M442L725
$$ 413529 415385 416645 418363 421111 424401 427617 430997 435222 440338 445694 450791 455597 460039 463764
51259D63764K767J789N04j508l983o044p092p188o643n811n081m650m280l760
$$ 463764 466531 468320 468824 467316 463333 457289 450197 443009 436366 430555 425474 420824 416544 412784
51245D12784l359l313l122k141q16l87j190k180k391k000j484o98M90J343J079
$$ 412784 409425 406112 402990 400849 400033 399646 398456 396276 393885 391885 390401 389703 390193 391536 392615
51230C92615Q2n17l45KO3M9K43N95J081J804K592L005K941K779K695K348J457
$$ 392615 392697 392180 391835 391837 391900 391949 392192 392787 393868 395672 398264 401269 404210 406989 409684 412032 413489
51213D13489L31n18r85j237j261q59k1J011J992K777L272L482L542L522L278K710
$$ 413489 413820 413302 412317 411080 409819 408960 408939 409950 411942 414719 417991 421473 425015 428537 431815 434525
51197D34525K040J553J098K48j011k054k359k104j761j417r06l99k15j09N32J677
$$ 434525 436565 438118 439216 439464 438453 436399 434040 431936 430175 428758 427852 427453 427238 427129 427661 429338
51181D29338K476K399J915J583J220N45N1L13R19J038P84R04J283R24l25j316
$$ 429338 431814 434213 436128 437711 438931 439476 439527 439840 440759 441797 442581 443485 444768 445692 445367 444051
51165D44051j181m35Q3L34N27L42m09j060r82o49r80j966k812l126l185l223l274
$$ 444051 442870 442435 442518 442852 443379 443721 443312 442252 441270 440621 439641 437675 434863 431737 428552 425329 422055
51148D22055l432l619l285k118q45m68r30j348j363j359j378r60j44L69L82N79
$$ 422055 418623 415004 411719 409601 408756 408288 407358 406010 404647 403288 401910 400950 400806 401175 401557 402136
51132D02136J346K040J988J488J302J609K048K348K362J911J042K28q9M4L86Q81
$$ 402136 403482 405522 407510 408998 410300 411909 413957 416305 418667 420578 421620 421848 421759 421803 422189 423070
51116D23070J452J792J767J746K130K836L553M208M788M979M500L586K745K158
$$ 423070 424522 426314 428081 429827 431957 434793 438346 442554 447342 452321 456821 460407 463152 465310
51102D65310J651J111M90l79j544k599l068l035k944k856k365j350k86L27M91
$$ 465310 466961 468072 468562 468183 466639 464040 460972 457937 454993 452137 449772 448422 448136 448463 448954
51087D48954M67L85K68J70R4oJ8N07J470K329K530K218J997K084K138J949J843
$$ 448954 449421 449806 450074 450244 450338 450332 450350 450857 452327 454656 457186 459404 461401 463485 465623 467572 469415
51070D69415K168K664K737K273J807J893K597L684N012O458P723Q510Q918R299
$$ 469415 471583 474247 476984 479257 481064 482957 485554 489238 494250 500708 508431 516941 525859 535158
51056E35158R665R489Q320O451M727L779L683M354N858Q140J0635J2563J3591
$$ 535158 544823 554312 562632 569083 573810 577589 581272 585626 591484 599624 610259 622822 636413
51043F36413J4014J4217J4256J3922J3008J1394R235P116N680M758L281L83l712
$$ 636413 650427 664644 678900 692822 705830 717224 726459 733575 739255 744013 747294 747677 743965
51030G43965q221j2779j7244k0927k2977k3532k3500k2998k1079j7425j3328j0210
$$ 743965 735744 722965 705721 684794 661817 638285 614785 591787 570708 553283 539955 529745
51018E29745p939n529k931r82J34J201K665L947M434M343M353M867N956P476Q928
$$ 529745 521806 516277 513346 512364 512498 513699 516364 520311 524745 529088 533441 538308 544264 551740 560668
51003E60668R641R471R013Q878R102R388R591R732R845J0128J0891J2074J3102
$$ 560668 570309 579780 588793 597671 606773 616161 625752 635484 645329 655457 666348 678422 691524
50990F91524J3578J3867J4606J5797J6722J6876J6534J6399J6778J7377J7753
$$ 691524 705102 718969 733575 749372 766094 782970 799504 815903 832681 850058 867811
50979H67811J7789J7532J6674J4541J0873O370K231q03k731l763m027l696k959
$$ 867811 885600 903132 919806 934347 945220 951590 953821 953018 950287 946524 942497 938801 935842
50966I35842j629Q09M542R068J3702J8139K2289K5907K8775L1190L3762L6643
$$ 935842 934213 935022 939564 948632 962334 980473 1002762 1028669 1057444 1088634 1122396 1159039
50954A159039L9227M0752M1032M0391L9118L7369L5613L4633L4727L5233L5423
$$ 1159039 1198266 1239018 1280050 1320441 1359559 1396928 1432541 1467174 1501901 1537134 1572557
50943A572557L5736L7393M0540M3548M4527M2999L9525L4435K7877K0813J4784
$$ 1572557 1608293 1645686 1686226 1729774 1774301 1817300 1856825 1891260 1919137 1939950 1954734
50932A954734J0439P021L584kl497p192j1778j7584k4228l0921l6996m2383m7547
$$ 1954734 1965173 1972194 1975778 1975776 1972279 1965087 1953309 1935725 1911497 1880576 1843580 1801197 1753650
50919A753650n2758n7521o1020o2960o3444o2318n9422n5508n1916m9079m6067
$$ 1753650 1700892 1643371 1582351 1519391 1455947 1393629 1334207 1278699 1226783 1177704 1131637
50908A131637m2074l7498l3177k9293k5712k2694k0469j8530j6244j3867j2146
$$ 1131637 1089563 1052065 1018888 989595 963883 941189 920720 902190 885946 872079 859933
50897H59933j1106j0028q647p554p270p494p563p137o292n243m275l613l201k720
$$ 859933 848827 838799 830152 822598 815328 807834 800271 793134 786842 781599 777324 773711 770510 767790
50883G67790j966j046k08M49J012J645K427L197L616L520L215L223L795M721N632
$$ 767790 765824 764778 764570 765019 766031 767676 770103 773300 776916 780436 783651 786874 790669 795390 801022
50868H01022O427P391Q827J0534J1796J2112J1883J2068J3217J5115J7351J9725
$$ 801022 807449 814840 823667 834201 845997 858109 869992 882060 895277 910392 927743 947468
50856I47468K2057K4162K6268K8980L2520L6366L9976M3465M7264N1504N6138
$$ 947468 969525 993687 1019955 1048935 1081455 1117821 1157797 1201262 1248526 1300030 1356168
50845A356168O1221O6616P1731P6130Q0075Q3950Q7457Q9994R1530R2389R2220
$$ 1356168 1417389 1484005 1555736 1631866 1711941 1795891 1883348 1973342 2064872 2157261 2249481
50834B249481Q9980Q5143P8383P0865O3292N5924M9104M3394L9261L6793L5892
$$ 2249481 2339461 2424604 2502987 2573852 2637144 2693068 2742172 2785566 2824827 2861620 2897512
50823B897512L6671L9532M4506N0693N6825O2485O7985P2712P4440P1101O2699
$$ 2897512 2934183 2973715 3018221 3068914 3125739 3188224 3256209 3328921 3403361 3474462 3537161
50812C537161N0592L5421J6946m302k6544m8270o9145q9016j06987j22114j34224
$$ 3537161 3587753 3623174 3640120 3635818 3609274 3561004 3491859 3402843 3295856 3173742 3039518
50801C039518j43307j48740j49860j46960j40939j32217j20772j07205r3072p9871
$$ 3039518 2896211 2747471 2597611 2450651 2309712 2177495 2056723 1949518 1856446 1776575
50791A776575o8034n7012m6168l5467k5492j6965j0240n190j523Q90K008J852
$$ 1776575 1708541 1651529 1605361 1569894 1544402 1527437 1517197 1512007 1510484 1511374 1513382 1515234
50779A515234O99r51k713m646o985r443j1149j1703j1987j3286j5716j8211k0102
$$ 1515234 1515933 1514982 1512269 1507623 1500638 1491195 1480046 1468343 1456356 1443070 1427354 1409143 1389041
50766A389041k1910k4263k6760k8522k9364k9808l0183l0303k9894k8852k7116
$$ 1389041 1367131 1342868 1316108 1287586 1258222 1228414 1198231 1167928 1138034 1109182 1082066
50755A082066k4752k2120j9625j7281j4845j2265r679p079m337j582Q33K846M793
$$ 1082066 1057314 1035194 1015569 998288 983443 971178 961499 954420 950083 948501 949334 952180 956973
50742I56973O904R038J1036J3077J5419J7988K0476K2760K4975K7269K9631L2028
$$ 956973 963877 972915 983951 997028 1012447 1030435 1050911 1073671 1098646 1125915 1155546 1187574
50730A187574L4507L7120L9755M2178M4199M5824M7246M8690N0180N1461N2182
$$ 1187574 1222081 1259201 1298956 1341134 1385333 1431157 1478403 1527093 1577273 1628734 1680916
50719A680916N2110N1114M9000M5478M0446L4170K7108J9656J2290N795J088j291
$$ 1680916 1733026 1784140 1833140 1878618 1919064 1953234 1980342 1999998 2012288 2018083 2019171 2017880
50707B017880j285R45N113J0544J6371K2218K8281L4420L9516M2245M2241L9892
$$ 2017880 2016595 2017540 2022653 2033197 2049568 2071786 2100067 2134487 2174003 2216248 2258489 2298381
50695B298381L5167K7330J6038K137j2858k7727m1786n4531o5407p3714p8616
$$ 2298381 2333548 2360878 2376916 2379053 2366195 2338468 2296682 2242151 2176744 2103030 2024414
50684B024414p9529p6718p1265o4267n6270m7633l8983l0826k2915j4440m943
$$ 2024414 1944885 1868167 1796902 1732635 1676365 1628732 1589749 1558923 1536008 1521568 1516625
50673A516625N217J5196K4201L1793L8010M3219M7537N0365N0874M8970M5522
$$ 1516625 1521842 1537038 1561239 1593032 1631042 1674261 1721798 1772163 1823037 1872007 1917529
50662A917529M1418L6821L1626K6317K1826J8538J5963J3580J1617J0583J0337
$$ 1917529 1958947 1995768 2027394 2053711 2075537 2094075 2110038 2123618 2135235 2145818 2156155
50651B156155J0043R072P583O181N348N326O194P857J0157J3224J7428K2756K8487
$$ 2156155 2166198 2175270 2182853 2189034 2194382 2199708 2205902 2213759 2223916 2237140 2254568 2277324 2305811
50638B305811L3773L8402M2638M6531M9768N2135N3722N4734N5524N6855N9491
$$ 2305811 2339584 2377986 2420624 2467155 2516923 2569058 2622780 2677514 2733038 2789893 2849384
50627B849384O3148O5998O5291N8380M3349J9644j0944m3920p3433r4738j05917
$$ 2849384 2912532 2978530 3043821 3102201 3145550 3165194 3154250 3110330 3036897 2942159 2836242
50616B836242j07786j02566r2603p9769o5453n0771l6702k4026j3185m287K624
$$ 2836242 2728456 2625890 2533287 2453518 2388065 2337294 2300592 2276566 2263381 2259094 2261718
50605B261718P237R052P909M209j600r602j9949l1772m3139n2468n9627o5238
$$ 2261718 2268955 2278007 2285916 2290125 2288525 2278923 2258974 2227202 2184063 2131595 2071968 2006730
50593B006730o9403p1697p2099p1169o9220o6070o1746n6794n1730m6577m1254
$$ 2006730 1937327 1865630 1793531 1722362 1653142 1587072 1525326 1468532 1416802 1370225 1328971
50582A328971l5997l1090k6604k2551j9012j5809j2419q493m254j49L550O620
$$ 1328971 1292974 1261884 1235280 1212729 1193717 1177908 1165489 1156996 1152742 1152593 1156143 1162763
50570A162763Q758R904J0412J0637J0541J0039R425R104R145R480J0363J2178
$$ 1162763 1171521 1181425 1191837 1202474 1213015 1223054 1232479 1241583 1250728 1260208 1270571 1282749
50558A282749J4937J8276K1942K5868K9921L3883L7776M1821M5984M9663N1951
$$ 1282749 1297686 1315962 1337904 1363772 1393693 1427576 1465352 1507173 1553157 1602820 1654771
50547A654771N2205N0518M7629M4316M0857L7353L4436L3098L3587L5085L6904
$$ 1654771 1706976 1757494 1805123 1849439 1890296 1927649 1962085 1995183 2028770 2063855 2100759
50536B100759L9514M3701M9095N4389N8972O3531O8902P5084Q1694Q8764R6536
$$ 2100759 2140273 2183974 2233069 2287458 2346430 2409961 2478863 2553947 2635641 2724405 2820941
50525B820941J04830J13052J20663J27285J32459J35677J36558J34850J30298
$$ 2820941 2925771 3038823 3159486 3286771 3419230 3554907 3691465 3826315 3956613
50516C956613J22721J12154R8713Q2359O3032M1061J7332o988l0887n3710p4989
$$ 3956613 4079334 4191488 4290201 4372560 4435592 4476653 4493985 4486997 4456110 4402400 4327411
50505D327411r4133j10268j22425j29992j32919j31522j26048j16565j03245q6701
$$ 4327411 4233278 4123010 4000585 3870593 3737674 3606152 3480104 3363539 3260294 3173593
50495C173593o7837m7383k5808l875J6839L4449M7701N6167N9359N6154M5511
$$ 3173593 3105756 3058373 3032565 3028690 3045529 3079978 3127679 3183846 3243205 3299359 3344870
50484C344870K7626M205k2223m9090p4207r6026j13666j26599j34414j37130j35565
$$ 3344870 3372496 3376701 3354478 3305388 3231181 3135155 3021489 2894890 2760476 2623346 2487781
50473B487781j31035j24657j17078j08784j00251r1807q3678p6163o9519o3620
$$ 2487781 2356746 2232089 2115011 2006227 1905976 1814169 1730491 1654328 1584809 1521189
50463A521189n8098n2873m8200m4084m0008l5475l0605k5951k1893j8341j4983
$$ 1521189 1463091 1410218 1362018 1317934 1277926 1242451 1211846 1185895 1164002 1145661 1130678
50452A130678j1678q681o465n244m622l938k870j568k18J162K536L756M777N578
$$ 1130678 1119000 1110319 1103854 1098610 1093988 1090050 1087180 1085612 1085394 1086556 1089092 1092848 1097625 1103203
50438A103203N880N380M482M303N526P547R165R931J0358J1058J2178J3579J5123
$$ 1103203 1109083 1114463 1118945 1123248 1128774 1136321 1145486 1155417 1165775 1176833 1189011 1202590 1217713
50425A217713J6638J8020J9379K0874K2392K3770K5289K7489L0435L3671L7081
$$ 1217713 1234351 1252371 1271750 1292624 1315016 1338786 1364075 1391564 1421999 1455670 1492751
50414A492751M1311M6858N3109N8828O3525O7793P2177P6261P9053Q0065P9600
$$ 1492751 1534062 1580920 1634029 1692857 1756382 1824175 1896352 1972613 2051666 2131731 2211331
50403B211331P8195P6114P3411P0103O6002O0590N3298M3974L2819J9940N245
$$ 2211331 2289526 2365640 2439051 2509154 2575156 2635746 2689044 2733018 2765837 2785777 2791022
50392B791022j1075k8163m4752n9745p2372q2069q8429r1337r0931q7536q1694
$$ 2791022 2779947 2751784 2707032 2647287 2574915 2492846 2404417 2313080 2222149 2134613 2052919
50381B052919p4055o4910n4010m1311k7819j5158m224N256J3580K0096K3801K4406
$$ 2052919 1978864 1913954 1859944 1818633 1790814 1775656 1771432 1776688 1790268 1810364 1834165 1858571
50369A858571K2214J7221R123j757j4155k6575l7971m7656n5175o0446o3722o5129
$$ 1858571 1880785 1898006 1907129 1905372 1891217 1864642 1826671 1779015 1723840 1663394 1599672 1534543
50357A534543o4588o2309n8984n5272n1408m7541m4037m1072l8205l4837l0907
$$ 1534543 1469955 1407646 1348662 1293390 1241982 1194441 1150404 1109332 1071127 1036290 1005383
50346A005383k6813k2808j8924j5351j2433j0266q680p541o747n952m773l319
$$ 1005383 978570 955762 936838 921487 909054 898788 890108 882567 875820 869868 865095 861776
50334H61776k143j540j229q36k83L75J098J620J491P32J48N70J959L519M547M804
$$ 861776 859633 858093 856864 856028 855745 856120 857218 858838 860329 861061 861209 861779 863738 867257 871804 876608
50318H76608M286L176K021J470J643K066K407K870L640M303M339M109M727O690
$$ 876608 880894 884070 886091 887561 889204 891270 893677 896547 900187 904490 908829 912938 917665 924355
50304I24355R031J0215R782Q698Q238Q866J0323J2262J4456J6707J8967K1504
$$ 924355 933386 943601 953383 962081 970319 979185 989508 1001770 1016226 1032933 1051900 1073404
50292A073404K4498K7477K9427K9488K7317K2830J6167Q138K56o119j0579j3383
$$ 1073404 1097902 1125379 1154806 1184294 1211611 1234441 1250608 1258746 1259002 1252883 1242304 1228921
50280A228921j4597j3972j1513p755l487L16K245Q44m011j0347j5407j7843j8345
$$ 1228921 1214324 1200352 1188839 1181084 1177597 1177913 1180158 1181002 1176991 1166644 1151237 1133394 1115049
50267A115049j8064j7133j5111j2367j0144r250r237r133q495p449n999l850r41
$$ 1115049 1096985 1079852 1064741 1052374 1042230 1032980 1023743 1014610 1006115 998666 992667 988817 987876
50254I87876K123M352N222N225N504O730Q421R524R642R288R018Q748Q105P008
$$ 987876 989999 994351 999573 1004798 1010302 1017032 1025453 1034977 1044619 1053907 1062925 1071673 1079778 1086786
50240A086786N647M247L037K107J038p95l294n506o848p921r516j1373j2720j3518
$$ 1086786 1092433 1096680 1099717 1101824 1102862 1102067 1098773 1093267 1086419 1078498 1068982 1057609 1044889 1031371
50226A031371j4240j4716j4327j3244j2401j2059j1507j0402r338q649p623n547
$$ 1031371 1017131 1002415 988088 974844 962443 950384 938877 928475 919137 910488 902865 897318
50214H97318k753K0K649N378Q098J0707J3653J7492K2025K6507L0370L3365L5330
$$ 897318 894565 894585 897234 902612 910710 921417 935070 952562 974587 1001094 1031464 1064829 1100159
50201A100159L6332L6636L6151L4379L1487K8838K7731K7966K8363K8291K7847
$$ 1100159 1136491 1173127 1209278 1243657 1275144 1303982 1331713 1359679 1388042 1416333 1444180
50190A444180K6864K4743K1133J5860Q298k122j4558k6780l6901m4500m9935n3338
$$ 1444180 1471044 1495787 1516920 1532780 1541078 1538956 1524398 1497618 1460717 1416217 1366282 1312944
50178A312944n4637n3866n1091m6371m0078l2813k4932j6745r288m131j984k106
$$ 1312944 1258307 1204441 1153350 1106979 1066901 1034088 1009156 992411 983123 978992 977008 974902
50166I74902l500o031r819j4051j7238j8501j8010j6330j3842j0890p911n261
$$ 974902 971402 965371 955552 941501 924263 905762 887752 871422 857580 846690 838779 833518
50154H33518l010q77J617M693P808R849J0199R368Q306P250N680L264L40k622
$$ 833518 830508 829631 831248 835941 843749 853598 863797 873165 881471 888721 894401 897665 898005 895383
50140H95383n578q646j1574j3694j4411j3592j1515q576n121j539J680M153N927
$$ 895383 889805 881159 869585 855891 841480 827888 816373 807797 802676 801137 802817 806970 812897
50127H12897P337Q472Q914Q263O797N461N089N668O334O119M798L097K051K123
$$ 812897 820234 828706 837620 845883 852680 858141 863230 868898 875232 881351 886149 889246 891297 893420
50113H93420K968L895M456M555M378M321M827O066P803R639J1251J2445J3222
$$ 893420 896388 900283 904739 909294 913672 917993 922820 928886 936689 946328 957579 970024 983246
50100I83246J3977J5378J7800K0950K4209K7219K9952L2501L5170L8595M3302
$$ 983246 997223 1012601 1030401 1051351 1075560 1102779 1132731 1165232 1200402 1238997 1282299
50089A282299M9059N5059O0828O6494P1945P6199P8077P7374P4894P1558O7913
$$ 1282299 1331358 1386417 1447245 1513739 1585684 1661883 1739960 1817334 1892228 1963786 2031699
50078B031699O4491O1996O0740O0204N9400N7418N3341M6004L4506J9120J361
$$ 2031699 2096190 2158186 2218926 2279130 2338530 2395948 2449289 2495293 2529799 2548919 2550280
50067B550280j6975l4626n0790o4743p5868q4021q9465r2411r2800r0604q6241
$$ 2550280 2533305 2498679 2447889 2383146 2307278 2223257 2133792 2041381 1948581 1857977 1771736
50056A771736q0506p4039o6957n9158n0839m2531l4637k7302k0802j5670j2114
$$ 1771736 1691230 1617191 1550234 1491076 1440237 1397706 1363069 1335767 1314965 1299295 1287181
50045A287181r662p714o227n380m888m261l546l188l194l171l179l725m730n307
$$ 1287181 1277519 1269805 1263578 1258198 1253310 1249049 1245503 1242315 1239121 1235950 1232771 1229046 1224316 1219009
50031A219009n006m438m255m218l913l713m214n219o106o825p716q585q894q738
$$ 1219009 1214003 1209565 1205310 1201092 1197179 1193466 1189252 1184033 1177927 1171102 1163386 1154801 1145907 1137169
50017A137169q741q966q811q209q060r047j0635j1738j1999j1954j2202j2799
$$ 1137169 1128428 1119462 1110651 1102442 1094382 1085335 1074700 1062962 1050963 1039009 1026807 1014008
50005A014008j3413j3718j3544j2763j1244r050o637m430k133J116N604J0331
$$ 1014008 1000595 986877 973333 960570 949326 940276 933639 929209 927076 928192 933796 944127
49993I44127J3859J5633J6085J5810J5136J4194J2945J1238R348Q129Q021Q209
$$ 944127 957986 973619 989704 1005514 1020650 1034844 1047789 1059027 1068375 1076504 1084525 1092734
49981A092734P482N668L503J352r75l224m512m361k987n56L048P488J2012J6493
$$ 1092734 1100216 1105884 1109387 1110739 1109764 1106540 1102028 1097667 1094680 1094124 1097172 1104660 1116672 1133165
49967A133165K1437K6601L0640L2733L3573L4107L4153L3142L1534L0393L0068
$$ 1133165 1154602 1181203 1211843 1244576 1278149 1312256 1346409 1379551 1411085 1441478 1471546
49956A471546L0285L1226L3385L6292L8244L7584L3757K7136J8342P947l523j5416
$$ 1471546 1501831 1533057 1566442 1602734 1640978 1678562 1712319 1739455 1757797 1765744 1762221 1746805
49944A746805k6790l6578m4167m9596n2988n4125n2969n0310m7309m4611m2296
$$ 1746805 1720015 1683437 1639270 1589674 1536686 1482561 1429592 1379282 1331973 1287362 1245066
49933A245066m0534l9700l9847m0549m1327m1831m1586m0033l7055l3243k9457
$$ 1245066 1204532 1164832 1124985 1084436 1043109 1001278 959692 919659 882604 849361 819904
49922H19904k6086k2828j9203j5277j1723r035o794m182j196J118J859J302N19
$$ 819904 793818 770990 751787 736510 724787 715752 708958 704776 703580 704698 706557 707859 708378
49909G08378L52R76K094L230M114N040O525Q556J0496J1971J3227J4426J5314
$$ 708378 708730 709706 711800 715030 719144 724184 730709 739265 749761 761732 774959 789385 804699
49896H04699J5944J6940J8285J8608J6641J2879Q905N393J867j796m904p120q990
$$ 804699 820643 837583 855868 874476 891117 903996 912901 918294 920161 918365 913461 906341 897351
$$ [...]
56827a