
##TITLE=AC1395_GUALH12207_7519859_1o7gSwumvg
##JCAMPDX= 6.0         $$ Bruker NMR JCAMP-DX V2.0
##DATA TYPE= NMR SPECTRUM
##DATA CLASS= NTUPLES
##ORIGIN= BRUKER
##OWNER= Administrator
$$ 1.72 TOPSPIN		Version 2.1
$$ 2013-02-19 21:04:55.453 -0500  Administrator@X
$$ Compression mode = diff/dup
##.OBSERVE FREQUENCY= 400.02188249412
##.OBSERVE NUCLEUS= ^1H
##.ACQUISITION MODE= SIMULTANEOUS (DQD)
##.ACQUISITION SCHEME= undefined
##.AVERAGES= 8
##.DIGITISER RES= 22
##SPECTROMETER/DATA SYSTEM= spect
##.PULSE SEQUENCE= zg30
##.SOLVENT NAME= COFFEE_meoh
##.SHIFT REFERENCE= INTERNAL, COFFEE_meoh, 1, 14.98509
##AUDIT TRAIL= $$ (NUMBER, WHEN, WHO, WHERE, PROCESS, VERSION, WHAT)
$$ ##TITLE= Audit trail, TOPSPIN		Version 2.1
$$ ##JCAMPDX= 5.01
$$ ##ORIGIN= Bruker BioSpin GmbH
$$ ##OWNER= Administrator
$$ $$ E:\/data/COFFEE/nmr/AC1395_GUALH12207_7519859_1o7gSwumvg/10/pdata/1/auditp.txt
$$ ##AUDIT TRAIL=  $$ (NUMBER, WHEN, WHO, WHERE, PROCESS, VERSION, WHAT)
(   1,<2013-02-19 21:04:47.109 -0500>,<Administrator>,<X>,<go>,<TOPSPIN 2.1>,
      <created by zg
	started at 2013-02-19 21:03:41.062 -0500,
	POWCHK enabled, PULCHK disabled,
       configuration hash MD5:
       86 BA 57 50 F2 9D 5C 9B 26 00 A9 28 5F 66 2E 89
       data hash MD5: 64K
       D4 A2 A1 27 C7 B6 35 5D C6 83 4C 53 03 81 56 0D>)
(   2,<2013-02-19 21:04:50.296 -0500>,<Administrator>,<X>,<proc1d>,<TOPSPIN 2.1>,
      <Start of raw data processing
       efp LB = 0 FT_mod = 6 PKNL = 1 PHC0 = 0 PHC1 = 0 SI = 32K 
       data hash MD5: 32K
       C7 DA 75 43 48 F5 AF B9 2B C9 89 43 F1 CB 96 F1>)
(   3,<2013-02-19 21:04:50.765 -0500>,<Administrator>,<X>,<proc1d>,<TOPSPIN 2.1>,
      <pk PHC0 = 72.78442 PHC1 = 0 
       data hash MD5: 32K
       1C 6B 7D 90 C0 CD 3D D0 EE 36 D4 22 B1 89 DD F1>)
(   4,<2013-02-19 21:04:50.984 -0500>,<Administrator>,<X>,<proc1d>,<TOPSPIN 2.1>,
      <abs ABSG = 1 
       data hash MD5: 32K
       57 8C D2 8C 9F AC D9 E6 C0 B8 61 87 9A 25 BC 7F>)
(   5,<2013-02-19 21:04:51.156 -0500>,<Administrator>,<X>,<proc1d>,<TOPSPIN 2.1>,
      <abs ABSG = 2 
       data hash MD5: 32K
       17 C0 40 2D A4 1B CF D9 6F A9 36 EA C7 95 2E C5>)
(   6,<2013-02-19 21:04:51.312 -0500>,<Administrator>,<X>,<proc1d>,<TOPSPIN 2.1>,
      <abs ABSG = 3 
       data hash MD5: 32K
       A1 63 58 88 50 9F BD 4F 0C 6D 6C 44 75 5F FC 18>)
(   7,<2013-02-19 21:04:51.453 -0500>,<Administrator>,<X>,<proc1d>,<TOPSPIN 2.1>,
      <abs ABSG = 4 
       data hash MD5: 32K
       C4 09 A7 D6 7F 99 A5 D8 A5 3A EE 03 61 29 12 91>)
(   8,<2013-02-19 21:04:51.593 -0500>,<Administrator>,<X>,<proc1d>,<TOPSPIN 2.1>,
      <abs ABSG = 5 
       data hash MD5: 32K
       86 89 67 46 BA E2 D3 E2 17 8E C5 D4 D8 04 05 AE>)
$$ ##END=
$$ 
$$ $$ hash MD5
$$ $$ 13 DF D7 1F D0 E1 8F 00 34 85 8E CC F9 15 65 52
##$RELAX= 
##$RELAX= 
##$RELAX= 
##$RELAX= 
##$RELAX= 
##$RELAX= 
##$RELAX= 
$$ Bruker specific parameters
$$ --------------------------
##$DU= <E:\>
##$EXPNO= 10
##$NAME= <AC1395_GUALH12207_7519859_1o7gSwumvg>
$$ [...]
150 150 150 150 150 150 150 150
##$TP07= 0
##$TPNAME0= <>
##$TPNAME1= <>
##$TPNAME2= <>
##$TPNAME3= <>
##$TPNAME4= <>
##$TPNAME5= <>
##$TPNAME6= <>
##$TPNAME7= <>
##$TPOAL= (0..7)
0.5 0.5 0.5 0.5 0.5 0.5 0.5 0.5
##$TPOFFS= (0..7)
0 0 0 0 0 0 0 0
##$TUNHIN= 0
##$TUNHOUT= 0
##$TUNXOUT= 0
##$USERA1= <user>
##$USERA2= <user>
##$USERA3= <user>
##$USERA4= <user>
##$USERA5= <user>
##$V9= 5
##$VALIST= <valist>
##$VCLIST= <CCCCCCCCCCCCCCC>
##$VD= 0
##$VDLIST= <DDDDDDDDDDDDDDD>
##$VPLIST= <PPPPPPPPPPPPPPP>
##$VTLIST= <TTTTTTTTTTTTTTT>
##$WBST= 1024
##$WBSW= 4
##$XGAIN= (0..3)
0 0 0 0
##$XL= 0
##$YL= 0
##$YMAX_a= 561805
##$YMIN_a= -550687
##$ZGOPTNS= <>
##$ZL1= 120
##$ZL2= 120
##$ZL3= 120
##$ZL4= 120
##$ABSF1= 14.98509
##$ABSF2= -5.573092
##$ABSG= 5
##$ABSL= 3
##$ALPHA= 0
##$AQORDER= 0
##$ASSFAC= 0
##$ASSFACI= 0
##$ASSFACX= 0
##$ASSWID= 0
##$AUNMP= <proc_prof1d_extract_pilot.lims>
##$AXLEFT= 0
##$AXNAME= <>
##$AXNUC= <1H>
##$AXRIGHT= 0
##$AXTYPE= 0
##$AXUNIT= <>
##$AZFE= 0.1
##$AZFW= 0.1
##$BCFW= 0
##$BC_mod= 0
##$BYTORDP= 0
##$COROFFS= 0
##$CY= 15
##$DATMOD= 1
##$DC= 0
##$DFILT= <>
##$DTYPP= 0
##$F1P= 0
##$F2P= 0
##$FCOR= 0.5
##$FTSIZE= 32768
##$FT_mod= 6
##$GAMMA= 0
##$GB= 0
##$INTBC= 1
##$INTSCL= 1
##$ISEN= 128
##$LB= 0
##$LEV0= 0
##$LPBIN= 0
##$MAXI= 10000
##$MC2= 0
##$MEAN= 0
##$ME_mod= 0
##$MI= 0
##$NCOEF= 0
##$NC_proc= -8
##$NLEV= 6
##$NOISF1= 0
##$NOISF2= 0
##$NSP= 0
##$NTH_PI= 0
##$NZP= 0
##$OFFSET= 14.98509
##$PC= 1
##$PHC0= 72.78442
##$PHC1= 0
##$PH_mod= 1
##$PKNL= yes
##$PPARMOD= 0
##$PPDIAG= 0
##$PPIPTYP= 0
##$PPMPNUM= 2147483647
##$PPRESOL= 1
##$PSCAL= 4
##$PSIGN= 0
##$PYNMP= <proc.py>
##$REVERSE= no
##$SF= 400.02
##$SI= 32768
##$SIGF1= 0
##$SIGF2= 0
##$SINO= 400
##$SIOLD= 32768
##$SPECTYP= <>
##$SREGLST= <1H.CDCl3>
##$SSB= 0
##$STSI= 32768
##$STSR= 0
##$SW_p= 8223.68421052631
##$SYMM= 0
##$S_DEV= 0
##$TDeff= 65536
##$TDoff= 0
##$TI= <>
##$TILT= no
##$TM1= 0
##$TM2= 0
##$TOPLEV= 0
##$USERP1= <user>
##$USERP2= <user>
##$USERP3= <user>
##$USERP4= <user>
##$USERP5= <user>
##$WDW= 1
##$XDIM= 32768
##$YMAX_p= 456970680
##$YMIN_p= -651585
##$CURPLOT= <Network HP LaserJet P1505>
##$CURPRIN= <$Network HP LaserJet P1505>
##$DFORMAT= <normdp>
##$LAYOUT= <+/1D_H.xwp>
##$LFORMAT= <normlp>
##$PFORMAT= <normpl>
##$SURQMSG= 1
$$ End of Bruker specific parameters
$$ ---------------------------------
##NTUPLES= NMR SPECTRUM
##VAR_NAME=  FREQUENCY,     SPECTRUM/REAL,   SPECTRUM/IMAG
##SYMBOL=    X,             R,               I
##VAR_TYPE=  INDEPENDENT,   DEPENDENT,       DEPENDENT
##VAR_FORM=  AFFN,          ASDF,            ASDF
##VAR_DIM=   32768,         32768,           32768
##UNITS=     HZ,            ARBITRARY UNITS, ARBITRARY UNITS
##FACTOR=    0.250966925370066, 1,           1
##FIRST=     8223.43324360094, -99304,       -46826
##LAST=      0,             92275,           -188930
##MIN=       0,             -651585,         0
##MAX=       8223.43324360094, 456970680,    0
$$ Real data points
##PAGE= N=1
##DATA TABLE= (X++(R..R)), XYDATA
$$ [...]
23869 -72236 -367847 84926 104770 -20357 -257775 203898 -127123 -82930 -22337 41303 130594
23858 130594 -206048 72255 144763 57327 -134102 445286 27779 57435 105201 -49802 40361
23846 -196262 31884 48815 -160077 -400403 -56157 31005 136449 -68841 58955 -37266 -193895
23835 -193895 90559 67672 128184 81380 177785 -39512 196478 -84166 113560 -23675 151721
23823 36845 -59531 -67464 -214124 79999 75920 -95902 -151648 275963 282977 348527 84104 39326
23810 -41842 -21301 -52904 32064 -108016 -115543 -145105 381114 132361 -138173 -56989 152461
23798 -19266 56751 62450 -91391 244046 158216 -195176 237263 -111031 240655 -102710 53395
23786 146230 207371 191388 -164037 -131555 -69915 60156 -138693 -119752 -70137 -162072 47506
23774 -190182 -191013 158853 168973 231768 -50214 396318 -63562 -245606 224022 549334 -113975
23762 70459 -211 -121719 -72192 -168707 -273687 -103113 -163171 91565 157941 -91560 4123 137541
23750 137541 -12611 74577 109826 128516 -162162 -205055 -58599 -28138 -315387 -61156 -156925
23739 -156925 -8279 -72230 -112081 48149 35527 -156590 244792 -201953 -113078 -206021 158743
23727 22069 -12603 -119861 -228196 -143230 -57878 -94060 -45701 -149081 -277742 24744 -145054
23715 -68982 -29643 -75756 -73773 92335 -172622 33290 20343 -117427 90749 -113491 518348
23703 -90513 149870 -100997 89919 -216274 -23498 -26373 -251390 -21347 -95588 -79849 9554
23691 -55074 170486 -113614 103856 169566 -13179 -10528 52734 66541 -246988 76399 191287
23680 191287 3915 174631 165806 -198284 -102454 65341 -209655 -11426 249338 -65959 -87499
23669 -87499 -161559 338884 79468 -205558 -42903 -208021 -333113 -204538 -269651 191870
23658 -145428 -133133 -597985 10407 43021 243352 -161476 -275274 146847 263335 245350
23648 245350 -109075 485720 -233903 -207773 -103100 -136729 211738 -134082 -21442 211949
23637 -480 -62716 -233205 -141697 -28877 -56135 159498 220204 -310878 154367 -143667 -34462
23625 169999 94179 188431 123911 75123 167289 -202873 358441 -135709 -88329 99222 -53224
23613 145293 -164968 103256 -29242 -258643 323379 19138 79347 51799 222141 -264350
23602 -266850 -20788 -382927 145318 -1451 16570 416824 -39918 -92529 -23406 25567 -201517
23590 -215522 -48526 43370 261775 -183182 -92017 98401 -326150 386392 -90247 -84261 317469
23578 217506 4798 189212 164365 -88502 -71457 346858 -105186 -14065 -159041 61774 8957
23566 -218965 -159835 -66832 -152338 -4376 -274994 212117 -18948 218170 -59404 41037 -47110
23554 -370869 58112 4628 -163626 -38328 -180993 62336 89081 -75186 -91745 -266464 -296289
23543 -296289 -322283 12128 232113 -112350 -198106 65496 109404 -392707 341573 -79757 -229667
23532 -229667 -136915 -70479 282754 -40548 160238 83119 247045 57759 -151205 84145 -79032
23520 45431 -122492 -216895 34792 -123797 -164932 36108 -203022 70187 33992 -174609 -63764
23508 235806 -85074 216609 37356 109398 29651 -37156 147655 -50345 113671 149274 144625
23497 144625 393343 49646 116720 9695 -118243 -281949 258128 47790 -161651 17446 -118520
23485 -159326 25430 -198428 -142522 13737 154907 392773 133334 -357095 -120905 -5054
23474 -9576 -320469 330121 97324 -189879 -139909 87665 -171383 -13790 -269303 -431687 62181
23462 -62152 -150590 57104 -74174 -52751 168964 -152638 -290712 -332671 -330566 -117454 246475
23450 126513 -190120 68736 -403083 -302221 -112435 -122761 143861 166540 213563 87038
23439 79458 -159596 -217120 -48243 303153 100546 -63440 -96124 -227943 27427 178399 -215950
23427 102729 91023 182005 -158997 56811 10498 18235 179386 -75455 -199776 163780 97206
23416 97206 35630 -87843 229300 113281 -208638 -148759 -225182 225452 -115735 -91445 39516
23404 -149291 -207421 -62593 98064 -71844 -175789 -130191 -108838 62904 -101348 61148 -240655
23392 71833 35329 -250093 51603 -218553 365814 -296578 -230840 -957 -8266 -24263 -308193
23381 -308193 -204727 -177694 -66 224279 91390 -102902 30343 80038 171847 -172388 -382081
23370 -382081 129819 -118018 -13214 -12491 -19203 -9448 -392830 184800 -48489 -94427 41379
23358 21804 164191 232685 -45512 -40939 -155714 -377723 98189 -329538 -382023 -82918 -284876
23347 -284876 -4074 14658 274272 -52098 143288 48809 -194041 63304 -67728 14493 22867
23336 22867 17138 -209273 69608 167546 160241 77083 -31204 57089 -41568 -419291 277835
23324 -134658 101841 -100349 211066 -90115 115179 -212873 78074 -104558 37331 28005
23314 28005 35507 -213964 -263153 219135 100601 47573 84075 133210 -213563 -463430 30452
23302 31273 62323 59225 -329749 -92901 93170 -10151 -20518 -15108 91926 53116 195802 395734
23290 395734 -123715 192436 367266 -205507 -158547 49927 -119448 -135348 116600 65351
23280 65351 127888 59167 103722 -60929 29177 -5956 -118877 273455 221284 -31052 -23468 -27734
23268 -27734 176519 209579 -189922 -158370 92114 252460 78193 -69133 104854 -412330 223749
23256 200403 162287 -214766 -227480 78238 -92741 -93675 -59353 43040 222430 -269332 -133269
23244 -432419 -196654 -3533 -236904 -44309 76787 45354 119360 54133 -170548 -182612 97796
23232 -59885 104050 336727 -174873 315145 201387 169300 -133401 150666 259301 109848
23221 863 -27904 45518 26405 37065 -40148 -354148 32570 116047 -83077 -53183 -161475 -435416
23209 -435416 -139934 -347708 -37994 -138715 193868 255720 171120 -5205 95602 35196 29166
23198 29166 -207699 -137271 145034 162095 -189069 134248 188444 47613 -138470 -31536 -9994
23186 160591 45289 -348100 -92491 858 279955 4270 59528 -310358 193302 -137868 -487305
23175 -487305 225881 -369444 -34498 -81868 94349 27777 -459998 -151044 -95617 -3949 -59546
23164 -59546 -250535 163550 24794 2223 -369505 -126718 -67134 23395 -177697 -171385 39369
23152 -326465 -96780 69506 -63804 -100280 -79140 225162 51008 -194976 90333 -122744 -159035
23141 -159035 73447 -274369 -158277 -314514 -123257 27565 -104031 -67487 1803 202526
23131 202526 164918 83706 55035 85275 -190611 -213547 -73675 244013 -116213 -68396 -301691
23120 -301691 -59825 -207758 162326 -28848 118997 -209843 -76458 255298 206262 -259608
23109 -50674 120019 61565 105203 -106977 -167564 -83357 -307386 -222566 129074 96421 -158694
23097 -99115 6892 97509 -77212 -77814 -54117 212588 39871 44710 149079 37669 -118047 153399
23084 263035 -173722 -83313 -80882 -214580 -153331 46041 67133 -32707 -142743 -339565 106529
23072 38287 18519 85456 -104539 31953 -83394 -156445 177922 76316 289279 -409342 20647
23060 225700 -67632 142845 -181311 75681 -93381 29161 -19630 -73072 164713 -7938 202630
23048 -2282 -449309 19549 -525969 51821 369124 -80701 -168129 72184 -49354 -5134 184340
23036 2798 -110975 -19563 -361939 86724 32749 -41390 -31871 396641 -154105 -80550 -10588
23024 -9786 -23220 -170310 -268676 164114 -256690 -160214 69078 21082 144103 -81465 -433523
23013 -433523 17063 14542 -209316 42701 -336841 199491 -104380 213849 -73622 -96260 122035
23001 -41192 75521 56536 125929 -406993 -399756 -41376 -150598 -81749 -135069 -162049 97085
22989 -23248 42387 308996 -146108 98986 7356 -443470 -16493 -188257 -112772 5467 -120396
22977 -67203 -227076 81323 -227229 -75078 -156619 24824 -57421 154067 316288 -69503 -132681
22966 -132681 474187 150480 222682 -268691 126308 -236339 82994 -415832 -154282 51321
22955 -12899 160462 68716 -4232 399784 -174521 -326137 160506 38618 -276254 263890
22944 239418 -68506 -207478 -62388 37932 -56363 -134451 -30265 42093 15108 30611 -20597
22932 -27035 -34413 -375900 -53502 113882 -288712 -226577 -159262 -316465 -74422 186901 141628
22921 141628 -232453 271181 -261300 21585 45634 14131 -25799 -254308 285846 62717
22910 -79686 -55324 -170200 57889 153832 -87939 -163372 229762 -96529 -129074 -130336 226065
22898 34988 134370 -114016 125498 -15360 -107166 -12161 -16110 39214 141202 -177774 72985
22886 46582 286769 131123 29332 57359 -311437 56687 15598 -87044 34404 -61562 -158752
22875 -158752 -318854 447338 -393 -50036 396695 -35488 -11149 51377 206727 295193 197689
22864 197689 37687 89798 242375 -221897 -491937 -39071 11543 -400464 -201757 -223911
22854 -223911 -20102 262063 -19176 363912 -138369 -227547 261255 -40950 -16996 -58813 44803
22842 -67216 -40366 -58760 -172251 -117322 319605 -257690 -28290 -73236 -5322 66985 181482
22831 181482 152634 -56334 -60046 -49235 -157443 33444 101687 -77911 -95134 -1943 -90216 89470
22818 63250 -188724 -176569 -278594 139014 -14041 196079 -110034 -95508 -93799 35443 127507
22807 127507 175272 -149505 -332868 -95756 95231 -103302 6695 -194136 105169 -152078
22796 19130 145866 98564 -85897 -296313 -187422 -52382 162863 -365842 -176253 47812
22785 -204631 54965 4431 44706 -53159 -27751 -94298 -40870 92229 74403 117490 117300 -152179
22772 48733 -30170 38174 126208 109190 29846 -220739 72810 -157536 112775 -137783 -110424
22761 -110424 57582 -374989 74849 71256 -115168 -133556 91592 -50803 -189875 38276 -17752
22749 -16148 7122 236757 -122427 39241 310523 -90193 57419 -308181 186191 63613 -173181
22737 168839 -168163 -50267 -211371 -151000 -212274 278607 -267573 159540 -42340 -62280
22727 -62280 -279811 -94406 -110617 -248418 -387504 -61688 -130533 -252001 -29897 -354695 -118859
22715 -239491 -111173 -508839 -35469 -254008 -180533 120075 101122 96089 11034 15521 36897
22704 36897 31733 212211 137394 -121969 10941 11497 53917 -187316 -77147 -328370 169622
22692 -19532 -176946 87279 -225096 -472862 233680 -167493 -168280 -200749 -20323 -11655 780 171960
22680 171960 25020 75672 -151455 46337 74692 28217 -18381 83827 174937 111325 244985
22669 244985 -83409 -132113 67521 118898 144596 -36834 91727 247345 -56780 75791 266204
22658 266204 10111 -221667 32012 101999 -38130 301819 -428185 229233 200908 -2609 -301787
22647 -301787 106261 74367 -170501 -322510 -96155 -110057 -103779 302287 -193262 306283
22636 -161532 -148674 -58913 -39760 -55400 -161174 -87833 -86073 12075 -176569 115667 -175670
22624 -71051 -65210 110958 -339539 -24218 -162269 192055 154789 -267331 -156926 -185568 -99754
22613 -99754 -75488 -216057 -365691 -278310 95803 225465 -112850 116481 -200888 302693
22602 -51977 87003 -204475 -119435 99748 22371 -134052 -172026 -235858 93893 273803 -79656
22590 -92708 93086 -38899 300183 42741 116211 -249553 102261 -237922 -40745 -274296 -313151
22579 -313151 159241 -24229 65062 -22316 168415 269857 -35876 -379061 170344 -99094
22568 -169571 -10968 -16052 -495238 -140046 199314 397116 93451 -56780 -16403 18235 88170
22557 88170 89735 549018 -135439 -104269 41934 -279996 50625 47105 -103922 -13298 -146152
22546 -146152 -85319 -89782 -327756 -87532 -51754 96423 38991 -176184 -214120 79335 -177259
22534 -85302 -96461 -201115 -121273 -14573 -7700 109382 -94926 2408 -258851 31505 -125275
22522 -3416 -148685 -448516 -120512 -178634 -47025 -172950 126048 -95806 70503 -304240 -186726
22511 -186726 95398 86551 90013 -102343 -241531 307649 224482 -272020 270895 -78168 -147313
22500 -147313 -289557 144859 -78577 25335 91673 39256 -207812 162177 -250387 -114886
22489 232496 7444 -218794 92985 14325 -139972 171297 -87092 -583876 -83921 0 -65707 -343723
22477 -343723 292561 -84549 6552 49755 8495 41491 -103144 -376856 -63735 -54100 -230520
22466 -230520 69263 -141524 32725 103409 -137483 107406 -142582 -37720 -98158 48063 31959
22455 31959 -105683 -260508 -109130 -229033 -14918 67220 -346355 223693 -107948 6939
22444 3167 -268703 327398 10580 25532 -35932 -285542 88683 -115651 212447 99479 -38805
22432 12640 -252055 69192 -58149 -298766 182357 -314705 8353 -108123 -82784 -267891 -247503
22421 -247503 3782 -42129 176652 -122244 -212490 254186 -131061 -86456 -72962 -325805 29590
22409 212427 3478 -66734 11662 -9349 -377255 -94472 -50152 -364928 -265326 136982 28465
22397 -168540 -75220 -2076 -105355 -389300 436576 118506 -363560 30002 293544 -50099
22386 -41079 -291428 -281376 204891 -127235 41703 18133 212417 -70894 -113845 -283755 181177
22374 16088 -28013 -304186 -36252 -428967 89408 -25711 -97623 -3988 427520 -260962 78750
22362 251840 -427629 130461 -286938 -19032 -244239 5249 46645 -31888 190336 284375 47913
22350 172732 111985 -223168 166687 88292 -130533 -255810 213123 73304 32510 15812
22339 -62830 69106 -11384 340182 164469 -212981 -161014 155325 44043 -172511 -212832 222671
22327 -48991 -86552 -109631 -18360 -174215 -9610 86656 -43104 84490 125011 -162908 112206
22315 -18005 58234 -153685 -73226 54034 122425 -51432 93561 -76567 14145 203758 106964
22304 106964 -145563 22829 87537 280077 -98114 28293 -352 -134436 -84327 -318017 54082
22292 167727 -148577 201167 -23441 -294755 55217 -68852 10202 220634 113695 -126987
22281 318421 -97956 23402 3921 18578 -270029 191236 197301 -173264 27806 -158578 -80839
22270 -80839 -158554 214661 -74721 134325 -136905 191763 -54002 -105447 -206473 17967 23413
22259 23413 100348 -172166 -197515 -4366 55427 -126156 46875 -44033 -118754 -37394 -158461
22248 -158461 157693 178412 -94142 -311383 50946 179096 -187250 138778 -178283 43247
22237 27899 -153626 -215325 -240725 -34634 30425 229713 -433350 87907 98902 -197346 91840
22225 -45910 -144430 -235043 -25396 34828 59078 144713 -133370 -129221 -117051 -124239 -90564 -187279
22213 -187279 -124248 -136654 -75854 -44679 -225734 -147582 -235556 61390 -141054 -293200 82762
22201 -16090 -85402 -141412 -1463 -58057 118728 24675 -136730 141523 -50292 -16772 -116535
22190 -116535 251020 -191107 -87841 -185169 97116 -250263 -136538 -57420 156621 152854 -97555
22178 78557 -115123 -264870 258434 -117642 33346 -122305 188112 114975 -331368 -64583
22167 -55762 -197869 -403665 -105774 53123 -92356 -35075 -213332 -91835 -42724 202839 -186129
22155 84464 -65864 23160 -420891 85197 -151529 57330 -84324 -72256 124620 -98437 94049
22143 172901 -29033 137858 75536 -12281 74924 58310 -94091 39374 -38139 153517 -41061
22131 50981 -174567 55053 190169 -141728 -94865 -243490 119102 -51296 174381 -97361
22120 42739 -252796 116960 -242013 96352 -184174 -209119 27434 -82364 161814 -168421
22109 -102400 -237154 -252009 -38938 81134 201414 163667 66672 -87937 -169090 -118020 91358
22097 -129774 178526 -365665 69661 -174796 -27836 -14275 133773 -201567 194622 43869
22086 -91743 -316999 -113865 -254745 -24463 -149241 -75589 22057 -332690 49761 337359
22076 337359 -202845 176043 6563 132889 79412 24463 -72042 -208253 92664 -105413 -203403
22065 -203403 53688 115332 -183468 107503 71004 36219 69815 -307296 150757 276776
22055 276776 -81354 162380 -127752 -307300 239807 72354 -208160 -82946 -14392 -308110
22045 -308110 112561 55700 -210821 117031 -188303 240410 -27661 65158 -172735 -221288
22035 -221288 279284 -249239 139539 47797 -72944 -279805 -167705 -216253 209457 240272
22025 240272 -354440 21907 -124771 155641 9285 -408586 88019 117884 -137883 -35667 -137145
22014 -137145 -242458 -63656 314729 -194438 -108316 -157729 258125 56974 70227 -225803
22003 125523 -409690 -88689 -245270 215749 -390583 184182 -196750 80796 -145670 -102281
21993 -102281 -258642 -121296 -38447 1992 -272290 -176312 -134833 -172713 270665 -7601 -175122
21982 -175122 -43140 57018 -91592 -162963 129982 -166930 -145644 -170757 -177663 138824 -22687
21970 -205128 -181996 -39190 -2326 93140 -121520 -63494 -28888 -231628 113152 -106254 -332732
21959 -332732 -48180 -180420 -2524 -29687 140591 -50626 -139217 -291302 5936 3707 534 175137
21947 175137 -2633 52382 -336392 -238369 172022 -186855 -5590 -25538 -22530 -42967 -34078 -118012
21935 -118012 -13738 135490 28659 81953 -89991 236594 -103916 149485 -156171 136050
21924 -143682 119112 112829 -60900 -168159 -131944 57951 108048 92847 -147745 -255017 134711
21912 -127119 -45990 -71354 379940 131713 -116987 -94401 -213454 -461725 19706 -400075
21901 72464 -233243 8810 48865 -379148 87274 -229800 -162364 28234 -81922 -263732 -153209
21890 -153209 95539 -287121 112466 -186904 134106 -8249 -53395 208318 -69232 -163258 83049
21878 99476 67100 -70701 -210477 -165953 229067 -273285 44450 -15642 48367 -60308 -271959
21867 -271959 -85362 88368 135469 -109311 -65923 -126187 -66261 60107 -112312 -180310 57330
21855 52869 59716 -38022 -80296 -64078 -47515 975 -7576 54462 -24566 188588 -131140 -132736
21843 -132736 35831 51563 946 46536 17612 -49899 -91254 544379 101996 -81987 185044
21831 -312668 -67147 -512907 -202306 43512 318489 270618 257255 -31372 -79366 19959 -281210
21819 81813 37047 2849 64870 119655 29069 -139694 279747 293745 -270820 84410 -88928
21807 144959 116432 -7354 -291158 15111 140256 -44253 -118889 -264533 -390040 -87365 178861
21795 90964 -4397 -262314 -125057 106898 -143674 -108754 -39798 225707 -144585 -106210 -143426
21784 -143426 439591 50184 191384 -84477 -63535 62084 99885 134206 -137570 -42539 242712
21772 60755 41033 92275 70582 125100 94836 31116 -125952 -36219 -205645 -35656 -9718
21760 115729 -179141 200425 -134316 23552 282817 -122323 -166230 -152031 -123905 271830
21749 -366123 46714 -252115 -116169 -144052 84815 -309509 -218062 -95572 -200604 -77759 98016
21737 -35631 49220 257953 258669 -66198 237279 -366623 -186248 -174076 155313 -127235 -135124
21726 -135124 -53382 146932 -230395 123926 -90246 376402 170172 -108158 56733 -29974
21715 -379385 -174201 -27542 -90193 -311469 -114799 -21400 -334144 -453857 -102632 54450
21704 -147116 -130919 -23000 197603 171270 101366 -45080 -47317 -123760 73790 11740 65341
21693 65341 107772 144747 -90146 72278 -426552 -140832 168512 -314445 54253 -30246 126505
21681 311713 213304 98362 208092 -24298 -220371 -208671 46734 19504 151847 -148127 -111151
21670 -111151 -161554 291167 -211792 -166926 -64213 -30749 26747 -214114 15623 50559 -206572
21658 -413974 -205898 -173973 -282 -101047 -40951 -221966 -122566 61371 182336 125015 90370
21647 90370 -88460 -205238 -506030 142637 -33083 -9411 24054 -92840 31548 277302 -308648
21635 -48989 -74401 102680 -164731 -85487 -42921 300093 182923 -276350 49452 81014 -286106
21623 31015 -306162 120439 227023 67309 220426 -72365 65750 -235610 -87467 -75066 -32033
21611 247406 -51945 78237 -266695 145232 51553 -9066 9483 -60371 -234348 145245 -154525
21599 -350662 -50335 -238316 -53897 -224946 109411 38650 -1376 390770 -115926 78455 -16594
21587 -227973 195280 76460 130726 198119 123778 -99082 166588 104994 -122744 150033 -73166
21575 -39850 -222322 -50155 -51639 -126390 14132 220576 -106326 80399 -115138 -46439 355879
21563 177739 182673 109881 92466 -202954 -64703 -31404 205162 -206572 -239042 -142562 -142683
21552 -142683 259460 -250403 40398 -16956 108691 -340622 -1687 -192751 -253191 119641
21541 -93053 -2658 -59053 -138777 64493 46195 -59387 -275009 13226 -107363 199074 -169903
21529 -37823 -179599 147751 -116296 140833 -345073 -356879 -42910 79278 -328034 235666
21518 43731 -91845 74644 -221950 -317595 22143 -92079 -14926 11001 242170 14511 52033
21507 52033 -577408 157405 -96628 -155083 -91385 233275 295454 -183198 160078 -170625
21496 79825 -219406 -319285 -123076 -260059 22789 -89233 166228 67210 66261 105995 -34560
21484 14160 -87007 385140 -355344 178815 14454 -221170 71613 47390 -212882 -155314 -362259
21473 -362259 107428 112006 -51821 69508 132282 2044 -122280 -140100 134808 -16007 -131388
21462 -131388 -201240 -419579 204752 45941 -132926 189598 124951 -46461 198691 -161114
21451 220259 -165343 -295797 40205 118158 1439 -57517 25876 -211896 32017 13127 113068
21440 113068 -338153 164543 81337 395127 246790 -134174 170693 333887 85604 47026
21430 47026 -62890 8650 143221 -236764 -203958 -188249 174573 38455 204881 77831 162249
21419 162249 -238814 -206882 -138445 -52968 -221423 -208169 -286792 -192872 51591 -5538 -182239
21408 -182239 206286 32317 -79264 47296 -28893 -193561 227095 -349023 295433 -415505
21397 -77243 -171227 10497 -374185 -31024 11123 -355099 -61582 73233 20111 -133345 -82364
21386 -82364 -195199 176961 -4554 -368093 325211 305944 -232724 -187677 -34374 -239220 -53713
21374 199077 -44016 -111788 -138782 -151638 175059 78282 -85199 -24162 -69033 187341 303
21362 193792 150452 -62338 -70564 -53201 136035 -53806 -71672 -106369 31297 92411 -10947
21350 -109520 -78739 -249751 -170870 -38397 188310 -22669 -55072 -83946 48510 -369889 -263477
21339 -263477 -391086 130911 -42018 -275088 -64812 10726 -348398 -4346 -261651 24730 -29528
21327 71546 524264 -281598 107632 -118173 157027 102601 -8035 91107 -126369 -182766 -75180
21315 -54006 -254452 -221791 -200794 -52530 -127506 -373899 -425979 54918 255824 -176184 159936
21303 -141629 14318 340032 -148957 241279 320382 -34970 172646 -91537 -154764 -180260 37642
21291 -55881 -384375 -16776 -214083 74785 -45804 113239 -208816 -20225 -128561 -126953 -26890
21279 312686 19106 -89333 -162379 275377 -317448 -152875 146208 -25267 194822 163914
21269 163914 135137 194949 26795 -81837 288343 25633 -309108 40693 388244 -229200 -36104
21257 7214 -150138 86315 49323 136886 243825 -374983 76658 263857 -342505 40966 -38441
21245 -275492 -110067 3946 -116924 283475 149366 323772 85379 -138994 -109236 -249027
21235 -249027 75014 43072 -179040 -234686 -78454 -263492 -93379 361286 -352936 -253598 -50763
21223 -104062 -39533 50391 -182447 -304646 -170510 -283889 40263 -49139 -203853 -46899
21212 -125992 -84177 -37142 -37546 99192 -153788 -284672 54953 -89322 -53592 117482 198419
21201 198419 -151374 300035 9506 230269 284207 -184238 -171152 -85056 8158 -153864 -66137
21189 -213782 150889 -134644 23118 -305489 -257527 -198874 -201296 -236997 151461 55575 96415
21178 96415 -58297 190145 181532 -133920 -109228 -193008 88977 165290 -113098 -123647 -469294
21167 -469294 -127200 -105570 -250561 -109565 -27494 -117575 43068 150147 -153986 -318673
21157 -318673 -167140 143708 -60629 -80752 180019 -140992 -184465 59874 -215875 213550
21146 -24825 72678 -22259 -309255 -6351 -7395 -306433 -145533 24761 256841 320529 -102393
21134 -200958 226184 -94399 -1969 48807 -314447 -323429 -15811 13629 140789 -218906 -122067
21123 -122067 -291551 121414 -143795 246509 -272863 -76639 266309 -111645 -84282 430038
21112 -200013 59246 290539 19978 -151233 83748 -210124 5239 -19103 55483 36508 -123253
21100 -58488 42535 -312078 -82952 195619 181844 -109657 304969 114305 -182419 21614
21089 153088 -26070 57103 -98853 -66488 -165660 169683 -143620 -173335 -145277 -22470 58056
21077 -77551 62283 269942 -116236 -105148 -284579 -74487 -35406 -234350 171603 -141737
21066 -5132 127326 -245308 39878 -212785 -70484 -160822 -105172 -103631 69409 151303 -141573
21054 19529 -243115 32897 5241 -138503 -163868 -473078 -96287 -47352 -18546 143080 43463
21042 -42913 57998 2128 91598 39252 147118 -138823 99239 -280276 97156 -141312 248784
21030 -143553 -166880 47307 134438 278689 -1070 129124 -154048 -432803 74459 -19888 -85064
21019 -85064 33198 131707 -307737 419858 -149537 -105722 -143819 -395052 -178335 -138734 132408
21007 -28352 -426871 -171867 -232921 -57668 -305514 -118002 -294870 -2619 -20661 -197430 -186326
20996 -186326 -151819 -89474 -154884 -212296 34502 -305424 -82490 -83827 206949 -92139 -148600
20985 -148600 30349 36031 -71276 -371308 184194 -118583 -24838 108005 196956 -83774 80689
20973 4411 -14759 -160610 74743 -40401 27645 -112785 -120527 -183932 -159177 37402 -575373
20961 91241 -240891 117321 -183596 -396069 35292 80482 -239633 -73223 -351717 -430407
20951 -430407 221371 43579 -6757 -75279 -53540 -33327 -177579 6430 -220908 -173589 187989
20939 127875 -63302 245996 -34260 -78987 48613 -61031 143253 -166862 59051 -79122 -153015
20928 -153015 139607 -294735 -287853 -72698 -6358 522155 -61272 -17390 -296523 -137551 -223289
20917 -223289 -173835 291190 -30628 55451 9706 157745 197799 -171877 -313258 6789 -82436
20905 -318622 164422 256843 127178 -1434 3166 -65632 27477 -162776 -207585 -112146 -156066
20894 -156066 103466 34632 -106658 77590 161768 -142449 -59822 63169 -13202 22709 -24927
20882 -13084 -116838 -135885 -210813 -32453 75281 37092 -368609 445175 -480579 -87158 -276196
20871 -276196 276966 -101676 272121 6331 117597 54416 -282078 -172100 -189144 -352837
20861 -352837 -41457 49782 212502 -354871 92411 122355 -131099 172736 -274308 -82498
20850 -56021 78914 -8850 39403 -74233 -16856 -138996 -111229 -67649 -102214 -4268 66116 -63701
20837 -82650 190806 239135 47425 -183402 -108760 88906 364336 -138659 -126284 -19751 -155661
20826 -155661 -110662 -156204 -85570 108407 -15383 -218210 44599 220641 334 -305467 -4545
20814 78758 -278447 -62314 -350454 -94939 163475 -207363 -217472 378049 167792 -95857
20803 -274930 191242 176177 -180870 -110242 -278828 250299 127926 -250633 -221964 -63338
20792 -29854 135889 -49799 -168686 -112475 -87946 25440 -13995 -117844 3365 -51816 -229151
20781 -229151 -37139 -156927 -58199 -132876 -319295 178278 -115465 26230 -109643 -46914
20770 202881 -107054 116243 254614 -154651 -71575 68753 -222830 -62083 56214 -105797
20759 -66740 -249477 -2561 133028 -404818 128641 48014 -85111 -20106 55996 286070 -116640
20747 170084 -144202 74072 197057 130904 -206721 -710 260193 -225456 109106 167861 -90597
20735 -17172 16011 87268 -134872 137093 -141802 81711 10212 40095 95557 -124466 -46082
20723 -47042 -262780 138707 117683 -63503 -306508 -88912 -101883 97330 221419 -157605 -123203
20712 -123203 59662 -77466 261892 79834 -15090 16511 -96638 174046 -110959 -99272 -32349
20700 -109660 -197316 136120 21640 12859 -37928 -128115 338186 -94874 -244515 -233109 -116141
20688 17715 -137660 137991 84692 -186586 -75118 -227743 -378500 -77492 157625 -257838
20677 -4512 -51314 76264 -322121 -149898 -103178 38610 -125695 -153542 -39605 -326586 98633
20665 17139 -105792 294503 -90724 -15891 -104652 -246163 240509 -56473 12797 -116753 -9629
20653 308976 -71959 11009 -301478 -55077 -9408 -203345 91125 -198453 100564 -145047 -255432
20642 -255432 49709 136762 -88265 -47752 82510 -41519 -406881 -24329 8499 -275389 -211582
20631 -211582 222856 -189885 79624 -248174 -60407 177036 -13717 -239657 -375087 -322377
20621 -322377 -294816 -3087 -38899 337 51836 -3797 -35755 71063 25545 114418 -183 44135 -121123
20607 60119 1603 -178331 -196050 351311 -7788 51259 -190038 -6884 213162 -395232 -90486
20595 -104725 -200637 -139526 92974 -305368 40556 152928 -31967 -146233 -160713 162351 -36613
20583 97513 -365920 -251198 -40100 -125248 51162 -238903 -143154 -193384 156614 29311 -164135
20571 -57877 -146538 -129903 -108309 -15772 -112676 -72741 -16644 -404357 148673 -240536 233850
20559 10671 -53841 -215430 101781 -337413 -168225 -97222 -381465 -143239 212077 -287502
20548 -478729 111228 1381 -37571 28410 -382186 109922 -231254 89728 196033 -43762 215882
20536 218500 3758 -150983 134414 126777 266238 -385881 36551 11224 -390195 -400 182634
20524 -14089 -135157 -21980 -494959 87526 -92155 65170 -59150 -206577 -79807 -111556 67231
20512 172539 66266 14334 -41426 -61178 -154898 47045 -147682 324802 303059 285390 -43797
20500 55566 149290 48574 49063 -190971 -249789 133080 80432 -353666 26581 15233 -37842
20488 147835 -244139 -107559 -132112 249686 -168217 -102218 -219270 185221 189780 -478013
20477 -139086 333994 -108086 -96549 -12764 -145235 -51578 -103561 -342231 -138952 -4199 -152065
20466 -152065 222575 181118 -11389 25862 337181 390923 -185921 -114074 50720 46377 -160652
20454 127220 -159050 123347 -244081 157116 25283 -19793 145778 -16011 317323 -358462
20443 24263 35423 359792 -227981 -115783 166102 20981 -46627 -84479 -167096 -87916 173979
20431 -231153 198135 149348 320205 -111117 201837 -195342 93125 -113573 -62829 97211
20420 -130955 76054 75878 57004 -93321 20467 -381266 -24950 -108699 -85688 135038 34923
20408 41091 -44353 -120158 98060 -208522 -37522 -245139 -178951 -114880 192852 -155624 -59448
20396 -21322 -37431 -106030 180024 114917 14668 80166 220111 191554 -186486 -69452 248413
20384 7239 -19878 -334669 -184373 -142365 -345046 126334 13637 -168205 70439 -96344 -44748
20372 69318 -153594 398937 -57276 114008 212785 -186698 -24150 222883 92149 -69450 -162718
20361 -162718 79746 -168720 -127557 64390 -92914 -168026 263189 -9769 -123015 -178336 44370
20349 266105 22822 -113683 -42969 -164682 -46195 -80438 -327824 -257625 -102577 58082 -39772
20337 217216 -233256 -50527 5110 -66224 51068 -53745 -59773 -245959 -52776 -15839 62563
20325 67439 -298843 74661 47732 -127583 38433 84105 -276070 -135683 -153310 -252611 235001
20313 175775 -85170 -280163 -158769 -38652 -15916 -19273 -370084 176636 -198491 -521451
20303 -521451 -304086 47075 215180 74649 -151130 -502550 -15042 16213 -110801 -141070
20293 -141070 137667 -52423 -88957 -3821 -33123 -29519 -434992 -101033 -353347 -11787 1562
20281 -186589 -126885 80426 -199822 -207341 -172213 -262264 -299915 -102254 -60314 -29659 242647
20269 -282008 -80029 -92262 -221183 138555 -208747 -328090 26818 -132977 -170309 -135978
20259 -135978 -142746 -232250 -72987 -192340 -10262 -214682 74855 115193 -68270 24157 137417
20248 137417 -48406 101956 -115740 -21015 -205183 -109317 -245031 242081 -144350 -84570
20238 -84570 -8500 263273 -149908 -104800 122401 -45019 69898 51452 -58736 -274415 190478
20226 -366959 -191389 140221 -272873 -181549 67844 -166028 359518 -241690 88410 467690
20216 467690 -11963 181257 98661 118596 -130816 -163604 -362036 -311657 -145397 -61981 -186601
20205 -186601 -265240 152838 179730 -134397 16122 50273 232256 -291348 104846 -92964
20194 78812 -188659 -204670 -80793 -381643 -84982 -473601 -272584 -87121 211379 -73683 -22822
20182 -153922 -168033 -195689 -212470 165684 -52863 -54273 -353036 -150801 -49674 165246 -380522
20170 -278181 -249077 243787 -1937 112474 -148509 92970 -71549 -67464 26851 -36755 46847
20158 83768 -74184 -344238 -17354 50951 -73991 -324279 -11489 -54294 -525082 -250001 -75642
20146 -191302 -33726 134259 284242 -45395 -45018 -29444 -241840 144587 19006 -187406 355083
20134 -74494 21844 -99079 25787 83002 220788 33073 -46282 -43059 35415 200504 -73329
20122 285453 162482 -330163 182146 3087 135429 60367 44592 -110171 144360 -183281
20111 -62149 143302 338764 -169342 -5223 2008 -142024 -96323 -188916 -111335 -125575 -18389
20099 74255 -23238 30448 -114454 -93141 154596 -46475 79173 173804 -136862 -162401 429085
20087 28940 161159 -305016 -285382 -29959 220647 105977 16528 157777 241791 -88090 -225739
20076 -225739 94192 -125372 -107541 -177136 143415 26308 225728 267458 -138210 -2396 93164
20064 73306 -207810 -271444 -331364 -346679 -175656 103806 249975 94498 -68233 -246284 -220815
20053 -220815 34522 -188747 -70809 -45419 -87859 -290576 -311556 55140 -22464 -310026 78455
20041 38211 -166658 -25147 -258546 165686 -147948 189268 10312 24078 -257057 262833
20030 87546 -337352 96413 -235594 224845 -421060 -48703 82709 403860 -263037 -60810
20019 -281249 -128255 197596 30762 -50953 -107968 -82396 -79668 -251748 68605 35089 -348459
20007 -151516 -233650 -27771 -40469 176079 13424 -3373 -176649 184701 116331 72757 -332425
19995 -8108 -15139 -318407 15575 -411140 -253293 -32499 -147260 -272875 -138782 -183571 -125629
19984 -125629 55590 89739 -56164 221625 -292578 138198 -235615 393062 -71741 -144961
19974 -144961 232908 -67205 54506 -245022 -324472 -373684 -272112 -2452 -269852 58499 -142797
19962 -18553 -49753 -158584 -175621 -169572 -144477 -120417 -248693 -409259 -299358 -140451 -274781
19951 -274781 88180 40109 -61687 76577 -145113 -309494 81201 -251417 -154059 -217189 -202768
19940 -202768 -160065 101391 10499 -86677 50890 19649 193980 242057 35301 -166896 -148989
19929 -148989 46179 -135189 -20482 -207364 142047 -120262 -41760 -56224 -476414 -42008
19918 8515 -194678 -91951 -10173 208899 -134927 92328 22780 -124814 183058 -83739 -18427
19906 -121288 -198742 -256193 -185612 -218044 -173830 95562 -23479 -70087 135059 3676 -121500
19894 -15519 -73289 -12496 78441 -153381 -142768 254618 -217018 14153 78461 64368 -198765
19882 154716 -32808 188850 -177837 33615 -18715 -212640 -62501 123481 39836 47642 8399
19870 194908 185850 -126113 112199 -107899 -55607 23488 249815 22079 -30225 -22470 -377597
19859 -377597 28324 -13508 -203763 30847 91421 -96255 -164880 -213634 282125 -252156 -94992
19847 28528 -68044 110879 -228072 119576 -123421 -259575 -2028 -26790 -206853 -80901 -90445
19836 -90445 196832 112198 -269264 166361 164 21963 -46546 -168644 173640 -69278 -160966
19825 -160966 50620 -221182 103403 95426 -587659 -32130 151145 -164449 -32074 -138595
19815 -138595 -179304 -140744 66354 217553 -203427 -247967 -94445 16029 -256782 163348 187234
19804 187234 2565 -182193 -67199 -206560 96205 -115822 -203882 266993 165094 -200462
19793 47338 -505219 272086 110826 318466 -103805 -231033 144774 -96523 131429 -103195
19782 -231739 -276889 14066 -68395 46008 -180687 142788 -111738 -181001 -212615 -79676 73528
19770 -97447 -285196 -45116 -147717 78733 -256904 66592 -28682 218708 -158902 153177
19759 -169080 4752 198235 -162933 -230427 -86840 -200201 -157462 39585 -170489 179093 -143323
19747 19136 -71516 72923 194090 -57216 -313745 -100754 -266579 -212753 -80639 -110874 -147311
19736 -147311 176029 -187890 -236786 -158142 -314022 -89545 -44008 -196961 -4841 -143212 66461
19724 54431 -93602 -8398 -52557 -142409 174426 153353 -226273 402355 2918 301481 -175281
19712 63169 -39027 185623 -64981 -108718 201728 171168 -59502 8256 -5778 2100 -154173 -401707
19700 -401707 -115605 -84030 -15643 -90380 22491 116454 119585 88204 -62432 -126042 -184310
19689 -184310 107018 -138977 -218378 -162574 -134552 123389 -83168 -102698 -55533 97272 -217588
19677 -255170 -105357 146604 -47540 -184857 -77615 282052 227312 -161666 -155153 98511 -31673
19665 30841 23511 -225895 324669 -28130 51 -184563 -33396 -271349 -226151 32402 -51657 -195680
19653 -195680 -164200 30645 90276 -87636 -101678 -4009 -392397 -251448 -138315 -22025 -58154
19642 -58154 -106871 -67230 -34723 -250889 -217748 8628 -93531 -178516 80825 -336360 -9196 72490
19629 -126009 -117980 46538 -243645 121725 328248 -123871 -131076 -180238 198166 9809 -387642
19617 -39768 110696 -22849 123233 -219503 -149493 -184762 -213175 -347469 -118949 90481 -76678
19605 -467873 -57356 -132922 54661 -91947 -319144 -188026 -25351 322788 200931 -118808
19594 -273357 -244056 -45680 -436703 19523 -303074 14173 99687 351062 -103202 7217 -47159
19582 -103943 166278 -313054 -96068 16408 -383933 -249699 -72823 210564 -200326 321693
19571 -81691 -349355 -9856 -88189 91055 -354520 -370195 -25447 -420448 55519 -406362 66521
19559 124671 -15004 -95928 -177934 -20338 272741 278742 90333 275010 287963 -189677 -497997
19548 -497997 435944 524668 -186382 -332528 33216 -244653 164490 -129408 -26993 95170
19537 349203 -57192 -91159 13931 -279878 -70536 113806 -201004 -135436 36725 -260507 -287202
19526 -287202 48429 89275 207771 335008 -16465 -68299 88586 -433054 -40481 -65875 321109
19514 146354 183219 207013 -372408 -468917 -128011 -90781 -321932 74858 39319 -246550 -136280
19503 -136280 -245474 -118150 -153123 92707 28209 -181309 -150874 388798 -322524 187351
19492 89275 -23674 214423 131718 -144617 -42493 -90157 83510 -38409 296182 53076 -104131
19480 -328476 -356454 211875 -374827 -362958 300585 -187440 119431 -135003 -82774 -2455
19469 -211415 65173 -41837 -79107 -118323 -26446 -254583 237919 134218 87511 -64024 -243197
19458 -243197 -76688 -124295 9339 -93726 30412 210699 -138213 -352881 81906 -49706 -206375
19447 -206375 104122 -219161 -257729 -76462 -182705 1217 -360921 -40078 135623 -138907
19436 80250 -356441 -167616 -478577 -201302 85602 -66320 -77641 18748 -360031 -62496 158434
19424 -57528 95954 -280768 292275 113313 -70942 -232656 -508726 25524 303217 -248811
19413 -116488 -55859 -59547 57162 -21854 -289373 16191 90104 116746 354540 -211741 -31003
19401 -47738 -31275 -26690 -306789 -125296 -150821 -203592 -94190 -98196 30848 -181765 -52521
19389 -36732 -601725 -268382 -89876 -50088 228092 -324481 -34023 37498 55286 73280 -313183
19377 -130405 -146030 -293709 -102503 258719 114203 169413 -102417 -250202 -107725 241683
19366 244611 -4451 -117690 128626 -108374 40409 -215692 120715 -171321 -42035 61728
19355 -97466 137970 13587 -255805 162158 -437111 -254436 5955 -85830 134483 -118248
19344 46965 -69510 -146742 -76201 155416 -284772 -62111 -27531 374177 56735 83396 -15484
19332 -57677 -210927 -11020 -88681 -199513 133177 -201092 85663 49581 -78938 93721 -2119
19320 125146 -23 -27261 176195 -333775 67521 151601 -67675 -3741 110451 56926 -249442
19308 -66191 -19234 121111 136231 -173695 299888 16380 62845 -327336 -132617 -175966 -329415
19297 -329415 -314304 -205598 111958 -19615 33203 4181 -282265 -231635 -70761 -85294 130513
19285 72729 221782 14488 -93191 -80880 37147 -270577 -251289 -138108 -46623 -19754 -317778
19274 -317778 57341 125514 -167239 303375 -23208 117559 16694 -263457 117974 95315
19264 95315 -456 -237325 -254402 -1067 -212701 32005 -15049 328982 -267294 224790 -62410
19252 -190681 -24588 -101993 13076 179321 40640 -259526 -348306 87325 -117715 120571 110334
19241 110334 -171326 131744 -290723 -352509 -50914 -369420 -57535 -170112 24107 -288461
19230 -121520 68766 238859 -241912 79211 -402672 -11887 -244264 -145445 -302971 -183568
19220 -183568 191902 -48608 -225688 -95805 -316607 -175361 -80318 -249568 -171722 295474
19209 116263 -217945 -35426 -64080 77537 -130217 -105361 -146713 -20659 -342259 37615 -94218
19197 -118136 -226774 -56320 130085 -261608 50913 -84767 -149192 274759 -57682 48689 -439997
19185 -405024 -136307 -291242 -40202 -42303 -81029 10837 171739 -300501 -85897 -15823 -32742
19174 -32742 -253246 -148794 -9548 -54731 -34514 -104314 -195879 -361013 210762 215660 -46092
19162 -124661 -211330 -140627 -16070 -379159 -66452 88720 -301575 107797 -55704 139476 239243
19151 239243 -213758 167324 -242923 312365 -53089 -242140 -204004 374665 104804 -179701
19140 -58633 -65224 -511146 86261 -425830 -173063 -148414 -110736 6958 -114594 154473 -41310
19128 -361840 -165156 -232345 102572 -124838 -150160 -173796 118048 54373 34858 -291634
19117 -215562 -212397 215944 -17625 -146225 3543 -260338 -314818 -190447 100918 14812 96887
19106 96887 200839 -3703 63931 -246174 -254568 -110115 134437 -433107 -107459 -321099 -78193
19094 -39827 -26552 -195300 -35301 -24550 97342 -72702 48952 122618 229282 89501 155307
19083 155307 -405654 -337177 -118324 -200789 -47173 -51317 -429936 56631 51475 103744 170227
19072 170227 -70119 -89373 180163 -105845 -62175 15859 200381 -196653 39254 172181
19062 172181 -101890 60292 -75311 -193882 -43396 168188 -282918 5373 73239 114033 175708
19051 175708 205152 -37295 -91489 -299905 125228 -152085 -78001 -246451 -297937 52947 -40291
19039 76429 -203409 -253415 158229 184720 -168593 8699 189263 -92093 -63409 186471 24962
19027 -31356 139221 63158 28543 -54416 7663 12803 305439 229969 -20259 -438303 -251142
19016 -251142 -182861 226071 -146999 -154989 71321 -306713 -101442 300 261169 -12478 90014
19004 129355 312061 -59226 -169552 -263319 -59505 -91894 -46542 -212260 -15159 -85143 -147183
18993 -147183 24947 -101991 -113581 -186783 -237355 -419782 -58907 -44486 -12725 -297939 10525
18981 -127146 -62232 -99653 37542 -23913 -335049 -206568 -297608 100383 62787 -397132 -12866
18969 40895 108952 -80952 -146028 13446 -285904 -182734 -107245 -252307 -6108 78743 316388
18958 316388 -62613 -73264 -58821 -72549 186341 -176984 -54119 -302594 254294 -230333
18947 -72451 -42735 499549 238623 195932 57566 40482 -43008 -112824 -152675 -159524 14236
18935 -142524 -17676 -12417 -437376 38038 -17582 25159 -397410 -429446 104077 -313073 -219013
18924 -219013 -206893 23313 -268654 259699 -176568 -386085 100967 52798 -109815 40182
18913 -325249 -19901 -46895 -198606 19099 12311 -373596 -5101 -4228 -1038 206807 145214 -60209
18900 12713 -215864 -215424 79141 10267 -9149 -61365 161728 297855 383060 42704 -225289
18888 -101408 -27065 15679 -420459 -78028 -92110 -175357 -8487 33535 -247697 -166609 -117284
18877 -117284 -71382 -183282 37843 -33795 -244304 -41977 -223074 -282263 -258661 -40294 -130121
18866 -130121 -27916 146258 124247 -191500 -138125 36559 149236 -20140 -1340 -124983 -100103
18855 -100103 224260 -89229 -6789 -151663 139707 -112891 -141442 -59053 35352 -355895 -81193
18843 52066 -98716 165195 -78963 57210 195760 -35676 -109116 -63772 -83403 172690 32806
18831 136521 58864 -104796 29066 9395 -134289 44558 -316754 8659 82671 -226723 196700
18819 -228003 17503 105980 306534 9383 -167356 -201691 -4341 121222 246698 258943 218171
18808 218171 314323 195763 -56784 -74299 -129721 -22824 -15480 -53850 118735 160928 -145829
18796 89523 109167 37015 46253 296315 62206 30752 -67336 4563 -108596 -415018 111296
18784 86223 115010 -134727 -73886 -515444 -73622 88302 -161847 248106 -98947 -152819 132460
18772 -193597 -76631 6708 -89154 -44427 -107011 -232264 -163960 82309 -45349 -144810 36311
18760 -247589 3288 240042 113731 -297813 -373696 -184648 -56596 -140861 83074 -44196 -290866
18749 -290866 -125463 -266415 -233269 47416 -55467 -150592 -478473 43018 42929 -329435 -86068
18737 -124837 -172700 335368 91902 -340397 -86316 42677 139606 -30411 27671 -57889 73022
18725 52810 -400127 -149838 35764 232851 315662 -22501 -94581 -66661 111298 145200 -79981
18713 44569 -615236 146878 111004 218099 -91118 -23455 142269 -44218 -222011 -161139 -220677
18702 -220677 208751 159332 137877 63443 -283243 -191882 21018 127282 -167839 -182861 -46015
18690 -40677 86664 -97035 228163 -165670 -285646 -120025 -195108 -237661 -264016 272408 -39129
18678 -35885 -175112 -178214 -230012 -109986 -363814 -75551 -33222 -134234 -108296 105671 34270
18666 190518 -123404 -63683 -196366 -213865 142952 -43797 119209 13048 -62015 -120336 -72254
18655 -72254 240051 -425698 -11346 182044 -235548 -117282 -6702 -95912 -2375 -209179 366333
18643 -114993 -267796 258412 -343387 -205830 -231983 -115739 -75405 -242039 -13624 -248033
18633 -248033 -191123 261496 -82993 -124245 -452 138504 33255 199170 -19386 244112 88033
18621 182404 165648 126351 -340885 -359524 25211 135337 -286775 17306 53075 -35053 109598
18609 -101727 37190 272064 -146863 -67715 112426 -101780 105743 -240624 305849 66880
18598 -150435 -25108 -277722 -55395 -1287 -100907 -158169 -322960 -237990 25091 5760 -312336
18586 44901 43819 -281995 90644 -7825 157049 3329 -20006 25966 134347 41115 95419 -334290
18573 -131770 -149540 -127961 -13997 -59901 -94965 -28829 -168634 -9115 -192315 270068 -186872
18561 227577 265618 168968 -292001 -67953 -98620 38135 164449 -4186 232416 20027 -110040
18549 -10315 -237966 -273834 97056 222366 -429113 -139100 -442804 -37784 -332801 -155773
18538 190281 100196 -132713 -10821 9613 -159688 -458970 -66934 40385 -73331 -138543 -14337
18526 54150 -163966 -49585 323140 -35021 119539 -180462 -153146 -70459 -277217 75001 155327
18515 155327 -162270 -89791 -195463 -113927 135285 274146 -356086 26257 87829 -42038
18504 -196571 -69563 8775 213128 -242931 121948 -236856 -144298 107201 124979 36884 -37325
18492 -175840 29561 85512 -153037 379941 -3581 39394 4521 -72043 -81694 -365668 -19895
18480 -232918 -88566 -143006 35856 -134273 -119861 -91860 -124222 -292993 -67654 -227709 -142468
18469 -142468 -161010 236928 -10939 -139153 57796 -97186 108194 13250 121145 135610 -70044
18457 304170 137221 -273938 34299 -63438 165782 36629 99220 158065 -58264 -205859 65121
18445 22161 104803 -73580 -109361 152882 -43732 -66980 -259129 162310 -119313 -36546 276442
18433 -66603 -48119 221694 -118233 -54155 -239764 -36640 147649 -271569 4327 87969 217708
18422 217708 213204 -269129 153683 -142338 -370876 -128006 1473 -107656 85690 31650 212259
18411 212259 161560 170871 -19480 -100101 62164 -160006 -10191 347048 173594 -140260 -174445
18400 -174445 -26889 -280239 -38960 -40309 -91669 -17870 155223 -20456 118395 -397282 -91420
18388 106944 -107889 107689 115234 -150833 41445 -381838 -63289 -1007 -178704 300085 232933
18377 232933 111258 -74135 -167701 -88851 195552 65006 70990 37428 -79446 44188 243249
18366 243249 -220655 65176 -63289 100827 187885 -204013 -44732 353524 119953 222868
18356 222868 -193821 -149484 -333736 -115048 -228752 -74110 -163652 18934 -124624 -133309 171032
18344 12757 42578 40792 -343181 -129829 173630 43225 21656 104214 145298 -67082 74382
18332 36306 -44342 40311 169789 -50428 -253096 -90176 -359914 21059 15090 -182059 45499
18320 -412043 26437 -192495 277290 -24463 -159710 27221 283860 -174993 -45646 83069
18309 -114545 35024 31698 134196 -319813 121966 128571 149619 34605 -57735 -6729 -56400
18298 -56400 262683 -22137 2662 45912 286107 -302731 211011 -160760 -521021 -92615 5564
18286 -185968 -311786 -109815 -286289 53098 -138367 6559 -226659 -293527 -291490 -10997 -251460
18275 -251460 7240 -11182 365308 -198779 -62004 103807 86692 -119080 -34295 35399 -239869
18263 63597 -179564 29101 -36313 156460 -360556 -181085 -40976 -216007 -87690 -180649 187383
18251 -233185 -51363 -162160 -202051 63634 89096 52928 97417 168734 -271836 77370 -159906
18239 -72900 45656 45653 -19486 -191240 -218028 83894 -15278 413308 -129160 93324 225509 178731
18227 178731 91230 -64716 -124437 -19374 213974 41561 -244025 70779 -90914 1216 -206686
18215 -229304 -308576 -190061 304032 133122 -22660 -72944 -220171 71698 -34521 129001
18204 23601 131868 -282126 -14970 -59213 -110020 84260 68261 -120085 -98461 81698 -134108
18192 130219 126710 107365 187317 -370999 -274838 89092 -194147 283786 -180239 78727 231891
18181 231891 42721 255825 -103370 -9904 -146300 -154843 6635 -188319 -96965 -79494 82024
18169 234620 -214508 -65968 34385 102312 -310887 -83407 -141723 -66122 218934 -172944 -295703
18158 -295703 -426315 30950 99943 -227882 -186953 -20150 113937 278862 -38778 64597 178152
18147 178152 -197075 -3137 53697 -222028 55364 -183093 -383409 93542 60756 -208943 20386
18135 -94621 -8535 70273 -194735 47337 78802 49106 -70988 -109125 -35539 42784 230266
18124 230266 -36623 90059 -123622 -194351 -114896 -129904 -24111 130456 -99956 905 -146789
18112 -26113 52885 -181283 -31801 28588 -62878 -113768 -227245 -506210 -11911 108865 248950
18101 248950 -60452 66028 -60877 163385 -39981 -540517 -221630 187003 189703 -153200 -97861
18090 -97861 206448 -90222 430416 57264 -216923 -37436 -173728 -301029 84794 118778 266701
18079 266701 -137716 -207688 -392649 203850 36552 194068 576152 -68795 -174951 64691
18068 -39533 -826 -12345 -227430 225456 90374 112646 -7882 190412 12989 -89671 190686
18056 127340 -117255 123621 -298436 -87489 -233597 -75329 56406 -139442 169191 -7153
18045 -323042 96739 168689 99359 -92624 -186145 114423 112251 120865 48072 -88166 151821
18033 272008 201901 198881 -195851 14297 -72164 32718 -186943 73862 35279 -205650 44031
18021 229155 158034 53363 -206299 44655 136555 -173198 62244 -28072 -205770 -81745 -261973
18010 -261973 -111581 -115907 -129611 12549 -48267 98701 -96925 -39842 -213570 -98513 -60171
17999 -60171 389986 89151 84750 -180014 -52371 212466 -114942 193040 -149621 -193740 97140
17987 92197 -39365 33055 112213 -103618 23065 -157913 -87162 6111 109828 232238 175821
17976 175821 -39063 -229721 -290516 419829 24092 51620 162648 -126377 118488 142603
17966 142603 -83316 12630 -15797 -150240 -80111 15246 -139516 160775 -185698 -113280 -119254
17955 -119254 110800 -120396 168917 43877 136237 31980 50178 -139905 109510 -279762
17944 -6207 178505 108080 23068 51940 -218385 95322 -214791 -1525 -491679 -102784 -341477
17933 -341477 182658 -67220 -158100 -7944 58185 20375 -322369 75470 -23267 214143 74383
17921 104435 50001 -252622 -55638 -296312 -271393 -118724 44179 166894 23846 -257634
17910 -130386 -7602 -276766 468299 -114726 85959 34188 -37635 -40917 -212846 -27635 -203516
17899 -203516 142820 47513 212784 5378 -22936 -215388 103778 -208102 -327521 7121 150423
17888 150423 -91977 -59214 14902 -130847 -232735 -120119 -332202 154711 -123845 57932
17877 -50493 149280 152803 209363 -337886 269449 76856 -43479 73624 -46098 -311080 2366
17865 149740 -116633 13759 158508 312895 -135921 309814 -97086 146949 52037 144752
17855 144752 87351 -276310 221633 282186 -234926 -19001 401954 407069 -70733 -7977 201196
17843 161250 -107937 57466 11643 -195270 -8536 237389 87265 -15631 -343190 269929 -50200
17831 -243759 288452 -45078 -60689 53188 -79871 -90009 -190166 -110720 -58164 16055 168225
17820 168225 83921 193748 224780 791 -118452 -82639 105482 -124543 221735 -101169 285852
17808 -207725 3179 111527 -336222 43777 -30205 46760 -41080 194312 96077 -101163 89726
17796 -297446 -108075 168403 46759 177353 -90413 -113285 -156336 -13740 -136678 -253208
17786 -253208 40588 -231705 93661 -197379 294348 148642 -154464 174192 -5097 -78069
17776 -78069 -226834 -147514 170682 -116912 -271470 77485 -189692 179250 -301539 -220689
17766 -220689 24173 44551 -250603 -106663 36471 20825 114389 -38096 138770 151974 -10588
17754 226351 -27420 199496 14154 274254 -53046 119583 -28403 123472 135262 -107930
17743 279681 -82314 -215095 -15666 27231 165244 -87807 -252614 256662 -175705 -89997
17733 -89997 -243809 -85240 168905 -212459 -98260 -368719 -349942 -165046 -17568 130489
17722 189400 -184116 199024 -20331 95736 127970 -7827 176806 -34912 39131 280504 40826
17710 -71477 55310 8718 -43650 42628 -35746 24082 197653 -235412 -143651 310292 58370
17698 -89235 26464 -391127 201655 -333982 -47284 103290 -46844 34797 -61652 25704 -79446
17686 67975 -43046 335959 35652 268008 337983 290974 187644 94430 141843 -116722 -90741
17675 -90741 -65400 133115 175130 110543 -42652 -152072 -49220 -67163 42270 30473 91950
17664 91950 279119 130867 -178425 174196 -2198 -36040 -430 401485 454972 120992 -254323
17652 -301141 -32082 21519 62754 -98090 80437 67429 -227739 107907 221038 373338 -88542
17640 -333157 -175395 353385 14454 -41180 363764 -242822 -83994 164528 54434 -279980
17629 -59948 145752 146611 -112043 -112951 -117819 -154965 -155383 -475247 125045 -158236 98644 -63143
17616 -97430 -351786 125646 92257 65336 412151 98824 -151048 457635 97605 175144 61949
17604 246434 -66665 165565 -23260 -25806 -192430 118081 38650 241301 -48882 -190743 109422
17592 -61768 -385326 197204 -108257 20742 23071 119465 134635 -17998 -169731 206210 143166
17581 143166 60468 330027 150908 -130390 -113231 28796 310274 -69774 248345 228946
17571 228946 82546 -96934 219456 -163320 88658 122719 446870 180157 107543 23036 140897
17560 140897 78643 73035 179255 232076 -27094 154792 262702 11745 -102405 120902 -52794
17548 -80984 56162 227072 86662 130747 -272567 119787 252451 42932 198757 52676 -195005
17536 152105 322990 399295 60797 -292709 6100 281846 -91090 -3377 219142 38769 -59804
17524 147908 -337516 -156647 262052 173914 166231 -65687 15214 274427 243402 147434 -43426
17512 -73311 206880 301806 -108516 -168720 -135990 207332 148172 34413 41739 266565 -31616
17500 -8339 -15065 277558 8711 198427 247980 -53982 350447 -99890 264386 -236871 146176
17488 98884 334619 149599 -179446 212391 66404 -55776 130218 258320 800 287039 -76819
17476 148472 193966 510572 242022 146412 -36017 116499 293189 201569 304982 16343
17465 -180733 57362 100368 288585 192923 -58257 176162 337986 72711 271142 243749 135787
17454 135787 460470 155371 124202 361521 358811 444240 250692 402094 160196 225149
17444 225149 108224 60431 166261 203055 225305 45638 44075 -2194 -52851 -198683 57295
17432 318923 119957 591788 136142 344352 181338 160602 385096 341931 173141 125611
17422 125611 244521 527663 -87598 504550 206546 255569 150971 165820 -18689 328120
17411 149247 301013 347107 207916 140493 -28497 148483 -21319 21097 261614 228339 221670
17400 221670 -26271 -59702 310313 300156 206693 171113 372395 166333 270942 237795 220369
17389 220369 -38764 272361 130121 81823 246977 270661 -312942 261040 -39594 56467
17378 -102568 -35378 -42749 -73744 174768 37151 149282 332119 104561 308336 -74280 330654
17366 -41796 -43721 480129 -95056 -108829 -47955 131104 44641 283062 398890 56732 -24624
17354 -5080 136278 236398 291272 313353 18363 109413 195229 -235388 -40769 250448 -207863
17342 17873 306378 182808 -215935 -288920 313856 132709 43817 -5451 -113699 231726
17331 47402 318997 -98387 41715 116005 189835 20198 -74861 72624 173040 206825 -20853
17319 308996 128583 221555 102025 254622 47504 172065 61940 -146867 409289 -22179
17308 134704 360037 15960 91727 237991 -85289 283036 176402 382581 253781 217944
17298 217944 442987 -198390 226519 306267 195112 173672 28192 205714 64719 343371
17288 343371 117327 -25544 356703 122175 187986 80891 191224 148640 173366 62530 144880
17277 144880 73003 -213645 399780 49938 193587 -53260 244524 -19148 36629 257888
17267 257888 68154 24941 397084 204548 226035 11629 387532 -101126 -16953 -665 182376
17255 124197 300839 242615 402616 -128714 206058 164988 204326 48691 121252 326705
17245 326705 131737 -1725 -45531 -128027 158630 176434 410028 256891 63711 383820 389046
17234 389046 445220 618682 578781 223383 14984 -178312 186969 231001 25805 119594 303625
17223 303625 77433 408827 544159 369390 94733 253434 75765 120814 -66666 -26170 332618
17211 264078 286331 159400 19987 55915 477593 449042 292462 451298 363557 298485 425671
17200 425671 197821 390081 123817 366454 187652 583518 464922 199978 107825 234447
17190 234447 508938 190199 351624 -3091 134706 126789 330538 289832 242807 177718 238185
17179 238185 143730 79298 579953 394407 332559 338279 485485 240889 311102 248009 232595
17168 232595 775587 62040 314623 267819 286189 370731 87004 213113 379684 367468 414291
17157 414291 351332 28307 288855 154395 119576 175537 190716 77418 158503 -6666 494513
17145 232636 322755 381305 229838 436500 130693 316357 368682 73907 145505 329933
17135 329933 226616 386823 304023 170144 204052 153385 94271 451436 169131 72622
17124 229601 432765 462426 17753 317729 109699 390251 258166 251396 603912 250096
17113 218868 518491 34723 332986 272397 412076 424729 560038 258276 559317 331020
17103 331020 725706 294321 149677 402093 456772 349973 627103 423983 745882 287648
17092 339746 473767 575144 293513 223532 216487 615239 324044 742678 474857 387271
17082 387271 503491 365801 189304 475720 447128 593428 560047 379074 420168 260169
17072 260169 379004 732967 553415 592223 349095 582482 618819 422389 390235 688801
17062 688801 579653 363825 504836 404263 228863 596099 499341 265957 614293 364022
17052 364022 321173 376563 363577 306561 532567 351775 635081 455818 449913 616308 491043
17041 491043 486973 378071 265313 367098 350882 690739 728251 547085 755679 563240
17031 563240 612993 753060 729744 684023 621197 415444 508323 603274 819037 579386 436474
17020 436474 389443 705986 243949 587251 735693 706636 330044 530987 467007 552157
17010 552157 945517 730508 575467 547086 591898 430668 885077 562602 725563 467307
17000 467307 826358 393889 857953 882297 722751 494798 836715 592549 566662 665291
16990 665291 769245 771946 530574 518673 625736 350471 922313 367155 914002 999429
16980 999429 581586 1173712 904197 654175 897180 1061986 1077058 821784 583989 786211
16970 786211 863899 888242 877129 825291 542004 1108521 860865 804555 1021320 711139
16960 711139 1036193 910488 1076126 1053592 664689 866289 1007782 1252039 1308707 1081852
16950 1081852 1221657 1018557 1206635 1207709 1438416 1322756 877629 1371850 838343 920604
16940 920604 1053484 1308246 912093 1075903 1309285 820314 1024610 1146635 1116016 985338
16930 985338 1005712 1473870 1276779 1338174 1304021 1283365 1465326 1284281 1621963 1260019
16920 1260019 1209251 1392848 1397772 1793737 1138915 1436280 1337863 1646224 1333605 1215816
16910 1215816 1272369 1417989 1651733 1636254 1299378 1742553 1612671 1370448 1711746 1628598
16900 1628598 1760489 1532306 1746549 1841681 1660887 1709041 1914098 1739424 1870092 2122714
16890 2122714 2121909 1820140 1669909 2238128 2312011 1816527 2168025 1838957 1837724 2472100
16880 2472100 1813338 2114290 2039955 2218095 2428633 2171349 2217861 2246133 2284932 2178706
16870 2178706 2145937 2177901 2241812 2373728 2391058 2418985 2384418 2565539 2691233 2438661
16860 2438661 2694897 2784008 2716514 2393170 2837789 2599035 2912059 2849713 3035610 2916729
16850 2916729 2981682 3183460 3304626 3208542 3328318 3619862 3506437 3378026 3455077 3524243
16840 3524243 3657135 3577482 3860243 3553649 3743483 3867281 3914144 3990732 4048748 4377911
16830 4377911 3684914 4188915 4124814 4507299 4432590 4568666 4471523 4309654 4701867 4877652
16820 4877652 5114234 5184054 4836308 4998043 5426391 5201534 5644589 5407837 5775133 5719625
16810 5719625 6247813 6262856 6196820 6152393 6528698 6586407 7021051 6989577 7348862 7406071
16800 7406071 7496779 7540482 8064648 8054112 8321303 8661310 8698615 8830567 9374822 9043576
16790 9043576 9660416 10088978 9873875 10245773 10643841 10873807 11394031 11347041 11908291 11824363
16780 11824363 12595955 12993339 13341436 13759081 14034936 14593085 15025588 15652522 16272738
16771 16272738 16641020 17393525 17886357 18309895 19117313 19604516 20569517 20998592 22279772
16762 22279772 22911225 23592794 25097285 26003378 27227314 28240993 29348526 30714047
16754 30714047 32057405 33725173 35270745 36738619 38641443 40518342 42637974 44790221
16746 44790221 46802006 49959052 52588641 55226156 58577077 61553369 65172934 69454456
16738 69454456 73778896 78273765 83021200 88390958 94103520 100312882 106868296 113603051
16730 113603051 120851062 128659785 136807795 145125884 153697292 162353297 170605517 178853086
16722 178853086 186875497 193830052 199834995 204586154 208284477 210357822 210640127 209549673
16714 209549673 206803926 202341490 197234869 190248181 182951120 174876197 165930679 157226905
16706 157226905 148433999 139927789 131059609 123022927 115825636 108117433 101050451 94691561
16698 94691561 89030889 83274990 77925920 73165444 68965390 64788117 60973781 57575293
16690 57575293 54128730 51074301 48239332 45557564 43006739 40911032 38925660 37182640
16682 37182640 35209758 33430123 31727178 30559735 28751071 27601743 26423894 24903509
16674 24903509 24076812 23181432 22343538 21141343 20430407 19830421 18977270 18403475 17266174
16665 17266174 17006845 16262277 15499266 15282691 14815555 14172032 13579433 13065535 12771629
16656 12771629 12237573 11924637 11592883 11313578 11240711 10657485 10186722 9989051 9619145
16647 9619145 9637091 9103529 8891121 8737729 8364305 8307463 7655239 8076940 7545821 7468119
16637 7468119 7367474 7243994 7181083 6827186 6434731 5959347 6461621 5900287 5951171 5566995
16627 5566995 5897047 5754514 5516027 5103466 5059652 4973844 4811687 4957464 4708701 4538482
16617 4538482 4504531 4231172 4300440 4040971 4235861 4189170 3824419 4122419 4144626 3804574
16607 3804574 3521455 3751691 3572681 3268472 3609632 3547507 3290994 3470748 3145318 3370298
16597 3370298 2945009 3082952 2900625 2734113 3061148 2673502 2708470 2632508 2577243 2684621
16587 2684621 2836840 2734261 2605437 2358638 2718260 2591535 2341621 2282555 2048201 2184501
16577 2184501 2298321 2241384 2278749 2108739 2309462 2281424 2130504 1830813 1773646 1902134
16567 1902134 1861736 1963584 1859426 1758184 1665340 1698109 1466424 1853544 1503537 1740960
16557 1740960 1702022 1398501 1416021 1369405 1564905 1355169 1470298 1585853 1720955 1068578
16547 1068578 1255317 1348060 1257845 1127005 1376869 1570479 1311955 1223974 1565831 1484038
16537 1484038 1405490 1367594 1112160 1118989 1354341 956336 772858 1167858 1318852 1243375
16527 1243375 1002700 797050 1052257 1086376 1041917 1095558 1308972 858968 897691 918432
16517 918432 993286 833007 866882 739052 800701 1110771 754693 887220 1212268 787867
16507 787867 895958 842066 1019400 783517 979221 871782 518243 872571 868758 764181
16497 764181 664178 891611 780785 825334 937007 634668 665077 792057 1139881 813084
16487 813084 339356 763229 563677 695367 328143 643897 519301 1012599 642417 698712
16477 698712 978954 847844 525927 775645 801155 1003669 770593 532159 609854 548411
16467 548411 488834 495686 767949 577681 520829 982700 556442 477707 826519 518342
16457 518342 324003 491217 255114 507779 622541 542413 438116 610435 199985 476618
16447 476618 546074 512243 431339 600063 467406 387386 167808 511482 596802 420241
16437 420241 535030 189291 425925 384384 376896 696479 413024 288548 564106 485532
16427 485532 357772 608333 328836 620288 574004 216983 416702 535642 341425 318878
16417 318878 358039 304050 347491 187521 296835 509887 561943 273794 409254 441949
16407 441949 362027 466918 318823 93834 395876 309992 213148 402746 206908 243753
16397 243753 522546 120077 230024 214137 293556 413024 180814 333069 303354 127225
16386 335425 314653 389950 607203 323660 3304 420920 594320 218026 403640 481223
16376 481223 123908 46957 25603 397773 64327 -80709 197939 197408 343956 268276 59930
16364 437518 115698 41569 220663 248629 316199 249509 102069 284253 186208 263031 356478
16353 356478 291098 313226 -144449 130354 134729 402327 178877 217399 108936 166459 158893
16342 158893 -73499 102934 162029 305890 11239 248759 533225 76115 142633 346741
16332 346741 -68060 140488 96150 110978 113869 -104294 197684 39199 317968 220092 183995
16321 183995 456287 15935 122378 88868 125036 203891 312220 137256 31153 352876
16311 352876 -45419 196214 209567 339574 47073 361616 36621 55645 364721 -65175 264928
16299 97777 32690 -87407 77175 92774 224456 -340125 329520 134531 33501 -20897 -86229
16288 -86229 -128990 177316 -76296 51359 130239 45657 197338 -152975 127203 27862 446177
16277 446177 32527 12066 103697 -61469 161711 191795 191974 -59455 212603 41258 143067
16266 143067 80675 -30707 59614 195440 20826 71013 191138 -32456 -31610 163814 385527
16255 385527 198110 -108850 195723 241957 148931 198107 137834 -205017 239608 -26073
16244 9669 -126485 235001 107434 121749 113957 336476 -91162 6685 94405 -110970 62316
16232 24588 72 378101 -117179 -182569 -112266 80147 241901 10760 49134 -28263 -131440
16221 -131440 -47642 94966 51729 384385 30077 160837 -75197 150666 66070 104854 -254936
16209 -33475 87368 10309 135356 -111610 491516 121618 1734 -54879 -115015 -69488 245675
16197 -116139 220608 129244 101426 108284 278327 -129214 166318 63957 -55764 71576 7365
16185 191854 271 28125 26154 98727 131428 -99914 155390 220276 146605 374498 21188 250716
16173 250716 -191008 -52388 86784 98725 -73776 -62139 185726 54737 -51798 167656 -33481
16161 -254364 -54038 -289736 -272111 -22973 -190818 -197765 -186348 6828 -53744 -229484 124892
16149 502605 -24003 137814 -7376 -71941 49837 370495 332499 -216764 161009 -147399 -88871
16138 -88871 27121 157109 -181222 205304 94244 -12072 9239 288142 -275891 137418 -92564
16126 -26662 179438 87012 -143790 -70566 65895 -42222 66411 -191503 19970 446205 27615
16114 132140 128075 -30529 -23330 11632 157397 51782 84886 141974 3565 46200 52598 306260
16102 306260 -291446 252704 100667 120094 -98360 17241 197991 -180264 73112 191878
16092 191878 -350627 -6131 127671 -67381 55795 164208 82515 -55321 31343 -162587 -48879
16080 -235746 18665 299627 -2950 176760 -43904 -312049 231521 -66846 116971 -71087 -22751
16068 -280914 383229 -147883 -42012 102475 -20392 -104454 87051 -232421 174412 -319596
16057 137231 -63252 -2049 -237116 268373 -333092 -6674 -303682 388898 50402 68998 28956
16045 -88721 -213641 -240292 46176 -189106 167671 -243114 -179873 75429 -49645 -93368 -175182
16034 -175182 118483 -23804 -240552 409012 170932 63840 -288298 -126648 -200230 -93121
16023 237288 42496 -489771 -244131 160557 631 -130086 89768 195985 -102817 305089
16012 -49632 147482 -50635 30449 -170461 66246 -52062 -79131 -294415 -132502 11332 76369
16001 76369 -24858 134379 152879 92400 115072 257580 -69904 -6589 -17757 -157029 -234474
15990 -234474 177884 53045 19915 -199444 54960 189662 126785 -8638 56732 391002 26208
15978 131965 246323 -64939 103491 -62654 -30357 -162124 -6249 211469 129390 -167238 323861
15966 104048 179571 -122566 99123 38269 -336223 -75753 -255001 -60814 36423 11266 -184838
15954 125493 79799 6709 90595 -172943 -184155 -359470 -305148 -38312 76037 -99497 -274699
15943 -274699 56960 48446 -46450 -87422 -114762 -334670 -92295 -321045 -97320 -251655 -11770
15931 -74352 -199368 66495 -44620 -155804 -93015 -197421 203565 -5749 -231103 133706 -281893
15919 -162622 -74796 256144 -198611 141244 -30291 35193 -101470 32019 -252679 87526
15908 -163041 69233 -185816 28015 367775 -19280 -111601 143805 -104164 -124276 -231354
15898 -231354 -70682 -150678 -181110 8454 -322340 13488 109722 -96171 -58897 -237729 -67742
15886 -246291 40579 73733 -104189 563570 77200 108354 -47887 -354603 173632 -91296 -166568
15875 -166568 2747 -166146 -406312 -152140 177536 -56117 -132457 178279 216094 -266352
15864 18138 32603 167851 -84340 -24501 330031 -381507 12948 143316 1437 -174235 61463
15852 26075 42592 -18377 86725 53630 20289 -122614 70736 154389 -199571 -244936 -378800
15841 -378800 -19344 251856 85131 -81884 177061 -50837 -127282 -206496 -62213 -21696 129454
15829 175465 -265214 251278 167054 311745 -371925 -43459 -188591 -17928 -11271 -184137
15819 -184137 240003 52250 -110197 167691 -93870 195082 -29522 -349476 -168444 292526
15808 -15989 -204672 -94840 -228502 -187181 -24652 -148488 90558 -209454 -220890 35452 -3013
15796 -105430 -54776 119355 -225312 158469 -207888 114454 -41626 -128545 -128239 -298139 -151520
15785 -151520 -73244 209127 -172832 -147761 84042 -94129 -296943 170277 -217171 34517
15774 60285 -257849 -123323 -235017 -41987 212800 -130995 56891 331083 48377 97170
15764 97170 67629 126160 58370 -125908 -57703 -236948 -107492 -67315 -71916 278653 12285
15752 -54560 -12558 111725 -88900 81893 97013 304443 -84389 -51457 -146389 -124958 -27974
15740 -2472 25199 -279388 23539 -59299 114541 173198 -306848 4458 -76656 270020 -142109
15728 22687 -312148 -218492 -53927 -178386 14986 -92864 -64141 175762 -56545 91645 -373917
15716 -84136 141254 -207962 84706 -245908 -466131 -46024 -208371 -28469 -133310 28146
15705 -56667 -236457 7830 -378309 -1714 -45820 94485 -8182 139382 -64833 -236028 -10471
15693 -263284 -155256 217231 -263910 -230991 -169420 153365 -26348 -264720 42793 229223
15683 229223 -70007 38411 -436172 -261649 -371185 28642 48154 -44684 -101516 10668 -47284
15671 195420 7143 20215 121447 98903 -139363 -122786 -296853 -9527 -398574 -340631 48116
15659 -19263 -83267 89993 -190583 16170 421941 -55073 19935 -48776 8445 149117 -293945
15647 137114 44685 -31861 3781 68113 246004 -48873 -93091 94780 54801 -217905 10252
15635 292167 -133617 131980 147260 -286590 161458 -165011 -16170 -184331 -121605 31768
15624 -252004 165729 -398462 228023 -178413 -28595 86930 98756 -29910 191643 110457
15614 110457 154681 135331 60337 -19320 -266153 -22220 -29165 -225889 -17345 -83183 68383
15602 -115026 -121685 -72213 -60637 235774 264476 223982 285350 -382685 -38672 256455 17895
15590 254739 88691 105696 -3205 214 80689 -37098 -89885 30961 -288810 122653 -59041 -99375
15578 -99375 -6379 -249217 -315635 99381 -385760 48565 -18553 -170487 -292525 103382 10770
15566 -375502 -253420 -188459 218997 -279324 96628 192053 -98250 275662 -189036 68765
15555 148408 113375 -234215 202044 -149092 -76450 -9400 171211 94085 -37893 -51702 -102794
15544 -102794 -399107 -80370 -54236 144519 174279 270471 342781 107096 117970 187104 51012
15532 188815 -304843 -49160 38277 215562 127610 -254050 -5159 15343 171019 -85475 29277
15520 274949 174314 8413 105438 -160454 125934 -35250 186235 -65829 -214969 -29740 -115981
15509 -115981 -118871 -22702 -167588 -113224 -389968 92833 -59313 -309716 3787 -74275 -232395
15498 -232395 242491 -67560 261567 -9856 27497 -155058 -56091 94049 -134299 -174486 -55240
15486 76705 -79831 -167753 63581 18626 193738 142175 -246570 157902 22257 196909 140018
15475 140018 -118382 101178 -57348 85985 160442 138055 -73546 -43783 366000 39352 -9945
15463 203024 219787 128960 -360888 206824 101022 -125349 42113 -179054 19226 6364 -257647
15451 -49793 -151576 -150989 209898 -93577 52852 -217328 -313105 183674 -147943 -252404 17501
15439 -245339 262629 -171987 80751 89610 -279661 -109628 -77871 -55062 -173628 -176441 244896
15427 14859 -158524 -134207 297229 303790 -115464 39328 -55232 235550 67334 -69432 -234459
15416 -234459 32901 239700 -93827 520390 294296 -32977 -77131 49753 -26338 268079 72335
15404 35558 -231724 193415 -126966 -7661 -25929 82008 -217891 -170876 36271 278475 -10755
15392 -11659 132828 49116 -150474 62469 -220293 224557 -206574 93042 -75839 -149544 61268
15380 -78673 202458 120802 150903 341173 -39077 -417291 300350 74765 -17857 -262462 1417
15368 -135608 -378508 43710 161152 -91827 53760 155793 -50665 -277284 -28910 -5739 -251948
15357 -251948 270970 206482 44630 7788 -82214 -303 254008 13134 -229246 -61305 212104
15345 -223563 -36883 7383 -195019 187755 -170527 -78917 -291597 148040 73405 111863 18828
15333 85209 231814 -110105 -76525 -148105 103020 56749 224107 -482130 50424 -122214
15322 227766 216092 -225157 -150575 44547 270100 -207504 -104867 -128505 142847 333372
15312 333372 233222 101505 204978 95079 -64339 183418 -104301 -158552 -66947 -1570 -204802
15301 -204802 236384 -192304 -128218 125020 134765 14578 61989 288418 93633 228429 28484
15289 -17046 175350 -195079 171496 -333236 -169079 -209453 -53233 224344 353356 171168
15278 186054 149302 446230 377953 122162 388926 -71405 19269 12330 -49082 137484 -13871
15266 -385403 333787 121165 155581 253286 54562 -41266 92831 1587 11542 62179 22094
15254 262736 217037 145130 55287 213679 362962 559861 1096449 605054 1251847 724757
15244 724757 14771 80884 253687 128535 7240 -336221 -101347 48399 160640 49180 -16684
15232 111463 -199024 262512 323110 241416 -128298 263047 21205 141870 212295 230908
15222 230908 -242785 -47582 -251906 225642 128502 123654 222336 181920 -295265 -201293 -46475
15210 261095 155741 -29691 22365 311098 331842 63742 362048 65603 109998 -6961 -321837
15199 -321837 133399 -8061 -177997 26894 138149 94290 302633 111303 363761 197965
15189 197965 308839 7741 -268662 345329 -137652 297223 -181425 -192957 64681 133814
15179 133814 229031 160905 -2114 -10352 8879 382279 204228 -87106 -89385 11809 119346 -240901
15166 -226395 -17965 578685 -193479 30685 340072 -315053 247597 88236 -99853 220310
15155 -100170 72635 229147 135688 148626 -31478 96764 312790 88419 468388 301756 -27343
15143 -6860 -38829 98085 248030 290307 257512 478483 -38611 114810 196661 54845 258281
15132 258281 35477 -160294 259493 152710 52584 -19872 156759 330429 -51647 166191
15121 107534 258492 218635 64180 2097 -126355 127236 129157 37950 -187642 41683 239572
15110 239572 58040 4194 262799 217115 3840 -20700 314513 -40485 329635 2894 191161
15099 191161 81777 268754 80144 372764 452331 201383 -19409 31387 -16798 -48713 -25644
15088 -25644 385867 240766 141396 126765 382244 107211 -15881 5030 78442 155900 102495
15077 102495 29433 267074 146820 464815 265493 152420 177094 540809 -36844 276305
15066 399488 296141 -25378 153645 -98403 -43736 94369 -35517 -38278 -159270 -33091 343886
15054 227798 -125644 213087 66352 167496 199879 -26583 438175 152447 574864 20445
15043 45458 32984 14597 437256 172374 374761 171910 -5784 168168 100437 -47184 301578
15031 135024 45218 161560 496774 92589 204065 -196054 55209 407620 80529 558431
15021 558431 152835 138676 59887 -64689 240137 113869 250540 321303 -1676 116827 361676
15010 361676 -165156 208575 472442 182199 -45577 343368 175904 141857 210398 232840
15000 232840 183776 278459 332230 -134475 116981 168993 345715 331073 448773 547959 51297
14988 278656 827 183477 96483 69075 300915 171195 207152 612115 167703 321052 304320
14977 304320 38874 220375 86035 -135197 493412 -250241 364824 366751 274716 116808
14966 246154 335978 -197269 256078 9923 406067 236579 676074 556378 348003 109251
14955 506109 416739 258332 123183 245275 310817 203434 -66929 -1896 251025 459845
14945 459845 161370 248364 -52987 396874 262758 -2922 586198 168621 10576 101684 335965
14934 335965 390151 181845 256194 65381 688056 334760 470169 444060 434608 244664 402715
14923 402715 394806 338797 287634 27527 403784 32730 328206 465603 397156 301984 18243
14911 373786 218451 353609 489970 433131 18177 333018 85936 185059 390328 505084
14901 505084 312495 285936 249083 395778 512386 198090 383148 608052 79826 400730
14891 400730 627527 166687 205902 147025 657045 474426 348002 251227 134722 420103
14881 420103 296919 347130 340972 285196 297874 595598 371821 447594 534903 364034 485974
14870 485974 389683 532211 444343 402332 540462 370292 679864 689622 110235 88608 220950
14859 220950 537895 95779 473104 370152 715913 622813 312795 705513 676418 258596
14848 427920 215414 460671 527706 59691 269943 340763 450879 369064 205486 423734
14838 423734 406563 317742 621878 290284 607147 124525 590991 527015 225673 192927
14828 192927 631100 584371 499393 493461 253867 657351 294362 831706 349951 583337
14818 583337 465071 357189 502031 675572 320499 686585 428123 238484 603470 549036
14808 549036 595407 311709 438668 507950 572858 554911 619762 380619 612339 177718
14797 487558 402841 627457 634158 486451 400238 406659 551099 522436 604302 533254 468273
14786 468273 627227 472428 756958 864399 847561 419733 935200 892933 472970 545343
14776 545343 730058 569713 678173 394401 708394 817024 475700 852535 529570 480184
14766 480184 564193 567445 589728 610696 420181 601162 626946 636856 601304 1003303 639634
14755 639634 496576 943943 745592 490019 725327 750682 909841 649449 738493 705576
14745 705576 773968 757125 710936 792376 879180 818260 937770 915816 829496 895748 598046
14734 598046 1021397 388520 616073 446802 996171 649754 805674 750057 755462 949302
14724 949302 849511 797156 823013 886520 772473 758001 706439 725121 813948 676869 836948
14713 836948 751758 659798 885784 1062961 928972 799791 641637 707312 917961 777651
14703 777651 1173750 816411 745137 890161 763098 1410178 912429 756068 336019 881529
14693 881529 1025186 699353 915145 686005 825354 968884 855550 1001520 833748 845671
14683 845671 951383 722294 1034894 1188833 920153 1051317 1075157 1229139 777169 1007005
14673 1007005 1052238 958010 1225070 1167649 1046405 1322365 680400 1086432 1310756 1140382
14663 1140382 1023287 1263519 1207783 985920 1105987 1159340 1193939 1286200 1173271 1108564
14653 1108564 1070309 1293913 1391047 1102129 1413638 1304710 1154667 1315542 1010363 1054641
14643 1054641 1349936 1445357 1423683 1229605 886073 1412964 1317040 1328487 1302305 1351282
14633 1351282 1428046 1384718 1383303 1649620 1255422 1320056 1439895 1233676 1388339 1573645
14623 1573645 1550910 1379334 1776196 1223145 1487113 1502750 1625454 1402591 1503971 1470352
14613 1470352 1430245 1133525 1337177 1509633 1324508 1427527 1556824 1656714 1946865 1819807
14603 1819807 1841933 1934899 1476158 1626437 1871153 1583079 1407776 1750323 1760171 1615013
14593 1615013 1793903 1834140 1837214 1488227 2054366 1898976 2032129 2327942 1943599 2029968
14583 2029968 1626291 1700572 1967721 1776415 1585635 2162195 1768049 2071145 2042059 1904810
14573 1904810 2620569 2187698 2309442 2329036 2432615 2199125 2186291 2307503 2530019 2852845
14563 2852845 2532845 2634889 2514866 2441521 3088755 2965747 3145580 3241318 3217127 3442246
14553 3442246 3614802 3949747 4938667 5626765 7409960 10831236 18467075 34949867 51375463
14544 51375463 24916362 10216078 5018781 3066404 2398353 2491237 2165078 1976779
14536 1976779 2108723 2145371 2111540 2287539 2216607 2060231 2270363 2172950 2228472 2234265 2277777
14525 2277777 2534338 2367423 2234702 2642758 2578662 2296635 2835130 2993685 2909516 2800213
14515 2800213 2704023 2821433 2863758 2853285 3007589 3145082 3011799 2969565 3014416 2780980
14505 2780980 3420016 3111940 3337321 3273511 2989254 3080916 3133470 3154466 3194505 3132838
14495 3132838 3123600 3534034 3529572 3553971 3648211 3700690 4001445 3726512 3723459 3683039 3733724
14484 3733724 3549266 3873426 3912822 3899570 3698913 4188588 4046288 3801492 4517721 4139274
14474 4139274 4231460 4406035 4531599 4562431 4488358 4421444 4669634 4727679 4725673 4823572 4655762
14463 4655762 5023687 5113113 4775709 4959058 5255825 5025700 5226280 5214014 5292235 5109668
14453 5109668 5191553 5479863 5470480 5836845 6001940 5568941 6051001 6119704 6016600 6095247
14443 6095247 6016312 6186625 6559626 6558006 6451222 6582527 6769004 6619812 6531426 6808777
14433 6808777 7031033 7269554 7028787 6892571 7087048 7123763 7422383 7630675 7437458 7810684
14423 7810684 7920009 7855569 7993074 8471453 8105428 8629543 8699838 8488439 9118759 8853590
14413 8853590 9013058 9271047 9509313 9451411 9661734 9423759 9796689 10088684 10059703 10158798
14403 10158798 10585044 10709469 10849131 10713439 10917403 11111459 11510290 11960409 11930404
14394 11930404 12036686 12286833 12348831 12791692 12730706 13029152 13271364 13648750 14081178 13835451
14384 13835451 14055492 14306603 14639990 14823412 15085104 15258375 16085155 15651310 16501758
14375 16501758 16770387 16872433 17317873 17467453 18155373 18280760 19001616 19058471 19385848
14366 19385848 19541956 20129179 20730571 21271153 21742633 22035180 22526323 22852143 23409862
14357 23409862 24103444 24567106 24777004 25472363 26241349 26860662 27312827 28500581 28550346
14348 28550346 29552393 30051459 31145102 31826096 32589344 33506583 34844902 35498311 36270259
14339 36270259 37370712 38269480 39235011 40498710 41873312 42910618 44096599 45907845
14331 45907845 47103625 48179607 49766933 51295057 52822374 54546012 56449309 58044722
14323 58044722 60422891 62313338 64395766 66614084 69133106 71370652 73948678 76859111
14315 76859111 79757018 82899212 85712457 89246828 92741424 96387580 100262896 104557450
14307 104557450 109242023 113754131 118438474 123838822 129232127 134852448 141232385 147753864
14299 147753864 154409011 161590571 169203724 177354498 186075238 195136227 204636379 214895218
14291 214895218 225518517 236646814 248206035 260764358 273597759 286736238 300231634
14284 300231634 314417844 328549038 343034099 357539500 371854371 385801217 399422033
14277 399422033 412362433 424187103 434741946 443987466 450654376 453731668 454724264 455514867
14269 455514867 456970680 454567322 451871074 448036864 441266910 432401941 421423435 409308837
14261 409308837 396277539 382403881 367831327 352501386 337927391 323119951 308500107
14254 308500107 294595368 280670950 267581360 254436300 242520037 230254378 219326223
14247 219326223 208982890 198750611 189344684 180697496 172238957 164295904 156733762 149668015
14239 149668015 143172900 136661265 131163852 125382271 119781851 114482175 109850509 105279781
14231 105279781 101580647 97380606 93570966 90086366 86300808 83195748 80249113 77156963
14223 77156963 74230964 71544193 69432959 67132087 64911052 62739853 60623249 58828486
14215 58828486 56714848 54789650 53494270 51803330 50426059 48840348 47252544 45813486
14207 45813486 44957340 44083793 42338506 41083674 39978236 38757776 37891092 37256828 36591940
14198 36591940 35198609 34352666 33197643 32673083 31890619 31269944 30316789 29398105 28768996
14189 28768996 27741063 27641985 26842405 26574543 25806696 25060770 24669142 23957498 23469568
14180 23469568 22787792 22691112 21906801 21568839 21170655 20608380 20284042 19988561 19371790
14171 19371790 19236730 18875618 18494609 17929007 17700403 17621661 17348776 16959975 16403431
14162 16403431 15946502 15645523 15383234 15375692 15046485 14768634 14478680 14251112 13727481 13807131
14152 13807131 13413540 13137676 12813217 12783388 12671665 12557425 12307372 11984457 11690768
14143 11690768 11349371 11321957 11305707 11227510 10945312 10852094 10516472 10259756 10216217 10288748
14133 10288748 10198349 9861662 9695736 9838937 9304346 9244799 9368584 9024231 9028665 8871568
14123 8871568 8598608 8645749 8411525 8495470 8469527 7882302 7727351 7915606 7547520 7853137
14113 7853137 7713021 7682180 7521457 7580058 7323008 7121266 7086881 7097872 6890408 7200256
14103 7200256 6633518 6600950 6536591 6207466 6111720 6574514 6352517 6167809 6589452 6048212
14093 6048212 5911300 5761472 5929650 5735852 5632127 5539913 5539867 5520276 5570072 5590307 5239037
14082 5239037 5389021 5290038 4855173 5188390 5158599 4992157 5123313 4946937 5082814 4939660
14072 4939660 5268126 4804541 4493939 4543444 4822584 4410376 4436214 4350686 4688727 4379210
14062 4379210 4397523 4245376 4278682 4417843 4340722 4383923 4210766 4213429 4037789 3837929
14052 3837929 3938700 3762029 3778525 3773024 3557309 3763437 3622775 3773048 3412958 3237476
14042 3237476 3485403 3475056 3423412 3339316 3854802 3471368 3275889 3264264 3898628 3482884
14032 3482884 3333474 3453269 3601323 3565344 3224499 3204579 2966244 3292868 2931606 3048826
14022 3048826 3010317 2877453 2755980 2728436 2961717 2572240 2534390 2372258 2479692 2556573
14012 2556573 2524081 2647472 2762040 2321021 2543350 2494156 2531947 2716046 2661358 2702769
14002 2702769 2471001 2265714 2522166 2242502 2493143 2274822 2232456 2590923 2110505 2142277
13992 2142277 2284393 2421228 2679215 3601445 5978229 11779083 26914565 49897958
13984 49897958 31330480 15866315 9318167 6440659 5001693 4371308 3915474 3862570
13976 3862570 3170870 3168257 3022755 2928976 2625715 2939016 2522938 2433172 2540866 2600282
13966 2600282 2861558 2568029 2171477 2417963 2312261 2497690 2292425 2311116 2195410 2062948
13956 2062948 2247848 2277542 1761543 2076758 2421829 2306048 2290539 1959865 2320115 2093381
13946 2093381 2008639 2193522 1954223 2157519 1913488 2111239 1991291 2134545 1811092 1656389
13936 1656389 1679905 2003414 1828779 1915776 1825812 1694749 1740792 1868663 1831029 1807917
13926 1807917 1722363 1762332 1702954 1300411 1643571 1579368 1898178 1496925 1569750 1617400
13916 1617400 1635297 1714877 1565793 1418638 1609042 1179168 1738993 1551507 1281645 1579390
13906 1579390 1328118 1407705 1803762 1462662 1507250 1290562 1355924 1597937 1701679 1382224
13896 1382224 1488190 1402660 1324127 1153387 1542462 1277525 1438513 1194376 1495338 753137
13886 753137 1148983 1493066 1520683 1577818 1613209 1562277 1147259 1076408 1340430 1064383
13876 1064383 1227389 1248886 1294427 1359356 1419129 1191212 1307235 1195516 1245075 1262386
13866 1262386 1258116 972711 1208549 1353193 1308632 1339522 1238822 977787 1378299 1329406
13856 1329406 1020338 696855 1050106 1157742 927378 1069111 1159003 934321 1304930 1097228
13846 1097228 1273916 922013 874817 831610 1272735 1092978 830537 997636 1023218 1194130
13836 1194130 1073922 1333004 1280110 1358362 611538 720255 994636 995667 1157198 778872
13826 778872 1039097 930132 1010629 1042293 849467 640156 1099631 895477 1127732 1097134
13816 1097134 1106811 661419 1184441 766861 854123 952908 794218 1030946 956497 617452
13806 617452 919614 822970 1057134 813896 742681 889017 973599 883823 789217 664271
13796 664271 839351 752876 820960 1121794 893999 596981 700561 551176 586311 581716
13786 581716 744981 991005 549606 459698 750760 983700 839924 868807 854265 550329
13776 550329 774275 715679 855545 517716 698282 751245 676423 806132 944814 616626
13766 616626 675400 379637 913466 686253 672172 452586 558276 727471 697672 583459
13756 583459 467489 635751 561870 697301 1081619 435571 596332 796297 700330 632759
13746 632759 565891 644699 530434 748801 953470 656804 309337 1181919 549921 744390
13736 744390 465413 665839 505411 601910 1053960 402218 578913 637947 875631 522081
13726 522081 425320 570994 554457 623632 1027295 684138 659966 657957 628294 950342 806881
13715 806881 744913 540236 671849 282519 647644 570649 544361 523163 782425 325492
13704 484757 736152 444651 661740 459742 702880 750123 555653 512959 550567 776024
13694 776024 515496 432406 472444 669382 474845 570426 407347 550910 296187 527155
13684 527155 456379 217953 257747 588313 709102 599766 713951 284342 715090 319622
13673 507401 352815 438733 232893 285372 347414 513255 561221 525543 424943 630032
13663 630032 312592 360055 658627 829843 479623 505036 520131 333839 328246 515366
13653 515366 527172 207728 506350 270703 371191 256066 530804 490288 655264 618544
13643 618544 356420 507091 381772 858128 756232 650466 387438 504546 402122 372419
13633 372419 864838 333765 690471 746711 468704 589987 287804 216406 615319 458399
13623 458399 169765 341590 343087 540910 241625 632274 690599 259296 607365 398961
13613 398961 73958 612200 354938 336298 382680 285327 447995 133057 101786 105729 19554
13601 249576 158273 402698 736966 422650 168002 246310 419763 582404 367104 349072
13591 349072 380296 296832 534816 180646 114389 317169 544211 345555 297619 440974
13581 440974 485926 354911 450423 41963 780255 293773 310815 274327 390147 169130
13570 288247 359650 157404 180539 487853 404266 376114 574500 391214 372922 513127
13560 513127 287401 326577 140315 217096 138140 356663 307171 -8220 115719 514107 327105
13549 327105 245337 222827 360763 261405 357897 475098 398660 84939 427293 470656 523829
13538 523829 456580 551955 359907 269403 402205 148482 389884 126722 102194 176699
13528 176699 162860 381174 174330 428068 414125 141472 332471 259796 166876 620485
13518 620485 330489 -67285 261255 76713 415972 331715 258264 544769 654546 15821
13507 409534 471380 344623 270356 209680 141019 391065 325011 232726 269786 66195 497759
13496 497759 722384 296807 283375 484918 101943 272303 69190 137600 265243 368936
13486 368936 662401 421875 280297 372364 427404 446944 287268 169685 403166 648072
13476 648072 283088 134582 400534 319711 348022 54932 132250 469301 577452 167978
13465 471148 536070 -137678 388982 318226 349699 306027 596508 610537 41699 625440 251411
13453 234585 368247 55079 471449 469147 326294 -7239 4818 88188 374452 144864 79607
13442 79607 -6586 273613 40247 546348 334568 29577 418381 288629 286979 -76312 406219
13430 203552 47287 -14733 386939 154140 124848 -15475 -444 191813 -56058 489878 393340
13419 393340 332503 91007 415625 54517 220214 68972 19219 97173 369706 246409 120842
13407 530616 -186994 190520 -55241 107041 73711 5339 129805 442516 266138 -58524
13396 17062 -6909 -85923 215404 106415 212835 146219 190122 485396 -119932 81691 -74196
13384 346480 315463 140562 274701 -76143 317729 450888 366605 329300 156202 252245
13374 252245 218595 126594 630888 161745 493381 140087 475835 334264 245764 51143
13363 505026 -111937 231337 158302 353968 -17515 329914 -14695 -23373 151681 337124
13353 337124 129144 94824 367441 171411 271500 116331 -34778 127610 330320 137240
13342 481603 460439 73409 251586 302044 378205 374684 80563 122946 191004 259668 120924
13330 -7549 461540 373597 138084 470662 -33407 301354 133403 254493 -97411 48546 265740
13319 265740 293346 195358 414675 238842 304808 -143376 168868 -201402 130479 254503
13309 254503 10046 324544 371879 217587 314030 130524 458026 206259 276191 -81394
13298 90624 357380 163443 -56826 43012 45175 297885 -117057 111466 232544 96212 294791
13287 294791 49639 280930 190511 -14701 -91687 231368 -65101 82922 -67323 341967 -16171
13275 -140578 83917 234343 154801 42847 -91375 -285612 28132 -119085 42277 403762 165931
13263 110024 -53005 378686 223766 440401 -273298 297351 87137 174570 -305491 -240204
13253 -240204 143660 152977 -10241 294535 -126673 109072 -100815 -184624 160293 -44120
13242 96540 167355 -4264 395934 323281 144195 348333 -57265 132139 349693 555676 263467
13230 93546 191258 192894 270457 219418 513571 251488 62681 66658 76581 35641 176858 294469
13218 294469 280524 137180 191950 182807 84097 -1675 -33742 237276 -164861 115416 155438
13207 155438 254441 156565 185435 158909 270902 -193911 381557 316061 440545 38962 197131
13196 197131 54272 -6869 119394 -301468 355122 -135642 -129980 119866 289786 -178134
13185 97637 -247364 437587 -200691 441143 254436 -153658 -193748 5719 250026 62370
13174 344864 219557 -37366 147282 362124 97499 173523 185227 344323 -6361 -15675 -146909
13163 -146909 73252 172340 51580 134903 63135 -16887 219117 45643 239348 31171 19062
13152 19062 243395 -136019 385995 64653 75053 -107579 24722 256014 -21127 32477 -194971
13140 146622 43946 243091 -133257 17079 174649 -109558 -110577 140314 -182302 143073
13129 -196525 108111 4231 126576 -41246 -8416 195198 368161 121664 38299 -35494 20753
13117 154350 94482 7553 206736 145328 -190428 45459 212674 -116083 22577 -139302 183474
13105 -201156 491059 -23134 423391 87928 -31164 30835 27886 355091 134020 -64793 58738
13093 -157799 275789 160368 -175085 -96049 -232944 207246 201354 395000 87684 65449
13083 65449 42010 -23446 119092 -78113 259966 172480 -42142 -13634 -181537 147703 98919
13072 98919 -199255 195461 208025 34045 326901 80598 191876 -42139 -31226 161945 16143
13060 -15701 248301 150496 76306 64070 65091 -208907 -90776 -129890 259326 -91101 -27145
13048 100016 73991 54827 221438 143231 284413 129146 117227 123616 99859 160404 19677
13036 -85753 240883 -159806 28027 437603 -5400 32015 53635 158168 -26196 197868 -34235
13024 72197 -52249 -227723 417700 166019 43003 274608 196488 104268 -61169 206096 409904
13013 409904 -128620 415410 163003 391709 99479 82096 199318 138064 -184495 204723
13002 176375 202682 -6010 65164 -79786 -205400 285407 10811 91457 -36352 170190 -7116
12990 266612 364906 9185 171612 -107779 203347 133595 -190218 293748 161270 -61750
12979 286872 220334 -133980 278807 62323 278681 152526 55206 -273004 29233 181332
12969 181332 -21464 -118249 -124929 -18578 193466 3145 152854 140909 -40682 134293 249874
12958 249874 209078 52531 -162530 -113183 259882 179069 8317 -64267 66575 52061 -232203
12946 -32559 -172950 40537 35544 -203035 -89871 155756 -77543 76590 76063 -74522 221562
12934 74135 -7847 -48273 170898 -49953 88686 411994 -143060 129466 -204245 -147451 100597
12922 126897 -123930 76491 -26033 42534 258639 -167749 12452 99309 -183350 13516 -67929
12910 141166 -80100 118628 131488 44063 105213 -191580 76888 -390394 290080 17399 -18746
12898 -313015 -17671 207017 9354 -112770 126717 -18376 53743 254992 208085 -47597 344427
12886 93788 -176048 -337211 -77475 27558 296741 120164 308392 253687 91046 4006 200080
12875 200080 226970 108527 21802 388174 -21556 174385 -57925 -89567 -152714 34013 203093
12864 203093 -65943 -51661 55458 33795 84171 323419 -127808 205696 270626 -89708 97322
12852 19990 -139315 170761 269537 276347 -159845 127793 -363103 -188561 173368 108916
12842 108916 19766 363816 -81776 -34291 36644 -164509 -10003 -45537 -150394 -33958 137318
12830 123977 171737 109062 45128 27911 -34038 44978 -244866 241266 52212 151953 32673
12818 302926 277145 52846 70232 257076 -31479 260681 -377357 416181 -40351 184500
12807 -35759 -92837 -37211 -233682 28374 101454 159226 -58319 36988 613657 -148272 -41552
12795 -246522 -5545 147826 -235507 -57388 -161298 160954 -54105 -153674 97570 -10235 -11413
12784 -11413 -241325 -91827 -14728 193773 85711 90911 93461 52020 102714 -70860 -187136
12773 -187136 135363 99712 -13552 -80892 68745 54179 -353404 -8172 -62804 -209238 311330
12761 87402 236531 -4960 -235843 -36175 148782 178017 -35699 367867 -165968 8065 22606
12750 22606 102098 219374 -113991 14137 422096 66602 -128719 124941 33637 302155
12740 302155 312570 -34650 255187 198761 116155 -190403 -128147 186550 -18994 182553 65499
12728 -45289 333215 -210451 19139 133099 -75190 -109360 88566 -63645 130950 -285864 -168307
12717 -168307 -39398 169998 -105580 -107680 47764 -8189 235476 356583 331574 329051 488486
12706 488486 170306 118887 269810 -90784 433567 1510 -1645 -3644 90805 -81609 231406
12694 308993 176390 217688 -210706 220360 -97639 -37775 60385 -113004 125963 45956
12683 -206021 39903 50053 314124 178735 -135292 25234 268759 103274 276816 -39371
12672 126341 162850 -261327 115504 -165412 12397 72087 169424 195687 193451 -12316 238894
12660 -151767 -14736 -7951 -22381 -242770 163768 -193190 272193 13230 -97363 -43497 85544
12648 219825 32746 174449 75872 382496 -32584 -52498 125463 242970 45140 -384766
12637 115862 -125026 -53533 42439 -72457 19505 -8826 394453 114760 38164 354412 164402
12625 166618 163097 159803 253147 339518 272563 223936 62295 470426 121133 32969 45964
12614 45964 152703 86725 147350 129873 -471155 -227336 217451 -75473 15371 128251 261484
12603 261484 -45759 69753 -142102 56710 136054 49689 40305 247799 224520 -177339 316191
12591 124118 152542 203225 -83803 -187345 142859 143090 133745 83286 -85574 -86848 -46671 122039
12578 63242 43509 -266393 -260608 -240823 -11398 359077 -55209 54505 -120878 218467 -124870
12566 49829 -91360 -99768 191126 27609 -415593 -319602 98091 -166355 332381 175400 28751
12554 400563 123840 -66943 291445 138036 172795 -292826 95101 74984 -270605 17776
12543 92574 122383 54893 -118421 -275966 -122617 -176790 -29337 290686 203179 -38922 137765
12531 135632 41217 -28139 -99060 166237 -83217 -31481 -121834 54194 310574 10126 -120827
12519 99860 3277 -114357 237134 -198584 18087 126868 -367948 -354894 142511 -49393 138306
12507 -96035 -76139 -15734 -148541 406188 388754 -89883 -225864 -46152 309569 128953 49524
12495 251589 216391 90697 68275 294519 189179 -24134 58826 -47777 -51510 23035 -1107
12483 -146842 237497 -116380 99901 -250032 -342835 -259206 -136971 -39525 104381 -188373
12472 163332 17824 89898 -210316 -172509 72971 -77588 -104180 -42247 142319 -88268 -187709
12461 -187709 150747 -96741 -30178 -379747 -141294 77052 168139 8021 346582 116483 215369
12450 215369 -81397 -85995 85461 149481 110156 -66677 104162 367481 -78851 204363 -161006
12438 121889 -108405 109560 -29172 -62162 -60094 -156525 -208995 174850 72925 -135416 156570
12426 71112 36358 -69823 -140396 282216 69355 -77766 116201 -82347 41357 -360606 -263664
12415 -263664 121839 -111804 3141 -62916 -67604 -67201 -254810 -431964 257730 131702 -175473
12403 -41469 -93179 118386 -446564 174950 12102 153514 -56825 154023 -32313 138306
12392 -92411 -482191 -68722 266477 -164033 -324117 -14331 182683 177220 -89241 -159248 -31493
12380 30797 260255 219436 -138061 24958 -42204 194910 -174307 -58435 55851 43442 88803
12369 88803 16922 -92527 59185 -63892 -7148 -251514 -315608 -53962 -89479 277247 542493
12358 542493 -13470 -106521 164319 -101622 -266530 355225 -197936 -199956 151416 -118019
12347 -179725 -40246 251730 165145 168630 41820 107258 -106174 -264416 317552 176759 -219469
12335 339035 -293311 7537 -147598 -355792 192470 143922 134753 -103345 82147 330229 3212
12323 147658 73431 158438 40710 99640 110825 46239 296808 13967 120144 -79873 59327
12311 -45222 -72199 109268 -178367 15665 -189054 -7934 57404 139134 199235 29609 -331477
12299 144383 3777 -14148 -134067 -39583 114415 140989 234645 -108834 13187 -9842 -139668
12288 -139668 -31046 82771 136052 64080 229138 43273 184056 18998 141468 31441 140319
12277 140319 83240 260883 75280 133544 221338 210617 -109066 309289 68291 100434 87409
12266 87409 146747 318161 14216 124254 -61453 304282 95498 -79860 74102 106641 49125
12254 -245854 -11786 364468 192320 94730 297695 235002 170 58498 99244 80261 74388
12243 74388 135141 45934 89258 192514 131105 113715 74822 -159360 -194391 15634 342711
12232 342711 13488 41340 453204 -194529 231844 143409 69068 380243 244472 264236
12222 264236 47018 18791 153192 375966 161420 124949 161186 102352 160882 -251038 217823
12210 209935 225534 -231125 263265 -33692 31217 -219298 133672 112239 105213 -9162 358028
12198 -5416 169756 169067 297641 465097 255520 494550 191588 227005 285573 42347 187513
12187 187513 296465 148131 168368 -72290 -113222 410502 72080 -172159 78087 350453
12177 350453 70699 -157830 126880 54984 60493 209883 36004 168461 149725 242299 -104672
12165 -101119 28748 151712 19869 118714 285697 -106643 61959 96120 135571 -25427 -267925
12154 -267925 91919 320133 -20828 40620 -170 4516 77982 391925 -200673 100955 193792
12143 193792 100012 -178448 -63264 44871 -393640 225827 138866 -115078 360900 141010
12132 -130851 -137375 -270307 48045 -243945 -1835 222047 247996 116424 158047 -133450 -120589
12121 -120589 162156 313183 383485 -230331 172017 358229 -125562 34426 57477 229331
12111 229331 -69383 -185037 193222 -108633 374653 120691 -18288 117760 72413 -120929
12100 -64107 294164 69056 -63555 25376 -177351 131505 -57511 -106837 -214 -459884 159303
12088 163176 89287 -81794 -252783 254685 -89805 376274 94358 -149864 -286154 273039
12077 73693 -26301 49701 -46128 116352 220718 -4918 250747 1306722 2228314 907394
12066 469187 -7290 293212 -63981 240613 -69276 -25892 25877 410192 -86370 219041 83577
12054 314206 -84078 -31219 294315 -15878 328890 -238249 -332023 -200611 44802 100565 -198651
12042 331468 249906 44886 -163446 -47614 176865 -219490 97737 -196087 -25120 -78629 -31848
12030 -80600 -233233 -301809 9741 -26430 29387 -25144 89821 -287660 130020 99988 -87637
12018 40888 -221490 -66614 212588 61206 -133939 -295031 23195 84117 132192 83866 -56168
12006 -175643 43192 -125879 6304 -89348 -106566 7632 -94995 -315187 -55091 -383627 -60399
11994 -247787 196919 17891 62655 -50482 -359786 177444 220679 -386504 -226400 51945
11983 -85807 186444 60736 -68968 -62412 -29504 156739 28950 -164493 -244755 -175803 -52836
11971 112067 8826 -95083 122259 3445 78117 168317 60617 -89892 -54694 263286 -276582
11959 -11376 -163 -5116 -109068 -121510 249864 108885 1541 118913 -127490 143321 64705
11947 -90155 37140 321868 -28851 -194886 1518 250576 -329079 -19317 287721 -127243 -14884
11935 -2016 436616 12387 123465 -141014 -7335 -73921 148933 -47945 10486 471434 -165186
11923 193585 256329 -403017 -141348 -181597 -225532 51574 139384 -84456 -172186 48849 -118675
11911 -108094 68458 -347416 -138251 -213129 46762 15410 177501 92143 -207559 -168875 226857
11899 41924 -65327 24368 196097 85188 -321343 -110764 114440 67865 -104468 169568
11888 -114514 -38439 -63208 -33659 -135223 -86603 145001 -3336 -49854 -19413 216976 60076
11876 104763 -280901 154989 -51843 41166 89735 156481 -170925 -164049 -147255 79969 -184972
11864 112979 -236740 -260586 -244103 201105 -169261 -56906 -96346 -39747 -8878 -219090 69561
11852 -190652 266805 -247484 -57837 -109899 -1430 -478915 -43368 87780 21111 323272 -215508
11840 72064 350130 128671 75858 69465 -352954 103823 -319246 204289 -143615 -6222 141191
11828 -317225 -48315 -58469 284300 -25225 -16764 -1509 139676 3773 -180218 86987 93307 -227930
11815 180817 -148495 24376 225868 272958 -31281 -50347 14741 40283 236020 -84182 267364
11803 -184781 -178937 84062 54856 -4845 -44007 -213702 -84784 -277125 -81431 -1566 -114819
11792 -114819 208384 -328352 -327542 62528 141424 -219714 154787 171995 -18103 -248838 -88825
11780 331153 58164 105856 -40002 -3042 20642 -194805 -52199 274963 26633 35536 21961
11769 21961 211018 -8016 -62068 5874 -233047 -39761 -122857 -214384 10698 39649 1584 49855
11757 49855 318916 -257538 -46493 -432302 32093 107139 -139094 175847 42948 164 -88428
11745 -180387 75356 -196 -301297 96665 -53250 -210229 32641 -227539 152519 -33495 -189635
11734 -189635 258060 -56672 151892 327708 76326 -111915 28233 -127694 17037 -217137
11723 12795 20856 -46575 122071 60637 40129 269060 -48032 -266923 -222974 43462 -177073
11711 126448 388085 -196020 2405 129144 10210 -75727 -136406 -54605 -159105 79973 474056
11700 474056 8343 -78652 154739 147877 69051 -143969 -73791 -237354 77794 34588 -269335
11688 377970 242599 23833 -180856 -163989 202358 -175693 59805 272262 252977 288868
11678 288868 282649 -76576 171737 -80803 140903 -58090 206327 -77369 -86609 -172214 89776
11666 300728 21177 -102892 -70545 86643 74831 99881 145253 -348056 -213680 -156571 486828
11654 -85073 70959 72208 147530 15250 1226 107032 -153962 204544 116923 -309792 67039
11642 -55546 -105024 -258188 208184 -221244 250356 -329211 -199174 613875 -386055 164110
11631 -2458 -60788 49286 74892 235361 -74434 119644 127741 93023 357577 -185183 96446
11619 137389 35410 117877 4687 186930 -183734 29042 -8921 -171768 -252370 -183535 183815
11607 -19382 310976 -269901 106639 -92512 62397 180252 97467 -11922 -100602 -49988 -199272
11596 -199272 70502 121862 57191 81413 33198 -15357 191450 16794 135509 218256 181131
11585 181131 -56732 -82273 449967 55616 366264 143572 -53722 -77157 -143009 -25866 166952
11573 -53201 111121 -218073 5908 84390 -17124 -52999 208545 -155384 93554 36511 101312
11562 101312 104887 -25198 85028 -133464 -82378 151983 290443 -15507 -81555 42297 74401
11551 74401 -180791 61270 449167 -209880 333091 -112562 314875 -94475 -187246 581895
11540 -166056 -216328 357093 50913 -116700 6549 230737 239054 -506239 124348 194108 230962
11529 230962 322471 452447 237366 153498 55819 100487 177505 32281 104726 -117153 -64599
11518 -64599 -58510 95457 315816 394402 101199 -57060 97224 49231 127570 85163 293264
11507 293264 81177 -32706 363688 294823 319419 -339497 350096 -55339 102283 199739 279807
11496 279807 -14925 -43363 -77551 327893 -192619 288338 135107 52356 243239 461076
11486 461076 288361 25229 -59878 164878 319764 137257 220607 155305 213896 10738 464894
11475 464894 -47377 -114234 73454 206921 249161 -141500 329535 -229732 -109359 111002
11464 235781 118158 -71810 94038 -85655 242219 286464 134426 71054 69040 -193662 245840
11452 -73161 314742 76799 284652 132213 -38494 152572 132747 -97576 172820 159321 61197
11440 -59865 137356 143155 90033 100643 244634 -53671 52265 114580 -159503 7711 -59925
11428 -95684 -201964 -37275 22159 -188245 31640 262755 -76350 -82758 -258891 -222429 542
11416 -207607 198697 -94310 -32687 73220 2093 280316 -62615 -57164 259314 67130 86824
11405 86824 34915 47875 -36123 -31407 -366159 39862 119733 70735 -59672 -10770 97664 -128597
11392 185481 -138535 9488 -94394 -101470 -8302 -152044 -245605 -76201 -99560 -131841 -232390
11381 -232390 390296 -97225 380868 -138515 32435 -136127 -9064 -165810 224121 291705
11371 291705 260730 58457 76487 -1220 -176353 -299387 -124180 113211 124778 12888 198513
11360 198513 261819 -186873 -141659 40981 253903 -25082 -5485 435331 4232 -252996 59222
11348 -5439 70877 -49016 57113 266970 -34676 162166 84761 -64722 -269672 192678 -131281
11336 -40680 101345 60995 97441 -203868 -29665 -149703 -250488 112549 82207 -43810 153405
11324 -21576 334654 75581 178717 19276 153808 59435 -138600 91009 196243 242589 226418
11313 226418 -36857 43384 -285806 121974 357990 -196653 -3772 216571 209324 73276 195380
11302 195380 288409 -67026 -233328 5697 -316114 -330427 -267861 232794 -137961 152272 236198
11291 236198 257785 -137133 140962 -86058 -81203 2556 -203977 -300926 218560 -10156 -10035
11280 -10035 -86062 182487 -89343 -78063 106087 117743 -91308 18928 -25392 -136739 -18605
11268 -147762 -247288 -250375 -146043 36987 -205739 -63085 148704 -47969 351609 110896 211407
11257 211407 -380268 227794 128697 135795 201233 146537 2494 -184558 40462 154103 11649
11245 51890 306441 -21371 -32129 -12401 -179280 -145403 -70628 -127795 -52477 -86817 93226
11233 108292 -421379 45940 -138865 -152931 -267894 -265716 -302324 107355 -159169 -57251 -78871
11222 -78871 -37716 2297 27490 -215401 -306591 47942 50914 -167384 18881 224383 -119653
11210 126050 -227447 55746 -267436 -270586 -23997 60411 68743 186411 -16352 51124 -201725
11198 -46785 190153 -77393 273974 231965 52727 48364 386826 4014 62151 90513 13356
11186 -57668 307035 -23858 179009 -21608 172109 -25523 -92007 261131 89727 -69406 31746
11174 -42837 10265 212482 120025 147393 -347895 -220989 -300626 -52617 -449677 167680 -48537
11162 -78523 -53602 -361573 107911 105312 72719 222808 82124 -197435 221157 -196410 -6626
11150 -264925 -22538 18507 -105674 -150382 231356 -321757 -10983 -154144 -86135 223909
11139 -92576 -69443 -161310 152509 179681 120257 257750 308178 35716 191681 -97908 25708
11127 222304 259634 -87233 138807 155920 93005 -49855 133020 -144811 -108939 146248 -5877
11115 59 153750 -41065 -57098 188399 453819 49640 76426 265723 -158847 372912 182931
11103 102985 93209 397771 137959 218403 244873 112096 179234 130722 26058 251237 108501
11091 306671 8156 113231 82351 299614 -172729 223489 198005 -80321 52085 138916 133465
11080 133465 8651 143541 325444 231241 455303 291141 445290 73548 -116217 283396
11069 456192 212192 404172 503625 544684 314401 461891 237532 209957 511580 273476
11059 273476 584847 549783 567644 479460 616827 712248 841185 728495 687707 552274
11049 552274 603312 952873 807044 518155 763782 735462 1032205 986744 787846 1179908
11039 1179908 849764 882191 819033 491835 583948 795519 824019 881816 474413 878226
11029 878226 773218 837709 1026303 790778 545574 988107 843550 465959 731035 861798
11019 861798 868913 743592 664524 636270 932061 452545 536903 723608 699196 465850 706532
11008 706532 594701 901755 844014 821828 772650 394881 602222 798363 699370 697157 904574
10997 904574 607667 779018 892365 397647 728035 971295 895162 672134 1056923 878032
10987 878032 962540 1045495 1205423 1023211 1412442 1098717 1296486 1434811 1609219 1509225
10977 1509225 2100896 1949531 2715496 2676565 2566285 3277748 3059312 3029613 2801778 3042923
10967 3042923 2326414 1891741 2108576 1644518 1921772 1643671 1852423 1881345 1855918 2032373
10957 2032373 1744942 1557230 1634453 1228621 900004 1006932 770409 751066 922092 286724
10946 428711 773570 273014 377603 373615 345881 492223 -80775 56425 131970 -280143 53019
10934 -21208 186304 92230 50914 -35108 145144 150532 -37054 -37889 -185374 -194121 -86752 -344831
10922 -344831 32332 193183 -18220 20354 168990 133634 62930 -205931 -194157 -155963 -458570
10911 -458570 -19782 119692 -367099 -176344 210984 -39548 62482 214798 -178253 256593
10900 59155 120481 -265457 -421791 -1562 -218609 124863 19931 64355 44662 68274 17537
10888 120684 -18519 -63329 -21231 64914 -166916 -128231 256903 -3897 -34805 85532 83197
10877 83197 60328 144702 -187822 -192230 52633 -73926 -119862 -131513 146042 218778 171731
10866 171731 -264642 110954 -192772 153259 -37605 94980 -335828 -32538 -55985 149402
10855 180853 285814 27955 337060 98358 244288 -236843 92434 108401 218625 -19256
10844 293545 -149946 -1132 -80815 -118948 -131218 310744 -83743 -69224 129038 142769 183701
10833 183701 -52246 -356989 -48939 -10891 -34617 -48546 -36431 -21743 -45056 -48779 52410
10821 74385 -106505 -7828 1322 -273484 194104 -143167 118278 -209256 -295033 -100817 50599
10809 462095 -36236 -109696 -109015 -313612 154374 -186226 120783 43762 71170 -189702 -173771
10798 -173771 137187 57700 -14321 226278 -81105 159831 30756 -155335 -142524 79278 119095
10787 119095 61510 59071 -98029 -352431 -119863 -84024 -8558 -33260 119800 -118805 -157341
10776 -157341 122303 129608 -89105 -93457 -2470 -94041 157967 156738 -238894 39303 -110343
10764 -214397 -85571 36501 -41532 -59042 253035 77413 -161258 -389913 34776 -159282 -70621
10752 -173202 -63463 -367535 -484232 121054 123690 -384642 -86763 -692 315617 -246504 46978
10740 279511 -130387 105994 -67508 -13581 100830 185245 -254074 170517 -359493 190218
10729 -293909 42625 -163782 -84159 -282831 -14191 812 -110385 -7416 45444 -174524 -24279
10717 -90312 -415004 -147135 -97402 -358688 -119752 -109965 15859 6405 -99314 45997 -146443
10705 -76272 -303932 -335166 -305475 128478 -117213 -225329 229686 15233 154481 130577
10695 130577 -188775 -159235 -469255 -329181 145824 -102948 -372664 119127 86442 -73707
10684 -125551 -80917 -320117 -184362 -110125 220486 -98908 70793 13710 -105793 -125898 -302248
10673 -302248 -179533 15140 -64587 353608 94344 -92109 -31502 -67843 129931 -71974 -199783
10662 -199783 185398 5705 -277191 237867 202888 -62168 1983 -221340 -110690 -97544 -30981
10650 -206071 -225792 10239 -94392 215599 -114019 -2262 -6275 63978 283621 -238324 -63984
10638 234239 -170395 180058 -232076 -287502 -96039 113181 288409 112986 -292486 -90852
10627 50804 -183092 -226644 -197421 -179138 -282420 57120 -146955 444617 -283891 -156058
10617 -156058 81978 -364201 -1955 -236455 48391 -38471 209458 142805 -74724 30224 -52715
10605 -90660 -158840 -187522 -244649 -230189 -186921 140762 66999 -131533 274986 -142941 122289
10593 -333839 13971 130469 -124634 -211029 -44989 23352 321616 32261 -315132 91526 45507
10581 301424 189866 209135 38931 -7184 4342 81230 -443185 -281414 75277 -14641 -221599
10570 -221599 78958 -108629 -94849 1201 104706 85024 -189628 -114628 21893 131910 -263296
10558 -39690 -65996 -345106 -220822 119624 -260152 -426242 -38978 164513 -87104 11016
10547 -69476 -83931 -22995 -30692 39162 76382 44597 -168996 140546 -80255 83887 -289222
10535 -475272 -317150 -359867 159128 357127 93637 -331694 37102 -20174 -162801 -31454
10524 127404 99906 347887 113874 4796 -75212 127316 52395 -313197 95723 -65046 -173572
10513 -173572 124442 -56782 230538 -300863 -86212 -131640 -428426 -18786 -168668 79642
10502 47544 -126965 -209427 -158163 -67808 -182629 -27307 -90412 -38578 -125642 -113325 -279668
10491 -279668 -146190 255719 -186618 238470 -167592 -5000 66104 -2663 367935 108522
10480 424046 470104 140278 -103812 26965 -121219 90770 39412 -120520 26132 -321975
10469 -97155 34705 -103997 240316 300651 141363 -127257 -64144 -168822 -276277 -100561
10458 -195900 -391389 -208142 -195289 -37892 79222 46442 289045 -112240 -303945 -74496
10447 -102876 65794 -40460 -208729 94922 54757 -127147 31102 207499 56765 -96214 -46203
10435 -176912 227725 -305051 -83756 -50176 -121993 201241 85984 5271 14632 -166280 -38240
10423 -147781 156798 -227084 44524 -36941 52496 -128074 305391 -225156 -258068 -37093
10412 28407 -150882 -219151 157995 363178 -36383 68816 -136448 104020 107516 33022 65722
10401 65722 41195 8534 -22284 -148477 -14558 170522 21235 284865 159457 147418 -12306
10389 69616 316466 49900 255888 41450 -46141 29012 328586 350853 187836 -86885 -75296
10378 -75296 194946 169441 170025 392967 116023 430943 459886 206598 -5641 552507 438103
10367 438103 428734 492729 361701 228038 506641 363090 122966 450309 41788 319455
10357 319455 283674 34319 215180 430325 151547 547104 813335 471360 529936 323862
10347 323862 360512 480183 334388 468079 438789 217322 185232 443691 149079 217699
10337 217699 148494 148257 -175060 -30274 -18517 147241 -747 20693 -35533 245300 130249
10326 130249 74402 264313 97872 307823 45287 139738 252864 179205 -192182 116050
10315 136273 55927 149030 238018 54696 88828 -38860 16595 106690 -70035 278342 -214641
10303 33848 -102926 306442 -63116 135624 -128428 178413 25711 29088 75639 -349426 -48015
10291 -52616 -16603 -152044 -221701 61131 313943 27928 156981 -86047 -6104 -241111 -172307
10280 -172307 62059 -106422 -23754 74718 -184555 51463 -52887 139977 170316 73658 53468
10269 53468 41789 -27705 -29439 230401 253847 119644 117500 286207 360229 678158 595656
10258 595656 329515 439376 551516 -246004 269254 -105018 24088 -48955 -110277 -198614
10248 -198614 33357 199 319788 248771 143142 -312483 -241105 102153 -183187 120174 -66241
10236 183168 30909 -169366 151111 -50851 -66484 -146041 -78863 241777 150078 18741 15477
10225 15477 -10397 86575 219761 -44519 -164165 250152 -115044 -191126 -108507 230956 -68477
10213 426907 84464 -160535 -122731 -212063 -112544 9205 -442919 -204793 14159 58042 -259026
10201 14675 -217805 162021 -196713 379179 -232048 18279 146489 56798 95706 19424
10190 -117742 -246521 8925 -191095 244065 112708 13261 -69165 -323801 38389 369924
10180 369924 -78782 -596157 -292271 -213463 -187281 61754 -303172 -22604 -132890 -31209 -162592
10169 -162592 166964 -187192 46530 -84211 96390 -246744 -32191 -20574 -91954 164886 -183296
10157 14016 -183189 -159848 -28225 162148 -300987 27204 -83825 -264728 -206096 21922 -105851
10145 22199 14685 -226826 -260022 26047 -258903 -192727 -234754 -66433 -203849 -248515 -179529
10134 -179529 -54948 -72368 -136647 114906 -318458 -166440 36839 -29401 157704 -117024
10123 57381 -45448 125690 -131076 -181347 -53879 71384 -245313 -153185 -107109 227905 66645
10111 -42570 -101915 156261 -74181 67775 302156 -155887 222109 86575 -35183 98723 -141312
10099 -105901 -89839 -205413 -199887 -87701 5433 -223125 -105080 -292218 213158 119399 -131005
10087 -105310 111373 287120 -93787 -212488 -291876 46031 -107248 -91974 197291 61908
10076 -597849 -64277 77749 -84688 -152422 -16422 8189 82969 -462454 -37338 -149928 -66053
10064 30131 66082 -132884 -260569 -133835 -33415 -180683 -180678 373107 -150355 -7280 146292
10052 36635 171300 -87425 -69258 -146510 -467882 -176274 -67238 -211420 -129647 40615 190878
10041 190878 -227479 13832 69601 124047 -233088 -98149 252068 -269842 93130 -251107
10030 -87675 195514 -210352 -52331 24796 -238433 -185173 64682 137591 83967 139525 -25830
10018 -124934 -23272 102641 -175197 -96974 -113576 -37313 -341377 28198 115998 138824 172060
10007 172060 -417338 11179 -48189 -299834 -154500 -37864 9246 -167394 -144558 -114169 40870
9995 224398 28732 -17328 149234 -85454 -208130 225339 -157667 -408820 316956 128636
9984 -153443 10603 -25060 13388 -193540 -290071 -187764 -305353 83573 -356505 37602 -167356
9972 -64759 16973 -231596 -46043 124502 7013 -27386 -183714 79029 -386878 -296275 -96132
9960 -186074 33242 62190 -120751 94418 56145 174451 -181277 -250892 -332463 162697 32971
9948 -10144 43486 -89040 56557 -105965 -139429 -225646 -135626 -164409 31575 -508018 -188724
9936 -161171 -38765 504 171128 1441 -7279 -113213 -290261 64569 -32329 -138547 57051 165284
9924 165284 -108005 -119254 -256129 -62407 273853 -164322 -422550 -226792 -52091 53465
9913 -159440 -28193 21394 -383715 -46486 -15078 -112605 -106989 -57631 -153392 -302533 -196270
9902 -196270 -133996 295518 -252651 34808 -183453 80320 104729 -385864 -142358 -178310 29749
9890 -47985 -70511 -15582 40590 -290005 5670 -128688 -185724 -12688 -73426 70628 -98075 46045
9877 1582 -1943 -43475 28975 -266608 59316 140303 -142876 -104952 -211287 104777 330382
9866 330382 110000 123631 85101 193086 -259520 -139631 -203774 -51663 -323209 111714
9855 264148 100693 -283084 130552 303809 -251153 -103558 286866 -67477 -35159 72291
9844 -177303 -44043 -228566 -179674 12403 26402 -100976 232720 209028 66654 22869 -326449
9832 -28112 146670 -72877 -166134 134389 28820 -84818 33494 118412 17110 -99186 64520
9820 -113154 -134328 -463724 177080 -60839 -95118 4530 -149926 222932 -349150 9212 -295499
9808 104163 1031 -25807 -24836 -400626 -250443 -107372 -29191 -60114 -287507 102124 69985
9797 69985 195338 131686 -17156 -228895 203520 -272853 -7423 -83773 -203962 51998 -92293
9785 114245 -136573 -208730 70936 147606 -149849 -167474 43313 154267 -165672 -165050 -81072
9773 -142421 -196545 139812 -127763 -184165 -104246 -137244 62406 -77502 -235835 -220712 -102074
9761 -200597 -140792 -263288 -60742 -228889 218396 166532 -324729 -27973 -180172 -295361
9751 -295361 224857 11120 63141 -118249 -99541 -93974 -195410 -24935 -3160 60629 81418
9740 81418 -94972 -277267 -222691 -199636 -52592 91224 91842 -145887 256827 -205449 -115358
9729 -115358 14644 -576352 -52115 52364 136254 25265 69508 58398 -24113 -134270 -8351
9717 64665 -475765 97714 -436084 215954 -288052 -158268 -93885 -292375 -310969 -63521 -436941
9706 -436941 120215 105454 106074 -98635 141298 -57144 -173388 -470982 -46484 -204983 -33827
9694 -177031 -135020 33300 -133381 43973 -272087 -123048 -136462 -107052 -39508 -111610 -101494
9683 -101494 -5016 -143348 -198919 -52443 -167082 8677 -19438 -205974 -335687 -37097 -142076
9672 -142076 93182 -366766 -322527 -297731 -51127 19124 -112043 25787 -261092 283091 -37970
9660 -279500 -211461 -30118 92534 -94006 175164 -7371 -284902 -127115 47637 -106784 179935
9648 -2843 -67887 -84995 122761 -178430 -293963 236045 -346916 168684 -80121 -108787 -79659
9637 -79659 42488 -87889 -14932 13249 147989 -10346 -28726 50709 132076 -252138 -48090
9625 -15231 -193251 -206094 -560141 -27631 111385 269250 207852 7530 56199 68202 -329300
9613 -183575 6198 105301 -93426 215863 61677 -169119 42320 -65433 58030 -10189 -80889
9602 -80889 190449 -119459 106765 188976 -140391 -321423 -178682 -272492 -214667 -64969 -73837
9591 -73837 -49104 -183284 197311 -165577 3223 -52623 -348947 24298 -27408 86165 35048
9579 17078 -176173 56032 81668 90664 45501 -6590 -87793 24172 -292352 5832 -177407 -78812
9566 100791 239003 35420 -25846 47824 -196272 -47158 72889 -98744 -17883 -360695 11831
9554 55569 -345066 155637 -282065 -157739 89829 25728 373122 -39964 -73098 -74562 -23063
9542 115400 -134540 339482 221961 -308077 -198664 153106 -151137 -89990 58773 27101
9531 -399385 -316212 -117132 186566 394608 82816 -44801 -77075 57383 -102067 43668 6514
9519 -237837 -60255 16625 -119210 -253806 37968 191916 222852 45830 -255046 114366 133657
9508 133657 -215947 -238580 207950 -95842 -16521 -402727 216151 -114971 -222958 -134030
9498 -134030 42607 -17492 -169734 -44500 -67713 -363562 -174673 -336426 -95130 46781 20984
9486 116751 363551 -91194 111684 -154083 -135685 221620 -231492 102594 -111070 -386595
9476 -386595 -78248 48441 -249150 109046 -51037 58205 -361363 179720 -197688 78999 -119641
9464 164844 -325299 453686 84675 91948 -90553 -192507 114807 -105008 -287387 12343 -137995
9452 -288445 -198500 -176569 13437 94908 -164408 -127973 56397 2055 -5033 211154 -153451
9440 128494 94936 -181730 40421 -392780 111271 -267681 -123784 75622 -238679 -491013
9430 -491013 -195549 -360796 -47028 -419909 12031 -50736 -125429 -62402 47664 -149913 -227767
9419 -227767 -260186 -601466 -232619 -53329 -52742 -481432 -517040 -142983 -8184 -32847 -20819
9408 -20819 -95896 -215695 130248 95066 -50945 -187823 -238350 35275 -42560 194416 -106945
9396 -103940 -67555 -101879 32602 296702 -147563 -378410 -363419 348300 -332831 -238657 224364
9384 -324484 110581 -93595 21838 -103448 -206934 -477316 114309 -76665 286076 -496567
9373 21562 46560 -105084 -554256 -251680 -461477 -187488 37508 342498 -300087 5576 170369
9362 170369 -164604 243157 -55821 30406 -28106 -92489 69085 218077 -401501 -26731 -17883
9351 -17883 -197809 -225307 -25982 -108682 -222909 63728 50921 26752 158276 -55433 -37739
9340 -37739 -358772 -103920 -153717 4770 195095 13470 -34904 -71391 -44853 -142170 -258758
9329 -258758 22103 -29939 148820 185732 -189902 67280 -532 -334251 195204 -109139 -395123
9318 -395123 -129455 -1052 -345586 87688 301205 -143836 -89471 -7847 84461 -8944 125404
9306 -214573 233401 -288889 114419 -55420 -24209 241585 218913 -326606 -37257 -89109 -214597
9295 -214597 49192 -164490 272817 -45277 217902 -200471 285577 283828 107394 -208029
9284 2591 -142489 -74595 -13943 -212893 127727 135054 5762 277875 -70586 98691 -52310 -553434
9272 -553434 -91028 -133507 -35728 -254663 -177765 -177915 -271453 -85690 16059 274253 -310102
9260 -158175 5026 -82460 6930 -187345 -68184 263178 -67910 113007 -164705 173498 75953
9248 -137919 159579 6495 223710 49462 -112710 390635 651004 102263 -4851 119736 -275738
9236 52717 -56549 109317 -21972 -224811 -17762 44716 -38344 -58886 -121191 -275516 47786
9224 12937 -142636 35291 3581 -57146 -229320 -64835 -127893 -221269 -45192 -43924 48745 -359821
9211 -296891 19583 -72090 -31650 -102062 -44957 -135075 317336 -6581 136921 -33256 -204730
9200 -204730 -186432 -35681 -45755 -30485 76937 -259807 -168667 -341893 382779 -292861 -251319
9189 -251319 -143725 -186910 -95069 4256 41809 475797 181125 -178735 187256 -247287 -19323
9177 -230247 -11707 88720 -63477 -222329 58929 -66057 -215075 -130280 -29725 -50638 -33350
9166 -33350 -13240 42766 -153556 72000 -122263 47739 -245260 -179098 91768 -140535 245128
9154 -27590 212188 -47123 11628 -3879 -179458 -142783 -99801 -6718 -334224 -123081 -34406
9142 -24195 -144668 -43841 -259808 -110878 19225 -225006 -378775 -136893 7766 -154157 -75235
9130 -48607 77083 -126085 199961 46001 -15470 50991 -501489 46835 -28968 -28846 24362 46726
9118 46726 155022 -17338 -219557 63290 -400826 7174 -270229 -19539 -30215 62424 -79339
9106 54627 -329357 169272 -243748 -344327 7166 -126615 -126773 -300422 -51005 23350 129417
9095 129417 -131019 42294 -26056 -182096 -326324 -178420 -383008 -114333 136696 174689
9085 174689 -102831 -271251 53143 -21210 -131695 -168656 1598 24834 126181 -20074 -217813
9074 -217813 196013 160608 -290569 234565 -90877 -27386 111183 -60927 7234 128388 147311
9063 147311 3493 -430425 170289 -256987 52431 -18949 -329092 -49582 118310 -175540 -186882
9052 -186882 -241659 8941 130470 219036 20131 217505 176227 -108884 92369 -119457 294056
9040 -135364 215410 60529 -359272 -328262 675 62500 -240400 -173299 -269073 -109165 148564
9028 -396364 -250793 -189958 -19501 -147018 54494 73658 -306671 -11378 246525 -269543 -71745
9016 214770 -141436 -527373 451367 18623 40578 66310 -80275 -181344 -37537 -50083 55200
9004 -205554 -78647 42137 -293329 21759 -59722 -41586 145869 193769 -202181 -266835 -390439
8993 -390439 -177499 -50543 26209 190083 146530 99680 -125384 -165444 712 172889 -220120
8981 -81119 -255122 116228 -11051 -181704 -131878 -68395 59406 -45775 -97390 260652 -111343
8969 -209885 -22254 -67134 -221343 102820 146464 293760 -24354 160125 -102750 -197374 -253123
8958 -253123 -104096 -50263 -146396 -222085 68366 -78500 -115000 -58768 -1970 -383782 19651
8946 174561 -433721 -141900 82319 -37794 -37194 -187138 -107576 -68680 -96083 -274849 -92735
8934 40981 395138 -23584 22086 208985 -255479 -150742 53583 -57816 626354 937149 1339060
8923 1339060 3491738 11284586 11534430 3208846 1151567 528356 548298 131601 115399
8914 115399 -72857 -142500 37948 174288 -165281 188591 355349 453704 296677 -47079 130087
8902 37588 64995 -179506 -341769 332415 -234658 61673 278218 -102172 118787 -168200
8891 37692 70248 47297 -85344 152903 -147724 4601 -114710 12083 64919 -155472 -115869
8880 -115869 58418 -388785 -59783 -171063 -111931 -51362 19111 193385 -377806 -36143 -13990
8868 25858 -342487 -258212 -206660 188160 292015 -107146 -98181 282894 117351 -13591 -64412
8857 -64412 -19864 -7213 119598 26970 -131078 387766 -42965 118927 228755 -243593 114140
8845 -242389 -70473 -165672 377852 -65883 103785 24619 -188536 -163315 27848 -170271 77957
8833 -81829 -79707 -82766 -195717 -94207 -352674 -3704 -134661 -148117 61502 -1682 40624 -8264
8820 -159154 -196316 54637 -174156 -52492 -207724 -92770 -172617 49452 -190780 64112 -164392
8808 -21920 121840 -192208 -41406 25082 26829 -139173 -13892 -643082 -101948 14225 -205573
8796 37599 50043 213225 -114752 227421 -138829 -91596 -118654 123355 273925 -227590
8785 -84956 93053 -205166 81909 73312 -225850 -269837 16943 6676 -134375 -352421 -208531
8774 -208531 66451 -219935 -323737 -237827 -108625 -37664 -201997 34103 156832 97819 197419
8763 197419 321552 -99613 -312626 -104772 51555 -395699 -3878 -234042 -63489 65332 -163002
8751 168436 83674 267282 -269987 -143253 -54777 97653 -96225 -120178 72511 180670 20839
8739 -24036 238164 -344286 129067 -395613 -37637 269971 75007 -209982 -335994 41244
8728 -20130 35991 5303 -5063 303465 -105631 -114166 -33637 -127667 -348387 -138540 41703 121799
8716 121799 -135577 135000 -22892 168723 -39008 -44371 146792 242405 100426 23109 -191461
8704 -305898 -27588 -78622 -126284 -124929 -132314 156936 -51505 -254209 216033 122952 -281723
8692 378196 -472680 -252497 -397336 119767 110716 -244593 -150630 -49991 -250226 55245 15924
8680 -39585 229737 -4127 -36221 -278520 -286883 102501 -400724 139710 -90818 250051 -161584
8668 -189508 -17723 6326 -380900 -134410 24244 35640 -115995 -214392 264529 -21566 -172933
8657 -172933 4958 87279 34188 -36420 183665 -118372 -213598 -127625 -279186 50820 83784
8646 83784 -193661 -103955 -88295 -77826 83096 57511 265457 -185273 -3348 28101 -84592
8634 262266 70704 71304 -340012 -40017 323595 42289 -182664 79722 151939 -100618 -206620
8623 -206620 -192797 -162118 143762 -31448 21853 61960 -99857 -68171 68826 -37342 -106057
8612 -106057 -68220 -36809 21078 -476086 68890 -68470 -167552 -185983 128671 -129180 -145411
8601 -145411 -167436 -166329 81852 -43209 39475 -52655 241722 111119 -457009 -67404 -163414
8590 -163414 266143 43091 -224058 -35644 -269412 151142 135393 -283867 158974 -196092
8579 -254216 -23562 -290964 -172809 -215636 32747 -230693 -145692 -254922 -90632 140913 214695
8568 214695 -142943 -200858 -20429 -20037 -415882 25850 -126280 118324 66574 -48825 -53774
8557 -53774 90184 36797 -93545 157416 83375 37620 -290535 125688 -96735 97696 -216964
8545 70582 -93174 -211477 -56251 -39338 117631 45424 -119135 325379 258299 15776 141136
8534 141136 46364 -124464 -245577 -163248 -188733 -316832 163413 -434876 41817 -288942
8523 15918 210597 -83145 -27881 -232789 -119533 -76472 108619 -80868 180330 -311680 -121101
8511 -268449 12613 332446 -104004 107657 -374848 -78388 -435378 242451 -360823 -129978
8500 128439 -103744 93003 -191 -117464 -44204 -59069 -203211 5035 -12766 -272809 18107
8488 -356258 131388 -129598 -151107 3946 -55878 65965 -137725 -6845 380135 -109746 -147622
8477 -147622 -356358 167128 -35911 33100 -167629 -141709 -34489 -109725 -213114 -244099 -121266
8465 -346397 103032 200490 90306 260222 -334744 140430 -105497 -25829 261034 186704
8455 186704 -60892 72104 -87680 -103636 64654 -27426 -240248 -247562 -259675 -86542 -109328 183786
8442 -260377 181303 -170084 54294 60950 -240610 -140814 -66179 -23058 -111926 329790 -20033
8430 -150362 -138211 145986 -185040 69403 31006 170471 78583 -24297 -253433 176694 141687
8419 141687 335563 111579 -68369 -67401 71130 223935 -2903 -74215 -17042 -35965 25110 363158
8407 363158 21384 -89617 -83780 -184763 -96799 -17245 -278604 36984 -67246 -148522 -128579
8396 -128579 -8226 6027 68949 -87938 147674 -153751 82781 76011 51373 -113087 -157746 -36856
8383 38356 -125811 27332 -179485 123154 -431160 -59412 263642 11863 -201862 75583 108185
8372 108185 66676 327995 -334440 177367 95690 236613 79188 -150632 -72299 135261
8361 -247463 -101848 -191441 -276226 -163299 119509 -414269 -18479 189068 -269789 -134657
8350 97646 152751 -231047 35757 -25781 -246894 -184217 40009 37698 -52277 340749 -365392
8338 -206794 -206362 9229 -92903 64224 -68248 43344 -66884 -442630 -199758 -100373 -247598 29711
8325 -100557 57209 46910 -150071 65109 29108 -441268 -139200 -24196 69312 82248 130802
8314 130802 359466 -145365 -41812 47697 -403922 -223728 -33781 -60337 111844 -250666
8303 -171848 25287 -49650 53782 -67787 -341900 188051 39164 47109 41363 -368874 -153676
8291 534245 28842 -126627 179030 46538 -244844 -24658 -252510 -123605 72711 224063
8281 224063 23509 33149 284380 148121 -218947 -162367 220479 19497 99747 75678 55921
8270 55921 -65301 267849 169628 -121793 -6127 -31054 -69686 143121 -150255 22093 241536
8259 241536 -64860 38381 184140 -138801 995 -288522 110971 -24430 -75736 -36952 337610
8247 -146469 -240336 -197628 -181549 210147 -38245 95180 -48776 172383 51851 -168017 -604
8235 -166933 -101893 -183176 -52322 178334 447533 231881 -102224 -136636 101005 -33908 -123446
8224 -123446 -202464 51432 -51665 -11958 31700 -200033 162941 -88403 -114644 -171435 57898
8212 -192146 282445 -98979 58205 38074 -338782 -10598 211662 29638 -5061 968 -221899
8200 -230600 35116 -61074 -58668 -176334 210202 -180941 -4330 92594 -171323 -330285 18623
8188 -85585 -366231 -297755 -186197 -239494 -261955 -63753 -282694 -268920 -207273 117636 -65337
8176 197616 67430 -131135 -321387 -356791 43926 111753 -203703 -153399 157578 125302 -20068
8164 -161083 -92059 304846 -104103 39277 195083 -253000 100374 -193230 -147122 -143444 -241047
8153 -241047 -119616 -74590 7433 104845 -128474 -246413 -138740 109830 89883 32362 -270640
8141 66188 -268945 147961 3478 -69434 -336296 102339 162327 -121338 264068 -151928 165559
8129 8975 -93696 -188280 30001 -221341 -132048 -186307 252972 58292 -3179 -133868 -15251 -218553
8117 -218553 -130202 -30813 61748 118716 23558 -139769 -163424 -211256 -133587 13998 -11864
8105 94628 162367 -23984 402 -190466 -22490 -61519 -226620 81972 -177468 -265496 -142559
8094 -142559 3889 374838 -78523 97776 49159 -186412 -103696 200253 -116649 208445 34909
8082 -81258 -78620 165135 -541406 187938 -12444 -165706 90302 -25876 265760 -36450 171914
8070 -99067 -100904 32954 54497 -225518 -66550 -226413 56655 513 -189827 -215288 -243925 34477
8057 -255407 -75089 -43939 198383 -266262 -216914 -135208 216092 114890 -82604 -42394 -46976
8046 -46976 215730 -36 -130589 147473 -236682 -71052 -47350 -94374 -62746 81846 93850 -40082
8033 104639 -541420 163238 -38159 -33668 16065 101731 -140219 -20387 -335767 -225248 -81778
8021 -116492 -419544 11246 22659 -394761 -92528 -90596 273922 140163 -69864 266590 54332
8009 -106380 74201 25590 118466 6893 -217513 -245216 47994 -62003 144079 112060 7688 -196470
7996 -397043 -30119 -150984 -250851 -88993 -245721 311659 248390 -768 62493 207727 278485
7985 278485 -529 206985 112740 70247 31468 99476 130611 201332 111888 -191144 69898 -263752
7972 -312729 -183533 -72489 -4220 -54962 -269136 -34249 -485342 100953 106783 -64617 12066
7960 -139004 -100839 181705 -108761 -269619 306621 -68863 13966 225212 27705 -136718
7949 -62487 128249 24688 -202681 3016 79388 -66924 127072 -173537 70044 90329 -82927
7937 76204 -112325 3717 228887 46540 105065 -101742 102845 -17011 -101588 124799 -143368
7925 194843 28443 108514 65928 -92374 -21836 252695 108797 -37797 -133705 35153 -204249
7913 -273728 47470 -304560 73634 -59330 -54940 -74458 74001 -21507 -226639 47680 -14719
7901 -110859 28744 311390 -8950 189924 126303 -81029 -178358 -227870 126875 89831 44335
7889 46681 38573 -154309 -61642 -131534 -333288 -265793 -462059 52472 -88187 -208383 -74235
7877 -245891 9671 -304242 -249976 295646 46749 -142521 -211786 2810 -341806 69810 21132
7865 25433 -24805 1410 17579 151047 72601 -160861 235935 -69198 -215661 111374 88865
7854 88865 -253438 89247 6196 -131162 -149143 4974 63260 -146998 -27803 -200525 102095
7842 -220868 -84059 230139 45188 -4324 -62578 -178682 -318792 -44154 -84686 -55841 53168
7830 -282928 59751 -243048 -261983 357208 113651 143301 29028 41019 -221536 -44490 -110897
7819 -110897 321191 -136116 89142 -224890 -128990 -131988 -127381 -368315 -181778 67307 -22931
7807 -150196 -529828 49348 159436 -157995 -56100 141869 -181227 -111976 329958 -355284
7796 -90388 -117788 -131305 6778 -51960 -103857 -238630 26243 -191936 -21025 -88344 -5991 -255957
7784 -255957 -228486 164244 -98092 50034 -157709 -205313 171317 -189415 -115493 -364530 -31606
7772 -215153 -113419 -114270 -112720 135795 -232579 169111 345250 -25304 -67682 18442 86256
7761 86256 -358881 -140286 -269568 99262 94372 -128439 -189087 -87560 -86175 5102 -153016
7749 -122275 -78134 -270346 -216533 -26749 -450840 68541 -11761 -308604 151578 377649 51916
7737 14523 -19255 -51679 -37088 324307 -264777 -53643 43790 275598 -86192 351367 -45187
7725 51264 -63152 -151294 15492 -206798 -351197 -102939 119892 -37708 -30523 -91047 -177924
7714 -177924 -28920 -95654 84611 161030 -102299 -222366 54938 -101698 -147007 54874 -391771
7702 -36616 -223450 -45680 -93976 -36669 33469 119880 22513 -106218 140394 158644 -135992
7690 -25187 -303336 98972 -14515 67105 -86472 -94162 91056 -12148 -211370 -77059 258706
7678 -380414 104911 161592 -111036 -221458 216664 261353 -41664 -25561 119562 -271323
7667 177716 -69517 124754 -38165 -302915 -30685 264527 -79356 -67883 27660 -114339 -142411
7656 -142411 -10148 199104 22722 -431322 -280005 -265938 -2299 205197 97554 133708 -23754
7644 -13980 194129 -270554 120489 119340 94245 -159529 -102517 -69957 175988 -95844 -257670
7633 -257670 224980 -123819 -213596 33443 -281425 -176762 1721 47985 -120188 -151711 -112865
7622 -112865 9840 -191615 332707 -222152 -82198 54698 -187346 137494 -158066 -337260
7612 -337260 -102479 -235903 -267660 -29574 18141 -176828 111323 -100460 -232266 -37690
7601 -58836 324033 157106 -418178 -25999 213449 -311166 -287087 28855 -195671 -351398
7591 -351398 54518 175047 -291918 -14285 -92284 -51744 -90818 101399 210376 -99725 25299
7579 -240156 -345125 -59602 -49689 -72490 146692 -87207 -198804 -192334 -73812 75263 -53560
7567 -31205 28759 -17473 31712 -323814 162986 -2261 -231628 91775 -145768 -123839 14604
7555 198499 77290 516362 -21908 156442 -28030 115718 -96276 93571 156091 86694 -49183
7543 57879 225782 -201600 254895 -138898 -221013 -165846 -261520 55289 316991 417397 -365199
7531 -91077 219938 -251307 -265230 101939 -107844 -141368 -51554 -233531 116762 -48353 -210697
7520 -210697 9426 183703 -248551 -122693 44772 -85557 -339091 115169 320525 -143885
7509 -98037 106628 -147622 -106246 -225881 -28363 215064 339003 -135964 -43635 -291938
7499 -291938 90588 217860 393579 250993 -106452 90068 -174961 39750 145091 111626
7489 111626 280147 -180583 -63363 19907 -289895 7105 -364827 143410 145277 -266059 35003
7477 116764 91273 75039 326723 -23409 57824 -19169 -175003 31996 166819 -355584 -3990
7465 72544 -227925 51766 230119 -268894 -3686 -139926 -191145 -257550 -130342 133017 98053
7454 98053 -70073 -35662 -10956 125443 303778 125496 -41722 -33237 17925 83625 -236384
7442 -182812 53674 -226412 -167769 185690 -3044 -97860 -187908 138978 60299 -287027 -308733
7431 -308733 -245494 28136 -242193 -45730 -195299 -280430 -89266 -75750 64130 129652 95315
7420 95315 27119 203354 -33454 -124714 123012 -28911 -88601 258211 6829 30711 133405
7409 133405 -24248 187465 -126879 68008 -107442 -192130 214543 145188 22283 116318 -72063
7397 -3606 -233893 273752 -139387 -137342 113013 -163389 -10845 -127615 -35824 240357 -132816
7385 -9570 -23636 343440 -37597 165877 48819 -466154 -43789 237609 291305 -8548 -66026
7374 -66026 -82203 -148111 -73394 59233 50638 124992 -211058 -146618 -32111 -160476 104623
7362 27768 -93181 -282082 -175036 -93177 89283 -378450 76909 -124563 -261605 74030 84610
7351 84610 -75782 -81871 -307966 32755 -62983 38442 337733 -209556 230968 48342 277360
7340 277360 -112991 -191871 130974 -355482 263970 -360980 -202794 -23273 -221901 188070
7329 124793 -200370 -15732 275822 205378 -53165 -110423 -132411 248708 -147078 80835 263487
7318 263487 -404651 77721 57125 -23257 -70195 87419 29945 81800 -133977 -264180 145746
7306 6061 -246951 -416250 96731 -384391 46981 -14783 226391 260339 -168208 74345 -112118
7294 109226 52050 -140483 -228943 -123412 133437 75246 -289807 -99436 134162 277931
7284 277931 31006 83021 -80938 -194640 15088 -16476 -84164 -162981 47399 221891 -106416
7272 56527 102270 137846 -103455 80809 -415637 -345003 153671 142343 -128205 216719 79038
7260 379139 168253 -52494 156067 -42072 189572 146113 168745 -30694 150450 -216388 19775
7248 -299136 46456 -195197 228004 -219268 160918 -206422 -74170 -133214 177750 -53511
7237 -172830 -219587 14837 27191 209248 -61733 -492580 65492 34168 -99811 -86331 -307532
7226 -307532 -83565 155513 -36353 109862 -74485 -135474 -91134 79091 323692 -138487 282572
7214 -3598 -138344 114610 -163937 -469776 -343909 -37825 -99627 77394 16742 -70022 268773
7202 157402 68201 13198 -591 183210 85672 182170 251943 11054 282125 -42723 125200
7190 157759 -156401 215482 169396 -100228 23552 15390 -349392 -78932 -120006 -369452 -159837
7178 68554 -201049 -148924 -37819 -15823 236517 263311 -80879 -277077 17920 94449 -125707
7166 -191000 -44355 113003 28726 -135139 143131 -29301 -302041 -162074 180458 136104
7156 136104 140079 320337 -82722 -139999 169979 38949 83882 166076 5477 -116713 69079
7144 -69326 -175661 -183508 -159867 -81803 -355616 76631 -267354 92704 138662 -78671 12199
7132 -380938 106474 78304 37087 164255 28611 -168921 333511 -237200 -20956 269126
7121 -8266 -211409 16495 -110023 -27034 300132 84120 257728 -29968 58470 -79626 -182331
7110 -182331 -166859 131567 -162630 -10007 -79182 224223 230949 122419 11824 25476 -239019
7098 -99498 -6354 -93487 47584 -209884 29865 -245734 -173963 -175184 232125 -199299 -187515
7087 -187515 -234566 117559 -152897 -90823 -56645 70523 114022 -1490 -323887 39243 68189
7076 68189 371661 -163048 130138 101822 -35117 97636 16232 -302147 21694 -109734 224811
7064 50308 -70195 -63829 -35164 -14978 151038 -152179 -174745 -314126 -154314 -276990 130154
7052 -151376 165326 -36698 135820 -37183 -296575 -84612 87400 -99347 -152880 88520 102738
7041 102738 -104175 -413854 11314 164731 25220 92676 376815 -190713 141675 -219005
7030 -64706 -70528 296238 237313 173760 -115862 -23128 155935 138235 410654 64579 231703
7019 231703 -201968 -226764 46622 -98367 -296607 -92366 -27826 -251272 -181248 -218155 57087
7007 128584 20975 23697 -15711 -11240 -287256 165613 -165808 63288 -286394 -64330 19830
6995 215835 -88970 307294 -75892 -282981 50565 -125987 -6448 -471079 -137198 250257 -222326
6983 7560 -151981 188810 -119848 72385 -44905 -52240 -145138 345646 -180539 -13772 204662
6971 199104 174466 37292 179924 -85383 -11743 79737 -107093 139872 -123635 115069 237711
6960 237711 396962 155241 56700 81375 -75374 68571 -339732 32096 195724 59297 15157
6948 -232972 278032 -248397 122456 59150 -249027 -10633 -169425 337812 -187967 91318
6937 29433 123367 -37170 165203 -229503 -74814 -59894 -288621 -189897 -454680 -29880 -222417
6926 -222417 213167 24255 -117023 25082 -28159 -43026 19608 66411 -234249 -98286 -199687
6915 -199687 117078 168475 86872 154326 -9872 -228292 -365203 44978 185763 97652 210104
6904 210104 -100224 76983 -286749 -96820 30914 -61873 -139976 253150 -132493 243840 -138003
6892 -41712 -43652 -154316 -45148 -390618 -63506 -345867 55722 325520 -84974 33687 16252
6880 16902 -5049 -33219 -257041 381279 13048 183199 -30186 -268110 15478 301809 244800
6869 244800 -18447 -20637 -192842 -143764 -50645 60410 233620 -301036 44889 54395 -162764
6857 222254 8141 -160355 107118 -18251 -138900 -61750 -61440 196596 81704 -108623 -41590
6845 49487 143104 -99476 -115530 69630 -108806 -116644 -11829 -208842 -83401 -202379 -310105
6834 -310105 138025 -139760 34355 326727 -53101 -147425 4649 -125394 -31459 -132047 58126
6822 -162236 385153 61788 82095 77388 -103942 -35597 102992 290371 50119 83563 129255
6811 129255 -140237 -312703 -126629 87454 -323420 81048 174375 -332857 289195 -101132
6800 -118268 57407 211945 51112 122464 99506 -501766 242426 -321474 -347578 -35458 -183561
6789 -183561 -255693 -127397 -79927 -952 -47049 31492 -36310 -88515 80807 157608 -32714 179452
6776 237970 -222565 -269216 40563 -416360 -193517 145881 -77458 63672 103049 12737 84038
6765 84038 71165 -61327 15878 -227573 -141138 60544 67310 106474 131278 -2435 -154987 -190774
6753 -190774 -153781 31467 40323 206450 148425 200634 -2364 78617 -118953 28843 -50451 267828
6740 119896 -76490 250533 -82029 -218412 49679 -5886 -202869 254508 -59532 -14367 -260545
6729 -260545 246918 -180793 54824 144560 -219159 -23266 160844 -151977 -230777 -154181 61030
6717 -69535 -27466 155032 -97004 -12092 -32027 -58815 73184 172702 -45661 -147949 -133493
6706 -133493 -317849 256402 -51995 168892 107110 80459 247890 -109481 -51520 -119285 -56207
6694 -15537 141174 -5596 -100728 -6257 18918 -202140 2098 192608 254461 -68908 -64065 -94794
6682 -94794 -19383 -87925 79634 -114196 5395 -380987 -174087 -141065 107444 166995 52138
6670 -143153 -29187 55538 70016 4750 81542 5121 -62279 -145696 28765 103000 -78690 -63010
6658 -63010 24907 -140212 75442 42354 -113495 -443307 8692 573 -146751 300859 32439
6646 106050 40884 -34284 -195586 -27309 25541 10151 -113981 -31202 212923 121016 357928
6635 357928 -241911 -396802 -81533 -39583 -363751 88748 -50078 -116139 -18379 -133929 -125503
6624 -125503 -83721 26658 -18015 123367 90761 179979 -5566 -231104 48158 99606 -152215
6612 -39991 -117292 182043 181669 35223 -124436 -204711 218123 72603 115345 64759 -98508 -130285
6600 -130285 -62673 -217671 41100 15588 -96575 19318 46161 170428 254071 99520 -42987
6588 -458433 63380 246151 186688 364785 113101 318517 7413 -350866 -140756 114557
6577 -38498 -212198 69518 -159090 -158440 -27658 -17561 -132211 -83226 162689 123431 292484
6566 292484 -88360 95195 286084 -330256 -76467 97811 -22977 -16858 156242 -213339 256332
6554 -46023 -188577 -344663 55587 -58706 76200 44725 -131082 95248 -72428 245058 -47543
6542 -283861 28545 -249055 180666 -217074 -269736 -117579 170738 172907 -243005 287616
6531 -28115 -147143 -131178 -54523 115286 -216995 -92084 -68913 -29925 12974 74610 223248
6520 223248 -5969 -241916 -264781 -105504 -107399 362078 -179427 -120963 -141927 -268201 -191006
6509 -191006 -313835 -52037 8367 365390 62260 379496 157052 -83354 -126932 -138967 106393
6497 59266 266319 93590 7980 166600 125751 -47484 21701 -79209 29268 32853 267822 20905
6484 -78731 -23834 -353357 -184033 -310807 -144548 21951 -93864 -176249 102805 -108983 46642
6472 29949 -164433 41373 -281520 -33106 110572 225113 -256128 -130018 -117378 67734 47949
6461 47949 -69626 166241 -50658 -19362 59988 103451 64799 -214622 -167619 -185416 65097
6449 -201165 -195776 239116 108796 -46069 144674 425474 57913 320880 -336123 -50747 113058
6437 -159915 -122482 -228860 123800 222540 187697 -63536 -159387 264845 113262 143057 -213478
6425 -66151 78619 -52227 76857 -127462 237250 -239868 -20579 -146045 20207 -18658 -19623
6414 -19623 234967 164905 318210 70899 364394 -112351 104948 45164 172572 -78231 119453
6402 203435 -20196 368579 -135802 -10077 -36170 168044 -177587 74790 148925 36598 212246
6391 212246 89794 -7838 118415 -82727 28761 -77203 53532 -50476 61308 -7066 202031 102270
6379 102270 327192 -111274 -172848 42497 9128 -103791 58170 44361 108724 19748 -139694
6367 -48059 29737 318188 -70340 -70828 -51541 -64232 -56599 86756 -162859 -430108 -45315 24113
6354 66673 -87595 -217906 168791 60830 -111384 -96943 528651 -166449 113992 200564 247049
6343 247049 -87633 -125643 48999 68259 45235 117170 184864 31403 138292 -258041 -207308
6332 -207308 -74963 131899 13563 165237 -184089 -100347 -147518 -110477 -94447 149037 110203
6321 110203 8785 107010 166613 -328645 -118996 -121227 145638 -96845 -239328 -215253 142801
6309 -170953 -54112 88820 154479 -72204 21565 96190 -32400 -18608 65738 -268155 305846
6297 95269 -318849 -96331 -171659 -235699 -243318 130142 -97678 -6268 -230419 -56574 -93613 -110344
6285 -110344 3344 -191489 79837 -244704 -227023 -95094 234095 29511 -191781 40526 -204282
6273 -277126 487749 -19869 88135 36479 -62282 166462 -74551 43579 -13309 6228 252159
6262 252159 -236835 71993 93988 27027 -58123 -193197 -358168 -48763 -176351 -91940 -9311
6250 -455763 125089 -76731 206340 12940 243331 143144 -144659 -265463 297094 94782
6239 -5095 -304416 -36759 -54983 -98708 -104074 -42293 -18516 -311041 168508 -17867 166333
6227 41790 -21381 169132 -72697 -396119 21398 8475 -377889 -31854 118118 59670 90563
6216 90563 61219 200467 -27870 97303 -210520 40146 103522 43484 -68409 428326 204746
6204 -285948 -338 -88857 -42208 -24443 -60802 -73035 119969 -19738 -169477 -140826 -25508 216798
6191 -10582 95045 32443 268068 186554 243236 -142558 -47814 12919 10891 -65123 -293366
6180 -293366 -94091 -280758 -37235 -56374 -178569 250400 -400090 81245 -73832 -239332 -168445
6169 -168445 120801 -119432 116340 183117 -266286 216871 -44037 -59213 116163 -89208
6158 117119 107032 -211554 169305 -76365 -137663 -265170 40135 -26594 -51972 -119176 53404
6146 189941 31216 -49008 -245756 -26353 -98223 34762 60164 -79925 206061 -35147 153741
6134 146013 14971 -260451 120665 208516 -96183 194061 87793 327740 -177169 -251638 40622
6122 199212 151113 -36183 -157997 -153921 39226 -146277 -40451 513043 228330 84516 130044
6111 130044 -30149 80279 -220014 402301 -388710 67661 175670 127073 -174672 -241050 -60729
6099 -227219 -223335 133993 -111493 -174508 -188483 172195 -45506 -346093 -21359 -138921 -302242
6088 -302242 -319735 17359 138277 205743 -365927 56694 -45440 41635 141885 -168472 140908
6076 15412 -128023 66430 -46654 -73750 -204882 -47225 -94606 101175 -184787 226608 162685
6065 162685 30261 -306035 -319458 181753 30304 229087 252164 85080 -167575 -123778 -29581
6053 -272830 79808 185690 -87396 -153131 97916 -3341 -995 -170386 109091 -17852 178057
6041 292474 259880 78063 89372 207644 -137196 6502 137037 -28223 -23898 -132517 -248955
6030 -248955 -10420 -80064 -310932 -237143 -14861 201741 62433 61573 4712 -206686 388222
6018 74103 160784 -201462 27506 22980 7256 204934 86519 21703 -36405 20640 -59945 161274
6005 30240 68191 31300 361916 -177351 -81164 -119854 -238082 74410 -1806 145165 232092
5994 232092 -79316 -35927 -222599 -19715 -91883 171532 -106187 -78411 -391681 -77821 -98568
5983 -98568 4215 173678 35624 -162463 -297702 -138024 51344 -23144 -148731 37124 255460
5972 255460 250938 42954 -182738 112858 -43394 -98791 2727 -66972 24986 -97952 152606
5960 193560 232742 -31680 -13901 -216934 -21855 -336512 -2098 -191597 -180512 25493 -11354
5948 -331540 -284996 87286 52415 180088 -109450 -26449 60169 75966 108586 213148 -319224
5936 302398 -313165 -106250 129204 -160992 -209534 -14156 34699 -91238 165826 -14626 215533
5924 121651 307796 -120979 3969 126837 473082 -31913 61332 232481 749 6036 -116779
5912 -33873 -89653 -159731 -175634 -340305 100911 -10688 -14796 -50051 56620 -11925 -35652 173794
5899 19487 -90070 -34560 -440585 -71322 -46888 159313 59206 -11048 -51805 -190100 88552
5887 94683 -145508 179063 -135723 -203821 -87653 379425 -111723 -286207 -142965 161899
5876 -308906 195726 -133391 -120333 24763 -154474 45373 -222421 364327 -155665 189113
5865 55340 -5148 -31509 189175 -44891 -92820 277003 -195277 -100983 -197207 154480 17277
5853 34542 34167 70130 -267812 -49763 -140250 242800 -228633 -31399 31058 144398 193354
5842 193354 55468 -1634 -103932 -103786 221519 -92481 -105118 103950 114478 118935 59596 208324
5830 208324 -28468 -173151 -186740 -36935 -195229 206068 112316 -25626 -222347 -68397 41441
5818 -133892 -41449 82322 -71077 196680 25988 203249 -9829 -21314 109322 7243 250385
5807 250385 209369 -6441 -339863 132747 199789 -90863 11136 -101429 -239882 198757 -62340
5795 49219 -25778 276503 278307 155071 -195731 261075 -3676 100150 -2066 -32155 183752
5783 6132 -152433 -126356 -86047 -132371 -88492 293406 38483 37441 67025 151813 -27915 199054
5770 -46341 -183702 4499 -211786 65696 -308782 270214 -127477 74252 -62178 260469 186963
5759 186963 78330 106043 -109249 -98970 35050 -15809 -257925 100631 -196848 13221 248742
5748 248742 -200542 66403 122950 -346615 156318 207046 71082 42421 48505 -262749 177740
5736 -231349 114880 111486 129506 260007 38553 -69315 -73840 193244 -455083 86042 -3603
5724 -381014 -23659 -31966 48991 -148563 -126225 88265 -252356 37622 -8452 104387 -9135 66561
5711 32419 -169631 -50360 -43296 3815 -150681 -237589 -31522 246725 -55703 331052 -499823
5699 -197327 37379 -85007 -265113 90709 66056 91909 239392 13486 227115 342388 -39484
5687 265685 253782 -45029 -139953 132091 -5281 44957 -31691 67817 -61616 -66590 -84359 17331
5674 297921 34417 70616 146340 45187 -116313 284625 -131818 -86932 -11406 122039 29372
5662 33473 28280 148078 -34781 138793 -100790 -34775 -69943 185212 6741 -64970 -169785
5651 -169785 -177267 -225283 60933 177054 278509 35199 72864 -147284 -38256 121263 -85332
5639 -299474 -247516 34018 -4540 268109 61650 262700 43992 97579 -200971 -31799 -179340
5628 -179340 352045 103220 148737 155489 247362 -110427 161623 7002 -239549 211835 -499892
5616 54699 -32535 -247252 178989 -269651 81075 9031 41901 140333 -106998 -71844 -245701
5605 -245701 -294962 195768 -299230 -16720 121201 23811 -146614 -87056 -4742 144085 50448
5593 109374 -141737 -131724 -39915 -77773 126515 388139 50331 -70180 255095 -192702 -112325
5582 -112325 19108 231395 -198954 -67210 -117729 21111 -324660 81012 -179881 103180 210484
5571 210484 128387 101476 -125485 -107921 154194 -22367 -85286 78750 151389 110247 29892
5559 135029 -133336 102226 18999 341272 199354 128423 45152 67136 4202 25667 -184788
5547 -41004 63550 -199647 -13312 496769 -483871 155959 153243 40264 -202152 -90662 -26215
5535 -102911 48037 -272041 86444 11331 -95774 40117 -9686 349348 555799 302247 128134
5523 40920 -263564 -6297 -249100 -155844 -69159 -83870 -53124 30124 252822 -231731 -36968
5511 -163074 69787 -165987 2517 -431001 44759 161068 70823 -309698 222852 -459088 -150043
5499 66227 -26508 -63314 -421674 -61269 -185886 -69098 47419 44856 -39488 -264976 -18654
5487 219197 215974 32518 175359 -67660 -51797 154613 -101138 1605 113425 -103743 -59239
5476 -59239 84691 105551 7476 301361 -83296 -111438 -180266 -183955 -59846 -371497 156142 14168
5463 175310 -138854 39138 -129989 49612 84184 128291 78738 247654 27469 -427067 -61677
5451 -93867 -100133 26404 -242187 -47085 -86078 186632 -170576 52626 -103489 -154965 9908
5439 118341 248497 102775 -78480 -149859 185071 -151329 189066 203723 -54286 325081
5428 352279 -99113 255833 -84390 -125285 -10358 -88964 -155534 -165951 -116188 -30114 137547
5416 -17875 -16373 13720 43991 -49878 -92096 57269 -29235 -307925 -146296 -82697 14649 26474
5404 26474 -33609 -124922 -138480 133525 -48487 -45931 -150335 82466 -188028 215629 -326839
5392 -187520 -74821 -27369 -229548 156428 181508 58711 -187037 236682 10960 -4394 -156796
5381 -156796 164159 41645 394570 72379 -309041 -224870 52914 -26362 127768 -682 -209640
5370 -209640 -299755 -182957 -130780 -159713 46385 -304667 129086 -21498 -47400 20976 22582
5359 22582 132477 172930 73188 -397657 87056 168094 -287246 -41996 216364 43506 40472
5348 40472 -194862 -12295 410361 9270 -18267 -91605 38774 130260 412101 -143447 -148347
5337 -148347 300970 39223 -131917 -201276 47991 319962 183660 237056 339423 362648 189274
5326 189274 31569 20033 -161225 228842 93952 286067 32840 -231529 155052 -124241
5315 -883 -98972 -92547 -40510 -34177 -75840 -32138 -38572 44665 -210466 61680 -65527 165999
5302 12938 -124027 -120502 -88123 54956 174366 -382404 142532 178886 229374 227777 40008
5290 33470 61773 68884 24703 -323622 -140822 -192480 -184037 299519 -142124 -11797 -344337
5279 -344337 -340342 142776 -8161 -214427 77750 -16420 -88363 -90418 -72419 315553 267705 138624
5267 138624 -352447 -181949 114003 16404 330125 40580 -112448 -154271 21732 -81569 -421665
5256 -421665 83393 4984 56737 -37449 -152133 87050 -98647 -146633 -312553 -190894 52753
5244 -227945 286577 186728 30630 263072 -46252 182872 42859 -216560 311195 -179398
5233 -121924 17420 -125679 112441 144376 -252774 18836 -290119 51562 48047 -101534 -138736
5222 -138736 122420 161475 135357 -128054 190038 -262321 33115 -79012 -54631 252315 52509
5210 10780 261906 -214330 -81634 -100563 122098 -38440 -43493 -54780 -198367 43338 239202
5199 239202 339536 -379439 -51069 106432 -119552 155164 98454 232692 -158399 -102064
5189 -102064 -119108 -280664 210802 22698 -35739 73441 -83072 -140150 54162 -22207 -215555
5178 -215555 58528 -31920 -149795 -106782 -103785 -52157 -122223 -64286 -287884 -46785 -167657
5167 -167657 167830 221485 155070 -215830 -113698 142679 -279828 166926 -88405 331748
5156 230054 135632 -153651 -121505 -136584 -261729 179675 -88445 -234726 148028 -1764 -119111
5145 -119111 -200791 -169779 -109928 113115 182441 56995 90733 2973 121209 292305 21794
5133 70193 -316748 289610 -226858 -84125 1598 -39828 44883 19393 347776 -76976 150817
5121 16127 71881 -220926 -30246 288822 134084 -65648 394793 27650 -12855 -74044 -154305
5110 -154305 71329 15997 -68815 -37080 308300 -14656 -120245 -69361 70815 140676 -88320
5098 139537 72251 -102196 18719 23309 -141653 205883 27255 -308018 348348 111352 -47900
5086 2834 -275876 47508 154438 175093 -123012 -168120 -113376 288903 147592 118742 5270
5074 76832 25678 142677 -44021 -185243 16556 37211 176778 199732 -122290 -126460 11378
5062 -224349 25424 6304 138277 -112784 -108297 -243513 -247990 -46727 142609 -81967 -40366
5050 204153 229283 -11930 62573 102444 -30663 -11809 -337137 325594 28617 41962 44330
5039 44330 -180989 -36055 122975 -244577 -97652 -51524 -68664 -128408 -199570 -97424 -8302
5027 -287242 99100 -21447 155651 8425 21113 192258 -106559 187580 -89884 -166508 241778
5015 252093 -287794 104341 247816 233456 285823 190113 -25549 410024 117585 34813 99988
5004 99988 -80772 48115 -200336 -28629 26671 -35584 109045 11798 19802 -135641 155928
4992 87836 -150827 194622 -91136 -22663 -101834 256511 1297 92889 72172 -313436 -97574
4980 -21822 285522 -34548 181520 185681 11757 -53488 154252 -150849 111273 183141 21407
4968 -203909 2804 83918 -65263 321736 54667 323883 217866 208638 207774 131376 -305999 -255996
4956 -255996 -25168 237030 85391 -228782 -149978 -189038 -327505 134488 8400 442607 -230529
4944 -98728 -28270 56675 -137514 -28015 29670 -3296 -14354 -120443 -213815 85894 -183288
4932 106830 -200413 56632 -236158 131594 233894 -211226 125140 252742 -191712 -162833
4922 -162833 258719 -206702 76304 364041 -152846 134802 -51726 -105867 116279 -109627
4911 -12882 184118 -55379 167778 -46837 -123669 61262 -305973 -52456 83230 40323 -257469
4899 11770 129476 -51052 -21337 -32349 278048 246192 74632 -214215 -37623 21345 138572
4888 138572 150100 69355 -306249 348346 206265 76002 294144 123171 -171018 -67094
4877 4241 -198881 -201230 174982 30961 289577 -201581 -186156 95110 230189 86316 -142299
4865 2410 275577 -239622 -162049 -352682 120789 64949 238 89569 13949 53325 29855 96285
4853 96285 33039 117263 -167866 75981 25578 -60744 298363 -237148 76318 -4805 138822
4841 11076 107878 -59883 173052 28276 413744 -182042 40104 36509 82381 104923 -18698
4829 -66808 -176248 -5811 -170949 161129 -289476 -9563 -221902 166547 -424522 438943 80409
4817 -350348 -222194 -46935 25070 18860 34835 141570 -45968 -8082 -82165 298951 -31378
4805 60620 -119449 150447 80144 -352316 -94831 65026 -203061 -244856 290729 131763 -48784
4793 260194 -141405 -62125 -239434 118717 199735 79067 -37122 118998 -97346 25500 -294408
4781 -153199 6912 -233345 -209536 68760 -105573 125186 -264920 -48557 323779 229438 119408
4770 119408 13741 58786 -19712 -95503 36363 225537 14290 31352 54814 -60391 275076
4758 85319 -109948 -43970 82944 84889 245887 158727 57442 -48198 -34786 -26165 223589 -10536
4745 30264 270961 181248 -317750 17728 252272 -34507 2268 -94068 -269902 -176760 -188917
4734 -188917 244284 -416106 -37894 141698 -248489 92479 15260 20206 -35730 113544 3860
4722 49724 -56624 -399595 117891 -309086 -147280 -177837 49033 -42586 96977 -90156 -55477
4711 -55477 -107794 -75960 105245 -340901 7061 -172657 119496 -142113 -222325 152475 180977
4700 180977 324354 20057 15060 107556 99961 508638 -148591 171912 98934 198898 -52680
4688 46002 -246036 -113162 399178 95794 -101093 -215932 124710 84397 -115231 -90701
4678 -90701 55327 393 -203680 59831 117950 94707 58252 -6576 -19465 -92772 -42360 81708
4665 13344 11373 220604 67451 -1430 -238454 -9264 45157 99978 349814 223465 17964 -202344
4652 -27585 -126076 -64254 203628 -97583 84634 -108867 16117 -111641 -51508 -3693 26388
4640 -233472 148798 -41374 79311 238670 -114247 30118 130311 3403 25381 -57884 -380073
4629 -380073 -62144 -105068 285532 31369 474173 86099 60166 -37066 147258 -88943 -70980
4618 -70980 139969 11530 -81072 50841 -182641 110956 -170859 103789 -172822 -177804 -19660
4606 -141283 152525 172118 -255200 -89169 -149525 258344 107612 -42336 -153530 -136882 -308363
4595 -308363 163137 -127042 -71202 -35522 -238088 -202946 11026 201644 -97701 -226940 192668
4583 198284 35808 57314 -193223 220474 87636 17163 -97555 97085 -7059 -27657 -51089
4572 -51089 -216396 19875 -255095 187593 29320 -127022 110271 12355 -23661 -77874 -47092
4561 -47092 -57662 -63096 -90317 -87279 -100425 80956 -120716 -129153 224662 -199402 -62797 73800
4548 -259952 -145027 154298 -28114 170717 73456 -116389 10264 143930 -45620 -107552 45611
4536 97834 -134091 7039 114597 125981 -94302 -168943 -62640 -299433 -212593 -524827 33703
4524 -214502 -242111 -51040 -24903 250281 82824 138945 174845 -39901 355083 97335 124410
4513 124410 -175897 -27149 159571 89093 -236939 381166 230348 306616 121498 -33354
4502 -151847 47691 141348 -97176 41012 -48917 66368 24346 134586 -48754 -78771 -62926
4491 -62926 3863 138274 -208898 162061 54455 -200693 101892 -220183 140358 108092 -257747
$$ [...]
##END NTUPLES=NMR SPECTRUM
##END=
