
##TITLE=AC1395_GUALH12207_7519859_1o7gSwumvg
##JCAMPDX= 6.0         $$ Bruker NMR JCAMP-DX V2.0
##DATA TYPE= NMR SPECTRUM
##DATA CLASS= NTUPLES
##ORIGIN= BRUKER
##OWNER= Administrator
$$ 1.72 TOPSPIN		Version 2.1
$$ 2013-02-20 16:04:19.870 -0500  Administrator@X
$$ Compression mode = diff/dup
##.OBSERVE FREQUENCY= 400.02188249412
##.OBSERVE NUCLEUS= ^1H
##.ACQUISITION MODE= SIMULTANEOUS (DQD)
##.ACQUISITION SCHEME= undefined
##.AVERAGES= 64
##.DIGITISER RES= 22
##SPECTROMETER/DATA SYSTEM= spect
##.PULSE SEQUENCE= noesygpps1d.comp
##.SOLVENT NAME= COFFEE_meoh
##.SHIFT REFERENCE= INTERNAL, COFFEE_meoh, 1, 14.96086
##AUDIT TRAIL= $$ (NUMBER, WHEN, WHO, WHERE, PROCESS, VERSION, WHAT)
$$ ##TITLE= Audit trail, TOPSPIN		Version 2.1
$$ ##JCAMPDX= 5.01
$$ ##ORIGIN= Bruker BioSpin GmbH
$$ ##OWNER= Administrator
$$ $$ E:\/data/COFFEE/nmr/AC1395_GUALH12207_7519859_1o7gSwumvg/12/pdata/1/auditp.txt
$$ ##AUDIT TRAIL=  $$ (NUMBER, WHEN, WHO, WHERE, PROCESS, VERSION, WHAT)
(   1,<2013-02-19 21:17:52.222 -0500>,<Administrator>,<X>,<go>,<TOPSPIN 2.1>,
      <created by zg
	started at 2013-02-19 21:06:22.328 -0500,
	POWCHK enabled, PULCHK disabled,
       configuration hash MD5:
       86 BA 57 50 F2 9D 5C 9B 26 00 A9 28 5F 66 2E 89
       data hash MD5: 64K
       61 D2 C4 81 7B ED 4A DA 41 51 E6 09 24 A4 FB E5>)
(   2,<2013-02-19 21:17:55.378 -0500>,<Administrator>,<X>,<proc1d>,<TOPSPIN 2.1>,
      <Start of raw data processing
       efp LB = 0.3 FT_mod = 6 PKNL = 1 PHC0 = 0 PHC1 = 0 SI = 128K 
       data hash MD5: 128K
       FD 59 47 D5 3D C8 44 D2 B7 E2 2D DF 63 F0 40 6B>)
(   3,<2013-02-19 21:17:56.456 -0500>,<Administrator>,<X>,<proc1d>,<TOPSPIN 2.1>,
      <pk PHC0 = 254.7675 PHC1 = 0 
       data hash MD5: 128K
       29 81 57 06 49 F6 B7 7F 2F AD 46 28 8A B8 D3 93>)
(   4,<2013-02-19 21:17:57.144 -0500>,<Administrator>,<X>,<proc1d>,<TOPSPIN 2.1>,
      <abs ABSG = 1 
       data hash MD5: 128K
       4C 53 4B E7 1C B3 27 4B 1F 15 FE 27 C9 53 41 DB>)
(   5,<2013-02-19 21:17:57.300 -0500>,<Administrator>,<X>,<proc1d>,<TOPSPIN 2.1>,
      <abs ABSG = 2 
       data hash MD5: 128K
       9C 87 97 E3 6F 19 43 9D 47 07 2E 98 34 72 FB 46>)
(   6,<2013-02-19 21:17:57.440 -0500>,<Administrator>,<X>,<proc1d>,<TOPSPIN 2.1>,
      <abs ABSG = 3 
       data hash MD5: 128K
       36 6A FC 32 EA D6 BF EF 4D 65 6A BF 5B 9B E5 8E>)
(   7,<2013-02-19 21:17:57.644 -0500>,<Administrator>,<X>,<proc1d>,<TOPSPIN 2.1>,
      <abs ABSG = 4 
       data hash MD5: 128K
       22 86 92 1C 0D 0D 2B B9 73 9B D4 52 5C BE 37 13>)
(   8,<2013-02-19 21:17:57.800 -0500>,<Administrator>,<X>,<proc1d>,<TOPSPIN 2.1>,
      <abs ABSG = 5 
       data hash MD5: 128K
       20 D7 B1 EF 23 97 31 3B 03 5E 66 15 AF 1F 3A 37>)
(   9,<2013-02-19 21:18:04.519 -0500>,<Administrator>,<X>,<audit>,<TOPSPIN 2.1>,
      <user comment:
       ICON-NMR User ID: COFFEE
       data hash MD5: 128K
       20 D7 B1 EF 23 97 31 3B 03 5E 66 15 AF 1F 3A 37>)
$$ ##END=
$$ 
$$ $$ hash MD5
$$ [...]
150 150 150 150 150 150 150 150
##$TP07= 0
##$TPNAME0= <>
##$TPNAME1= <>
##$TPNAME2= <>
##$TPNAME3= <>
##$TPNAME4= <>
##$TPNAME5= <>
##$TPNAME6= <>
##$TPNAME7= <>
##$TPOAL= (0..7)
0.5 0.5 0.5 0.5 0.5 0.5 0.5 0.5
##$TPOFFS= (0..7)
0 0 0 0 0 0 0 0
##$TUNHIN= 0
##$TUNHOUT= 0
##$TUNXOUT= 0
##$USERA1= <user>
##$USERA2= <user>
##$USERA3= <user>
##$USERA4= <user>
##$USERA5= <user>
##$V9= 5
##$VALIST= <valist>
##$VCLIST= <CCCCCCCCCCCCCCC>
##$VD= 0
##$VDLIST= <DDDDDDDDDDDDDDD>
##$VPLIST= <PPPPPPPPPPPPPPP>
##$VTLIST= <TTTTTTTTTTTTTTT>
##$WBST= 1024
##$WBSW= 4
##$XGAIN= (0..3)
0 0 0 0
##$XL= 0
##$YL= 0
##$YMAX_a= 6155719
##$YMIN_a= -10365380
##$ZGOPTNS= <>
##$ZL1= 120
##$ZL2= 120
##$ZL3= 120
##$ZL4= 120
##$ABSF1= 14.96086
##$ABSF2= -5.597322
##$ABSG= 5
##$ABSL= 3
##$ALPHA= 0
##$AQORDER= 0
##$ASSFAC= 0
##$ASSFACI= 0
##$ASSFACX= 0
##$ASSWID= 0
##$AUNMP= <proc_prof1d_extract.lims>
##$AXLEFT= 0
##$AXNAME= <>
##$AXNUC= <1H>
##$AXRIGHT= 0
##$AXTYPE= 0
##$AXUNIT= <>
##$AZFE= 0.1
##$AZFW= 0.1
##$BCFW= 0
##$BC_mod= 0
##$BYTORDP= 0
##$COROFFS= 0
##$CY= 15
##$DATMOD= 1
##$DC= 0
##$DFILT= <>
##$DTYPP= 0
##$F1P= 0
##$F2P= 0
##$FCOR= 0.5
##$FTSIZE= 131072
##$FT_mod= 6
##$GAMMA= 0
##$GB= 0
##$INTBC= 1
##$INTSCL= 1
##$ISEN= 128
##$LB= 0.3
##$LEV0= 0
##$LPBIN= 0
##$MAXI= 10000
##$MC2= 0
##$MEAN= 0
##$ME_mod= 0
##$MI= 0
##$NCOEF= 0
##$NC_proc= -2
##$NLEV= 6
##$NOISF1= 0
##$NOISF2= 0
##$NSP= 0
##$NTH_PI= 0
##$NZP= 0
##$OFFSET= 14.96086
##$PC= 1
##$PHC0= 254.7675
##$PHC1= 0
##$PH_mod= 1
##$PKNL= yes
##$PPARMOD= 0
##$PPDIAG= 0
##$PPIPTYP= 0
##$PPMPNUM= 2147483647
##$PPRESOL= 1
##$PSCAL= 4
##$PSIGN= 0
##$PYNMP= <proc.py>
##$REVERSE= no
##$SF= 400.020009691633
##$SI= 131072
##$SIGF1= 0
##$SIGF2= 0
##$SINO= 400
##$SIOLD= 131072
##$SPECTYP= <>
##$SREGLST= <1H.CDCl3>
##$SSB= 0
##$STSI= 131072
##$STSR= 0
##$SW_p= 8223.68421052631
##$SYMM= 0
##$S_DEV= 0
##$TDeff= 65536
##$TDoff= 0
##$TI= <>
##$TILT= no
##$TM1= 0
##$TM2= 0
##$TOPLEV= 0
##$USERP1= <user>
##$USERP2= <user>
##$USERP3= <user>
##$USERP4= <user>
##$USERP5= <user>
##$WDW= 1
##$XDIM= 131072
##$YMAX_p= 449816551
##$YMIN_p= -12451
##$CURPLOT= <Network HP LaserJet P1505>
##$CURPRIN= <$Network HP LaserJet P1505>
##$DFORMAT= <normdp>
##$LAYOUT= <+/1D_H.xwp>
##$LFORMAT= <normlp>
##$PFORMAT= <normpl>
##$SURQMSG= 1
$$ End of Bruker specific parameters
$$ ---------------------------------
##NTUPLES= NMR SPECTRUM
##VAR_NAME=  FREQUENCY,     SPECTRUM/REAL,   SPECTRUM/IMAG
##SYMBOL=    X,             R,               I
##VAR_TYPE=  INDEPENDENT,   DEPENDENT,       DEPENDENT
##VAR_FORM=  AFFN,          ASDF,            ASDF
##VAR_DIM=   131072,        131072,          131072
##UNITS=     HZ,            ARBITRARY UNITS, ARBITRARY UNITS
##FACTOR=    0.0627417313425164, 1,          1
##FIRST=     8223.62146879497, 959,          -62940
##LAST=      0,             2608,            -62924
##MIN=       0,             -12451,          0
##MAX=       8223.62146879497, 449816551,    0
$$ Real data points
##PAGE= N=1
##DATA TABLE= (X++(R..R)), XYDATA
$$ [...]
63900A530488j02668r0234p9020o8481n8353m8612l9851l3141k8916k6357k4447
$$ 1530488 1427820 1337586 1258566 1190085 1131732 1083120 1043269 1010128 981212 954855 930408
63889I30408k3150k2870k3096k2555k0735j8442j6592j5080j3187j0625p718m706
$$ 930408 907258 884388 861292 838737 818002 799560 782968 767888 754701 744076 736358 731652
63877G31652j372K543O764J0627J3785J6557J9408K2317K5010K7606L0484L3438
$$ 731652 730280 732823 739587 750214 763999 780556 799964 822281 847291 874897 905381 938819
63865I38819L5644L6709L7217L7825L8266L7801L6222L3950L1316K8244K4560
$$ 938819 974463 1011172 1048389 1086214 1124480 1162281 1198503 1232453 1263769 1292013 1316573
63854A316573K0169J5115R734M585j85n129j0702j6458k1551k5777k9588l3185
$$ 1316573 1336742 1351857 1361591 1366176 1365991 1360862 1350160 1333702 1312151 1286374 1256786 1223601
63842A223601l6228l8465m0037m1134m1798m2148m2306m2069m1056l9318l7422
$$ 1223601 1187373 1148908 1108871 1067737 1025939 983791 941485 899416 858360 819042 781620
63831G81620l5852l4648l3636l2605l1250k9344k7032k4647k2235j9759j7636
$$ 781620 745768 711120 677484 644879 613629 584285 557253 532606 510371 490612 472976
63820D72976j6497j6194j5634j3977j1674r992r613j0006j0011q963p266n930
$$ 472976 456479 440285 424651 410674 399000 389008 379395 369389 359378 350415 343149 337219
63808C37219n522n617n413m750m164m060m117l665k496j191o38j083j733j664
$$ 337219 331697 326080 320667 315917 311753 307693 303576 299911 297415 296224 295586 294503 292770 291106
63794B91106j133j369k798m217m348l553l086l130k796j868j276j616k314k614
$$ 291106 289973 288604 285806 281589 277241 273688 270602 267472 264676 262808 261532 259916 257602 254988
63780B54988k490k124j426n65j94n26q30m81R2J36l03o56p80q87q99n86k22l06
$$ 254988 252498 250374 248948 248383 248189 247663 246833 246352 246444 246580 246277 245621 244841 243954 243055 242469 242247 241941
63762B41941p12p09L2R43J146L76p87j408r94NO52M78j60o82q97p91l01M41R49
$$ 241941 241229 240520 240552 241495 242641 243017 242230 240822 239828 239833 240485 240963 240803 240121 239224 238433 238132 238573 239522
63743B39522R47P90R66J410J708J749J786K033K516L142L651L666L137K526K307
$$ 239522 240469 241259 242225 243635 245343 247092 248878 250911 253427 256569 260220 263886 267023 269549 271856
63728B71856K487K848L301L719L792L513L481M192N272N895N830N574N562N743
$$ 271856 274343 277191 280492 284211 288003 291516 294997 299189 304461 310356 316186 321760 327322 333065
63714C33065N840N642N015L943K542Q89j014k889m103m296l842l438l444l859
$$ 333065 338905 344547 349562 353505 356047 356936 355922 353033 348930 344634 340792 337354 333910 330051
63700C30051m461m635l641j582L31J108J161J490K099K200J661J166J072J062
$$ 330051 325590 320955 317314 315732 316063 317171 318332 319822 321921 324121 325782 326948 328020 329082
63686C29082J067J481K258K733K740K928L601M025L477K291J282P16M12L51N44
$$ 329082 330149 331630 333888 336621 339361 342289 345890 349915 353392 355683 356965 357681 358093 358444 358988
63671C58988P02O13N92R85J559J888K078K517L076L220K818K252J649N75j281
$$ 358988 359690 360303 360895 361880 363439 365327 367405 369922 372998 376218 379036 381288 382937 383512 382231
63656C82231l504n295o251o579o640o525o137n528m961m550m055l272k502k188
$$ 382231 378727 373432 367181 360602 353962 347437 341300 335772 330811 326261 322206 318934 316432 314244
63642C14244k165j756p86J04M40P11J606K884L714L974M364N182N788N606N068
$$ 314244 312079 310323 309537 309641 310081 310792 312398 315282 318996 322970 327334 332516 338304 343910 348978
63627C48978N018N580O228O725P322Q045Q439Q288Q098Q532R638J0997J2377J3836
$$ 348978 353996 359576 365804 372529 379851 387896 396335 404623 412721 421253 430891 441888 454265 468101
63613D68101J5408J7090J9076K1482K3883K5654K6892K8407L0640L3102L5161
$$ 468101 483509 500599 519675 541157 565040 590694 617586 645993 676633 709735 744896
63602G44896L6807L8158L8649L7346L3772K8060K0667J2490M884j150n609q813
$$ 744896 781703 819861 858510 895856 929628 957688 978355 990845 995729 994579 988970 980157
63590I80157j0440j0163q894q322r157j0820j2998j6253k0673k5026k8011k9585
$$ 980157 969717 959554 950660 942338 933181 922361 909363 893110 872437 847411 819400 789815
63578G89815l0339l0327k9336k7694k5879k3740k0983j8013j5451j3096j0370
$$ 789815 759476 729149 699813 672119 646240 622500 601517 583504 568053 554957 544587
63567E44587p530n375l820j860Q11L240M642N519O758Q380R789J0779J1577J2246
$$ 544587 537057 531682 527862 526002 526813 530053 534695 540214 546972 555352 565141 575920 587497 599743
63553E99743J2701J3131J3920J5183J6785J8761K1322K4530K8290L2569L7380
$$ 599743 612444 625575 639495 654678 671463 690224 711546 736076 764366 796935 834315
63542H34315M2615M8002N3008N6283N5521M8694L5974K0197N150o598j4281j8103
$$ 834315 876930 924932 977940 1034223 1089744 1138438 1174412 1194609 1199759 1193161 1178880 1160777
63530A160777j8559j6597j3687j1144r447q533q716j0823j5241k1177k7192l2393
$$ 1160777 1142218 1125621 1111934 1100790 1091343 1082810 1074094 1063271 1048030 1026853 999661 967268
63518I67268l6765m0374m2707m3092m1539l8923l6246l3944l1836k9634k7274
$$ 967268 930503 890129 847422 804330 762791 723868 687622 653678 621842 592208 564934
63507E64934k4801k2129j9129j5997j3345j1713j0972j0368r273p796o590o042
$$ 564934 540133 518004 498875 482878 469533 457820 446848 436480 427207 419411 412821 406779
63495D06779n779n109l888k754k316k343k131j549j171j271j307q48m24p32j293
$$ 406779 401000 395891 392003 389249 386933 384590 382459 380910 379739 378468 377161 376313 375889 375157 373864
63480C73864q35R16K756L584L763M355N572O630O856O256N160L837K521J372L21
$$ 373864 373029 373945 376701 380285 384048 388403 393975 400605 407461 413717 418877 422714 425235 426607 426928
63465D26928p88j950l104m284n384n954n669m873m175l666k956j975j103n20p
$$ 426928 426140 424190 421086 416802 411418 405464 399795 394922 390747 387081 384125 382150 381047 380527 380520
63450C80520M90O97O67R45J739K451K549K474L130M649O272P331P937Q712J0179
$$ 380520 381010 381707 382374 383319 385058 387509 390058 392532 395662 400311 406583 413914 421851 430563 440742
63435D40742J2402J5018J7692K0699K4853L0575L7110M2728M5523M4063L8079
$$ 440742 453144 468162 485854 506553 531406 561981 599091 641819 687342 731405 769484
63424G69484K9056J9681J2026O476K809J608L629Q121J3107J7559K2247K8091
$$ 769484 798540 818221 830247 836723 839532 841140 844769 852890 865997 883556 905803 933894
63412I33894L4577M0368M4649M7070M6954M3368L6094K6102J5146N039l045q878
$$ 933894 968471 1008839 1053488 1100558 1147512 1190880 1226974 1253076 1268222 1273261 1270216 1261338
63400A261338j2729j4622j4504j3178j2300j3066j5377j8628k2670k7446l2385
$$ 1261338 1248609 1233987 1219483 1206305 1194005 1180939 1165562 1146934 1124264 1096818 1064433
63389A064433l6821m0537m3203m3933m2340l9578l7196l5170l2219k8036k3892
$$ 1064433 1027612 987075 943872 899939 857599 818021 780825 745655 713436 685400 661508
63378F61508k0834j8446j5987j3641j1823r984p151l377K30K825M596O191P947
$$ 661508 640674 622228 606241 592600 580777 570793 563642 560265 560495 563320 567916 574107 582054
63365E82054R822J1707J3575J5426J7258J9080K0983K3093K5399K7743L0138L2958
$$ 582054 591876 603583 617158 632584 649842 668922 689905 712998 738397 766140 796278 829236
63353H29236L6456M0237M3536M6006M7648M8004M5966M0808L3006K3748J4038
$$ 829236 865692 905929 949465 995471 1043119 1091123 1137089 1177897 1210903 1234651 1248689
63342A248689M627l542r434j2607j3495j3063j2304j1944j2472j4265j7572k2136
$$ 1248689 1253316 1249774 1240340 1227733 1214238 1201175 1188871 1176927 1164455 1150190 1132618 1110482
63330A110482k7047l1415l5155l8652m1585m2834m1790l9170l6010l2510k8363
$$ 1110482 1083435 1052020 1016865 978213 936628 893794 852004 812834 776824 744314 715951
63319G15951k3782j9303j4853r874m507p7J691l28o066j3949k1195k5394k6163
$$ 715951 692169 672866 658013 648139 643632 643555 645246 644918 638852 624903 603708 578314 552151
63306E52151k4930k3091k0947j8378j5680j3238j1081r267q153p794p512o715
$$ 552151 527221 504130 483183 464805 449125 435887 424806 415539 407386 399592 392080 385365
63294C85365n726n168m882m248l409l253m051m924m964m241l375k691k235k125
$$ 385365 379639 374471 369589 365341 361932 358679 354628 349704 344740 340499 337124 334433 332198 330073
63280C30073k284k201j515o41k90m84o21m22j70m7J29K99j3r14j625j290%J348
$$ 330073 327789 325588 324073 323432 323142 322658 322037 321615 321445 321398 321527 321826 321813 320899 319274 317984 317984 319332
63262C19332K054K128K025K168K598K806K175R31K52R75K441L317L311L285L706
$$ 319332 321386 323514 325539 327707 330305 333111 335286 336217 336469 337444 339885 343202 346513 349798 353504
63247C53504L941L482L015L515M811N805N922N690N875O649P764R021J0258J1154
$$ 353504 357445 360927 363942 367457 372268 378073 383995 389685 395560 402209 409973 418994 429252 440406
63233D40406J1425J1218J1148J1729J2814J3683J3843J3667J4009J5136J6322
$$ 440406 451831 463049 474197 485926 498740 512423 526266 539933 553942 569078 585400
63222E85400J6650J5995J5012J4360J4250J4725J5875J7569J9133J9619J8519
$$ 585400 602050 618045 633057 647417 661667 676392 692267 709836 728969 748588 767107
63211G67107J6118J3123R973O580K724j528n811r707j2869j5077j6396j7145j7426
$$ 767107 783225 796348 806321 812901 815625 814097 808286 798579 785710 770633 754237 737092 719666
63198G19666j6895j5297j3120j1159r431p131l875l93K420M659P056R912J2959
$$ 719666 702771 687474 674354 663195 653764 646633 642758 642365 644785 649444 656500 666412 679371
63185F79371J6099J9486K2855K5402K6627K6901K7042K7565K8579K9938L1220
$$ 679371 695470 714956 737811 763213 789840 816741 843783 871348 899927 929865 961085
63174I61085L1817L1477L0703L0265L0279L0053K8900K6833K4245K1103J6808
$$ 961085 992902 1024379 1055082 1085347 1115626 1145679 1174579 1201412 1225657 1246760 1263568
63163A263568J0929L726m183j2452k0888k8906l5574m0454m3963m6673m8452m8700
$$ 1263568 1274497 1278223 1274040 1261588 1240700 1211794 1176220 1135766 1091803 1045130 996678 947978
63151I47978m7392m5351m3338m1193l8193l4221l0175k7008k4641k2186j9221
$$ 947978 900586 855235 811897 770704 732511 698290 668115 641107 616466 594280 575059
63140E75059j6377j4385j3033j1540r692q030o941o205n554n003m427l415k019
$$ 575059 558682 544297 531264 519724 510032 502002 495061 488856 483302 478299 473872 470457 468438
63127D68438j095j329k190k466j627k11J022J690J703J225Q81J383K667L790L974
$$ 468438 467343 466014 463824 461358 459731 459520 460542 462232 463935 465160 466041 467424 470091 473881 477855
63112D77855L450L078L302L826M109L924L429K965K773K838K883K571J802Q91
$$ 477855 481305 484383 487685 491511 495620 499544 502973 505938 508711 511549 514432 517003 518805 519696
63098E19696L77N02R10J003O59L63N13R19J217J532K243L104L163J841j71j500
$$ 519696 520073 520575 521485 522488 523147 523510 524023 524942 526159 527691 529934 533038 536201 538042 537871 536371
63082E36371j578j217j495k347k627j619j9R42J031J095J748K627L164L528M286
$$ 536371 534793 533576 532081 529734 527107 525488 525469 526411 527442 528537 530285 532912 536076 539604 543890
63067E43890N527O727P394P532P544P963R059J0502J1618J2191J2784J4046J5960
$$ 543890 549417 556144 563538 571070 578614 586577 595636 606138 617756 629947 642731 656777 672737
63054F72737J8121K0447K3120K6001K8611L0685L2395L4009L5591L7019L8069
$$ 672737 690858 711305 734425 760426 789037 819722 852117 886126 921717 958736 996805
63043I96805L8615L8860L9188L9641L9881L9922M0344M1386M2290M2303M1833
$$ 996805 1035420 1074280 1113468 1153109 1192990 1232912 1273256 1314642 1356932 1399235 1441068
63032A441068M1768M1908M1001L8298L4114K8770K2046J3995N439k872j0948j8942
$$ 1441068 1482836 1524744 1565745 1604043 1638157 1666927 1688973 1702968 1708407 1705535 1694587 1675645
63020A675645k6445l2855l7956m1657m3624m3704m2264l9671l5777l0548k4738
$$ 1675645 1649200 1616345 1578389 1536732 1493108 1449404 1407140 1367469 1331692 1301144 1276406
63009A276406j9302j4196q427j381O415J3936K0711K6996L3123L8966M4080M8280
$$ 1276406 1257104 1242908 1234481 1233100 1239515 1253451 1274162 1301158 1334281 1373247 1417327 1465607
62997A465607N1821N4866N6984N7626N7085N6530N6908N8071N9144N9427N8789
$$ 1465607 1517428 1572294 1629278 1686904 1743989 1800519 1857427 1915498 1974642 2034069 2092858
62986B092858N7442N5502N2563M7721M0276L0451J9053O507p217k1758l6225n0095
$$ 2092858 2150300 2205802 2258365 2306086 2346362 2376813 2395866 2402373 2395156 2373398 2337173 2287078
62974B287078o3416p5691q5433r1548r4536r5575r4918r2134q7497q2080p6559
$$ 2287078 2223662 2147971 2062538 1970990 1876454 1780879 1685961 1593827 1506330 1424250 1347691
62963A347691p0874o5075n9547n4238m8644m2915l8121l4876l2413k9674k6797
$$ 1347691 1276817 1211742 1152195 1097957 1049313 1006398 968277 933401 900988 871314 844517
62952H44517k4750k3801k3178k2245k1197k0394j9608j8459j7174j6338j5975
$$ 844517 819767 795966 772788 750543 729346 708952 689344 670885 653711 637373 621398
62941F21398j5450j4447j3504j3171j3069j2344j0887r465q588p866o769n459
$$ 621398 605948 591501 577997 564826 551757 539413 528526 519061 510473 502607 495838 490379
62929D90379m464l987l947m303m821m818l859k579k093k602l158l008k516k421
$$ 490379 485915 481928 477981 473678 468857 464039 460180 457601 455508 452906 449748 446740 444224 441803
62915D41803k682k606j842p58J39O92R62R38N77lo40j328k153k993l487l419l042
$$ 441803 439121 436515 434673 433915 434054 434746 435708 436646 437223 437220 436580 435252 433099 430106 426619 423200 420158
62898D20158k786k721k533k054j574j477j738j935j648p85L86J420K002K133J956
$$ 420158 417372 414651 412118 410064 408490 407013 405275 403340 401692 400907 401293 402713 404715 406848 408804
62883D08804J423M34p68j590j689j303q76n98m48l89l17p1K62L59J75O9J65j6
$$ 408804 410227 410661 409893 408303 406614 405311 404435 403837 403389 403000 402683 402612 402874 403233 403408 403477 403642 403626
62865D03626q24j742j955j396p05l23k11l18n98o12J61J410K097J703Q06J27l06
$$ 403626 402802 401060 399105 397709 397004 396681 396470 396152 395554 394942 395103 396513 398610 400313 401119 401246 400940
62848D00940o58n97J77J124J295N07n32j215j530j550j049k6Q89J010M22j96m80
$$ 400940 400282 399685 399862 400986 402281 402788 402256 401041 399511 397961 396912 396886 397775 398785 399207 399011 398531
62831C98531p17j215j679j473l86J065J997J817O99m08m68O44J898K175J547J099
$$ 398531 397814 396599 394920 393447 393061 394126 396123 397940 398639 398231 397763 398407 400305 402480 404027 405126
62815D05126J514K293K595K371K255K627L210L563L557L339L131L115L342L705
$$ 405126 406640 408933 411528 413899 416154 418781 421991 425554 429111 432450 435581 438696 442038 445743
62801D45743M094M540N103N748O420P222Q285R506J0513J0923J0651J0114J0066
$$ 445743 449837 454377 459480 465228 471648 478870 487155 496661 507174 518097 528748 538862 548928
62788E48928J1039J2898J5093J7347J9731K2232K4729K7512L1205L5814M0491
$$ 548928 559967 572865 587958 605305 625036 647268 671997 699509 730714 766528 807019
62777H07019M4607M8491N2571N6404N9194O0840O1591O1146N8938N5093N0117
$$ 807019 851626 900117 952688 1009092 1068286 1129126 1190717 1251863 1310801 1365894 1416011
62766A416011M3805L5503K5403J4591L672p543j8725k8592l6342m2604m8269n3098
$$ 1416011 1459816 1495319 1520722 1535313 1538985 1531442 1512717 1484125 1447783 1405179 1356910 1303812
62754A303812n6213n7367n7001n5496n3121n0401m7786m5160m2192l8964l5828
$$ 1303812 1247599 1190232 1133231 1077735 1024614 974213 926427 881267 839075 800111 764283
62743G64283l2869l0016k7407k5118k2838k0271j7688j5539j3729j1832r820q028
$$ 764283 731414 701398 673991 648873 626035 605764 588076 572537 558808 546976 537156 529128
62731E29128o493m969l512k483j917j415p12J04R58K005L275M574N737O751P648
$$ 529128 522635 517666 514154 511671 509754 508339 507627 507731 508689 510694 513969 518543 524280 531031 538679
62716E38679Q605J0020J2024J4005J5194J5779J6775J8681K0926K3061K5744K9855
$$ 538679 547284 557304 569328 583333 598527 614306 631081 649762 670688 693749 719493 749348
62704G49348L5014L9898M4082M8759N5223O3162P1046P7962Q4359R0811R6826
$$ 749348 784362 824260 868342 917101 972324 1035486 1106532 1184494 1268853 1359664 1456490
62693A456490J01495J04867J07786J10197J10551J07280J00257R0198P7231O0959
$$ 1456490 1557985 1662852 1770638 1880835 1991386 2098666 2198923 2289121 2366352 2427311
62683B427311M1750K1040K50j9952l9202n6913p2490q5586r5912j03203j07609
$$ 2427311 2469061 2490101 2490351 2470399 2431197 2374284 2301794 2216208 2120296 2017093 1909484
62672A909484j09665j09568j06992j01961r5499q8875q2509p6125o9732o3797
$$ 1909484 1799819 1690251 1583259 1481298 1385799 1296924 1214415 1138290 1068558 1004761
62662A004761n8486n3367m8091m2979l8628l5172l2217k9332k6358k3316k0321
$$ 1004761 946275 892908 844817 801838 763210 728038 695821 666489 640131 616815 596494
62651E96494j7667j5741j4600j3754j2597j1102r809r085q682q211p693p309o830
$$ 596494 578827 563086 548486 534732 522135 511033 501224 492139 483457 475246 467553 460244 453414
62638D53414n838m442l247k573k217k017k086k240j892r18j43l20j057j441j436
$$ 453414 447576 443134 439887 437314 435097 433080 430994 428754 426862 425944 425801 425481 424424 422983 421547
62623D21547j807k693l142k406j063l50p03j417j533p53M20J155J046O21R39K475
$$ 421547 419740 417047 413905 411499 410436 410086 409383 407966 406433 405680 406100 407255 408301 408922 409861 412336
62607D12336M510N846O043N755N884O735P909Q858R384R758J0457J1755J3639
$$ 412336 416846 422692 428735 434490 440374 447109 455018 463876 473260 483018 493475 505230 518869
62594E18869J5981J8676K1456K3857K5661K7175K8731K9933K9843K8092K5370
$$ 518869 534850 553526 574982 598839 624500 651675 680406 710339 740182 768274 793644
62583G93644K2529J9476J5385R904L670k415q020j3227j7839k1357k3567k4850
$$ 793644 816173 835649 851034 860938 864608 862193 854173 840946 823107 801750 778183 753333
62571G53333k5698k6141k5900k4970k3773k2686k1665k0448j9003j7516j6076
$$ 753333 727635 701494 675594 650624 626851 604165 582500 562052 543049 525533 509457
62560E09457j4604j3115j1783j0615r274p469n445l786k717j882r53j85j45r34
$$ 509457 494853 481738 469955 459340 450066 442597 437152 433366 430649 428767 427814 427629 427484 426550
62546D26550j951k445k138j279k77N62J186J766K462L120L415L361L438L978M611
$$ 426550 424599 422154 420016 418737 418460 419022 420208 421974 424436 427556 430971 434332 437770 441748 446359
62531D46359M769M570M710N378N927N955O184P668J0356J3080J4960J6254J7762
$$ 446359 451128 455698 460408 465786 471713 477668 483852 491520 501876 514956 529916 546170 563932
62518E63932J9933K2861K6644L1221L6035M0394M4197M7970N2118N6323N9813
$$ 563932 583865 606726 633370 664591 700626 741020 785217 833187 885305 941628 1001441
62507A001441O2018O2825O2266O0152N6091M9787M1333L1232K0216Q996j947j2399
$$ 1001441 1063459 1126284 1188550 1248702 1304793 1354580 1395913 1427145 1447361 1456357 1454410 1442011
62495A442011k2151l0616l6872m0336m1339m0803l9293l6687l2824k8105k3086
$$ 1442011 1419860 1389244 1352372 1312036 1270697 1229894 1190601 1153914 1121090 1092985 1069899
62484A069899j7769j1769n158J359P329J3205J9720K6700L2961L7503M0447M2513
$$ 1069899 1052130 1040361 1035203 1036562 1043891 1057096 1076816 1103516 1136477 1173980 1214427 1256940
62472A256940M3710M2879L8681L0934K0934J0640J470o438j4092k2656l2291m1851
$$ 1256940 1300650 1343529 1382210 1413144 1434078 1444718 1446188 1439750 1425658 1403002 1370711 1328860
62460A328860m9780n5325n8778o0814o1795o1735o0539n8154n4576m9924m4487
$$ 1328860 1279080 1223755 1164977 1104163 1042368 980633 920094 861940 807364 757440 712953
62449G12953l8764l3397k8884k5188k1789j8354j5178j2751j1045r572q030o449
$$ 712953 674189 640792 611908 586720 564931 546577 531399 518648 507603 498031 490001 483552
62437D83552m814l052j415l01L47J002J703J917J441P88L58k06j300k615l620
$$ 483552 478738 475686 474271 473970 474317 475319 477022 478939 480380 481168 481526 481320 480020 477405 473785
62422D73785m377n222n972o191n923n597n353n081m864m817m606l864k945k541
$$ 473785 469408 464186 458214 452023 446100 440503 435150 430069 425205 420388 415782 411918 408973 406432
62408D06432k629k540k059j677j692j747j485j014n73l33n44j185j445m71J236
$$ 406432 403803 401263 399204 397527 395835 394088 392603 391589 391016 390683 390139 388954 387509 387038 388274
62393C88274K106J644J229K137L692M242L357K028J141P39O64R33J442J978K582
$$ 388274 390380 392024 393253 395390 399082 403324 406681 408709 409850 410589 411253 412186 413628 415606 418188
62378D18188L427M337M921N205N561O146O834P677Q838J0167J1305J2247J3233
$$ 418188 421615 425952 430873 436078 441639 447785 454619 462296 471134 481301 492606 504853 518086
62365E18086J4187J4824J5342J6321J7875J9596K1554K4595K9232L4802M0278
$$ 518086 532273 547097 562439 578760 596635 616231 637785 662380 691612 726414 766692
62354G66692M5475N0851N6494O1882O6519P0170P2393P2377O9444O3514N5023
$$ 766692 812167 863018 919512 981394 1047913 1118083 1190476 1262853 1332297 1395811 1450834
62343A450834M4622L3133K1507J0537N06q776j7575k5817l3106l9207m4422m9285
$$ 1450834 1495456 1528589 1550096 1560633 1561139 1552363 1534788 1508971 1475865 1436658 1392236 1342951
62331A342951n3784n7105n8304n7125n4102n0058m5727m1615l7866l4203l0312
$$ 1342951 1289167 1232062 1173758 1116633 1062531 1012473 966746 925131 887265 853062 822750
62320H22750k6424k3259k1355k0542k0209j9856j9310j8697j8318j8344j8402
$$ 822750 796326 773067 751712 731170 710961 691105 671795 653098 634780 616436 598034
62309E98034j7708j5918j3690j2018j1139j0521r762q928p951o429m365k578j836
$$ 598034 580326 564408 550718 538700 527561 517040 507278 498350 490399 483970 479605 477027 475191
62296D75191j979k264k321k173j709q37pJ92m1J59J087K006K121J563J074J203
$$ 475191 473212 470948 468627 466454 464745 463908 463901 464093 464052 464211 465298 467304 469425 470988 472062 473265
62280D73265K074L438M711N322N371N525O023O310O013N709O097O856P169P066
$$ 473265 475339 478777 483488 488810 494181 499706 505729 512039 518052 523761 529858 536714 543883 550949
62266E50949P439Q698J0262J1530J2686J4278J6502J9251K2533K6425L0890L5892
$$ 550949 558388 567086 577348 588878 601564 615842 632344 651595 674128 700553 731443 767335
62254G67335M1538M7852N4558O1164O7164P2050P5347P6644P5443P0988O2777
$$ 767335 808873 856725 911283 972447 1039611 1111661 1187008 1263652 1339095 1410083 1472860
62243A472860N1429L8672K6079J4144K859p323j5840k3205l0868l9571m8390n5843
$$ 1472860 1524289 1562961 1589040 1603184 1606043 1598720 1582880 1559675 1528807 1489236 1440846 1385003
62231A385003o1370o5171o7097o6649o4104o0682n7183n3109m7733m1501l5720
$$ 1385003 1323633 1258462 1191365 1124716 1060612 999930 942747 889638 841905 800404 764684
62220G64684l1031k6990k3113j9542j6536j3874j1277q915p046n404l496j354
$$ 764684 733653 706663 683550 664008 647472 633598 622321 613406 606360 600956 597460 596106
62208E96106M41J567K321L067L625L613L212L195L999N030N268M500L563L195
$$ 596106 596547 598114 600435 603502 607127 610740 613952 617147 621146 626176 631444 635944 639507 642702
62194F42702L085K457J273K74o0LJ41N30J448K688L731M344M740N313O274P443
$$ 642702 645787 648244 649517 649791 649731 649734 649875 650405 651853 654541 658272 662616 667356 672669 678943 686386
62178F86386Q329Q574Q336P928P171N565L222J133L17J032K995N946R708J4052
$$ 686386 694715 703289 711625 719553 726724 732289 735511 736644 736961 737993 740988 746934 756642 770694
62164G70694J8822K3943K9244L4590M0168M6061N1396N4713N5392N3955N0593
$$ 770694 789516 813459 842703 877293 917461 963522 1014918 1069631 1125023 1178978 1229571
62153A229571M4504L5416K4943J5265P040l59p123j2886j8100k3948l0606l6754
$$ 1229571 1274075 1309491 1334434 1349699 1356739 1356380 1349257 1336371 1318271 1294323 1263717 1226963
62141A226963m1284m4469m6933m8338m7848m5341m1543l7265l2965k8800k4726
$$ 1226963 1185679 1141210 1094277 1045939 998091 952750 911207 873942 840977 812177 787451
62130G87451k0722j7060j4055j1543r005o420m420l295k371p33J721M289O159
$$ 787451 766729 749669 735614 724071 715066 708646 704226 700931 698560 697827 699548 703837 709996
62117G09996O797N979L972J547m55j608j919j665j318j277j494j670j990l167
$$ 709996 716793 722772 726744 728291 727836 726228 724309 722644 721326 720049 718555 716885 714895 711728
62103G11728n407p697q687q109o857n759m772l429j635K88K081L778N445O898
$$ 711728 706321 698624 689937 681828 674971 669212 664440 661011 659376 659664 661745 665523 670968 677866
62089F77866P897Q476Q930R433R902J0368J1165J2507J4131J5710J7421J9683
$$ 677866 685763 694239 703169 712602 722504 732872 744037 756544 770675 786385 803806 823489
62077H23489K2411K5019K7091K8705L0070L1242L2235L2980L3165L2547L1399
$$ 823489 845900 870919 898010 926715 956785 988027 1020262 1053242 1086407 1118954 1150353
62066A150353L0162K8753K6789K4594K3186K3217K4461K6597K9644L3185L5966
$$ 1150353 1180515 1209268 1236057 1260651 1283837 1307054 1331515 1358112 1387756 1420941 1456907
62055A456907L6952L6214L4113L0156K3635J5240P022N49m390r199j5066k2259
$$ 1456907 1493859 1530073 1564186 1594342 1617977 1633217 1640239 1640788 1636398 1627199 1612133 1589874
62043A589874l0175l7803m4339m9667n4135n7829o0340o1255o0676n9053n6645
$$ 1589874 1559699 1521896 1477557 1427890 1373755 1315926 1255586 1194331 1133655 1074602 1017957
62032A017957n3434m9513m5364m1503l7877l3972k9606k5383k1995j9326j6722
$$ 1017957 964523 915010 869646 828143 790266 756294 726688 701305 679310 659984 643262
62021F43262j4087j2108j1237j0987j0597j0013r790j0171j0747j0895j0296r046
$$ 643262 629175 617067 605830 594843 584246 574233 564443 554272 543525 532630 522334 513288
62009E13288p498o083n064m352l581k395p85Q64K131L098M294N940P471Q165Q027
$$ 513288 505790 499707 494643 490291 486710 484315 483530 484394 486525 489623 493917 499857 507328 515493 523520
61994E23520P616P200O572N582M300K675O85j187k335k933l771n046o076o484
$$ 523520 531136 538336 544908 550490 554790 557465 558150 556963 554628 551695 547924 542878 536802 530318
61980E30318o737p217p540p362p067p023o867o228n518n228m930l882k273j037
$$ 530318 523581 516364 508824 501462 494395 487372 480505 474277 468759 463531 458601 454719 452446 451409
61966D51409o79r75j583k240k557k374k168k404k641k019n43Q62J539J627J473
$$ 451409 450730 449755 448172 445932 443375 441001 438833 436429 433788 431769 431226 432088 433627 435254 436727
61951D36727J271J336J993L031L861M367N088O336P738Q805R548J0341J1536J3305
$$ 436727 437998 439334 441327 444358 448219 452586 457674 464010 471748 480553 490101 500442 511978 525283
61937E25283J5523J7734J9565K1092K2519K3638K4099K4061K3944K3622K2457
$$ 525283 540806 558540 578105 599197 621716 645354 669453 693514 717458 741080 763537
61926G63537K0244J7505J4772J2125R547P118M727K009j225m876q705j2094j3922
$$ 763537 783781 801286 816058 828183 837730 844848 849575 851584 850359 845483 836778 824684 810762
61913H10762j3576j2022j0900j0333q711n103p03K909N899R432J3422J6425J7621
$$ 810762 797186 785164 774264 763931 755220 750117 749414 752323 758222 767654 781076 797501 815122
61900H15122J7670J7380J6475J4189J0362N499J79n052r474j2483j4128j5146
$$ 815122 832792 850172 866647 880836 891198 896697 896876 891824 882350 869867 855739 840593
61888H40593j6269j7594j8639j8926j8460j7665j6921j6202j5186j3697j2045
$$ 840593 824324 806730 788091 769165 750705 733040 716119 699917 684731 671034 658989
61877F58989j0924j0867j1793j3029j3829j3837j3117j1930j0526r037p434n652
$$ 658989 648065 637198 625405 612376 598547 584710 571593 559663 549137 540100 532666 527014
61865E27014l811k197r53N8J071K222L613N265O952Q438R954J2127J5119J8248
$$ 527014 523203 521006 520053 520111 521182 523404 527017 532282 539234 547672 557626 569753 584872 603120
61851F03120K0777K2769K4841K7391L0428L3753L6806L8749L9316L9280L9397
$$ 603120 623897 646666 671507 698898 729326 763079 799885 838634 877950 917230 956627
61840I56627L9168L7370L3569K8322K2052J4762O949k58o153j0950j4815j7202
$$ 956627 995795 1033165 1066734 1095056 1117108 1131870 1138819 1138561 1132408 1121458 1106643 1089441
61828A089441j7567j6182j3714j0437o326j575L346P895J1523J3919J5314J6058
$$ 1089441 1071874 1055692 1041978 1031541 1025215 1023640 1026986 1034881 1046404 1060323 1075637 1091695
61816A091695J5763J3358Q322J377o255j3743k0606k6448l1198l5112l8144l9767
$$ 1091695 1107458 1120816 1129138 1130515 1124260 1110517 1089911 1063463 1032265 997153 959009 919242
61804I19242l9772l8737l7258l5268l2630k9842k7520k5552k3380k0793j7962
$$ 919242 879470 840733 803475 768207 735577 705735 678215 652663 629283 608490 590528
61793E90528j5105j2631j1175j0822j0585r482p797o560o036n573m871m437m592
$$ 590528 575423 562792 551617 540795 530210 520728 512931 506371 500335 494762 489891 485454 480862
61780D80862m796m346l228k022j288j240j663j922j440l77L92K06o54j214p57
$$ 480862 476066 471720 468492 466470 465182 463942 462279 460357 458917 458540 458932 459138 458484 457270 456513
61765D56513N16J653J839J200O05N94Q41Q94R42J414K153K605K748L042L525L544
$$ 456513 457029 458682 460521 461721 462326 462920 463761 464655 465597 467011 469164 471769 474517 477559 481084 484628
61749D84628K715J534P86O55P16M92k01j265k349l071l364l494l629l588l093
$$ 484628 487343 488877 489663 490318 491034 491526 491325 490060 487711 484640 481276 477782 474153 470565 467472
61734D67472k207j344q78q00p04j43Q80J872K324K188J825J628J835K443L112
$$ 467472 465265 463921 463043 462243 461539 461396 462276 464148 466472 468660 470485 472113 473948 476391 479503
61719D79503L353L141L132L866M954N512N258M652L983L007J647L86l98j062k166
$$ 479503 482856 485997 489129 492995 497949 503461 508719 513371 517354 520361 522008 522394 521996 520934 518768
61704E18768l603m735n251n391n404n180m605l987l785m070m413m382l992l584
$$ 518768 515165 510430 505179 499788 494384 489204 484599 480612 476827 472757 468344 463962 459970 456386
61690D56386l370l231k988k628k225j813j499j512j907k350k398j995j463j035
$$ 456386 453016 449785 446797 444169 441944 440131 438632 437120 435213 432863 430465 428470 427007 425972
61676D25972o54k58m4k49q09j313j401j157j075j514k190k442k030j429j160j134
$$ 425972 425318 425060 425016 424767 423958 422645 421244 420087 419012 417498 415308 412866 410836 409407 408247 407113
61660D07113r04l45K27M75L09j62o29o96k74K65N85Q35J246J625J725J890K628
$$ 407113 406209 405864 406091 406566 406875 406713 406084 405388 405114 405379 405964 406799 408045 409670 411395 413285 415913
61643D15913L604L860L192K555K749L406L671L355K818K201J449Q15O41O30n0
$$ 415913 419517 423377 426569 429124 431873 435279 438950 442305 445123 447324 448773 449588 450229 450859 450809
61628D50809j746l800n164n358m686l810l162k713k197j556r95o11j51N81J304
$$ 450809 449063 445263 440099 434741 430055 426245 423083 420370 418173 416617 415622 415011 414860 415441 416745
61613D16745J597J494J387J317Q11l82j826k897l616m532n906p276q011q041p803
$$ 416745 418342 419836 421223 422540 423351 422969 421143 418246 414630 410098 404192 396916 388905 380864 373061
61598C73061p561p064o049m819m036l917l933l433k432j590j505k126k840l049
$$ 373061 365500 358436 352387 347568 343532 339615 335682 332249 329817 328227 326722 324596 321756 318707
61584C18707k693k253k168k280k075j534j327j914k704k651j577m31j59p17j395
$$ 318707 316014 313761 311593 309313 307238 305704 304377 302463 299759 297108 295531 295100 294941 294224 292829
61569B92829j694j615j393j298j456j585j145l3J027J214N60k41p77j182j425
$$ 292829 291135 289520 288127 286829 285373 283788 282643 282610 283637 284851 285411 285170 284393 283211 281786
61554B81786j041K01J798K991L426L126K221J052J96m2R3K88O39J283J904K094
$$ 281786 280745 280946 282744 285735 289161 292287 294508 295560 295756 295714 295807 296095 296734 298017 299921 302015
61538C02015J980K009K250K420K397K270K030J710J619J847J813J056K06K43Q34
$$ 302015 303995 306004 308254 310674 313071 315341 317371 319081 320700 322547 324360 325416 325622 325865 326699
61523C26699O41n85j449j031k56l62j049j335j365j980k872k806j631p14r65j610
$$ 326699 327340 326755 325306 324275 324019 323657 322608 321273 319908 317928 315056 312250 310619 309905 308940 307330
61507C07330j476n99J10K30J05J11K02J29k80r51j542j740j653j669j844j749
$$ 307330 305854 305255 305365 305595 305700 305811 306013 306142 305862 304911 303369 301629 299976 298307 296463 294714
61491B94714j101k02M54P60Q91Q76N76L3m30m80m8N89J032J093R47Q20P01N31
$$ 294714 293613 293411 293865 294625 295516 296392 296968 297001 296571 296091 296043 296632 297664 298757 299704 300524 301225 301756
61473C01756N51J058J846K264J958J306R17R92J249J233O58l27j072r08J13J184
$$ 301756 302307 303365 305211 307475 309433 310739 311656 312648 313897 315130 315788 315461 314389 313481 313594 314778
61457C14778J597J375R67N83J01n52j166j333p50M21J505J850J517J165J176J238
$$ 314778 316375 317750 318717 319300 319401 318849 317683 316350 315600 316021 317526 319376 320893 322058 323234 324472
61441C24472R29M09K51P50J621K329K563K518K751L527M377M562M036L509L423
$$ 324472 325401 325810 326061 326811 328432 330761 333324 335842 338593 342120 346497 351059 355095 358604 362027
61426C62027L388K855J939J119N77K67K99O65Q36L16m67m76O08J952K630K613
$$ 362027 365415 368270 370209 371328 371905 372172 372471 373136 373972 374288 373821 373345 373953 375905 378535 381148
61410C81148K468K510K540K223J417K63q49j573j968k399k950l192k826k255k190
$$ 381148 383616 386126 388666 390889 392306 392569 391720 390147 388179 385780 382830 379638 376812 374557 372367
61395C72367k745l295l260k658j821r26o7N20N72J61m17r93j517j743j324l78
$$ 372367 369622 366327 363067 360409 358588 357662 357595 358115 358687 358848 358431 357438 355921 354178 352854 352476
61379C52476M15N29K02J0R3J72J90L98Q04J037R10P69R79J378J507J202P37M59
$$ 352476 352891 353420 353622 353632 353725 353897 354087 354485 355289 356326 357236 358005 358984 360362 361869 363071 363808 364267
61361C64267N76J112J916K735L459M167M804M983M457L658L409M044N101N984
$$ 364267 364843 365955 367871 370606 374065 378232 383036 388019 392476 396134 399543 403587 408688 414672
61347D14672O675P542Q654R550R739R171Q117O798N385M265L933M440N217N693
$$ 414672 421347 428889 437543 447093 456832 466003 474120 480918 486303 490568 494501 498941 504158 509851
61333E09851N851N898N653M718L256J986J229M91p52k235l256l584l604l716l968
$$ 509851 515702 521600 527253 531971 535227 537213 538442 538933 538181 535946 532690 529106 525502 521786 517818
61318E17818m136l925l156k068j236r16o72J6J006J812K422L243M278N051N509
$$ 517818 513682 509757 506601 504533 503297 502381 501709 501725 502731 504543 506965 510208 514486 519537 525046
61303E25046O294P895R903J1486J2144J1690R991P235M176J555o10k704m705o174
$$ 525046 531340 539235 549138 560624 572768 584458 594449 601684 605860 607415 606805 604101 599396 593222
61289E93222o940p288p455p467p489p836q399q574p992o904n716m567l610l184
$$ 593222 586282 578994 571539 564072 556583 548747 540348 531774 523782 516878 511162 506595 502985 499801
61275D99801l216k836j266J088L016L853L950L856L639L256K981L117L564M011
$$ 499801 496585 493749 492483 493571 496587 500440 504390 508246 511885 515141 518122 521239 524803 528814
61261E28814M324M652N241O301P828R461J0710J1429J1760J1676J0892R390P632
$$ 528814 533138 537790 543031 549332 557160 566621 577331 588760 600520 612196 623088 632478 640110
61248F40110O087M936M340M417M628L859J704p03j927j995k158l062m033m312
$$ 640110 646197 651133 655473 659890 664518 668377 670081 669378 667451 665456 663298 660236 656203 651891
61234F51891m202m487n263n878n781n064m199l569l199k880k470k000j456o54
$$ 651891 647689 643202 637939 632061 626280 621216 617017 613448 610249 607369 604899 602899 601443 600789
61220F00789L67J114J138P73Q30J543K272K338J842J441J729K837M277M993M042
$$ 600789 601156 602270 603408 604181 605011 606554 608826 611164 613006 614447 616176 619013 623290 628283 632325
61205F32325J577j022k372k251j456p63k94K60J169K434L918N627P763J0361J3013
$$ 632325 633902 632880 630508 628257 626801 626038 625744 626004 627173 629607 633525 639152 646915 657276 670289
61190F70289J5229J6983J8420J9078J8079J5304J1882R091P125N361L500J946
$$ 670289 685518 702501 720921 739999 758078 773382 785264 794355 801480 806841 810341 812287
61178H12287J227J438K167K679K284Q92q07j981k441k650l088l872m888n957o846
$$ 812287 813514 814952 817119 819798 822082 822974 822167 820186 817745 815095 812007 808135 803247 797290 790444
61163G90444p352p439p308p315p838r017j0592j2079j3107j3526j3222j2203j0781
$$ 790444 783092 775653 768345 761030 753192 744175 733583 721504 708397 694871 681649 669446 658665
61150F58665r376q057o561m816l049j415K2Q05K35j715m196o454q464j0228j1177
$$ 658665 649289 641232 634671 629855 626806 625391 625413 626218 626453 624738 620542 614088 605624 595396 584219
61135E84219j0882r830q767p620n904l842k249j339n38N25J630K637L802N156
$$ 584219 573337 563507 554740 547120 541216 537374 535125 533786 533248 533773 535403 538040 541842 546998
61121E46998O273P000P872R415J1419J3326J5004J6757J8705K0509K1716K2262
$$ 546998 553271 560271 568143 577558 588977 602303 617307 634064 652769 673278 694994 717256
61109G17256K2609K3339K4487K5391K5417K4720K4000K3532K2904K1701K0026
$$ 717256 739865 763204 787691 813082 838499 863219 887219 910751 933655 955356 975382
61098I75382J8033J5402J1663P001K292j722n098q345j1598j4399j6432j8115
$$ 975382 993415 1008817 1020480 1027481 1029773 1028051 1022953 1014608 1003010 988611 972179 954064
61086I54064k0068k2131k3457k3630k3146k2620k2079k1372k0759k0490k0206
$$ 954064 933996 911865 888408 864778 841632 819012 796933 775561 754802 734312 714106
61075G14106j9411j8236j7193j6329j5273j3928j2552j1252r941q697p605o367
$$ 714106 694695 676459 659266 642937 627664 613736 601184 589932 579991 571294 563689 557322
61063E57322m672k880j683j139o37J83J086J843K505L107L623M253N178O139O867
$$ 557322 552650 549770 548087 546948 546311 546494 547580 549423 551928 555035 558658 562911 568089 574228 581095
61048E81095P741R227J0857J1774J2203J3220J4969J6383J7054J8046K0244K3072
$$ 581095 588836 598063 608920 620694 632897 646117 661086 677469 694523 712569 732813 755885
61036G55885K5575K7675K9522L0699L1114L1808L3706L6150L7767L8230L8174
$$ 755885 781460 809135 838657 869356 900470 932278 965984 1002134 1039901 1078131 1116305
61025A116305L7941L7627L7922L9677M2781M6521N0784N5900O1591O7210P2854
$$ 1116305 1154246 1191873 1229795 1269472 1312253 1358774 1409558 1465458 1527049 1594259 1667113
61014A667113P9269Q7065R7214J11886J33213J61443J95827K37135K87529L48345
$$ 1667113 1746382 1833447 1930661 2042547 2175760 2337203 2533030 2770165 3057694 3406039
61004C406039M20660N08569O19302P58884R28870J124035J322263J469002J481535
$$ 3406039 3826699 4335268 4954570 5713454 6642324 7766359 9088622 10557624 12039159
60995A2039159J293335R14259M48477M1821j99791k51261j48547M6963K56208
$$ 12039159 13332494 14246753 14695230 14737051 14537260 14285999 14137452 14184415 14440623
60986A4440623L77309L12583K9212m03651q48720j181705j350292j372283j296111
$$ 14440623 14817932 15130515 15159727 14756076 13907356 12725651 11375359 10003076 8706965
60977H706965j167753j020321q74936p42352o25686n24916m39283l66815l04707
$$ 8706965 7539212 6518891 5643955 4901603 4275917 3751001 3311718 2944903 2640196
60968B640196k51572k07941j73970j47974j27665j11533r8398q7032p6994o8733
$$ 2640196 2388624 2180683 2006713 1858739 1731074 1619541 1521143 1434111 1357117 1288384
60958A288384o2125n5796m8693m1371l4946k9607k5034k1460j9289j8137j7198
$$ 1288384 1226259 1170463 1121770 1080399 1045453 1015846 990812 969352 950063 931926 914728
60947I14728j6191j5149j3732j1646r392p646o214m464k600j447j128r58o91q40
$$ 914728 898537 883388 869656 858010 848618 840972 834758 830294 827694 826247 825119 824161 823470 822630
60933H22630j599k413k949l578m442m874m325l301k655k367j629M3K252M210N433
$$ 822630 821031 818618 815669 812091 807649 802775 798450 795149 792494 790127 788498 788541 790793 795003 800436
60918H00436O077O733P803R013R861J0501J1675J3610J5566J6805J7417J7817
$$ 800436 806513 813246 821049 830062 839923 850424 862099 875709 891275 908080 925497 943314
60906I43314J7943J7642J7274J7149J6688J5057J2499J0144Q478O765M281J297
$$ 943314 961257 978899 996173 1013322 1030010 1045067 1057566 1067710 1076188 1082953 1087234 1088531
60894A088531j548m159o750r191j1181j2801j4403j6045j7510j8710j9700k0410
$$ 1088531 1086983 1082824 1076074 1066883 1055702 1042901 1028498 1012453 994943 976233 956533 936123
60882I36123k0723k0780k0777k0572j9895j8966j8363j8168j7774j6784j5596
$$ 936123 915400 894620 873843 853271 833376 814410 796047 777879 760105 743321 727725
60871G27725j4711j3911j2673j1124r936r337q881q244p624p167o613n845n263
$$ 727725 713014 699103 686430 675306 665370 656033 647152 638908 631284 624117 617504 611659 606396
60858F06396n211n444n647o031o829p551p496o793o272o284o415o310o107n835
$$ 606396 601185 595741 590094 584063 577234 569683 562187 555394 549122 542838 536423 530113 524006 518171
60844E18171n249m419l873l787l713l410l344l891m629m965n001n176n539n887
$$ 518171 512922 508503 504630 500843 497130 493720 490376 486485 481856 476891 471890 466714 461175 455288
60830D55288o250o614o594n989n264m810m119k547o06N04N46M36P86J213J341
$$ 455288 449038 442424 435830 429841 424577 419767 415648 413101 412495 412999 413545 413981 414767 415980 417321
60815D17321J532K122K687K601J906J207R85J331J935K212J767R68N80P11O83
$$ 417321 418853 420975 423662 426263 428169 429376 430361 431692 433627 435839 437606 438574 439154 439865 440548
60800D40548J91j16L04R00P56j13q60r78p78p30r30j195j377j471j642j985k206
$$ 440548 440739 440623 440927 441827 442583 442470 441610 440632 439854 439124 438194 436999 435622 434151 432509 430524 428318
60783D28318j847j071p89j640l159m381m964n127m941m290l450k878k523j954
$$ 428318 426471 425400 424611 422971 419812 415431 410467 405340 400399 396109 392659 389781 387258 385304
60769C85304j233r08j045j034n70j09L5L16J156K034K145J573J065Q76N74J9k67
$$ 385304 384071 383163 382118 381084 380514 380405 380440 380756 381912 383946 386091 387664 388729 389605 390179 390198 389931
60752C89931M3N41P46Q59J341K111K675K874L020L282L448L388L287L223K820
$$ 389931 389974 390515 391261 392120 393461 395572 398247 401121 404141 407423 410871 414259 417546 420769 423589
60737D23589J674o6j775k957l545l749l849m140m712n302n491n157m563m027l671
$$ 423589 425263 425197 423422 420465 416920 413171 409322 405182 400470 395168 389677 384520 379957 375930 372259
60722C72259l544l742m230m704m788m374l670k918k221j631j255j172j207j047
$$ 372259 368715 364973 360743 356039 351251 346877 343207 340289 338068 336437 335182 334010 332803 331756
60708C31756o15k55k89n06l82J53N78N11K28R6q3o80j415j579r90j80M85J205
$$ 331756 331141 330886 330597 330091 329709 329862 330440 330951 331179 331275 331192 330512 329097 327518 326528 326348 326833 328038
60690C28038K049K430J859Q86O43J482K525K729K046J357J420K216L249M166M850
$$ 328038 330087 332517 334376 335262 335905 337387 339912 342641 344687 346044 347464 349680 352929 357095 361945
60675C61945N189N082M723M472M325L995L599L791M678N230M482K947J910J530
$$ 361945 367134 372216 376939 381411 385736 389731 393330 397121 401799 407029 411511 414458 416368 417898
60661D17898P42q38k155k369k178k627l418l489k714j909j379o53L49R53Q15M92
$$ 417898 418640 417802 415647 413278 411100 408473 405055 401566 398852 396943 395564 394911 395260 396213 397028 397520
60645C97520N01O00M57L17M49L93n07k062l403m053m279m426m451m289m147m110
$$ 397520 398021 398621 399078 399395 399844 400237 399730 397668 394265 390212 385933 381507 377056 372767 368620 364510
60629C64510l786k749j290k84k35o50n76L00J281J450P05j44l02J58N05K86j10
$$ 364510 360724 357975 356685 356401 356166 355516 354940 355240 356521 357971 358676 358532 358230 358388 358893 359179 359069
60612C59069J1P56J463J460P98J18j30o7j2K3L00Q74J414J582J495J573J933K192
$$ 359069 359080 359836 361299 362759 363557 363675 363545 363478 363466 363489 363789 364663 366077 367659 369154 370727 372660 374852
60594C74852J980J520J334J486J511J187R02R41Q17j18j570k462k283j716j654
$$ 374852 376832 378352 379686 381172 382683 383870 384772 385713 386530 386412 384842 382380 380097 378381 376727
60579C76727j952j673l69J317K395K623K614K999L724M314M665N226O330P695
$$ 376727 374775 373102 372733 374050 376445 379068 381682 384681 388405 392719 397384 402610 408940 416635
60565D16635Q865R827J0733J1194J0496Q580O325M552L084J129j625m574o738
$$ 416635 425500 435327 446060 457254 467750 476330 482655 487207 490291 491420 489795 485221 478483
60552D78483p503o987n836m702l726k538q03J306L261M667N619O565P796R107
$$ 478483 470980 463993 458157 453455 449729 447191 446388 447694 450955 455622 461241 467806 475602 484709
60538D84709J0014J0379J0636J1220J1992J2443J2250J1262R179N850J853j698
$$ 484709 494723 505102 515738 526958 538950 551393 563643 574905 584084 589934 591787 590089
60526E90089m122n551o361o644o409n841n158m521m165m220m309l747k360p23
$$ 590089 585967 580416 574055 567411 561002 555161 550003 545482 541317 537097 532788 529041 526681 525958
60512E25958N34J280J615J533J206J067J356J826K313L168M887P550J0923J4756
$$ 525958 526492 527772 529387 530920 532126 533193 534549 536375 538688 541856 546743 554293 565216 579972
60498E79972J8762K2582K6153K9778L3569L7093L9779M1349M1649M0405L7422
$$ 579972 598734 621316 647469 677247 710816 747909 787688 829037 870686 911091 948513
60487I48513L2694K6157J7717P795k661j2904k2588l1031l7071m0249m1467m1890
$$ 948513 981207 1007364 1025081 1032876 1030215 1017311 994723 963692 926621 886372 844905 803015
60475H03015m1613m0035l7052l3212k9103k5252k2241k0113j8045j5385j2698
$$ 803015 761402 721367 684315 651103 622000 596748 574507 554394 536349 520964 508266
60464E08266j1028j0430j0065r485q887q261p262n934m788m091l740l745m105
$$ 508266 497238 486808 476743 467258 458371 450110 442848 436914 432126 428035 424295 420550 416445
60451D16445m314l870l135k844k841k345j454j165j723k095j585q42o62q00o88
$$ 416445 412131 408261 405126 402282 399441 397096 395642 394477 392754 390659 389074 388232 387570 386770 386082
60436C86082m65m49l15L11R23P40j25q58j119j203j230r23k23M99R49J093Q70
$$ 386082 385617 385168 384853 385164 386087 386827 386702 385844 384725 383522 382292 381369 381146 381645 382594 383687 384557
60419C84557J59p98j430j427j013m91K04J209K213K532J779L75p64j004m24M43
$$ 384557 384716 383918 382488 381061 380048 379557 379761 380970 383183 385715 387494 387869 387105 386101 385677 386120
60403C86120J166J589J740J778J958K348K700K739K473K051J519J056J167K127
$$ 386120 387286 388875 390615 392393 394351 396699 399399 402138 404611 406662 408181 409237 410404 412531
60389D12531L343L853L457K864K669K714K592K181J544P74K17L83J278K158K324
$$ 412531 415874 419727 423184 426048 428717 431431 434023 436204 437748 438522 438739 439122 440400 442558 444882
60374D44882J887J479J444J623J748J776J815J937J964J542O65k3J95J144J826
$$ 444882 446769 448248 449692 451315 453063 454839 456654 458591 460555 462097 462762 462739 462934 464078 465904
60359D65904J588Q36M19P08J516K577L734M852N767O356O606O784P380Q502R358
$$ 465904 467492 468328 468747 469455 470971 473548 477282 482134 487901 494257 500863 507647 515027 523529 532887
60344E32887Q876O953M642K864J439l70k756n180o951p704p520o867o254n822
$$ 532887 541763 548716 553358 556222 557661 557291 554535 549355 542404 534700 527180 520313 514059 508237
60330E08237n398m951m633m351l830l149k732k708k786k928l447m197m396l700
$$ 508237 502839 497888 493255 488904 485074 481925 479193 476485 473699 470771 467324 463127 458731 455031
60316D55031k808k389k051j006O33K118L221M351N636O735P645Q959J1110J3850
$$ 455031 452223 449834 447783 446777 447410 449528 452749 457100 462736 469471 477116 486075 497185 511035
60302E11035J6676J9348K1613K2754K1805J8395J3192P371J607m203j0063j5106
$$ 511035 527711 547059 568672 591426 613231 631626 644818 652189 653796 649593 639530 624424
60290F24424j8222j9287j9103j8126j6100j3126j0154p918o096m207k576j627
$$ 624424 606202 586915 567812 549686 533586 520460 510306 502388 496292 492085 489509 487882
60278D87882r29L3O48lj390j895j077l29r18k384l501l975m348m768m733l999
$$ 487882 486953 486986 487634 487631 486241 484346 483269 482940 482022 479638 476137 472162 467814 463046 458313 454314
60262D54314l069k584k562k387j552l46K96j84j225j699j223m86k39l97m04r8
$$ 454314 451245 448661 446099 443712 442160 441814 442110 441926 440701 439002 437779 437293 437054 436657 436253 436155
60246D36155J60J22k7O8N17J072J356J169O74K72K30N01Q35J021R83P99O66P71
$$ 436155 436315 436437 436410 436478 436995 438067 439423 440592 441266 441538 441768 442269 443104 444125 445108 445907 446573 447344
60228D47344J111J532J892K179K394K483K414K257K124K071K082K176K450L001
$$ 447344 448455 449987 451879 454058 456452 458935 461349 463606 465730 467801 469883 472059 474509 477510
60214D77510L776M546N071N322N454N597N743N921O262O763P177P243P080P013
$$ 477510 481286 485832 490903 496225 501679 507276 513019 518940 525202 531965 539142 546385 553465 560478
60200E60478P089O969O520O208O511P065O894N704M467M176M415L879K278Q52
$$ 560478 567567 574536 581056 587264 593775 600840 607734 613438 617905 622081 626496 630375 632653 633505
60186F33505O48J156J157L29q11k090l810n725o864o587n344m141l683m025m600
$$ 633505 634153 635309 636466 636795 635984 633894 630084 624359 617495 610908 605564 601423 597740 593715 589115
60171E89115m637l986l456l711m126l547k161j478k222l334l586l161k887k757
$$ 589115 584478 580492 577036 573325 569199 565652 563491 562013 559791 556457 552871 549710 546823 544066
60157E44066k204j286n72j55L77J066J510J583J620J816K000K021J959J840J530
$$ 544066 541862 540576 540004 539849 540226 541292 542802 544385 546005 547821 549821 551842 553801 555641 557171
60142E57171R77L66M2L22J276K572L804M995O375P649Q033P305O228N504M917
$$ 557171 558148 558514 558556 558878 560154 562726 566530 571525 577900 585549 593582 600887 607115 612619 617536
60127F17536L980K901K203J824J289N53k4k89l16k7O42J347J709J891K316K981
$$ 617536 621516 624417 626620 628444 629733 630286 630262 629973 629657 629630 630272 631619 633328 635219 637535 640516
60111F40516L564L924M009L520K368J227Q86J172J223O96ko46j548k901m390n638
$$ 640516 644080 648004 652013 655533 657901 659128 660014 661186 662409 663105 663103 662457 660909 658008 653618 647980
60095F47980o469o662n946m458k754j336m61l12q78j676k055j801j100j19R74
$$ 647980 641511 634849 628903 624445 621691 620355 619894 619582 618704 617028 614973 613172 612072 611953 612927
60080F12927J743J875J581J190N93k48o49m3O83j18k658n230o262o003n661n718
$$ 612927 614670 616545 618126 619316 619909 619661 619012 618969 619652 619534 616876 611646 605384 599381 593720 588002
60064E88002n789n611n441n580n925o025n531m719m433n073n815n458l975k572
$$ 588002 582213 576602 571161 565581 559656 553631 548100 543381 538948 533875 528060 522602 518627 516055
60050E16055k086k091j788j027o5R96K056K789L089L357L956M718N288N618N826
$$ 516055 513969 511878 510090 509063 508998 509994 512050 514839 517928 521285 525241 529959 535247 540865 546691
60035E46691N936O055O420O855O615N206L117J279N0r12j930k916l669m229m816
$$ 546691 552627 558682 565102 571957 578572 583778 586895 588174 588224 587312 585382 582466 578797 574568 569752
60020E69752n541o249o684o822o914p063p011o557o003n725n573n154m572m280
$$ 569752 564211 557962 551278 544456 537542 530479 523468 516911 510908 505183 499610 494456 489884 485604
60006D85604m285m205m069m302m749m572l464k243j726j701j494j022o87o31o19
$$ 485604 481319 477114 473045 468743 463994 459422 455958 453715 451989 450288 448794 447772 447085 446454 445835
59991D45835m42L1R05J948K589K650K767L599M884N768N913N726N574N240M277
$$ 445835 445393 445424 446329 448277 450866 453516 456283 459882 464766 470534 476447 482173 487747 492987 497264
59976D97264K573N60j019j634j481j325j765k663l480l924m046l934l575k993
$$ 497264 499837 500397 499378 497744 496263 494938 493173 490510 487030 483106 479060 475126 471551 468558
59962D68558k288j556q65k88J22L17K14k00p73j268j550j542j154m74J62N67J006
$$ 468558 466270 464714 463849 463561 463683 464000 464214 464014 463241 461973 460423 458881 457727 457253 457415 457982 458988
59945D58988J707K325K396K190K369K879K923K165J197O09K67j27m64o47r15j337
$$ 458988 460695 463020 465416 467606 469975 472854 475777 477942 479139 479748 480015 479888 479424 478777 477862 476525
59929D76525j454r61k20K97O74J168J620J799J908K208K512K638K984L936M988
$$ 476525 475071 474110 473890 474187 474861 476029 477649 479448 481356 483564 486076 488714 491698 495634 500622
59914E00622N237M655M204M564N386N883N666M726L096R03j312k787l133k736
$$ 500622 505859 510514 514718 519282 524668 530551 536217 540943 544039 544942 543630 540843 537710 534974
59900E34974k439k713l194l185k571j897j610j545j315q20j38P65J925L182M310
$$ 534974 532535 529822 526628 523443 520872 518975 517365 515820 514505 513685 513547 514312 516237 519419 523729
59885E23729N201N812O131O300O426O273N541M624M542N726P242P726O821N369
$$ 523729 528930 534742 540873 547173 553599 559872 565413 570037 574579 580305 587547 595273 602094 607463
59871F07463M259L527K485N71j972m169n233n396n540o036o349n938n024m211
$$ 607463 611722 615249 617734 618305 616333 612164 606931 601535 595995 589959 583610 577672 572648 568437
59857E68437l782l645l609l374k597j287J56J502K927M439N559N886N476M380
$$ 568437 564655 561010 557401 554027 551430 550143 550299 551801 554728 559167 564726 570612 576088 580468
59843E80468K393j78k056k120p75N14Q60N05j73j289k925m545n335m910l548j904
$$ 580468 582861 582683 580627 578507 577732 578246 579106 579611 579438 578149 575224 570679 565344 560434 556886 554982
59827E54982n57L48J106J977K731K784J819J73j389k306k634k828l131l330l217
$$ 554982 554425 554773 555879 557856 560587 563371 565190 565363 563974 561668 559034 556206 553075 549745 546528
59812E46528k966k719k110q26M96O73o31k464l691l956l507k757k242k337k738
$$ 546528 543562 540843 538733 537907 538403 539076 538445 535981 532290 528334 524827 522070 519828 517491 514753
59797E14753k773k443k458k994l252k731k054j925j989j484m66L67O87O78M92
$$ 514753 511980 509537 507079 504085 500833 498102 496048 494123 492134 490650 490184 490551 491238 491916 492408
59782D92408K07K0K1O4K34R04J890K240J479M49J72M08K50l55o41l21R7J57q7
$$ 492408 492615 492635 492656 492720 492954 493858 495748 497988 499467 499916 500088 500496 500746 500391 499750 499429 499526 499683 499596
59763D99596m06n38j49P42J522J688J549J631J832J737J442J314J308J302J676
$$ 499596 499190 498652 498503 499245 500767 502455 504004 505635 507467 509204 510646 511960 513268 514570 516246
59748E16246K765M104N027N656O315O468N466M026L673M570N167M235K230M39
$$ 516246 519011 523115 528142 533798 540113 546581 552047 556073 559746 564316 569483 573718 575948 576387
59734E76387l16J13J272K085J611J84q39p37n8M83Q43J087Q99K33k53J5P38J182
$$ 576387 576071 576184 577456 579541 581152 581336 580497 579760 579702 580185 581028 582115 583014 583247 582994 583009 583747 584929
59716E84929J044N56O6j69n2K74N72P48P84O15L91N76J276J855J822J727K327
$$ 584929 585973 586529 586595 586426 586374 586648 587220 587968 588752 589367 589758 590334 591610 593465 595287 597014 599341
59699E99341L145K996J805P71O10Q17R37J353K298L201L567L618L438K468N51
$$ 599341 602486 605482 607287 608058 608668 609485 610422 611775 614073 617274 620841 624459 627897 630365 630916
59684F30916j309k124k126k058j891j255n76p82j958l242l990m352m699n157n742
$$ 630916 629607 627483 625357 623299 621408 620153 619577 618795 616837 613595 609605 605253 600554 595397 589655
59669E89655o379o690o223n069l911l331l317l497l525l197k463j546r06q30r93
$$ 589655 583276 576586 570363 565294 561383 558052 554735 551238 547713 544516 542053 540507 539601 538771 537778
59654E37778o58N40K103L189L571L732L986M077L842L702L949L995L013J110q08
$$ 537778 537120 537660 539763 542952 546523 550255 554241 558318 562160 565862 569811 573806 576819 577929 577121
59639E77121k146k978l487l749m035m594n051m735l684k611j926j437j148j443
$$ 577121 574975 571997 568510 564761 560726 556132 551081 546346 542662 540051 538125 536688 535540 534097
59625E34097k211k626k228j593j470j800k034k032k125k578l324m020m226l789
$$ 534097 531886 529260 527032 525439 523969 522169 520135 518103 515978 513400 510076 506056 501830 498041
59611D98041l147k876k866k407j190K67J383K193K979L674L914L419K184N42r11
$$ 498041 494894 492018 489152 486745 485555 485822 487205 489398 492377 496051 499965 503384 505568 506110 505199
59596E05199j759k086k125j805j085m47l52m19M6Q51J109O61K55K22J3o82j298
$$ 505199 503440 501354 499229 497424 496339 495892 495540 495121 495167 496018 497127 497788 498043 498265 498278 497596 496298
59579D96298j343j103j052j305j940l031m010l948k918k164k356k659k113j072
$$ 496298 494955 493852 492800 491495 489555 486524 482514 478566 475648 473484 471128 468469 466356 465284
59565D65284m88n09o11n36l46pM12N59L64K43L74L81J85L60J072J538J242Q75
$$ 465284 464796 464287 463676 463140 462794 462787 463199 463758 464122 464365 464739 465120 465305 465665 466737 468275 469517 470392
59547D70392J254K053K534K793L334L982M331M754N910P602R136J0558J2621J5760
$$ 470392 471646 473699 476233 479026 482360 486342 490673 495427 501337 508939 518075 528633 541254 557014
59533E57014J9696K3480K5164K2329J4440M343l875q410j0165j0208q543n434
$$ 557014 576710 600190 625354 647683 662123 666466 662591 654181 644016 633808 625265 619831
59521F19831k174J78J785L143M075M144L349J951J31j827l507m854o194p584q697
$$ 619831 617657 617835 619620 622763 626838 630982 634331 636282 636413 634586 631079 626225 620031 612447 603750
59506F03750r410r956j0320j0143r457q844q587q236p358o235n444n103m878m425
$$ 603750 594340 584384 574064 563921 554464 545620 537033 528797 521439 515204 509760 504657 499779 495354
59492D95354l630k660j879j424q52L89K019K983K607J339K01j21M96J772L103
$$ 495354 491724 489064 487185 485761 484909 485298 487317 490300 492907 494246 494447 494326 494822 496594 499697
59477D99697L880M057M201M789N640O284O614O937P416P633O849M831K386P35
$$ 499697 503577 507634 511835 516624 522264 528548 535162 542099 549515 557148 563997 568828 571214 571949
59463E71949K20j0p02j370j044J85J230J531J737K652M275O137P917R316R915
$$ 571949 572169 572159 571457 570087 569043 569228 570458 571989 573726 576378 580653 586790 594707 604023 613938
59448F13938R752R661J0430J1762J2458J1703R811P621N392K525j552o313j0261
$$ 613938 623690 633351 643781 655543 668001 679704 689515 697136 702528 705053 703501 697188 686927
59435F86927j2247j2471j1966j1374j0655r725q799q048p411o846o289n379l704
$$ 686927 674680 662209 650243 638869 628214 618489 609690 601642 594231 587385 581096 575717 572013
59422E72013j432P78K613M369O261Q069R786J1992J5074J8447K1104K2671K3687
$$ 572013 570581 571359 573972 578341 584602 592671 602457 614449 629523 647970 669074 691745 715432
59409G15432K5048K7434L0547L2261K9083J8849L349j2256k3016k7145k5820k1140
$$ 715432 740480 767914 798461 830722 859805 878654 882003 869747 846731 819586 793766 772626
59397G72626j4651p153Q52Q383J3282J2801N682o153j8403k7147l0929l0622k7949
$$ 772626 757975 750822 751674 760057 773339 786140 791822 785669 767266 740119 709190 678568 650619
59384F50619k4237k0096j5791j1809q851p125n961m593l104k021j151K31J957
$$ 650619 626382 606286 590495 578686 569835 562710 556749 552156 549052 547031 545880 546111 548068
59371E48068K823K316J597J924K879L212K849K831L456L784L226K596L058M777
$$ 548068 550891 553207 554804 556728 559607 562819 565668 568499 571955 575739 578965 581561 584619 589396
59357E89396O947Q634R239Q734P897P876R112J0894J2207J2725J2854J3162J3987
$$ 589396 596343 604977 614216 622950 630847 638723 647835 658729 670936 683661 696515 709677 723664
59344G23664J5318J6753J7779J8148J7862J6879J5216J3271J1528R944P958N198
$$ 723664 738982 755735 773514 791662 809524 826403 841619 854890 866418 876362 884320 889518
59332H89518J808j813n207p903r818j1512j3497j5416j6513j6762j6771j6717
$$ 889518 891326 889513 884306 876403 866585 855073 841576 826160 809647 792885 776114 759397
59320G59397j6177j5020j3590j2039j0324q848q073p471o009l836k249j676j064
$$ 759397 743220 728200 714610 702571 692247 683399 675326 667855 661846 658010 655761 654085 653021
59307F53021K94J666K415L344N496Q454J0752J1276R557N645N69l892o786q743
$$ 653021 653315 654981 657396 660740 666236 674690 685442 696718 706275 711920 712489 708597 701811 693068
59293F93068j0462j1407j0865r350p882o652n475m767m933n359n148m396l749
$$ 693068 682606 671199 660334 650984 643102 636450 630975 626208 621275 615916 610768 606372 602623
59280F02623l213k416j513p78O9J199J956J957K199L874O640R190J0981J2172
$$ 602623 599410 596994 595481 594703 594772 595971 597927 599884 602083 605957 612597 621787 632768 644940
59266F44940J2569J2064J1497J1546J1308R592P073N308M067J704j939n210p375
$$ 644940 657509 669573 681070 692616 703924 713516 720589 725897 729964 731668 729729 724519 717144
59253G17144r501j2005j3477j2926j1457j0543j0051r122p818o639n317l354j149
$$ 717144 707643 695638 682161 669235 657778 647235 637184 628062 620244 613605 608288 604934 603785
59240F03785M82J469K292K966L035K439J784J800K784M372N691O030N440M491
$$ 603785 604267 605736 608028 610994 614029 616468 618252 620052 622836 627208 632899 638929 644369 648860
59226F48860L506K443J329K19j139k885m466n280n682o390p063o653n210m052
$$ 648860 652366 654809 656138 656357 655218 652333 647867 642587 636905 630515 623452 616799 611589 607537
59212F07537l800l501k265o78J43P9j94l14m13n81p26p44n57j78J68L89Q39J732
$$ 607537 603737 600236 597971 597293 597436 597515 597321 597007 596594 596013 595287 594543 593986 593808 593976 594365 595204 596936
59194E96936K426K065R00L5p1R9L88J247K472K881J858L55k70L38J610K772L119
$$ 596936 599362 601427 602327 602362 602291 602390 602778 604025 606497 609378 611236 611591 611321 611659 613269 616041 619160
59177F19160K434J501J396J960J964J062M47R71J891K305K671L851N484O540O944
$$ 619160 621594 623095 624491 626451 628415 629477 629924 630895 632786 635091 637762 641613 647097 653637 660581
59162F60581P476Q407R170R336R052Q549P730O339M239J726l99j472j812k487
$$ 660581 668057 676464 685634 694970 704022 712571 720301 726640 730879 732605 732206 730734 728922 726435
59148G26435l962n611o713p258p513p515p350p258p163o780o451o983q279r087
$$ 726435 722473 716862 710149 702891 695378 687863 680513 673255 666092 659312 652861 645878 637599 628512
59134F28512q632p542o575n536m258l581m234n391n521m249k472j020j36J67J85
$$ 628512 619880 612338 605763 600227 595969 592388 588154 582763 577242 572993 570521 569501 569365 569532 569717
59119E69717P12K290M341N810O517P192Q338R638J0432J0308R465Q728Q936R951
$$ 569717 570429 572719 577060 582870 589387 596579 604917 614555 624987 635295 644760 653488 662424 672375
59105F72375J0741J0757J0546J0636J0591R865Q843Q150P522O366M924L842K927
$$ 672375 683116 693873 704419 715055 725646 735511 744354 752504 760026 766392 771316 775158 778085
59092G78085J477l23j418j424j137j266j466j064j89L32r3j266k581l793n196
$$ 778085 779562 779239 777821 776397 775260 773994 772528 771464 771275 771607 771514 770248 767667 763874 758678
59077G58678p014q819j0033j0839j1885j3039j3330j2422j1221j0490r723q171
$$ 758678 751664 742845 732812 721973 710088 697049 683719 671297 660076 649586 639863 631692
59065F31692o249m965m480m237m093m327m666m417l539k735k404k251k019j921
$$ 631692 625443 620478 615998 611761 607668 603341 598675 594258 590719 587984 585580 583329 581310 579389
59051E79389k152k550k903l137l045k361j248l71k41o52r45p21k05L1k56o68o24
$$ 579389 577237 574687 571784 568647 565602 563241 561993 561622 561381 560729 559784 559063 558858 558889 558633 557965 557341
59034E57341n7O12J103J472J701J676J635K145L318M605N562O344P200Q047Q821
$$ 557341 557284 557896 558999 560471 562172 563848 565483 567628 570946 575551 581113 587457 594657 602704 611525
59019F11525R751J0963J2302J3728J5290J6428J6138J4216J1686R445P215M433
$$ 611525 621276 632239 644541 658269 673559 689987 706125 720341 732027 741472 748687 753120
59007G53120J455r01k449l465l832l224j880m42Q75K349M119N922P353Q048P820
$$ 753120 754575 753674 751225 747760 743928 740704 738824 738382 739257 741606 745725 751647 759000 767048 774868
58992G74868O908N826M729L296J497j15j130j815k554l370m325n751p552q922
$$ 774868 781776 787602 792331 795627 797124 797009 795879 794064 791510 788140 783815 778064 770512 761590
58978G61590r316r085q679p813o066l722j406N64J969K525K565L174M901O914
$$ 761590 752274 743189 734510 726697 720631 716909 715503 716067 718036 720561 723126 726300 731201 738115
58964G38115Q172Q773R404J0107J0519J0710J0870J0664R824Q836Q049O666L740
$$ 738115 746287 755060 764464 774571 785090 795800 806670 817334 827158 835994 844043 850709 854449
58951H54449k36l944p079j0281j3396j5233j5294j4567j4146j3888j3014j1381
$$ 854449 854213 850269 843190 832909 819513 804280 788986 774419 760273 746385 733371 721990
58939G21990r641q429p759p172o292n246m422l929l612l566m063m869n238m908
$$ 721990 712349 703920 696161 688989 682697 677451 673029 669100 665488 661922 657859 652990 647752 642844
58925F42844m411m134l771l109k582k540k573k195j565j053p00o05j016j592j419
$$ 642844 638433 634299 630528 627419 624837 622297 619724 617529 615964 614911 614211 613606 612590 610998 609579
58910F09579l64N54Q10J284K685M168M676M733N659P643R853J1791J3409J4452
$$ 609579 609215 609769 610579 611863 614548 618716 623392 628125 633784 641427 651280 663071 676480 690932
58896F90932J4853J5196J5708J5477J3748J1411R987R833J0542J2235J5005J7796
$$ 690932 705785 720981 736689 752166 765914 777325 787312 797145 807687 819922 834927 852723
58884H52723J9494K0664K2532K4646K5265K3797K1252J8377J4997J1201P575M040
$$ 852723 872217 892881 915413 940059 965324 989121 1010373 1028750 1043747 1054948 1062523 1066563
58872A066563j35m986r751j4072j8065k1247k2776k2784k2188k1239j9493j7184
$$ 1066563 1066428 1061442 1051691 1037619 1019554 998307 975531 952747 930559 909320 889827 872643
58860H72643j5158j3534j1839j0506j0588j1795j2466j1863j1018j0908j1237
$$ 872643 857485 843951 832112 821606 811018 799223 786757 774894 763876 752968 741731
58849G41731j1545j2070j2770j2721j1318r157p158n649m713m570n025n426n509
$$ 741731 730186 718116 705346 692625 681307 672150 664992 659343 654630 650060 645035 639609 634100
58836F34100n521n360m561l403k984l722m662m772m120l359k829k572k559k520
$$ 634100 628579 623219 618658 615255 612271 608549 603887 599115 594995 591636 588807 586235 583676 581156
58822E81156k127j505j038o47M2Q36J176J202J707K914M163M893N091M708L620
$$ 581156 579029 577524 576486 575839 575881 576717 577893 579095 580802 583716 587879 592772 597863 602571 606191
58807F06191K324J736K046K585K853K877K492J345k31j262j429j450j941k623
$$ 606191 608515 610251 612297 614882 617735 620612 623104 624449 624218 622956 621527 620077 618136 615513
58793F15513k909k685k334k422l279m464m934m265l224k500j573K24K301L677
$$ 615513 612604 609919 607585 605163 601884 597420 592486 588221 584997 582497 580924 581148 583449 587126
58779E87126M536N582O467O475O170O578P120O279M170K442J600M26j699l817
$$ 587126 591662 597244 603711 610186 616356 622934 630054 636333 640503 642945 644545 644971 643272 639455
58765F39455n167o127o899o959o328n842n643m944l738l169l587l805k881j268
$$ 639455 634288 628161 621262 614303 607975 602133 596490 591546 587808 584639 581052 577247 574366 573098
58751E73098K94J695K748L027K776K690K573J689O34R19K449L387L156L362M961
$$ 573098 573392 575087 577835 580862 583638 586328 588901 590590 591224 592143 594592 597979 601135 604497 609458
58736F09458O584O899O613O811O967O178M970M402M510M868N609O655P094O460
$$ 609458 616042 622941 629554 636365 643332 649510 654480 658882 663392 668260 673869 680524 687618 694078
58722F94078N615N315M966L850K511J809J582J312J216J708K632L899N842Q167
$$ 694078 699693 705008 709974 713824 716335 718144 719726 721038 722254 723962 726594 730493 736335 744502
58708G44502R549R210P891O540N078L242J397l00k408m997p223q888j1049j4074
$$ 744502 754051 763261 771152 777692 782770 786012 787409 787109 784701 779704 772481 763593 752544 738470
58694G38470j6595j7550j7790j8308j8302j6644j4094j2276j1252r803p621n691
$$ 738470 721875 704325 686535 668227 649925 633281 619187 606911 595659 585856 578235 572544
58682E72544m766m655m846m894m504l931l833m220m230l422k414j689q51K78R73
$$ 572544 567778 563123 558277 553383 548879 544948 541115 536895 532665 529243 526829 525140 524289 524567 525540
58667E25540Q95J006K209M120N990P840R797J1321J2029J2246J1964J0382P319
$$ 525540 526435 527441 529650 533770 539760 547600 557397 568718 580747 592993 604957 615339 622658
58654F22658L962J294j007l302m900n319n255n238m712l549l057m039n225n166
$$ 622658 626620 627914 626907 623605 618705 613386 608131 602893 598181 594632 591575 587536 582311 577145
58640E77145m413m310m674m423l571k981k739k251j331l8J827L935N020M440L234
$$ 577145 572732 568422 563748 559325 555754 552773 550034 547783 546452 546414 548241 552176 557196 561636 564870
58625E64870K568K105J155K59K44P14R60J348K420L543L979M353N533O969P679
$$ 564870 567438 569543 570698 570957 571201 571915 572875 574223 576643 580186 584165 588518 594051 601020 608699
58610F08699Q028Q834R462Q573O257L904K340J398Q32L81n91k341m020m713m583
$$ 608699 616727 625561 635023 643596 649853 653757 656097 657495 658327 658708 658117 655776 651756 647043 642460
58595F42460m260l948l887m526n369n003l344k287k799l069j208J779L760M724
$$ 642460 638200 634252 630365 625839 620470 615467 612123 609836 607037 603968 602760 604539 608299 613023
58581F13023O089P889R034R595J0501J1460J1329J0212R330R095Q944Q694Q499
$$ 613023 619112 627001 636035 645630 656131 667591 678920 689132 698462 707557 716501 725195 733694
58568G33694Q054P319P435R255J1732J3401J4710J7061K0246K2804K4426K6093
$$ 733694 741748 749067 756502 765757 777489 790890 805600 822661 842907 865711 890137 916230
58556I16230K8043K9368K9346K7793K4457J9540J4309R784N461O35l824o588p907
$$ 916230 944273 973641 1002987 1030780 1055237 1074777 1089086 1098870 1104331 1104966 1101142 1094554 1086647
58543A086647q829r188q234o606n891o730q840j2222j6582k0453k2584k3625k4686
$$ 1086647 1077818 1068630 1060396 1053790 1047899 1041169 1032329 1020107 1003525 983072 960488 936863 912177
58530I12177k5223k4071k1738j9571j7426j4282j0561p696n873m093k166p44J75
$$ 912177 886954 862883 841145 821574 804148 789866 779305 771609 765736 761643 759477 758733 758908
58517G58908J045J535J106K58l10j007k233l037k592j968k417l067k439j179j049
$$ 758908 759953 761488 762594 762852 762542 761535 759302 756265 753673 751705 749288 746221 743782 742603 741554
58502G41554k026k719k824k977k940k181j439j551j652o51N35N86K56Q38J467
$$ 741554 739528 736809 733985 731008 728068 725887 724448 722897 721245 720594 721129 721715 721971 722809 724276
58487G24276P67r8Q61K853L684L731N089P431Q473Q231R183J2058J4876J6353
$$ 724276 725043 724945 725806 728659 732343 736074 741163 748594 757067 765298 774481 786539 801415 817768
58473H17768J7189J7691J7127J5655J4145J1961P685J988k885o367r467j1841
$$ 817768 834957 852648 869775 885430 899575 911536 919221 921209 918324 911957 902490 890649
58461H90649j2098j0813r905r203o878l312r01J09K069N703Q959J0666J1886J2971
$$ 890649 878551 867738 857833 848630 841752 838440 837539 837648 839717 845420 854379 865045 876931 889902
58447H89902J2564J0466Q305O447L247j696o416r613j1984j3781j3843j1998r795
$$ 889902 902466 912932 921237 927684 930931 929235 922819 913206 901222 887441 873598 861600 851805
58434H51805q057o068l701j794j14K374M929N606M720M755O488Q304R596J1576
$$ 851805 843748 837680 833979 832185 832071 834445 839374 844980 849700 854455 860943 869247 878843 890419
58420H90419J4136J5297J4536J3465J2532J0215O225K326p43l981p140q446p991
$$ 890419 904555 919852 934388 947853 960385 970600 976825 979151 978408 974427 967287 958841 950850
58407I50850q112r488j0246r648r245r577r164p704o765o457m970k332q64q78
$$ 950850 942738 933250 923004 913356 904111 894534 885370 877666 870901 864444 859474 857142 856278 855400
58393H55400J76L065N224N276N173O097O167M162J991J323R97k86j721k603l731
$$ 855400 855576 858641 863865 869141 874314 880411 886578 890740 892731 894054 895051 894765 893044 890441 886710
58378H86710n089n100l541k181j331Q07M224O295O184O329P979R185Q881R007
$$ 886710 881621 876521 872980 870799 869468 870275 874499 880794 886978 893307 901286 910471 919352 928359
58364I28359J0684J2068J1993J2028J2986J3233J2407J2935J5675J7839J7493
$$ 928359 939043 951111 963104 975132 988118 1001351 1013758 1026693 1042368 1060207 1077700
58353A077700J6362J5976J4810J1685Q307O058L789J029l06M24R62L65R32L766
$$ 1077700 1094062 1110038 1124848 1136533 1144840 1150898 1154687 1155716 1155410 1155834 1156796 1157161 1158093 1161859
58339A161859O444P462Q814J1622J3492J2997J2657J4516J6745J7483J8037J9310
$$ 1161859 1168303 1175765 1184579 1196201 1209693 1222690 1235347 1249863 1266608 1284091 1302128 1321438
58327A321438J9191J6660J4498J4695J5069J3517J1565J0603Q677M579J067N02
$$ 1321438 1340629 1357289 1371787 1386482 1401551 1415068 1426633 1437236 1445913 1450492 1451559 1452061
58315A452061J063O87Q70L075N263N620O029Q294J0630J1304J2021J4326J6406
$$ 1452061 1453124 1453811 1454681 1457756 1463019 1468639 1474668 1482962 1493592 1504896 1516917 1531243 1547649
58302A547649J6811J7433J9616K1189K0621J9991K0749K0853J9213J8355J9515
$$ 1547649 1564460 1581893 1601509 1622698 1643319 1663310 1684059 1704912 1724125 1742480 1761995
58291A761995J9960J8420J7978K0120K1388J9827J9026K1525K3970K3362K2468
$$ 1761995 1781955 1800375 1818353 1838473 1859861 1879688 1898714 1920239 1944209 1967571 1990039
58280A990039K4186K6167K6026K6283K8989L1038L0139K9844L3206L7059L8130
$$ 1990039 2014225 2040392 2066418 2092701 2121690 2152728 2182867 2212711 2245917 2282976 2321106
58269B321106L9088M2824M6506M7286M8064N1581N4674N4640N5264O0074O5636
$$ 2321106 2360194 2403018 2449524 2496810 2544874 2596455 2651129 2705769 2761033 2821107 2886743
58258B886743O8093P0255P5374Q0159Q0983Q0750Q2599Q3267Q0007P7386P9585
$$ 2886743 2954836 3025091 3100465 3180624 3261607 3342357 3424956 3508223 3588230 3665616 3745201
58247C745201Q2854Q3309Q4974R1871R9574J03335J07256J16281J26584J33187
$$ 3745201 3828055 3911364 3996338 4088209 4187783 4291118 4398374 4514655 4641239 4774426
58237D774426J39603J50292J61396J68817J77368J91691K06521K16617K27461
$$ 4774426 4914029 5064321 5225717 5394534 5571902 5763593 5970114 6186731 6414192
58228F414192K44992K63939K78248K93504L16499L42357L65163L91063M26797
$$ 6414192 6659184 6923123 7201371 7494875 7811374 8153731 8518894 8909957 9336754
58219I336754M65856N00785N38312N87004O41598O95812P58158Q37561R26678
$$ 9336754 9802610 10303395 10841707 11428711 12070309 12766121 13524279 14361840 15288518
58210A5288518J018374J124553J258112J411372J574897J762029J990931K260061
$$ 15288518 16306892 17431445 18689557 20100929 21675826 23437855 25428786 27688847
58202B7688847K568828K944556L419749M003401M708598N586345O693184Q048443
$$ 27688847 30257675 33202231 36621980 40625381 45333979 50920324 57613508 65661951
58194F5661951R668135J1618904J3993728J6867988K0337434K4549459K9577263
$$ 65661951 75330086 86948990 100942718 117810706 138148140 162697599 192274862
58187A92274862L5208407M0808829M5206973M6560113M2628841L1925716J5202810
$$ 192274862 227483269 268292098 313499071 360059184 402688025 434613741 449816551
58180D49816551m185313k1792559l4358808m0992253m2654656m0948632l7332380
$$ 449816551 445631238 423838679 389479871 348487618 305832962 264884330 227551950
58173B27551950l2914066k8429021k4248306k0498291j7222800j4435442j2094224
$$ 227551950 194637884 166208863 141960557 121462266 104239466 89804024 77709800
58166G7709800j0125619q480792p130225o023674n101885m335527l714252l209571
$$ 77709800 67584181 59103389 51973164 45949490 40847605 36512078 32797826 29588255
58158B9588255k783448k421820k126901j885577j674770j488934j334415j203953
$$ 29588255 26804807 24382987 22256086 20370509 18695739 17206805 15872390 14668437
58150A4668437j082069r68721q73722p93680p16242o41628n79332n28560m81006
$$ 14668437 13586368 12617647 11743925 10950245 10234003 9592375 9013043 8484483 8003477
58141H003477m38046m06827l83591l58084l30496l08204k89971k68825k46497
$$ 8003477 7565431 7158604 6775013 6416929 6086433 5778229 5488258 5219433 4972936
58132D972936k30093k17957k02967j86253j74228j65530j54055j41402j33633
$$ 4972936 4742843 4524886 4321919 4135666 3961438 3795908 3641853 3500451 3366818
58123C366818j28923j20747j10155j03112r8794r2167q4894q2221q1905p7598
$$ 3366818 3237895 3117148 3006993 2903881 2805087 2712920 2628026 2545805 2463900 2386302
58113B386302p0449o6423o4843o0553n4826n3076n3921n1283m5714m3181m4145
$$ 2386302 2315853 2249430 2184587 2124034 2069208 2016132 1962211 1910928 1865214 1822033 1777888
58102A777888m3869m2176m2997m5384m4468m0578l8417l8191l6263l3445l3837
$$ 1777888 1734019 1691843 1648846 1603462 1558994 1518416 1479999 1441808 1405545 1372100 1338263
58091A338263l6435l6379l3655l2231l1699k8215k2916k0808k1823k1225j8469
$$ 1338263 1301828 1265449 1231794 1199563 1167864 1139649 1116733 1095925 1074102 1052877 1034408
58080A034408j7520j8633j7925j5243j4597j6458j7076j5781j5811j7407j7118
$$ 1034408 1016888 998255 980330 965087 950490 934032 916956 901175 885364 867957 850839
58069H50839j4547j3221j4104j4517j3769j3790j4020j1850q280p047q053p673
$$ 850839 836292 823071 808967 794450 780681 766891 752871 741021 732741 725694 717641 709968
58057G09968n632n332p287q397q180r472j2369j3483j1955j0563j0234q953o797
$$ 709968 704336 699004 691717 683320 675140 665668 653299 639816 627861 617298 607064 598111 591314
58044E91314o352p449o914m348k900l558l913l289l850n696o094m567l890n028
$$ 591314 584962 577513 570599 566251 563351 559793 555880 552591 548741 543045 536951 532384 528494 523466
58030E23466n796n446n877p425q060p596q140r652r608p838p063p817p510n442
$$ 523466 517670 512224 506347 498922 490862 483266 475126 465474 455866 448028 440965 433148 425638 420196
58016D20196m075m329m151k920k750m144m726l608k888l450l416k067j304j825
$$ 420196 416121 411792 407641 404721 401971 397827 393101 389493 386605 383155 379739 377672 376368 374543
58002C74543j706j81R28Q44J234K795L951M197N065O668O880N199L860L813L174
$$ 374543 372837 372656 373584 374428 375662 378457 382408 386605 391670 398338 405218 410417 414277 418090 421264
57987D21264R66j073j808k479l774m332l611l172l782m175l813l936m830n017
$$ 421264 422230 421157 419349 416870 413096 408764 405153 401981 398199 394024 390211 386275 381445 376428
57973C76428m182l917m537m268k654j635k086k344j338k95n3M36J690K527K398
$$ 376428 372246 368329 363792 359524 356870 355235 353149 350805 349467 349172 349119 349555 351245 353772 356170
57958C56170K350K735K530J650J249J177J6j834k264j252j218k794l683k709j574
$$ 356170 358520 361255 363785 365435 366684 367861 367877 366043 363779 362527 361309 358515 354832 352123 350549
57943C50549j358o90J197K819L352M104N634O546O544P541J0093J1871J1451J0626
$$ 350549 349191 348501 349698 352517 355869 359973 365607 372153 378697 386238 396331 408202 419653 430279
57929D30279J1083J1589J0534Q635P137N680L765K146J047p72l626n860o617p277
$$ 430279 441362 452951 463485 472120 479257 484937 488702 490848 491895 491123 487497 481637 475020 467743
57915D67743q650r317q391p482q000q781q260o955o006n203m111l331l102k543
$$ 467743 459093 449776 441385 433903 425903 417122 408862 401907 395901 390698 386587 383256 380154 377611
57901C77611j584j665l229m607m706m615n165n246m028k690k229j715l31R53J296
$$ 377611 376027 374362 371133 366526 361820 357205 352040 346794 342766 340076 337847 336132 335801 336754 338050
57886C38050J535K278K541J838J531K452L327L147K977L669L943K639Q21k24j154
$$ 338050 339585 341863 344404 346242 347773 350225 353552 356699 359676 363345 367288 369927 370748 370524 369370
57871C69370k729l762l013j463p29p33p67j251k530l438k968j937j381p47O13
$$ 369370 366641 362879 359866 358403 357674 356941 356174 354923 352393 348955 345987 344050 342669 341922 342535
57856C42535J735J641J212J729K839L570L988M375M202L374K951L220K743Q26
$$ 342535 344270 345911 347123 348852 351691 355261 359249 363624 367826 371200 374151 377371 380114 380940
57842C80940q86j041q98k127m016m935n030n288n362m529l564l598m088l905l387
$$ 380940 380054 379013 378115 375988 371972 367037 362007 356719 351357 346828 343264 339666 335578 331673 328286
57827C28286l431l535k655j172k26R4L68N71O18J191K584L812M110M103M172L195
$$ 328286 324855 321320 318665 317493 317267 317361 317729 318300 318918 320109 322693 326505 330615 334718 338890 342085
57811C42085N21k297l540l697m118m630m423l953m055m264l878l518l792l747
$$ 342085 342606 340309 336769 333072 328954 324324 319901 315948 311893 307629 303751 300233 296441 292694
57797B92694k519j210j044r75N26K482K757J566J094K095L297L803L922L702K743
$$ 292694 290175 288965 287921 286946 287472 289954 292711 294277 295371 297466 300763 304566 308488 312190 314933
57782C14933J426O57N34O93J505L366N314O024N709N500N459M861L938L547L512
$$ 314933 316359 317016 317550 318243 319748 323114 328428 334452 340161 345661 351120 355981 359919 363466 366978
57767C66978K911J703N36o33k203l719m512n078o259p505p614o655n585m417k542
$$ 366978 369889 371592 372128 371495 369292 365573 361061 355983 349724 342219 334605 327950 322365 317948 315406
57752C15406n15L54J07J40J072K092K492K458K287J976J714J778K028K244K587
$$ 315406 314891 315245 315352 315492 316564 318656 321148 323606 325893 327869 329583 331361 333389 335633 338220
57737C38220K916K330M11j680k594k563k647k923k776k344k220k231j864j451
$$ 338220 341136 343466 343877 342197 339603 337040 334393 331470 328694 326350 324130 321899 320035 318584
57723C18584j622k058k147k246k953l682l437k533k142k477k893l242l718l836
$$ 318584 316962 314904 312757 310511 307558 303876 300439 297906 295764 293287 290394 287152 283434 279598
57709B79598l077k175k295l218l724l484l145k925k496k025j950j959j436o36
$$ 279598 276521 274346 272051 268833 265109 261625 258480 255555 253059 251034 249084 247125 245689 245053
57695B45053j85Q0N84P98J5j115j328o91l72p67j228j384j367r50J80J484K186
$$ 245053 244868 244948 245532 246330 246345 245230 243902 243211 242839 242072 240844 239460 238093 237143 237323 238807 240993
57678B40993K489L092L891M413N087O738R286J2250J6021K1135K6851L1996L6935
$$ 240993 243482 246574 250465 254878 259965 266703 275989 288239 304260 325395 352246 384242 421177
57665D21177M2990M9929N5216N5511M8058L1719Q704j5160l3811m4953m9808m9988
$$ 421177 464167 514096 569312 624823 672881 704600 713304 698144 664333 619380 569572 519584
57653E19584m6433m0752l5009k9817k4396j8715j3963j0749q499o817n952n669
$$ 519584 473151 432399 397390 367573 343177 324462 310499 299750 291251 284434 278482 272813
57641B72813n152m231l472k916k034r02j30L65J164J994J963J114M22K02m1l24
$$ 272813 267661 263430 259958 257042 255008 254106 253976 254341 255505 257499 259462 260576 260998 261200 261159 260835
57625B60835j45K15j30j129j756j689j633j912k048j862j771j835j717j559j792
$$ 260835 260690 260905 260775 259646 257890 256201 254568 252656 250608 248746 246975 245140 243423 241864 240072
57610B40072k115j807r58k30L27J046J472Q38m72j302j331j069o09J80N69k44
$$ 240072 237957 236150 235192 234962 235289 236335 237807 238645 238173 236871 235540 234471 233862 234042 234611 234367
57594B34367j575k048j753j934k746l109k690k283k166j851j398j338j353p70
$$ 234367 232792 230744 228991 227057 224311 221202 218512 216229 214063 212212 210814 209476 208123 207353
57580B07353k11q56k113k117o51M63J84n88j071j664k408k334j182p6K22K51M60
$$ 207353 207142 206286 204173 202056 201405 201868 202052 201464 200393 198729 196321 193987 192805 192729 192951 193202 193662
57563A93662M27L9q3K09L09J72L96P50L52l68K38K418M366M790M387M041L437
$$ 193662 194089 194128 194045 194254 194563 194735 195131 195881 196233 195865 196103 198521 202887 207677 212064 216105 219542
57546B19542K271J219O20k95j927l354l713l304k630j663n97m4J12O66J431J164
$$ 219542 221813 223032 223652 223357 221430 218076 214363 211059 208429 206766 206169 206125 206237 206903 208334 209498
57530B09498l22j600j759j494j415j018j10M31K02J5K57J34o01q08J05J097J292
$$ 209498 209176 207576 205817 204323 202908 201890 201780 202211 202413 202428 202685 202819 202218 201410 201515 202612 203904
57513B03904J309J690J658O58l83n77m31n29k97N93J069K77q67j166r62j179j626
$$ 203904 205213 206903 208561 209219 208836 208259 207828 207299 207002 207595 208664 208941 208074 206908 205946 204767 203141
57496B03141j616j280r84m80K10J85q75j795j602r95q56n72O76K055K247J547
$$ 203141 201525 200245 199261 198781 198991 199176 198301 196506 194904 193909 193053 192481 193157 195212 197459 199006
57480A99006J205J386J399J249J454J760J535J050J010J147N50q02j974k362k185
$$ 199006 200211 201597 202996 204245 205699 207459 208994 210044 211054 212201 212751 211949 209975 207613 205428
57465B05428j832j519j375j282r30l95j64k93k99j14k03m42o3Q45J115M09j56
$$ 205428 203596 202077 200702 199420 198490 198095 197931 197638 197339 197225 197022 196580 196517 197362 198477 198886 198730
57448A98730N8J79k89k50J063K420K327J158J41n38j083q47N03J636J205k3l51
$$ 198730 198788 198967 198678 198428 199491 201911 204238 205396 205537 204999 203916 203069 203572 205208 206413 206390 206039
57431B06039K59N94M23N24Q88P46J27j46J44N30R10J370J382N21m55n36p5r9m66
$$ 206039 206298 206892 207315 207839 208727 209473 209600 209454 209598 210128 211038 212408 213790 214311 213856 213320 213245 213146 212680
57412B12680k29N45Q68N77N34J028J395J267J043R56P38L06q7l39m48j74N01R48
$$ 212680 212451 212996 213864 214441 214975 216003 217398 218665 219708 220664 221402 221708 221621 221282 220834 220660 221161 222109
57394B22109O40j3l52m14m09R6J418K809L324L181L163L246K944K524K666L257
$$ 222109 222749 222736 222384 221970 221561 221657 223075 225884 229208 232389 235552 238798 241742 244266 246932 250189
57378B50189L613L514L146K421J393P44Q40R27K78n62q20r23j590k299k118j406
$$ 250189 253802 257316 260462 262883 264276 265020 265860 266787 267065 266503 265683 264760 263170 260871 258753 257347
57362B57347j093r59j88Q43J074O42N84J019J251J378K062K943L021K499K449
$$ 257347 256254 255295 255107 255950 257024 257666 258250 259269 260520 261898 263960 266903 269924 272423 274872
57347B74872K781K345J076K36L39N64M65N49Q53P01K15M52J502J988J217K63K78
$$ 274872 277653 279998 281074 281310 281649 282213 282678 283227 284080 284781 284996 285448 286950 288938 290155 290418 290696
57330B90696R65J522J890K270K360J869J113N27K07K57Q41J589J791J452J374
$$ 290696 291661 293183 295073 297343 299703 301572 302685 303212 303419 303676 304517 306106 307897 309349 310723
57315C10723J970K729L096L042K642J877J052O36O06O55R64J861K848L028K526
$$ 310723 312693 315422 318518 321560 324202 326079 327131 327767 328373 329028 329992 331853 334701 337729 340255
57300C40255K375K860L179K899K600K727K924K881K910L267L718M106M545M892
$$ 340255 342630 345490 348669 351568 354168 356895 359819 362700 365610 368877 372595 376701 381246 386138
57286C86138M773M375M361M878N409N688N892N923N425M597M056L852L557L286
$$ 386138 390911 395286 399647 404525 409934 415622 421514 427437 432862 437459 441515 445367 448924 452210
57272D52210L456L594K720J167N57J522K744K909K472K581L283L663L222K319
$$ 452210 455666 459260 461980 463147 463704 465226 467970 470879 473351 475932 479215 482878 486100 488419
57258D88419J606J508K047K853L563M214M929N489N709O048O959P957Q199P840
$$ 488419 490025 491533 493580 496433 499996 504210 509139 514628 520337 526385 533344 541301 549500 557340
57244E57340P793Q237Q512Q401Q376Q568Q653Q810R580J0662J1168J1201J1826
$$ 557340 565133 573370 581882 590283 598659 607227 615880 624690 634270 644932 656100 667301 679127
57231F79127J3166J3895J3160J1775J0848J0450J0228J0286J0736J1261J1742
$$ 679127 692293 706188 719348 731123 741971 752421 762649 772935 783671 794932 806674
57220H06674J2583J3866J4956J5369J5357J5220J4933J4705J5046J5875J6503
$$ 806674 819257 833123 848079 863448 878805 894025 908958 923663 938709 954584 971087
57209I71087J6784J7316J8155J8491J8104J8019J9007K0421K1292K1791K2757
$$ 971087 987871 1005187 1023342 1041833 1059937 1077956 1096963 1117384 1138676 1160467 1183224
57198A183224K4397K6147K7400K7844K7551K7119K7266K8097K9097K9977L0834
$$ 1183224 1207621 1233768 1261168 1289012 1316563 1343682 1370948 1399045 1428142 1458119 1488953
57187A488953L1552L1855L1996L2467L3031L2963L2356L2034L2101L1760L0812
$$ 1488953 1520505 1552360 1584356 1616823 1649854 1682817 1715173 1747207 1779308 1811068 1841880
57176A841880L0047K9805K9407K8451K7540K7219K7359K8007K9570L1648L2878
$$ 1841880 1871927 1901732 1931139 1959590 1987130 2014349 2041708 2069715 2099285 2130933 2163811
57165B163811L2667L1935L1566L1335L0955L1003L1851L2801L3148L3226L3583
$$ 2163811 2196478 2228413 2259979 2291314 2322269 2353272 2385123 2417924 2451072 2484298 2517881
57154B517881L4060L4356L4627L4795L4223L2777L1282L0325K9572K8848K8764
$$ 2517881 2551941 2586297 2620924 2655719 2689942 2722719 2754001 2784326 2813898 2842746 2871510
57143B871510K9558L0536L1384L2818L5115L7248L8459L9384M0633M1546M1622
$$ 2871510 2901068 2931604 2962988 2995806 3030921 3068169 3106628 3146012 3186645 3228191 3269813
57132C269813M1906M3459M5515M6691M7161M8084M9537N0758N1946N4273N8179
$$ 3269813 3311719 3355178 3400693 3447384 3494545 3542629 3592166 3642924 3694870 3749143 3807322
57121C807322O2977O7989P2984P7591Q1461Q5096Q9746R6379J05148J15615J27053
$$ 3807322 3870299 3938288 4011272 4088863 4170324 4255420 4345166 4441545 4546693 4662308 4789361
57110D789361J39037J52167J67694J86134K07163K31346K60885K98012L43749
$$ 4789361 4928398 5080565 5248259 5434393 5641556 5872902 6133787 6431799 6775548
57101F775548L99210M66971N50109O50887P71717R16648J090581J297317J538829
$$ 6775548 7174758 7641729 8191838 8842725 9614442 10531090 11621671 12918988 14457817
57092A4457817J815006K122628K455044K803568L158046L505590L831211M121761
$$ 14457817 16272823 18395451 20850495 23654063 26812109 30317699 34148910 38270671
57084C8270671M366829M551479M647100M611299M398320L972567L320588K460959
$$ 38270671 42637500 47188979 51836079 56447378 60845698 64818265 68138853 70599812
57076G0599812J447344L58055p24569j731430k612340l335018l884723m263580
$$ 70599812 72047156 72405211 71680642 69949212 67336872 64001854 60117131 55853551
57068E5853551m485566m569023m532244m393438m171953l888473l564256l219626
$$ 55853551 51367985 46798962 42266718 37873280 33701327 29812854 26248598 23028972
57060B3028972k871990k534572k216736j924920j662930j431994j231298j058808
$$ 23028972 20156982 17622410 15405674 13480754 11817824 10385830 9154532 8095724
57052H095724r11730p86824o80947n91410n15819m51835l97244l50192l09285
$$ 8095724 7183994 6397170 5716223 5124813 4608994 4157159 3759915 3409723 3100438
57043C100438k73555k42188k14275j88945j65788j44851j26014j08820r3038p8768
$$ 3100438 2826883 2584695 2370420 2181475 2015687 1870836 1744822 1636002 1542964 1464196
57033A464196o5609n2260l7728k2731r673j672j663j1189k8619m8809o5772p6113
$$ 1464196 1398587 1346327 1308599 1285868 1276195 1274523 1272860 1261671 1233052 1184243 1118471 1042358
57021A042358p9845p8605p3988o7356n9962n2787m6447m1253l7004l3035k8983
$$ 1042358 962513 883908 809920 742564 682602 629815 583368 542115 505111 472076 443093
57010D43093k5231k2227j9720j7261j4982j3267j2005j0883r988r504r121q469
$$ 443093 417862 395635 375915 358654 343672 330405 318400 307517 297529 288025 278904 270435
56998B70435p783p460p204o451n314m356l650k797j734p96p4P57K051M027O719
$$ 270435 262652 255192 247988 241537 236223 231867 228217 225420 223686 222890 222816 223573 225624 229651 236370
56983B36370R712J2217J3672J3772J1797O893l45p557j2657j5422j6496j5993
$$ 236370 246082 258299 271971 285743 297540 304433 304088 296531 283874 268452 251956 235963
56971B35963j4157j2280j1457j1076r842p708n523l409r60J619L988O768J0615
$$ 235963 221806 209526 198069 186993 177151 169443 163920 160511 159551 161170 165158 171926 182541
56958A82541J4749J7982K0624K3487K5329K3339J6497O721l382j2277j8936k2454
$$ 182541 197290 215272 235896 259383 284712 308051 324548 331269 327887 315610 296674 274220
56946B74220k2983k1724j9472j6284j2671r677p437n006j970J055L839P048J0945
$$ 274220 251237 229513 210041 193757 181086 171409 163972 158966 156996 158051 161890 168938 179883
56933A79883J4944J8943K3627K8849L2821L3592L0272K2599J0838l118j5832k4629
$$ 179883 194827 213770 237397 266246 299067 332659 362931 385530 396368 393250 377418 352789
56921C52789k9184l0483k9407k6845k3985k1392j8592j5311j2292j0248q848p441
$$ 352789 323605 293122 263715 236870 212885 191493 172901 157590 145298 135050 126202 118761
56909A18761o062m997m103l197k478j989j336m15K97O39J155K093K834K946L007
$$ 118761 112699 107702 103599 100402 97924 95935 94599 94184 94481 95120 96275 98368 101202 104148 107155
56894A07155L698M795N816O975Q696J0720J2518J4262J6576J9445K1781K2114
$$ 107155 110853 115648 121464 128439 137135 147855 160373 174635 191211 210656 232437 254551
56882B54551J9540J4317P644O99n976j1886j5921j7158j6105j4125j1760q749
$$ 254551 274091 288408 296052 296751 290775 278889 262968 245810 229705 215580 203820 195071
56870A95071n479k919q66K191O872J1967J6418K0904K6541L3183M0007M6691N2715
$$ 195071 189592 186673 185807 187998 194870 206837 223255 244159 270700 303883 343890 390581 443296
56857D43296N6141N4326M5741L0742J1340q977k6098l7264m2289m2474l9021l3038
$$ 443296 499437 553763 599504 630246 641586 632609 606511 569247 526958 484484 445463 412425
56845D12425k6132j9668j3670p278j05P537J5445K3759L2544M1789N1677O2430
$$ 412425 386293 366625 352955 345677 345572 353109 368554 392313 424857 466646 518323 580753
56833E80753P3754Q4430R1824R1719P9805N4804K0451j5949m7128o8623p9451
$$ 580753 654507 738937 830761 922480 1002285 1057089 1077540 1061591 1014463 945840 866389
56822H66389q1272p6894o8882n9068m8831l9113l0073k1402j3134n585J552R253
$$ 866389 785117 708223 639341 580273 531442 492329 462256 440854 427720 422135 423687 432940
56810D32940J7991K7348L6999M7122N7205O4967O7036O0432M3825J8675j0171
$$ 432940 450931 478279 515278 562400 619605 684572 751608 812040 855865 874540 864369
56799H64369l6175n4581o4383o7046o4442n8399n0906m3434l6303k9354k2770
$$ 864369 828194 773613 709230 642184 577742 519343 468437 425003 388700 359346 336576
56788C36576j6791j1240n889p18M582J0658J7492K4013K9221L2821L4165L1515
$$ 336576 319785 308545 302656 301938 306520 317178 334670 358683 387904 420725 454890 486405
56776D86405K3391J0380m998j9687l1094l7737l9853l9028l6637l3116k8932k5183
$$ 486405 509796 520176 515178 495491 464397 426660 386807 347779 311142 278026 249094 223911
56764B23911k2451j9978j6927j3698j1217r581q377p560p068o194m444k578j747
$$ 223911 201460 181482 164555 150857 139640 130059 121682 114122 107054 100860 96416 93838 92091
56751I2091j931k199k144k084k135j992j567j091o87m21n15r60j243r47l59L5
$$ 92091 90160 87961 85817 83733 81598 79606 78039 76948 76261 75840 75325 74365 73122 72175 71816 71851
56735G1851J39n6p09j519j540l79J012J490J085N20K5n02p46l58L16P10Q56J020
$$ 71851 71990 71934 71225 69706 68166 67787 68799 70289 71374 71894 71919 71417 70671 70313 70629 71339 72195 73215
56717G3215J037Q01Q39J534K292K354J956J742J592J019L18J78M95O49O60J041
$$ 73215 74252 75053 75892 77426 79718 82072 84028 85770 87362 88381 88699 88877 89372 90021 90681 91722
56701I1722J678J913J665J507J619J592J240Q74P05O55P03R08J107J096R57Q23
$$ 91722 93400 95313 96978 98485 100104 101696 102936 103810 104515 105170 105873 106781 107888 108984 109941 110764
56685A10764N76K30J47L87L68k41q01n86J26M82J90n15j412k193k325j757j207
$$ 110764 111340 111570 111717 112104 112472 112231 111430 110844 110970 111452 111642 111127 109715 107522 105197 103440 102233
56668A02233j097q41OP46O12J75M49J266J733J817K207K924L326L279L219L215
$$ 102233 101136 100295 100301 101047 101659 101834 102283 103549 105282 107099 109306 112230 115556 118835 122054 125269
56652A25269L051K945L205L334K591J238K26j61l44l96lO79J130J303J442J327
$$ 125269 128320 131265 134470 137804 140395 141633 141859 141698 141354 140958 140955 141634 142764 144067 145509 146836
56636A46836O72o5k83l51r93j870j991j333r20j246j752j866j610j188q64j109
$$ 146836 147508 147443 147160 146809 145816 143946 141955 140622 139702 138456 136704 134838 133228 132040 131176 130067
56620A30067j990k693k507j956j939k232j979j304j033j114p50qJ72m00q72q59
$$ 130067 128077 125384 122877 120921 118982 116750 114771 113467 112434 111320 110570 110562 110734 110334 109462 108603
56604A08603r47j455j828j534o66M78J532J870J276O32R13J677J731J045O92J009
$$ 108603 107656 106201 104373 102839 102173 102651 104183 106053 107329 107961 108874 110551 112282 113327 114019 115028
56588A15028J232J009Q80J011Q83L95J08J77K03K52P90J527J595J053Q88J383
$$ 115028 116260 117269 118149 119160 120043 120438 120546 120723 120926 121178 121968 123495 125090 126143 127031 128414
56572A28414J755J637J604J925K138K153K499L097L168K715K894M345O326P941
$$ 128414 130169 131806 133410 135335 137473 139626 142125 145222 148390 151105 153999 158344 164670 172611
56558A72611R231J0636J2304J4138J5497J4842J1025N140j90l561n506o481n996
$$ 172611 181842 192478 204782 218920 234417 249259 260284 265424 265234 261673 256167 249686 243690
56545B43690m291l005l175l908l991l547l254l036k609k321k539k906k993k889
$$ 243690 239399 236394 233219 229311 225320 221773 218519 215483 212874 210553 208014 205108 202115 199226
56531A99226k641j949j035q42j687k610k649k008j380r87q74j276k011k271j580
$$ 199226 196585 194636 193601 192759 191072 188462 185813 183805 182425 181438 180564 179288 177277 175006 173426
56516A73426m10N38R02L87j090k708l255k634j909j543q65L32R99M12o40r59l63
$$ 173426 173016 173554 174456 174843 173753 171045 167790 165156 163247 161704 160839 161171 162170 162582 161942 160983 160620
56499A60620O26J520J767R14n46j374j151p28p13p15m19k47l56k17K23K35k61
$$ 160620 161246 162766 164533 165447 164901 163527 162376 161648 160935 160220 159801 159554 159198 158981 159204 159439 159178
56482A59178k72N61J247J128R53J300J434P26n8q2J88Q3NM15O41R5l70K64J378
$$ 159178 158906 159467 160714 161842 162795 164095 165529 166255 166197 166115 166303 166386 166391 166806 167447 167542 167172 167436 168814
56463A68814J621R42L36J46k3k13j52j1k8L00J509K999L584K983J881P97k13r35
$$ 168814 170435 171377 171713 171859 171836 171623 171471 171460 171432 171732 173241 176240 179824 182807 184688 185485 185272 184337
56445A84337r97m15M04J124J549J521J129O58J28o74j503j726j256p31m80k03
$$ 184337 183340 182925 183329 184453 186002 187523 188652 189310 189438 188764 187261 185535 184279 183548 183068 182865
56429A82865J61J53k50m75m06n61q72n14N71J262R66M85M99N23P8k94j08J98K59
$$ 182865 183026 183179 182929 182454 182048 181487 180615 180101 180672 181934 182900 183385 183884 184407 184485 184191 184083 184281 184540
56410A84540M62Q82Q15J61p6M30N79j39m77M60J417Q69o20j463j385j115p22L6
$$ 184540 185002 185884 186699 186860 186784 187214 187793 187654 187177 187637 189054 189923 189303 187840 186455 185340 184618 184654
56392A84654N99M00J62Q52J983K316J733J105Q55Q29J085J696K297K720L299L806
$$ 184654 185253 185653 185815 186667 188650 190966 192699 193804 194659 195488 196573 198269 200566 203286 206585 210391
56376B10391L173J293j87j1Q67J000O51P30P98j5j059j083m04k64o10l32O59J336
$$ 210391 213564 214857 214670 214659 215526 216526 217177 217907 218705 218690 217631 216548 216144 215880 215270 214938 215597 216933
56358B16933J282R70N98M7l39j97j7k63k56P32J866J780P56L22R75J767J971J800
$$ 216933 218215 219185 219783 219830 219491 219294 219277 219014 218758 219490 221356 223136 223892 224214 225189 226956 228927 230727
56340B30727J612J529J742K210K433K243K299K977L559L411K998K782K203R44
$$ 230727 232339 233868 235610 237820 240253 242496 244795 247772 251331 254742 257740 260522 262725 263669
56326B63669Q6O28J849K578K942L548L932L429K487J656M87j027j394J19J597
$$ 263669 263755 264383 266232 268810 271752 275300 279232 282661 285148 286804 287291 286264 284870 284989 286586
56311B86586J020o48j188o91p82j400j199l54r0N5J527L687M384L571L406M531
$$ 286586 287606 286958 285770 285079 284297 282897 281698 281344 281254 281309 282836 286523 290907 294478 297884 302415
56295C02415N106M096K868K682K894K528J760J021L16%O76J988K937L561M686
$$ 302415 307521 311617 314485 317167 320061 322589 324349 325370 325686 325686 326362 328350 331287 334848 339534
56280C39534N949N939M545L401L590M491N151N378N234M971N475P354R538J0295
$$ 339534 345483 351422 355967 359368 362958 367449 372600 377978 383212 388183 393658 401012 410550 420845
56266D20845R567Q850Q951R439J0120J1284J2581J3364J4022J5428J7301J8825
$$ 420845 430412 439262 448213 457652 467772 479056 491637 505001 519023 534451 551752 570577
56254E70577K0439K3212K6794K9989L2985L6932M1665M6067N0365N5767O2004
$$ 570577 591016 614228 641022 671011 703996 740928 782593 828660 879025 934792 996796
56243I96796O7648P2663P8173Q3728Q7433Q8936Q9703Q9928Q7766Q2154P3988
$$ 996796 1064444 1137107 1215280 1299008 1386441 1475377 1565080 1655008 1742774 1824928 1898916
56232A898916O3985N1757L7627K3169R156m957j8994l1556m2095n1406n9614o5637
$$ 1898916 1962901 2014658 2052285 2075454 2084610 2079653 2060659 2029103 1987008 1935602 1875988 1810351
56220A810351o9223p1476p2909p2896p1420o9497o7401o4491o0968n7842n4915
$$ 1810351 1741128 1669652 1596743 1523847 1452427 1382930 1315529 1251038 1190070 1132228 1077313
56209A077313n0975m6223m2299l9646l7042l4035l1515k9610k7328k4621k2485
$$ 1077313 1026338 980115 937816 898170 861128 827093 795578 765968 738640 714019 691534
56198F91534k0744j8175j5048j3049j2338j1351r737q852q873q256o624n420n039
$$ 691534 670790 652615 637567 624518 612180 600829 591092 582240 573367 565111 558487 553067 548028
56185E48028m145k438j324j104m18P98Q16o20j464q07j80l97j57J070J812J477
$$ 548028 543883 541445 540121 539017 538599 539397 540213 539593 538129 537322 537142 536745 536588 537658 539470 540947
56169E40947J588K804L660L566M059N657O488N655M987N747O506O157O173P824
$$ 540947 542535 545339 548999 552565 556624 562281 568769 574424 579411 585158 591664 597821 603994 611818
56155F11818R795J0621J1090J2268J3463J4081J5349J8197K1544K4319K7202L0907
$$ 611818 621613 632234 643324 655592 669055 683136 698485 716682 738226 762545 789747 820654
56143H20654L4910L9314M5636N4292O3595P2685Q2906R4840J06478J15713J22030
$$ 820654 855564 894878 940514 994806 1058401 1131086 1213992 1308832 1415310 1531023 1653053
56132A653053J24196J19398J06872R0199P4111O1124N2346M8537M8224M7213M2131
$$ 1653053 1777249 1896647 2003519 2093718 2167829 2228953 2281299 2329836 2378060 2425273 2467404
56121B467404L2814K0403N919q100j7896k2455k4777k7889l2591m0108n3010p1071
$$ 2467404 2500218 2520621 2526540 2518440 2500544 2478089 2453312 2425423 2392832 2352724 2299714 2228643
56109B228643q9445j03396j12128j16218j14797j07792r7826q7255p5827o3299
$$ 2228643 2139198 2035802 1923674 1807456 1692659 1584867 1487041 1399786 1323959 1260660
56099A260660n1521m1878l3571k6282k1440j8972j6183j1863q123o256m559k184
$$ 1260660 1209139 1167261 1133690 1107408 1085968 1066996 1050813 1038950 1030827 1024571 1020012 1017828
56087A017828j092j807j528R53K719K001J547L600N865N988N795P367Q934Q550
$$ 1017828 1016736 1014929 1013401 1014354 1017073 1019074 1020621 1024221 1030086 1036074 1041869 1049236 1058170 1066720
56073A066720P989R103J0172R624R541J1507J3075J2342J1920J4058J6001J4894
$$ 1066720 1074709 1083812 1093984 1103608 1113149 1124656 1137731 1150073 1161993 1176051 1192052 1206946
56061A206946J3238J4493J7052J7688J7419J8779K0556K0418J9674K0474K1373
$$ 1206946 1220184 1234677 1251729 1269417 1286836 1305615 1326171 1346589 1366263 1386737 1408110
56050A408110K0467J9674K1032K2127K0149J7220J6665J7404J7032J6959J9269
$$ 1408110 1428577 1448251 1469283 1491410 1511559 1528779 1545444 1562848 1579880 1596839 1616108
56039A616108K1954K2453K2489K4291K5843K5141K5054K8415L2428L3717L4612
$$ 1616108 1638062 1660515 1683004 1707295 1733138 1758279 1783333 1811748 1844176 1877893 1912505
56028A912505L8288M2119M2437M1616M3559M6318M6254M5422M7646N1116N2213
$$ 1912505 1950793 1992912 2035349 2076965 2120524 2166842 2213096 2258518 2306164 2357280 2409493
56017B409493N2832N6565O1579O4489O7221P2526P7177P7534P7263Q1337Q7066
$$ 2409493 2462325 2518890 2580469 2644958 2712179 2784705 2861882 2939416 3016679 3098016 3185082
56006C185082Q9556R1128R6267J02156J03953J04738J10319J18623J24433J29879
$$ 3185082 3274638 3365766 3462033 3564189 3668142 3772880 3883199 4001822 4126255 4256134
55996D256134J39707J50909J57984J63918J74692J87746J97404K06704K21685
$$ 4256134 4395841 4546750 4704734 4868652 5043344 5231090 5428494 5635198 5856883
55987E856883K39133K52754K66244K86838L11366L32687L54422L84458M19532
$$ 5856883 6096016 6348770 6615014 6901852 7213218 7545905 7900327 8284785 8704317
55978H704317M51887M85514N29255N79673O28256O79834P45496Q23300R05283
$$ 8704317 9156204 9641718 10170973 10750646 11378902 12058736 12804232 13627532 14532815
55969A4532815R97242J111091J244675J391223J561386J772143K022414K306393
$$ 14532815 15530057 16641148 17885823 19277046 20838432 22610575 24632989 26939382
55961B6939382K642822L062849L579364M201531M969588N937560P131031Q563955
$$ 26939382 29582204 32645053 36224417 40425948 45395536 51333096 58464127 67028082
55953F7028082J0288798J2386890J4925635J7981996K1684004K6124959L1173574
$$ 67028082 77316880 89703770 104629405 122611401 144295405 170420364 201593938
55946B01593938L6330807M0623593M2475018L9862422L1228577J6847187o01480
$$ 201593938 237924745 278548338 321023356 360885778 392114355 408961542 408360062
55939D08360062j7127788k9480293l6463674l8714605l7641744l4614595l0700414
$$ 408360062 391232274 361751981 325288307 286573702 248931958 214317363 183616949
55932A83616949k6628655k2789592j9324830j6278927j3669474j1469387r616192
$$ 183616949 156988294 134198702 114873872 98594945 84925471 73456084 63839892
55925F3839892q061882o779866n729807m857929m131401l538108l054857k647478
$$ 63839892 55778010 48998144 43268337 38410408 34279007 30740899 27686042 25038564
55917B5038564k299839k013138j778014j573766j393093j242236j117503j004511
$$ 25038564 22738725 20725587 18947573 17373807 15980714 14738478 13620975 12616464
55909A2616464q99562q10157p35152o64446n97342n42065m97719m54731m12570
$$ 12616464 11716902 10906745 10171593 9507147 8909805 8367740 7870021 7415290 7002720
55900G002720l79628l55818l31819l05485k83408k66238k47437k26746k10555
$$ 7002720 6623092 6267274 5935455 5629970 5346562 5080324 4832887 4606141 4395586
55891D395586j98595j83907j66305j52690j43777j33365j21264j14306j13618
$$ 4395586 4196991 4013084 3846779 3694089 3550312 3416947 3295683 3181377 3067759
55882C067759j12691j09098j06810j05993j01614r3424q6936q3247p7718o9693
$$ 3067759 2955068 2845970 2739160 2633167 2531553 2438129 2351193 2267946 2190228 2120535
55872B120535o3841o0986n7087n2202n1032n3549n4211n1694n0466n1580n0632
$$ 2120535 2056694 1995708 1938621 1886419 1835387 1781838 1727627 1675933 1625467 1573887 1523255
55861A523255m6370m2805m1267l8440l3915l1774l2945l3395l1595l0662l1592
$$ 1523255 1476885 1434080 1392813 1354373 1320458 1288684 1255739 1222344 1190749 1160087 1128495
55850A128495l1328k9055k7747k8072k7258k5151k4951k6777k6980k4820k3459
$$ 1128495 1097167 1068112 1040365 1012293 985035 959884 934933 908156 881176 856356 832897
55839H32897k3400k1526j7736j5821j6463j5882j3009j1390j2345j2541j0408
$$ 832897 809497 787971 770235 754414 737951 722069 709060 697670 685325 672784 662376
55828F62376q796r168q931o780n242n747o337o242p626j0815j2698j1911j0939
$$ 662376 653580 644412 635481 628701 623459 617712 611375 605133 597507 586692 573994 562083 551144
55815E51144j1291j1189r832r239j0057r986q171o854o962o362m105k249j796
$$ 551144 539853 528664 518832 509593 499536 489550 481379 474525 467563 461201 457096 454847 453051
55802D53051r39J143K722L104L864N265N418M151L570L831K627q2j302j87N17
$$ 453051 452112 453255 455977 459081 462945 468210 473628 477779 481349 485180 487807 487725 486423 486236 486753
55787D86753m31q25K66N24j067k112j375j179l223n970q138j0844j4190j5704
$$ 486753 486322 485497 485763 486287 485220 483108 481733 480554 477331 471361 463223 452379 438189 422485
55773D22485j4312j2213j0825q607m808j502J90K001M431M638J002l779o737q399
$$ 422485 408173 395960 385135 376528 371720 370218 370408 372409 376840 381478 382480 378701 371964 363565
55759C63565r979j0192p824m638k849k107j319j032j787k511k629l466n584p196
$$ 363565 353586 343394 335570 330932 328083 325976 324657 323625 321838 319327 316698 313232 307648 300452
55745C00452p088o566o753o544n165m041m172m185l022j964k048k029j011m66
$$ 300452 293364 286798 280045 273501 268336 264295 260123 255938 252916 250952 248904 246875 245864 245398
55731B45398j565k813k579j762j844k450k786l354m363m559l505k855l569m083
$$ 245398 243833 241020 238441 236679 234835 232385 229599 226245 221882 217323 213818 210963 207394 203311
55717B03311l092j854j773j937j092J4L11M24J176J989K509L705N605O143M170
$$ 203311 200219 198365 196592 194655 193563 193577 193888 194312 195488 197477 199986 203691 209296 215439 219609
55702B19609J504P3q16k463m226n039n423n936n656m176l161l797m688m309l495
$$ 219609 221113 221186 220370 217907 213681 208642 203219 197283 191627 187451 184290 180493 175805 171496 168001
55687A68001l411l146j635nM05N59J834L322L453K837L031L808L971L582L292
$$ 168001 164590 161444 159809 159804 160209 160768 162602 165924 169377 172214 175245 179053 183024 186606 189898
55672A89898K702J474P01J111J337M9j545j549m69j59q46j364j393j371j119l85
$$ 189898 192600 194074 194775 195886 197223 197272 195727 194178 193709 193550 192704 191340 189947 188576 187457 187072
55656A87072J35P1M67J935L068K495J217Q97J163P38l5NM87J93p32j298j506j899
$$ 187072 187207 187278 187745 189680 192748 195243 196460 197357 198520 199258 199223 199228 199715 199908 199176 197878 196372 194473
55638A94473k109j746j751k989m555n244n668o849p886p233n431m298m099l643
$$ 194473 192364 190618 188867 185878 181323 176079 170411 163562 155676 148443 143012 138714 134615 130972
55624A30972k667j932j453o42J62J56l13k88M7j37o46o73m80q86j577j583j010
$$ 130972 128305 126373 124920 124278 124440 124596 124283 123995 124042 123905 123259 122586 122106 121220 119643 118060 117050
55607A17050q01j103j350j467j685j656j125q03j256j651j055j73k13q63j024
$$ 117050 116249 115146 113796 112329 110644 108988 107863 107060 105804 104153 103098 102925 102712 101849 100825
55592A00825q04j070j560j254j74P12J020R87M90n01j120o73P2O2k86Q4R86J514
$$ 100825 100021 98951 97391 96137 95963 96675 97695 98682 99172 98671 97551 96878 96950 97012 96726 96810 97796 99310
55574I9310J733K296K966L132L173L788M526M515L990L599K909J284m48j024q81
$$ 99310 101043 103339 106305 109437 112610 116398 120924 125439 129429 133028 135937 137221 136773 135749 134868
55559A34868j446k757l625l748l820l822l056j820j289j713k190k204k068j890
$$ 134868 133422 130665 127040 123292 119472 115650 112594 110774 109485 107772 105582 103378 101310 99420
55545I9420j393o59L1Q29J817K351K064J829K465L200K880K005J937K617K747
$$ 99420 98027 97368 97399 98228 100045 102396 104460 106289 108754 111954 114834 116839 118776 121393 124140
55530A24140J909Q71Q7n77q87m78J45J50l27p02j213k396l739m305m178l965l435
$$ 124140 126049 126920 127007 126430 125543 125065 125210 125360 125033 124331 123118 120722 116983 112678 108500 104535 101100
55513A01100k126p18j54j5N98J124L14j419k342j917j253j094r97n19K68J364
$$ 101100 98974 98256 98102 98087 98685 99809 100123 98704 96362 94445 93192 92098 91101 90582 90850 92214
55497I2214K630L156K128K02j271j947k284k226j530q81j087j668j690j422j616
$$ 92214 94844 98000 100128 100330 99059 97112 94828 92602 91072 90191 89104 87436 85746 84324 82708
55482H2708j815j171l29n66j526j745j042m57k20K88R04J021J118J905K335Q75
$$ 82708 80893 79722 79393 78827 77301 75556 74514 74057 73837 74125 75029 76050 77168 79073 81408 82283
55466H2283j561k400j167K5r4n86o80j020j806j985j224o63q67q19J45J105J131
$$ 82283 80722 78322 77155 77180 77086 76500 75820 74800 72994 71009 69785 69122 68255 67436 67581 68686 69817
55449F9817N46j18r38j661j375K9J385J748J312M76o46j424r56M14J204Q62M19
$$ 69817 70363 70245 69307 67646 66271 66300 67685 69433 70745 71221 70575 69151 68195 68609 69813 70675 71094
55432G1094O76J196J445J528J348N12n47p74k29j14o78p40K01J032Q96M47M54
$$ 71094 71770 72966 74411 75939 77287 77799 77252 76478 76249 76135 75457 74717 74918 75950 76846 77293 77747
55415G7747N21R8m90p73r00r83p04n7M78P92J169J272M28q64j125J0J268J585
$$ 77747 78268 78366 77876 77103 76203 75220 74516 74459 74937 75729 76898 78170 78598 77734 76609 76619 77887 79472
55397G9472J170M13o62j551j452p30o74j332j275k7J018Q46K54K04L48J23j34
$$ 79472 80642 81055 80393 78842 77390 76660 75986 74654 73379 73352 74370 75216 75470 75674 76022 76145 76011
55380G6011j27l30q73j018n22j98l66j77P17J237O46k06l44o8P7L40P80O18l27
$$ 76011 75884 75554 74681 73663 73141 72943 72577 72400 73117 74354 75000 74794 74450 74382 74459 74799 75579 76197 75870
55361G5870q81l31L10M1m55j61L99J31p63j297j269j064o01K13P55N26J32K75
$$ 75870 74989 74658 74968 75009 74554 74393 74792 74923 74160 72863 71594 70530 69929 70142 70897 71423 71555 71830
55343G1830N25J70l83k70L24M43j98r89j288p97M15J603J680N31n87o23J0L51
$$ 71830 72355 72525 72142 71872 72196 72639 72441 71452 70164 69367 69782 71385 73065 73596 73009 72386 72396 72747
55325G2747K68J14r4l35j39O39J208Q96J57k31l18n34p24m90M8N15Q42R43N49
$$ 72747 73015 73129 73035 72700 72561 73200 74408 75304 75461 75230 74912 74378 73654 73164 73212 73727 74569 75512 76061
55306G6061j24k13N83J377J294N94m8n59j073j295r95n01p9M33R03P95K36J87
$$ 76061 75937 75724 76307 77684 78978 79572 79524 78965 77892 76597 75602 75101 75022 75455 76358 77153 77389 77576
55288G7576Q57J085J88q14p71j43j8l78n29m44m22j70N53J038N90k27m61l10n60
$$ 77576 78433 79518 79706 78892 78121 77978 77960 77582 77053 76609 76187 76017 76570 77608 78198 77971 77510 77200 76640
55269G6640r93o86M17J421J767J610J109L42k49k02K63N64N92N34K68l85j072
$$ 76640 75647 74961 75378 76799 78566 80176 81285 81627 81378 81176 81439 82003 82595 83129 83397 83012 81940
55252H1940j261j005p23n91n43n86o59n33l36n53j149j326o62J96N51O37R51J273
$$ 81940 80679 79674 78951 78360 77817 77231 76572 76039 75703 75150 74001 72675 72013 72209 72760 73397 74348 75621
55234G5621J127O07J04k96o10o37l90k14j26K96R95J244P94K67J8l52q75q39j72
$$ 75621 76748 77355 77459 77163 76553 75916 75526 75312 75186 75482 76477 77721 78515 78782 78800 78448 77573 76734 76562
55215G6562R3m84q71l26K47j54r01q49j62K48K10O9j57k96L68J824K649J860M58
$$ 76562 76655 76171 75300 74974 75221 75067 74166 73317 73155 73403 73613 73682 73525 73229 73597 75421 78070 79930 80388
55196H0388q0J24J61J08M75P85L46l42m77m32p91q05L74J710J557K90l14M8R7
$$ 80388 80308 80432 80593 80701 81176 81961 82307 81965 81488 81056 80265 79460 79834 81544 83101 83391 83077 83125 83222
55177H3222m90o04J17N98K43j41J11N11M68J87Q2K00M47O49M28j90l84L65J166
$$ 83222 82732 82128 82245 82843 83086 82945 83056 83567 84035 84222 84304 84504 84951 85600 86028 85838 85454 85819 86985
55158H6985R32J90K94J169J399M75n98j000r93r40p14l84k61j85K98R35J036O14
$$ 86985 87917 88107 88401 89570 90969 91444 90846 89846 88853 87913 87199 86815 86554 86369 86667 87602 88638 89252
55140H9252K42l4m54n29L19J257P98q82j927j359j91L55L33K81J90j03m05n69
$$ 89252 89494 89460 89006 88477 88796 90053 90851 89969 88042 86683 86492 86847 87180 87461 87651 87548 87143 86574
55122H6574o68n81j42K42Pn20m76J60N25K69p7j60k00k87k49k03k94l5J018K114
$$ 86574 85906 85325 85183 85425 85432 84912 84436 84596 85121 85390 85313 85153 84953 84666 84417 84214 83920 83885 84903 87017
55102H7017K105J173M74K43j98o96k41J082J824J311M97J59j52q35j306j107p07
$$ 87017 89122 90295 90769 91012 90814 90118 89877 90959 92783 94094 94591 94750 94598 93763 92457 91350 90643
55085I0643m83l6Q44J548J614J388J131M80o47j536j598j048l06M22P65M11q9
$$ 90643 90160 90124 90968 92516 94130 95518 96649 97129 96482 94946 93348 92300 91994 92416 93181 93592 93503
55068I3503J31P53N29o78j487j080k16L17P85J329J219K22n41j70O23P39K82m1
$$ 93503 93634 94387 94916 94238 92751 91671 91455 91772 92557 93886 95105 95327 94786 94616 95239 95978 96260 96219
55050I6219k69q06j434j617j295o48K52J058J121M90P9L18M88O7l33j01K86J93
$$ 96219 95950 95144 93710 92093 90798 90150 90402 91460 92581 93071 93150 93468 93956 94023 93690 93589 93875 94068
55032I4068r2j07j79o81j109r07m45k40K2O63J012M07m88n46J29N52M85N00P20
$$ 94068 93976 93869 93690 93009 91900 90993 90548 90308 90330 90993 92005 92412 91924 91378 91507 92059 92544 93044 93764
55013I3764P14M85M74O57N76K77K75N79O41L10L9J17L58O71J187J651J404K76
$$ 93764 94478 94963 95437 96094 96670 96947 97222 97801 98442 98752 98791 98908 99266 99937 101124 102775 104179 104455
54995A04455q82j038q5J046J404R91O25Q69J340J325Q16L60P3m35j054j010m0
$$ 104455 103573 102535 102450 103496 104900 105891 106516 107385 108725 110050 110866 111226 111299 110864 109810 108800 108760
54978A08760R56J017L06k81k70J56O06P42L60l25p78p74n62k45M44J404J814J087
$$ 108760 109716 110733 111039 110758 110488 110644 111250 111992 112352 112027 111249 110475 109913 109668 110112 111516 113330 114417
54960A14417k74j215j256o85p5M3n66j450j697r70J2M11K91L48Q99J579J847J489
$$ 114417 114143 112928 111672 110987 110912 110955 110389 108939 107242 106272 106284 106695 106986 107334 108233 109812 111659 113148
54942A13148P43O4l42p15j178j274n82L83O88L15Q5K66K20l57r22j092j190j329
$$ 113148 113891 113955 113613 112898 111720 110446 109864 110247 110935 111250 111335 111601 111821 111464 110542 109450 108260 106931
54924A06931r54J02J051J258J122J274J677K137K853L855M613M888N184N736N883
$$ 106931 105977 106079 107130 108388 109510 110784 112461 114598 117451 121306 125919 130807 135991 141727 147610
54909A47610N140M043L165K143N44j126k244l102m135m820m518l738l406l398
$$ 147610 152750 156793 159958 162101 162645 161519 159275 156173 152038 147218 142700 138962 135556 132158
54895A32158l015k438k421k807k698j933j261r77n67J68P08P11M83L15J31l7J07
$$ 132158 129143 126705 124284 121477 118779 116846 115585 114608 114041 114209 114917 115628 116111 116426 116557 116520 116627
54878A16627N81J051J393J807K292K611K810L229L877M346M475M536M675M569
$$ 116627 117208 118259 119652 121459 123751 126362 129172 132401 136278 140624 145099 149635 154310 158879
54864A58879L872K600R83p35k231l118l252k955k847l353m273m873m615l797l144
$$ 158879 162751 165351 166334 165599 163368 160250 156998 154043 151196 147843 143570 138697 134082 130285 127141
54849A27141k798k275j413p97r12j458j829j803j460r53o74j067j879k170j441
$$ 127141 124343 122068 120655 119858 118946 117488 115659 113856 112396 111443 110769 109702 107823 105653 104212
54834A04212k33P16J296J536J073k05j527j974j499o86P1N76N99J99j10l2J00
$$ 104212 103979 104695 105991 107527 108600 108395 106868 104894 103395 102709 102780 103356 103955 104154 104044 104012 104112
54817A04112PJ3L80P21O75M68K92j75r56j238n16M80Q75R48J364J813J498N22
$$ 104112 104119 104132 104512 105233 105908 106376 106668 106493 105537 104299 103783 104263 105138 106086 107450 109263 110761 111283
54799A11283l22p40q92o83o9L24M2k37L18J164J135L07j88M5L86N40P62Q30K54
$$ 111283 110961 110221 109329 108646 108577 108901 108943 108706 109024 110188 111323 111630 111442 111487 111873 112413 113175 114005 114259
54780A14259m85l26N66Q42O9n50p6R41J662K190K806L058K512J690J368J484J504
$$ 114259 113774 113448 114014 114856 114925 114375 114299 115240 116902 119092 121898 124956 127468 129158 130526 132010 133514
54763A33514J427J770K748L977M890N153M808M230L764L387K870K121J070m92
$$ 133514 134941 136711 139459 143436 148326 153479 158287 162517 166281 169668 172538 174659 175729 175237
54749A75237k507m240m963m835m570m376l958l391l057k819k137j105m19k74j46
$$ 175237 172730 168490 163527 158692 154122 149746 145788 142397 139340 136521 134384 133279 132860 132586 132440
54734A32440Q6j57r79j520j183n77n54r43q81r3Q33J290J294J308J620J975J893
$$ 132440 132526 132369 131390 129870 128687 128110 127556 126613 125732 125639 126472 127762 129056 130364 131984 133959 135852
54717A35852J420J323K184L563M583N011N149M863L647J614l76j816k946l916
$$ 135852 137272 138595 140779 144342 148925 153936 159085 163948 167595 169209 168833 167017 164071 160155
54703A60155m369m170l842l814l827l439k666j809j071o43p05j062j219j024q35
$$ 160155 155786 151616 147774 143960 140133 136694 134028 132219 131148 130505 129800 128738 127519 126495 125660
54688A25660q69q55o31n51r48j531j751j465j017p38o78o54m56q7K45M48O72R78
$$ 125660 124791 123936 123305 122754 121806 120275 118524 117059 116042 115304 114626 113972 113516 113429 113674 114122 114794 115772
54670A15772J132R61O73M20r1j002j755j749j280j050j008n04M62J089R30M15
$$ 115772 116904 117865 118538 118958 118867 117865 116110 114361 113081 112031 111023 110519 110981 112070 113000 113415
54654A13415P9NJ67O00J053J141R18P37M97j88j054j256o08J14L51M44Q04J142
$$ 113415 113494 113499 113666 114266 115319 116460 117378 118115 118612 118424 117370 116114 115506 115620 115971 116415 117219 118361
54636A18361R75L91j52l28j8O49J158R36Q5o47p50l62J64N42M68j37p75q98p50
$$ 118361 119336 119727 119575 119247 119229 119878 121036 121972 122057 121410 120660 120298 120462 121004 121472 121335 120560 119662 118912
54617A18912r52j338j088o8R07J304J398J428J221Q87Q98J157Q99j2p33p32n37
$$ 118912 117960 116622 115534 115466 116373 117677 119075 120503 121724 122611 123509 124666 125565 125553 124820 124088 123551
54600A23551o88q97p98o30n60k35L95O78L23J1K50M64mp63j072r23o11jR47J542
$$ 123551 122863 121966 121168 120538 119978 119743 120138 120816 121139 121150 121400 121864 121860 121097 120025 119102 118491 118490 119437 120979
54580A20979J208M18K8J22L44O78J118J162N13j90l15l07q22j353q63N20J655
$$ 120979 122187 122605 122633 122755 123099 123777 124895 126057 126570 126380 126065 125758 124936 123583 122720 123240 124895
54563A24895J992J896J482L99j157k221k170j226J52J593K420J936M75o20n26
$$ 124895 126887 128783 130265 130664 129507 127286 125116 123890 124042 125635 128055 129991 130466 129846 129320
54548A29320J50L76N3j11K36O44N13r2n03k43M23R64J411K217L257L613K730J230
$$ 129320 129470 129846 129899 129788 130024 130668 131181 131089 130586 130343 130766 131730 133141 135358 138615 142228 144958 146188
54530A46188J10l97o40p49o96p33j064j335j149q07p19m89N06J749J895O42q02
$$ 146188 146298 145901 145261 144512 143816 143083 142019 140684 139535 138728 138009 137520 138026 139775 141670 142312 141510
54513A41510j353j269j275j286q00NL80J04j94O5O40Q40M27j67m79n79p81j009
$$ 141510 140157 138888 137613 136327 135527 135532 135912 136016 135822 135887 136527 137367 137794 137627 137148 136569 135788 134779
54495A34779q71k77L58O95P93P07K69m71r79q78m48j51K2K52L92K52J23L79P58
$$ 134779 133908 133631 133989 134684 135477 136184 136453 135982 135003 134125 133677 133526 133548 133800 134192 134444 134567 134946 135704
54476A35704P37M13L71P19R22O62K84K73O80J182J317P86j27m78L27J633K160
$$ 135704 136441 136854 137225 137944 138866 139528 139812 140085 140765 141947 143264 144050 143923 143445 143772 145405 147565
54459A47565J608Q57N56L15k98p76l98N14Q24j1j278j833j245q0O92N30k69r33
$$ 147565 149173 150030 150586 150901 150603 149827 149429 149943 150767 150756 149478 147645 146400 146320 147012 147542 147273 146340
54441A46340j051r19j017j313j352r75o10o67r30p78M8J094J689J514O53n84j674
$$ 146340 145289 144370 143353 142040 140688 139713 139103 138436 137506 136728 136776 137870 139559 141073 141726 141142 139468
54424A39468j922r65P19K128K663K529K215J896J460Q47J11o95j506k144k367
$$ 139468 137546 136581 137300 139428 142091 144620 146835 148731 150191 151038 151149 150454 148948 146804 144437
54409A44437k012j133j02N54O49N62P37J053J053P25N72Q60J232J232Q44L52M5
$$ 144437 142425 141292 141190 141744 142393 142955 143692 144745 145798 146523 147095 147955 149187 150419 151263 151615 151660
54392A51660J14N58R90J023Q06Q27J082J007M21j74l97n30q46j038p84l36o5J21
$$ 151660 151774 152332 153322 154345 155151 155978 157060 158067 158488 158314 157917 157387 156541 155503 154719 154383 154318 154439
54374A54439L92N17L15J66M11O80M58j8j24J90N18Q78J589K390K513J825J048
$$ 154439 154831 155348 155663 155829 156240 156920 157378 157360 157236 157426 157944 158822 160411 162801 165314 167139 168187
54357A68187O95M28j63p61p89l15N5M6N6N26J329J925K026J848J680J431Q35q1
$$ 168187 168882 169310 169147 168386 167597 167282 167337 167383 167439 167965 169294 171219 173245 175093 176773 178204 179039 178958
54339A78958r64j553j784j633j216r95j386k083k253j589o86k40k92m80n95o27
$$ 178958 177994 176441 174657 173024 171808 170813 169427 167344 165091 163502 162816 162576 162284 161804 161209 160582
54323A60582o94j043j691j991j233J45P32j00j411k050j944j493o46N17J148O52
$$ 160582 159888 158845 157154 155163 153930 154075 154807 154707 153296 151246 149302 147809 147163 147680 148828 149480
54307A49480j20L6Q18Q80n2q47p80m47m61m17K01Q75O11o15j674j529l13Q57J025
$$ 149480 149360 149396 150214 151094 151042 150195 149415 148968 148507 148090 148291 149166 149777 149162 147488 145959 145646 146503 147528
54288A47528K67n36o73j39P18J572K056J837J083M44K43J41j57m25n13o97r34
$$ 147528 147795 147259 146586 146447 147165 148737 150793 152630 153713 154157 154400 154541 154384 153959 153446 152749 151815
54271A51815n49N53J115P3j696k304j273J42Q90J126J294J350J230J118R28L20
$$ 151815 151266 151819 152934 153007 151311 149007 147734 147876 148766 149892 151186 152536 153766 154884 155812 156132
54255A56132n01p63j68O71J070J004P12L16M2K36Q35J270J114M85k60q26r61o37
$$ 156132 155631 154868 154700 155371 156441 157445 158157 158473 158515 158751 159586 160856 161970 162455 162195 161369 160408 159771
54237A59771k96m21q56j010o78k04M6j23q58j881k284j465j35M78K25k4J27L02
$$ 159771 159475 159054 158198 157188 156510 156306 156352 156229 155371 153490 151206 149741 149606 150084 150309 150285 150412 150714
54219A50714M24Q56J347J139L98K49R20J193L67n71n55o8p0l60j84K66K97P8K72
$$ 150714 151138 151994 153341 154480 154878 155127 156047 157240 157607 157036 156481 156413 156343 155983 155799 156065 156362 156440 156712
54200A56712O47K78q62j721j645j091o85m51k67l25o87q76l41P99J788J864Q49
$$ 156712 157359 157637 156775 155054 153409 152318 151633 151182 150915 150590 149903 149027 148686 149485 151273 153137 153986
54183A53986o91j823j941j229m02n0k05m15j84N02J070R67L48r5l7J63J33j5q9
$$ 153986 153295 151472 149531 148302 147900 147850 147645 147230 147046 147548 148618 149585 149933 149838 149801 149964 150097 150082 149993
54164A49993k46o17q58n47J85P59P91L77j48m39l39m2M9j75l32j5P10J402J671
$$ 149993 149747 149130 148272 147725 147910 148669 149460 149837 149689 149250 148911 148869 148918 148743 148411 148396 149106 150508 152179
54145A52179J365O17j13l73k35k02m23m21J13O85N48k88j112j315q71j16N23P24
$$ 152179 153544 154161 154048 153675 153440 153238 152815 152394 152507 153192 153740 153452 152340 151025 150154 150038 150561 151285
54127A51285N28L78N77Q26O82K86K74Q69J481J406O31k00m85j35N56J246J683
$$ 151285 151813 152191 152768 153594 154276 154562 154836 155705 157186 158592 159223 159023 158538 158403 158959 160205 161888
54110A61888J672J146L79n5K19Q68J107N72j90k99L90J002N97o51j537j243l02
$$ 161888 163560 164706 165085 165030 165249 166117 167224 167796 167606 167307 167697 168699 169296 168645 167108 165865 165563
54093A65563J55q9k76k2R3m07j009r74m05J46O13J230J764J765J399J216J198
$$ 165563 165718 165629 165353 165331 165424 165017 164008 163034 162629 162775 163388 164618 166382 168147 169546 170762 171960
54076A71960Q73K72j2K53O89J030J324J492J440J597K434L409L403K427J920K885
$$ 171960 172833 173105 173093 173346 174035 175065 176389 177881 179321 180918 183352 186761 190164 192591 194511 197396
54060A97396M697O216P210P989Q408P974O556M347J551j416l783m984n128m612
$$ 197396 202093 208309 215519 223508 231916 239890 246446 250793 252344 250928 247145 242161 237033 232421
54046B32421l716k749k021j325o1J733L099L365L023K919L129L275L334L545L904
$$ 232421 228705 225956 223935 222610 222549 224282 227381 230746 233769 236688 239817 243092 246426 249971 253875
54031B53875M329M892N378N131L945K632K082K221K468K672K851K549J455K65
$$ 253875 258204 263096 268474 273605 277550 280182 282264 284485 286953 289625 292476 295025 296480 296745
54017B96745p2K33P6r17k053k824l559m540n345n448m987m533m434m614m742m508
$$ 296745 296673 296906 296982 296065 294012 291188 287629 283089 277744 272296 267309 262776 258342 253728 248986 244478
54001B44478l976l629l783m034l662k614j644j431j919k522k664k090j027q4K59
$$ 244478 240502 236873 233090 229056 225394 222780 221136 219705 217786 215264 212600 210510 209483 209399 209658
53986B09658J36L0J09J43N7J32M53O48L79l7Q4Q77J621J573R67Q30J750L134L977
$$ 209658 209794 209824 209933 210076 210133 210265 210718 211366 211745 211708 211792 212669 214290 215863 216830 217660 219410 222544 226521
53967B26521L976L484K709J599L73n61j263k054k677k471j636j314j992k664k236
$$ 226521 230497 233981 236690 238289 238662 238101 236838 234784 232107 229636 228000 226686 224694 222030 219794
53952B19794r84R4O99J115J303J064P92J081J757K141K142K300K803L282L604
$$ 219794 218810 218904 219603 220718 222021 223085 223877 224958 226715 228856 230998 233298 236101 239383 242987
53937B42987M053M648N022N124N382N918O225N873N099M414M003L802L786L960
$$ 242987 247040 251688 256710 261834 267216 273134 279359 285232 290331 294745 298748 302550 306336 310296
53923C10296M238M564M971N407N718N920O345P329Q843J0483J1889J3124J4530
$$ 310296 314534 319098 324069 329476 335194 341114 347459 354788 363631 374114 386003 399127 413657
53910D13657J6154J7521J8052J7482J5554J1690N656j504p858j2088j4052j4026
$$ 413657 429811 447332 465384 482866 498420 510110 515766 514262 506404 494316 480264 466238
53898D66238j2365j0138q869q996r319q740p786p636q338r014r237r245r073q529
$$ 466238 453873 443735 434866 425870 416551 407811 400025 392389 384051 375037 365800 356555 347482 338953
53884C38953p851p532p502p229o474n402m212l303l404m677n998o080n101m296
$$ 338953 331102 323570 316068 308839 302365 296963 292751 289448 286044 281367 275369 269289 264188 259892
53870B59892m164m078l590l023k694k528k569k919l105k504j549j382k037k128
$$ 259892 255728 251650 248060 245037 242343 239815 237246 234327 231222 228718 227169 225787 223750 221622
53856B21622q99N02N89n34j631k134k419k664k496j785j037o52l75K41J016J230
$$ 221622 220723 221225 221814 221280 219649 217515 215096 212432 209936 208151 207114 206462 206087 206328 207344 208574
53840B08574N54m08p73m01N4J48J86N50J009J096P83L52j6j35L02J162J631J181
$$ 208574 209128 208720 207947 207546 207600 207748 207934 208484 209493 210589 211372 211724 211708 211573 211875 213037 214668 215849
53822B15849L70m1j94n47o89K5J002R31j28o11L07J640K210K176K253K459K520
$$ 215849 216219 216178 215984 215437 214748 214773 215775 216706 216578 215967 216274 217914 220124 222300 224553 227012 229532
53805B29532K736L517M538N189N452N703N917N731N177M735M703M877M783M047
$$ 229532 232268 235785 240323 245512 250964 256667 262584 268315 273492 278227 282930 287807 292590 296637
53791B96637K706J341P05R69J594J955J880J482Q88K30m12j186k185l032l265
$$ 296637 299343 300684 301389 302358 303952 305907 307787 309269 310157 310387 309975 308789 306604 303572 300307
53776C00307l201l743n088o287o448n776n056m599m237l876l537l123k596k210
$$ 300307 297106 293363 288275 281988 275540 269764 264708 260109 255872 251996 248459 245336 242740 240530
53762B40530k171k291k282k150k018j819j452j048p94o43m40j80k4j70p43j523
$$ 240530 238359 236068 233786 231636 229618 227799 226347 225299 224505 223862 223422 223242 223218 223048 222305 220782
53746B20782j911j532q15n21o90o43q5M69N80M96N32N14K86K11O26J228J488J397
$$ 220782 218871 217339 216524 216003 215313 214670 214585 215054 215634 216130 216662 217176 217462 217673 218299 219527 221015 222412
53728B22412J294J317J458J851K528L038K850K031J203R14J266J956K463K413
$$ 222412 223706 225023 226481 228332 230860 233898 236748 238779 239982 240896 242162 244118 246581 248994
53714B48994K004J825K117K478K541K543K918L602M149M340M315M185L820L083
$$ 248994 250998 252823 254940 257418 259959 262502 265420 269022 273171 277511 281826 286011 289831 292914
53700B92914K118J373J286J832K490K902L300L935M385M060L255K915L212L222
$$ 292914 295032 296405 297691 299523 302013 304915 308215 312150 316535 320595 323850 326765 329977 333199
53686C33199K295R66J33m8K6J40K51J61l45j228k243l090l394l064k608k558k625
$$ 333199 335494 336460 336593 336545 336571 336711 336962 337123 336778 335550 333307 330217 326823 323759 321151 318593 315968
53669C15968k165j452j421k009j968p95L79N49K35J82p5j132k219k264j728j733
$$ 315968 313803 312351 310930 308921 306953 306158 306537 307086 307321 307503 307428 306296 304077 301813 300085 298352
53653B98352j952j058R03K237J917O90l53r34r92k27J051J768J463R66J118J591
$$ 298352 296400 295342 296245 298482 300399 301089 300736 299802 298810 298583 299634 301402 302865 303831 304949 306540
53637C06540J681J488J568J944K284K584K972L156K790K204K120K716L529M146
$$ 306540 308221 309709 311277 313221 315505 318089 321061 324217 327007 329211 331331 334047 337576 341722
53623C41722M453M254L351K239K005L107M627N242M792M325M660N479O051O263
$$ 341722 346175 350429 353780 356019 358024 361131 365758 371000 375792 380117 384777 390256 396307 402570
53609D02570O427O516O206N630N373N643N977N939N620N267M962M854N172N626
$$ 402570 408997 415513 421719 427349 432722 438365 444342 450281 455901 461168 466130 470984 476156 481782
53595D81782N410M158K552J478R46L44o87k062l605n060o027o379o477o521o104
$$ 481782 487192 491350 493902 495380 496326 496670 495983 493921 490316 485256 479229 472850 466373 459852 453748
53580D53748m925l587k974l147l515l784m000l925l265k439k233k627k780k282
$$ 453748 448823 445236 442262 439115 435600 431816 427816 423891 420626 418187 415954 413327 410547 408265
53566D08265j619j234r10m03J9O3j39l47n65q03r26q89p58l48N78J649K044J647
$$ 408265 406646 405412 404502 404099 404118 404181 404042 403695 403130 402327 401401 400512 399754 399406 399984 401633 403677 405324
53548D05324J320J682K241K273J971K079K786L686M516N258N662N413M869M932
$$ 405324 406644 408326 410567 412840 414811 416890 419676 423362 427878 433136 438798 444211 449080 454012
53534D54012O012P540Q693R245R486R673R895J0337J1233J2515J3713J4403J4671
$$ 454012 460024 467564 476257 485502 494988 504661 514556 524893 536126 548641 562354 576757 591428
53521E91428J4962J5530J6186J6713J7302J8337J9854K1487K2933K4211K5400
$$ 591428 606390 621920 638106 654819 672121 690458 710312 731799 754732 778943 804343
53510H04343K6410K7179K7854K8582K9216K9467K9295K8916K8478K7891K7087
$$ 804343 830753 857932 885786 914368 943584 973051 1002346 1031262 1059740 1087631 1114718
53499A114718K6254K5624K5064K4182K2917K1844K1557K1839K1779K0869J9640
$$ 1114718 1140972 1166596 1191660 1215842 1238759 1260603 1282160 1303999 1325778 1346647 1366287
53488A366287J8970J9028J9204J8972J8463J8184J8423J9038J9604J9639J8816
$$ 1366287 1385257 1404285 1423489 1442461 1460924 1479108 1497531 1516569 1536173 1555812 1574628
53477A574628J7085J4637J1777Q844O156L905K044K69j914m993q983j3135j6375
$$ 1574628 1591713 1606350 1618127 1626971 1633127 1637032 1639076 1639345 1637431 1632438 1623455 1610320 1593945
53464A593945j8244j9219j9934k0432k0461k0206k0252k0904k1989k3317k4885
$$ 1593945 1575701 1556482 1536548 1516116 1495655 1475449 1455197 1434293 1412304 1388987 1364102
53453A364102k6426k7237k6849k5715k4846k4709k4760k4207k3044k2005k1474
$$ 1364102 1337676 1310439 1283590 1257875 1233029 1208320 1183560 1159353 1136309 1114304 1092830
53442A092830k0906j9492j7140j4405j1704r177p156o117n813n158l372q69J393
$$ 1092830 1071924 1052432 1035292 1020887 1009183 1000006 992850 986733 980920 975762 972390 971521 972914
53429I72914L065M429N721O990Q456J0332J2301J3740J4598J5558J7187J9250
$$ 972914 975979 980408 986129 993119 1001575 1011907 1024208 1037948 1052546 1068104 1085291 1104541
53417A104541K1033K2132K2831K3882K5937K9015L2434L5352L7362L8612L9554
$$ 1104541 1125574 1147706 1170537 1194419 1220356 1249371 1281805 1317157 1354519 1393131 1432685
53406A432685M0732M2572M5055M7686N0079N2378N4903N7529N9824O1660O3239
$$ 1432685 1473417 1515989 1561044 1608730 1658809 1711187 1766090 1823619 1883443 1945103 2008342
53395B008342O4542O5201O5086O4718O4775O5346O5811O5460O4130O2173N9890
$$ 2008342 2072884 2138085 2203171 2267889 2332664 2398010 2463821 2529281 2593411 2655584 2715474
53384B715474N7230N4195N1209M8607M5839M1959L6991L2111K8019K3918J8809
$$ 2715474 2772704 2826899 2878108 2926715 2972554 3014513 3051504 3083615 3111634 3135552 3154361
53373C154361J3171Q355M558L99n451j3088k1926l1505m1252n0111n7007o1599
$$ 3154361 3167532 3175887 3180445 3180844 3175393 3162305 3140379 3108874 3067622 3017511 2960504 2898905
53361B898905o4282o5760o6745o7711o8574o8794o8011o6462o4619o2646o0468
$$ 2898905 2834623 2768863 2702118 2634407 2565833 2497039 2429028 2362566 2297947 2235301 2174833
53350B174833n8193n6136n4516n3339n2617n2401n2472n2172n0873m8654m6296
$$ 2174833 2116640 2060504 2005988 1952649 1900032 1847631 1795159 1742987 1692114 1643460 1597164
53339A597164m4410m2812m0968l8762l6389l3737l0540k7124k4281k2141j9894
$$ 1597164 1552754 1509942 1468974 1430212 1393823 1360086 1329546 1302422 1278141 1256000 1236106
53328A236106j7042j4353j3007j3204j4103j4770j4727j3858j2412j0872r461
$$ 1236106 1219064 1204711 1191704 1178500 1164397 1149627 1134900 1121042 1108630 1097758 1088297
53317A088297p991o455n169m048k317L71L194N258O852Q663J0336J1043J1145
$$ 1088297 1080306 1073851 1068682 1064634 1062317 1062688 1065882 1071140 1077992 1086655 1096991 1108034 1119179
53304A119179J1967J3947J6193J8079K0061K2585K5173K7184K8549K9444L0006
$$ 1119179 1131146 1145093 1161286 1179365 1199426 1222011 1247184 1274368 1302917 1332361 1362367
53293A362367L0788L2619L5324L7296L7068L4933L2434L0620K9340K7906K5874
$$ 1362367 1393155 1425774 1461098 1498394 1535462 1570395 1602829 1633449 1662789 1690695 1716569
53282A716569K3304K0645J8297J6122J3577J0379O730K786j523n947r701j2278
$$ 1716569 1739873 1760518 1778815 1794937 1808514 1818893 1825623 1828409 1826886 1820939 1811238 1798960
53270A798960j4181j6446j9534k2995k6081k8427l0202l1716l2887l3301l2924
$$ 1798960 1784779 1768333 1748799 1725804 1699723 1671296 1641094 1609378 1576491 1543190 1510266
53259A510266l2573l3225l4936l6819l8007l8178l7368l5881l4399l3486l2916
$$ 1510266 1477693 1444468 1409532 1372713 1334706 1296528 1259160 1223279 1188880 1155394 1122478
53248A122478l2106l1223l1011l1474l1591l0761k9730k9524l0060l0353k9677
$$ 1122478 1090372 1059149 1028138 996664 965073 934312 904582 875058 844998 814645 784968
53237G84968k8014k5758k3427k1362j9394j7118j4684j2741j1441j0167q663p729
$$ 784968 756954 731196 707769 686407 667013 649895 635211 622470 611029 600862 592199 584470
53225E84470q106r250r952r873r742j0185j1059j1917j2591j3122j3489j3451
$$ 584470 576364 567114 557162 547289 537547 527362 516303 504386 491795 478673 465184 451733
53213D51733j2726j1421j0229r825r916r441p904o021m728m126l845l880m371
$$ 451733 439007 427586 417357 407532 397616 388175 380271 374250 369522 365396 361551 357671 353300
53200C53300m986n201n045m940m944m720m202l675l259k751k069j461j217j434
$$ 353300 348314 343113 338068 333128 328184 323464 319262 315587 312328 309577 307508 306047 304830 303396
53186C03396k042k770l192l085k761k714k957k949k298j264n05l75n94o84o27
$$ 303396 301354 298584 295392 292307 289546 286832 283875 280926 278628 277364 276859 276484 275890 275206 274579
53171B74579r04j734k592k781k267j442l69J043K207K110O64r58j689j601j237
$$ 274579 273675 271941 269349 266568 264301 262859 262490 263533 265740 267850 268514 267556 265867 264266 263029
53156B63029p43k20j96q72j429r88oK10p12j760j919j299o80n05o03o02l06J41
$$ 263029 262286 262066 261870 260998 259569 258581 258575 258785 258073 256313 254394 253095 252415 251910 251307 250705 250399 250540
53138B50540L58R8m38q09p97m84LN98J130J341J130P85P53J149J514J348P76L96
$$ 250540 250898 250996 250558 249749 248952 248468 248471 249069 250199 251540 252670 253455 254208 255357 256871 258219 258995 259391
53120B59391L59J39m18n33L11J248J095K06kP79J421J314J131J200P30n91j648
$$ 259391 259750 259889 259471 258938 259249 260497 261592 261798 261796 262575 263996 265310 266441 267641 268371 267780 266132
53103B66132j625j431k079k814k343j144p69j404j821j574j489j862j813q55K63
$$ 266132 264507 263076 260997 258183 255840 254696 253927 252523 250702 249128 247639 245777 243964 243109 243372
53088B43372Q05R66R98N98k17n65Q0Q88P57j26o66m26J7J63K31N23Q18O61Q9l54
$$ 243372 244177 245143 246141 246739 246522 245957 246037 246925 247682 247556 246890 246464 246481 246644 246875 247398 248216 248877 248966 248612
53068B48612k63J37K28l12j175j739j617r24j86J9m23j024j251j163j178j253
$$ 248612 248349 248486 248714 248402 247227 245488 243871 242947 242761 242780 242357 241333 240082 238919 237741 236488
53052B36488r18j47M11M14L57P17J147J078O19K07j99q67j514j570j070n78l73
$$ 236488 235570 235423 235834 236248 236605 237322 238469 239547 240166 240373 240174 239307 237793 236223 235153 234575 234202
53035B34202k27nJ48K05L37N73P72Q86R02O97K01l66p63j003j054o27L17J175
$$ 234202 233975 233970 234118 234323 234660 235233 236005 236891 237793 238490 238691 238325 237562 236559 235505 234878 235195 236370
53017B36370J328R20N23L13L4l95p17o69j23P63J346R75l1n33j24K48j85p52n20
$$ 236370 237698 238618 239141 239454 239488 239093 238376 237707 237584 238347 239693 240668 240637 240104 239980 240228 240043 239291 238771
52998B38771J93N27O12J072J623J509R30O29M68j46p31l37N39L92p79j176J63
$$ 238771 238964 239491 240103 241175 242798 244307 245237 245866 246334 246188 245457 245120 245659 246051 245272 244096 244259
52981B44259K069L116L252K923K048P62q1p3Q9r3k6P56J534J566J359J778K596
$$ 244259 246328 249444 252696 255619 257667 258429 258348 258275 258364 258271 258245 259001 260535 262101 263460 265238 267834
52964B67834K965K733K348J954J436R94Q28O71K97Lk5l33j424k823l679l939m138
$$ 267834 270799 273532 275880 277834 279270 280264 281092 281763 282060 282063 282038 281705 280281 277458 273779 269840 265702
52947B65702m343m050k991j486o8P81Q27L03k69p15j195j480r99OL05o82j884
$$ 265702 261359 257309 254318 252832 252764 253545 254372 254675 254406 253691 252496 251016 250017 250023 250328 249646 247762
52930B47762k044j389r35p85l15L91M27n36j714k153j567l40P75J030L31n46q03
$$ 247762 245718 244329 243394 242609 242294 242685 243112 242576 240862 238709 237142 236802 237577 238607 238938 238392 237589
52913B37589m32J11N90Q22M04o53j476j298n05KJ07K10K32j28m55o0P41R66M90
$$ 237589 237157 237268 237858 238680 239084 238431 236955 235657 235152 235154 235261 235471 235703 235575 235120 235060 235801 236767 237257
52894B37257J47K59K44j86n09l79j51m6K04N47L49m79j049p10M5M84O99J067J304
$$ 237257 237404 237663 237907 237721 237212 236833 236682 236636 236840 237387 237736 237257 236208 235498 235543 236027 236726 237793 239097
52875B39097R20J96j41M0K32J93K59P54J596K434K875K599J667O81K71M48P13
$$ 239097 240017 240213 240072 240112 240344 240537 240796 241550 243146 245580 248455 251054 252721 253402 253673 254121 254834
52858B54834P31O09N41N40N71O67P65O35J56m24o95o25q13j908l725n122n066
$$ 254834 255565 256174 256715 257255 257826 258493 259258 259893 260049 259625 258930 258305 257492 255584 251859 246737 241671
52841B41671l699k142j266j064j181j532k131k662k694k142j251k41O60J035N83
$$ 241671 237972 235830 234564 233500 232319 230787 228656 225994 223300 221158 219907 219666 220326 221361 221944
52826B21944k11k73Q49K205K316Q49r38j561q36J26K75l41q22m86M36J073Q62
$$ 221944 221733 221460 222309 224514 226830 227679 226741 225180 224344 224470 224745 224404 223582 223096 223532 224605 225467
52809B25467J89p1L73R03R52Q93J457K516L120K724J730O53n72k047l322l824
$$ 225467 225656 225585 225958 226861 227813 228706 230163 232679 235799 238523 240253 240906 240334 238287 234965 231141
52793B31141l538k791j787p65k64n51j089j122o40j57J72N61Q70O89J29j40J19
$$ 231141 227603 224812 223025 222260 221996 221445 220356 219234 218594 218437 218609 219170 220040 220729 220858 220718 220837
52776B20837M01L56L49Q02J473J837J760J402P79q6q43j071p86l89j53l6Q5K41
$$ 220837 221238 221594 221943 222745 224218 226055 227815 229217 229996 229910 229067 227996 227210 226821 226668 226632 226717 226958
52758B26958L92M36K32k31o96q10m36K20P13O24q6r02j049j77J337K708L328L068
$$ 226958 227350 227786 228018 227787 227091 226281 225845 226065 226778 227402 227316 226414 225365 225188 226525 229233 232561 235629
52740B35629K271J547J284J269R69K95j65J39J049K008K714L174L268K784J891
$$ 235629 237900 239447 240731 242000 242969 243264 243099 243238 244287 246295 249009 252183 255451 258235 260126
52725B60126J150R10R36P47J33p70j657k216k280k006j711j509j258r80j022j546
$$ 260126 261276 262186 263122 263869 264002 263232 261575 259359 257079 255073 253362 251853 250595 249615 248593 247047
52709B47047k132k227j795j213o60n4M66M99m7p06r38o25PO13Q17M33k11n26m06
$$ 247047 244915 242688 240893 239680 239020 238966 239432 239931 239884 239178 238240 237615 237622 238235 239052 239485 239274 238748 238342
52690B38342k96l19Q5J222K362K559J891J202Q54N11Q5M5N91J174J136L77p64
$$ 238342 238046 237727 237812 239034 241396 243955 245846 247048 247902 248413 248498 248543 249134 250308 251444 251821 251057
52673B51057j798k150j493k88M57K49m83j123j529j683j390p11k08k02k22L19
$$ 251057 249259 247109 245616 245328 245785 246034 245551 244428 242899 241216 239826 239115 238907 238705 238483 238802
52657B38802J199J721J698J582J747K168K725L337L786L736L026J780L33q45j448
$$ 238802 240001 241722 243420 245002 246749 248917 251642 254979 258765 262501 265527 267307 267640 266795 265347
52642B65347j621j829k176k287j954j526j280r63l70N6j81p71r98p43m02o2N11
$$ 265347 263726 261897 259721 257434 255480 253954 252674 251711 251341 251397 251216 250445 249447 248704 248302 248240 248751
52625B48751J152J362J184J226J679J877J173k46j578k159j779p51K48O88O59
$$ 248751 249903 251265 252449 253675 255354 257231 258404 258158 256580 254421 252642 251891 252139 252827 253486
52610B53486N58M59K42J77O36J198R00l74j487j490p33n5M62J153J718J470N27
$$ 253486 254044 254503 254745 254922 255558 256756 257656 257282 255795 254305 253572 253517 253979 255132 256850 258320 258847
52593B58847j24Q6O34P17K29m20r51j361j580j414q28m2O59J116J267J101P15
$$ 258847 258723 258809 259443 260160 260389 259969 259018 257657 256077 254663 253835 253793 254452 255568 256835 257936 258651
52576B58651L95M34P97J059Q08J29n02p57p27o33m67j52J48J20k53o00n38q2M33
$$ 258651 259046 259480 260277 261336 262144 262273 261771 261014 260287 259654 259187 259035 259183 259303 259050 258450 257912 257830 258263
52557B58263O77N36R5m63r66j288j356j115n69R9O02Q28J032J496K036K031J134
$$ 258263 258940 259476 259571 259108 258142 256854 255498 254383 253814 253913 254515 255343 256375 257871 259907 261938 263072
52540B63072k40j302j637j418r57m34j4K9l99j027j369j093k04R19J672J636R66
$$ 263072 262832 261530 259893 258475 257518 257084 257070 257099 256700 255673 254304 253211 253007 253926 255598 257234 258200
52523B58200K80J8P1Rl95r97j389j189l59O84J469J956K433K931L123K936K850
$$ 258200 258480 258498 258569 258578 258183 257186 255797 254608 254249 254933 256402 258358 260791 263722 266845 269781 272631
52506B72631L305M135M857N175M931L840J839m74k192k980l241l452l655l694
$$ 272631 275936 280071 284928 290103 295034 298874 300713 300239 298047 295067 291826 288374 284719 281025
52492B81025l589l436l101k308j096o4N2q19j860k082j346m03J9l0M7O83J705
$$ 281025 277436 274000 270899 268591 267495 267431 267483 266664 264804 262722 261376 260973 260992 260962 261009 261692 263397
52475B63397K429K189J065M6M9Q05J230R36O84J058J559J578J555K262L380L786
$$ 263397 265826 268015 269080 269126 269175 269980 271210 272146 272830 273888 275447 277025 278580 280842 284222 288008
52459B88008L120K209J818J825J744J410P91k68j699k991l681l868m023m388m736
$$ 288008 291128 293337 295155 296980 298724 300134 300925 300657 298958 295967 292286 288418 284395 280007 275271
52444B75271m571l531j782j15N90R7r90j799j878j383p41j77M28J118J506J134
$$ 275271 270700 267169 265387 265272 265862 265959 264969 263170 261292 259909 259168 258991 259419 260537 262043 263177
52428B63177K81j39K83Q53P64J99n0K54P37J220J819K279K027J104M25P17J706
$$ 263177 263458 263319 263602 264455 265219 265418 265368 265622 266359 267579 269398 271677 273704 274808 275233 275950 277656
52411B77656K569K924L020L309M024N114O402P858R554J1184J1802J0461P178
$$ 277656 280225 283149 286169 289478 293502 298616 305018 312876 322430 333614 345416 355877 363055
52398C63055K937j170m553o956q215q342p597o358n055m123l654l166k099n43
$$ 363055 365992 364822 360269 353313 345098 336756 329159 322801 317746 313623 309969 306803 304704 304161
52384C04161P84J280R07M1p15p46J00J266K051K400K761L307L791M082M318M531
$$ 304161 304945 306225 307132 307173 306458 305712 305812 307078 309129 311529 314290 317597 321388 325470 329788 334319
52368C34319M642M769N135N641N942N878N306L855J478r12k218k507k665k835
$$ 334319 338961 343730 348865 354506 360448 366326 371632 375487 376965 376053 373835 371328 368663 365828
52354C65828k229p51M45N54K51M99J094J304J242J579K251K482K093J865K508
$$ 365828 363599 362848 363293 363847 364098 364597 365691 366995 368237 369816 372067 374549 376642 378507 381015
52339C81015L839N186O172O904P673Q615R604J0439J1106J1699J2136J2283J2420
$$ 381015 384854 390040 396212 403116 410789 419404 429008 439447 450553 462252 474388 486671 499091
52326D99091J3195J4903J7062J8986K0376K1278K1701K1672K1355K0891K0279
$$ 499091 512286 527189 544251 563237 583613 604891 626592 648264 669619 690510 710789
52315G10789J9501J8579J7368J5691J3759J2060J0650R118P466O468O655P377
$$ 710789 730290 748869 766237 781928 795687 807747 818397 827515 834981 841449 848104 855481
52303H55481P418O286M443K552R95ol48j83J80M58L73l16j521k767l745m661n848
$$ 855481 862899 869185 873628 876180 877175 877169 876821 876638 876818 877276 877649 877333 875812 873045 869300 864639 858791
52286H58791p191q193q361p360n159k312K37J996L367M956O840Q761J0648J2420
$$ 858791 851600 843407 835046 827686 822527 820215 820452 822448 825815 830771 837611 846372 857020 869440
52272H69440J3674J4172J4398J5023J5898J6228J5652J4562J3310J1772R975Q550
$$ 869440 883114 897286 911684 926707 942605 958833 974485 989047 1002357 1014129 1024104 1032654
52260A032654Q076Q164P740O288M502L458L316L262K706K117K249K962L373L062
$$ 1032654 1040730 1048894 1056634 1062922 1067424 1070882 1074198 1077460 1080166 1082283 1084532 1087494 1090867 1093929
52246A093929K361J474J02j735l286m049m544n482o579o879o029m551l018j626
$$ 1093929 1096290 1097764 1097866 1096131 1092845 1088796 1084252 1078770 1072191 1065312 1059283 1054732 1051714 1050088
52232A050088m61M07J141J981K798L237L334L614M391N346N886N815N458N301
$$ 1050088 1049627 1050034 1051175 1053156 1055954 1059191 1062525 1066139 1070530 1075876 1081762 1087577 1093035 1098336
52218A098336N535N917O174O456P176Q269R027Q956Q518Q622R494J0538J1181
$$ 1098336 1103871 1109788 1115962 1122418 1129594 1137863 1146890 1155846 1164364 1172986 1182480 1193018 1204199
52205A204199J1412J1362J0796R378P351N622M916M950M748L883L090L266M201
$$ 1204199 1215611 1226973 1237769 1247147 1254498 1260120 1265036 1269986 1274734 1278617 1281707 1284973 1289174
52192A289174M866M777M365L987L427K604K020K011K185J996J342K40j389l145
$$ 1289174 1294040 1298817 1303182 1307169 1310596 1313200 1315220 1317231 1319416 1321412 1322754 1322994 1321605 1318460
52178A318460m125m153m373n767p755r140r851j0588j1178j0701r218p940p368
$$ 1318460 1314335 1310182 1305809 1300042 1292287 1283147 1273296 1262708 1251530 1240829 1231611 1223671 1216303
52165A216303o494m454j955k91L16N27O31M45K41P71K170L481L699K841J647M93
$$ 1216303 1209809 1205355 1203400 1203109 1203425 1203952 1204583 1205028 1205269 1206040 1208210 1211691 1215390 1218231 1219878 1220371
52149A220371p98k182l037k940k380k141k269k192j679j020k97O93J663J825J007
$$ 1220371 1219573 1217391 1214354 1211414 1209034 1206893 1204624 1202432 1200753 1199733 1199436 1200129 1201792 1203617 1204624
52134A204624O7k42q9K78J325L477O169Q543J0559J2562J4336J5556J6846J9146
$$ 1204624 1204691 1204449 1204360 1204638 1205963 1209440 1215609 1224152 1234711 1247273 1261609 1277165 1294011 1313157
52120A313157K2202K4742K6154K6941K7553K7767K7418K6661K5282K2722J9220
$$ 1313157 1335359 1360101 1386255 1413196 1440749 1468516 1495934 1522595 1547877 1570599 1589819
52109A589819J5904J3323J0690P180L192l38l228n835q037r239r318q834q314
$$ 1589819 1605723 1619046 1629736 1636916 1640108 1639770 1636542 1630707 1622670 1613431 1604113 1595279 1586965
52096A586965p734o797n335l471j631m17k22q64j666k010j869j857k607l995n097
$$ 1586965 1579231 1572434 1567099 1563628 1561997 1561580 1561358 1560494 1558828 1556818 1554949 1553092 1550485 1546490 1541393
52081A541393n147m254k932j209J257M312P190R382J1088J2560J3549J3716J3264
$$ 1541393 1536246 1531992 1529060 1527851 1529108 1533420 1540610 1549992 1561080 1573640 1587189 1600905 1614169
52068A614169J2826J2876J3436J4168J4529J4008J2425J0089P533N094K710P4
$$ 1614169 1626995 1639871 1653307 1667475 1682004 1696012 1708437 1718526 1726059 1731153 1733863 1733937
52056A733937k820n441p292q720j0634j3153j5155j5628j4982j4422j4480j4956
$$ 1733937 1731117 1725676 1718384 1709664 1699030 1685877 1670722 1655094 1640112 1625690 1611210 1596254
52044A596254j5854j7346j8961j9853k0019k0283k0918k1141k0273j8525j6319
$$ 1596254 1580400 1563054 1544093 1524240 1504221 1483938 1463020 1441879 1421606 1403081 1386762
$$ [...]
##END NTUPLES=NMR SPECTRUM
##END=
