
##TITLE=AC1396_KENAH12208_7519595_p3BysR0INB
##JCAMPDX= 6.0         $$ Bruker NMR JCAMP-DX V2.0
##DATA TYPE= NMR SPECTRUM
##DATA CLASS= NTUPLES
##ORIGIN= BRUKER
##OWNER= Administrator
$$ 1.72 TOPSPIN		Version 2.1
$$ 2013-02-20 02:08:33.576 -0500  Administrator@X
$$ Compression mode = diff/dup
##.OBSERVE FREQUENCY= 400.02188249412
##.OBSERVE NUCLEUS= ^1H
##.ACQUISITION MODE= SIMULTANEOUS (DQD)
##.ACQUISITION SCHEME= undefined
##.AVERAGES= 64
##.DIGITISER RES= 22
##SPECTROMETER/DATA SYSTEM= spect
##.PULSE SEQUENCE= noesygpps1d.comp
##.SOLVENT NAME= COFFEE_meoh
##.SHIFT REFERENCE= INTERNAL, COFFEE_meoh, 1, 14.96072
##AUDIT TRAIL= $$ (NUMBER, WHEN, WHO, WHERE, PROCESS, VERSION, WHAT)
$$ ##TITLE= Audit trail, TOPSPIN		Version 2.1
$$ ##JCAMPDX= 5.01
$$ ##ORIGIN= Bruker BioSpin GmbH
$$ ##OWNER= Administrator
$$ $$ E:\/data/COFFEE/nmr/AC1396_KENAH12208_7519595_p3BysR0INB/12/pdata/1/auditp.txt
$$ ##AUDIT TRAIL=  $$ (NUMBER, WHEN, WHO, WHERE, PROCESS, VERSION, WHAT)
(   1,<2013-02-20 02:08:27.747 -0500>,<Administrator>,<X>,<go>,<TOPSPIN 2.1>,
      <created by zg
	started at 2013-02-20 01:56:57.793 -0500,
	POWCHK enabled, PULCHK disabled,
       configuration hash MD5:
       86 BA 57 50 F2 9D 5C 9B 26 00 A9 28 5F 66 2E 89
       data hash MD5: 64K
       A0 73 D4 E3 1D F5 3F 3F 3D DA 79 56 66 A1 6A 4C>)
(   2,<2013-02-20 02:08:30.826 -0500>,<Administrator>,<X>,<proc1d>,<TOPSPIN 2.1>,
      <Start of raw data processing
       efp LB = 0.3 FT_mod = 6 PKNL = 1 PHC0 = 0 PHC1 = 0 SI = 128K 
       data hash MD5: 128K
       03 6B 12 52 58 DF BC F1 02 5A 1D 1B 3E FC 98 B7>)
(   3,<2013-02-20 02:08:31.872 -0500>,<Administrator>,<X>,<proc1d>,<TOPSPIN 2.1>,
      <pk PHC0 = 251.6803 PHC1 = 0 
       data hash MD5: 128K
       64 2A 6E AA C4 E9 20 77 4A BD BD 7C B9 3A 75 8A>)
(   4,<2013-02-20 02:08:32.544 -0500>,<Administrator>,<X>,<proc1d>,<TOPSPIN 2.1>,
      <abs ABSG = 1 
       data hash MD5: 128K
       0E C3 A6 15 EC DF 1A FE 9E F8 21 1E EC 1E 68 5C>)
(   5,<2013-02-20 02:08:32.716 -0500>,<Administrator>,<X>,<proc1d>,<TOPSPIN 2.1>,
      <abs ABSG = 2 
       data hash MD5: 128K
       F8 85 1F 98 78 DD 36 37 AC 84 E0 FD 34 07 D3 5C>)
(   6,<2013-02-20 02:08:32.872 -0500>,<Administrator>,<X>,<proc1d>,<TOPSPIN 2.1>,
      <abs ABSG = 3 
       data hash MD5: 128K
       DD 01 DE 76 C2 D3 F0 36 5B DD 04 EE AD 1A 93 2B>)
(   7,<2013-02-20 02:08:33.044 -0500>,<Administrator>,<X>,<proc1d>,<TOPSPIN 2.1>,
      <abs ABSG = 4 
       data hash MD5: 128K
       1D 0E 1A 38 53 1E 6B 2A 07 76 B4 BF 53 B3 87 44>)
(   8,<2013-02-20 02:08:33.232 -0500>,<Administrator>,<X>,<proc1d>,<TOPSPIN 2.1>,
      <abs ABSG = 5 
       data hash MD5: 128K
       96 85 20 F1 99 76 DA A4 F1 BB B1 B3 99 DA 56 32>)
$$ ##END=
$$ 
$$ $$ hash MD5
$$ $$ EB 4A 9D 1E 49 AD 4B E6 BD 33 B9 F8 F1 D5 46 EB
##$RELAX= 
##$RELAX= 
##$RELAX= 
##$RELAX= 
##$RELAX= 
##$RELAX= 
##$RELAX= 
##$RELAX= 
$$ Bruker specific parameters
$$ --------------------------
##$DU= <E:\>
##$EXPNO= 12
$$ [...]
150 150 150 150 150 150 150 150
##$TP07= 0
##$TPNAME0= <>
##$TPNAME1= <>
##$TPNAME2= <>
##$TPNAME3= <>
##$TPNAME4= <>
##$TPNAME5= <>
##$TPNAME6= <>
##$TPNAME7= <>
##$TPOAL= (0..7)
0.5 0.5 0.5 0.5 0.5 0.5 0.5 0.5
##$TPOFFS= (0..7)
0 0 0 0 0 0 0 0
##$TUNHIN= 0
##$TUNHOUT= 0
##$TUNXOUT= 0
##$USERA1= <user>
##$USERA2= <user>
##$USERA3= <user>
##$USERA4= <user>
##$USERA5= <user>
##$V9= 5
##$VALIST= <valist>
##$VCLIST= <CCCCCCCCCCCCCCC>
##$VD= 0
##$VDLIST= <DDDDDDDDDDDDDDD>
##$VPLIST= <PPPPPPPPPPPPPPP>
##$VTLIST= <TTTTTTTTTTTTTTT>
##$WBST= 1024
##$WBSW= 4
##$XGAIN= (0..3)
0 0 0 0
##$XL= 0
##$YL= 0
##$YMAX_a= 6501328
##$YMIN_a= -11229006
##$ZGOPTNS= <>
##$ZL1= 120
##$ZL2= 120
##$ZL3= 120
##$ZL4= 120
##$ABSF1= 14.96072
##$ABSF2= -5.597462
##$ABSG= 5
##$ABSL= 3
##$ALPHA= 0
##$AQORDER= 0
##$ASSFAC= 0
##$ASSFACI= 0
##$ASSFACX= 0
##$ASSWID= 0
##$AUNMP= <proc_prof1d_extract.lims>
##$AXLEFT= 0
##$AXNAME= <>
##$AXNUC= <1H>
##$AXRIGHT= 0
##$AXTYPE= 0
##$AXUNIT= <>
##$AZFE= 0.1
##$AZFW= 0.1
##$BCFW= 0
##$BC_mod= 0
##$BYTORDP= 0
##$COROFFS= 0
##$CY= 15
##$DATMOD= 1
##$DC= 0
##$DFILT= <>
##$DTYPP= 0
##$F1P= 0
##$F2P= 0
##$FCOR= 0.5
##$FTSIZE= 131072
##$FT_mod= 6
##$GAMMA= 0
##$GB= 0
##$INTBC= 1
##$INTSCL= 1
##$ISEN= 128
##$LB= 0.3
##$LEV0= 0
##$LPBIN= 0
##$MAXI= 10000
##$MC2= 0
##$MEAN= 0
##$ME_mod= 0
##$MI= 0
##$NCOEF= 0
##$NC_proc= -2
##$NLEV= 6
##$NOISF1= 0
##$NOISF2= 0
##$NSP= 0
##$NTH_PI= 0
##$NZP= 0
##$OFFSET= 14.96072
##$PC= 1
##$PHC0= 251.6803
##$PHC1= 0
##$PH_mod= 1
##$PKNL= yes
##$PPARMOD= 0
##$PPDIAG= 0
##$PPIPTYP= 0
##$PPMPNUM= 2147483647
##$PPRESOL= 1
##$PSCAL= 4
##$PSIGN= 0
##$PYNMP= <proc.py>
##$REVERSE= no
##$SF= 400.020009747512
##$SI= 131072
##$SIGF1= 0
##$SIGF2= 0
##$SINO= 400
##$SIOLD= 131072
##$SPECTYP= <>
##$SREGLST= <1H.CDCl3>
##$SSB= 0
##$STSI= 131072
##$STSR= 0
##$SW_p= 8223.68421052631
##$SYMM= 0
##$S_DEV= 0
##$TDeff= 65536
##$TDoff= 0
##$TI= <>
##$TILT= no
##$TM1= 0
##$TM2= 0
##$TOPLEV= 0
##$USERP1= <user>
##$USERP2= <user>
##$USERP3= <user>
##$USERP4= <user>
##$USERP5= <user>
##$WDW= 1
##$XDIM= 131072
##$YMAX_p= 433572916
##$YMIN_p= -11801
##$CURPLOT= <Network HP LaserJet P1505>
##$CURPRIN= <$Network HP LaserJet P1505>
##$DFORMAT= <normdp>
##$LAYOUT= <+/1D_H.xwp>
##$LFORMAT= <normlp>
##$PFORMAT= <normpl>
##$SURQMSG= 1
$$ End of Bruker specific parameters
$$ ---------------------------------
##NTUPLES= NMR SPECTRUM
##VAR_NAME=  FREQUENCY,     SPECTRUM/REAL,   SPECTRUM/IMAG
##SYMBOL=    X,             R,               I
##VAR_TYPE=  INDEPENDENT,   DEPENDENT,       DEPENDENT
##VAR_FORM=  AFFN,          ASDF,            ASDF
##VAR_DIM=   131072,        131072,          131072
##UNITS=     HZ,            ARBITRARY UNITS, ARBITRARY UNITS
##FACTOR=    0.0627417313425164, 1,          1
##FIRST=     8223.62146879497, -1569,        -61748
##LAST=      0,             -179,            -62508
##MIN=       0,             -11801,          0
##MAX=       8223.62146879497, 433572916,    0
$$ Real data points
##PAGE= N=1
##DATA TABLE= (X++(R..R)), XYDATA
$$ [...]
61606D12924l667l890m529n164n016m141l432l328l346l055k670k409k019j457
61592C64801j277j846k634k897k605k224j937j607j236r45o69l27k11p47j861
61577C41778k875l059k186o36Q39J514J142J90m82l43L61Q86Q36N96P39J102R33
61560C41335P3n90k70O14J067Q92P10Q41R66R38J040J323J367R56M36P6k36m67
61542C51071j60Q62J969K338J809R01L46P80K314M084M753L884K398J322O45j41
61526C79175r57j350j392j574j965k160j980j629j250q61o32o59n25J91J077J230
61510C64739N12k43m37l63m21m40k57k56p01r57k49J084J823J366M02l2L85J228
61492C67183J909K048J650J151J058J403J680J496R71M32J9j46K10J155K215K806
$$ y = [412924, 409257, 405367, 400838, 395674, 390658, 386517, 383085, 379757, 376411, 373356, 370686, 368277, 366258, 364801, 363524, 361678, 359044, 356147, 353542, 351318, 349381, 347774, 346538, 345593, 344924, 344597, 344386, 343639, 341778, 338903, 335844, 333658, 333022, 333861, 335375, 336517, 336707, 336225, 335882, 336243, 337129, 337965, 338561, 339300, 340402, 341335, 341408, 340818, 340548, 341162, 342229, 343121, 343831, 344672, 345638, 346576, 347616, 348939, 350306, 351262, 351698, 351774, 351538, 351071, 350911, 351773, 353742, 356080, 357889, 358790, 359136, 359916, 362230, 366314, 371067, 374951, 377349, 378671, 379316, 379175, 378218, 376868, 375476, 373902, 371937, 369777, 367797, 366168, 364918, 364057, 363425, 362766, 362241, 362432, 363509, 364739, 365251, 365008, 364571, 364208, 363787, 363347, 363090, 362834, 362133, 361176, 360927, 362011, 363834, 365200, 365602, 365570, 365955, 367183, 369092, 371140, 372790, 373941, 374999, 376402, 378082, 379578, 380549, 380981, 381000, 380854, 381064, 382219, 384434, 387240]
61476C87240K901K927L120L330L443L504L350K583J095o49k051k851l037k616
61462D02289j775j004p66j052j507j882k180k466k676k666k317j617p32J05P74
61447C80528J271J523J447J282J524K285K996L033K564K312K552K753K410J898
61433D10378K089L121L958L429J567m07j387j332q03r5Q19J775K483K969L414
61418D31978L602L057J881Q41M68N00M69L33K49J67N3J53N75R17P16J05l40l54
61400D45370k01k97p80j414j795j668j139m54K73R19J119O81J01NJ88m8n82n04
61382D39774L52R46O62K77N75J004P71L73Q22J875K372K000J438R70K31o65r64
61365D52813m89qj23n48p35m38L82J447J921J202L9r4J106K444L118L800N298
$$ y = [387240, 390141, 393068, 396188, 399518, 402961, 406465, 409815, 412398, 413493, 412844, 410793, 407942, 404905, 402289, 400514, 399510, 398744, 397692, 396185, 394303, 392123, 389657, 386981, 384315, 381998, 380381, 379649, 379754, 380528, 381799, 383322, 384769, 386051, 387575, 389860, 392856, 395889, 398453, 400765, 403317, 406070, 408480, 410378, 412467, 415588, 419546, 422975, 424542, 424135, 422748, 421416, 420613, 420518, 421337, 423112, 425595, 428564, 431978, 435580, 438637, 440518, 441359, 441827, 442327, 442796, 443129, 443378, 443545, 443598, 443751, 444326, 445243, 445959, 446064, 445724, 445370, 445169, 444872, 444092, 442678, 440883, 439215, 438076, 437622, 437895, 438814, 439933, 440614, 440715, 440720, 440908, 440860, 440278, 439774, 440126, 441072, 441734, 442011, 442586, 443590, 444361, 444734, 445556, 447431, 449803, 451803, 453241, 454211, 454442, 453777, 452813, 452324, 452316, 452193, 451645, 450910, 450472, 450854, 452301, 454222, 455424, 455463, 455369, 456475, 458919, 462037, 465837, 471135]
61348D71135P138Q205Q135P290N976M433L214K813L019L192L076K948L084L415
61334E37073L663L578L133K563K130J783J270M77n00j529k290k246j296l16k51
61319E47242p08l44J226K856L552L783M495N659O586P136P722Q412Q838Q924R075
61304F24454R600J0437J1351J2011J1914J0594Q056M846J691q53k674m128n630
61291F91669p141q256q848r240r612r670r182q436p838p343o680n850n040m230
61277E84303l239k100j093m06O8O58J619K783L547L487K915K505K419K292K106
61262F01864K384L320M331M956N591O761Q039Q335P184N311L866L379L415L071
61248F71807J946O28M7L23O57M53o8n72j290k412l311l141k046j109j072j558
$$ y = [471135, 478273, 486478, 494613, 501903, 507879, 512312, 515526, 518339, 521358, 524550, 527626, 530574, 533658, 537073, 540736, 544314, 547447, 550010, 552140, 553923, 555193, 555670, 555170, 553641, 551351, 549105, 547809, 547493, 547242, 546534, 546190, 547416, 550272, 553824, 557607, 562102, 567761, 574347, 581483, 589205, 597617, 606455, 615379, 624454, 634054, 644491, 655842, 667853, 679767, 690361, 698417, 703263, 704954, 704101, 701427, 697299, 691669, 684528, 676272, 667424, 658184, 648572, 638902, 629720, 621284, 613446, 606103, 599423, 593573, 588533, 584303, 581064, 578964, 577871, 577465, 577533, 578191, 579810, 582593, 586140, 589627, 592542, 595047, 597466, 599758, 601864, 604248, 607568, 611899, 616855, 622446, 629207, 637246, 645581, 652765, 658076, 661942, 665321, 668736, 671807, 673753, 674381, 674428, 674751, 675408, 675861, 675793, 675221, 673931, 671519, 668208, 665067, 663021, 661912, 660840, 659282]
61232F59282j712j161k31N95J265K174L601N202O255O503O421O586P037P402P353
61217G16572O782N836N000M816N292N837O015N960N821N223L838K192J287J441
61203G81912K021K327K334K433K850L576M665O245Q234J0210J1801J3131J4622
61190H66361J6171J6833J5661J2783R269O082L549J738P35L78K00m6k32l03n85
61175I48594j325k272k977l304l468l759m380n285o128o557o587o456o244o021
61161H83831o202p185q583r497r576r232q762p929o628n126l435j214J350L414
61147H05226M677N846P279Q003O935M460J859l23k308l843m132l018j353P1J281
61132H30660K660M327O168Q000R469J0191J0210J0134J0649J2063J4241J6765
$$ y = [659282, 657570, 656409, 656178, 656773, 658038, 660212, 663813, 669015, 675270, 681773, 688194, 694780, 701817, 709219, 716572, 723354, 729190, 734190, 739006, 744298, 750135, 756150, 762110, 767931, 773154, 776992, 779184, 780471, 781912, 783933, 786260, 788594, 791027, 793877, 797453, 802118, 808363, 816597, 826807, 838608, 851739, 866361, 882532, 899365, 915026, 927809, 937078, 943160, 946709, 948447, 949182, 949560, 949760, 949714, 949482, 949179, 948594, 947269, 944997, 942020, 938716, 935248, 931489, 927109, 921824, 915696, 909139, 902552, 896096, 889852, 883831, 877629, 870444, 861861, 852364, 842788, 833556, 824794, 816865, 810237, 805111, 801676, 800462, 801812, 805226, 809903, 815749, 823028, 831031, 837966, 842426, 844285, 843962, 841654, 837811, 833679, 830661, 829308, 829379, 830660, 833320, 837647, 843815, 851815, 861284, 871475, 881685, 891819, 902468, 914531, 928772, 945537]
61120I45537J9132K1042K2538K3814K4975K6070K7181K8237K8971K9213K9151
61109A225861K9025K8734K8036K6986K5915K4980K3910K2232J9711J6524J3034
61098A484948R299M983j9n043r156j2227j5031j8152k1199k3315k4155k4128k3978
61085A322827k4285k5064k5726k5673k5005k4354k3950k3316k2041k0414j9061
61074A063938j8229j7634j6804j5445j3722j2165j1054r968q367o463n011m242
61062I24834l637k851k197k028k147k046j356l8J479K500K842L287M653O590Q052
61047I37937Q775R423J0433J1669J3117J4908J6664J7852J8789K0195K1864K2953
61035A124579K3561K4676K6411K7813K8585K9510L0858L2002L3015L4973L8050
$$ y = [945537, 964669, 985711, 1008249, 1032063, 1057038, 1083108, 1110289, 1138526, 1167497, 1196710, 1225861, 1254886, 1283620, 1311656, 1338642, 1364557, 1389537, 1413447, 1435679, 1455390, 1471914, 1484948, 1494247, 1499230, 1499211, 1494168, 1485012, 1472785, 1457754, 1439602, 1418403, 1395088, 1370933, 1346805, 1322827, 1298542, 1273478, 1247752, 1222079, 1197074, 1172720, 1148770, 1125454, 1103413, 1082999, 1063938, 1045709, 1028075, 1011271, 995826, 982104, 969939, 958885, 948917, 940550, 934087, 929076, 924834, 921197, 918346, 916149, 914121, 911974, 909928, 908572, 908534, 910013, 912513, 915355, 918642, 923295, 929885, 937937, 946712, 956135, 966568, 978237, 991354, 1006262, 1022926, 1040778, 1059567, 1079762, 1101626, 1124579, 1148140, 1172816, 1199227, 1227040, 1255625, 1285135, 1315993, 1347995, 1381010, 1415983, 1454033]
61024A454033M0885M2499M3301M3696M3477M3371M5228M9774N5799O2546P0871
61013A995480Q1087R1664J01473J11508J23450J38745J60153J91425K33733K85195
61003C513913L45409M17246N02594O01374P18287Q65196J051813J278991J544515
60994A0839338J838946K111040K240037K082622J589980Q86024K09151k39931
60986B1557207l99328l18498p6279K41004N01164N31528K18791l85806j079626
60977B0790157j640930j955686k036604j956629j785879j574546j357750j155700
60969G326433r74100q13174o75083n60987m66818l87211l20863k68443k27941
60960B631813j95601j69481j48850j31787j16303j02570r1408q1690p1661o1723
$$ y = [1454033, 1494918, 1537417, 1580718, 1624414, 1667891, 1711262, 1756490, 1806264, 1862063, 1924609, 1995480, 2076567, 2168231, 2269704, 2381212, 2504662, 2643407, 2803560, 2994985, 3228718, 3513913, 3859322, 4276568, 4779162, 5380536, 6098823, 6964019, 8015832, 9294823, 10839338, 12678284, 14789324, 17029361, 19111983, 20701963, 21587987, 21797138, 21557207, 21157879, 20839381, 20763102, 21004106, 21505270, 22036798, 22255589, 21869783, 20790157, 19149227, 17193541, 15156937, 13200308, 11414429, 9839883, 8482133, 7326433, 6352333, 5539159, 4864076, 4303089, 3836271, 3449060, 3128197, 2859754, 2631813, 2436212, 2266731, 2117881, 1986094, 1869791, 1767221, 1675813, 1594123, 1522462, 1460739]
60950A460739n3504m7004m0951l5408l1839l0757l0974l1049l0278k8677k7011
60939A073287k6270k6334k5858k4320k3008k2979k3308k2617k1178k0049j9247
60928H18119j8242j7273j6668j5693j3714j1649j0802j0854j0570r799r268q961
60916F64626q220p053o000n053m030l443l709m052l465k293j521j108l87L77L94
60901F15063q9j49K10K50J1J46M77J57q11j643k280l382m844n747n802n621n453
60884E80493n022m678n266o564p160o421n366n113n402n306m586l678k936k402
60870E10593k044j830j697j530j071p4J218K105K307K367K747L171L403L973N119
60855E28757N725M587K342Q17O07O07L7m48q7P03R57L14r24k341l550m170m088
$$ y = [1460739, 1407235, 1360231, 1319280, 1283872, 1252033, 1221276, 1190302, 1159253, 1128975, 1100298, 1073287, 1047017, 1020683, 994825, 970505, 947497, 924518, 901210, 878593, 857415, 837366, 818119, 799877, 782604, 765936, 750243, 736529, 724880, 714078, 703224, 692654, 682855, 673587, 664626, 656406, 649353, 643353, 638300, 634270, 630827, 627118, 623066, 619601, 617308, 615787, 614679, 614292, 614669, 615063, 614974, 614825, 615035, 615285, 615296, 615442, 615919, 616076, 615265, 613622, 611342, 607960, 603116, 597369, 591567, 585946, 580493, 575471, 570793, 565527, 558963, 551803, 545382, 540016, 534903, 529501, 524195, 519609, 515931, 512995, 510593, 508549, 506719, 505022, 503492, 502421, 502347, 503565, 505670, 507977, 510344, 513091, 516262, 519665, 523638, 528757, 534482, 539069, 541411, 542228, 542835, 543442, 543479, 543031, 542944, 543647, 544604, 544918, 543994, 541653, 538103, 533933, 529845]
60838E29845l648l521m374o312q378r091p968o171n123m927m779m419m235m289
60824D52610m215l908l567l065k151j124o01p05j097j645k328k754k547k063j965
60809D18875k227k293j998j591j088l90J90K74J00O4o6o02j041o68J46M40J58
60792D08283J06M66N63J08m20p16r62j085o75K23J087J704K154K116J182j37q36
60775D13161p99p69j007j066q97r41j034m89N88J284J339J361J442J007L13M57
60759D13950J439J782Q78Q0M29Q46k3j436j718r49p31j608k360j886m75J043K242
60742D11503K925K845K084J142K82p69k208l566m111l701k981k657k769k747k132
60727C93140j058l8M99L34m57j276j273l33N21L00o32j078o65r9P3J24L58N44
$$ y = [529845, 526197, 522676, 518302, 511990, 503612, 494521, 486553, 480382, 475259, 470332, 465553, 461134, 456899, 452610, 448395, 444487, 440920, 437855, 435704, 434580, 433979, 433274, 432177, 430532, 428204, 425450, 422903, 420840, 418875, 416648, 414355, 412357, 410766, 409678, 409288, 409478, 409752, 409852, 409916, 409850, 409248, 408207, 407539, 407685, 408125, 408283, 408389, 408855, 409418, 409526, 409106, 408390, 407428, 406343, 405668, 405891, 406978, 408682, 410836, 412952, 414134, 413997, 413161, 412362, 411593, 410586, 409520, 408623, 407682, 406648, 406159, 406747, 408031, 409370, 410731, 412173, 413180, 413493, 413950, 415389, 417171, 418049, 418129, 418558, 419404, 419381, 417945, 416227, 415278, 414547, 412939, 410579, 408693, 408218, 409261, 411503, 414428, 417273, 419357, 420499, 420781, 420012, 417804, 414238, 410127, 406426, 403445, 400788, 398019, 395272, 393140, 392082, 392044, 392543, 392877, 392420, 391144, 389871, 389538, 390059, 390359, 389727, 388649, 387984, 387885, 387958, 388082, 388440, 388984]
60709C88984M53K91K26M2l95q36j042j068r12m20K36N01J04n67r85r87o55j63
60691C82807J34o1m77m62J79R19J229J101Q28O93R47J592K190K311K197K422L026
60674D01575L586L997M366M287L250J856J460K288K897K038J03j758l001l526
60660D23418l107j913r68j138j910k014j022K71R35Q44O19R75K064L298L909L771
60644D28032L364K974K437J711J022K64j012k755m183m726m590m119l329k407
60630D12683j867j714j260l10K73m8l73M14J913K723K328J404N32k90q77o64L71
60613D15238J366J581J205Q82Q27P78N10J00k97o56j022j281j185p50n09r43j713
60596D14131j803p10Q61J839J975J910K195K671K760K146J135M07L41O65Q67Q57
$$ y = [388984, 389437, 389728, 389954, 389996, 389601, 388765, 387723, 386655, 385743, 385323, 385559, 386060, 386164, 385597, 384612, 383625, 382970, 382807, 382941, 382880, 382403, 381941, 382120, 383039, 384268, 385369, 386197, 386890, 387837, 389429, 391619, 393930, 396127, 398549, 401575, 405161, 409158, 413524, 417811, 421061, 422917, 424377, 426665, 429562, 431600, 431703, 429945, 426944, 423418, 420311, 418398, 417430, 416292, 414382, 412368, 411346, 411617, 412552, 413396, 414015, 414990, 417054, 420352, 424261, 428032, 431396, 434370, 436807, 438518, 439540, 439804, 438792, 436037, 431854, 427128, 422538, 418419, 415090, 412683, 410816, 409102, 407842, 407532, 407805, 407757, 407384, 407798, 409711, 412434, 414762, 416166, 416698, 416408, 415531, 414867, 415238, 416604, 418185, 419390, 420272, 421099, 421877, 422387, 422487, 422190, 421534, 420512, 419231, 418046, 417296, 416787, 415844, 414131, 412328, 411618, 412479, 414318, 416293, 418203, 420398, 423069, 425829, 427975, 429110, 429517, 429858, 430523, 431390, 432247]
60580D32247Q92R28N91j68p96p75j28Q66K044L167L829L971M233N395P494R737
60564D73527J1235J1700J1495J1074J0393Q969O605L747R19j873m701o973p828
60551E28289p230n957m510k737o69J012J756J821J926K563L870N668P432Q606
60537E41840R246R993J1313J3086J4981J6732J8012J8463J7963J6465J3685R520
60525G11299M702L09l280o272q496r506r692j0127j1071j1610j1094r923q525
60512F16714o670m395k516j521p79L71J591K380L212M939P562J0430J3180J5881
60498F60379J8709K2021K6209L0889L4834L7357L9002M0280M0568L9117L6407
60487A025772L3430L0214K6168K1476J6893J2366O933l7q329j7471k6898l5536
$$ y = [432247, 433139, 434067, 434658, 434490, 433694, 432919, 432791, 433657, 435701, 438868, 442697, 446668, 450901, 456296, 463790, 473527, 484762, 496462, 507957, 519031, 529424, 538393, 544998, 548745, 549664, 547791, 543090, 536117, 528289, 521059, 515102, 510592, 507855, 507186, 508198, 509954, 511775, 513701, 516264, 520134, 525802, 533234, 541840, 551086, 561079, 572392, 585478, 600459, 617191, 635203, 653666, 671629, 688094, 701779, 711299, 716001, 716310, 713030, 706758, 698262, 688756, 679064, 668937, 657866, 646256, 635162, 625239, 616714, 610044, 605649, 603133, 601612, 600833, 601204, 602795, 605175, 608387, 613326, 620888, 631318, 644498, 660379, 679088, 701109, 727318, 758207, 793041, 830398, 869400, 909680, 950248, 989365, 1025772, 1059202, 1089416, 1115584, 1137060, 1153953, 1166319, 1173252, 1173215, 1164886, 1147415, 1120517, 1084981]
60475A084981m2161m6353m8514m8979m7725m4984m1436l7665l3850l0023k6230
60464F37061k2484j8956j6127j4331j3249j2173j0712r009p472o519o235o080
60452D93714n330m089l301l413l656l180k253j692j709j980k315k481j958p39
60438D55618J43j84j131j481j166j067j403j525j250j159j466j621j288p86l41
60423D39893K26Q00Q02P4o86p46j03P91J577K024K048J916K069K546K940K913
60407D59084K480J773J061Q68J530K606L243L150K687K137J537J194J561K440
60393D87351K957K694K211K108K218K126J998K301K953L362L263L062L221L580
60379E25405L547K920K248K206K759L277L428L522L828M020L658K839K003J350
$$ y = [1084981, 1042820, 996467, 947953, 898974, 851249, 806265, 764829, 727164, 693314, 663291, 637061, 614577, 595621, 579494, 565163, 551914, 539741, 529029, 520020, 512548, 506029, 499794, 493714, 488384, 484295, 480994, 477581, 473925, 470745, 468492, 466800, 465091, 463111, 460796, 458315, 456357, 455618, 455761, 455577, 454446, 452965, 451799, 450732, 449329, 447804, 446554, 445395, 443929, 442308, 441020, 440234, 439893, 440119, 440919, 441721, 441795, 441109, 440363, 440260, 441051, 442628, 444652, 446700, 448616, 450685, 453231, 456171, 459084, 461564, 463337, 464398, 465266, 466796, 469402, 472645, 475795, 478482, 480619, 482156, 483350, 484911, 487351, 490308, 493002, 495213, 497321, 499539, 501665, 503663, 505964, 508917, 512279, 515542, 518604, 521825, 525405, 528952, 531872, 534120, 536326, 539085, 542362, 545790, 549312, 553140, 557160, 560818, 563657, 565660, 567010]
60365E67010Q56O23Q25J420K266L311M337M834M596M261M800O491Q716J0684J2085
60350F37115J3129J4176J5135J5175J3457J0254O857L989R82k975p401j0960j2935
60337F95998j3513j3117j2154j1177j0438r484p841n922m623m181m145m197m283
60324E90923m179l685l188l176l401l178k411j486l20J562L966N967P175Q327
60310E92896J0298J3095J5937J7896J8391J7517J5995J4367J2402R735O759M186
60298G49474J943n62l309n718p868j0648j4333j7938k0221k0657j9234j6177j2296
60285F02456q838o413m549k648q38M10R29O83m30k109l458l786l410l192l537
60270E61270m175m681m836m641m256l930l831l944m123m107l589k579j656j445
$$ y = [567010, 567866, 568489, 569314, 570734, 573000, 576311, 580648, 585482, 590078, 594339, 599139, 605630, 614346, 625030, 637115, 650244, 664420, 679555, 694730, 708187, 718441, 725298, 729287, 730269, 727294, 719893, 708933, 695998, 682485, 669368, 657214, 646037, 635599, 626115, 618274, 612352, 607729, 603548, 599403, 595206, 590923, 586744, 583059, 579871, 576695, 573294, 570116, 567705, 566219, 565899, 567461, 571427, 577394, 584569, 592896, 603194, 616289, 632226, 650122, 668513, 686030, 702025, 716392, 728794, 738529, 745288, 749474, 751417, 750855, 747546, 741828, 733960, 723312, 708979, 691041, 670820, 650163, 630929, 614752, 602456, 593618, 587205, 582656, 580008, 579170, 579580, 580509, 581192, 580762, 578653, 575195, 571409, 567999, 564807, 561270, 557095, 552414, 547578, 542937, 538681, 534751, 530920, 526976, 522853, 518746, 515157, 512578, 510922, 509477]
60256E09477j767j743q68L08Q55O06L20P70J872K877L319L508L792L747K705J034
60240E30812R6N39J415J488P24j13p32j288j595j314o73j55L08J025J683J780
60224E34000J701K290L344L654K859K141K661M083N281N872O418P438Q760R784
60210F00286J0111R874R514R293R208R386J0084J1055J1430J0764R725R157Q945
60197G28832Q517P956P685P373O271M485K880J721M54j103k360k996l493m336
60183G61886n421o504p575q504q982q974q746q372p760p170o994p033o685n871
60169F57295n052m401l716l161l162l525l508k992k698l049l580l668l203k294
60155F09286j070J07Q88J437K039K327J744O79J45L34N25M77P25J385J880K139
$$ y = [509477, 507710, 505967, 505099, 505407, 506262, 506868, 507188, 507958, 509830, 512707, 516026, 519534, 523326, 527073, 529778, 530812, 530908, 531447, 532862, 534350, 535074, 534961, 534229, 532941, 531346, 530032, 529359, 529204, 529512, 530537, 532220, 534000, 535701, 537991, 541335, 544989, 547848, 549989, 552650, 556733, 562014, 567886, 574304, 581742, 590502, 600286, 610397, 620271, 629785, 639078, 648286, 657672, 667756, 678811, 690241, 701005, 710730, 719887, 728832, 737349, 745305, 752990, 760363, 766634, 771119, 773999, 775720, 776174, 775071, 772711, 769715, 766222, 761886, 756465, 749961, 742386, 733882, 724900, 715926, 707180, 698808, 691048, 683878, 676884, 669851, 663166, 657295, 652243, 647842, 644126, 640965, 637803, 634278, 630770, 627778, 625080, 622031, 618451, 614783, 611580, 609286, 608216, 608323, 609211, 610648, 612687, 615014, 616758, 617437, 617582, 617916, 618441, 618918, 619643, 621028, 622908, 625047]
60139F25047K813L929M606M620M973O217P407P559P124P055P256O991O190N390
60125G07177M799M240L761L624L846M195M431M374M074L982M455N101N302N337
60111G68698N997O976O891N278L421K529K127J071p58k598l985m914n398n632
60097G79703o070o795p224o950o295n650m945m249m091m626n135m980m425l968
60083G04300l603l238l135l326l297k833k435k390k233j769j715k618l956n018
60069F62734n850o567o709o175n863o342o761o148n033m538m644m604m403m407
60055E84690m117k809j161n92j055r63M88K252L100L226L610M625N811O603O808
60040F10516O711O824P346P885P953P573P038O388N543M674L913K958J472l17
$$ y = [625047, 627860, 631789, 636395, 641015, 645988, 652205, 659612, 667171, 674295, 681350, 688606, 695597, 701787, 707177, 711976, 716216, 719977, 723601, 727447, 731642, 736073, 740447, 744521, 748503, 752958, 758059, 763361, 768698, 774695, 781671, 788562, 793840, 797261, 799790, 801917, 802988, 802230, 799632, 795647, 790733, 785335, 779703, 773633, 766838, 759614, 752664, 746369, 740719, 735774, 731525, 727434, 722808, 717673, 712693, 708268, 704300, 700697, 697459, 694324, 690998, 687701, 684868, 682433, 680043, 677810, 676041, 674326, 671708, 667752, 662734, 656884, 650317, 643608, 637433, 631570, 625228, 618467, 612319, 607286, 602748, 598104, 593500, 589097, 584690, 580573, 577764, 576603, 576011, 574956, 573993, 574481, 576733, 579833, 583059, 586669, 591294, 597105, 603708, 610516, 617227, 624051, 631397, 639282, 647235, 654808, 661846, 668234, 673777, 678451, 682364, 685322, 686794, 686477]
60026F86477k012l737n816p971r523j0306j0857j1624j2445j2782j2192j0733
60014E76479r119q173p941p650o776n618m561l495k449j972k279k600k221j571
60000E10054j418j520j067j20M62L69J59K87O37J085J743K563L279L879M567N303
59984E30262N720N552M824L712K526J609R76L09m98j174j686k451l586m549m963
59969E36583n121n200m699l357j977j442j495j282n55M22J585K772L237K563J524
59954E23558J156J344J315J055J115J388J344J193J561K166K121J523J407J994
59940E44240K237J466L08l96o19o65n46l20k65l37l7P94J703K391L115L981M443
59923E61493L926K483N41j527l249m073l885l234k639k046j238l76K31P09J460
$$ y = [686477, 684465, 680728, 674912, 666941, 657418, 647112, 636255, 624631, 612186, 599404, 587212, 576479, 567360, 559187, 551246, 543596, 536820, 531202, 526641, 523146, 520697, 518725, 516446, 513846, 511625, 510054, 508636, 507116, 506049, 505929, 506391, 506760, 506919, 507206, 507843, 508928, 510671, 513234, 516513, 520392, 524959, 530262, 535982, 541534, 546358, 550070, 552596, 554205, 555181, 555490, 554992, 553818, 552132, 549681, 546095, 541546, 536583, 531462, 526262, 521563, 518206, 516229, 514787, 513292, 512010, 511455, 511877, 513462, 516234, 519471, 522034, 523558, 524714, 526058, 527373, 528428, 529543, 530931, 532275, 533468, 535029, 537195, 539316, 540839, 542246, 544240, 546477, 547943, 548251, 547855, 547236, 546571, 546025, 545705, 545440, 545103, 545066, 545860, 547563, 549954, 553069, 557050, 561493, 565419, 567902, 568443, 566916, 563667, 559594, 555709, 552475, 549836, 547790, 546552, 546176, 546407, 547116, 548576]
59908E48576K487L225L160K463J825J632J573J165M52q2j71L3L64P88J183J419
59892E70092J681K240K918L363L731M429N169N253M819M835N567O158O055N762
59878F32072N673N383M803M685N202N190L858K159J248O80n55k100k886k984l247
59863F59181l634l391k622k144k008j528o34J15P32J727K940L701M038M536N097
59848F66106N123M891N525P376R547J0969J1038R276N702J522j629l275l953l689
59834G24529j954P90K878L166K011K34j794l738m969n205m862m508m460m959o035
59819F91124p164p673p470o874o017n030m384m190l589j910J8Q12M21q1k59n81
59803F37153j151j501j533j450r45K34J155O09j049k376l006l715m487m351l390
$$ y = [548576, 551063, 554288, 557448, 559911, 561736, 563368, 564941, 566106, 566558, 566476, 566305, 566338, 566702, 567490, 568673, 570092, 571773, 574013, 576931, 580294, 584025, 588454, 593623, 598876, 603695, 608530, 614097, 620255, 626310, 632072, 637745, 643128, 647931, 652616, 657818, 663008, 666866, 669025, 670273, 670953, 670398, 668298, 665412, 662428, 659181, 655547, 652156, 649534, 647390, 645382, 643854, 643220, 643335, 644067, 645794, 648734, 652435, 656473, 661009, 666106, 671229, 676120, 681645, 689021, 698568, 709537, 720575, 729851, 735553, 737075, 735446, 732171, 728218, 724529, 722575, 723365, 726243, 729409, 731420, 731654, 729860, 726122, 721153, 715948, 711086, 706578, 702118, 697159, 691124, 683960, 676287, 668817, 661943, 655926, 650896, 646512, 642322, 638733, 636823, 636841, 637653, 638074, 637993, 637734, 637153, 636002, 634501, 632968, 631518, 630573, 630807, 631962, 632571, 631522, 629146, 626140, 622425, 617938, 613587, 610197]
59788F10197k966l535l868l095k007j649j961k432k879l023k484j633j288j304
59774E76073p63J87L37m19n98N07J712K018K167L061M098M374M234M380M521M149
59758F10038L768M077M727N012N147N737O572O980O996P213P851Q634R245R357
59744G01354Q669P333N946M788L678K736K421K482J937N17q62j521j851k217k209
59729G33201j724j576k232k888k737k140j647q57O31K034K341J792J254P85l0
59714G26207q17p32J00O30L28k21k63J98N45L25j02K78J969M028M893M252L349
59697G44967L324M109N136O144O872O960O621O484O325M917J817j739m309n787
59683G91841o757p236o918n970m873m000l768m475n627o300o487p070q080q329
$$ y = [610197, 607231, 603696, 599828, 596733, 594726, 593077, 591116, 588684, 585805, 582782, 580298, 578665, 577377, 576073, 575310, 575497, 575834, 575415, 574817, 575324, 577036, 579054, 581221, 584282, 588380, 592754, 596988, 601368, 605889, 610038, 613806, 617883, 622610, 627622, 632769, 638506, 645078, 652058, 659054, 666267, 674118, 682752, 691997, 701354, 710023, 717356, 723302, 728090, 731768, 734504, 736925, 739407, 741344, 741861, 740999, 739478, 737627, 735410, 733201, 731477, 729901, 727669, 724781, 722044, 719904, 718257, 717400, 718031, 720065, 722406, 724198, 725452, 726237, 726207, 725390, 724658, 724758, 725388, 725716, 725495, 725232, 725430, 725975, 726300, 726198, 726476, 728445, 732473, 737366, 741618, 744967, 748291, 752400, 757536, 763680, 770552, 777512, 784133, 790617, 796942, 801859, 803676, 801937, 797628, 791841, 785084, 777848, 770930, 764960, 760087, 756087, 752319, 747844, 742217, 735917, 729430, 722360, 714280, 705951]
59669G05951p384o470o525o704n842m314l170k521j974j671j653j139K79J533
59655F58396J558J075J507K808L866M504N486O796P364O561M802K677M79j457
59641G06422k813l758m709n762o753p537p728o861n302m291m275m102k834j461
59627F38236j580l021m176m237l850l710l797l975m247m382m083l612l511l818
59613E86237m136m240m049l394k344j423q58j44J095K350L033L352L631L479K558
59598E85147J511J141J193R36M47L06N16P04J012J731K446K533K163J889J617
59583F05292Q67l58j739l163m279m243k935j727j864k730k922k438k277k413j845
59568E71226n47K61Pm56k92K56N56M69J97q2j96j27j18k88l36j49j92o82r74m56
$$ y = [705951, 698567, 692097, 685572, 678868, 673026, 668712, 665542, 663021, 661047, 659376, 657723, 656584, 656863, 658396, 659954, 661029, 662536, 665344, 669210, 673714, 679200, 685996, 693360, 699921, 704723, 707400, 707879, 706422, 703609, 699851, 695142, 689380, 682627, 675090, 667362, 660501, 655199, 650908, 646633, 642531, 639697, 638236, 636656, 633635, 629459, 625222, 621372, 617662, 613865, 609890, 605643, 601261, 597178, 593566, 590055, 586237, 582101, 577861, 573812, 570418, 568074, 566651, 565793, 565649, 566744, 569094, 572127, 575479, 579110, 582589, 585147, 586658, 587799, 588992, 589928, 590375, 590681, 591197, 591901, 592913, 594644, 597090, 599623, 601786, 603675, 605292, 606159, 605801, 604062, 600899, 596620, 592377, 589442, 587715, 585851, 583121, 580199, 577761, 575484, 573071, 571226, 570679, 570940, 570947, 570491, 570199, 570455, 571011, 571480, 571677, 571595, 571399, 571272, 571154, 570866, 570530, 570381, 570189, 569507, 568533, 568077]
59548E68077M28R67J346K130L091L664M001M616N413O090O979Q481J0383J2764
59534F38430J6522K1275K3667K0104J1173J488n033q030q879q232o233l518q26
59521F91908J553L305L909L423K638J998J080n40k587m569o192p142p198o863
59507F74723p108q188r261r477q865q025p343o728n814m479l264k914l220k984
59493E87053j688m14k57o60l84N13J049J130J553K405K986L233L834M775N184
59478F10312M806M514N000N971O927P735Q245Q161P507O581N394L860K402J482
59464F88897Q06j48j031j101n65l34n38m22L98J715L551O011Q312R286Q964Q552
59448G32353Q788R410J0165J0985J1153R587O274K294j603n327q334r675r394
$$ y = [568077, 568505, 569472, 570818, 572948, 576039, 579703, 583704, 588320, 593733, 599823, 606802, 615283, 625666, 638430, 654952, 676227, 699894, 719998, 731171, 732659, 727626, 719596, 710717, 702485, 696252, 692734, 691908, 693461, 696766, 700675, 704098, 706736, 708734, 709814, 709274, 706687, 702118, 695926, 688784, 681586, 674723, 667615, 659427, 650166, 640689, 631824, 623799, 616456, 609728, 603914, 599435, 596171, 593257, 590037, 587053, 585365, 584951, 584694, 584034, 583650, 584163, 585212, 586342, 587895, 590300, 593286, 596519, 600353, 605128, 610312, 615118, 619632, 624632, 630603, 637530, 645265, 653510, 661671, 669178, 675759, 681153, 685013, 687415, 688897, 689703, 689555, 688524, 687423, 686858, 686524, 685986, 685564, 685962, 687677, 691228, 697239, 705551, 714837, 723801, 732353, 741141, 750551, 760716, 771701, 782854, 792441, 798715, 801009, 799406, 794079, 785745, 776070, 766676]
59435G66676q657q132p405o192m965m059l343k930l062l159k309p54M32J328L208
59420G16677O382R609J2124J4573J7365J9802K1601K3619K6193K8537L0724L4149
59408I61355L8164L8048K9126J2551n047j7561k3412k4050k1051j5531q556n69
59396I63467Q511J7201K1153J5998K210j4066k5945l1074l1496k9632k6166k1574
59384H48587j7356j4629j2841j0986r121p680o244m288k355j243o59J16Q35R03
59370G63039P63J223J874J660P12J56L40O80J034J781K721L295L755M760O044
59355G93837O823P305Q252R352R677R518J0041J1240J2075J2534J3606J5125J5619
59342I35004J4620J3265J2261J1081R507Q058O490L780J44k864m793o942r894
$$ y = [766676, 758019, 749887, 742482, 736290, 731325, 727266, 723923, 720993, 717931, 714772, 712463, 711709, 712141, 713469, 716677, 723059, 732668, 744792, 759365, 776730, 796532, 818133, 841752, 867945, 896482, 927206, 961355, 999519, 1037567, 1066693, 1079244, 1074197, 1056636, 1033224, 1009174, 988123, 972592, 964036, 963467, 971978, 989179, 1010332, 1026330, 1028540, 1014474, 988529, 957455, 925959, 896327, 870161, 848587, 831231, 816602, 803761, 792775, 783654, 775974, 769730, 765442, 763087, 761844, 761185, 761301, 762136, 763039, 763802, 765025, 766899, 768559, 769271, 769427, 769767, 770447, 771481, 773262, 775983, 779278, 783033, 787793, 793837, 800660, 807965, 816217, 825569, 835246, 844764, 854805, 866045, 878120, 890654, 904260, 919385, 935004, 949624, 962889, 975150, 986231, 995738, 1003796, 1010286, 1014066, 1014210, 1011346, 1006553, 999611, 989717]
59329I89717j2442j3812j5010j6817j8281j8438j7948j7753j7473j6428j4981
59318H10334j3714j2393j0832r649r176q626p298n654m407l595l222l654m622
59305G13492n010m362l402k473q69J526L585M849O659J0091J4044J6366J5790
59292G70286J1945N039l232r859j3029j3589j3071j1687r406p384o601o151m540
59279F88721j908N63K578M601O491P816R048J1002J3475J5526J6771J7407J7461
59266H09552J6928J6180J5379J4023J1848R529P630N611K807l52l029n194p253
59253H93659q993r890r874r118p606n689m339m110m365m147l199j682J84J733
59239H22564K016R67l99j403k213k660k016n53J95m60j389j667k033l280m793
$$ y = [989717, 977275, 963463, 948453, 931636, 913355, 894917, 876969, 859216, 841743, 825315, 810334, 796620, 784227, 773395, 763746, 754570, 745944, 738646, 732992, 728585, 724990, 721768, 718114, 713492, 708482, 704120, 700718, 698245, 697376, 698902, 702487, 707336, 713995, 724086, 738130, 754496, 770286, 782231, 787270, 784038, 774179, 761150, 747561, 734490, 722803, 713397, 706013, 699412, 693261, 688721, 686813, 687376, 689954, 694555, 701046, 708862, 717910, 728912, 742387, 757913, 774684, 792091, 809552, 826480, 842660, 858039, 872062, 883910, 893439, 901069, 906680, 909487, 909135, 906106, 900912, 893659, 884666, 874776, 864902, 855784, 848178, 842489, 838150, 834040, 829675, 825528, 822329, 820647, 820831, 822564, 824580, 825547, 825148, 823745, 821532, 818872, 816856, 816303, 816498, 816038, 814649, 812982, 810949, 807669, 802876]
59224H02876n888p059q584r372q791q181q832r735r226p711o823o682o032m541
59210F95419l125k314j857j674j762j520m56P30J030O06K93J70j49m44k66Q6J75
59193F84942L56J014J552J265O14M02M21Q7k96j88L3j27j02P60J762J811J187
59176F95493R20J030P75J47k74m55n90k56Q63J950K145K007K566L602M190M346
59160G18459M575M472L321J555J84q34k216l895n344o746q303r108q350p133p210
59145F73427q329q657p535o112n264m751m404m548n004n066m633m261m067l684
59131E97112l150k754k280j437o68l32L64K317M805O271O448O377O688P279Q329
59116F35369J0066J1732J2296J1998J1860J1944J1492J0489R605Q819P610O302
$$ y = [802876, 796988, 789929, 781345, 771973, 763182, 755001, 746169, 736434, 727208, 719497, 712674, 705992, 699960, 695419, 692294, 689980, 688123, 686449, 684687, 683167, 682711, 683441, 684471, 685077, 685370, 685540, 685391, 684947, 684681, 684767, 684942, 685298, 686312, 687864, 689129, 689743, 690145, 690566, 690653, 690357, 690169, 690202, 690075, 689973, 690733, 692495, 694306, 695493, 696413, 697443, 698218, 698365, 698091, 697636, 697046, 696790, 697653, 699603, 701748, 703755, 706321, 709923, 714113, 718459, 723034, 727506, 730827, 732382, 732566, 731732, 729516, 725621, 720277, 713531, 705228, 696120, 687770, 680637, 673427, 665098, 656441, 648906, 642794, 637530, 632779, 628375, 623827, 618823, 613757, 609124, 604863, 600796, 597112, 593962, 591208, 588928, 587491, 586823, 586491, 586855, 589172, 593977, 600248, 606696, 613073, 619761, 627040, 635369, 645435, 657167, 669463, 681461, 693321, 705265, 716757, 727246, 736851, 745670, 753280, 759582]
59104G59582N700N560M871L621K770K535K113J081k09j542k913l845l853l424
59090G72047l268l007j883l80L47L13M37O85J42j206k387l105m035n411o748p898
59074G34643q982r426q504o874o105o550p061o766n884m784l602k814k934l567
59060F50790l831l638l517l415k846j977j448j317j263j366j674j558o96k0l75
59045F21849r87p16n3j89r11j126q19o71m40L82R61K40r22q49K50Q11O40Q41J515
59026F19806J903K484M397O985Q489R075J0526J2895J4185J3660J2762J2277J1170
59013G40614Q934O642M794K460o33l208m441m930n020m211k696j551p64Q05L018
58998G39813M248M189M473N687O167M866L137K399K042J079L0k52j88n37j201
$$ y = [759582, 765282, 770842, 775713, 779334, 782104, 784639, 786752, 787833, 787624, 786082, 783169, 779324, 775471, 772047, 768779, 765772, 763889, 763509, 763856, 764169, 764606, 765291, 765433, 764227, 761840, 758735, 754700, 749289, 742541, 734643, 725661, 716235, 707731, 700857, 694752, 688202, 681141, 674375, 668491, 663707, 660105, 657291, 654357, 650790, 646959, 643321, 639804, 636389, 633543, 631566, 630118, 628801, 627538, 626172, 624498, 622940, 622244, 622224, 621849, 620862, 620146, 620093, 619904, 618993, 617867, 617048, 616377, 615937, 616319, 617280, 617520, 616598, 615749, 615999, 616810, 617450, 618291, 619806, 621709, 624193, 628590, 635575, 644064, 653139, 663665, 676560, 690745, 704405, 717167, 729444, 740614, 749548, 756190, 760984, 763444, 762811, 759603, 755162, 750232, 745212, 741001, 738305, 736754, 735990, 736795, 739813, 744061, 748250, 752723, 758410, 764577, 769443, 772580, 774979, 777021, 778100, 778130, 777878, 777690, 777153, 775952]
58983G75952j930k902l780l573k234r13j5J391L584N438O473P720R627J0975J1096
58968H16909J1347J2926J4813J5329J4448J3268J2287J1398J0559R421P289M321
58956I54315J696j45k226n310q715j1593j3972j5830j6571j6283j6087j6320j5759
58943H17200j3663j1145r453q227o569m692l283k311j553j390j989k551k320j639
58929G46415j246j272j525j998k483k466j931j513j577j903k333k805k835k080
58915G18448j295j403j801j167K24R19Q47J423K867L795L886M660O809R010J0308
58900G57530J1542J3393J4969J5508J5665J5901J5421J3824J2195J1367J0675
58889I07990R678R442J0824J2835J3975J4036J3650J3163J2841J2894J2568J0487
$$ y = [775952, 774022, 771120, 767340, 763767, 761533, 760620, 760605, 761996, 765580, 771018, 777491, 785211, 794838, 805813, 816909, 828256, 841182, 855995, 871324, 885772, 899040, 911327, 922725, 933284, 942705, 949994, 954315, 956011, 955866, 953640, 948330, 939615, 928022, 914050, 898220, 881649, 865366, 849279, 832959, 817200, 803537, 792392, 782939, 774712, 768143, 763451, 760168, 757857, 756304, 754914, 752925, 750374, 748054, 746415, 745169, 743897, 742372, 740374, 737891, 735425, 733494, 731981, 730404, 728501, 726168, 723363, 720528, 718448, 717153, 715750, 713949, 712782, 713006, 713925, 714772, 716195, 719062, 722857, 726743, 731403, 738212, 747222, 757530, 769072, 782465, 797434, 812942, 828607, 844508, 859929, 873753, 885948, 897315, 907990, 917668, 927110, 937934, 950769, 964744, 978780, 992430, 1005593, 1018434, 1031328, 1043896, 1054383]
58877A054383O619K584m78k884m874n991o541p773r745j0855j0305r228q529p618
58863I78765o147n176n417o153o819p897r368j0226j0410j1225j2884j3711j2906
58850H60426j1890j1762j1566j0382r045q378p751o775o477p325q106q095q271
58837G44603r089r206p973o940p213p468o379m877m128l413j970r38j292j729
58823F71988p42Q80J700K081K873L368K731J967K314L022K771J936J552J378Q95
58808G00714P11J202J222O4r28o04j95j203k781l387l531m474n642n741n205n264
58792F64958n605n222m576m741n277m997m026l191k294p69Q55J839K628L815M813
58777F38210N087N376O190O514N516M074K944J122k149n430p094p670q242q186
$$ y = [1054383, 1061002, 1063586, 1063108, 1060224, 1055350, 1049359, 1042818, 1035045, 1025300, 1014445, 1004140, 994912, 986383, 978765, 972618, 967442, 962025, 955872, 949053, 941156, 931788, 921562, 911152, 899927, 887043, 873332, 860426, 848536, 836774, 825208, 814826, 805781, 797403, 789652, 782877, 776400, 769075, 760969, 752874, 744603, 735514, 726308, 718335, 711395, 704182, 696714, 690335, 685458, 681330, 677917, 675947, 675009, 673717, 671988, 671246, 672126, 673826, 675907, 678780, 682148, 684879, 686846, 689160, 692182, 694953, 696889, 698441, 699819, 700714, 701425, 702627, 703849, 703913, 702985, 702381, 702186, 700983, 698202, 694815, 691284, 686810, 681168, 675427, 670222, 664958, 659353, 654131, 649555, 644814, 639537, 634540, 630514, 627323, 625029, 624260, 625115, 626954, 629582, 633397, 638210, 643297, 648673, 654863, 661377, 666893, 670967, 673911, 675033, 672884, 667454, 660360, 652690, 644448, 636262]
58763F36262o630m640l746l636l270k854k838k470j333o16r54q45P50K209J978
58748F07367J421K395L880L830K720K347K683K752L221N162P423Q117P656P731
58734F68705Q356Q465Q174Q011P209N306M005M820O373O637O235O612O727M869
58720G60504K315J759L182M522N431P031Q859R372Q808Q510Q169O643M627L527
58706H43259K582J86k949m960o294q763j2040j4319j5650j7373j9011j9031j8047
58693G07590j7956j8411j7410j4919j2810j1597j0283q913q379q160p117n827
58681E65808n421n082l622k302k878m079l522j954j781k510j697M11J372J163
58667E33906K035M139N448N894P489J0215J1786J1641J1255J0431P316K405j393
$$ y = [636262, 629632, 624992, 621246, 617610, 614340, 611486, 608648, 606178, 604845, 604229, 603275, 602430, 603180, 605389, 607367, 608788, 611183, 615063, 618893, 621613, 623960, 626643, 629395, 632616, 637778, 645201, 653318, 660974, 668705, 677061, 685526, 693700, 701711, 708920, 714226, 718231, 723051, 729424, 736061, 742296, 748908, 755635, 760504, 762819, 764578, 767760, 772282, 777713, 784744, 793603, 802975, 811783, 820293, 828462, 835105, 839732, 843259, 845841, 846027, 843078, 838118, 831824, 823061, 811021, 796702, 781052, 763679, 744668, 725637, 707590, 689634, 671223, 653813, 638894, 626084, 614487, 604204, 595291, 586912, 578752, 571635, 565808, 560387, 555305, 551683, 549381, 546503, 542424, 538902, 536948, 535167, 532657, 530960, 531371, 532743, 533906, 535941, 540080, 545528, 551422, 558911, 569126, 580912, 592553, 603808, 614239, 621555, 623960, 622567]
58654F22567l152m694o644p443o838o621p250p214o219n661n615m730l409l518
58640E43559m699m584l052k380k786j786J209L600L913L743M260M311L244K343
58626E50895K219J752N99r0l44j683l989m968l650j598K2J742L637M692M994N766
58610E59996O832O780N810N544N885N216L730L291L850L472K057J487J849J216
58596F17015m78j068j95P1q27j038k9M91J60P61K740M428N486P443J0168J1447
58580F56575J0912J0705J1536J1672J0614J0006J0121R243P393O874Q214R320
58568G73185R511J0672J3514J6423J8824K1917K5400K7364K8125L0098L3166L4418
58556A042617L3122L1486K9640K4698J6140P506J161m203r324j2189j1931j0663
$$ y = [622567, 619415, 614721, 608077, 600634, 593796, 587175, 579925, 572711, 566492, 560831, 555216, 550486, 547077, 543559, 538860, 534276, 531224, 528844, 526058, 524272, 525481, 529081, 532994, 536737, 540997, 545308, 548552, 550895, 553114, 554866, 555465, 555375, 555031, 553348, 549359, 544391, 540741, 539143, 539165, 540907, 544544, 549236, 554230, 559996, 566828, 573608, 579418, 584962, 590847, 596063, 599793, 603084, 606934, 610406, 612463, 613950, 615799, 617015, 616537, 615469, 615274, 615345, 614518, 613480, 613451, 613942, 614102, 614863, 617603, 622031, 627517, 634960, 645128, 656575, 667487, 678192, 689728, 701400, 712014, 722020, 732141, 741384, 748777, 755651, 763865, 773185, 782696, 793368, 806882, 823305, 842129, 864046, 889446, 916810, 944935, 975033, 1008199, 1042617, 1075739, 1107225, 1136865, 1161563, 1177703, 1185209, 1186370, 1182167, 1172843, 1160654, 1148723, 1138060]
58544A138060r655p725n022m224o298r112j1719j5818k1510k6009k8165k9906
58532I62897l1638l0962k7581k4732k3696k1739j7599j4174j3311j2586j0006
58521G34873p403o452n638l884l030m023m643l588k790l335l179j374l35j282
58507F83917j704L3J698J361M74L24l91j962j959K73J760R81M31J622K253J060
58491F90171O57K575M145L537L156M867O439O185O457Q992J1375J1760J2649J6156
58477G89121J9877K1305K2079K4027K5051K2979J9480J6369J1879M504l222q510
58465I64939j2164j5318j6334j4388j2166j1467j0082o359k576m31K353P329J1771
58452H85107J3493J4695J7231J8581J6442J2827R767N558r09o844j0494j4357
$$ y = [1138060, 1128405, 1120680, 1115658, 1111434, 1105136, 1096024, 1084305, 1068487, 1046977, 1020968, 992803, 962897, 931259, 900297, 872716, 847984, 824288, 802549, 784950, 770776, 757465, 744879, 734873, 727470, 721018, 715380, 711496, 708466, 704443, 699800, 696212, 693422, 690087, 686908, 685534, 685199, 683917, 682213, 682246, 683944, 685305, 685779, 686103, 685712, 683750, 681791, 682064, 683824, 684805, 685236, 686858, 689111, 690171, 690828, 693403, 697548, 701085, 704241, 709108, 715547, 721732, 728189, 737181, 748556, 760316, 772965, 789121, 808998, 830303, 852382, 876409, 901460, 924439, 943919, 960288, 972167, 976671, 973449, 964939, 952775, 937457, 921123, 906735, 894569, 883102, 873020, 866661, 864085, 863654, 866007, 873336, 885107, 898600, 913295, 930526, 949107, 965549, 978376, 988143, 993701, 992792, 985948, 975454, 961097]
58440I61097j9506k2008j9483j5888j5020j4509j1252p540o355n542k313J069
58428H22750J706J676L800O162O374O792R952J3185J3251J1940J1678J0212N345
58415I24823K89j591k810o662j0726j1525j1069j2457j3545j1447q833r197j0160
58402H15090q147n369n365n872l139O88J514P09J697L086K154J213L394N985M995
58387H12633K490K330K641j6l033k038Q72R46p02N6K387L053L444O490R867R790
58371H51210Q281R287J1193J0556R421J1251J3563J2566J1068J3460J6976J6528
58359I95360J4217J5159J7682J6866J4237J4508J5939J3362P922M608L003m05
58347A132458l678k545Q74J533Q07L273P285Q076P108Q944J1952J1661J0102J2128
$$ y = [961097, 941591, 919583, 900100, 884212, 869192, 854683, 843431, 835891, 829536, 823994, 821681, 822750, 824456, 826132, 829932, 836094, 842468, 849260, 859212, 872397, 885648, 897588, 909266, 919478, 924823, 925112, 923521, 920711, 914049, 903323, 891798, 880729, 868272, 854727, 843280, 834447, 825250, 815090, 806943, 801574, 796209, 790337, 787198, 787886, 789400, 790109, 791806, 794892, 797046, 798259, 801653, 807638, 812633, 815123, 817453, 820094, 820078, 817045, 815007, 815879, 816825, 816123, 816179, 818566, 821619, 825063, 831553, 841420, 851210, 859491, 868778, 879971, 890527, 899948, 911199, 924762, 937328, 948396, 961856, 978832, 995360, 1009577, 1024736, 1042418, 1059284, 1073521, 1088029, 1103968, 1117330, 1125252, 1129860, 1132863, 1132458, 1128780, 1126235, 1127109, 1128642, 1129449, 1132722, 1140007, 1148083, 1155191, 1164135, 1176087, 1187748, 1197850, 1209978]
58333A209978J5700J5724J4145J6159J9808J9721J7729J9019K1198J8228J2110
58322A399519R425R292O098J234M41K307J070j814o23K921K831Q76L340Q548R983
58307A455448R009J1888J6881J7285J4708J6126K0254K0240J7490J9077K3639
58296A642045K3714K0061J9703K1938K0395J6759J7974K2071K1503J8289K0539
58285A864991K6291K6532K2360K2910K7926K8913K6113K7668L3127L4516L2606
58274B173953L5245M0863M0905L7198L9286M6000M7848M6006M9990N8076N9669
58263B675039N5914N7871O5210O7379O4942O8414P6609P8039P3393P4239P9813
58252C436862P8342P1201P1728P9790Q2162P8640Q2355R3433R8536R7704J04669
$$ y = [1209978, 1225678, 1241402, 1255547, 1271706, 1291514, 1311235, 1328964, 1347983, 1369181, 1387409, 1399519, 1408944, 1418236, 1424334, 1425568, 1426009, 1428316, 1429386, 1427572, 1426949, 1429870, 1432701, 1433577, 1436917, 1445465, 1455448, 1464457, 1476345, 1493226, 1510511, 1525219, 1541345, 1561599, 1581839, 1599329, 1618406, 1642045, 1665759, 1685820, 1705523, 1727461, 1747856, 1764615, 1782589, 1804660, 1826163, 1844452, 1864991, 1891282, 1917814, 1940174, 1963084, 1991010, 2019923, 2046036, 2073704, 2106831, 2141347, 2173953, 2209198, 2250061, 2290966, 2328164, 2367450, 2413450, 2461298, 2507304, 2557294, 2615370, 2675039, 2730953, 2788824, 2854034, 2921413, 2986355, 3054769, 3131378, 3209417, 3282810, 3357049, 3436862, 3515204, 3586405, 3658133, 3737923, 3820085, 3898725, 3981080, 4074513, 4173049, 4270753, 4375422]
58241D375422J19112J26374J26329J33953J49418J57331J57810J67343J86313
58232E699405J97690K00827K13218K35463K49381K54653K70976K99415L19580
58223G940608L30218L52931L89919M19496M39996M74569N25407N68960O04483
58214A2046587O59002P35510Q07451Q74116R66872J090058J214377J340963J508966
58205B1243902J726579J963117K224934K565131L001672L509099M112043M895046
58197D5241523N893970P077343Q462359J0137839J2150721J4516025J7377488
58190A20857268K0982491K5435887L0651512L6475832M2280177M6031677M4338482
58183C67053326L4564243J7495169k346692j9437344l0483691l5409798l6057427
$$ y = [4375422, 4494534, 4620908, 4747237, 4881190, 5030608, 5187939, 5345749, 5513092, 5699405, 5897095, 6097922, 6311140, 6546603, 6795984, 7050637, 7321613, 7621028, 7940608, 8270826, 8623757, 9013676, 9433172, 9873168, 10347737, 10873144, 11442104, 12046587, 12705589, 13441099, 14248550, 15122666, 16089538, 17179596, 18393973, 19734936, 21243902, 22970481, 24933598, 27158532, 29723663, 32725335, 36234434, 40346477, 45241523, 51135493, 58212836, 66675195, 76813034, 88963755, 103479780, 120857268, 141839759, 167275646, 197927158, 234402990, 276683167, 322714844, 367053326, 401617569, 419112738, 416766046, 397328702, 366845011, 331435213, 295377786]
58176B95377786l4485098l2111617k9580876k6949615k4085315k1043656j8083910
58169A09037699j5405320j3030731j0941986r168759p707803o483365n439596
58162D0860139m584110l908413l350066k865601k466376k153561j886061j640029
58154A8005922j437027j286392j156553j027916r20635q45896p78978p03695o37612
58145I211218n91188n44664m86659m35652m02837l71071l29666k94430k75013
58136E480038k56382k30210k11938k09458k05980j90760j77108j73769j67423
58127C657010j49874j34958j32071j28919j16276j05055j03392j00660q9405q0359
58117B516041q0941q0528p1464o3705o4723o5010n7231n0325n1323n1885m5792
$$ y = [295377786, 260892688, 228781071, 199200195, 172250580, 148165265, 127121609, 109037699, 93632379, 80601648, 69659662, 60490903, 52783100, 46299735, 40860139, 36276029, 32367616, 29017550, 26151949, 23685573, 21532012, 19645951, 18005922, 16568895, 15282503, 14125950, 13098034, 12177399, 11331503, 10552525, 9848830, 9211218, 8620030, 8075366, 7588707, 7153055, 6750218, 6379147, 6049481, 5755051, 5480038, 5223656, 4993446, 4781508, 4572050, 4366070, 4175310, 3998202, 3824433, 3657010, 3507136, 3372178, 3240107, 3111188, 2994912, 2889857, 2786465, 2685805, 2596400, 2516041, 2435100, 2354572, 2283108, 2219403, 2154680, 2089670, 2032439, 1982114, 1930791, 1878906, 1833114]
58106A833114m1549m5033m7226m1569l6420l8252l9278l3568k9084l1824l3949
58095A415362k9204k4808k6572k7411k1926j7659k0561k3489k0288j7328k0097
58084A166019k2021j7719j4138j7467k1563k0135j8180k0806k2726j9282j6226
58073I55756j8372j9918j5983j2472j4536j6465j2985r611j1710j3952j0701o670
58061G92381p336q612n880l648o488r711q474p130j0286j3510j2006r705j0858
58048F78737j1383p485m015n414o928l820o70k534n229l632j441l454n983m204
58034F12545j643l186n746m803l342n598q559q161p263r328j0865q328n737p325
58020E22661r332p302m692n964p806n732k895l750n318l313q01k124m150k267
$$ y = [1833114, 1791565, 1746532, 1699306, 1657737, 1621317, 1583065, 1543787, 1510219, 1481135, 1449311, 1415362, 1386158, 1361350, 1334778, 1307367, 1285441, 1267782, 1247221, 1223732, 1203444, 1186116, 1166019, 1143998, 1126279, 1112141, 1094674, 1073111, 1052976, 1034796, 1013990, 991264, 971982, 955756, 937384, 917466, 901483, 889011, 874475, 858010, 845025, 835414, 823704, 809752, 799051, 792381, 785045, 776433, 770553, 766905, 760417, 750706, 742232, 735102, 724816, 711306, 699300, 689595, 678737, 667354, 659869, 655854, 650440, 643512, 639692, 639022, 636488, 631259, 627627, 626186, 622732, 616749, 612545, 610902, 607716, 601970, 597167, 593825, 588227, 579668, 571507, 564244, 554916, 544051, 535723, 529986, 522661, 513329, 506027, 501335, 495371, 487565, 481833, 478938, 475188, 469870, 466557, 465756, 463632, 459482, 457215]
58006D57215O32k17k294r39J690J276r7J452L423J778p17N93L500L320J572K203
57990D74390L384J325j800j726j20j031l079k777j802l444n543m450k275k860
57976D48192m322k976q54j812l778k516L17M92q10K12K299J771r9L43J970J333
57960D39762m32p5J199L89r77R0J562j49l132l181j310j303k578k225j304k285
57944D24051l034l33L333L471J495J974M438N091M351N558Q081Q718Q087Q979
57930D84260J0242Q809N923M774M096P07l739n332n178p133j0194j0331q233q085
57916D60586r835r768p794p261q243p638n412m377m387k777N7J330J306K352L553
57901D01692K109r61k200j782k436l606k555r3O70K12J351L295K993J224J302
$$ y = [457215, 457847, 457630, 455336, 454397, 456087, 457363, 457266, 458718, 462141, 463919, 463202, 463795, 467295, 470615, 472187, 474390, 477774, 479099, 477299, 475573, 475453, 474422, 471343, 468566, 466764, 463320, 457777, 453327, 451052, 448192, 443870, 440894, 440040, 438228, 434450, 431934, 432251, 432743, 431933, 432145, 434444, 436215, 436116, 436459, 438429, 439762, 439330, 439255, 440454, 440843, 439866, 439956, 441518, 441369, 438237, 435056, 433746, 432443, 429865, 427640, 426336, 424051, 421017, 420684, 424017, 427488, 428983, 430957, 435395, 440486, 444837, 450395, 458476, 467194, 475281, 484260, 494502, 503311, 509234, 514008, 518104, 518811, 515072, 509740, 504562, 497429, 487235, 476904, 468671, 460586, 450751, 440983, 433189, 425928, 417685, 410047, 404635, 400258, 395871, 393094, 393151, 394481, 395787, 398139, 401692, 403801, 402840, 400640, 398858, 396422, 392816, 390261, 390168, 390838, 391050, 392401, 395696, 398689, 399913, 401215]
57886D01215K780K522R79J207K657K254O98J246L043K273o25j512K9M03r55q43
57870D17371J165J936J000J369L463M165K698J872K692L068K502K927M365M749
57856D55342M270N035O372N600L350K855M014L620J443N65J471J308o51k191k981
57841D89422m803o821o205l728l126m559m456k278j477k917l326j433O4k2N86
57826D44921K630L677K944K772L893M046K701K256L274L318J796J221K321K653
57812D84423J435R65J756J025k292n482o640p183q257q728q105p624p297n751
57798D22245l753l737n158m751k142n88j305j832j024p32j298l83K230L434K137
57783D03343J156K121L035K668K817M270M890L795L248M393N122M063K861K694
$$ y = [401215, 403995, 406517, 407496, 408703, 411360, 413614, 414312, 415558, 418601, 420874, 420249, 418737, 418766, 419169, 418214, 417371, 418536, 420472, 421472, 422841, 426304, 430469, 433167, 435039, 437731, 440799, 443301, 446228, 450593, 455342, 459612, 464647, 471019, 476619, 479969, 482824, 486838, 490458, 491901, 492466, 493937, 495245, 494594, 492403, 489422, 484619, 477798, 471593, 467865, 464739, 460180, 455724, 453446, 451969, 449052, 445726, 444293, 444357, 444335, 444921, 447551, 451228, 454172, 456944, 460837, 464883, 467584, 469840, 473114, 476432, 478228, 479449, 481770, 484423, 485858, 486823, 488579, 489604, 487312, 481830, 475190, 468007, 459750, 451022, 442917, 435293, 427996, 422245, 418492, 414755, 409597, 404846, 402704, 402116, 400811, 398979, 397955, 397223, 395925, 395542, 397772, 401206, 403343, 404499, 406620, 409655, 412323, 415140, 419410, 424300, 428095, 431343, 435736, 440858, 444921, 447782, 450476]
57769D50476K236P94k75p05k035l956l981k105j471k963l596j886m22j098k167
57754D26846k055j899k295j624L51J251M28M15K149L040J921J533L574N491M914
57739D44040L407L050L014K199J783K557K954K123J670K282K141P00L07J881K849
57724D76957J689O06J132J150r06k703k042o45p87j465j071o98j627k488j992
57709D65110j600k600l362k409j341j784k287j204R3j28p00L5J155J326J580K997
57693D54881M070L219J744J500J866J605J482K378L122K682K364L350M405M328
57679D92996M344N652P107P790R316J3040J7432K0858K4567L0237L7050M3943
57667G14332N2267O2967P2840P6223O9138N0340K1355j1960m0586n8481o6372
$$ y = [450476, 452712, 453506, 453231, 452526, 450491, 446535, 442554, 440449, 438978, 436015, 432419, 430533, 430111, 429013, 426846, 424791, 422892, 420597, 418973, 419324, 420575, 421003, 421418, 423567, 426607, 428528, 430061, 433635, 439126, 444040, 447447, 450497, 453511, 455710, 457493, 460050, 463004, 465127, 466797, 469079, 471220, 471920, 472227, 474108, 476957, 478646, 479252, 480384, 481534, 480628, 477925, 475883, 475238, 474451, 472986, 471915, 471217, 469590, 467102, 465110, 463510, 460910, 457548, 455139, 453798, 452014, 449727, 448523, 448616, 448488, 447788, 447823, 448978, 450304, 451884, 454881, 458951, 462170, 463914, 465414, 467280, 468885, 470367, 472745, 475867, 478549, 480913, 484263, 488668, 492996, 497340, 502992, 510099, 517889, 527205, 540245, 557677, 578535, 603102, 633339, 670389, 714332, 766599, 829566, 902406, 978629, 1047767, 1098107, 1119462, 1107502, 1066916, 1008435, 942063]
57656I42063o7916o4873n8151n0304m3497l7075k9960k3483j9178j6070j2754
57645E18802r993q672p478n307l621l739m071k768q59n9J57O91M99r68j629k3
57629D70962J761J440K75L34O56m02j564j026j45r95k312j699J1M68J13Q58J993
57612D70728J379m32j001l2Q72J432K428L191K574J480J470J976J706J399K218
57597D91388K900J705j79m76L20K24n28m14j5q57k012j471J3Q6j052j093L38J516
57579D90393J901K352K636J854Q53J187K211K102J124R18J321R27P7K40J111J264
57563E12471J036J732K737K459J414J313J868J590R90J758L386L995L847M730
57549E45326O288O405M910L651L081K004N46J38O64O55L02J190L135M273M264
$$ y = [942063, 874147, 809274, 751123, 700819, 657322, 620247, 590287, 566804, 547626, 531556, 518802, 508809, 500137, 492659, 487352, 483731, 479992, 475921, 473153, 472294, 472235, 472392, 473083, 473582, 472614, 470985, 470962, 472723, 474163, 474438, 474772, 475428, 475026, 473462, 472436, 472291, 471296, 468984, 467285, 467296, 467764, 467877, 468735, 470728, 472107, 471675, 470674, 470642, 471514, 472946, 475374, 478565, 481139, 482619, 484089, 486065, 487771, 489170, 491388, 494288, 495993, 495814, 495338, 495658, 495882, 495354, 494940, 494925, 494068, 492056, 490585, 490598, 490684, 489632, 488539, 488877, 490393, 492294, 494646, 497282, 499136, 499989, 501176, 503387, 505489, 506613, 507531, 508852, 509779, 509856, 510096, 511207, 512471, 513507, 515239, 517976, 520435, 521849, 523162, 525030, 526620, 527610, 529368, 532754, 536749, 540596, 545326, 551614, 558019, 562929, 566580, 569661, 571665, 572211, 572349, 573013, 573668, 573970, 575160, 578295, 582568, 586832]
57534E86832M506N164M969L889L224L034K290J386J734K962L366L002L524N000
57520F34882N818N672N823O457O513O133O462P157O835N837N703O129N407L805
57506G18633L396M418M929M236L706L902L836L380L560M094L508K013J467K180
57492G67258K504J948J954L084M135M456M667M810M281L732M486N883N958M865
57478H24021M764O152P208P046O700O491N404L691L136M017M534L958L651M276
57464H95049M680M359M449N377N992N791N790O419O829O772O984P223O380M870
57450I76964M518N585O367O130N914O118N945N650O564Q343Q964Q101P658Q416
57436A071237Q930Q548Q505R118Q866P400O680P748Q977Q887Q280Q288Q561Q659
$$ y = [586832, 591338, 596502, 601471, 605360, 608584, 611618, 613908, 615294, 617028, 619990, 623356, 626358, 629882, 634882, 640700, 646372, 652195, 658652, 665165, 671298, 677760, 684917, 691752, 697589, 703292, 709421, 714828, 718633, 722029, 726447, 731376, 735612, 739318, 743220, 747056, 750436, 753996, 758090, 761598, 763611, 765078, 767258, 769762, 771710, 773664, 776748, 780883, 785339, 790006, 794816, 799097, 802829, 807315, 813198, 819156, 824021, 828785, 834937, 842145, 849191, 855891, 862382, 867786, 871477, 874613, 878630, 883164, 887122, 890773, 895049, 899729, 904088, 908537, 913914, 919906, 925697, 931487, 937906, 944735, 951507, 958491, 965714, 972094, 976964, 981482, 987067, 993434, 999564, 1005478, 1011596, 1017541, 1023191, 1029755, 1038098, 1047062, 1055163, 1062821, 1071237, 1080167, 1088715, 1097220, 1106338, 1115204, 1122604, 1129284, 1137032, 1146009, 1154896, 1163176, 1171464, 1180025, 1188684]
57422A188684R110R879R888R014Q571Q911Q768P846P716R153J0873J1820J2499
57409A312732J3135J2906J2033J2234J3894J5054J4334J2751J1602J0755J0040
57398A451470J0072J0648J0518R765J0068J1724J2903J2822J3053J4370J5069
57387A582482J4073J3073J3801J5361J6207J6654J7498J8028J7327J6050J5241
57376A755795J4750J4267J4388J5274J5757J5107J4221J3936J3684J2952J2452
57365A912583J2774J3368J3910J5015J6600J7324J6659J5900J6083J6629J6940
57354B083785J7554J8727J9656K0065K0777K1854K2047K1012K0082K0044K0132
57343B305735J9979K0310K0886K0265J8656J8437K0471K2409K2202K0889K0340
$$ y = [1188684, 1197794, 1207673, 1217561, 1226575, 1235146, 1244057, 1252825, 1260671, 1268387, 1277540, 1288413, 1300233, 1312732, 1325867, 1338773, 1350806, 1363040, 1376934, 1391988, 1406322, 1419073, 1430675, 1441430, 1451470, 1461542, 1472190, 1482708, 1492473, 1502541, 1514265, 1527168, 1539990, 1553043, 1567413, 1582482, 1596555, 1609628, 1623429, 1638790, 1654997, 1671651, 1689149, 1707177, 1724504, 1740554, 1755795, 1770545, 1784812, 1799200, 1814474, 1830231, 1845338, 1859559, 1873495, 1887179, 1900131, 1912583, 1925357, 1938725, 1952635, 1967650, 1984250, 2001574, 2018233, 2034133, 2050216, 2066845, 2083785, 2101339, 2120066, 2139722, 2159787, 2180564, 2202418, 2224465, 2245477, 2265559, 2285603, 2305735, 2325714, 2346024, 2366910, 2387175, 2405831, 2424268, 2444739, 2467148, 2489350, 2510239, 2530579]
57332B530579K0524K0732K1300K2299K2548K1648K1105K1887K2781K2740K2703
57321B770846K3460K3895K3112K2291K2553K2987K2666K2605K3787K5104K5302
57310C028608K5172K5875K6786K6879K6627K6759K6781K6454K6846K8150K8530
57299C323467K7044K5676K6370K8008K8658K8763K9600L0397K9782K8648K8795
57288C635208K9838L0043K9332K8970K9136K9071K8912K9280K9690K9356K8821
57277C957657K9010K9524K9567K9647L0506L1424L1316L0615L0357L0371K9999
57266D289993K9655K9971L0483L0721L1433L3076L4386L4191L3477L3787L4775
57255D645948L5181L5035L5014L4726L3570L2295L1840L1593L0609K9487K9336
$$ y = [2530579, 2551103, 2571835, 2593135, 2615434, 2637982, 2659630, 2680735, 2702622, 2725403, 2748143, 2770846, 2794306, 2818201, 2841313, 2863604, 2886157, 2909144, 2931810, 2954415, 2978202, 3003306, 3028608, 3053780, 3079655, 3106441, 3133320, 3159947, 3186706, 3213487, 3239941, 3266787, 3294937, 3323467, 3350511, 3376187, 3402557, 3430565, 3459223, 3487986, 3517586, 3547983, 3577765, 3606413, 3635208, 3665046, 3695089, 3724421, 3753391, 3782527, 3811598, 3840510, 3869790, 3899480, 3928836, 3957657, 3986667, 4016191, 4045758, 4075405, 4105911, 4137335, 4168651, 4199266, 4229623, 4259994, 4289993, 4319648, 4349619, 4380102, 4410823, 4442256, 4475332, 4509718, 4543909, 4577386, 4611173, 4645948, 4681129, 4716164, 4751178, 4785904, 4819474, 4851769, 4883609, 4915202, 4945811, 4975298, 5004634]
57244E004634K9855L0134L0225L0338K9694K7999K6699K6941K7572K7076K6145
57233E317312K6360K7537K8523K9253L0022K9967K8604K7665K8963L1447L2652
57222E638305L2176L1416L0844K9958K9155K9178K9212K7847K5504K3774K2833
57211E950202K1532J9598J7780J6216J4460J2723J1397R977Q023O376N761N185
57199F099230L511J689J373K221K526J832R84L06m45r79j120j639k893l644k944
57184F100008j970k155k819k640k171k589l287l102k720l414m477m423l630l298
57170F057313k873j254M37K50j250j875j351j155j423r80p7j02r02j162j236k672
57154F039688n080o431o557p576j0476j3947j6989k0167k3745k6869k9111l0925
$$ y = [5004634, 5034489, 5064623, 5094848, 5125186, 5154880, 5182879, 5209578, 5236519, 5264091, 5291167, 5317312, 5343672, 5371209, 5399732, 5428985, 5459007, 5488974, 5517578, 5545243, 5574206, 5605653, 5638305, 5670481, 5701897, 5732741, 5762699, 5791854, 5821032, 5850244, 5878091, 5903595, 5927369, 5950202, 5971734, 5991332, 6009112, 6025328, 6039788, 6052511, 6063908, 6073885, 6081908, 6088284, 6094045, 6099230, 6102741, 6104430, 6105803, 6108024, 6110550, 6112382, 6113366, 6113672, 6113227, 6112248, 6111128, 6109489, 6106596, 6102952, 6100008, 6098038, 6095883, 6093064, 6090424, 6088253, 6085664, 6082377, 6079275, 6076555, 6073141, 6068664, 6064241, 6060611, 6057313, 6054440, 6053186, 6053623, 6053873, 6052623, 6050748, 6049397, 6048242, 6046819, 6045839, 6045762, 6045660, 6044758, 6043596, 6042360, 6039688, 6034608, 6028177, 6021620, 6014044, 6003568, 5989621, 5972632, 5952465, 5928720, 5901851, 5872740, 5841815]
57142E841815l2193l2102l0685k8770k6334k2579j7552j2046o183J99O096J0148
57130E649814J2573J4538J6030J6106J4701J2433R343N760L608M801Q963J4817
57118E783487K2837L4193M7972O1941P5453Q9217J03072J16652J31632J50670
57108F617126J74709K03763K39475K84107L37730L99517M71530N58743O66074
57099I952774P98442R63182J169316J424328J733813K103003K535210L028564
57091B3708632L576056M167304M787489N415885O027898O596330P088200P463849
57083F8831643P681886P697281P446602O846264N832172M419135K720116R01320
57075A12376419q83340k523910l948356n111006n991962o597383o951825p087652
$$ y = [5841815, 5809622, 5777520, 5746835, 5718065, 5691731, 5669152, 5651600, 5639554, 5633371, 5633570, 5639666, 5649814, 5662387, 5676925, 5692955, 5709061, 5723762, 5736195, 5745538, 5751298, 5754906, 5759707, 5768670, 5783487, 5806324, 5840517, 5888489, 5950430, 6025883, 6115100, 6218172, 6334824, 6466456, 6617126, 6791835, 6995598, 7235073, 7519180, 7856910, 8256427, 8727957, 9286700, 9952774, 10751216, 11714398, 12883714, 14308042, 16041855, 18144858, 20680068, 23708632, 27284688, 31451992, 36239481, 41655366, 47683264, 54279594, 61367794, 68831643, 76513529, 84210810, 91657412, 98503676, 104335848, 108754983, 111475099, 112376419, 111493079, 108969169, 105020813, 99909807, 93917845, 87320462, 80368637, 73280985]
57067G3280985p037700o831925o497924o064714n564658n029747m486493l955148
57059B7812676l451690k988010k570872k202658j882979j609033j376020j178831
57051A0552583j012921q73448p55471o55954n73898n07541m53118m07207l68519
57042D944506l36366l09258k85902k65690k47217k28252k08161j88573j70626
57033B704461j53600j37003j21732j07872r3574p7519o0577m3597k5365m449J7779
57022A896952L6360M3837L3022K432l9672p9354j06836j21061j25140j21419j12313
57011A306808j01791r2595q3999p4603o5405n8022n2068m6420m1313l7091l2741
57000F20760k7652k3208k0695j9298j7802j6525j5769j4267j1168p883o011m943
$$ y = [73280985, 66243285, 59411360, 52913436, 46848722, 41284064, 36254317, 31767824, 27812676, 24360986, 21372976, 18802104, 16599446, 14716467, 13107434, 11731414, 10552583, 9539662, 8666214, 7910743, 7254789, 6680891, 6173350, 5720232, 5313025, 4944506, 4608140, 4298882, 4012980, 3747290, 3500073, 3271821, 3063660, 2875087, 2704461, 2550861, 2413858, 2292126, 2184254, 2090680, 2013161, 1952584, 1908987, 1883622, 1879173, 1896952, 1933312, 1977149, 2010171, 2012603, 1972931, 1893577, 1786741, 1665680, 1540540, 1419121, 1306808, 1205017, 1112422, 1028423, 953820, 888415, 830393, 778325, 731905, 690592, 653501, 620760, 593108, 569900, 549205, 529907, 512105, 495580, 479811, 465544, 454376, 446493, 440482, 435539]
56988D35539l258r66J460M653R100J3594J6428J6731J3583N887n173j5608k2403
56975D69567k6171k8470k8797k6305k2416j9139j6314j2841r257o785m952k357
56963B65763J148M814Q590J2700J6777K0846K5740L0937L3353K9949K0583P317
56951D78517p295k0079k7778k9873k9219k8234k6197k1936j6851j3004j0094o724
56939B41233l072P9L417P874J2630J6649K0916K6991L4396M1051M4832M3088L2999
56926E23083J5043n301k1901l2825l9189m1368l9288l4822l0681k7475k4235k0916
56914B20125j8161j5632j2849j0687r904r352p694n628m330l223j592o97j651
56901A18725k746j778L04J005L66L90J449K339L165N130P962J0420J2821J6499
$$ y = [435539, 432281, 431315, 432775, 437428, 446528, 460122, 476550, 493281, 506864, 512751, 507578, 491970, 469567, 443396, 414926, 386129, 359824, 337408, 318269, 301955, 289114, 279857, 273072, 268120, 265763, 266911, 271725, 280315, 293015, 309792, 330638, 356378, 387315, 420668, 450617, 471200, 478517, 471222, 451143, 423365, 393492, 364273, 336039, 309842, 287906, 271055, 258051, 247957, 241233, 238161, 238240, 241657, 249531, 262161, 278810, 299726, 326717, 361113, 402164, 446996, 490084, 523083, 538126, 532825, 510924, 478099, 438910, 397542, 358254, 323432, 292751, 265276, 241041, 220125, 201964, 186332, 173483, 162796, 152892, 143540, 135846, 130218, 125888, 122665, 121073, 120376, 118725, 115979, 114201, 114505, 115510, 115876, 116266, 117715, 120054, 123219, 128349, 136311, 146731, 159552, 176051]
56887A76051K1163K5404K9014L2072L2396K7014J6222L706p246j5407k0152k1078
56875B99159j9155j6083j2497q408m615j621J901P228J3085J7474K1119K6468
56863C24055L3995M2276N1111O1531P2559Q0284Q0218O9149M6180J4908j6260
56852H60006l9157n1613n6497n6331n1724m4008l5625k7540j8981r847r02Q111
56840D75892J8048K8375L8177M8639O1793P7334R3451J09642J24610J31508J20054
56829A327523Q5705L4888j9321o4774r4376j07170j07542j01491r2319q0696o7815
56818G12612n5677m4389l2352j9596q193J182J0460K1193L2890M5022N8330P2860
56806G94342Q6050R3082Q8129O6696L0024j2685m9324p3210q5121q8381q5264
$$ y = [176051, 197214, 222618, 251632, 283704, 316100, 343114, 359336, 363042, 355796, 340389, 320237, 299159, 280004, 263921, 251424, 243016, 238401, 236780, 238681, 245909, 258994, 276468, 297587, 324055, 358050, 400326, 451437, 512968, 585527, 665811, 746029, 815178, 861358, 876266, 860006, 820849, 769236, 712739, 656408, 604684, 560676, 525051, 497511, 478530, 468683, 467781, 475892, 493940, 522315, 560492, 609131, 670924, 748258, 841709, 951351, 1075961, 1207469, 1327523, 1413228, 1448116, 1428795, 1364021, 1269645, 1162475, 1054933, 953442, 861123, 780427, 712612, 656935, 612546, 580194, 560598, 552405, 553587, 564047, 585240, 618130, 663152, 721482, 794342, 880392, 973474, 1061603, 1128299, 1158323, 1145638, 1096314, 1023104, 937983, 849602, 764338]
56795G64338p7986o9165n9821m9416l8604k9478k2503j5975r065k773K917R884
56783D02353J8916K8437L7041M4559M9453M7888L7219J8850l218k4722m1607n0963
56771E64206n3125n1306m8121m3975l9008l4305l0289k6106k1539j7643j4816
56760A83973j2149r437p772p441p209o388n697n487n045m240l845l814l193k132
56746A00124j843k264k081j340j537k684k936j741p13o70m88K94M03n08q47K03
56730H1372J288J354J145J201P35l62p24J45R61J049J336K087K097J178R23J824
56714I7609K227J308N67J028J498J066Q00J470K008J769J913K940L254J924N83
56699A21964P80J606J759J785K392K616J687Q30J294K257K478K401K808L050K346
$$ y = [764338, 686352, 617187, 557366, 507950, 469346, 439868, 417365, 401390, 392325, 389552, 392469, 402353, 421269, 449706, 486747, 531306, 580759, 628647, 665866, 684716, 681498, 656776, 615169, 564206, 511081, 459775, 411654, 367679, 328671, 294366, 264077, 237971, 216432, 198789, 183973, 171824, 162387, 154615, 147174, 139965, 133577, 127880, 122393, 117348, 113108, 109263, 105449, 102256, 100124, 98281, 96017, 93936, 92596, 91059, 88375, 85439, 83698, 82985, 82315, 81827, 82121, 82524, 82016, 81169, 81372, 82660, 84014, 85159, 86360, 87095, 86733, 86009, 86154, 87115, 88164, 89500, 91587, 93684, 94862, 95785, 97609, 99836, 101144, 101711, 102739, 104237, 105303, 106103, 107573, 109581, 111350, 113263, 116203, 119457, 121381, 121964, 122744, 124350, 126109, 127894, 130286, 132902, 134589, 135419, 136713, 138970, 141448, 143849, 146657, 149707, 152053]
56684A52053J395J128J206J159J434K114K100R95M9K5j67j404k738l209l433m017
56668A48690m187l447k790k934l030k425j931k114k189j813j992k938l138j965
56654A11797j024j426j806p62P94J385J215R85L41q34j395p48NJ7l1K03k32j393
56636A07091j622l59O09K94K98J755L055K697J895K142K513J735P62R01J369J019
56620A26154N43P93Q20j58q63k26M80ln09K31J014L96m97o8P73L83o05o90k53
56601A27715l36l37N53J293Q13K44Q12J350M95m55L00J758J912J182J192J611
56585A40102J191N37R29J653J351P41J187J837J084k95l76P16J578K217L258L828
56569A61538L104K585L857N473N212M092M787P186R060J0266J2676J6441J9560
$$ y = [152053, 153448, 154576, 155782, 156941, 158375, 160489, 162589, 163584, 163633, 163658, 163491, 162087, 159349, 156140, 152707, 148690, 144503, 141056, 138266, 135332, 132302, 129877, 127946, 125832, 123643, 121830, 119838, 116900, 113762, 111797, 110773, 109347, 107541, 106779, 107573, 108958, 110173, 111158, 111499, 110665, 109270, 108522, 108527, 108544, 108513, 108716, 108484, 107091, 105469, 105110, 105719, 106013, 106311, 108066, 111121, 113818, 115713, 117855, 120368, 122103, 122865, 123766, 125135, 126154, 126697, 127490, 128310, 128152, 127289, 127063, 127543, 127540, 127031, 127262, 128276, 128672, 128175, 128107, 128880, 129263, 128658, 127968, 127715, 127379, 127042, 127595, 128888, 129701, 129945, 130757, 132107, 132602, 132147, 132447, 134205, 136117, 137299, 138491, 140102, 141293, 141830, 142759, 144412, 145763, 146504, 147691, 149528, 150612, 150317, 149941, 150657, 152235, 154452, 157710, 161538, 164642, 167227, 171084, 176557, 181769, 185861, 190648, 197834, 206894, 217160, 229836, 246277, 265837]
56556B65837K0826K0166J6708R892K125k878m466m980n657n621m717m224m452
56543B98559m317l638l572m462n306n438n083m400l619l487m094m192l218k697
56529B41036l716m652l733k165k021k539j597M32J394Q80K9j119k968m125l089
56514B12047j280j215k465k758k116k376l323k985j515j104k096k600j975j523
56500A82716j641j340o95p69j181o12M55L66o20q51m54r29j843j305M26J127M06
56483A73256Q6P09R36M98O08J167P40m27n13N12O89l72q44l5N83K84J90Q48J310
56464A80225J200J288J616J331N75L12L38k04o85J21J336J023m41q69J28R29J054
56447A89277J514K215K115J762K623L992L694J806M45R0o37j665j413j06K72n16
$$ y = [265837, 286663, 306829, 323537, 333429, 335554, 332676, 328210, 323230, 317573, 311952, 307235, 303011, 298559, 294242, 290604, 287032, 282570, 277264, 271826, 266743, 262343, 258724, 255237, 251143, 246951, 243733, 241036, 237320, 232668, 228935, 226770, 224749, 222210, 220613, 221045, 222439, 223319, 223348, 222229, 219261, 215136, 212047, 210767, 209552, 207087, 204329, 202213, 199837, 196514, 193529, 192014, 190910, 188814, 186214, 184239, 182716, 181075, 179735, 179040, 178271, 177090, 176478, 176933, 177299, 176679, 175828, 175374, 174445, 172602, 171297, 171723, 172850, 173256, 173342, 174051, 174987, 175485, 176093, 177260, 178000, 177573, 177060, 177572, 178261, 177889, 177045, 177010, 177593, 177877, 178067, 178915, 180225, 181425, 182713, 184329, 185660, 186235, 186547, 186885, 186681, 185996, 186117, 187453, 188476, 188035, 187166, 187294, 188223, 189277, 190791, 193006, 195121, 196883, 199506, 203498, 207192, 208998, 209443, 209533, 208896, 207231, 205818, 205712, 205984, 205468]
56431B05468p59k24l87j213j072m0J77k97L61J953K295J191P01J130N21j376k361
56414B06068j682j004r12j4J740K413J548R26J176R47L0j53M01J43o68j47J390
56397B12202J541K33NJ382K037J312J324K653L103J932J262J942K081R58M19J000
56381B35386O20j337k510j653n83n20k00R33J336O48P49K117K756K009J767K619
56365B44137K674J461J098K130K323R79L79J367J707M79j30Q60J358M97M52K000
56349B63771K670J404P23J911K481R01m10M86J720J497J223K085K367J068M12
56334B84309J916L644L999M518O154O741M983L241L384L631K445J698K870L792
56320C37325K491P27N16O16l45p82N21J465K96j078n96L95K93M93K258L687L173
$$ y = [205468, 204709, 204485, 204098, 202885, 201813, 201773, 201950, 201653, 202014, 203967, 206262, 207453, 208154, 209284, 209805, 208429, 206068, 204386, 203382, 202470, 202456, 204196, 206609, 208157, 209083, 210259, 211206, 211236, 211083, 211484, 211627, 210959, 210812, 212202, 213743, 213976, 213981, 215363, 217400, 218712, 220036, 222689, 225792, 227724, 228986, 230928, 233009, 233967, 234386, 235386, 236006, 234669, 232159, 230506, 229923, 229403, 229203, 230136, 231472, 232120, 232869, 234986, 237742, 239751, 241518, 244137, 246811, 248272, 249370, 251500, 253823, 254802, 255181, 256548, 258255, 258734, 258604, 259464, 260822, 261319, 261771, 263771, 266441, 267845, 268568, 270479, 272960, 273861, 273451, 273937, 275657, 277154, 278377, 280462, 282829, 283897, 284309, 286225, 289869, 293868, 298386, 304540, 311281, 316264, 319505, 322889, 326520, 328965, 330663, 333533, 337325, 339816, 340543, 341059, 341675, 341330, 340548, 341069, 342534, 342830, 341752, 341156, 341551, 341844, 342337, 344595, 348282, 351455]
56303C51455K597L800N152M954M900O745Q758Q930Q409Q472P472M362J827K200
56289D30033L504L239K813M364O437O803O578P659Q871Q588Q251R544J0875J0446
56275E28005R927J1313J3057J3145J3046J4741J6717J6955J7024J9206K2239K3928
56263G19303K5230K7836L0453L1540L3028L7288M2923M7544N2034N8235O5136
56252A170550P1357P8630Q8759R9743J08921J17264J26714J36071J43433J49752
56242B291194J55892J59137J56856J50650J42730J31333J14130R3051P1179M7860
56232C514012K1610n106k8829n0111p0857q9492j03536j14258j23895j30941j33075
56221B685522j32107j31194j29676j25400j19565j14466j09089j01728r4213q8783
$$ y = [351455, 354052, 357852, 363004, 367958, 372858, 379603, 388361, 397291, 405700, 414172, 421644, 426006, 427833, 430033, 433537, 436776, 439589, 443953, 450390, 457193, 463771, 471430, 480301, 488889, 497140, 506684, 517559, 528005, 537932, 549245, 562302, 575447, 588493, 603234, 619951, 636906, 653930, 673136, 695375, 719303, 744533, 772369, 802822, 834362, 867390, 904678, 947601, 995145, 1047179, 1105414, 1170550, 1241907, 1320537, 1409296, 1509039, 1617960, 1735224, 1861938, 1998009, 2141442, 2291194, 2447086, 2606223, 2763079, 2913729, 3056459, 3187792, 3301922, 3394973, 3466152, 3514012, 3535622, 3530516, 3501687, 3451576, 3380719, 3291227, 3187691, 3073433, 2949538, 2818597, 2685522, 2553415, 2422221, 2292545, 2167145, 2047580, 1933114, 1824025, 1722297, 1628084, 1539301]
56211A539301q3639p6399o9025o4320o0660n5324m9895m6964m4669m0084l4949
56200I13373l2302l0434k6216k1414j9613j9538j7635j4642j3483j3122j0859
56189F94115q207q238r413q293n991n645o018m070j362j327k510j276J059P94
56175F33618p84K80K951L112J326J506L408L621K619L687O104O378N114N863Q300
56160F87103R253R132J0684J2831J2550J1321J2834J5904J6635J6013J8211K2821
56148H55292K6045K8147L2502L8665M3666M8808N7899P0023Q1175R1390J03067
56137A476679J13965J19302J19025J15677J07503R1818P3095N9207N1287M5350
56127B372908M1283M1085M0505L2527J8285N245m233j3253k1054k3732k3624k7973
$$ y = [1539301, 1455662, 1379263, 1310238, 1245918, 1185258, 1129934, 1080039, 1033075, 988406, 948322, 913373, 881071, 850637, 824421, 803007, 783394, 763856, 746221, 731579, 718096, 704974, 694115, 685908, 677670, 668257, 659964, 653973, 648328, 642310, 638240, 636878, 635551, 633041, 631765, 632824, 633618, 632834, 633114, 636065, 639177, 640503, 642009, 645417, 649038, 651657, 655344, 661448, 667826, 672940, 678803, 687103, 696356, 705488, 716172, 729003, 741553, 752874, 765708, 781612, 798247, 814260, 832471, 855292, 881337, 909484, 941986, 980651, 1024317, 1073125, 1131024, 1201047, 1282222, 1373612, 1476679, 1590644, 1709946, 1828971, 1944648, 2052151, 2143969, 2217064, 2276271, 2327558, 2372908, 2414191, 2455276, 2495781, 2528308, 2546593, 2551838, 2547605, 2534352, 2513298, 2489566, 2465942, 2437969]
56115B437969l8336n0527o4136q1937j00415j11377j13339j11724j08009r8751
56105A559418q5221p3516o4596n4105m2354l4413l0138k4338j7049j3376j2986
56094A107326j0256n195l383m788l507Q45K522J015J864N431O227M180N138R181
56080A116600J0085P416P478J1021J1912R403R597J3226J4112J1419J1319J4763
56068A248351J5858J4028J5257J9701K0759J8197J9014K3596K4458K0797K0400
56057A460416K4759K6277K2946K1626K3999K3498J9177J8188K1395K1156J6559
56046A699996J5922K0899K3283K1028K1746K6744K7743K3510K3295K9394L2777
56035A966337L0731L1901L8880M2950M1380M2754M9600N3171N1002N1846N7607
$$ y = [2437969, 2399633, 2349106, 2284970, 2203033, 2102618, 1991241, 1877902, 1766178, 1658169, 1559418, 1474197, 1400681, 1336085, 1281980, 1239626, 1205213, 1175075, 1150737, 1133688, 1120312, 1107326, 1097070, 1091875, 1088492, 1083704, 1080197, 1081042, 1083564, 1084579, 1086443, 1091874, 1098101, 1102281, 1107419, 1116600, 1126685, 1134101, 1141579, 1152600, 1164512, 1173915, 1183512, 1196738, 1210850, 1222269, 1233588, 1248351, 1264209, 1278237, 1293494, 1313195, 1333954, 1352151, 1371165, 1394761, 1419219, 1440016, 1460416, 1485175, 1511452, 1534398, 1556024, 1580023, 1603521, 1622698, 1640886, 1662281, 1683437, 1699996, 1715918, 1736817, 1760100, 1781128, 1802874, 1829618, 1857361, 1880871, 1904166, 1933560, 1966337, 1997068, 2028969, 2067849, 2110799, 2152179, 2194933, 2244533, 2297704, 2348706, 2400552, 2458159]
56024B458159N8679N3106N1569N7180N9594N5580N5569O2960O7275O5108O7042
56013C111821P6180Q1161P8570Q0400R0783R7683R6505R8955J09170J14860J11916
56002D148004J13535J24649J32314J32104J37923J54438J66668J68846J75719
55993E454200J92905K05203K07483K16695K38982K56570K62515K75442L03436
55984G613431L27744L39936L59513L95704M29075M51154M83385N35205N84313
55975A1519460O21551O72177P48035Q24590Q92037R80139J103328J233819J361247
55966A9956383J522866J739734J983892K248019K582185L019546L539295M152444
55958D0744364M943215N967598P197299Q626306J0335420J2388922J4797993J7675064
$$ y = [2458159, 2516838, 2569944, 2621513, 2678693, 2738287, 2793867, 2849436, 2912396, 2979671, 3044779, 3111821, 3188001, 3269162, 3347732, 3428132, 3518915, 3616598, 3713103, 3812058, 3921228, 4036088, 4148004, 4261539, 4386188, 4518502, 4650606, 4788529, 4942967, 5109635, 5278481, 5454200, 5647105, 5852308, 6059791, 6276486, 6515468, 6772038, 7034553, 7309995, 7613431, 7941175, 8281111, 8640624, 9036328, 9465403, 9916557, 10399942, 10935147, 11519460, 12141011, 12813188, 13561223, 14385813, 15277850, 16257989, 17361317, 18595136, 19956383, 21479249, 23218983, 25202875, 27450894, 30033079, 33052625, 36591920, 40744364, 45687579, 51655177, 58852476, 67478782, 77814202, 90203124, 105001117, 122676181]
55950A22676181K1270246K5735612L1008745L6951113M3064364M7518436M6856655
55943C75081352L7875587K0615977o85719k0094280l3584488m0477187m2217945
55936B96513297m0605072l7063670l2670381k8156048k3876944j9986762j6612422
55929I7541998j3812397j1506843r579721p989901o716266n680054m801759m070765
55921C3384292l491742l019436k605038k253393j978901j752169j540034j354019
55913A5389560j212261j093674r73063q63791p84497p18427o44256n74616n27390
55904G997585m89292m42525l98769l73544l53849l22959k91841k75712k63590
55895D785504k40295k15681k03950j95695j77496j58551j51638j47470j33236
$$ y = [122676181, 143946427, 169682039, 200690784, 237641897, 280706261, 328224697, 375081352, 412956939, 433572916, 432887197, 412792917, 379208429, 338731242, 296513297, 255908225, 218844555, 186174174, 158018126, 134141182, 114154420, 97541998, 83729601, 72222758, 62643037, 54653136, 47936870, 42256816, 37455057, 33384292, 29892550, 26873114, 24268076, 22014683, 20035782, 18283613, 16743579, 15389560, 14177299, 13083625, 12110562, 11246771, 10462274, 9743847, 9099591, 8524975, 7997585, 7508293, 7065768, 6666999, 6293455, 5939606, 5616647, 5324806, 5049094, 4785504, 4545209, 4329528, 4125578, 3929883, 3752387, 3593836, 3442198, 3294728, 3161492]
55886C161492j17666j13121j10970r8698q4104p9196p6820o6165n5561n7292o4558
55875B237341o5105o3385o8253p2811o7450n9789o1138o5516o1790n4553n3667
55864A543884n4644m8474m0004l8052l7832l1220k4193k6291l2366l2093k8270
55853A150445k8946l0637k6173k0413k1744k6081k5061k1985k4261k8093k6044
55842H71007k1923k3138k5912k2921j8054j8811k1392j8107j2552j2697j5648
55831F59852j3654r029q771j0490p707l269l766o293m414j566m870j0996j1772
55818E63255q911r682j2778j1851q631r313j1866r843n045l984n379l346O16Q59
55804D64101p86J532O020O730N236P269J1067J0597P219O704P819N244P48N6J399
$$ y = [3161492, 3043826, 2930705, 2819735, 2721037, 2636933, 2557737, 2480917, 2414752, 2359191, 2301899, 2237341, 2172236, 2108851, 2040598, 1967787, 1900337, 1840548, 1779410, 1713894, 1652104, 1597551, 1543884, 1489240, 1440766, 1400762, 1362710, 1324878, 1293658, 1269465, 1243174, 1210808, 1178715, 1150445, 1121499, 1090862, 1064689, 1044276, 1022532, 996451, 971390, 949405, 925144, 897051, 871007, 849084, 825946, 800034, 777113, 759059, 740248, 718856, 700749, 688197, 675500, 659852, 646198, 637169, 628398, 617908, 610201, 606932, 603166, 596873, 592459, 590893, 586023, 575027, 563255, 554344, 544662, 531884, 520033, 511402, 502089, 490223, 480380, 475335, 471351, 465972, 462626, 463242, 464101, 463315, 464847, 470867, 477597, 482833, 490102, 501169, 511766, 518985, 525689, 533508, 538752, 539500, 539556, 540955]
55789E40955j288o470p636n483o118r184q949n547m376n837n951n487q186j1611
55775D48832j0070m959k130q19M545J3203J9343K2805K7750L1583K6380J1649
55763E88112m280j5835k3923k8504k7300k2455j9469j8722j6035j1431r156r368
55751C81634q248o112p040j0541j1816j0299r912j1012j0027o992n563n665l837
55738B74570n90K67p67K16K495J490k641m979m356m227n237m700l269m362o972
55723B36938o752m225m097o511o849m336k843k816n93L706N535M296M564P806
55709B23823J0246J0143R992J0246P966L109n85k204m679q334r939r084q964j0030
55695B21706r416p301p083q501p518l892j913k641k389j19P59o36p90J475L017
$$ y = [540955, 539667, 533197, 525561, 520078, 513960, 504776, 495827, 490280, 485904, 480067, 474116, 468629, 460443, 448832, 438762, 433803, 431673, 430854, 435399, 448602, 467945, 490750, 518500, 550083, 576463, 588112, 583832, 567997, 544074, 515570, 488270, 465815, 446346, 427624, 411589, 400158, 391002, 381634, 373386, 367274, 360234, 349693, 337877, 327578, 317666, 306654, 296627, 289635, 284072, 278407, 274570, 273980, 274247, 273480, 273696, 276191, 277681, 275040, 270061, 265705, 261478, 256241, 251541, 248272, 243910, 236938, 230186, 225961, 221864, 215353, 208504, 204168, 201325, 198509, 197916, 201622, 207157, 211453, 216017, 223823, 234069, 244212, 254204, 264450, 272416, 275525, 274940, 272736, 268057, 259723, 249784, 240700, 231736, 221706, 212290, 204989, 197906, 189405, 181887, 177995, 176082, 173441, 171052, 170933, 171692, 171056, 170266, 171741, 174758]
55680A74758K745L400N416N560L389K532L770L378K43j832j074o33k242l120j647
55665A94643l31o62n10J030J555L04k3J535K360J508J551L336M126K892K217L086
55649B18617L019J257M89J532J529n76k017j536j506k808k959j407j355m076o564
55634B01639p027p587r301r714p722n868n455m366j998j170k733l370j380L08
55620A34256l91j215k33P02M7n72k53j045l496m499k496m16o46j403q70n61j682
55603A15227k341j342p06j666k143r21j64j194j918j138j038k607l061q90R14
55588I5012l3j414o89M43k55j235l36J125J092M88P92R25j83q96J29J218Q89O86
55570I7758J897K657J432K33J125K539K258J227J156J140p8j150n80L63J23k67
$$ y = [174758, 177503, 180903, 186319, 191879, 195268, 197800, 201570, 204948, 205191, 203359, 202285, 201652, 199410, 196290, 194643, 194312, 193650, 193140, 194170, 195725, 196029, 196006, 197541, 199901, 201409, 202960, 206296, 210422, 213314, 215531, 218617, 221636, 222893, 223382, 224914, 226443, 225867, 223850, 222314, 220808, 218000, 215041, 213634, 212279, 208203, 201639, 194612, 187025, 177724, 168010, 160288, 154420, 148965, 144599, 142601, 141431, 138698, 135328, 133948, 134256, 133865, 132650, 132417, 133119, 133166, 132594, 132341, 131296, 127800, 123301, 120805, 120389, 119743, 118340, 117470, 116909, 115227, 112886, 111544, 110838, 109172, 107029, 106108, 105944, 104750, 102832, 101694, 100656, 98049, 94988, 94098, 95012, 94979, 93565, 92876, 93319, 93064, 91829, 91493, 92618, 93710, 94198, 94990, 95915, 95732, 94836, 94965, 96183, 97072, 97758, 99655, 102312, 103744, 103977, 105102, 107641, 109899, 111126, 112282, 113422, 113344, 112194, 111614, 111977, 112100, 111833]
55554A11833L94P43n37j971j974j713k546l114j926l64k53p58l86K53K16L69J317
55537I9583J636O15J46J446K618J951Q47R18J047J04l67Q47J739L61j640j920
55521A09931j289j578k053j286l47q96k025k086j702k148k613j976j287j802k470
55506H4373j990j333j645j842q58m8o54j211k76P12J42n87L27J647J450P22J250
55489H0179J996J082m54l89P04O07o63j265p52n0O85J635J920J053M31J154J984
55472H9857J560P95P27J92j775l374k764j358j386k118j555j83J58l79m70l62
55456G7565r43j397o40L27J31l85J01O52j10j121o62M97N39j82k40P4k23m23M32
55437G3992J221N89m21k76K21k05m39R35K390J645l81j110m52j82l69K36J246
$$ y = [111833, 112227, 112970, 112433, 110462, 108488, 106775, 104229, 101115, 99189, 98825, 98572, 97814, 97428, 97681, 97897, 98266, 99583, 101219, 101834, 101980, 103426, 106044, 107995, 108842, 109760, 110807, 110911, 110544, 111391, 113130, 113491, 111851, 109931, 108642, 107064, 105011, 103725, 103378, 102482, 100457, 98371, 96669, 94521, 91908, 89932, 88645, 86843, 84373, 82383, 81050, 79405, 77563, 76705, 76657, 76003, 74792, 74516, 75228, 75370, 74783, 75110, 76757, 78207, 78929, 80179, 82175, 83257, 82803, 82414, 83118, 83725, 83062, 81797, 81045, 80995, 81680, 83315, 85235, 86288, 86719, 87873, 89857, 91417, 92212, 92939, 93131, 91356, 87982, 85218, 83860, 82474, 80356, 78801, 78618, 78776, 78397, 77927, 77565, 76622, 75225, 74585, 74912, 75043, 74658, 74759, 75411, 75301, 74180, 73518, 74015, 74554, 74372, 74132, 74206, 73983, 73560, 73992, 75213, 75802, 75381, 75105, 75326, 75121, 74682, 75617, 78007, 79652, 79271, 78161, 77709, 77527, 77158, 77394, 78640]
55420G8640J263N83M04L07o61j553j023p2m24j352j070K7L83L19R42J388L32j020
55402G7413o81N39N32k61R3J151Q80m96j013o12q63j608j273j17J12n60n32K67
55384G2971M80R1K19N76O7o88k68O62M05n24k38J039J351M30k79m38p65p64M62
55365G4789J743J298n2j91M92m8j530j776o85j90n02rJ198J200j35q46l78j52
55347G4226m56L7J359J908J376J038R89M8j446j763q83n48j035r56l16n71j466
55330G1541j013R09K101J724J362J824J900J018K69J27k28p02j26J130J156k44
55314H2748j024k60N37K09n49j108j893k747k628j584q24m26O82K192K419J185
55298G6929K16K34K10j72R3J003J227O39O59J496J594M15o42o60k47K21J051J638
$$ y = [78640, 79903, 80486, 80890, 81197, 80536, 78983, 77960, 77888, 77464, 76112, 75042, 75069, 75452, 75771, 76713, 78101, 78433, 77413, 76732, 77271, 77803, 77542, 77635, 78786, 79666, 79170, 78157, 77545, 76682, 75074, 73801, 73684, 73796, 73236, 72704, 72971, 73451, 73542, 73761, 74337, 74404, 73716, 73448, 74110, 74515, 73991, 73753, 74792, 76143, 76573, 76294, 75856, 75091, 74327, 74789, 76532, 77830, 77778, 77587, 78079, 78031, 76501, 74725, 74040, 73850, 73348, 73339, 74537, 75737, 75602, 74756, 74378, 74226, 73770, 73807, 75166, 77074, 78450, 79488, 80477, 80525, 79079, 77316, 76433, 75885, 74850, 73894, 73578, 73007, 71541, 70528, 71437, 73538, 75262, 76624, 78448, 80348, 81366, 81635, 81762, 81534, 80832, 80706, 81836, 82992, 82748, 81724, 81464, 82001, 82210, 81661, 80553, 78660, 75913, 73285, 71701, 70877, 70451, 71133, 73325, 75744, 76929, 77145, 77379, 77589, 77417, 77510, 78513, 79740, 80379, 81038, 82534, 84128, 84543, 83901, 83241, 82994, 83215, 84266, 85904]
55280H5904R03m78p62j64m11j328r71O18J154J37k75P51J291K87o68n23n29j360
55262H3576j532l26N29q2o88kP75L17m79m03k2j54k15K46L00m93q27Q5Q88L83
55242H1876l75j3P98P35J49K32R40J287R31K21n15q93n09K32L76j45m53l52n18
55223H4004q72m32P46J272N51m04p70q13o81j0Q52R48M40M02P62M11n38q19m98
55204H4551r01j859j662k47M18k05k68R74J628N01p85o35L8j62p03n47m9J08K15
55185H0410M62J94n70o20M25J280J169R65J263J327Q88Q86J451J345L76J18J076
55168I2445J507M06p34n34J31J28J9M76P61M23M22J131J245J80n40J12P90J63
55150I8531q79j133j102j360r44O52J825J200j03m20r8j91l18K19P51N00Q8J21
$$ y = [85904, 86807, 86329, 85567, 85403, 84992, 83664, 82693, 83311, 84465, 84602, 84327, 85078, 86369, 86656, 85988, 85465, 84936, 83576, 82044, 81718, 82247, 82165, 81477, 81475, 82250, 82567, 82088, 81685, 81663, 81509, 81294, 81540, 81840, 81347, 80520, 80605, 81493, 81876, 81501, 81488, 82286, 83021, 83170, 83402, 84342, 85629, 86560, 86781, 86266, 85373, 84864, 85096, 85472, 85327, 84874, 84522, 84004, 83132, 82700, 83446, 84718, 85269, 84865, 84095, 83282, 82601, 82591, 83443, 84391, 84831, 85233, 85995, 86406, 85868, 85049, 84551, 83650, 81791, 80129, 79882, 80300, 80095, 79827, 80801, 82429, 82930, 82145, 81510, 81548, 81386, 80683, 80136, 80087, 80195, 80410, 80872, 81066, 80496, 79876, 80301, 81581, 82750, 83715, 84978, 86305, 87193, 88079, 89530, 90875, 91251, 91369, 92445, 93952, 94358, 93624, 93090, 93221, 93349, 93368, 93844, 94605, 95028, 95450, 96581, 97826, 98006, 97466, 97578, 98368, 98531, 97652, 96519, 95417, 94057, 93113, 93765, 95590, 96790, 96687, 96267, 96169, 95978, 95660, 95879, 96630, 97130, 97218, 97339]
55132I7339j59j131j475l45Q48O60r0r6J42k80o31o2M14l64j473j430o43k85p7
55113I0862P17J385R37N7q8J35j12k99L27J014Q34N59J257K169J983J085N86K62
55095A03670n77j294j006l86m31n18L45J447J584J216J375J487N35o25m02Q14
55079A07234J252N17l22p51r59n68O96J663R76p18j614j361j028r71n50L21R46
55062A04763J014P04K0q42j104n36j30n71j016n66J55K47P8J89rq37j054K62J806
55043A02573J924J120P79O56j67j051q21o5j45p30n95k6j96p88n66K61M64K3k05
55024A02445m29j311j988j069P60J461P17P7J76J19l43l06M25Q64N75K16J08j30
55006A02367m66l72N8K22J27K49M44K16j79j20K78N52Q33J326J498R77M51M92
$$ y = [97339, 97180, 96049, 94574, 94229, 95077, 95737, 95647, 95551, 95693, 95413, 94782, 94720, 95134, 94770, 93297, 91867, 91224, 90939, 90862, 91579, 92964, 93901, 93958, 93870, 94005, 93893, 93594, 93921, 94935, 95769, 96328, 97585, 99754, 101737, 102822, 103408, 103670, 103093, 101799, 100793, 100407, 99976, 99458, 99803, 101250, 102834, 104050, 105425, 106912, 107447, 106822, 106420, 107234, 108486, 109003, 108681, 107930, 106971, 106403, 107099, 108762, 109738, 109020, 107406, 106045, 105017, 104046, 103496, 103817, 104763, 105777, 106481, 106501, 105659, 104555, 104019, 103889, 103318, 102302, 101736, 101891, 102138, 102216, 102405, 102396, 101559, 100505, 100767, 102573, 104497, 105617, 106396, 107052, 106885, 105834, 105013, 104948, 104803, 104073, 103478, 103452, 103256, 102468, 101902, 102163, 102627, 102650, 102445, 102016, 100705, 98717, 97648, 98408, 99869, 100586, 100663, 100839, 100958, 100615, 100309, 100734, 101598, 102173, 102389, 102497, 102367, 101901, 101529, 101587, 101809, 101936, 102185, 102629, 102845, 102666, 102546, 102824, 103376, 104209, 105535, 107033, 108010, 108461, 108953]
54988A08953N06M8M1J132K025J321j46o66l14k54m66k97k89j220k086j385K96
54971A07199J209J240J533K059J894J369J474J700R00k04M1J214J368L24k39J64
54955A23245L02k12m61l53p94j477j011M73J224O77Q6P7j05o04m97J97K58m88
54937A20537p88k69pl23j96O40J021M58n4R6K84K59P08J694K277K318K881M312
54919A35848N569O049O419P157P836Q256Q666Q527O779L653N76j956m611p091
54905A91677p955p014n873n487n083m263m072m968n578m684l009j876j369q42
54891A29604k23J43J95J1l25m25P7Q60J341J680K274K649K212J709K414M040N204
54874A53440N722O588P774Q048P129O080N274L935J833k92k298m653o803p504
$$ y = [108953, 109459, 109507, 109548, 110680, 112705, 114026, 113880, 113214, 112900, 112646, 112180, 111883, 111594, 110374, 108288, 106903, 107199, 108408, 109648, 111181, 113240, 115134, 116503, 117977, 119677, 120577, 120373, 120414, 121628, 122996, 123320, 123081, 123245, 123547, 123335, 122874, 122521, 121727, 120250, 119239, 119712, 120936, 121613, 121699, 121776, 121671, 121067, 120570, 120767, 121025, 120537, 119749, 119480, 119473, 119150, 118954, 119594, 120615, 121073, 121019, 121115, 121399, 121658, 122366, 124060, 126337, 128655, 131536, 135848, 141417, 147466, 153885, 161042, 168878, 177134, 185800, 194327, 201106, 204759, 205335, 203379, 198768, 191677, 183722, 176708, 170835, 165348, 160265, 156002, 151930, 146962, 141384, 136700, 133691, 131815, 130446, 129604, 129381, 129524, 129719, 129730, 129405, 128980, 129057, 129917, 131258, 132938, 135212, 137861, 140073, 141782, 144196, 148236, 153440, 159162, 165750, 173524, 181572, 188701, 194781, 200055, 203990, 205823, 205531, 203233, 198580, 191777, 184273]
54860A84273p026o971p571p310n703m176l624l281k680k608l195l209k190j373
54846A23356j513j684j201q94j368j763j374q80r39j041p70o94j026q76K00J273
54830A08806J541J397J295Q98J72j42J42K66N2L07J089J226L01n30m68k22l91
54813A15739m12M5K37k15n30k62k1m5L18J022R39j12p65l18K91M90J045K088K265
54794A21799J130K53O71J114K74j003j395j158j009n45N17J135O25J03N81J147
54778A24239P41K34Q43J846J850J278J522K525L080K985L046L451L739L963M526
54763A59868N251N675N912O269O582O660O552N744L236o68l940n233n486o105
54749A90317o834o717n909n088m195l110k518k782k972k382j784j911j939j001
$$ y = [184273, 177247, 170276, 162705, 155395, 149692, 145516, 141892, 138611, 135931, 133323, 130128, 126919, 124729, 123356, 121843, 120159, 118958, 118064, 116696, 114933, 113559, 112679, 111740, 110699, 109929, 109235, 108209, 107333, 107533, 108806, 110347, 111744, 113039, 113937, 114109, 113967, 114109, 114375, 114427, 114734, 115823, 117049, 117350, 116820, 116352, 116130, 115739, 115327, 115372, 115609, 115394, 114864, 114602, 114581, 114536, 114854, 115876, 116815, 116703, 115938, 115620, 115911, 116401, 117446, 119534, 121799, 122929, 123182, 123853, 124967, 125241, 124238, 122843, 121685, 120676, 120131, 120648, 121783, 122408, 122511, 123092, 124239, 124980, 125214, 126057, 127903, 129753, 131031, 132553, 135078, 138158, 141143, 144189, 147640, 151379, 155342, 159868, 165119, 170794, 176706, 182975, 189557, 196217, 202769, 208513, 211749, 211081, 207141, 201908, 196422, 190317, 183483, 176766, 170857, 165769, 161574, 158464, 155946, 153164, 150192, 147810, 146026, 144115, 142176, 141175]
54735A41175rj81q62p08m4j16o95n01M93J114J111J458K535L618M220M683N349
54718A62640O138O970P628P454N998L790J720l2j751l388m653n539o118o333o394
54703A68130o646o709n733l940k724k620k512j619p90p99q83k68K06m50j482j582
54687A29579r93q24j120j121p80n83m56j27M2k23l24J66M83p6q47r69q35j098
54669A19894j194l72P43J139J078J246J193K51p94p38K5K14j99k50J58L54L81
54652A23129P27R58K74r06j436j150o74M5J343K391J879O3j405j625j084l05O68
54635A22892J414J194N1j070j391p91M24J540J700Q73J1m47j193k367k540q05
54619A19495J345J845Q46kj08l0J89P72R80M5j131j135m34n29j239r68M50J417
$$ y = [141175, 141166, 140985, 140123, 139415, 139371, 139255, 138560, 138059, 138552, 139666, 140777, 142235, 144770, 148388, 152608, 157291, 162640, 168778, 175748, 183376, 190830, 196828, 200618, 202338, 202306, 200555, 197167, 192514, 186975, 180857, 174524, 168130, 161484, 154775, 149042, 145102, 142378, 139758, 137246, 135627, 134837, 134038, 133155, 132887, 133093, 132643, 131161, 129579, 128586, 127762, 126642, 125521, 124741, 124158, 123702, 123575, 123617, 123394, 123070, 123236, 123719, 123643, 122796, 121827, 120992, 119894, 118700, 118328, 119071, 120210, 121288, 122534, 123727, 123978, 123184, 122446, 122471, 122685, 122486, 122236, 122394, 122748, 123129, 123856, 124814, 125088, 124182, 122746, 121596, 120922, 120967, 122310, 124701, 126580, 126643, 125238, 123613, 122529, 122224, 122892, 124306, 125500, 125551, 124481, 123090, 122299, 122723, 124263, 125963, 126836, 126847, 126400, 125207, 122840, 120300, 119495, 120840, 122685, 123531, 123529, 123421, 123391, 123580, 124352, 125332, 125377, 124246, 123111, 122677, 122148, 120909, 119941, 120391, 121808]
54601A21808J168O44N68N50M01N59Q00K31r91j490o88L67O60L87J06q8j79J7L75
54582A25205N34N50O06L46n17j226p84M36J133R48O46O43N91L71J80j36p01q50
54564A27975M9J226J503J157J291J697J168j96r02m60j8k76m97p5M37M29J46n9
54546A34595k19j42O11J751K302J907J211P86O06O02P26N17l26j052o96L37O90
54529A44206Lq20j141j119p79K9P69O47k3k75j71o32j578j831j014r6K25K53K35
54510A36888l5l47j14M86O71M67O40J154J168O77O20J123J199N40J8M7p3o82j071
54491A43376q11m60m03k56J17J73k30n04m24m20m94q2P44J182J087J147J433J162
54473A46337K63k29J98Q56J213J536J773J294K86QR49K043K295J922J373N24m75
$$ y = [121808, 122976, 123620, 124188, 124738, 125139, 125698, 126498, 126729, 125738, 124248, 123560, 123927, 124587, 124974, 125080, 124992, 124813, 124830, 125205, 125739, 126289, 126895, 127241, 126724, 125498, 124714, 125150, 126283, 127231, 127877, 128520, 129111, 129482, 129662, 129526, 128825, 127975, 128024, 129250, 130753, 131910, 133201, 134898, 136066, 135870, 134968, 134508, 134490, 134214, 133717, 133642, 134079, 134508, 134654, 134595, 134376, 134234, 134845, 136596, 138898, 140805, 142016, 142802, 143408, 144010, 144736, 145253, 144927, 143875, 143179, 143516, 144206, 144209, 143389, 142248, 141129, 140350, 140379, 141148, 141795, 141772, 141497, 141326, 140694, 139116, 137285, 136271, 136175, 136400, 136653, 136888, 136853, 136506, 136392, 136878, 137549, 138016, 138656, 139810, 140978, 141655, 142275, 143398, 144597, 145137, 145155, 145202, 145129, 144447, 143376, 142565, 142105, 141702, 141446, 141563, 141736, 141506, 141002, 140578, 140158, 139664, 139582, 140326, 141508, 142595, 143742, 145175, 146337, 146600, 146371, 146569, 147425, 148638, 150174, 151947, 153241, 153527, 153535, 154484, 156527, 158822, 160744, 162117, 162641, 162166]
54456A62166q21k90K50J94m4j02l53r68j426j525j699j977j708q60k94l47l43
54439A49853N2L44M60R82J646J245k95j390j198r14j601k377j968p53J55O72J228
54422A46141J447Q05j65n67m43k93P9J084K246K636K114J318O85J74l21q12j150
54405A54978r41mR55R34N9m53J6P99J214J322J163M65m14m80M04J158J150R96
54387A63321J157J101N91L70P51Q34J25l90J18Q95R65P53J036J334Q22M9K79J589
54369A75700K881L365K976J804K12q69p99r3K98J86q7m82j034j318r90m78l81
54352A80891n86o53n81n91n81m85o24j115j451j272r63r60j039q99q37j160j578
54335A65516j746j840k005j876j234n33j56K11Q45J332J263R66R39J081J061Q43
$$ y = [162166, 161345, 161055, 161305, 161499, 161455, 161353, 161000, 160032, 158606, 157081, 155382, 153405, 151697, 150837, 150543, 150196, 149853, 149905, 150249, 150709, 151691, 153337, 154582, 154287, 152897, 151699, 150785, 149184, 146807, 144839, 144086, 144241, 144913, 146141, 147588, 148393, 148228, 147661, 147218, 146925, 147004, 148088, 150334, 152970, 155084, 156402, 157087, 157261, 156940, 156128, 154978, 154037, 154033, 154988, 155922, 155981, 155528, 155544, 156343, 157557, 158879, 160042, 160507, 160093, 159613, 160017, 161175, 162325, 163321, 164478, 165579, 166170, 166540, 167291, 168125, 168250, 167860, 167978, 168873, 169838, 170591, 171627, 172961, 173783, 173832, 174111, 175700, 178581, 181946, 184922, 186726, 186938, 186069, 185270, 185177, 185475, 185661, 185574, 185092, 184058, 182740, 181750, 181272, 180891, 180305, 179652, 179071, 178480, 177899, 177414, 176790, 175675, 174224, 172952, 171989, 171029, 169990, 169091, 168254, 167094, 165516, 163770, 161930, 159925, 158049, 156815, 156282, 156126, 156337, 157182, 158514, 159777, 160743, 161682, 162763, 163824, 164667]
54319A64667M71o5l80N4Q24P52l53j147o71K49L61k46o65o98q02j092j332j468
54301A58459j486j172n84j84j00J11N54P02M54M86R93J167O54L24P63J106M92
54284A62739l16r4Q32J081K94n09m58K72R50R87L03n19o70j05L78K46j98n16o42
54265A64055m17L81J259J281N25J54O62J207J184J074J199J035M97M05Q73P95
54249A76169j35n66J95P30j38j164p18M22L63p99j355p73q7J36L44O01L51m05
54231A73171r80j049q60n54k23k00m74l76L11O20j24j019q88j25J41o2P2M49K98
54212A68128l46p73q55r09p95l44j92r37j861j824r07k4N58J030J017K06n63k98
54194A60311M94O46K81M13J023J141O21K52K58J76P3M42J038J178J042J269J545
$$ y = [164667, 165138, 165073, 164693, 164747, 165571, 166323, 165970, 164823, 164152, 164401, 164762, 164516, 163851, 163153, 162351, 161259, 159927, 158459, 156973, 155801, 155217, 155033, 154933, 155044, 155598, 156300, 156754, 157240, 158233, 159400, 160054, 160378, 161141, 162247, 162739, 162423, 162329, 163161, 164242, 164536, 164027, 163569, 163841, 164791, 165778, 166081, 165562, 164892, 164787, 165165, 165411, 165213, 164697, 164055, 163638, 164019, 165278, 166559, 167084, 167238, 167900, 169107, 170291, 171365, 172564, 173599, 174096, 174501, 175374, 176169, 176034, 175468, 175663, 176393, 176255, 175091, 174373, 174795, 175158, 174359, 173004, 172231, 172144, 172280, 172624, 173225, 173576, 173171, 172191, 171142, 170282, 169728, 169505, 169305, 168831, 168455, 168766, 169386, 169262, 168243, 167355, 167230, 167371, 167309, 167381, 167830, 168128, 167782, 167009, 166154, 165245, 164450, 164106, 163914, 162977, 161116, 159292, 158385, 158361, 158919, 159949, 160966, 161172, 160609, 160311, 160805, 161451, 161732, 162145, 163168, 164309, 164930, 165182, 165440, 165616, 165689, 166131, 167169, 168347, 169389, 170658, 172203]
54177A72203J011k9l01N37J516J821J464N81o22j440j341r16j011j261p98N3K45
54160A71712j63k59o3l76j049j141p29q30j430j344k99N43M85J64J46J14j30k17
54142A65134j82n72j247j294n33J34K42M23J161J980K275K002J277K59m40j86
54126A70433O84J288J500J788J899J127j14m76L63J240J360J267J671K510L541
54111A90081M712N653N857N565N438N297M398K931J880J293J97j568k959l523
54097B25252m024m855n266m815m136l683l038k079j536j660j569p34J05K07j9
54082A88150P2L28M27N24O83N99M56R79J994K080N51j254j613n16P13J153Q32
54065A96158K26%O76J893K518K021J081M53O2l04l08K24O78N25J22k1r6l43k93
$$ y = [172203, 173214, 173185, 172884, 173421, 174937, 176758, 178222, 178803, 178181, 176741, 175400, 174484, 173473, 172212, 171414, 171467, 171712, 171549, 171290, 171227, 170851, 169802, 168661, 167932, 167102, 165672, 164328, 164029, 164572, 165057, 165221, 165367, 165481, 165351, 165134, 164952, 164380, 163133, 161839, 161306, 161440, 161682, 162105, 163266, 165246, 167521, 169523, 170800, 171059, 170619, 170433, 171117, 172405, 173905, 175693, 177592, 178719, 178605, 178129, 178492, 179732, 181092, 182359, 184030, 186540, 190081, 194793, 200446, 206303, 211868, 217306, 222603, 227001, 229932, 231812, 233105, 233302, 231734, 228775, 225252, 221228, 216373, 211107, 206292, 202156, 198473, 195435, 193356, 191820, 190160, 188591, 187857, 187962, 188169, 188150, 188222, 188550, 188977, 189501, 190184, 190783, 191239, 192218, 194212, 196292, 196843, 195589, 193976, 193460, 194173, 195326, 196158, 196384, 196384, 197060, 198953, 201471, 203492, 204573, 205026, 205088, 204784, 204476, 204700, 205378, 205903, 206025, 206004, 205908, 205565, 205272]
54046B05272N32J640K212K282K501L006L328L315L445M106N061N719N748N369
54032B53536N027M870M682M466M633N228N452M673L499K958K872K103M42r13j008
54017C02520k81K49J45m80j401k270k754k965l299l787m159m494n086n682n642
54002B60614m934m165l602k954k223j872j997k094j848j461j122p81n35n24n49
53987B29953l93l74p96j214j054o23m84k98N68J720K315K576L233L844L469K788
53971B45230L509N572O952O631N677M771K802q94m705o572o448n730n197m638
53957B46960l735k405q71J15j09r30r41J16J028J087J031J500K039K294K811L820
53941B53810M514M423M271M600M787M313L732L473K925J752Q93J118J717J754
$$ y = [205272, 205804, 207444, 209656, 211938, 214439, 217445, 220773, 224088, 227533, 231639, 236700, 242419, 248167, 253536, 258563, 263433, 268115, 272581, 277214, 282442, 287894, 292567, 296066, 299024, 301896, 303999, 304441, 303528, 302520, 302239, 302488, 302633, 302153, 300752, 298482, 295728, 292763, 289464, 285677, 281518, 277024, 271938, 266256, 260614, 255680, 251515, 247913, 244959, 242736, 240864, 238867, 236773, 234925, 233464, 232342, 231561, 231026, 230502, 229953, 229560, 229186, 228390, 227176, 226122, 225499, 225015, 224717, 225285, 227005, 229320, 231896, 235129, 238973, 242442, 245230, 248739, 254311, 261263, 267894, 273571, 278342, 281144, 280250, 275545, 268973, 262525, 256795, 251598, 246960, 243225, 240820, 239949, 240064, 239955, 239025, 238084, 238200, 239228, 240315, 241346, 242846, 244885, 247179, 249990, 253810, 258324, 262747, 267018, 271618, 276405, 280718, 284450, 287923, 290848, 292600, 293493, 294611, 296328, 298082]
53927B98082J596K017K771L219L549M219M967N372N601N682N019L671L132M530
53913C53427O879Q334Q486Q153P688O834N713M731L720K314Q10k77j133k185l152
53898D10342l450l189k982l081l453m193n149n665n456n229n766o867p844q448
53884C39570q661q222p085n763m607l460k495k471l421m088l570k642k462k809
53870B77814k772k362k286k656l003l206l378l291k766k254k218k357k168j801
53856B41296j665j686j582j338r42l00J78k39j355k005j799j624j826j435j00
53841B23578P35Rj022o07Q20J540J170O71M52J80n7jj29q91j520j079j43P1k53
53822B23524j9P55J042O91N40Q11R46J042J772K897L276K620J922J924K320K595
$$ y = [298082, 299678, 301695, 304466, 307685, 311234, 315453, 320420, 325792, 331393, 337075, 342094, 345765, 348897, 353427, 360306, 368640, 377126, 385279, 392967, 399801, 405514, 410245, 413965, 416279, 417089, 416812, 415679, 413494, 410342, 406892, 403703, 400721, 397640, 394187, 389994, 384845, 379180, 373724, 368495, 362729, 355862, 348018, 339570, 330909, 322687, 315602, 309839, 305232, 301772, 299277, 296806, 293385, 289297, 285727, 283085, 280623, 277814, 275042, 272680, 270394, 267738, 264735, 261529, 258151, 254860, 252094, 249840, 247622, 245265, 243097, 241296, 239631, 237945, 236363, 235025, 234083, 233783, 233961, 233722, 232367, 230362, 228563, 226939, 225113, 223678, 223578, 224313, 224322, 223300, 222693, 223513, 225053, 226223, 226894, 227346, 227526, 227469, 227468, 227339, 226448, 224928, 223849, 223706, 223777, 223524, 223505, 224260, 225302, 225993, 226533, 227344, 228290, 229332, 231104, 234001, 237277, 239897, 241819, 243743, 246063, 248658]
53806B48658K636K402J985J975K908M346N339N642N620N360M843M568M893N105
53792C06280M311K950K210K272K315K059J933J953J704J297J105O82o47k318l060
53777C25046k889l112m270n409n727n519n235m810m298m120m221l990l324k893
53763B65229l033l274l214l018k773k204j304n78l98o51j061j347j171n68k28
53748B40407o63j284j142l05L42M47L81K72q8m33j15Q44J667J747J111N9r13j138
53730B41196m56L98P84J010J453J552Q31J25M55J223J156N20O56J530J720R03
53714B55056M86J315K453K842K713K719K860K971L235L589L564L097K705K529
53700B92134K156J652J761K761L989M780N075M920M318L695L652M013L949L147
$$ y = [248658, 251294, 253696, 255681, 257656, 260564, 264910, 270249, 275891, 281511, 286871, 291714, 296282, 301175, 306280, 310591, 313541, 315751, 318023, 320338, 322397, 324330, 326283, 327987, 329284, 330389, 331071, 330424, 328106, 325046, 322157, 319045, 314775, 309366, 303639, 298120, 292885, 288075, 283777, 279657, 275436, 271446, 268122, 265229, 262196, 258922, 255708, 252690, 249917, 247713, 246409, 245831, 245433, 244782, 243721, 242374, 241203, 240635, 240407, 239744, 238460, 237318, 237013, 237355, 237802, 238183, 238455, 238367, 237934, 237819, 238663, 240330, 242077, 243188, 243247, 242334, 241196, 240740, 241138, 241922, 242932, 244385, 245937, 246768, 246893, 247348, 248571, 249727, 250247, 250903, 252433, 254153, 255056, 255542, 256857, 259310, 262152, 264865, 267584, 270444, 273415, 276650, 280239, 283803, 286900, 289605, 292134, 294290, 295942, 297703, 300464, 304453, 309233, 314308, 319228, 323546, 327241, 330893, 334906, 338855, 342002]
53686C42002K023Q35m23j362j499j194j204j458j483j743k962m242l672j216Q46
53671C23248Q88j92p91o74l80l9K59L1o81r79n26k57q88j688j667j009m22O3O53
53652C14949R06L36o02j057q81m85k4N97J287J933K595L122L075K458J992K188
53636C32389K665K811K703K832L369M034M359L866K511J056M82Q04J165J138J217
53621C67401J763K374K635K716K828K804K638K710L100L340L245L262L665M020
53607D08501L922L618L468L374L080K508J664P33L36R17J813J819Q68J59K74L10
53591D37364o05j932k577k362j900j592j466j564j896k262k459k438k158j730
53577D10423j638k173k702k381j512j203j590j567n98L60L50k30m53j57L03Q91
$$ y = [342002, 344025, 344860, 344437, 343075, 341576, 340382, 339178, 337720, 336237, 334494, 331532, 327290, 323618, 322402, 323248, 324136, 323944, 323153, 322479, 322099, 322060, 322319, 322350, 321669, 320690, 320164, 319907, 319019, 317331, 315664, 314655, 314233, 314296, 314949, 315855, 316191, 315589, 314532, 313651, 313166, 313142, 313739, 315026, 316959, 319554, 322676, 325751, 328209, 330201, 332389, 335054, 337865, 340568, 343400, 346769, 350803, 355162, 359028, 361539, 362595, 363077, 363881, 365046, 366184, 367401, 369164, 371538, 374173, 376889, 379717, 382521, 385159, 387869, 390969, 394309, 397554, 400816, 404481, 408501, 412423, 416041, 419509, 422883, 425963, 428471, 430135, 430868, 431204, 432121, 433934, 435753, 436621, 436780, 437054, 437364, 436759, 434827, 432250, 429888, 427988, 426396, 424930, 423366, 421470, 419208, 416749, 414311, 412153, 410423, 408785, 406612, 403910, 401529, 400017, 398814, 397224, 395657, 395059, 395419, 395769, 395539, 395086, 394929, 395232, 396123]
53561C96123J671K304K335J722P60j85o89n11N8N78J138J946K527K229J474J322
53545D14802J876K256K238K559L408M037M250M844O035O880O866O793P349Q103
53531D82296Q640R390J0568J1498J1906J2542J3672J4216J3517J2713J3105J4279
53519F28342J5102J5633J6585J7765J8511J9116K0428K2365K4055K5161K6077
53508H49140K6963K7616K8052K8451K8738K8770K8676K8468K7786K6512K5132
53497A154304K3985K2828K1526K0436J9681J8903J8175J8178J8859J9113J8496
53486A374484J8036J8516J9165J9175J9182J9891K0405J9517J7708J6210J4830
53475A577119J2447R129N955L128rl243n517o798q364j0946j3823j6017j7330
$$ y = [396123, 397794, 400098, 402433, 404155, 404915, 404730, 404041, 403530, 403588, 404166, 405304, 407250, 409777, 412006, 413480, 414802, 416678, 418934, 421172, 423731, 427139, 431176, 435426, 440270, 446305, 453185, 460051, 466844, 474193, 482296, 490936, 500326, 510894, 522392, 534298, 546840, 560512, 574728, 588245, 600958, 614063, 628342, 643444, 659077, 675662, 693427, 711938, 731054, 751482, 773847, 797902, 823063, 849140, 876103, 903719, 931771, 960222, 988960, 1017730, 1046406, 1074874, 1102660, 1129172, 1154304, 1178289, 1201117, 1222643, 1243079, 1262760, 1281663, 1299838, 1318016, 1336875, 1355988, 1374484, 1392520, 1411036, 1430201, 1449376, 1468558, 1488449, 1508854, 1528371, 1546079, 1562289, 1577119, 1589566, 1598695, 1604650, 1607778, 1607769, 1604526, 1599009, 1592211, 1583847, 1572901, 1559078, 1543061, 1525731]
53462A525731j7899j7773j7242j6877j7020j7737j9117k0963k2476k3068k3162
53451A312397k3449k3642k3040k1925k1242k1016k0341j8928j7495j6404j5027
53440A089888j2861j0304p935n802l832k288j327o08K74J271K163L068M414O406
53426A062527Q661J0437J1404J2145J3560J5705J7709J8977J9868K0965K2315
53415A234273K3796K5554K7499K9081L0193L1651L4057L6765L8757M0084M1579
53404A593289M3565M5713M7823M9865N1585N2804N3986N5667N7629N9213O0230
53393B171369O0906O1203O0948O0339N9658N8792N7606N6430N5449N4014N1368
53382B808082M7750M4064M0711L7372L3699K9479K4477J8852J3373Q501L654j948
$$ y = [1525731, 1507832, 1490059, 1472817, 1455940, 1438920, 1421183, 1402066, 1381103, 1358627, 1335559, 1312397, 1288948, 1265306, 1242266, 1220341, 1199099, 1178083, 1157742, 1138814, 1121319, 1104915, 1089888, 1077027, 1066723, 1058788, 1052986, 1049154, 1046866, 1045539, 1044931, 1045205, 1046476, 1048639, 1051707, 1056121, 1062527, 1071188, 1081625, 1093029, 1105174, 1118734, 1134439, 1152148, 1171125, 1190993, 1211958, 1234273, 1258069, 1283623, 1311122, 1340203, 1370396, 1402047, 1436104, 1472869, 1511626, 1551710, 1593289, 1636854, 1682567, 1730390, 1780255, 1831840, 1884644, 1938630, 1994297, 2051926, 2111139, 2171369, 2232275, 2293478, 2354426, 2414765, 2474423, 2533215, 2590821, 2647251, 2702700, 2756714, 2808082, 2855832, 2899896, 2940607, 2977979, 3011678, 3041157, 3065634, 3084486, 3097859, 3106360, 3110014, 3108066]
53370C108066q093j4139k0322k7415l5280m2731m8875n3777n7773o0831o2702
53359B676128o3259o2764o2059o2062o2638o2472o0618n7637n4608n1777m9029
53348B027205m6964m6265m6426m6250m5397m4413m3396m1786l9405l6765l4264
53337A555874l1889k9627k7465k5091k2290j9493j7252j5428j3635j2149j1562
53326A329993j1829j2371j2938j3540j3884j3685j3225j2774j1911j0255q415
53315A195166p140n976l926j180J033K152K716L209L687M486O148Q504J0814J2862
53301A232555J4973J7067J8696K0075K1910K4132K5861K6862K7937K9636L1382
53290A491086L2315L2196L1202K9495K7286K4872K2435K0097J8090J6411J4504
$$ y = [3108066, 3099973, 3085834, 3065512, 3038097, 3002817, 2960086, 2911211, 2857434, 2799661, 2738830, 2676128, 2612869, 2550105, 2488046, 2425984, 2363346, 2300874, 2240256, 2182619, 2128011, 2076234, 2027205, 1980241, 1933976, 1887550, 1841300, 1795903, 1751490, 1708094, 1666308, 1626903, 1590138, 1555874, 1523985, 1494358, 1466893, 1441802, 1419512, 1400019, 1382767, 1367339, 1353704, 1341555, 1329993, 1318164, 1305793, 1292855, 1279315, 1265431, 1251746, 1238521, 1225747, 1213836, 1203581, 1195166, 1188026, 1182050, 1178124, 1176944, 1177977, 1180129, 1182845, 1186054, 1189741, 1194227, 1200375, 1208879, 1219693, 1232555, 1247528, 1264595, 1283291, 1303366, 1325276, 1349408, 1375269, 1402131, 1430068, 1459704, 1491086, 1523401, 1555597, 1586799, 1616294, 1643580, 1668452, 1690887, 1710984, 1729074, 1745485, 1759989]
53279A759989J1818Q456M778P80l524p597j0983j3978j6868j9133k0387k1503
53267A671848k3573k6188k8032k8893k9699l0801l1637l2077l2701l3555l3977
53256A340715l3822l3665l3638l3202l2225l1212l0271k9053k7859k7563k8128
53245A000077k8367k7574k6341k5365k4464k3327k2212k1375k0485j9123j7385
53234G44059j5651j4192j3137j2319j1203r502p770o772o509o563p025q172r555
53221F15689j0432j0880j1448j1983j1988j1858j2393j3226j3122j1888j0640
53210D85831j0030r529q719p928p376o807o217n916n751n387n249n995p135p562
53196C86230p384p619q093p501n811m707n050n612n163m207l810l995m206m152
$$ y = [1759989, 1771807, 1780263, 1785041, 1785821, 1782297, 1774700, 1763717, 1749739, 1732871, 1713738, 1693351, 1671848, 1648275, 1622087, 1594055, 1565162, 1535463, 1504662, 1473025, 1440948, 1408247, 1374692, 1340715, 1306893, 1273228, 1239590, 1206388, 1174163, 1142951, 1112680, 1083627, 1055768, 1028205, 1000077, 971710, 944136, 917795, 892430, 867966, 844639, 822427, 801052, 780567, 761444, 744059, 728408, 714216, 701079, 688760, 677557, 668055, 660285, 653513, 647004, 640441, 633416, 625244, 615689, 605257, 594377, 582929, 570946, 558958, 547100, 534707, 521481, 508359, 496471, 485831, 475801, 466272, 457553, 449625, 442249, 435442, 429225, 423309, 417558, 412171, 406922, 400927, 393792, 386230, 378846, 371227, 363134, 355633, 349822, 345115, 340065, 334453, 329290, 325083, 321273, 317278, 313072, 308920]
53182C08920l613k467j459j616k483k382r65J11k75j150j363j254j346r81K76
53167B87953J272Q49k62o64m25m83p65n20K4j07j010j759j789j427j170j266j781
53150B76670k437k564j843p77n0J99J20k09n77o69o37q85j107n10P00J312R48
53133B67684P09J254J689J210N24N16P11M01J37P38J666J865J451J228J137P18
53117B83638M88J338K863L726L519L018K727K367J785J174M38p27k008k683k665
53102B98998k514k428k027j217n51n75j251k104k594k447j885j362r66m58j5k06
53086B76398r60j392j118r12j407k073k175j980j986j756o25R05J612J142K70
53071B63943k34k07J27L32k6p60j086p98o96j242j592r08J30K96k96n13l2M00
$$ y = [308920, 305307, 302840, 301381, 299765, 297282, 294900, 293935, 294046, 293771, 292621, 291258, 290004, 288658, 287677, 287953, 289225, 290074, 289812, 289148, 288723, 288240, 287475, 286955, 286979, 286872, 285862, 284103, 282314, 280887, 279717, 278451, 276670, 274233, 271669, 269826, 269049, 268999, 269198, 269318, 269109, 268532, 267863, 267226, 266341, 265234, 264724, 265424, 266736, 267684, 268393, 269647, 271336, 272546, 273070, 273586, 274297, 274698, 274835, 275573, 277239, 279104, 280555, 281783, 282920, 283638, 284126, 285464, 288327, 292053, 295572, 298590, 301317, 303684, 305469, 306643, 307081, 306354, 304346, 301663, 298998, 296484, 294056, 292029, 290812, 290261, 289686, 288435, 286331, 283737, 281290, 279405, 278043, 277077, 276619, 276604, 276398, 275438, 274046, 272928, 272016, 270609, 268536, 266361, 264381, 262395, 260639, 260014, 260919, 262531, 263673, 263943, 263709, 263502, 263629, 263961, 263935, 263175, 262089, 261291, 260595, 259353, 257761, 256853, 256983, 257279, 256983, 256470, 256438, 256838]
53053B56838L82L23N33Q28J067J294J392J302J363J728J767Q66m97j348j567j738
53037B64533j918j638r70n06l36M0O49Q85M79j42n78q56r51p00k41P5L14Q92J704
53018B60735J951J073n28j787j805n60R72J570J062M94O85J092O74n18j471j622
53002B62017j312q97k51P12J635K081J913J263L53n53j270j678j542o60P16J976
52986B64503K762L102K933K190J396J269J479Q78n85j385o23N04N44jK86J302
52970B80554J707J159O73P78Q55M66Q4J76N25Q23J121J465J692J743J656J210
52954B96687K06r90j741j929j943k020k152k391k729k862k626k417k502k388j521
52939B66682l60J32j76n46m99k17L3J84J66M1J54N77P49K16n72r02p87o23k79
$$ y = [256838, 257220, 257543, 258076, 258904, 259971, 261265, 262657, 263959, 265322, 267050, 268817, 269683, 269186, 267838, 266271, 264533, 262615, 260977, 260007, 259501, 259165, 259205, 259854, 260739, 261218, 261076, 260498, 259642, 258691, 257991, 257750, 257825, 258139, 259031, 260735, 262686, 263759, 263231, 261444, 259639, 259079, 260051, 261621, 262683, 263177, 263862, 264954, 265628, 265110, 263639, 262017, 260705, 259808, 259557, 260269, 261904, 263985, 265898, 267161, 267514, 266961, 265691, 264013, 262471, 261811, 262527, 264503, 267265, 270367, 273300, 275490, 276886, 278155, 279634, 280512, 279927, 278542, 277919, 278423, 278967, 278966, 279252, 280554, 282261, 283420, 284093, 284871, 285726, 286192, 286276, 286452, 286977, 287800, 288921, 290386, 292078, 293821, 295477, 296687, 296893, 295903, 294162, 292233, 290290, 288270, 286118, 283727, 280998, 278136, 275510, 273093, 270591, 268203, 266682, 266322, 266454, 266278, 265732, 265233, 265016, 265049, 265233, 265399, 265440, 265594, 266171, 266920, 267136, 266564, 265662, 264875, 264252, 263973]
52920B63973N15J310J357O98nm68p97q13k98L70O26N67N65M23j78p65p02l52n63
52901B65463j202j378r32n55m41k9Q20J474J512J181P44K55m2J23M39M28K80M66
52883B68606O81J76r43j780j906j547o56R75K726L447K925K094J657J510J581
52868B79546K101K813K998K554K125J905J326J71r27j413j469j452j452j554j870
52853B85402k177k154j996k054k089j742j510k176l374l849l209k276j717j440
52839B53639j417j859k359k085j053j43L16P68J164Q25j22n39M0P71J040J322
52823B50308J934K203J639Q27L92J03l58o89p42r98j580j711r41mL71N43J113
52806B52410J766J892J711J791K022J827J084K04m44p05o82q77j783k981l391
$$ y = [263973, 264488, 265798, 267155, 267853, 267848, 267380, 266583, 265770, 265472, 265842, 266468, 267035, 267600, 268023, 267845, 267080, 266378, 266026, 265463, 264261, 262883, 261951, 261396, 260955, 260926, 261746, 263220, 264732, 265913, 266657, 266912, 266870, 266993, 267432, 267860, 268140, 268606, 269287, 269463, 268520, 266740, 264834, 263287, 262631, 263606, 266332, 269779, 272704, 274798, 276455, 277965, 279546, 281647, 284460, 287458, 290012, 292137, 294042, 295368, 295539, 294612, 293199, 291730, 290278, 288826, 287272, 285402, 283225, 281071, 279075, 277021, 274932, 273190, 271680, 269504, 266130, 262281, 259072, 256796, 255079, 253639, 252222, 250363, 248004, 245919, 244866, 244723, 245039, 245807, 246971, 247796, 247674, 247135, 247175, 247946, 248986, 250308, 252242, 254445, 256084, 256911, 257303, 257406, 257048, 256359, 255617, 254619, 253039, 251328, 250387, 250383, 250754, 251297, 252410, 254176, 256068, 257779, 259570, 261592, 263419, 264503, 264707, 264263, 263558, 262876, 261999, 260216, 257235, 253844]
52791B53844k698j739j161n70M10J237J314R36O24L02j50k43L40R55Q48K93K5
52774B54567Q5M0p4Q1L68L52N5j66l25p29j350j801j803j306m12N09R23Q12Q60
52755B50686J530K372K634K284J852J590J287P20q3q02q74O8J477K119J477M94
52739B68831L86J094J563J296Q86J030J631K051J926J416Q26K31l83p51n15J86
52723B81704O20L26l13p53j071j537j801j323l77K47L63L95L35k34j102j375p41
52706B73363J06N20N57M06j5n71p87n20q8L20O77O06k36j234j312m76J84K23K96
52687B72019P23Q62M44K17N74P38R4p13r00p76j010j432j479j123o53j01M35N82
52669B68501L99N29J173J645J503J232J225J029M08O6M43P53K50l75l8J009J708
$$ y = [253844, 251146, 249407, 248246, 247676, 248086, 249323, 250637, 251573, 252197, 252499, 252349, 252106, 252446, 253401, 254249, 254542, 254567, 254652, 254692, 254618, 254699, 255067, 255419, 255474, 255308, 254983, 254254, 252904, 251103, 249300, 247994, 247582, 248091, 249014, 249826, 250686, 252216, 254588, 257222, 259506, 261358, 262948, 264235, 264955, 264872, 264070, 263196, 263264, 264741, 266860, 268337, 268831, 269217, 270311, 271874, 273170, 274056, 275086, 276717, 278768, 280694, 282110, 282936, 283167, 282784, 282033, 281518, 281704, 282324, 282650, 282337, 281584, 280513, 278976, 277175, 275852, 275475, 275722, 276085, 276480, 276815, 276581, 275479, 274104, 273363, 273469, 273989, 274546, 274952, 274937, 274366, 273579, 273059, 272971, 273291, 273968, 274574, 274338, 273104, 271792, 271316, 271500, 271723, 272019, 272742, 273604, 274048, 274265, 274839, 275577, 275671, 274958, 274058, 273282, 272272, 270840, 269361, 268238, 267585, 267484, 267919, 268501, 268900, 269429, 270602, 272247, 273750, 274982, 276207, 277236, 277644, 277710, 278153, 278906, 279156, 278781, 278743, 279752, 281460]
52652B81460J894K240K851L073K609J829J033J65p61j530j930j739q40K65N86
52637B91205j82j097j150m74J59N07Q58J407K252L562N200O597P491Q100Q227
52622C32662O938L844n0l470o088p922q457p394n581m117l042j845p34l71p34
52607B93639j219j565j768j525o80Q6J9n48o45q4M35M68K60J73L14N96P23L54
52589B89033k90m66l8J68l49q35m44M77J118J532K140K557K106J143O73Q38Q26
52572C00189J74p43j411j571j104k38L28J60l23n34n40o04n14j34M9k55l74L14
52554B92869J171J140K77n71j100j459j387o61O9O3k36O1P15Q28M84M90O95J04
52536B93552j249k061j631p57m10n52o02k70L71R97J232J150J431K292K831K211
$$ y = [281460, 283354, 285594, 288445, 291518, 294127, 295956, 296989, 297154, 296393, 294863, 292933, 291194, 290354, 290619, 291205, 291023, 289926, 288776, 288302, 288461, 288968, 289826, 291233, 293485, 297047, 302247, 308844, 316335, 324435, 332662, 339600, 343444, 343394, 339924, 333836, 325914, 317457, 310063, 304482, 300365, 297323, 295478, 294744, 294373, 293639, 292420, 290855, 289087, 287562, 286882, 286968, 286987, 286439, 285794, 285710, 286145, 286613, 286873, 287046, 287360, 287956, 288679, 289033, 288743, 288277, 288239, 288407, 288058, 287223, 286779, 287256, 288374, 289906, 292046, 294603, 296709, 297852, 298525, 299363, 300189, 300363, 299620, 298209, 296638, 295534, 295296, 295624, 295784, 295461, 294927, 294387, 293783, 293269, 293135, 293184, 292929, 292555, 292869, 294040, 295180, 295457, 294886, 293786, 292327, 290940, 290279, 290348, 290411, 290175, 290236, 290951, 291779, 292263, 292753, 293448, 293552, 292303, 290242, 288611, 287854, 287444, 286892, 286290, 286020, 286391, 287388, 288620, 289770, 291201, 293493, 296324, 298535]
52520B98535J054N58P11O41L15M91J185J633J768K270L089L376L085L318M582
52505C26611N889N990M588K128o83k953m153m754n432n831n133l741k964k942
52491C06620k438r88K57L88N6J41L79R8n34r09q87o12m3O83J049P62J76k70m59
52472C03469l19K42R32J305J521K134K985L283K971K989L837M878N457N709N736
52457C47129M956L061Q39p85j897l121m412n099m850m118l648l815m256m199l372
52442C12413k496k378k768k685j786o08L55R81J017K73p08j099r92j130j466j207
52426B95716l52J48R2M57J578K235J456J05k81N32J580K132K262K409K945L802
52410C16816M268L763K934L142M635O299P539R092J1366J3174J3036J0777P013
$$ y = [298535, 299589, 300147, 300858, 301499, 301814, 302305, 303490, 305123, 306891, 309161, 312250, 315626, 318711, 322029, 326611, 332500, 338490, 343078, 345206, 344523, 341570, 337417, 332663, 327231, 321400, 316267, 312526, 309562, 306620, 304182, 303194, 303451, 303839, 303895, 304036, 304415, 304513, 303979, 303070, 302183, 301571, 301528, 302211, 303260, 304022, 304198, 303928, 303469, 303150, 303392, 304324, 305629, 307150, 309284, 312269, 315552, 318523, 321512, 325349, 330227, 335684, 341393, 347129, 352085, 355146, 355985, 355200, 353303, 350182, 345770, 340671, 335821, 331703, 328055, 324240, 319984, 315785, 312413, 309917, 307539, 304771, 302086, 300300, 299692, 300047, 301028, 302045, 302318, 301610, 300511, 299519, 298389, 296923, 295716, 295364, 295512, 295604, 296061, 297639, 299874, 301330, 301435, 301154, 301686, 303266, 305398, 307660, 310069, 313014, 316816, 321084, 324847, 327781, 330923, 335558, 341857, 349396, 358488, 369854, 383028, 396064, 406841, 413854]
52397D13854K149l063p014q653q780q736q480p191n177l727l195k672j616o22
52383C47077k99l73k88J0K58L65M31N87J017J853K935L874M428M709N015N529
52367C77128O028N940M941L460K233J360L12j031k029k202j935j857j987j965
52353C88396j647j092l25M70R17R42R60J299J790K201K578K846K652K026J711
52338D05724K328L611M858N787O477O926P239P883R239J1031J2601J3552J3969
52325E11225J4261J5089J6917J9316K1159K1835K1839K1743K1230J9795J7899
52314G22308J6662J6497J6724J6530J5812J5074J4819J5157J5794J6303J6462
52303H98142J6243J5645J4809J4111J3709J3106J1790J0167R053Q213O348K878
$$ y = [413854, 416003, 412940, 405926, 397273, 388493, 379757, 371277, 364086, 358909, 355182, 351987, 349315, 347699, 347077, 346778, 346405, 346117, 346127, 346385, 346750, 347181, 347768, 348785, 350638, 353573, 357447, 361875, 366584, 371599, 377128, 383156, 389096, 394037, 397497, 399730, 401090, 401402, 400371, 398342, 396140, 394205, 392348, 390361, 388396, 386749, 385657, 385332, 385802, 386719, 387661, 388621, 389920, 391710, 393911, 396489, 399335, 401987, 404013, 405724, 408052, 411663, 416521, 422308, 428785, 435711, 442950, 450833, 460072, 471103, 483704, 497256, 511225, 525486, 540575, 557492, 576808, 597967, 619802, 641641, 663384, 684614, 704409, 722308, 738970, 755467, 772191, 788721, 804533, 819607, 834426, 849583, 865377, 881680, 898142, 914385, 930030, 944839, 958950, 972659, 985765, 997555, 1007722, 1016775, 1024988, 1031336, 1034214]
52291A034214j151m418o712q416r478r772r783r988j0022r253p968p006o478n665
52277I28104m156k303n16J249L114M939O562Q014R365J0536J1398J1945J2326
52264A000577J2727J3170J3404J3232J2889J2837J3174J3563J3805J4017J4195
52253A147590J4079J3581J2941J2206J1041R188O757L927Q80j945m099n839p977
52240A212330j0652j2929j3978j4114j4193j4497j4663j4407j3760j2891j2024
52229A064222j1371j0868j0293r698r364r172q551p220n589m182l192k678k595
52216I69449k498j726k51J255K320L085L703M059M291M829N653O172O092N667
52202A012100M981L902K916K909L726M107L533K997L360M090M505N030O169P253
$$ y = [1034214, 1033063, 1028645, 1021933, 1013517, 1004039, 994267, 984484, 974496, 964474, 955221, 947253, 940247, 933769, 928104, 923948, 921645, 921129, 922378, 925492, 930431, 936993, 945007, 954372, 964908, 976306, 988251, 1000577, 1013304, 1026474, 1039878, 1053110, 1065999, 1078836, 1092010, 1105573, 1119378, 1133395, 1147590, 1161669, 1175250, 1188191, 1200397, 1211438, 1220626, 1227383, 1231310, 1232190, 1230245, 1226146, 1220307, 1212330, 1201678, 1188749, 1174771, 1160657, 1146464, 1131967, 1117304, 1102897, 1089137, 1076246, 1064222, 1052851, 1041983, 1031690, 1021992, 1012628, 1003456, 994905, 987685, 982096, 977914, 974722, 972044, 969449, 966951, 965225, 964974, 966229, 968549, 971634, 975337, 979396, 983687, 988516, 994169, 1000341, 1006433, 1012100, 1017081, 1020983, 1023899, 1026808, 1030534, 1034641, 1038174, 1041171, 1044531, 1048621, 1053126, 1058156, 1064325, 1071578]
52188A071578P393O899O601O394N621M295K839J135j077l306m961o398q258j0113
52174A078642j0977j0820j0504j0371r957q933p385n349k981r82Q2P16J853L430
52160A006464M595N088N443N850N885N347M516L490K096M62r59j900k216j604
52146A042557j81R96R77K52J40R64J934K584L183L644L299K122J124J094J807
52131A066496K816M228O248Q616J1061J3714J6706J9696K2200K4094K5647K7247
52119A248769K9113L0951L2013L1857L0913K9809K8429K6300K3692K1448J9672
52108A552966J7447J4075R996O200L293J385L36j91n79r43j216j495k037k911
52094A596326l991n233o602p953r362j1343j4152j7142j9368k0692k1580k1976
$$ y = [1071578, 1078971, 1085870, 1092471, 1098865, 1104486, 1108781, 1111620, 1112755, 1111678, 1108372, 1103411, 1097013, 1088755, 1078642, 1067665, 1056845, 1046341, 1035970, 1026013, 1017080, 1009695, 1004346, 1001365, 1000383, 1000465, 1001181, 1003034, 1006464, 1011059, 1016147, 1021590, 1027440, 1033325, 1038672, 1043188, 1046678, 1048774, 1049236, 1048277, 1046377, 1044161, 1042557, 1042376, 1043372, 1044349, 1044601, 1044741, 1045705, 1047639, 1050223, 1053406, 1057050, 1060349, 1062471, 1063595, 1064689, 1066496, 1069312, 1073540, 1079788, 1088404, 1099465, 1113179, 1129885, 1149581, 1171781, 1195875, 1221522, 1248769, 1277882, 1308833, 1340846, 1372703, 1403616, 1433425, 1461854, 1488154, 1511846, 1533294, 1552966, 1570413, 1584488, 1594484, 1600684, 1603977, 1605362, 1605698, 1605507, 1604928, 1603985, 1602769, 1601274, 1599237, 1596326, 1592335, 1587102, 1580500, 1572547, 1563185, 1551842, 1537690, 1520548, 1501180, 1480488, 1458908, 1436932]
52082A436932k1210j9044j6064j2956r964p186m763k687r19L61J161K268M641
52069A350570Q091J1340J3455J4626J5385J5858J6052J6132J6067J5486J4285
52058A507347J2921J1817J0881R926R027Q247P368O253N105M041K688N31k500
52045A593652n977r367j2372j5065j7777k0676k3375k5165k5643k5019k3847k2626
52033A366743k1513k0291j8627j6555j4502j2800j1422j0396j0000j0212j0415
52022A210010j0146r754r745r906r795r687j0179j0979j1033j0021q871q525q861
52009A082508r168r206r383j0139j1457j2932j4159j5161j6289j7648j8759j9018
51997I19189j8277j6859j5285j4131j3657j3238j1735q898n977m364m161m661
$$ y = [1436932, 1415722, 1396678, 1380614, 1367658, 1357694, 1350508, 1345745, 1343058, 1342139, 1342500, 1343661, 1345929, 1350570, 1358661, 1370001, 1383456, 1398082, 1413467, 1429325, 1445377, 1461509, 1477576, 1493062, 1507347, 1520268, 1532085, 1542966, 1552892, 1561919, 1570166, 1577534, 1583787, 1588892, 1592933, 1595621, 1596152, 1593652, 1587675, 1578308, 1565936, 1550871, 1533094, 1512418, 1489043, 1463878, 1438235, 1413216, 1389369, 1366743, 1345230, 1324939, 1306312, 1289757, 1275255, 1262455, 1251033, 1240637, 1230637, 1220425, 1210010, 1199864, 1190110, 1180365, 1170459, 1160664, 1150977, 1140798, 1129819, 1118786, 1108765, 1099894, 1091369, 1082508, 1073340, 1064134, 1054751, 1044612, 1033155, 1020223, 1006064, 990903, 974614, 956966, 938207, 919189, 900912, 884053, 868768, 854637, 840980, 827742, 816007, 807109, 801132, 796768, 792607, 787946]
51985G87946n660p328r242j0542j1089j1519j2149j2626j2691j2624j2739j3013
51973F56724j3249j3166j2427j1037r515q234o822m815k513n40J205L311N813
51960E84735Q129R819J0680J0360Q810O904N616M733L323J311m39j512k211k358
51946F47900j079J865N542R012J2168J5085J7390J8760J9285J8945J7304J4172
51934G96349J0157O225L074Q68q38k900n754q867j1555j3960j6490j8706j9895
51921G17708k0493k1617k3125k3570k2269k0143j8067j5823j3229j1095j0111
51910E18166r753r088p930o462m520k054L61K190L636N043O266P136P974Q903
51896E19868R312Q669P288N563L006r83n777r829j2226j3160j3022j1882r991
$$ y = [787946, 782286, 774958, 765716, 755174, 744085, 732566, 720417, 707791, 695100, 682476, 669737, 656724, 643475, 630309, 617882, 606845, 597330, 589096, 582274, 577459, 574946, 574406, 575611, 578922, 584735, 592864, 602683, 613363, 623723, 632533, 639437, 645053, 649786, 653109, 654420, 653981, 652469, 650258, 647900, 646821, 648686, 654228, 663240, 675408, 690493, 707883, 726643, 745928, 764873, 782177, 796349, 806506, 812731, 815805, 816673, 815835, 812935, 807181, 798314, 786759, 772799, 756309, 737603, 717708, 697215, 675598, 652473, 628903, 606634, 586491, 568424, 552601, 539372, 528277, 518166, 508413, 499325, 491395, 484933, 480413, 478359, 478720, 480910, 484546, 489589, 495855, 502991, 510965, 519868, 529180, 537849, 545137, 550700, 553706, 552723, 546946, 537117, 524891, 511731, 498709, 486827, 476836]
51883D76836q018o387m801k770m61J376K359K994M062N615P025P931Q605R144
51869E03510Q978P671N665L681J821m0j525k309l000m397o102o858o145m445k098
51854D94407R30M091O241O954O890O618N961M703L000Q84j720m292n964o703p333
51839E14667q214q872r056r074q862p907o431n375m844l793j799J17J088J545
51825D43190K030K086J335N32M10L76n33k026l014l112k740k201j561j067q50
51810D32855n04L52J382J981K015J687J145O25M63N36L10j65o2R65K077K364J913
51793D49939J188K72p14j279j394j782k632k966k110q85l34j75L53R11O54k19
51777D38827p69q19r45j280j438j315r72m8J635L256L932M217N464P814R961J0885
$$ y = [476836, 468818, 462431, 457630, 454860, 454399, 455775, 458134, 461128, 465190, 470805, 477830, 485761, 494366, 503510, 512488, 520159, 525824, 529505, 531326, 531286, 529761, 527452, 524452, 520055, 513953, 507095, 500950, 496505, 494407, 495337, 499428, 505669, 512623, 519513, 526131, 532092, 536795, 539795, 540679, 538959, 534667, 528703, 522000, 514667, 506453, 497581, 488525, 479451, 470589, 462682, 456251, 450876, 446032, 442239, 440440, 440557, 441645, 443190, 445220, 447306, 448641, 449173, 449583, 449959, 449426, 447400, 444386, 441274, 438534, 436333, 434772, 433705, 432855, 432351, 432703, 434085, 436066, 438081, 439768, 440913, 441538, 442001, 442537, 442847, 442682, 442620, 443585, 445662, 448026, 449939, 451127, 451399, 450685, 449406, 448012, 446230, 443598, 440632, 438522, 437637, 437303, 437128, 437481, 438392, 439046, 438827, 438058, 437239, 436294, 435014, 433576, 432261, 431289, 431241, 432876, 436132, 440064, 444281, 449745, 457559, 467520, 478405]
51761D78405J0749J0006Q773P208N597L782J302j712m502o739q822j0897j2302
51748D80848j2344j1163r493p922o646n648m811m026l162k012m01J542L452N179
51734D23393O900Q620R926J0438J0071Q749O444L737J720Q78P13Q41J640L141
51720D97211M128L246O07k531n225p090p624o447m169k108j029p75j098k090l638
51705D61368n024n348m196j898P51L116N069O460O522M551J313j268k159k091
51691D67166j961j474k25R93J098K88m41q45j404k175k733k959l007k712j930
51676D47679j086n11K73J778L399M118M004L828L601K719J519J432L339O656J0054
51661D92802J2322J2513J0289O349J913k244n763q042q477p331n427l077RL683
$$ y = [478405, 489154, 499160, 507933, 515141, 520738, 524520, 525822, 524110, 519608, 512869, 504047, 493150, 480848, 468504, 457341, 447848, 439926, 433280, 427632, 422821, 418795, 415633, 413621, 413220, 414762, 418214, 423393, 430293, 438913, 448839, 459277, 469348, 478097, 484541, 488278, 489998, 490876, 491589, 492430, 494070, 497211, 501339, 504585, 505192, 502661, 497436, 490346, 482722, 476275, 472106, 469998, 468969, 468194, 467096, 465006, 461368, 456344, 450996, 446800, 444902, 445653, 448769, 453838, 460298, 466820, 471371, 472684, 471416, 469257, 467166, 465205, 463731, 463506, 464499, 465597, 465885, 465444, 464599, 463195, 461020, 458287, 455328, 452321, 449609, 447679, 446593, 446082, 446355, 448133, 451532, 455650, 459654, 463482, 467083, 469802, 471321, 472753, 476092, 482748, 492802, 505124, 517637, 527926, 534275, 536188, 533944, 528181, 520139, 511662, 504331, 498904, 495827, 495836, 499519]
51647D99519P052R106R137O816K739j363l917n000n776o749p426p555p541p598
51633D81444p488p300p487p976q023p229n922m439k799j251l27j64l86q40j724
51618D18089k898l732l817l283k348j211l51k85q44j353j525j574j487q97J34
51603C92618R89J309J412J730K366L252M275N179N915P022R121J1947J4337J5174
51589D76646J3918J0523N545K69l939o544p770p862o959n442l749j923Q0J961
51575D64754L539N326P828J0551J2526J3534J4074J4405J4643J5456J7454J9854
51563F13944K0875J9797J7840J6818J7714K0525K4665K9184L3221L6402L8430
51552H89415L8451L5502K9405K0782J0535l3r126j5674k0385k4654k8609l1248
$$ y = [499519, 506571, 515677, 524814, 531630, 534369, 533006, 529089, 524089, 518313, 511564, 504138, 496583, 489042, 481444, 473956, 466656, 459169, 451193, 443170, 435941, 430019, 425580, 422781, 421530, 421203, 421039, 420653, 419813, 418089, 415191, 411459, 407642, 404359, 402011, 400800, 400449, 400164, 399320, 397967, 396442, 394868, 393381, 392484, 392618, 393607, 394916, 396328, 398058, 400424, 403676, 407951, 413130, 419045, 426067, 435188, 447135, 461472, 476646, 490564, 501087, 506632, 506901, 502962, 496418, 488648, 480786, 473827, 468385, 464636, 462713, 462793, 464754, 468293, 473619, 481447, 491998, 504524, 518058, 532132, 546537, 561180, 576636, 594090, 613944, 634819, 654616, 672456, 689274, 706988, 727513, 752178, 781362, 814583, 850985, 889415, 927866, 963368, 992773, 1013555, 1024090, 1024057, 1014931, 999257, 978872, 954218, 925609, 894361]
51540H94361l2189l2124l1623l0579k8920k6795k4175k1162j8534j6997j6180
51529F15083j5383j4898j5313j5879j5189j3250j1332r895q349o823o321o854
51517D75597p159o665o052n525m391k841k242k854l115k063q03n43q38r55j306
51502D28245k234k679j661L8J064J424J902K452K535K366K495K755K731K636K725
51487D46794K523J708J004J082J262N36q26j889k668l788n050n623n384m900m405
51472D20376l946m077n148o155n770m279l218l079k843j891r94q75j032o67N3
51457C76455M00J98j16j15L53J307K515L497L989M272M826N693O505P096P833
51442D24708R167J1010J2885J4635J6438J7781J6997J2709N687j403o193q096
$$ y = [894361, 862172, 830048, 798425, 767846, 738926, 712131, 687956, 666794, 648260, 631263, 615083, 599700, 584802, 569489, 553610, 538421, 525171, 513839, 503944, 495595, 488772, 482451, 475597, 468438, 461773, 455721, 450196, 445805, 442964, 440722, 437868, 434753, 432690, 431887, 431344, 430506, 429551, 428245, 426011, 423332, 421671, 421709, 422773, 424197, 426099, 428551, 431086, 433452, 435947, 438702, 441433, 444069, 446794, 449317, 451025, 452029, 453111, 454373, 454909, 454083, 452194, 449526, 445738, 440688, 435065, 429681, 424781, 420376, 416430, 412353, 407205, 401050, 395280, 391001, 387783, 384704, 381861, 379970, 378976, 378101, 377069, 376402, 376455, 376855, 377053, 376937, 376822, 377175, 378482, 380997, 384494, 388483, 392755, 397581, 403274, 409779, 416875, 424708, 433875, 444885, 457770, 472405, 488843, 506624, 523621, 536330, 542017, 540614, 534421, 526325]
51430E26325p775o185m441l745m679o724q800j0038r964q540o359m408l314l086
51416D38267l491m228m633m004k358m20J239K460K997K667K077K162K748K611
51402D38094J398L87P44J995K918L212L400L726L990M107M241M610N507P078Q853
51387D94260J0098J0842J1866J3569J5716J8436K2321K7184L1913L6065M0335
51376G32605M4865M8653N1530N5016N9476O1683N7251M5197K8738J1928k995j5422
51364A178525k5479l3753m0780m6403n0166n2165n2850n2229n0077m6742m2924
51353F84957l8822l4353k9826k5620k1459j6944j2589r426p700o794o261o021
51341D69142n730m962l987l542l770m095m142l998l731l359l245l724m335m246
$$ y = [526325, 518550, 512365, 507924, 504179, 499500, 492776, 483976, 473938, 463974, 455434, 449075, 444667, 441353, 438267, 434776, 430548, 425915, 421911, 419553, 419133, 420372, 422832, 425829, 428496, 430573, 432735, 435483, 438094, 439492, 439879, 440623, 442618, 445536, 448748, 452148, 455874, 459864, 463971, 468212, 472822, 478329, 485407, 494260, 504358, 515200, 527066, 540635, 556351, 574787, 597108, 624292, 656205, 692270, 732605, 777470, 826123, 877653, 932669, 992145, 1053828, 1111079, 1156276, 1185014, 1196942, 1193947, 1178525, 1153046, 1119293, 1078513, 1032110, 981944, 929779, 876929, 824700, 774623, 727881, 684957, 646135, 611782, 581956, 556336, 534877, 517933, 505344, 495918, 488218, 481424, 475163, 469142, 463412, 458450, 454463, 450921, 447151, 443056, 438914, 434916, 431185, 427826, 424581, 420857, 416522, 412276]
51327D12276l456k858k978l353l260k540j521o39j94j30j4M18Q57Q61N27L72P06
51310C95074J493K536L415L623L140K541K102J361M4j113j245n99j37k27n09p38
51294D10761r89j244j427j704k117k267j899j426j233r10J02J581K946M144N310
51279D09628O073O167O182O669O931N825L501J235k31r95r79%J155J179N5o96
51263D51699O1J863L545M339L830J901p93l039m249m807n113n075m708m447m401
51248D30606m044l103k134j811k091k427k437k044j342n90p4J49J63q9o70j352
51232D06710j851k205k496k460j891j234j122j438j551j263q76m63J20N75M59
51217C89014J31N55J919L210L466K838K158J960K156K298K048J691J977L102M151
$$ y = [412276, 408820, 405962, 402984, 399631, 396371, 393831, 392310, 391671, 391477, 391347, 391333, 391751, 392608, 393469, 393996, 394368, 395074, 396567, 399103, 402518, 406141, 409281, 411822, 413924, 415285, 415329, 414216, 412971, 412372, 412235, 412008, 411499, 410761, 409772, 408528, 407101, 405397, 403280, 401013, 399114, 397688, 396455, 395545, 395647, 397228, 400174, 404318, 409628, 415701, 421868, 428050, 434719, 441650, 447475, 450976, 452211, 451980, 450985, 450006, 450006, 451161, 452340, 452395, 451699, 451760, 453623, 457168, 461507, 465337, 467238, 466445, 463406, 459157, 454350, 449237, 444162, 439454, 435007, 430606, 426562, 423459, 421325, 419514, 417423, 414996, 412559, 410515, 409173, 408583, 408509, 408658, 408821, 408732, 408062, 406710, 404859, 402654, 400158, 397698, 395807, 394573, 393451, 392013, 390462, 389199, 388323, 387860, 387980, 388555, 389014, 389145, 389700, 391619, 394829, 398295, 401133, 403291, 405251, 407407, 409705, 411753, 413444, 415421, 418523, 422674]
51202D22674M188L569L341L631L599K919K213J868J400L34j056k216k886k994
51188D40584k623k233k251k340j753n60L10M26M33Q98J301P87o12j965k407j838
51172D26157r49p14j471k403k330j115J28M23N8R9J091K487L285L134K723K876
51156D33479L308K892J385j1l08j77p74j846k206j649j035p32k84K94K69n08j195
51139D30902j242j083j153j182q10k19L13P11P99L87j81k69J15L70L81O98J464
51122D30001K103K257K201K103J788J380J331J544J432J047J152J887K436K355
51108D55017K181K194J828Q67J78M38J075J261J148J306J645J806J909K104J949
51093D76906J087P7k83r8l0k17k88j97k72n19n23q1N43R46R76Q10Q28J202J593
$$ y = [422674, 426862, 430431, 433772, 437403, 441002, 443921, 446134, 448002, 449402, 449736, 448680, 446464, 443578, 440584, 437961, 435728, 433477, 431137, 429384, 428824, 429134, 429560, 429993, 430891, 432192, 432979, 432367, 430402, 427995, 426157, 425208, 424494, 423023, 420620, 418290, 417175, 417303, 417726, 417784, 417883, 418974, 421461, 424746, 427880, 430603, 433479, 436787, 439679, 441064, 441053, 440745, 440568, 439794, 437948, 435742, 434093, 433058, 432326, 432042, 432336, 432605, 432097, 430902, 429660, 428577, 427424, 426242, 425432, 425213, 425526, 426237, 427036, 427423, 427242, 426973, 427088, 427458, 427839, 428537, 430001, 432104, 434361, 436562, 438665, 440453, 441833, 443164, 444708, 446140, 447187, 448339, 450226, 452662, 455017, 457198, 459392, 461220, 462087, 462265, 462703, 463778, 465039, 466187, 467493, 469138, 470944, 472853, 474957, 476906, 477993, 478070, 477787, 477689, 477659, 477442, 477154, 476957, 476685, 476166, 475643, 475562, 476105, 477051, 478027, 478837, 479665, 480867, 482460]
51074D82460J525J133J024J384J820K193K923M178N507O620P918R795J1941J3859
51060E54280J5702J8151K1721K6238L0458L2110K9218K2070J3408O339K394J659
51048G73748L627P097R900J0005P174L161J33j238k352n382j0899j6743j9713
51035G58518j8388j3914q450l921k116m269r639j5410j8907j9524j8156j5683
51023F10141j2671r709p066m374j341J664M199O327Q181R593J0673J1975J3397
51010F40989J3681J1952R125O914N839N131M154K946J555j31j871l138l776m116
50996F89254m390m549m519m227l510k342r90L43J827L516M893N439N513O182Q117
50981G00557J0986J3921J6393J8528K0634K2436K3079K2124K0263J8627J7705
$$ y = [482460, 483985, 485118, 486142, 487526, 489346, 491539, 494462, 498640, 504147, 510767, 518685, 528480, 540421, 554280, 569982, 588133, 609854, 636092, 666550, 698660, 727878, 749948, 763356, 769695, 772089, 773748, 777375, 784472, 794372, 804377, 811551, 814712, 814845, 813607, 811255, 805873, 794974, 778231, 758518, 740130, 726216, 717766, 713845, 711729, 707460, 697821, 682411, 663504, 643980, 625824, 610141, 597470, 587761, 580695, 576321, 574980, 576644, 580843, 587170, 595351, 604944, 615617, 627592, 640989, 654670, 666622, 675747, 682661, 688500, 693631, 697785, 700731, 702286, 702155, 700284, 697146, 693370, 689254, 684864, 680315, 675796, 671569, 668059, 665717, 664727, 665070, 666897, 670413, 675306, 680745, 686258, 692440, 700557, 711543, 725464, 741857, 760385, 781019, 803455, 826534, 848658, 868921, 887548, 905253]
50970I05253J7520J8544K1393K5739L0501L5181L9993M4689M8531N1706N5399
50959A294449N9843O3605O5542O6247O6636O6205O3921N9900N5037M9608M3379
50948A954372L6612K9884K3268J6627J0328M924N71k506l642k802j569j901m154
50935B060012p085r452j0867j1545j2153j3615j6251j9374k2326k5368k8938l2728
50923A850310l6366m0238m4597m8497n0887n2135n3236n3979n3281n1047m8271
50912A317776m5459m2271l8691l5304l2364k9714k7512k5986k4499k2194j9459
50901I74323j7479j6359j5057j3283j1913j1235j0278q517o829o001n540m696
50889H47136l668k902k155j182m97m98n18K56J500K335K755L431M437N272N999
$$ y = [905253, 922773, 941317, 962710, 988449, 1018950, 1054131, 1094124, 1138813, 1187344, 1239050, 1294449, 1354292, 1417897, 1483439, 1549686, 1616322, 1682527, 1746448, 1806348, 1861385, 1910993, 1954372, 1990984, 2020868, 2044136, 2060763, 2071091, 2076015, 2076586, 2074080, 2070438, 2067636, 2066067, 2064166, 2060012, 2052927, 2043475, 2032608, 2021063, 2008910, 1995295, 1979044, 1959670, 1937344, 1911976, 1883038, 1850310, 1813944, 1773706, 1729109, 1680612, 1629725, 1577590, 1524354, 1470375, 1417094, 1366047, 1317776, 1272317, 1230046, 1191355, 1156051, 1123687, 1093973, 1066461, 1040475, 1015976, 993782, 974323, 956844, 940485, 925428, 912145, 900232, 888997, 878719, 870202, 863373, 857372, 851832, 847136, 843468, 840566, 838411, 837229, 836732, 836234, 835716, 835972, 837472, 839807, 842562, 845993, 850430, 855702, 861701]
50874H61701P345R388J1147J1888J2171J3059J4694J6317J7456J8474J9804K1282
50862A034726K2528K3702K5318K7465K9745L2048L4893L8778M3617M9133N5436
50851A417389O2819P1153P9825Q8281R6445J04701J13504J22736J31489J38803
50841B427145J44650J49662J53765J55724J54286J49123J40355J27806J11400
50832C713916R1785P0117M7702K6133O926r625k4443l7702m7654n2352n1920m8017
50820C684866m1696l3242k3667j4758p575k356r0k609j0470k1897l4645m7946
50808C443915o1987p6334r0033j02656j14288j24480j32038j35954j36106j33005
50798B337034j27242j19357j10053j00218r0536q1073p1412o1366n1460m2494
$$ y = [861701, 869046, 878434, 889581, 901469, 913640, 926699, 941393, 957710, 975166, 993640, 1013444, 1034726, 1057254, 1080956, 1106274, 1133739, 1163484, 1195532, 1230425, 1269203, 1312820, 1361953, 1417389, 1480208, 1551361, 1631186, 1719467, 1815912, 1920613, 2034117, 2156853, 2288342, 2427145, 2571795, 2721457, 2875222, 3030946, 3185232, 3334355, 3474710, 3602516, 3713916, 3805701, 3875818, 3923520, 3949653, 3956579, 3946954, 3922511, 3884809, 3837155, 3784803, 3732883, 3684866, 3643170, 3609928, 3586261, 3571503, 3563928, 3561572, 3561482, 3558873, 3548403, 3526506, 3491861, 3443915, 3381928, 3305594, 3215561, 3112905, 2998617, 2874137, 2742099, 2606145, 2470039, 2337034, 2209792, 2090435, 1980382, 1880164, 1789628, 1708555, 1637143, 1575777, 1524317, 1481823]
50788A481823l4794k8041k1809j6066j1250p932o206n291m125k584j684k254l820
50775A335967n197n887o267o790p605q793j0291j1623j2364j2856j3910j5712
50763A218672j7496j8437j8454j8020j7474j6668j5246j3226j1242r942r082p672
50751A045713n212k270M16K961N951R480J3066J6206J8660K0495K2252K4627K7639
50738A199984L0620L3416L6912M1730M7091N1793N5812O0002O4589O8836P2073
50727A762858P4233P5559P6346P6861P6943P5964P3703P0775O7583O3358N6934
50716B551117M7951L6584K2783O885r542k4519l6942m6203n1336n1925m9303m5283
50704B350267l9939l2244k2671j3482o191m18M283P070O917L850j692r707k0032
$$ y = [1481823, 1447029, 1418988, 1397179, 1381113, 1369863, 1361931, 1355725, 1350434, 1346309, 1343725, 1342041, 1339787, 1335967, 1330770, 1324883, 1318616, 1311826, 1304221, 1295428, 1285137, 1273514, 1261150, 1248294, 1234384, 1218672, 1201176, 1182739, 1164285, 1146265, 1128791, 1112123, 1096877, 1083651, 1072409, 1062467, 1053385, 1045713, 1040501, 1038231, 1038647, 1041608, 1047559, 1057039, 1070105, 1086311, 1104971, 1125466, 1147718, 1172345, 1199984, 1230604, 1264020, 1300932, 1342662, 1389753, 1441546, 1497358, 1557360, 1621949, 1690785, 1762858, 1837091, 1912650, 1988996, 2065857, 2142800, 2218764, 2292467, 2363242, 2430825, 2494183, 2551117, 2599068, 2635652, 2658435, 2665320, 2655778, 2631259, 2594317, 2548114, 2496778, 2444853, 2395550, 2350267, 2310328, 2278084, 2255413, 2241931, 2235740, 2235322, 2239605, 2246675, 2253592, 2257442, 2255750, 2246043, 2226011]
50691B226011l1664m3331n4163o3380p0059p3754p4849p3849p0813o5757n9186
50680A545206n1942m4778l8122l1828k5250j8040j0735m036K127Q185J3947J8900
50668A363634K3131K6861K9413K9834K8380K6234K3925K1262J8707J7261J6913
50657A625555J6665J6344J6881J8471K0004K0827K1652K3114K4802K6364K8212
50646A858891L0481L2573L4463L7118M0795M4325M7040M9965N3972N8039O0734
50635B348396O2311O3720O4437O2977N9226N4672N0500M6719M3222M0368L8092
50624B934640L5053K8915J7402k01k1691m2235n6886o3296o2157n5823m6890l7362
50612B629469k7980j8434q644L49P207J1541J3699J3679J0960N232l338j4386
$$ y = [2226011, 2194347, 2151016, 2096853, 2033473, 1963414, 1889660, 1814811, 1740962, 1670149, 1604392, 1545206, 1493264, 1448486, 1410364, 1378536, 1353286, 1335246, 1324511, 1320475, 1322602, 1330787, 1344734, 1363634, 1386765, 1413626, 1443039, 1472873, 1501253, 1527487, 1551412, 1572674, 1591381, 1608642, 1625555, 1642220, 1658564, 1675445, 1693916, 1713920, 1734747, 1756399, 1779513, 1804315, 1830679, 1858891, 1889372, 1921945, 1956408, 1993526, 2034321, 2078646, 2125686, 2175651, 2229623, 2287662, 2348396, 2410707, 2474427, 2538864, 2601841, 2661067, 2715739, 2766239, 2812958, 2856180, 2896548, 2934640, 2969693, 2998608, 3016010, 3015809, 2994118, 2951883, 2894997, 2831701, 2769544, 2713721, 2666831, 2629469, 2601489, 2583055, 2574411, 2574760, 2581967, 2593508, 2607207, 2620886, 2631846, 2637078, 2633740, 2619354]
50600B619354k7350m1219n4704o6634p6094q2558q6210q7781q7743q6018q2693
50589A840350p8499p4125o9560o4578n9404n4382m9348m3958l8390l3238k8861
50578A246007k5133k1694j8205j4593j1258q611o323l472K73M151P195R245J0752
50565A168334J2119J3579J5202J6760J7943J8905K0108K1565K2818K3787K4865
50554A375985K6063K6989K7918K9772L2548L4755L5219L4500L3852L3552L3194
50543A724347L2841L2892L3329L4053L5623L8761M3393M8857N4756O1041O7607
50532B207500P4452Q1851Q9770R7485J04472J11281J18856J27225J35481J42718
50522C291091J48461J52455J54571J54765J52721J47899J40081J29285J14953
$$ y = [2619354, 2592004, 2550785, 2496081, 2429447, 2353353, 2270795, 2184585, 2096804, 2009061, 1923043, 1840350, 1761851, 1687726, 1618166, 1553588, 1494184, 1439802, 1390454, 1346496, 1308106, 1274868, 1246007, 1220874, 1199180, 1180975, 1166382, 1155124, 1146513, 1140190, 1136718, 1136991, 1141142, 1148337, 1157582, 1168334, 1180453, 1194032, 1209234, 1225994, 1243937, 1262842, 1282950, 1304515, 1327333, 1351120, 1375985, 1402048, 1429037, 1456955, 1486727, 1519275, 1554030, 1589249, 1623749, 1657601, 1691153, 1724347, 1757188, 1790080, 1823409, 1857462, 1893085, 1931846, 1975239, 2024096, 2078852, 2139893, 2207500, 2281952, 2363803, 2453573, 2551058, 2655530, 2766811, 2885667, 3012892, 3148373, 3291091, 3439552, 3592007, 3746578, 3901343, 4054064, 4201963, 4342044, 4471329, 4586282]
50513D586282R6093P2853M7114K0828n479l1843n7394q0753j01237j18545j31679
50502D296240j39304j40969j37076j27877j13482r4694p3007m9817k6206l267
50492C390541J7996L6848N2272O2550O5976O1702M9501K9396K404k8808o0862
50481C679516r0909j16553j35567j47022j52232j53412j51647j47122j40725j33896
50471B310431j26936j18885j09299r9009q8973p9448p0528o2536n5522m9166m3399
50460A406730l8421l3932k9129k3714j8230j3222q653m348l83L172O426R409J2149
50447A267854J4989J8297K1825K4915K7405K9688L1750L2630L1037K6326J8985
50436A545701J0579L124k028m766n704n426m524l702l169k305n87J548L470N387
$$ y = [4586282, 4682375, 4755228, 4802342, 4823170, 4817691, 4785848, 4728454, 4647701, 4546464, 4427919, 4296240, 4156936, 4015967, 3878891, 3751014, 3637532, 3542838, 3469831, 3420014, 3393808, 3390541, 3408537, 3445385, 3497657, 3560207, 3626183, 3687885, 3737386, 3766782, 3769186, 3740378, 3679516, 3588607, 3472054, 3336487, 3189465, 3037233, 2883821, 2732174, 2585052, 2444327, 2310431, 2183495, 2064610, 1955311, 1856302, 1767329, 1687881, 1617353, 1554817, 1499295, 1450129, 1406730, 1368309, 1334377, 1305248, 1281534, 1263304, 1250082, 1241429, 1237081, 1236698, 1239870, 1246296, 1255705, 1267854, 1282843, 1301140, 1322965, 1347880, 1375285, 1404973, 1436723, 1469353, 1500390, 1526716, 1545701, 1556280, 1559404, 1557376, 1552610, 1546906, 1541480, 1536956, 1533254, 1530085, 1527780, 1527193, 1528741, 1532211, 1537598]
50422A537598P718R990J1554J3089J6024K0508K5313K9884L5083M1465M8141N4116
50410A850483N9650O5447P1257P6146P9647Q1812Q2468Q1216P8108P3786O8969
50399B668989O3996N8625N1961M2914L1114J7253K229j3844l1278m9481o6464
50388B776014p9949q8859r3530r4655r2438q6972p8933o9298n8406m5982l2227
50377A954765j8308n479N770J5313K2697K7313K8868K7176K1806J2592L69j3221
50365B079661k6553l8485m8356n5856o0734o2524o1006n7021n2107m7119m2108
50354A527792l7971l6919m0146m5788n0452n2397n2137n0472m7363m2794l7395
50343A033958l1843k6431k1385j6944j3026r378o078l285p99J522L268M173M926
$$ y = [1537598, 1545316, 1555306, 1566860, 1579949, 1595973, 1616481, 1641794, 1671678, 1706761, 1748226, 1796367, 1850483, 1910133, 1975580, 2046837, 2122983, 2202630, 2284442, 2366910, 2448126, 2526234, 2600020, 2668989, 2732985, 2791610, 2843571, 2886485, 2917599, 2934852, 2937081, 2923237, 2891959, 2842478, 2776014, 2696065, 2607206, 2513676, 2419021, 2326583, 2239611, 2160678, 2091380, 2032974, 1986992, 1954765, 1936457, 1930978, 1936748, 1952061, 1974758, 2002071, 2030939, 2058115, 2079921, 2092513, 2092882, 2079661, 2053108, 2014623, 1966267, 1910411, 1849677, 1787153, 1726147, 1669126, 1617019, 1569900, 1527792, 1489821, 1452902, 1412756, 1366968, 1316516, 1264119, 1211982, 1161510, 1114147, 1071353, 1033958, 1002115, 975684, 954299, 937355, 924329, 914951, 908873, 905588, 904789, 906311, 909579, 913752, 918678]
50330I18678O203P246O655M601K962L032M207N294O014O703P408P948Q300Q499
50316A003750Q484Q303Q034P421O107M350K959K423K667L586N122O867Q333R776
50302A088182J1918J4722J7294J9293K1614K5249L0135L5596M1390M7564N3284
50291A406241N6048N2352L9830J9673l079k2421l5054m1256m2859m1363l7882
50280A350230l3518k9007k4531k0176j6176j2465q611m506o84K335M568O334P991
50267A221784J0008J2726J5809J8374J9968K0965K1778K2209K1837K0755J9565
50256A425778J8813J8576J8471J8046J7225J6240J5069J3181J0090N738J27o832
50244A570522j4487k1099k5135k6658k6626k5338k2435j8158j3523r380o313n348
$$ y = [918678, 924881, 932127, 938782, 943383, 946345, 949377, 953584, 958878, 964892, 971595, 979003, 986951, 995251, 1003750, 1012234, 1020537, 1028571, 1035992, 1042099, 1046449, 1049408, 1051831, 1054498, 1058084, 1063206, 1070073, 1078406, 1088182, 1100100, 1114822, 1132116, 1151409, 1173023, 1198272, 1228407, 1264003, 1305393, 1352957, 1406241, 1462289, 1514641, 1554471, 1574144, 1571065, 1548644, 1513590, 1472334, 1429475, 1388112, 1350230, 1316712, 1287705, 1263174, 1242998, 1226822, 1214357, 1205746, 1201240, 1200556, 1202891, 1207459, 1213793, 1221784, 1231792, 1244518, 1260327, 1278701, 1298669, 1319634, 1341412, 1363621, 1385458, 1406213, 1425778, 1444591, 1463167, 1481638, 1499684, 1516909, 1533149, 1548218, 1561399, 1571489, 1577227, 1577354, 1570522, 1556035, 1534936, 1509801, 1483143, 1456517, 1431179, 1408744, 1390586, 1377063, 1367683, 1361370, 1356022]
50232A356022p563j2759j9340k5687l0899l4321l5426l4490l2479l0025k7180
50221A065853k4280k2118k0986k0346j9698j9059j8349j7105j5132j2895j0955
50210H64930r517q526p736o698n278m084l726l841l604l039k818k964k784k138
50196G98177j648j512j185m17L14N84L41n90k293l954m448l840l273l231l087
50181G69938k524k060j848j266k01N53O64Q10J301J450R94Q87J864L225L977M191
50165G81955M459M811N056N451O284P420Q821J0794J3244J5518J7499J9977K3392
50152I24681K7205L1068L5530M0844M6074N0305N3717N6636N8384N8119N6050
50141A438613N2921M9020M4658M0921L8813L8078L7689L7013L5638L2614K6818
$$ y = [1356022, 1348459, 1335700, 1316360, 1290673, 1259774, 1225453, 1190027, 1155537, 1123058, 1093033, 1065853, 1041573, 1019455, 998469, 978123, 958425, 939366, 921017, 903912, 888780, 875885, 864930, 855413, 846887, 839151, 832453, 827175, 823091, 819365, 815524, 811920, 808881, 806063, 803099, 800315, 798177, 796529, 795017, 793832, 793415, 793729, 794313, 794654, 794064, 791771, 787817, 783369, 779529, 776256, 773025, 769938, 767414, 765354, 763506, 762240, 762039, 762592, 763256, 764066, 765367, 766817, 767811, 768698, 770562, 773787, 777764, 781955, 786414, 791225, 796281, 801732, 808016, 815436, 824257, 835051, 848295, 863813, 881312, 901289, 924681, 951886, 982954, 1018484, 1059328, 1105402, 1155707, 1209424, 1266060, 1324444, 1382563, 1438613, 1491534, 1540554, 1585212, 1626133, 1664946, 1703024, 1740713, 1777726, 1813364, 1845978, 1872796]
50130A872796J7916O454o614j9985l2236m2592n1064n7519o1329o2324o1213n8580
50118A443710n4419m9192m4204m0133l6235l1962k8246k6165k5253k4326k3082
50107A060493k1703j9726j6738j3547j1344j0126r128q252p797p320o226n152
50095I23434n288o528p566p791p763p791p278n747l553j339N06J754K458L152
50081H70660M293N577O375O641O752O699O224N486M870M291L503K799K642K766
50067I39578K426J465L94m61j175j781k269k842l535l825l337k652k607k997k807
50052I13575j682l15N99J194K065L564N456P024P707P957Q959J1225J3893J5895
50038I97116J7090J7855J8239J8323J8761K0126K2223K4683K7593L0787L3369
$$ y = [1872796, 1890712, 1897166, 1890552, 1870567, 1838331, 1795739, 1744675, 1687156, 1625827, 1563503, 1502290, 1443710, 1389291, 1340099, 1295895, 1255762, 1219527, 1187565, 1159319, 1133154, 1107901, 1083575, 1060493, 1038790, 1019064, 1002326, 988779, 977435, 967309, 958181, 949929, 942132, 934812, 928586, 923434, 918146, 911618, 904052, 896261, 888498, 880707, 873429, 867682, 864129, 862790, 863296, 865050, 867508, 870660, 874953, 880530, 886905, 893546, 900298, 906997, 913221, 918707, 923577, 927868, 931371, 934170, 936812, 939578, 942004, 943469, 943863, 943402, 942227, 940446, 938177, 935335, 931800, 927975, 924638, 921986, 919379, 916382, 913575, 911893, 911578, 912177, 913371, 915436, 919000, 924456, 931480, 939187, 947144, 956103, 967328, 981221, 997116, 1014206, 1032061, 1050300, 1068623, 1087384, 1107510, 1129733, 1154416, 1182009, 1212796, 1246165]
50027A246165L4893L6185L7931L9202L8609L6205L2975K9121K4415J9707J6391
50016A591799J4618J3481J2676J2158J0280M427n959j8431l0177m0197m8488n4647
50004A461540n8307n9936o0122n8692n5190m9714m2783l4979k7084k0081j4516
49993I80136j0250p052m974l965l650l719m115m680n139n465n977o998q742j1282
49979H94128j4101j6049j6440j5975j5777j5813j5088j3276j1105r175p436n932
49967G37961n127n148n512n824o083o200n883n223m673m307l638k407r30L72J403
49952F78781K350L687N937Q834J1098J1781J1551J1715J2244J1898J0184Q036
49940G88096O429N458M974N017N290N044L819J682j320n162r291j2909j5866j8291
$$ y = [1246165, 1281058, 1317243, 1355174, 1394376, 1432985, 1469190, 1502165, 1531286, 1555701, 1575408, 1591799, 1606417, 1619898, 1632574, 1644732, 1655012, 1659439, 1653480, 1635049, 1604872, 1564675, 1516187, 1461540, 1403233, 1343297, 1283175, 1224483, 1169293, 1119579, 1076796, 1041817, 1014733, 994652, 980136, 969886, 962834, 957860, 953895, 950245, 946526, 942411, 937731, 932592, 927127, 921150, 914152, 905410, 894128, 880027, 863978, 847538, 831563, 815786, 799973, 784885, 771609, 760504, 751329, 743893, 737961, 732834, 727686, 722174, 716350, 710267, 704067, 698184, 692961, 688288, 683981, 680343, 677936, 677006, 677378, 678781, 681131, 684818, 690755, 699589, 710687, 722468, 734019, 745734, 757978, 769876, 780060, 788096, 794525, 799983, 804957, 809974, 815264, 820308, 824127, 825809, 824489, 819327, 810036, 797127, 781261, 762970]
49926G62970j9485j8345j5090j1440q788p141o021n229m417k981j025N55J287
49913F64850J591J741J472R63J078K080L085L492L914M997O253O941P302Q106
49899G17865R485J0992J2309J3234J3455J2877J1821J0442Q514O067L638J487
49887H32186p36l108n056o345p622r267j0614j1107j1431j2442j3564j3476j2002
$$ y = [762970, 743485, 725140, 710050, 698610, 689822, 682681, 676660, 671431, 667014, 664033, 663008, 663563, 664850, 666441, 668182, 669654, 670617, 671695, 673775, 676860, 680352, 684266, 689263, 695516, 702457, 709759, 717865, 727350, 738342, 750651, 763885, 777340, 790217, 802038, 812480, 820994, 827061, 830699, 832186, 831450, 828342, 823286, 816941, 809319, 800052, 789438, 778331, 766900, 754458, 740894, 727418, 715416]
$$ [...]
##END NTUPLES=NMR SPECTRUM
##END=
