
##TITLE=AC1397_PANAS12209_7519683_e0SbUa46xL
##JCAMPDX= 6.0         $$ Bruker NMR JCAMP-DX V2.0
##DATA TYPE= NMR SPECTRUM
##DATA CLASS= NTUPLES
##ORIGIN= BRUKER
##OWNER= Administrator
$$ 1.72 TOPSPIN		Version 2.1
$$ 2013-02-19 23:42:50.676 -0500  Administrator@X
$$ Compression mode = diff/dup
##.OBSERVE FREQUENCY= 400.02188249412
##.OBSERVE NUCLEUS= ^1H
##.ACQUISITION MODE= SIMULTANEOUS (DQD)
##.ACQUISITION SCHEME= undefined
##.AVERAGES= 64
##.DIGITISER RES= 22
##SPECTROMETER/DATA SYSTEM= spect
##.PULSE SEQUENCE= noesygpps1d.comp
##.SOLVENT NAME= COFFEE_meoh
##.SHIFT REFERENCE= INTERNAL, COFFEE_meoh, 1, 14.96099
##AUDIT TRAIL= $$ (NUMBER, WHEN, WHO, WHERE, PROCESS, VERSION, WHAT)
$$ ##TITLE= Audit trail, TOPSPIN		Version 2.1
$$ ##JCAMPDX= 5.01
$$ ##ORIGIN= Bruker BioSpin GmbH
$$ ##OWNER= Administrator
$$ $$ E:\/data/COFFEE/nmr/AC1397_PANAS12209_7519683_e0SbUa46xL/12/pdata/1/auditp.txt
$$ ##AUDIT TRAIL=  $$ (NUMBER, WHEN, WHO, WHERE, PROCESS, VERSION, WHAT)
(   1,<2013-02-19 23:42:44.692 -0500>,<Administrator>,<X>,<go>,<TOPSPIN 2.1>,
      <created by zg
	started at 2013-02-19 23:31:14.831 -0500,
	POWCHK enabled, PULCHK disabled,
       configuration hash MD5:
       86 BA 57 50 F2 9D 5C 9B 26 00 A9 28 5F 66 2E 89
       data hash MD5: 64K
       24 2F 7B 1C C0 9B 2B CC EE 4F DD 54 7C 09 42 EB>)
(   2,<2013-02-19 23:42:47.848 -0500>,<Administrator>,<X>,<proc1d>,<TOPSPIN 2.1>,
      <Start of raw data processing
       efp LB = 0.3 FT_mod = 6 PKNL = 1 PHC0 = 0 PHC1 = 0 SI = 128K 
       data hash MD5: 128K
       86 AD 9F E5 3E 95 80 D8 8E E7 FA 52 77 AC AB 3D>)
(   3,<2013-02-19 23:42:48.942 -0500>,<Administrator>,<X>,<proc1d>,<TOPSPIN 2.1>,
      <pk PHC0 = 254.7345 PHC1 = 0 
       data hash MD5: 128K
       BF AF 94 4B B0 B6 F3 2F A1 BF DF 70 BD 03 19 4D>)
(   4,<2013-02-19 23:42:49.629 -0500>,<Administrator>,<X>,<proc1d>,<TOPSPIN 2.1>,
      <abs ABSG = 1 
       data hash MD5: 128K
       C2 C3 C9 CB 99 5C 14 72 B3 41 EE 8F 08 5E CB C0>)
(   5,<2013-02-19 23:42:49.770 -0500>,<Administrator>,<X>,<proc1d>,<TOPSPIN 2.1>,
      <abs ABSG = 2 
       data hash MD5: 128K
       2E B6 75 42 10 57 98 0D 1D BA 9E 92 9C 98 E4 77>)
(   6,<2013-02-19 23:42:49.926 -0500>,<Administrator>,<X>,<proc1d>,<TOPSPIN 2.1>,
      <abs ABSG = 3 
       data hash MD5: 128K
       B9 54 1D 48 93 B4 7A BA EF 7C B1 A0 33 A9 55 70>)
(   7,<2013-02-19 23:42:50.114 -0500>,<Administrator>,<X>,<proc1d>,<TOPSPIN 2.1>,
      <abs ABSG = 4 
       data hash MD5: 128K
       FF E1 48 B0 B0 48 AC C9 F3 4A 8C 47 EF C8 DD 0E>)
(   8,<2013-02-19 23:42:50.317 -0500>,<Administrator>,<X>,<proc1d>,<TOPSPIN 2.1>,
      <abs ABSG = 5 
       data hash MD5: 128K
       90 41 A6 76 F7 61 B4 E8 80 BA C1 D5 0C B4 22 F7>)
$$ ##END=
$$ 
$$ $$ hash MD5
$$ $$ 2D AA D3 83 9A C3 39 96 35 F8 F3 F0 E3 66 6B 0D
##$RELAX= 
##$RELAX= 
##$RELAX= 
##$RELAX= 
##$RELAX= 
##$RELAX= 
##$RELAX= 
##$RELAX= 
$$ Bruker specific parameters
$$ --------------------------
##$DU= <E:\>
##$EXPNO= 12
$$ [...]
150 150 150 150 150 150 150 150
##$TP07= 0
##$TPNAME0= <>
##$TPNAME1= <>
##$TPNAME2= <>
##$TPNAME3= <>
##$TPNAME4= <>
##$TPNAME5= <>
##$TPNAME6= <>
##$TPNAME7= <>
##$TPOAL= (0..7)
0.5 0.5 0.5 0.5 0.5 0.5 0.5 0.5
##$TPOFFS= (0..7)
0 0 0 0 0 0 0 0
##$TUNHIN= 0
##$TUNHOUT= 0
##$TUNXOUT= 0
##$USERA1= <user>
##$USERA2= <user>
##$USERA3= <user>
##$USERA4= <user>
##$USERA5= <user>
##$V9= 5
##$VALIST= <valist>
##$VCLIST= <CCCCCCCCCCCCCCC>
##$VD= 0
##$VDLIST= <DDDDDDDDDDDDDDD>
##$VPLIST= <PPPPPPPPPPPPPPP>
##$VTLIST= <TTTTTTTTTTTTTTT>
##$WBST= 1024
##$WBSW= 4
##$XGAIN= (0..3)
0 0 0 0
##$XL= 0
##$YL= 0
##$YMAX_a= 6163789
##$YMIN_a= -10016137
##$ZGOPTNS= <>
##$ZL1= 120
##$ZL2= 120
##$ZL3= 120
##$ZL4= 120
##$ABSF1= 14.96099
##$ABSF2= -5.597192
##$ABSG= 5
##$ABSL= 3
##$ALPHA= 0
##$AQORDER= 0
##$ASSFAC= 0
##$ASSFACI= 0
##$ASSFACX= 0
##$ASSWID= 0
##$AUNMP= <proc_prof1d_extract.lims>
##$AXLEFT= 0
##$AXNAME= <>
##$AXNUC= <1H>
##$AXRIGHT= 0
##$AXTYPE= 0
##$AXUNIT= <>
##$AZFE= 0.1
##$AZFW= 0.1
##$BCFW= 0
##$BC_mod= 0
##$BYTORDP= 0
##$COROFFS= 0
##$CY= 15
##$DATMOD= 1
##$DC= 0
##$DFILT= <>
##$DTYPP= 0
##$F1P= 0
##$F2P= 0
##$FCOR= 0.5
##$FTSIZE= 131072
##$FT_mod= 6
##$GAMMA= 0
##$GB= 0
##$INTBC= 1
##$INTSCL= 1
##$ISEN= 128
##$LB= 0.3
##$LEV0= 0
##$LPBIN= 0
##$MAXI= 10000
##$MC2= 0
##$MEAN= 0
##$ME_mod= 0
##$MI= 0
##$NCOEF= 0
##$NC_proc= -2
##$NLEV= 6
##$NOISF1= 0
##$NOISF2= 0
##$NSP= 0
##$NTH_PI= 0
##$NZP= 0
##$OFFSET= 14.96099
##$PC= 1
##$PHC0= 254.7345
##$PHC1= 0
##$PH_mod= 1
##$PKNL= yes
##$PPARMOD= 0
##$PPDIAG= 0
##$PPIPTYP= 0
##$PPMPNUM= 2147483647
##$PPRESOL= 1
##$PSCAL= 4
##$PSIGN= 0
##$PYNMP= <proc.py>
##$REVERSE= no
##$SF= 400.020009641146
##$SI= 131072
##$SIGF1= 0
##$SIGF2= 0
##$SINO= 400
##$SIOLD= 131072
##$SPECTYP= <>
##$SREGLST= <1H.CDCl3>
##$SSB= 0
##$STSI= 131072
##$STSR= 0
##$SW_p= 8223.68421052631
##$SYMM= 0
##$S_DEV= 0
##$TDeff= 65536
##$TDoff= 0
##$TI= <>
##$TILT= no
##$TM1= 0
##$TM2= 0
##$TOPLEV= 0
##$USERP1= <user>
##$USERP2= <user>
##$USERP3= <user>
##$USERP4= <user>
##$USERP5= <user>
##$WDW= 1
##$XDIM= 131072
##$YMAX_p= 424029486
##$YMIN_p= -11312
##$CURPLOT= <Network HP LaserJet P1505>
##$CURPRIN= <$Network HP LaserJet P1505>
##$DFORMAT= <normdp>
##$LAYOUT= <+/1D_H.xwp>
##$LFORMAT= <normlp>
##$PFORMAT= <normpl>
##$SURQMSG= 1
$$ End of Bruker specific parameters
$$ ---------------------------------
##NTUPLES= NMR SPECTRUM
##VAR_NAME=  FREQUENCY,     SPECTRUM/REAL,   SPECTRUM/IMAG
##SYMBOL=    X,             R,               I
##VAR_TYPE=  INDEPENDENT,   DEPENDENT,       DEPENDENT
##VAR_FORM=  AFFN,          ASDF,            ASDF
##VAR_DIM=   131072,        131072,          131072
##UNITS=     HZ,            ARBITRARY UNITS, ARBITRARY UNITS
##FACTOR=    0.0627417313425164, 1,          1
##FIRST=     8223.62146879497, -27,          -57838
##LAST=      0,             1605,            -57855
##MIN=       0,             -11312,          0
##MAX=       8223.62146879497, 424029486,    0
$$ Real data points
##PAGE= N=1
##DATA TABLE= (X++(R..R)), XYDATA
$$ [...]
63909B400781k04430j86178j68614j51903j35409j19038j03581q9759p7519o6464
63899A097886n6584m8237m1607l6381l2066k8408k5439k3146k1268j9515j7918
63888G47317j6763j6214j6087j6008j5680j4952j3819j2345j0565q432n893k967
63876E97592K89L609O354P875Q371Q972J0528J2605J4191J5061J5727J6284J6250
63863G33708J5615J5074J4919J4504J3193J1143Q698N857K887O26o02j849m383
63850H29390p955j1131j3078j4227j5262j6307j7236j8036j8658j9025j9341j9911
63838F39223k0592k0902k0738k0503k0354j9903j8879j7631j6643j5957j5371
63827D31750j4910j4619j4116j2859j0978r402q850q895q426p085n736n266n311
$$ plain form
63909 2400781 2196351 2010173 1841559 1689656 1554247 1435209 1331628 1241869 1164350 1097886
63899 1097886 1041302 993065 951458 915077 883011 854603 829164 806018 784750 765235 747317
63888 747317 730554 714340 698253 682245 666565 651613 637794 625449 614884 606452 600559 597592
63876 597592 597881 601490 607844 615719 624090 633062 643590 656195 670386 685447 701174 717458 733708
63863 733708 749323 764397 779316 793820 807013 818156 826854 832711 835598 836224 835622 833773 829390
63850 829390 821435 810304 797226 782999 767737 751430 734194 716158 697500 678475 659134 639223
63838 639223 618631 597729 576991 556488 536134 516231 497352 479721 463078 447121 431750
63827 431750 416840 402221 388105 375246 364268 354866 346016 337121 328695 321610 315874 310608 305297
63814C05297m813l588k568k355k404k024j419j164j180r82n63k82j40J32M46M70
63798B82863K00k23r77k106k862k473j478j260k163l096l252l177l561l972l581
63783B48882k534j714j454j272p64j69J0m14j132j581j433r33n80m39j42L58N37
63766B35226L4p59j172r98m76P7M03L22Kj36K8J56L4l0K44O41P92N90M6p26j145
63745B33153m41J195K413K331J736J846K502K632K095J845K293K707K491K079
63731B60877K132K604L028L163K993K622K407K728L358L618L367L289L892M809
63717C04887N429N657N630N202M223K940J642K61j208k274k485k163k010k197
63703C23534k303k030j518j041p83p81p66k62P28J512J600J510J983K753K965
$$ plain form
63814 305297 300484 296896 294328 291973 289569 287545 286126 284962 283782 282800 282237 281955 281815 281947 282393 282863
63798 282863 283063 282840 281863 279757 276895 274422 272944 271684 269521 266425 263173 259996 256435 252463 248882
63783 248882 246348 244634 243180 241908 241144 240975 240985 240571 239439 237858 236425 235492 234912 234473 234331 234689 235226
63766 235226 235260 234501 233329 232331 231855 231932 232335 232657 232659 232523 232551 232707 232741 232711 232955 233596 234388 234978 235024 234298 233153
63745 233153 232712 233907 236320 238651 240387 242233 244735 247367 249462 251307 253600 256307 258798 260877
63731 260877 263009 265613 268641 271804 274797 277419 279826 282554 285912 289530 292897 296186 300078 304887
63717 304887 310316 315973 321603 326805 331028 333968 335610 335871 334663 332389 329904 327741 325731 323534
63703 323534 321231 319201 317683 316642 315859 315078 314312 314050 314778 316290 317890 319400 321383 324136 327101
63688C27101K632K627L126L189K371J584J646J873J173n8m14L43Q42J03j136j574
63672C45428j009j92M03R25J491J991K398K774K903K459J554P11J48m33j221j964
63656C58366k529l324m627n850o125n502m872m615m087k757j230n18o81r00p07
63641C10042l97k23Q0O99J251J382J431J996L069M034M473M523M527M682N030
63626C46599N539O120O758P561Q513R345R945J0670J1856J3165J3973J4404J5364
63613D79812J7383J9983K2429K4555K6524K8290K9855L1631L3889L6070L7245
63602G87666L7180L6305L4613L1301K5740J8433J0707L808j511n012p011q232
63590I63987r208r904j0184j0563j2007j4896j8567k2046k4978k7503k9483l0381
$$ plain form
63688 327101 329733 332360 335486 338675 341046 342630 344276 346149 347322 347264 346850 347193 348035 348138 347002 345428
63672 345428 344419 344227 344630 345555 347046 349037 351435 354209 357112 359571 361125 361836 361984 361551 360330 358366
63656 358366 355837 352513 347886 342036 335911 330409 325537 320922 316835 314078 312848 312330 311649 310749 310042
63641 310042 309645 309422 309502 310201 311452 312834 314265 316261 319330 323364 327837 332360 336887 341569 346599
63626 346599 352138 358258 365016 372577 381090 390435 400380 411050 422906 436071 450044 464448 479812
63613 479812 497195 517178 539607 564162 590686 618976 648831 680462 714351 750421 787666
63602 787666 824846 861151 895764 927065 952805 971238 981945 985753 984242 979230 972219 963987
63590 963987 954779 944875 934691 924128 912121 897225 878658 856612 831634 804131 774648 744267
63578G44267k9975k8691k6972k4734k1827j8712j6047j3726j0995p682m607k478
63566E37821r58P04K609M341N769P084Q193Q798R041R515J0501J1742J3021J4503
63552F42684J6326J8311K0277K2279K4482K7084L0443L4753L9461M3430M5905
63541I65435M6789M5770M1855L4390K4177J2934K050p530j4519j7666j7249j5384
63529A101052j4090j3485j2584j1516j1951j5053j9824k4296k7851l1473l5713
63518H83216l9432m1099m0624l9126l7308l4936l1872k8706k6005k3600k1054
63507E19454j8431j6191j4498j3028j1376r471p672o506o127n982n316m021k702
63494C98133j776j022k22K66L6n70p80l50K14M43L81L18L65N10Q30J421K188K822
$$ plain form
63578 744267 714292 685601 658629 633895 612068 593356 577309 563583 552588 544906 540299 537821
63566 537821 536863 537567 540176 544517 550286 557370 565563 574361 583402 592917 603418 615160 628181 642684
63552 642684 659010 677321 697598 719877 744359 771443 801886 836639 876100 919530 965435
63541 965435 1012224 1057994 1099849 1134239 1158416 1171350 1173400 1165870 1151351 1133685 1116436 1101052
63529 1101052 1086962 1073477 1060893 1049377 1037426 1022373 1002549 978253 950402 918929 883216
63518 883216 843784 802685 762061 722935 685627 650691 618819 590113 564108 540508 519454
63507 519454 501023 484832 470334 457306 445930 436459 428787 422281 416154 410172 404856 400835 398133
63494 398133 396357 395335 395113 395379 395415 394845 394065 393715 393929 394372 394753 395071 395436 395946 396776 398197 400385 403207
63476D03207L040K896K759K872K988K582J479O6j157j981k419k533k495k542k744
63461D06018k969l199l497l638l182k156j198o89j84Q03J911K460K641L412N177
63446D01710P205Q554R074R309R791J0653J1692J2664J3591J4845J6724J8988
63434E44800K1012K2527K3996K6206K9412L2773L4526L3023K8010K0940J3949
63423H31174Q602N564M922O330R134J2885J7595K3142K8657L3144L6508L9271
63411A056928M1364M1871M0084L6079L0087K2134J2751L410m338r881j3374j5119
63399A241996j5572j5577j5888j6654j7882k0157k4204k9664l4980l8741m0762
63388I71915m1711m1985m1379l9607l6796l3405k9900k6567k3524k0803j8290
$$ plain form
63476 403207 406247 409143 411902 414774 417762 420344 421823 421889 420732 418751 416332 413799 411304 408762 406018
63461 406018 403049 399850 396353 392715 389533 387377 386179 385490 385306 386109 388020 390480 393121 396533 401710
63446 401710 408915 417469 426543 435852 445643 456296 467988 480652 494243 509088 525812 544800
63434 544800 565812 588339 612335 638541 667953 700726 735252 768275 796285 817225 831174
63423 831174 839776 845340 850262 856592 865726 878611 896206 919348 948005 981149 1017657 1056928
63411 1056928 1098292 1140163 1180247 1216326 1246413 1268547 1281298 1284708 1280370 1270489 1257115 1241996
63399 1241996 1226424 1210847 1194959 1178305 1160423 1140266 1116062 1086398 1051418 1012677 971915
63388 971915 930204 888219 846840 807233 770437 737032 707132 680565 657041 636238 617948
63377F17948j5677j2562q842n001j871J92J856M216P516J0694J2589J3364J4220
63364F38642J5750J7340J8422J9598K1797K4855K7765L0133L2464L5066L7538
63353I19370L9572M1380M2904M3235M1469L7674L2508K6181J8521R865J350n758
63341A248271j0718j3447j4432j4555j4661j5151j6108j7737k0370k4010k8110
63330A058972l1884l4759l6552l7397l7514l6924l5423l2784k9039k4505j9656
63319G02535j4904j0472o439l124j403k197n536j0325j5215j9406k2467k3858
63307E67189k3267k1210j8771j6655j4834j3035j1174r255p329n646m512l881
63295D17620l400l040l203l924m484m260l752m008n164o204o356o022n900n754
$$ plain form
63377 617948 602271 589709 580867 575866 573995 574187 576043 580259 587775 598469 611058 624422 638642
63364 638642 654392 671732 690154 709752 731549 756404 784169 814302 846766 881832 919370
63353 919370 958942 1000322 1043226 1086461 1127930 1165604 1198112 1224293 1242814 1252679 1254029 1248271
63341 1248271 1237553 1224106 1209674 1195119 1180458 1165307 1149199 1131462 1111092 1087082 1058972
63330 1058972 1027088 992329 955777 918380 880866 843942 808519 775735 746696 722191 702535
63319 702535 687631 677159 670720 667596 666193 663996 658460 648135 632920 613514 591047 567189
63307 567189 543922 522712 503941 487286 472452 459417 448243 438988 431659 426013 421501 417620
63295 417620 414220 411180 407977 404053 399569 395309 391557 387549 382385 376181 369825 363803 357903 352149
63281C52149m807l113j765j529j976k218k007j648j257p16j64L0k24o37r40r83
63265C28195n23O19K055K994L040K549K075J815J746J929K339K701K825K872L099
63250C60330L524M071M814N808O843P639Q189Q635R020R387J0033J1310J3136
63237D62739J4940J6140J6662J7020J7905J9571K1478K2756K3147K3313K3984
63226F79655K5036K5613K5177K4075K3120K2820K3046K3378K3594K3804K4052
63215I43370K4074K3566K2555K1056J8573J4555R424M466L51l593q257j3474j8432
63202A038234k2743k6329k8763k9693k9687k9559k9015k6956k3329j9533j6615
63191G56012j4088j1166q218o139m872l502j490J020L862O886R471J0892J1403
$$ plain form
63281 352149 347342 344229 342464 340935 338959 336741 334734 333086 331829 331113 330949 330979 330755 330118 329178 328195
63265 328195 327672 328291 330346 333340 336380 338929 341004 342819 344565 346494 348833 351534 354359 357231 360330
63250 360330 363854 367925 372739 378547 385390 393029 401218 409853 418873 428260 438293 449603 462739
63237 462739 477679 493819 510481 527501 545406 564977 586455 609211 632358 655671 679655
63226 679655 704691 730304 755481 779556 802676 825496 848542 871920 895514 919318 943370
63215 943370 967444 991010 1013565 1034621 1053194 1067749 1077173 1081639 1081990 1078397 1070140 1056666 1038234
63202 1038234 1015491 989162 960399 930706 901019 871460 842445 815489 792160 772627 756012
63191 756012 741924 730758 722540 716401 711529 708027 706537 707557 711419 718305 727776 738668 750071
63178G50071J2163J3772J5502J6276J5944J5187J4569J4182J3926J3650J3070
63167I08312J1916J0180Q028N525K671m21l650p155j1112j5358j9379k2705k5047
63154H41805k6195k6236k5813k5715k5956k5663k4175k1863j9618j7843j6371
63143E86357j5054j3860j2525j0703q573o812n781n113m266l140k009j134o77
63130D96710o05n25J23J436K870L901M581N176N641N838N987O405O868O765N905
63115E57076M780L992L750L947M311M325L416J583k84j078m83P33J454J211M76
63100E89209O4K28M66K00n16j166j495j692j886j805j217m58j86o02j209j383
63084E76552j031m77P1P22J530K231K556K664L007L783M727N449N830O025O320
$$ plain form
63178 750071 762234 776006 791508 807784 823728 838915 853484 867666 881592 895242 908312
63167 908312 920228 930408 938436 943961 946632 946211 942561 935406 924294 908936 889557 866852 841805
63154 841805 815610 789374 763561 737846 711890 686227 662052 640189 620571 602728 586357
63143 586357 571303 557443 544918 534215 525642 518830 513049 507936 503670 500530 498521 497387 496710
63130 496710 496105 495580 495703 497139 500009 503910 508491 513667 519308 525146 531133 537538 544406 551171 557076
63115 557076 561856 565848 569598 573545 577856 582181 585597 587180 586896 585818 585335 586068 587522 588733 589209
63100 589209 589273 589501 589967 590167 589651 588485 586990 585298 583412 581607 580390 579932 579746 579144 577935 576552
63084 576552 575521 575044 575115 575837 577367 579598 582154 584818 587825 591608 596335 601784 607614 613639 619959
63069F19959O988Q142R552J0805J1709J2457J3380J4704J6564J8932K1449K3652
63057G88293K5562K7793L0775L4139L7186L9784M2422M5454M8678N1664N4177
63046A225927N6176N7663N8657N9206N9315N8955N8177N7168N6232N5713N5746
63035A858935N5976N5676N4347N2114M9382M6180M2046L6442K9056J9842R084
63024B309080k587j4442k6094l7526m8670n8992o7537p3429p6437p7074p5967
63013A750325p3230o8715o2876n6782n1019m4993l7815k9594k1420j4213q106
63002A281562k776K132O868J1454J5558J8872K1498K3668K5187K5632K5151K4570
62990A479376K4593K5151K5605K5311K3973K1785J9207J6411J2954Q359K828l031
$$ plain form
63069 619959 626947 635089 644641 655446 667155 679612 692992 707696 724260 743192 764641 788293
63057 788293 813855 841648 872423 906562 943748 983532 1025954 1071408 1120086 1171750 1225927
63046 1225927 1282103 1339766 1398423 1457629 1516944 1575899 1634076 1691244 1747476 1803189 1858935
63035 1858935 1914911 1970587 2024934 2077048 2126430 2172610 2214656 2251098 2280154 2299996 2309080
63024 2309080 2306493 2292051 2265957 2228431 2179761 2120769 2053232 1979803 1903366 1826292 1750325
63013 1750325 1677095 1608380 1545504 1488722 1437703 1392710 1354895 1325301 1303881 1289668 1281562
63002 1281562 1278786 1280918 1287786 1299240 1314798 1333670 1355168 1378836 1404023 1429655 1454806 1479376
62990 1479376 1503969 1529120 1554725 1580036 1604009 1625794 1645001 1661412 1674366 1682725 1685553 1682522
62978A682522r105j5836k3299l0792l7488m3074m7533n0777n2785n3761n3871
62967A264201n3000n0969m7855m4027m0092l6688l4023l1635k8971k6219k4099
62956H46623k2836k1880k0738j9516j8439j7433j6465j5788j5458j5039j4203
62945F48828j3307j2966j3259j3677j3651j2865j1388r763q657q150p599o566
62933E16980n544n368o064o681o276m833l239k401k337k209j389k91K39J48J17
62918D70852L52K57l68q03n40l01j065k624l808l948l351k552j753j047o73r12
62902D47716j850l142l930l464k065j003j048j583j683j406j365j514j295o60
62888D21708j72j39m15q74j349j246j07J497K341J913Q59Pl13j39K59L56j05n99
$$ plain form
62978 1682522 1673417 1657581 1634282 1603490 1566002 1522928 1475395 1424618 1371833 1318072 1264201
62967 1264201 1211201 1160232 1112377 1068350 1028258 991570 957547 925912 896941 870722 846623
62956 846623 823787 801907 781169 761653 743214 725781 709316 693528 678070 663031 648828
62945 648828 635521 622555 609296 595619 581968 569103 557715 547952 539295 531145 523546 516980
62933 516980 511436 506068 500004 493323 487047 482214 478975 476574 474237 472028 470639 470348 470587 470735 470852
62918 470852 471204 471461 471093 470290 469750 469449 468384 465760 461952 458004 454653 452101 450348 449301 448628 447716
62902 447716 445866 442724 438794 435330 433265 432262 431214 429631 427948 426542 425177 423663 422368 421708
62888 421708 421536 421397 420982 420108 418759 417513 417406 418903 421244 423157 424016 424023 423710 423571 423830 424186 424081 423482
62870D23482n32k87p15j645j987j416q18p41n67J66P36L32n86j004p49l18K03
62853D13554J043J845J844R87J28m1L30O62O66M97N09R20J486J591Q67l49j369
62836D25170j755j496q16j18J33j89o68q05n17o8L41O72R84J391J857J945J256
62819D27317K89K30J453K824L134K693K722L565M452M901N308N956O369O133N716
62804D83062N955P040Q322R042Q992Q710R070J0456J2223J3302J3388J3257J3849
62791F16668J5393J7562K0023K2644K5419K8484L2026L6041M0434M5351N1026
62780I51071N7182O3047O8226P3180P8437Q3708Q8197R1516R3656R4270R2577
62769A835067Q8164Q1340P2544O1758M8816L3996J7998J481j5038l0883m5200
$$ plain form
62870 423482 422950 422663 421948 420303 418316 416900 416082 415341 414774 414940 415676 416008 415422 414418 413669 413351 413554
62853 413554 414597 416442 418286 419273 419401 419360 419690 420352 421018 421515 422024 422944 424430 426021 426888 426539 425170
62836 425170 423415 421919 421103 420985 421118 420929 420261 419456 418939 418871 419212 419884 420868 422259 424116 426061 427317
62819 427317 427606 427836 429289 432113 435247 437940 440662 444227 448679 453580 458888 464844 471213 477346 483062
62804 483062 489017 496057 504379 513421 522413 531123 540193 550649 562872 576174 589562 602819 616668
62791 616668 632061 649623 669646 692290 717709 746193 778219 814260 854694 900045 951071
62780 951071 1008253 1071300 1139526 1212706 1291143 1374851 1463048 1554564 1648220 1742490 1835067
62769 1835067 1923231 2004571 2077115 2138873 2187689 2221685 2239683 2241164 2226126 2195243 2150043
62758B150043n7438o7680p6265q3113q7680q9619q9378q7871q5679q2748p8913
62747A263659p4431o9793o5163o0277n5007m9778m5205m1308l7374l2890k8429
62736G04004k5195k3510k2191j9850j6565j3715j2184j1346j0137q441o939n895
62724E28036m788l184j411j34L78L84L23N91J472K986M745O174P026P689Q925
62709E59212J1183J4064J6621J8312J9687K1876K5344K9370L2915L5799L8754
62698H23137M2366M6381N0182N3555N6669N9432O1327O2008O1641O0437N8128
62687A435263N4292M8962M2415L4473K4522J2555l10j2594k3544l3160m1612m9006
62675A492256n5404o0574o3825o4695o3747o2177o0545n8387n5186n1152m6858
$$ plain form
62758 2150043 2092605 2024925 1948660 1865547 1777867 1688248 1598870 1510999 1425320 1342572 1263659
62747 1263659 1189228 1119435 1054272 993995 938988 889210 844005 802697 765323 732433 704004
62736 704004 678809 655299 633108 613258 596693 582978 570794 559448 549311 540870 533931 528036
62724 528036 523248 520064 518653 518519 518897 519281 519604 520195 521667 524653 529398 535572 542598 550287 559212
62709 559212 570395 584459 601080 619392 639079 660955 686299 715669 748584 784383 823137
62698 823137 865503 911884 962066 1015621 1072290 1131722 1193049 1255057 1316698 1377135 1435263
62687 1435263 1489555 1538517 1580932 1615405 1639927 1652482 1652172 1639578 1616034 1582874 1541262 1492256
62675 1492256 1436852 1376278 1312453 1247758 1184011 1121834 1061289 1002902 947716 896564 849706
62664H49706m2648l8730l5363l2543k9801k6781k3804k1372j9387j7293j4898
62653E47086j2667j1128j0399j0221j0175r839r016p921o974o489o535o840o745
62640D32137n642l775k180j431r61j18P00Q17O76J268K301K336R76m24p37n87
62624D25356j010j755j924j533j219r19j12R43J463J533K033L111L901M058M373
62609D38299N412O533P019P269Q125R484J0609J1428J2668J4683J6980J9028K1008
62596E88545K3458K6539K9929L3207L6166L8769M0980M2695M3821M4299M3951
62585I92359M2325L8993L4010K7880K0925J3038M291m566j2672j9906k6691l2912
62573A077074l7651m0256m1216m1572m1659m0974l9188l6765l4365l2106k9772
$$ plain form
62664 849706 807058 768328 732965 700422 670621 643840 620036 598664 579277 561984 547086
62653 547086 534419 523291 512892 502671 492496 482657 473641 465720 458746 452257 445722 438882 432137
62640 432137 426495 422720 420540 419109 418148 418030 418730 419547 420223 421491 423792 426128 427104 426680 425943 425356
62624 425356 424346 422591 420667 419134 417915 416996 416884 417827 419290 420823 422856 425967 429868 433926 438299
62609 438299 443711 450244 457263 464532 472657 482141 492750 504178 516846 531529 548509 567537 588545
62596 588545 612003 638542 668471 701678 737844 776613 817593 860288 904109 948408 992359
62585 992359 1034684 1073677 1107687 1135567 1156492 1169530 1173821 1169255 1156583 1136677 1109986 1077074
62573 1077074 1039423 999167 957951 916379 874720 833746 794558 757793 723428 691322 661550
62562F61550k7452k5396k3394k0842j7645j4623j2668j1753j0988r595p545n437
62550D74212l983l522l751l913l438k397j322o68n85r26j311j298p59QO76J223
62534D48246J722K026J912J353M87l72n47O37K930N060O158O836Q111R735J0719
62519E05013J1259J2832J6070J9767K2579K4723K7168K9970L2345L3971L5256
62508G70953L6547L7782L8766L9199L8450L5962L1939K7237K2609J8258J3966
62497A111668R348M172j161n614q377r484r370q045n290j292L441Q718J4613K0917
62483A124244K7139L3075L8823M4300M9164N3272N6653N9057N9871N8528N4536
62472A658662M7364L6988K4689J2560J790q199j8795l0672m3307n5429o5653p3123
$$ plain form
62562 661550 634098 608702 585308 564466 546821 532198 519530 507777 496789 487194 479649 474212
62550 474212 470229 466707 462956 459043 455605 453208 451886 451218 450633 449707 448396 447098 446339 446347 447023 448246
62534 448246 449968 451994 453906 455259 455746 455374 454827 455464 458394 463454 469612 476448 484559 494294 505013
62519 505013 516272 529104 545174 564941 587520 612243 639411 669381 701726 735697 770953
62508 770953 807500 845282 884048 923247 961697 997659 1029598 1056835 1079444 1097702 1111668
62497 1111668 1121016 1125188 1124027 1118413 1110036 1100552 1091182 1083137 1077847 1076555 1079996 1088714 1103327 1124244
62483 1124244 1151383 1184458 1223281 1267581 1316745 1370017 1426670 1485727 1545598 1604126 1658662
62472 1658662 1706026 1743014 1767703 1780263 1782053 1773854 1755059 1724387 1681080 1625651 1559998 1486875
62460A486875p7871q0452q1104p9641p6186p1517o6364o0797n4661m8207m1912
62449G48163l5904l0038k4461j9724j6288j4082j2525j0902q871o698m857l427
62437E60386k047m78J072K319L197L679L637L119K423J665N56j108l074m960o638
62422E63748p971q560q203p337o599o161n962o207o986p630p239n927m836m710
62408D69420n107n227m891m350l646k778k087j914k030j880j291n34K03R62J660
62393D36510K049K159K362K799L042K634J794J323J804L032M234M852N080N622
62379D79296O794Q016Q386P791P103P143P809Q476Q982R777J1181J2908J4423
62366E98085J5464J6224J7279J9285K2428K6094K9431L2376L5699L9903M4555
$$ plain form
62460 1486875 1409004 1328552 1247448 1167807 1091621 1020104 953740 892943 838282 790075 748163
62449 748163 712259 682221 657760 638036 621748 607666 595141 584239 575368 568670 563813 560386
62437 560386 558339 557861 558933 561252 564449 568128 571765 574884 577307 578972 579528 578420 575346 570386 563748
62422 563748 555777 547217 539014 531677 525078 518917 512955 506748 499762 492132 484893 478966 474130 469420
62408 469420 464313 459086 454195 449845 446199 443421 441334 439420 437390 435510 434219 433685 433888 434850 436510
62393 436510 438559 440718 443080 445879 448921 451555 453349 454672 456476 459508 463742 468594 473674 479296
62379 479296 486090 494106 502492 510283 517386 524529 532338 540814 549796 559573 570754 583662 598085
62366 598085 613549 629773 647052 666337 688765 714859 744290 776666 812365 852268 896823
62355H96823M9015N3351N7974O2669O6543O8820O9152O7251O2871N6261M8114
62344A558844L8834K8325J6767N099n592j4888k2919k9829l5814m1366m6839n1719
62332A398903n4799n5365n3874n1372m8462m5121m1337l7532l4221l1447k8819
62321I16554k6157k3878k2587k2391k2744k2968k2746k2162k1458k0758j9939
62310F68766j8787j7348j5988j4861j3537j1584r421p971p335o463m554k208o42
62297E38067p1M42J664L381M887N753N995N966O224P149Q477R478R708R330Q679
62282F25129P920P250O991P127P119O508N536M830M582M459M194L959M040M400
62268G04044M788N171N918P419R643J2103J4434J6836J9882K3870K8566L3515
$$ plain form
62355 896823 945838 999189 1057163 1119832 1186375 1255195 1324347 1391598 1454469 1510730 1558844
62344 1558844 1597678 1626003 1642770 1647869 1642277 1627389 1604470 1574641 1538827 1497461 1450622 1398903
62332 1398903 1344104 1288739 1234865 1183493 1135031 1089910 1048573 1011041 976820 945373 916554
62321 916554 890397 866519 843932 821541 798797 775829 753083 730921 709463 688705 668766
62310 668766 649979 632631 616643 601782 588245 576661 567240 559269 551934 545471 540917 538709 538067
62297 538067 537996 538438 540102 543483 548370 554123 560118 566084 572308 579457 587934 597412 607120 616450 625129
62282 625129 633049 640299 647290 654417 661536 668044 673580 678410 682992 687451 691645 695604 699644 704044
62268 704044 708832 714003 719921 727340 736983 749086 763520 780356 800238 824108 852674 886189
62256H86189L8420M3238M8086N3132N8265O2886O6265O8124O8523O7086O2899
62245A523113N5454M5367L3806K1681R708j185j0404j8443k6418l4702m2612m9476
62233A505889n5368o0525o4571o6789o6838o4912o1405n6709n1223m5338l9503
62222H72708l4280l0058k6660k3616k0845j8613j6777j4672j2120r899q715q225
62210F48228p643o837o088n180l704k063j212j231j155l85N23R79J396K489M097
62195F22214N423O151O674P327P982Q373Q405Q147P827P798Q260R045R863J0634
62181G34123J1373J1901J2045J1987J2069J2253J2116J1431J0516R940J0071J0949
62169H70774J2426J4374J6846K0059K4119K8849L3853L8721M3095M6723M9509
$$ plain form
62256 886189 924609 967847 1015933 1069065 1127330 1190216 1256481 1324605 1393128 1460214 1523113
62245 1523113 1578567 1623934 1657740 1679421 1689129 1687944 1677540 1659097 1632679 1597977 1555365 1505889
62233 1505889 1450521 1389996 1325425 1258636 1191798 1126886 1065481 1008772 957549 912211 872708
62222 872708 838428 808370 781710 758094 737249 718636 701859 687187 675067 665168 656453 648228
62210 648228 640585 633748 627660 622480 618776 616713 615501 614270 613115 612730 613253 614232 615628 618117 622214
62195 622214 627637 633788 640462 647789 655771 664144 672549 680696 688523 696321 704581 713626 723489 734123
62181 734123 745496 757397 769442 781429 793498 805751 817867 829298 839814 849754 859825 870774
62169 870774 883200 897574 914420 934479 958598 987447 1021300 1060021 1103116 1149839 1199348
62158A199348N1265N1392M9074M4078L7067K8964K0243J1183K414n341j1961j7918
62146A459808k3584k8946l3993l8780m3047m6162m7649m7519m6002m3262l9586
62135A021278l5477l1372k7355k3369j9547j6198j3574j1623r985q271o538n312
62123H12657m905m792m094k655j181j82O85J929L263L729K789Q66j144k749m030
62108H00186n091n598n140m050l404l963n371o733p701q477q967q639p252n192
62094G14608k964q35R15K003K626L401M553N629O269O720P295P889Q412R174J0279
62079G85974J1148J1318J1391J2382J4299J6095J7104J7801J9002K0773K2444
62068I59731K3410K3726K4011K4847K6172K7370K8139K9018L0739L3131L5080
$$ plain form
62158 1199348 1250613 1302005 1351079 1395157 1432224 1461188 1481431 1492614 1495028 1489687 1477726 1459808
62146 1459808 1436224 1407278 1373285 1334505 1291458 1245296 1197647 1150128 1104126 1060864 1021278
62135 1021278 985801 954429 927074 903705 884158 867960 854386 842763 832778 824507 817969 812657
62123 812657 807752 802960 798866 796211 795030 794848 795533 797462 800725 804454 807243 808109 806965 804216 800186
62108 800186 795095 789497 784357 780307 776903 772940 767569 760836 753135 744658 735691 727052 719800 714608
62094 714608 711644 710809 711724 713727 716353 719754 724307 729936 736205 742925 750220 758109 766521 775695 785974
62079 785974 797122 808440 819831 832213 846512 862607 879711 897512 916514 937287 959731
62068 959731 983141 1006867 1030878 1055725 1081897 1109267 1137406 1166424 1197163 1230294 1265374
62057A265374L5513L4129L1156K6836K1304J4700P354o4o661j1979j6506k1183
62045A379973k6412l1804l6940m1826m6387m9975n1811n1814n0639m8906m6720
62034H96739m3984m0786l7291l3416k9009k4387k0385j7632j5950j4683j3409
62023F05807j2078j0697r314q269p837p671p139o351o154o846p581p509o900o515
62009D94946o401o014n128l881k265l42J266K008K389L435N153O465O756O573
61995E04960O470O109N038L671K761K380J958J112o3j323k489l563m838o615q568
61980E07000r717r434q216p128o705o678o594o244n687n127m736m412l895l224
61966D19203k870l143l715m021l824l203k232j136m20m08o80m38N17J566K076
$$ plain form
62057 1265374 1300887 1335016 1366172 1393008 1414312 1429012 1436366 1436302 1429641 1417662 1401156 1379973
62045 1379973 1353561 1321757 1284817 1242991 1196604 1146629 1094818 1043004 992365 943459 896739
62034 896739 852755 811969 774678 741262 712253 687866 667481 649849 633899 619216 605807
62023 605807 593729 583032 573718 565449 557612 549941 542802 536451 530297 523451 515870 508361 501461 494946
62009 494946 488545 482531 477403 473522 471257 470915 472181 474189 476578 480013 485166 491631 498387 504960
61995 504960 511430 517539 522577 526248 529009 531389 533347 534459 534396 533073 530584 527021 522183 515568 507000
61980 507000 497283 487849 479633 472505 465800 459122 452528 446284 440597 435470 430734 426322 422427 419203
61966 419203 416333 413190 409475 405454 401630 398427 396195 395059 394639 394231 393551 393113 393630 395196 397272
61951C97272K111K264K910L820M510M890N475O739Q422R789J0609J1467J2874
61938D83152J4550J5886J6769J7498J8172J8622J8832J8889J8638J7827J6574
61927F75409J5211J3673J1503Q601N487K596k33l302o390q937j0749j2014j2744
61914F78111j2498j0999q686o382m409k310M02L507O304Q414J0007J1244J1912
61901F84617J1748J0877R637Q177O401M202J588j363m362o859q315q713q663q898
61887F90074r580j0141r928r012q153p856p782p392o865o843p452q199q800r433
61873E72638j0047j0129r502q709q154p475o208m588l153k009r97j77M48J330
61859E03268K820M578O117P635R585J1704J3330J4521J6015J8059K0057K1474
$$ plain form
61951 397272 399383 401647 404557 408377 412887 417777 423252 429991 438413 448202 458811 470278 483152
61938 483152 497702 513588 530357 547855 566027 584649 603481 622370 641008 658835 675409
61927 675409 690620 704293 715796 724397 729884 732480 732247 728945 722555 713618 702869 690855 678111
61914 678111 665613 654614 645928 639546 635137 632827 633229 636736 643040 651454 661461 672705 684617
61901 684617 696365 707242 716879 725056 731457 735659 737247 735884 731522 724663 716348 707635 698972 690074
61887 690074 680494 670353 660425 651413 643260 635404 627622 620230 613365 606522 599070 590871 582071 572638
61873 572638 562591 552462 542960 534251 526097 518622 512414 507826 504673 502664 501667 501490 501938 503268
61859 503268 506088 510666 516783 524418 534003 545707 559037 573558 589573 607632 627689 649163
61847F49163K2420K3189K3856K4432K4874K4783K3690K1647J9045J5893J1965
61836H84957P661L846O74k611o318r593j1402j1613j0599q465n270j513K191N592
61822H37537Q594J0958J2655J4034J5122J5209J3565J0265N858O64n091j0834
61810I28536j5981k0404k3978k6058k6125k4786k3323k2269k1089j9328j7407
61799F87788j6059j5485j5284j4926j4157j3157j2347j1888j1429j0551r352q260
61787E34893p469o854o309n757n003l978l095k840l106l354l383l386l315k803
61773D74241j847j013o82n95l59P1N83J175J649J525P61J67O07J883L031L620
61757D84817M202N272O293O231M931L484L044L556L913L240J677r6j628k779l514
$$ plain form
61847 649163 671583 694772 718628 743060 767934 792717 816407 838054 857099 872992 884957
61836 884957 892618 896464 897138 894527 888209 878616 867214 855601 845002 836537 831267 829754 831945 837537
61822 837537 846131 857089 869744 883778 898900 914109 927674 937939 943797 944461 939370 928536
61810 928536 912555 892151 868173 842115 815990 791204 767881 745612 724523 705195 687788
61799 687788 671729 656244 640960 626034 611877 598720 586373 574485 563056 552505 543153 534893
61787 534893 527424 520570 514261 508504 503501 499523 496428 493588 490482 487128 483745 480359 477044 474241
61773 474241 472394 471381 470699 470104 469745 469816 470399 471574 473223 474748 475509 475676 476283 478166 481197 484817
61757 484817 489019 494291 500584 506815 511746 515230 518274 521830 525743 528983 530660 530564 528936 526157 522643
61742E22643m013m766o023p222p457o486m935l520k556k222k569l094k813j374
61728D63593L00R58M65j08K24J389K532K932K592K142K265L031L816M000L637
61713D93768L246L077K887K473K017J672J186K11j053j948k109j878j890k469
61699D99190l563m926o127o622o278n740n827o483o846o428n734n326m914l988
61685D20388k954k787l557m150l745k868k600l150l770l786l196k371j567q72
61671C79015l34RJ40R7L7J07K20O2m31p86m80L52J016J151J225J890L039L930
61653C90259M156M145M507N160N448N011M145L369K885K584K230J562N59k62k00
61638D35558P74J817K203K111K046J909J301M58J05L43M48m1o55p91n69n72j070
$$ plain form
61742 522643 518630 513864 507841 500619 493162 486676 481741 478221 475665 473443 470874 467780 464967 463593
61728 463593 463893 464851 465316 465208 465432 466821 469353 472285 474877 477019 479284 482315 486131 490131 493768
61713 493768 497014 500091 502978 505451 507468 509140 510326 510537 509484 507536 505427 503549 501659 499190
61699 499190 495627 490701 484574 477952 471674 465934 460107 453624 446778 440350 434616 429290 424376 420388
61685 420388 417434 414647 411090 406940 403195 400327 397727 394577 390807 387021 383825 381454 379887 379015
61671 379015 378681 378690 378830 378927 378964 379071 379291 379353 378922 378136 377656 378008 379024 380175 381400 383290 386329 390259
61653 390259 394415 398560 403067 408227 413675 418686 422831 426200 429085 431669 433899 435461 436020 435758 435558
61638 435558 436332 438149 440352 442463 444509 446418 447719 448177 448282 448625 449073 449032 448377 447586 447017 446445 445375
61621D45375j919k854l516l519k925k393k463k886l036k863k915l481m103m137
61607D02365l487k719k530l182m334n313n620n231m486l808l426l295l227l185
61593C48522l388l893m251l835k640j415q96j142j689k076k066j668j158q74q78
61578C16653r40q98q14p05n02l42n00q84r73n42m1J0k62l64j46J63L97O11Q59
61559C10780J128J394J551J433J046O93P20J277K259L264L610K952J867J322J438
61544C36734J450J025P76J077J306R12M83Q48J754K287K230J986J604Q85K02J33
61528C55692M56M88K64L33M60k41j724k742k518j676j111q62o63o93j140j658
61512C42665j827j714j426p01N61J713J903R88l71j298j307o45j30k17l16M13
$$ plain form
61621 445375 443456 440602 437086 433567 430642 428249 425786 422900 419864 417001 414086 410605 406502 402365
61607 402365 398878 396159 393629 390447 386113 380800 375180 369949 365463 361655 358229 354934 351707 348522
61593 348522 345134 341241 336990 333155 330515 329100 328204 327062 325373 323297 321231 319563 318405 317531 316653
61578 316653 315713 314815 314001 313296 312794 312452 311952 311068 310095 309553 309512 309522 309260 308896 308750 308913 309310 309921 310780
61559 310780 311908 313302 314853 316286 317332 318025 318745 320022 322281 325545 329155 332107 333974 335296 336734
61544 336734 338184 339209 339985 341062 342368 343280 343763 344611 346365 348652 350882 352868 354472 355357 355559 355692
61528 355692 356148 356636 356900 357233 357693 357452 355728 352986 350468 348792 347681 346819 346156 345463 344323 342665
61512 342665 340838 339124 337698 336997 337558 339271 341174 342162 341791 340493 339186 338541 338411 338194 337878 338291
61496C38291J653K197J687J130J344J864J946J711J628J632J468J271J135P57
61482C59714J95K71J346K475K712K587L224M409M890M316L619L433L339K841K095
61467D01466J310L13q80j779k142k411l025l752m061l830l367k953k587k066j252
61452C68984l23L45O45Q51J016P20j81r23o12N61J578J876J642J048J09o63m57
61435C76216P20J889K285K091J751J341J006J201J922K373J947J069M37k1p05
61420C95522j241p53P84K284K838K682K615K848K847K169J073K32LJ52K46J17
61404D14418j80o43j276j845j973j581r91o45p71j301j846j870j213l73Jr4j32
61387C97685Q7J78j02m12l45qL05P00J527K792M036M794M898M407L513K563K001
$$ plain form
61496 338291 339944 342141 343828 344958 346302 348166 350112 351823 353451 355083 356551 357822 358957 359714
61482 359714 359909 360180 361526 364001 366713 369300 372524 376933 381823 386139 389758 393191 396530 399371 401466
61467 401466 402776 403089 402209 400430 398288 395877 392852 389100 385039 381209 377842 374889 372302 370236 368984
61452 368984 368661 369006 369651 370502 371518 372238 372057 371134 370522 371083 372661 374537 376179 377227 377336 376673 376216
61435 376216 376936 378825 381110 383201 384952 386293 387299 388500 390422 392795 394742 395811 396248 396227 395522
61420 395522 394281 393528 394312 396596 399434 402116 404731 407579 410426 412595 413668 413900 413903 414055 414301 414418
61404 414418 414238 413595 412319 410474 408501 406920 405929 405284 404513 403212 401366 399496 398283 397910 397911 397817 397685
61387 397685 397772 397950 397848 397436 397091 397083 397388 398088 399615 402407 406443 411237 416135 420542 424055 426618 428619
61370D28619K140K854L585L762L343K836K663K671K450J966J529J299J124R26
61356D61767Q28R30J225J730K391K920L075L076L393M059M576M481L689K381R37
61341E01458n0k36J3J06J27O58J670K339K151J535J093Q59O70N76M35l14j846
61324E11244l364l906l500k979k881l016k868k110p62Q12K227L504M871O108O682
61309E10062O755P315Q832J0494J1420J1902J2643J3279J2802J1163R345P862
61297F33874O201L956J584k98j683k872l956m908n788o487o778o752o892p416
61283E91785p936q001p626p045o300n400m548l855k958j388P50K717L894M301
61269E48390M333M129L493K458J560J325J666K145K675L504M497N113N326N823
$$ plain form
61370 428619 430759 433613 437198 440960 444303 447139 449802 452473 454923 456889 458418 459717 460841 461767
61356 461767 462595 463525 464750 466480 468871 471791 474866 477942 481335 485394 489970 494451 498140 500521 501458
61341 501458 501408 501172 501185 501291 501418 502076 503746 506085 508236 509771 510864 511723 512393 512969 513404 513090 511244
61324 511244 507880 503974 500474 497495 494614 491598 488730 486620 485858 486670 488897 492401 497272 503380 510062
61309 510062 516817 524132 532964 543458 554878 566780 579423 592702 605504 616667 626012 633874
61297 633874 640075 644031 645615 645317 643634 640762 636806 631898 626110 619623 612845 606093 599201 591785
61283 591785 583849 575848 568222 561177 554877 549477 544929 541074 538116 536728 537478 540195 544089 548390
61269 548390 552723 556852 560345 562803 564363 565688 567354 569499 572174 575678 580175 585288 590614 596437
61255E96437O829P337O298M197K534J952J733J149M11K0qM0K8k19j003k292l470
61238F21973l952l789l422l142l126l575m397m924m495l263k031j247n31O81K309
61223E83069L694M364M439M323M196M005L800L769L996M397M938N619O157O037
61209F46803N087L754K634J941J646J704J920J984J992K563L980N637O862P880
61195F96387R259J0752J1638J2005J2705J3933J4765J4361J2841J0630P812M558
61183H31646J566n22j713k295k395k274k525l469m699n685o429p165p818q232
61169G77991q547q861q910q562q263q376q500q139p710q049r067r783r739r477
61155F56008r388q910p351n004k862j543r21n99k47L10R28J024N7j788l679n039
$$ plain form
61255 596437 603266 610603 616901 621098 623632 625584 627317 628466 628877 628897 628889 628929 628957 628738 627735 625443 621973
61238 621973 618021 614232 610810 607668 604542 600967 596570 591646 587151 583888 581857 580610 580079 580760 583069
61223 583069 586763 591127 595566 599889 604085 608090 611890 615659 619655 624052 628990 634609 640766 646803
61209 646803 651890 655644 658278 660219 661865 663569 665489 667473 669465 672028 676008 681645 688507 696387
61195 696387 705646 716398 728036 740041 752746 766679 781444 795805 808646 819276 827088 831646
61183 831646 833212 832690 830977 828682 826287 824013 821488 818019 813320 807635 801206 794041 786223 777991
61169 777991 769444 760583 751673 743111 734848 726472 717972 709833 702123 694074 685007 675224 665485 656008
61155 656008 646620 637710 630359 625355 622493 620950 620029 619430 619183 619493 620421 621445 621502 619714 616035 610996
61139F10996o045p102q063q389p920p082o218n140l529j517M12J925L004L742
61125E59074M326N081O222P632R037J0370J1682J2868J3877J4949J6348J7905
61113F89371J9282K0496K1724K2734K3172K3287K3642K4099K3837K2546K0798
61102I34988J9006J6894J4321J1763R434O719L195n09l610o295r123j1850j3741
61089I71192j4697j5178j5321j5093j4923j5195j5290j4310j2646j1686j1768
61078H15085j1625j0222p993n791l637j321O42J630K063L009M846P010Q940J0584
61064H13220J2040J3365J4846J6948J9724K2608K4940K6635K8172L0061L2355
61053A054914L4710L6945L9387M2439M5847M8716N0467N1409N2154N2733N2605
$$ plain form
61139 610996 604951 597849 589786 581397 573477 566395 560177 555037 551508 549991 550403 552328 555332 559074
61125 559074 563400 568481 574703 582335 591372 601742 613424 626292 640169 655118 671466 689371
61113 689371 708653 729149 750873 773607 796779 820066 843708 867807 891644 914190 934988
61102 934988 953994 970888 985209 996972 1006406 1013125 1016320 1015811 1012201 1005906 996783 984933 971192
61089 971192 956495 941317 925996 910903 895980 880785 865495 851185 838539 826853 815085
61078 815085 803460 793238 785245 779454 775817 774496 775138 776768 778831 781840 786686 793696 802636 813220
61064 813220 825260 838625 853471 870419 890143 912751 937691 964326 992498 1022559 1054914
61053 1054914 1089624 1126569 1165956 1208395 1254242 1302958 1353425 1404834 1456988 1509721 1562326
61042A562326N1412M9299M6617M3651M0580L7312L3298K7986K1659J5501J0509
61031A940150O546K889m67k643l111k575k111j772o42J850N407R743J5323K2737
61017A991324L1809M1870N2641O4398P7534R2646J11096J35017J66681K07964
61007B972980K59948L22295L93193M70966N56280O52399P63265Q91898J040242
60998H323466J207419J383041J537804J620600J571988J354483R84327N40205
60990A8523333J35190j34176k28354j71514l1264J05828J52803M3699k37938o40963
60980A7516644j062411j395535j578250j609331j528796j386048j219418j052143
60972F684712q96102p55976o32606n25790m35379l60528k99229k49262k09078
$$ plain form
61042 1562326 1613738 1663037 1709654 1753305 1793885 1831197 1864495 1892481 1914140 1929641 1940150
61031 1940150 1946696 1949585 1949118 1946475 1943364 1940789 1938678 1936906 1936264 1938114 1943521 1953264 1968587 1991324
61017 1991324 2023133 2065003 2117644 2182042 2259576 2352222 2463318 2598335 2765016 2972980
61007 2972980 3232928 3555223 3948416 4419382 4975662 5628061 6391326 7283224 8323466
60998 8323466 9530885 10913926 12451730 14072330 15644318 16998801 17983128 18523333
60990 18523333 18658523 18524347 18295993 18124479 18093215 18199043 18351846 18395545 18157607 17516644
60980 17516644 16454233 15058698 13480448 11871117 10342321 8956273 7736855 6684712
60972 6684712 5788610 5032634 4400028 3874238 3438859 3078331 2779102 2529840 2320762
60963B320762j77381j52489j32745j17153j04895r4549q4608p4728o5754n8294
60953A258166n1843m5536l9292l3831k9847k7375k5851k4566k3149k1719k0548
60942I14609j9599j8602j7494j6513j5781j5144j4538j4228j4415j4887j5252
60931G38156j5334j5081j4325j2987j1413j0127r249q479p650o952o566o349o033
60918F07611n496m715l713k713k136k210k687l114l295l250k910k158j120j86
60904E67908L68N93O95Q39J093J381J449J062L00n83j496k538l614m399m771m995
60888E53292n296n557n681n965o732p835q782r279r313q884q082p306o988p017
60874D50575o795n915m535l129k165j958k292k287j184N64J640J529J273K094
$$ plain form
60963 2320762 2143381 1990892 1858147 1740994 1636099 1541550 1456942 1382214 1316460 1258166
60953 1258166 1206323 1160787 1121495 1087664 1057817 1030442 1004591 980025 956876 935157 914609
60942 914609 895010 876408 858914 842401 826620 811476 796938 782710 768295 753408 738156
60931 738156 722822 707741 693416 680429 669016 658889 649640 641161 633511 626559 619993 613644 607611
60918 607611 602115 597400 593687 590974 588838 586628 583941 580827 577532 574282 571372 569214 568094 567908
60904 567908 568276 568869 569564 570403 571496 572877 574326 575388 575688 575105 573609 571071 567457 563058 558287 553292
60888 553292 547996 542439 536758 530793 524061 516226 507444 498165 488852 479968 471886 464580 457592 450575
60874 450575 443780 437865 433330 430201 428036 426078 423786 421499 420315 420879 422519 424048 425321 427415
60860D27415L827N290N832N834N810N794N668N475N173M576L746L165L194L631
60846D94430L938L729K970J935J120Q75R11M28j025k954m432n062n189n321n615
60831D80738n842n658m901l856l176l223l552l349k502j897k403l806n021n214
60817D26338m515l683l322l476l749l730l390l143l458m312n115n222m561l715
60803C70947l352l502l507k780j611r38j156j539j169j98M09K74N2K93O11N08
60787C53342M45J246K730L733L607K948K590K635K803L134L717M143L919L242
60773C94234K772K598K080Q65m75j136j076r70j310j890k165j903j427j267j555
60758C87375j779j302k17O02M49l88j035j078q93r36j186j381j463j461j181l87
$$ plain form
60860 427415 431242 436532 442364 448198 454008 459802 465470 470945 476118 480694 484440 487605 490799 494430
60846 494430 498368 502097 505067 507002 508122 508997 509908 510336 509311 506357 501925 496863 491674 486353 480738
60831 480738 474896 469238 464337 460481 457305 454082 450530 447181 444679 442782 440379 436573 431552 426338
60817 426338 421823 418140 414818 411342 407593 403863 400473 397330 393872 389560 384445 379223 374662 370947
60803 370947 367595 364093 360586 357806 356195 355257 354101 352562 351393 351195 351604 351878 351930 352223 352834 353342
60787 353342 353787 355033 357763 361496 365103 368051 370641 373276 376079 379213 382930 387073 390992 394234
60773 394234 397006 399604 401684 402549 402074 400938 399862 398892 397582 395692 393527 391624 390197 388930 387375
60758 387375 385596 384294 384077 384679 385128 384740 383705 382627 381734 380798 379612 378231 376768 375307 374126 373739
60742C73739P35J588J669R12m32k044l675n111o086o204n193l381j716r22q41
60727C43038q98r69j280j571j217k97K81J23Q2R75K218K642K242K082K561K851
60711C52863K321J535J381J866K366K569K610K589K520K574K958L572M067M132
60697C89923L513K064J41j307j519p92k35o74j972l331l924l414k196j199j070
60682C74008j540j793j390o04J50P84J399J947K201J968J283N38L02Q17J593J803
60666C83466J104p5j076j639j951k284k638k647j909n72N24O61R7k49M7N32P62
60649C72153R61J526K252K627K588K476K350J900J066K81j40m55j100k013k660
60634C83812k713k438k347k555k640k224j525j132j213j242p20J02O00P09J014
$$ plain form
60742 373739 374474 376062 377731 378643 378211 376167 372492 367381 361295 355091 349898 346517 344801 343879 343038
60727 343038 342140 341171 339891 338320 337103 336806 337087 337210 337292 338267 340485 343127 345369 347451 350012 352863
60711 352863 355184 356719 358100 359966 362332 364901 367511 370100 372620 375194 378152 381724 385791 389923
60697 389923 393436 395500 395641 394334 392815 392023 391788 391114 389142 385811 381887 378473 376277 375078 374008
60682 374008 372468 370675 369285 368681 368831 369615 371014 372961 375162 377130 378413 378951 379253 380070 381663 383466
60666 383466 384570 384495 383419 381780 379829 377545 374907 372260 370351 369779 370303 370964 371061 370812 370859 371391 372153
60649 372153 373114 374640 376892 379519 382107 384583 386933 388833 389899 390180 390040 389585 388485 386472 383812
60634 383812 381099 378661 376314 373759 371119 368895 367370 366238 365025 363783 363063 363165 363765 364474 365488
60619C65488J821K564K456J451K95k66o9N29J034J150R81Q88J048J186R95O35
60603C82186N38P00O31J36k81m7O77J252J392J360J407J445J338J099P21J54l45
60586C94363k08P17J692J795J099O47J105J836J654M17o16j83J529L141L690L572
60570D16250L767M511N217N522N783O403P131P466P405P305P098O229M477K379
60556D96943O19p65k166l624m639m748m078l128k231j344l03Q91K117L351M648
60541D81543N879O710P084P574Q883J0905J2675J3526J3863J4451J5138J4942
60529F13173J3329J0841Q213N511K514n37l163n277p013q058p900o834o045o295
60515F02459o990o897n576l678k133j393j314j334p49Q15L047N217O852Q081R365
$$ plain form
60619 365488 367309 369873 372329 373780 374075 373809 373740 374269 375303 376453 377434 378322 379370 380556 381551 382186
60603 382186 382724 383424 384055 384191 383910 383863 384540 385792 387184 388544 389951 391396 392734 393833 394554 394708 394363
60586 394363 394155 394872 396564 398359 399458 400105 401210 403046 404700 405117 404501 404318 405847 408988 412678 416250
60570 416250 420017 424528 429745 435267 441050 447453 454584 462050 469455 476760 483858 490087 494564 496943
60556 496943 497562 496797 494631 491007 486368 481620 477542 474414 472183 470839 470536 471427 473544 476895 481543
60541 481543 487422 494132 501216 508790 517673 528578 541253 554779 568642 583093 598231 613173
60529 613173 626502 637343 645556 651067 653581 653044 649881 644604 637591 629533 621633 614799 608754 602459
60515 602459 595469 588572 582996 579318 577185 575792 574478 573144 572395 573210 576257 581474 588326 596407 605772
60500F05772J1117J3517J6516J9871K3251K6246K8442K9664L0255L0787L1267
60489H66705L0888K8888K5498K1669J7974J4204R999N364M73m684j0169j5906
60477I90903k1716k7333l2242l5785l7591l7767l6626l4465l1696k8862k6284
60466F40536k3917k1686j9671j7812j5784j3484j1358r882q840p670o343n461
60454D78628n324n425n112m480m184m423m549l942k996k794l687m657m451l074
60440D19530j707j142r36k92O88J129M64r43k194k524j704j71J206J766J550J072
60424D15792O28O1p72j532j641r29N7N12J70m57o72k53O05J736K962L773L635
60407D23675K760K071K100K346K067J305O87N91R93J850K984L764L556K562J699
$$ plain form
60500 605772 616889 630406 646922 666793 690044 716290 744732 774396 804651 835438 866705
60489 866705 897593 926481 951979 973648 991622 1005826 1015825 1021189 1021662 1016978 1006809 990903
60477 990903 969187 941854 909612 873827 836236 798469 761843 727378 695682 666820 640536
60466 640536 616619 594933 575262 557450 541666 528182 516824 506942 498102 490432 484089 478628
60454 478628 473304 467879 462767 458287 454103 449680 445131 441189 438193 435399 431712 427055 422604 419530
60440 419530 417823 416681 415745 415453 416141 417270 417734 416791 414597 412073 410369 410198 411404 413170 414720 415792
60424 415792 416420 416481 415709 414177 412536 411607 411664 412176 412346 411889 411217 410964 411569 413305 416267 420040 423675
60407 423675 426435 428506 430606 432952 435019 436324 437011 437602 438595 440445 443429 447193 450749 453311 455010
60392D55010J505J664J709J650J742K029K392K780L100L106K676K031J501J202
60378D84097J069J087J268J466J464J294J385K162L456M419M266L147K009J558
60364E14147J638J779J889K063K118J880J771K421L824N391O802Q178R407J0014
60350E73322R964R884J0109J0066R000O961M564K201q1k181l955n437o669p415
60336F10333p459p065o708o456n952n018l891k887k111j594j424j668k229k843
60322E53028l141k898k395k217k431k168n39K105M339N252N439O120P630R223
60308E77347J0177J0653J1187J1747J1661J0558Q955P688O864N799L911J268j784
60295F76031n004p944r885j0643j1113j2204j3394j3226j1322r046p708o966n664
$$ plain form
60392 455010 456515 458179 459888 461538 463280 465309 467701 470481 473581 476687 479363 481394 482895 484097
60378 484097 485166 486253 487521 488987 490451 491745 493130 495292 498748 503167 507433 510580 512589 514147
60364 514147 515785 517564 519453 521516 523634 525514 527285 529706 533530 538921 545723 553901 563308 573322
60350 573322 583286 593170 603279 613345 622345 629306 633870 636071 635990 633809 629854 624417 617748 610333
60336 610333 602874 595809 589101 582645 576693 571675 567784 564897 562786 561192 559768 558100 555871 553028
60322 553028 549887 546989 544594 542377 539946 537778 537239 539344 543683 548935 554374 560494 568124 577347
60308 577347 587524 598177 609364 621111 632772 643330 652285 659973 666837 672636 676547 677815 676031
60295 676031 671027 663083 653198 642555 631442 619238 605844 592618 581296 572250 564542 557576 551912
60282E51912l706k029r87Q6J478K224J341o82k360k947k997l318l991m599m792
60267E24633m421l520k526k145k695l744m607m959m751l939k744j900j981k536
60253D78165k475j426k13J37m80j332j602r38L51J415J532R24N88J052J708J699
60237D79105J072N19L07L2n97j282j493r43K64J606K360K277K034K497L515M019
60221D95292L470K631K532L191L853M191M635N559O681P447P689P740Q029Q655
60207E71595R346R719R636R275Q867Q486Q133P841P582P228O765O411O340O360
60193F83584O126N514M595L338J713pj421k530l698m971n895o217o419p120q202
60178F58390q911q770p992p101o438o053n769n289m530l863l699l860l746l187
$$ plain form
60282 551912 548206 546177 545190 545276 546754 548978 550319 549637 547277 544330 541333 538015 534024 529425 524633
60267 524633 520212 516692 514166 512021 509326 505582 500975 496016 491265 487326 484582 482682 480701 478165
60253 478165 475690 474264 474051 474188 473708 472376 470774 469836 470187 471602 473134 474058 474646 475698 477406 479105
60237 479105 480177 480696 481003 481035 480438 479156 477663 476720 476984 478590 480950 483227 485261 487758 491273 495292
60221 495292 498762 501393 503925 507116 510969 515160 519795 525354 532035 539482 547171 554911 562940 571595
60207 571595 580941 590660 600296 609571 618438 626924 635057 642898 650480 657708 664473 670884 677224 683584
60193 683584 689710 695224 699819 703157 704870 704863 703442 700912 697214 692243 686348 680131 673712 666592 658390
60178 658390 649479 640709 632717 625616 619178 613125 607356 602067 597537 593674 589975 586115 582369 579182
60164E79182k733k857l267l387l153k914k687k107j143m04m54j045j340p78M26
60149E51339J561K093K049J880J906J995J761J181P95J271K713M544O025O839
60135E87952P217P570Q107Q782R380R651R443Q903Q392Q067P589O495M902L509
60121F95959K855K732K556K134J820J993K564L049L034K544J987J690J569J329
60107G27815R49O98O56M94j61j298k529l373l577l380l505m460n755o269n567
60092F90738m402l667l443l406l566l912l852k855j444o51o20n61j01K07m9m34
60076F57982m01p9J00k9n12j496k852l989m591n090o052p371q462q969q858q160
60060E91171p106o240n934n867n522m943m566m388l870k735j398l84L05J060K042
$$ plain form
60164 579182 576449 573592 570325 566938 563785 560871 558184 556077 554934 554530 554076 553031 551691 550913 551339
60149 551339 552900 554993 557042 558922 560828 562823 564584 565765 566560 567831 570544 575088 581113 587952
60135 587952 595169 602739 610846 619628 629008 638659 648102 657005 665397 673464 681053 687548 692450 695959
60121 695959 698814 701546 704102 706236 708056 710049 712613 715662 718696 721240 723227 724917 726486 727815
60107 727815 728764 729462 730118 730612 730451 729153 726624 723251 719674 716294 712789 708329 702574 696305 690738
60092 690738 686336 682669 679226 675820 672254 668342 664490 661635 660191 659540 658920 658359 658258 658465 658416 657982
60076 657982 657581 657502 657602 657573 657061 655565 652713 648724 644133 639043 632991 625620 617158 608189 599331 591171
60060 591171 584065 577825 571891 566024 560502 555559 550993 546605 542735 540000 538602 538218 538523 539583 541625
60045E41625K963L507L801M364N489O794P565P520P015O476N970N471N115M963
60031F18638M692L928K727J525O01j62j076k334l798n073n921o601p576q824r820
60016E80926j0319j0662j1068j1094j0305r069q114p508o700n463m159l035j846
60003D81584m66O40R04L36n27j223j578j510r57p9P58J384K019K905L791M141
59987D92122L880L631L932M545M842M601M077L469K857K444K255J716K29j753
59973E32847k982k888k143j571j341j466k129k962k884j475J81Q98R49J362K205
59958E16601K693K706K954L638M069L780L094K300J195k59j500k041k087k099
59944E35044k162k067j734j268q35o00o11p67j050j621k407k838k404j309q9J093
$$ plain form
60045 541625 544588 548095 551896 556260 561749 568543 576108 583628 590643 597119 603089 608560 613675 618638
60031 618638 623330 627258 629985 631510 632111 631949 630873 628539 624741 619668 613747 607146 599570 590746 580926
60016 580926 570607 559945 548877 537783 527478 518409 510295 502787 496087 490624 486465 483430 481584
60003 481584 481118 481758 482662 482998 482471 481248 479670 478160 477203 477124 477882 479266 481285 484190 487981 492122
59987 492122 496002 499633 503565 508110 512952 517553 521630 525099 527956 530400 532655 534371 534600 532847
59973 532847 529865 526977 524834 523263 521922 520456 518327 515365 512481 511006 511187 512085 513034 514396 516601
59958 516601 519294 522000 524954 528592 532661 536441 539535 541835 543030 542771 541271 539230 537143 535044
59944 535044 532882 530815 529081 527813 526978 526378 525767 525000 523950 522329 519922 517084 514680 513371 513282 514375
59928E14375K252L076L405L915N342P128P864P112N813M702L512K015P74K16q9
59913E71412n27o98k18M23O49P97J484K507L176L353L323L011K152J096N51N73
59897E93064N00o6q11j285j403j368j423j610j447j73K239M614N796O072O555
59882F09254P403P650O959O396O933Q034Q482Q101P703P629P262O098M578L411
59868G05893K588J564K61p02q57o21q11j668k660l256l538l863m161l928k911
59853F81330j564o21k60O9Q81J956K616K637K427K263J774N03j323k994m047m404
59837F81243m039l070k052j639j914k518l341m492n503n389l818j666o6O48P51
59822F43135M78P1l6L11N30r7j464k769l467l631l396k565j055N49J257O05p68
$$ plain form
59928 514375 516627 519703 523108 527023 532365 539493 547357 554469 560282 564984 568496 570511 571285 571501 571412
59913 571412 570885 570187 569969 570392 571041 571838 573322 575829 579005 582358 585681 588692 590844 591940 592491 593064
59897 593064 593564 593498 592687 591402 589999 588631 587208 585598 584151 583978 586217 590831 596627 602699 609254
59882 609254 616657 624307 631266 637662 644595 652629 661111 669212 676915 684544 691806 697904 702482 705893
59868 705893 708481 710045 710306 709604 708747 708126 707315 705647 702987 699731 696193 692330 688169 684241 681330
59853 681330 679766 679145 678885 678954 679835 681791 684407 687044 689471 691734 693508 694011 692688 689694 685647 681243
59837 681243 677204 674134 672082 670443 668529 666011 662670 658178 652675 647286 643468 641802 641736 642384 643135
59822 643135 643613 643684 643648 643959 644489 644392 642928 640159 636692 633061 629665 627100 626045 626594 627851 628456 627688
59805F27688j706j773j658k161l054l473l210k960l211l602l643l425l300l332
59791E87180l488l870m329m351l735l022k785k855k721k366k151k160k187k142
59777E45018k052j830j417r20l24O13J868K932L532M032M723N194N054M747M897
59762E76067N269N220M864M886N388N840O057O351O707O759O646O956P703Q211
59748F62924Q258Q454R157R851R933R443Q561P190N459M024L251K618J509J33
59734G50765q95j495k085k863l641m212m426m154l585l316l674m114l778k615
59720G05912j425q40p24o93p30j050j607k081k319k527k882l129k760j616r6J304
59704F82737K380L044L081K517J983K241L262M243M571M420M293M471M973N699
$$ plain form
59805 627688 625982 624209 622551 620390 617336 613863 610653 607693 604482 600880 597237 593812 590512 587180
59791 587180 583692 579822 575493 571142 567407 564385 561600 558745 556024 553658 551507 549347 547160 545018
59777 545018 542966 541136 539719 538799 538475 539088 540956 543888 547420 551452 556175 561369 566423 571170 576067
59762 576067 581336 586556 591420 596306 601694 607534 613591 619942 626649 633408 640054 647010 654713 662924
59748 662924 671182 679636 688793 698644 708577 718020 726581 733771 739230 743254 746505 749123 750632 750765
59734 750765 749870 748375 746290 743427 739786 735574 731148 726994 723409 720093 716419 712305 708527 705912
59720 705912 704487 703647 702923 702230 701500 700450 698843 696762 694443 691916 689034 685905 683145 681529 681433 682737
59704 682737 685117 688161 691242 693759 695742 697983 701245 705488 710059 714479 718772 723243 728216 733915
59690G33915O299O289N520M333L007J416n91k651m041m292l533k469k047k759
59676G38396m137n171n424n375n533n697n478n100n042n142m761l826l066l001
59662F71643l196k855j796m64P73J896K846L356L348L218L427M022M744N443O032
59647G02437O157N428L992K453J076m51k300m042n314o362p417q019p674o919
59633F73045o859p643q268p921o811n499m203l093k601k832l224l263l260l784
59619F03784m661n091m723m120m013m458m903m903m589m316m071l464k361j127
59605E46984l8J095K303K887K239R94M63Q47R94J63q82j001j27J008J920K496
59589E62345K575K182J778J664J497R46M44M66M79m38k119l332l420l005k824
$$ plain form
59690 733915 740214 746503 752023 756356 759363 760779 760188 757537 753496 749204 745671 743202 741155 738396
59676 738396 734259 729088 723664 718289 712756 707059 701581 696481 691439 686297 681536 677710 674644 671643
59662 671643 668447 665592 663796 663332 664105 666001 668847 672203 675551 678769 682196 686218 690962 696405 702437
59647 702437 708594 714022 718014 720467 721543 721092 718792 714750 709436 703074 695657 687638 679964 673045
59633 673045 666186 658543 650275 642354 635543 630044 625841 622748 620147 617315 614091 610828 607568 603784
59619 603784 599123 594032 589309 585189 581176 576718 571815 566912 562323 558007 553936 550472 548111 546984
59605 546984 546946 548041 550344 553231 555470 556464 556927 557774 558768 558931 558049 557048 556921 557929 559849 562345
59589 562345 564920 567102 568880 570544 572041 572987 573431 573897 574376 573938 571819 568487 565067 562062 559238
59574E59238k722k216j489j239j815k916l994m566m338l359k103j135o72n18m50
59559E25706m88o80q32o53k45j17m94q88o59J38R55J612K421L392M021M144M309
59542E41642M948N735O274O888Q146R982J1945J4026J6420J8543J9011J6744J1822
59529F92126N375r16n436p461p533o666n289l345j238J32L67L9q7J32K90p0j173
59512F59247k858m531n649o251o759p298p612p618p491p185o388n176m187l917
59498E76327m168m414m319l770k801j716r25m54K0N92R59J076J361K044K741L049
59482E65602L147L417L849M250M695N288N818O091O378O963P446P113N950M720
59468F40727L972L468K750J803R24K19m57j128j542j415p78K5O90J327K252L455
$$ plain form
59574 559238 556516 554300 552811 551572 549757 546841 542847 538281 533943 530584 528481 527346 526674 526156 525706
59559 525706 525218 524538 523706 523053 522808 522691 522197 521309 520650 520788 521743 523355 525776 529168 533189 537333 541642
59542 541642 546590 552325 558599 565487 573633 583615 595560 609586 626006 644549 663560 680304 692126
59529 692126 697501 696585 691149 683688 676155 669489 664200 660855 659617 659749 660116 660155 660068 660200 660490 660420 659247
59512 659247 656389 651858 646209 639958 633199 625901 618289 610671 603180 595995 589607 584431 580244 576327
59498 576327 572159 567745 563426 559656 556855 555139 554214 553760 553780 554372 555331 556407 557768 559812 562553 565602
59482 565602 568749 572166 576015 580265 584960 590248 596066 602157 608535 615498 622944 630057 636007 640727
59468 640727 644699 648167 650917 652720 653644 653863 653406 652278 650736 649321 648543 648568 649258 650585 652837 656292
59452F56292M527N244N917O850P738P996P534O749N809M476K701Q96p07k459m659
59437G14904o769p819p582o876o559o581o321n586m867m604m541m017k743j035
59423F39004O24K089L608N481P763J0207J2499J4600J6774J9190K1553K3347K4419
59410H01158K5151K5993K6894K7062K5118J9735J0734n3r418j4711j5369j2561
59398I09733p762j923M240R778J3401J3671R548J400q409j6600k1206k2579k2116
59385H61176k0480j7629j4032j0797q473o588m829l804l998m598m327l224k473
59372G55924k519k396j410m17o82k128l502l964l632k873j914j052m48K90J571
59357G30848K913L417L201L465M840O611P998R274J0900J2386J2988J3021J3521
$$ plain form
59452 656292 660819 666063 671980 678830 686568 694564 702098 708847 714656 719132 721833 722729 722022 719563 714904
59437 714904 708135 700316 692734 685858 679299 672718 666397 660811 655944 651340 646799 642782 640039 639004
59423 639004 639628 641717 645325 650806 658569 668776 681275 695875 712649 731839 753392 776739 801158
59410 801158 826309 852302 879196 906258 931376 951111 961845 961792 952374 937663 922294 909733
59398 909733 901971 900048 904288 914066 927467 941138 950686 952086 943677 927077 905871 883292 861176
59385 861176 840696 823067 809035 798238 789765 783177 778348 774544 770546 765948 761621 758397 755924
59372 755924 753405 751009 749599 749182 748500 746372 742870 738906 735274 732401 730487 729435 728987 729277 730848
59357 730848 733761 737178 740379 743844 748684 755295 763293 772567 783467 795853 808841 821862 835383
59344H35383J4746J6006J6762J7118J7112J6444J5071J3409J1708R773P505N181
59332I96218K930M76k325n145p653r889j1892j3466j4646j5907j7398j8393j8078
59319H64832j6625j4943j3603j2555j1741j1260j0904j0218r142q123p340o404
59307G31974n100l949l472l268k380m68J866L957N692P076P557O237K725k333
59293G46114p601j1791j4272j5134j4820j3708j2058j0216q590p259n826l959
59281F20880j967m97L04R66J913K968L892N014O788Q891J0430J1146J1853J3301
59267F95882J5057J5917J5251J3527J1611R971Q571P195N719M193K730J240n57
59254H06307k655m424n166m980m637m551m277l310j853m86O62J876L188M225M736
$$ plain form
59344 835383 850129 866135 882897 900015 917127 933571 948642 962051 973759 983532 991037 996218
59332 996218 999148 999624 997299 992154 984501 974612 962720 949254 934608 918701 901303 882910 864832
59319 864832 848207 833264 819661 807106 795365 784105 773201 762983 753841 745718 738378 731974
59307 731974 726874 722925 719453 716185 713805 713337 715203 719160 724852 731928 739485 745722 748447 746114
59293 746114 738513 726722 712450 697316 682496 668788 656730 646514 637924 630665 624839 620880
59281 620880 618913 618416 618720 619686 621599 624567 628459 633473 640261 649152 659582 670728 682581 695882
59267 695882 710939 726856 742107 755634 767245 777216 785787 792982 798701 802894 805624 806864 806307
59254 806307 803652 799228 794062 789082 784445 779894 775617 772307 770454 769968 770630 772506 775694 779919 784655
59239G84655M815M581M053L528L636M583N583N463L860J551m69j932l198m534
59225H16175n828o977q116r289j0185j0514j0525j0753j1267j1574j1323j0708
59213F99116r943q815p137n401m393m238m322m117l636k962j943o62K77L94N5
59198F42273N4O19J300J808K458L569M862N773O200O484O750O692O160N605N625
59183G06232O209O795O952O687O089N224M357L852L538K782J557Q39J221J632
59169G63966M85j992l763l571k491k263l018l586l377k897k658k657l010m039
59155G25129n507o533o688o546o770p283p763q349r103r301q111n925m220l932
59141F29098m626n376n886o313o517o083m953l636k674k179j873j455r78q36j202
$$ plain form
59239 784655 789470 794051 798104 801632 805268 809851 815434 820897 824757 826308 825839 823907 820709 816175
59225 816175 810347 803370 795254 785965 775780 765266 754741 743988 732721 721147 709824 699116
59213 699116 689173 680358 673221 667820 663427 659189 654867 650750 647114 644152 642209 641547 641824 642218 642273
59198 642273 642327 642946 644246 646054 648512 652081 656943 662716 668916 675400 682150 688842 695002 700607 706232
59183 706232 712441 719236 726188 732875 738964 744188 748545 752397 755935 758717 760274 761113 762334 763966
59169 763966 764451 762459 758696 755125 752634 750371 747353 743767 740390 737493 734835 732178 729168 725129
59155 725129 719622 713089 706401 699855 693085 685802 678039 669690 660587 651286 643175 637250 633030 629098
59141 629098 624472 619096 613210 606897 600380 594297 589344 585708 583034 580855 578982 577527 576549 575713 574511
59126E74511j397l29K138M609N612N336N239O007O895P281P804R250J1104J2183
59112F56243J2277J2187J2288J2132J1493J0732R942Q605O662N066M621M822M585
59099G71655L626K422J090p13k754l963l686k656k225k821l581l502k551j505
59085G48836r58q79j123j852l070m190m610m731n556p203q448q198o886n897n925
59070F79310o477o688o169n123m153l816m045m059l261k072j490j918k851l608
59056F23580l833l426k534j754j764k533l309l503l253k890k351j440l47M53P35
59041E91831O66N13M00L17K56K92N27Q61R43O13M22J250L178N079N743N347N310
59024F23548O698R131J1417J2961J4102J5231J6148J6446J6130J5470J4437J2694
$$ plain form
59126 574511 573114 572785 574923 579532 585144 590480 595719 601726 608621 615902 623706 632956 644060 656243
59112 656243 668520 680707 692995 705127 716620 727352 737294 745899 752561 757627 762248 767070 771655
59099 771655 775281 777703 778793 778080 775326 771363 767677 765021 762796 759975 756394 752892 750341 748836
59085 748836 747878 746999 745876 744024 740954 736764 732154 727423 721867 714664 706216 698018 691132 685235 679310
59070 679310 672833 666145 659976 654853 650700 646884 642839 638780 635519 633447 631957 630039 627188 623580
59056 623580 619747 616321 613787 612033 610269 607736 604427 600924 597671 594781 592430 590990 590643 591096 591831
59041 591831 592497 593010 593410 593727 593983 594275 594802 595663 596606 597219 597641 598891 602069 607148 612891 618238 623548
59024 623548 630246 639377 650794 663755 677857 693088 709236 725682 741812 757282 771719 784413
59012G84413J0050O657K841r02l885n710o720p484p879p385o230n327m786l544
58998G44109j107J310K306K240K477L241L496K776J736Q23l40j810k793k906k986
58983G52572l863m970n094m046k736j808r77J66J424K282K691L257M635O802R027
58968G59362J0563J1253J1351J1102J0804J0889J1362J1436J0365Q576P114O018
58956H80195M207J201k034m442o188p992r911j1582j3048j4374j4956j4160j2483
58943G74433j1183j0734j0439r571q119o326m214j984k94K40l40j468k560l317
58929G04124l726l924l952l676l026k197j482j064j085j672k570l094k851k254
58915F67551j897j616q58J79O04J01m80j69J070K591L881M806N487O382Q026J0285
$$ plain form
59012 784413 794463 801120 803961 803059 799174 793464 786744 779260 771381 763996 757766 752439 747653 744109
58998 744109 743002 744312 746618 748858 751335 754576 758072 760848 762584 763407 763067 761257 758464 755558 752572
58983 752572 748709 743739 738645 734599 731863 730055 729078 729244 730668 732950 735641 738898 743533 750335 759362
58968 759362 769925 781178 792529 803631 814435 825324 836686 848122 858487 867063 874177 880195
58956 880195 884402 885603 883569 879127 872939 864947 855036 843454 830406 816032 801076 786916 774433
58943 774433 763250 752516 742077 732506 724387 718061 713847 711863 711569 711809 711469 710001 707441 704124
58929 704124 700398 696474 692522 688846 685820 683623 682141 681077 679992 678320 675750 672656 669805 667551
58915 667551 665654 664038 663180 663359 663963 664064 663584 663415 664485 667076 670957 675763 681250 687632 695658 705943
58899G05943J2203J3089J3446J4221J5369J5885J5275J4190J3418J2925J2367
58888H58331J2065J2741J4444J6259J7204J7077J6320J5337J4123J2431J0150
58877A016482P529M987K665L59k037m253o036p579r131j0395j0842j0618j0440
58864I60691j0480j0027q622o931n959n825n935n986o200o783p728r020j0483
58851H60712j1618j2049j1987j1738j1029r533p777o715o437o211n815n950p015
58838G46838q388r275r580r503r011q228p732p874q209q091p444o558n536m420
58824F36989l487k904k419j762j007k43P60K094L317L972M153M083L629K784K221
58809F52180K618L610M071L407J995M84p57j584j994k187k345k376k225k227k758
$$ plain form
58899 705943 718146 731235 744681 758902 774271 790156 805431 819621 833039 845964 858331
58888 858331 870396 883137 897581 913840 931044 948121 964441 979778 993901 1006332 1016482
58877 1016482 1024011 1028998 1031663 1032022 1029985 1025732 1019696 1012117 1002986 992591 981749 971131 960691
58864 960691 950211 940184 931562 924631 918672 912847 906912 900926 894726 887943 880215 871195 860712
58851 860712 849094 837045 825058 813320 802291 792758 784981 778266 771829 765618 759803 753853 746838
58838 746838 738450 729175 719595 710092 701081 692853 685121 677247 669038 660947 653503 646945 641409 636989
58824 636989 633502 630598 628179 626417 625410 625167 625927 628021 631338 635310 639463 643546 647175 649959 652180
58809 652180 654798 658408 662479 665886 667881 668365 667608 666024 664030 661843 659498 657122 654897 652670 649912
58794F49912l643m358m664m632m232l397k404j601q45K92J806L237M406N606O991
58779F42474Q273R151R728J0196J0475J0239R227P464N322L191R50j986n711r217
58765G09776j1257j1700j1500j1377j1159j0432r225p835o455n201m105k911j274
58752F05345O01J933K195J672R87M54J60L03R33J594J707J323J153J730K814L775
58736F28679M357M887N682O503O802O448N946N868O190O410O254N933N680N273
58722G10912M277K797J654J663K747M086N029N599O019O279O463P017Q137R128
58708G81807R011P611N495K995R1k835n058o563q204j0502j3026j5244j7207j8898
58694G09473j9760j9456j8490j7470j6315j4752j2997j1310r512p581o171n765
$$ plain form
58794 649912 646269 641911 637247 632615 628383 624986 622582 620981 620136 620428 622234 625471 629877 635483 642474
58779 642474 650747 659898 669626 679822 690297 700536 709763 717227 722549 725740 726690 724704 718993 709776
58765 709776 698519 686819 675319 663942 652783 642351 633126 625291 618836 613635 609530 606619 605345
58752 605345 605946 607879 610074 611746 612733 613187 613347 613650 614583 616177 617884 619207 620360 622090 624904 628679
58736 628679 633036 637923 643605 650108 656910 663358 669304 675172 681362 687772 694026 699959 705639 710912
58722 710912 715189 717986 719640 721303 724050 728136 733165 738764 744783 751062 757525 764542 772679 781807
58708 781807 790818 798429 803924 806919 807010 804175 799117 792554 784350 773848 760822 745578 728371 709473
58694 709473 689713 670257 651767 634297 617982 603230 590233 578923 569411 561830 555659 549894
58682E49894n834n616n115m578l663k105p06m64j038j174m69M51J249K259L577
58667E26668M921O443Q547J0842J2398J3217J4217J5360J5021J1943O935J950
58655F48462j931m935p534r730j1158j1557j1134j0540j0222r786q505o467m697
58642E40266m109m672n675o261n772m157k196p22L00J423K560L052K879K862L359
58627E23137L572K639Q09q76j615j347o33k87o12r31l34J085K380L064L498L914
58611E37463M005L751L748M255M674M415L608K590J454N26N05J519K637K907K345
58596E80402J491N42m75j267j561j515j336r23j84P41J918L660N736P245P792
58581F02266Q122Q934R697R562Q863Q705R201R277Q345P339P588R157J0920J2039
$$ plain form
58682 549894 544060 538444 533329 528751 525088 522983 522277 521813 520775 519601 519132 519583 520832 523091 526668
58667 526668 531589 538032 546579 557421 569819 583036 597253 612613 627634 639577 646512 648462
58655 648462 646531 641596 634062 624332 613174 601617 590483 579943 569721 559935 551430 544963 540266
58642 540266 536157 531485 525810 519549 513777 509620 507424 506702 507002 508425 510985 514037 516916 519778 523137
58627 523137 526709 529348 530157 529281 527666 526319 525686 525399 524787 523856 523522 524607 526987 530051 533549 537463
58611 537463 541468 545219 548967 553222 557896 562311 565919 568509 569963 570489 570994 572513 575150 578057 580402
58596 580402 581893 582435 581960 580693 579132 577617 576281 575358 575174 575915 577833 581493 587229 594474 602266
58581 602266 610388 619322 629019 638581 647444 656149 665350 674627 682972 690311 697899 707056 717976 730015
58567G30015J2873J4174J5908J7412J8726K0885K4391K8092L0385L1134L1396
58556I75391L1545L0811K8644K5259K0703J4678P805J854k060m576o785q669r659
58543A104941r851r795r701r748j0627j2893j6155j9594k2872k5825k7775k8106
58531I01999k7239k6197k5328k4071k1876j8810j5370j2200r819q241p030n934
58519F99884n214n024m965m628m156l853l697l598l678l849l627k840j979j468
58505F47308j081n75k66l53l47J33N15J12o98r26l98K07N13R24J855L139M188
58488F54250M498M113L853M711O678Q593R525R847J0545J1989J3915J6038J8080
58475G76635J9549K0138K0010J9174J7118J3599R251M771P5m939r346j1899j2539
$$ plain form
58567 730015 742888 757062 772970 790382 809108 829993 854384 882476 912861 943995 975391
58556 975391 1006936 1037747 1066391 1091650 1112353 1127031 1134836 1136690 1134630 1130054 1123269 1114600 1104941
58543 1104941 1095090 1085295 1075594 1065846 1055219 1042326 1026171 1006577 983705 957880 930105 901999
58531 901999 874760 848563 823235 799164 777288 758478 743108 730908 721089 712848 705818 699884
58519 699884 694670 689646 684681 680053 675897 672044 668347 664749 661071 657222 653595 650755 648776 647308
58505 647308 646227 645652 645386 645033 644686 644819 645334 645446 644748 643822 643424 643631 644144 645068 646923 650062 654250
58488 654250 658748 662861 666714 671425 678103 686696 696221 706068 716613 728602 742517 758555 776635
58475 776635 796184 816322 836332 855506 872624 886223 895474 900245 900320 895381 886035 874136 861597
58462H61597j2276j1692j0422q107n120k189K46K338M706P900J1605J4661J6161
58449H69408J6175J5171J3151R886N574P52m162q848j2868j5813j7369j7223j5432
58436H38402j2981j1137j0009q512o083l457j335N67K560M171N089N934P170Q201
58422H18580Q513Q781R691J0479R832P670M948K254m19l053n694q521j1026j1943
58408H40092j0999r773r701j0125r549p940o317m971l643k765k778k736j409O43
58394G58029J762J744J920K893L923M611N423O246O013M259J958L61p7M28J228
58379H00721J385M66p91j385j332j187q10K54J565K346K944M397O711Q854J0345
58364H34483J1569J2665J3355J3798J4464J5190J5449J5357J5346J5166J4264
$$ plain form
58462 861597 849321 837629 827207 819100 813980 811791 812037 814375 819081 826981 838586 853247 869408
58449 869408 885583 900754 913905 923791 929365 930117 925955 917107 904239 888426 871057 853834 838402
58436 838402 825421 814284 804275 795763 789680 786223 784888 785455 788015 792186 797275 803209 810379 818580
58422 818580 827093 835874 845565 856044 865876 873546 878494 880748 880329 877276 871582 863061 852035 840092
58408 840092 829093 819320 809619 799494 789945 782005 775688 770717 767074 764309 761531 758795 757386 758029
58394 758029 759791 761535 763455 766348 770271 774882 780305 786551 792564 796823 798781 799142 799065 799493 800721
58379 800721 802106 802572 801781 800396 799064 797877 797067 797321 798886 801232 804176 808573 815284 824138 834483
58364 834483 846052 858717 872072 885870 900334 915524 930973 946330 961676 976842 991106
58353I91106J2847J1417R751P469N069L179J479k61j015J1J596K116K221L645
58339A050630O057P524P788Q524J0286J1777J2457J3444J5226J6735J7366J7853
58327A195667J8420J7962J5952J3489J1539R643P097M195J617k59j078o72K97
58314A293869R82J602K853M362N184N613O746Q511R852J0682J1814J3088J3633
58301A388791J3760J4583J5859J6307J5905J5770J5968J5703J5420J6211J7358
58290A561635J7194J6319J6969J9214K0809K1098K1872K3843K5520K6314K7633
58279A798420K9946L1743L2422L3313L4891L5780L5560L5639L6546L7189L7664
58268B179113L9660M3093M5621M6611M8246N1526N4557N6277N8382O1895O5106
$$ plain form
58353 991106 1003953 1015370 1025121 1032590 1037659 1040838 1042317 1042056 1041041 1041052 1042648 1044764 1046985 1050630
58339 1050630 1056687 1064211 1071999 1080523 1090809 1102586 1115043 1128487 1143713 1160448 1177814 1195667
58327 1195667 1214087 1232049 1248001 1261490 1273029 1282672 1289769 1293964 1295581 1295322 1294244 1293572 1293869
58314 1293869 1294851 1296453 1299306 1303668 1308852 1314465 1321211 1329722 1339574 1350256 1362070 1375158 1388791
58301 1388791 1402551 1417134 1432993 1449300 1465205 1480975 1496943 1512646 1528066 1544277 1561635
58290 1561635 1578829 1595148 1612117 1631331 1652140 1673238 1695110 1718953 1744473 1770787 1798420
58279 1798420 1828366 1860109 1892531 1925844 1960735 1996515 2032075 2067714 2104260 2141449 2179113
58268 2179113 2218773 2261866 2307487 2354098 2402344 2453870 2508427 2564704 2623086 2684981 2750087
58257B750087O6689O7780O9269P0132P0018P0347P1341P1272P0155P0721P4042
58246C521853P7857Q0903Q5117R1593R8347J04156J10723J18939J26956J34213
58236D550657J43099J54354J65163J74401J85104J99014K13362K26182K39993
58227F251329K56801K74339K90958L09491L32347L57448L83126M12305M47689
58218I315833M87578N30616N79760O37263P01036P70402Q50028R43758J050600
58209A5866874J171614J314213J484573J683306J914737K193165K534321K950393
58201C1113196L461957M106187M924468N949820P210712Q728219J0493272J2464326
58193H8452157J4614146J6973509J9607563K2556022K5814817K9340016L2962826
$$ plain form
58257 2750087 2816776 2884556 2953825 3023957 3093975 3164322 3235663 3306935 3377090 3447811 3521853
58246 3521853 3599710 3680613 3765730 3857323 3955670 4059826 4170549 4289488 4416444 4550657
58236 4550657 4693756 4848110 5013273 5187674 5372778 5571792 5785154 6011336 6251329
58227 6251329 6508130 6782469 7073427 7382918 7715265 8072713 8455839 8868144 9315833
58218 9315833 9803411 10334027 10913787 11551050 12252086 13022488 13872516 14816274 15866874
58209 15866874 17038488 18352701 19837274 21520580 23435317 25628482 28162803 31113196
58201 31113196 34575153 38681340 43605808 49555628 56766340 65494559 75987831 88452157
58193 88452157 103066303 120039812 139647375 162203397 188018214 217358230 250321056
58186B50321056L6185388L8008837L7025239L1896396K2093927Q498643o628588
58179D17400898k0464699l0787053l6720942l8668387l7691428l4915809l1245888
58172A86906692k7308978k3477924j9934359j6760138j3997965j1655135r698874
58165F4073319q079577o753330n677049m800700m079554l485561k998414k595298
58157B5603836k257258j975726j743927j549209j380655j236495j116578j014053
58149A3329935r21069q36624p62285o95377o32442n74639n24050m78632m35725
58140G469092l96678l63543l35000l09472k88326k72017k56993k40354k23975
58131D782734k10301j97668j83726j69952j58758j49124j38968j29153j21513
$$ plain form
58186 250321056 286506444 324515281 361540520 393436916 415530843 424029486 417400898
58179 417400898 396936199 366149146 329428204 290759817 253068389 218152580 186906692
58172 186906692 159597714 136119790 116185431 99425293 85427328 73772193 64073319
58165 64073319 55993742 49240412 43563363 38762663 34683109 31197548 28199134 25603836
58157 25603836 23346578 21370852 19626925 18077716 16697061 15460566 14343988 13329935
58149 13329935 12408866 11572242 10809957 10114580 9482138 8907499 8383449 7904817 7469092
58140 7469092 7072414 6708871 6373871 6064399 5776073 5504056 5247063 5006709 4782734
58131 4782734 4572433 4374765 4191039 4021087 3862329 3713205 3574237 3445084 3323571
58122C323571j15325j09031j03168r8598r4088q8420q2798p8552p4772p0499o6879
58111B341441o4752o2600n9200n5884n3911n2120m9457m7227m6470m5663m3503
58100A760654m1408m0795m0434l8947l7470l7228l6874l4976l2731l1540l0138
58089A358113k7004k3431k1266j9692j7215j4967j4875j6141j6580j6149j6310
58078A154483j7062j7397j7552j8213j8595j7731j6648j6886j7911j8257j8040
58067I60191j8115j7955j6690j5114j4361j3673j1815r538q310p730o685n908
58055H14297o824q741r770r802j0103j0619j0206r039q308p970p118o175o387
58042G03235p376p480o422n518n342n157m682m517m773m974n217n979o885p192
$$ plain form
58122 3323571 3208246 3099215 2996047 2897449 2803361 2714941 2632143 2553591 2478819 2408320 2341441
58111 2341441 2276689 2214089 2154889 2099005 2045094 1992974 1943517 1896290 1849820 1804157 1760654
58100 1760654 1719246 1678451 1638017 1599070 1561600 1524372 1487498 1452522 1419791 1388251 1358113
58089 1358113 1331109 1307678 1286412 1266720 1249505 1234538 1219663 1203522 1186942 1170793 1154483
58078 1154483 1137421 1120024 1102472 1084259 1065664 1047933 1031285 1014399 996488 978231 960191
58067 960191 942076 924121 907431 892317 877956 864283 852468 842930 834620 826890 820205 814297
58055 814297 807473 798732 788962 779160 769057 758438 748232 739193 730885 722915 715797 709622 703235
58042 703235 695859 688379 681957 676439 671097 665940 661258 656741 651968 646994 641777 635798 628913 621721
58028F21721p191p663q358q517q437q893r453r086p975p124o477n285l951l716
58014E19595m561n151m788l940k947j769r20j064j777k000j610j260r94m41k0
57999D86353m44j285j546j360j668k461k907k985l370l926l866l277k894k549
57985D51815j508k01Q0p56j504j697k061k803l112k731k418k511k348j572p35
57970D25938k42J20L43Q2m20l75L00Q61J054J379J920K000J374P08N48O64N83
57953D36837nj384l438n150n429m465l368k603j732n89M38J279K243L226L801
57938D19661M085M532N043N293N726P015Q667R358Q664P315N818L991J829l40
57924D96657k544m938p016q182q856r813j0688j0482r288q075p047n775m728m800
$$ plain form
58028 621721 614530 606867 598509 589992 581555 572662 563209 554123 546148 539024 532547 527262 523311 519595
58014 519595 515034 509883 505095 501155 498208 496439 495519 494455 492678 490678 489068 487808 486814 486373 486353
57999 486353 485909 484624 483078 481718 480050 477589 474682 471697 468327 464401 460535 457258 454364 451815
57985 451815 450307 450106 450186 449430 447926 446229 444168 441365 438253 435522 433104 430593 428245 426673 425938
57970 425938 425696 425816 426159 426241 425821 425446 425746 426607 427661 429040 430960 432960 434334 435042 435590 436254 436837
57953 436837 436832 435448 432010 426860 421431 416966 413598 410995 409263 408674 409112 410391 412634 415860 419661
57938 419661 423746 428278 433321 438614 444340 451355 460022 469380 478044 485359 491177 495168 496997 496657
57924 496657 494113 489175 482159 473977 465121 455308 444620 434138 424850 416775 409728 403953 399225 394425
57910C94425n387m844l088j837j890k070j391m93j72j41p0m18j312j963j891j553
57894C65905j175l02Q56J191O00O53K290M249M868M328L888L853L592K835J856
57879C99487R27L50N12J180J391O99j84n39n91p54q09n47l67n23n15OM54K02m55
57860C99924q73q86n07M80J922L028L280L035K741K320J733J285Q93Q3q38q30
57844D16790L6J30j385l083l319k611k543l271l634l162k369j474k19J161K058
57829C93105K521L107L815M091L814L442L213K968K672K398J991J310O72M41M00
57814D29960L1q82k382m511o903q725r694j0456j1305j1343r913q092p442p792
57800C30551p642o456n158m356l486k071o70j11m80j173j437p05R43K602L345
$$ plain form
57910 394425 389038 384194 381106 379269 377379 375309 373918 373425 373253 373112 373042 372624 371312 369349 367458 365905
57894 365905 364730 364428 365284 366475 367075 367728 370018 374267 379135 383463 387351 391204 394796 397631 399487
57879 399487 400414 400764 401276 402456 403847 404546 404362 403823 403232 402478 401669 401122 400755 400232 399717 399723 400177 400379 399924
57860 399924 399051 398165 397658 398138 400060 403088 406368 409403 412144 414464 416197 417482 418375 418458 417620 416790
57844 416790 416826 416956 415571 412488 409169 406558 404015 400744 397110 393948 391579 390105 389886 391047 393105
57829 393105 395626 398733 402548 406639 410453 413895 417108 420076 422748 425146 427137 428447 429119 429560 429960
57814 429960 429991 429109 426727 422216 415313 406588 396894 386438 375133 363790 353877 345785 338343 330551
57800 330551 322909 316453 311295 306939 303453 301382 300712 300601 300121 298948 297511 296806 297749 300351 303696
57785C03696L234L025L016K895K629K684L257M012M705N394N894N762M981M116
57771C59300L478K781J793P54j26j124k512l992m968n228n079m946m950m897m529
57756C25755l807k878j838o71N26J544K345L061L600L604L089K618K542K465J852
57741C43807P96k17r74j480j615j340r90q63p38k97K48M84M82O19Q82R05N39r7
57723C40151q92j624j793j159k37K39J58j10l69n90n30p9L13K25JK11N56K57o47
57704C34081j294j263r93q21n10R0O84J075J372J425Q64o8m88j31J26m78j401
57687C32270j542p47P1J50l54p36n31J43Q49J471K584M935Q446J2151J5285J8113
57671C92558K1414K5504L0121L5028M0305M6013N1822N6683N8559N4695M2973
$$ plain form
57785 303696 306930 309955 312971 315866 318495 321179 324436 328448 333153 338547 344441 350203 355184 359300
57771 359300 362778 365559 367352 368106 367980 366856 364344 360352 355384 350156 345077 340131 335181 330284 325755
57756 325755 321948 319070 317232 316561 317087 318631 320976 324037 327637 331241 334330 336948 339490 341955 343807
57741 343807 344603 344386 343412 341932 340317 338977 337987 337124 336386 336089 336337 336821 337303 337922 338804 339709 340248 340151
57723 340151 339259 337635 335842 334683 334446 334685 334843 334733 334364 333774 333244 333165 333478 333703 333704 333915 334471 334728 334081
57704 334081 332787 331524 330531 329710 329200 329290 329974 331049 332421 333846 334710 334642 334154 334023 334149 333671 332270
57687 332270 330728 329981 330052 330202 329848 329112 328581 328724 329573 331044 333628 338563 347009 359160 374445 392558
57671 392558 413972 439476 469597 504625 544930 590943 642765 699448 758007 812702 855675
57660H55675K3657o3k3450m2314n4356n9364n8739n4707m9283m3411l7160l0685
57648D25800k4751k0092j6632j3731j1079q822o980n257l545k127j263q93q72
57635C09756j077j227j081q69j021j383j337q65p66j399j977j652q08n10j083
57620B92701j868k157j868j399j258j624k041j899j364j284j844k105j518r62
57606B69510j436k362k366j315l67j63k02q5j29m75o34m02l92j074j915k012j262
57589B52919m32k70q56j655k074j959j644j410j169q44o52o85n64r1J69l81j305
57572B37097j583j049n58p28j237j502j327p90r5L37J45m33p81o90m53k97k73
57555B25783n27j036j208n73L28N77M05R73K457L490K888J120n35j417j620j398
$$ plain form
57660 855675 879332 879269 855819 813505 759149 699785 641046 586339 537056 493645 456485 425800
57648 425800 401049 380957 364325 350594 339515 330693 323713 318456 314911 312784 311521 310628 309756
57635 309756 308679 307452 306371 305502 304481 303098 301761 300896 300130 298731 296754 295102 294294 293784 292701
57620 292701 290833 288676 286808 285409 284151 282527 280486 278587 277223 275939 274095 271990 270472 269510
57606 269510 268074 265712 263346 262031 261664 261501 261299 261214 261085 260610 259976 259574 259182 258108 256193 254181 252919
57589 252919 252487 252217 251361 249706 247632 245673 244029 242619 241450 240606 239954 239269 238705 238614 238783 238402 237097
57572 237097 235514 234465 233907 233179 231942 230440 229113 228323 228228 228565 228710 228277 227496 226806 226353 226056 225783
57555 225783 225256 224220 223012 222439 222767 223344 223749 224722 227179 230669 233557 234677 234142 232725 231105 229707
57539B29707j064r38r01n16O7J2r40j870j908j485j548k061k124j346k59N54J079
57522B14459J511J773J621J008K36j76J81J275K653L788M218L684K371J061M97
57507B40160O90J103J388J430R55j56j252j554j440k048l414m151l467k417k311
57492B23516k839k741j706n14K86Q05J163J264J213J250J356J428J637K021K021
57477B30160J170O6k14M20R03M55n68j403j829k058k174k055j686j258j019j030
57461B17880j037o79L4N97O06K62O9J84M56Q33J314J634J454Q79M18L58N54P63
57443B26579Q81Q27N81L40L32M38L26N3J23P92J598J859J471J006J022J459J768
57426B41455J571J098R24J276J695J558Q04M2j45J23K14j73n41k38N79J077R00
$$ plain form
57539 229707 228643 227705 226804 226288 226355 226367 225427 223557 221649 220164 218616 216555 214431 213085 212826 213380 214459
57522 214459 215970 217743 219364 220372 220608 220432 220613 221888 224541 228329 232547 236231 238602 239663 240160
57507 240160 240850 241953 243341 244771 245726 245570 244318 242764 241324 239276 235862 231711 228244 225827 223516
57492 223516 220677 217936 216230 215716 216002 216807 217970 219234 220447 221697 223053 224481 226118 228139 230160
57477 230160 231330 231396 231182 231602 232505 232960 232392 230989 229160 227102 224928 222873 221187 219929 218910 217880
57461 217880 216843 216164 216198 216795 217401 217663 217732 217916 218372 219205 220519 222153 223607 224486 224904 225262 225816 226579
57443 226579 227460 228287 228868 229208 229540 229978 230304 230357 230480 231272 232870 234729 236200 237206 238228 239687 241455
57426 241455 243026 244124 245048 246324 248019 249577 250381 250423 250278 250401 250615 250442 249901 249663 250242 251319 252219
57409B52219O77J030J572J543J071R82J442J610R03k06r68j303j481j427r15r7
57393B56652O38J136J427J448J218J044J175J465J669J853K207K667L026L221
57379B80846L224K922K376J900J580J079K55m02m92m67j052k072k546k025j219
57364B83907j094j753k467k558k013j274o07J45J101J879J910J253O66O94J125
57349B80914J494J739J985K172K250K430K724K606J702O04L16R08J361R12ll67
57333C03747J56R68J333J146P99N58K83j40m55l35O4L11L93P40J521K302K584
57316C15975K287J620Q42L32M45J075J716K072K169J867Q65m95j168n68O48J386
57300C31068J263O21r6n23l32M37J354K117K786L230L017K233J709J934K354K333
$$ plain form
57409 252219 252896 253926 255498 257041 258112 259094 260536 262146 263049 262843 261875 260572 259091 257664 256749 256652
57393 256652 257290 258426 259853 261301 262519 263563 264738 266203 267872 269725 271932 274599 277625 280846
57379 280846 284070 286992 289368 291268 292848 293927 294182 293780 293288 292821 291769 289697 287151 285126 283907
57364 283907 282813 281060 278593 276035 274022 272748 272141 272286 273387 275266 277176 278429 279095 279789 280914
57349 280914 282408 284147 286132 288304 290554 292984 295708 298314 300016 300620 300936 301844 303205 304117 304114 303747
57333 303747 303903 304871 306204 307350 308149 308707 308990 308850 308395 308060 308124 308435 308828 309568 311089 313391 315975
57316 315975 318262 319882 320724 321056 321501 322576 324292 326364 328533 330400 331265 330770 329602 329034 329682 331068
57300 331068 332331 332952 332856 332333 332001 332438 333792 335909 338695 341925 344942 347175 348884 350818 353172 355505
57284C55505K136K244K380K014J373J079J160J260J432J877K246K079J701J782
57270C80268K261K503K355K220K255K331K527K980L366L347L245L534L967M082
57256D21241M180M811N569N561M890M531M799N078N129N405N948O078N441M448
57242D93109L514K825K895M125N670O021N087M487N307O763P666Q048Q508Q984
57228E73009R007Q595Q104P788P945Q858J0045J0465R976R799J0837J2372J3171
57215F99971J3146J2936J2640J1962J1235J1226J1991J2783J3026J2820J2496
57204H36232J2249J2115J2014J1897J2028J2750J3839J4679J5318J6631J8945
57193I88697K1199K2192K2051K1739K1685K1724K1888K2269K2395K1739K0774
$$ plain form
57284 355505 357641 359885 362265 364279 365652 366731 367891 369151 370583 372460 374706 376785 378486 380268
57270 380268 382529 385032 387387 389607 391862 394193 396720 399700 403066 406413 409658 413192 417159 421241
57256 421241 425421 430232 435801 441362 446252 450783 455582 460660 465789 471194 477142 483220 488661 493109
57242 493109 496623 499448 502343 506468 512138 518159 523246 527733 533040 539803 547469 555517 564025 573009
57228 573009 582016 590611 598715 606503 614448 623306 633351 643816 653792 663591 674428 686800 699971
57215 699971 713117 726053 738693 750655 761890 773116 785107 797890 810916 823736 836232
57204 836232 848481 860596 872610 884507 896535 909285 923124 937803 953121 969752 988697
57193 988697 1009896 1032088 1054139 1075878 1097563 1119287 1141175 1163444 1185839 1207578 1228352
57182A228352K0583K1409K2457K3115K3636K4343K4954K5025K4673K4426K4670
57171A487643K5427K6402K7138K7289K6926K6465K6299K6620K7440K8604K9741
57160A785994L0415L0425K9844K8920K8033K7620K7939K8856K9889L0523L0504
57149B108962K9997K9417K9026K8765K8638K9011L0216L1899L3223L3671L3340
57138B446165L2566L1662L0992L0743L0686L0591L0783L1757L3294L4646L5576
57127B799461L6488L7494L8156L8237L8007L7628L7108L7044L8568M2153M7181
57116C227525N2964N9438O6524P3619Q0173Q6180R1944R8176J06522J19025J36597
57105D198687J58819J85397K17013K54677K99602L54099M21254N03284O01361
$$ plain form
57182 1228352 1248935 1270344 1292801 1315916 1339552 1363895 1388849 1413874 1438547 1462973 1487643
57171 1487643 1513070 1539472 1566610 1593899 1620825 1647290 1673589 1700209 1727649 1756253 1785994
57160 1785994 1816409 1846834 1876678 1905598 1933631 1961251 1989190 2018046 2047935 2078458 2108962
57149 2108962 2138959 2168376 2197402 2226167 2254805 2283816 2314032 2345931 2379154 2412825 2446165
57138 2446165 2478731 2510393 2541385 2572128 2602814 2633405 2664188 2695945 2729239 2763885 2799461
57127 2799461 2835949 2873443 2911599 2949836 2987843 3025471 3062579 3099623 3138191 3180344 3227525
57116 3227525 3280489 3339927 3406451 3480070 3560243 3646423 3738367 3836543 3943065 4062090 4198687
57105 4198687 4357506 4542903 4759916 5014593 5314195 5668294 6089548 6592832 7194193
57096G194193P17198Q52920J008656J181912J369682J568840J773576J975265
57088A7642242K166607K343381K500229K627586K714609K750369K717602K591326
57080C8053951K355924K027787J653858J280294R21011N55477J51907l08532q20456
57071D5871221j354127j863304k300313k632115k847495k953159k965425k903270
57063B6052013k783558k619010k420007k197927j965610j734693j513836j309350
57055I508022j125667r64435q24543p04176o02402n18437m50249l94707l48805
57046C574601l10379k78091k51126k28610k09075j90871j73325j56979j42299
57037A633846j28621j14757j00378q6226p3105o1089m9711l8430k6851j4938l532
$$ plain form
57096 7194193 7911391 8764311 9772967 10954879 12324561 13893401 15666977 17642242
57088 17642242 19808849 22152230 24652459 27280045 29994654 32745023 35462625 38053951
57080 38053951 40409875 42437662 44091520 45371814 46292825 46848302 47000209 46691677 45871221
57071 45871221 44517094 42653790 40353477 37721362 34873867 31920708 28955283 26052013
57063 26052013 23268455 20649445 18229438 16031511 14065901 12331208 10817372 9508022
57055 9508022 8382355 7417920 6593377 5889201 5286799 4768362 4318113 3923406 3574601
57046 3574601 3264222 2986131 2735005 2506395 2297320 2106449 1933124 1776145 1633846
57037 1633846 1505225 1390468 1290090 1203864 1130759 1069670 1019959 981529 954678 939740 936208
57026I36208N472R782P825n74j4107l0101m4946n5408o0264o0666n8634n5344
57014E79243n0954m5641m0059l4873l0366k6546k3284k0313j7528j5223j3691
57003B60765j2669j1658j0720j0299j0262r799q542p096o191n817n557n256m864
56990A52035m047k471l24J829L643N176O694Q360R949J0651R540O456K244k006
56976B07729n781r026j1606j3130j3265j2074j0177q433p143n610k992M25L386
56963A12303N265O790Q889J1497J3989J6269J8704K1224K2980K2815J9741J3359
56951B93825M437m999j2682j7426j9398j9402j8182j6229j3792j0954p776m371
56939A53051q31K632N568P725R694J2537J6527K0748K4309K7192K9359K9471K5562
$$ plain form
57026 936208 941680 951462 959287 958713 944606 914505 869559 814151 753887 693221 634587 579243
57014 579243 528289 482648 442589 407716 377350 350804 327520 307207 289679 274456 260765
57003 260765 248096 236438 225718 215419 205157 195358 186816 179720 173529 167712 162155 156899 152035
56990 152035 147988 145517 145193 147022 150665 155841 162535 170895 180844 191495 201035 207491 209735 207729
56976 207729 201948 192922 181316 168186 154921 142847 132670 124237 117094 111484 108492 108917 112303
56963 112303 117568 124358 133247 144744 158733 175002 193706 214930 237910 260725 280466 293825
56951 293825 298262 293263 280581 263155 243757 224355 206173 189944 176152 165198 157422 153051
56939 153051 152220 154852 160420 168145 177839 190376 206903 227651 251960 279152 308511 337982 363544
56926C63544J7013N358o750j7004k4184k8221k9785k9523k7641k4435k0783j7615
56914A59974j5077j2763j0618q907p426n564l327j629j142j424j534j106l73M94
56900H9578J551K745L847M750N502O069O347O451O763P600Q971J0702J2652J4661
56886A88189J6433J7609J7886J7003J4657J0660N258q41o737j1591j4654j5386
56874B38486j3804j0597o730k931M90L611O894J0864J5530K0246K4475K8436L2689
56861C47659L7332M2066M6656N0521N1863M8099L7711K1576K527j5873l0416l9188
56849F00533m2204m0886l6654l0328k2730j4926p402K93Q549J6919K4916L2931
56837D89011M1579N0561N9055O6883P4222Q0054Q1657P5928O0954L6764N882k6509
$$ plain form
56926 363544 380557 385915 379165 362161 337977 309756 279971 250448 222807 198372 177589 159974
56914 159974 144897 132134 121516 112609 105183 99619 96292 94663 93521 92097 90563 89457 89084 89578
56900 89578 91129 93874 97721 102471 107973 114042 120389 126840 133603 141203 150174 160876 173528 188189
56886 188189 204622 222231 240117 257120 271777 282437 287695 286854 280117 268526 253872 238486
56874 238486 224682 214085 207355 204424 204914 208525 215419 226283 241813 262059 286534 314970 347659
56861 347659 384991 427057 473713 524234 576097 624196 661907 683483 686010 670137 639721 600533
56849 600533 558329 517443 480789 450461 427731 412805 405403 405696 414245 431164 456080 489011
56837 489011 530590 581151 640206 707089 781311 861365 943022 1018950 1079904 1116668 1122550 1096041
56825A096041n4033p2134q0120q0287p5424o7389n7437m6782l6324k6256j6467
56814D83388p182J222R030J7191K6198L5359M3569N0411N5770N8482N6135M6585
56802H76158K9486O697j8109m0321n6073o4004o5383o2377n6650m9434m1881l4577
56790D23532k7311j9922j2979p030j775L397Q479J3199J7842K2822K7484L0142
56778D77880K9318K4473J5775M014r155k1490l1080l6905l8922l8011l5574l2560
56766C07763k9002k4891k1128j8736j7402j5820j3527j1431j0287r577q377o623
56754A20962m978l867l219k800k408j933j585j806k708l672l842k938j475k75
56740H3456J59o3m84p91j000j057o46L18J233J387Q80M77N41P11O70O78J071J636
$$ plain form
56825 1096041 1042008 969874 889754 809467 734043 666654 609217 562435 526111 499855 483388
56814 483388 476206 477428 486458 503649 529847 565206 608775 659186 714956 773438 829573 876158
56802 876158 905644 912341 894232 853911 797838 733834 668451 606074 549424 499990 458109 423532
56790 423532 396221 376299 363320 356290 354515 357912 366391 379590 397432 420254 447738 477880
56778 477880 507198 531671 547446 551460 542305 520815 489735 452830 413908 375897 340323 307763
56766 307763 278761 253870 232742 214006 196604 180784 167257 155826 145539 135962 127585 120962
56754 120962 115984 112117 108898 106098 103690 101757 100172 98366 95658 91986 88144 85206 83731 83456
56740 83456 83615 83552 83068 82277 81277 80220 79574 79892 81125 82512 83392 83869 84410 85121 85791 86469 87540 89176
56722H9176J824J421Q01O29J254K253K696K123J111N03L40J40j1M62J445J877
56706A08044J180J45r5M99J094J182R18N46J75M0M19J143J643J610J369J397J674
56689A22983J738J344Q22O66Q81J067J118J451K233K796K420J463J012J418J839
56674A45251J445M04o92j728k759l317k823j587o92p64j274j331p15R1O79J147
56658A31335J688K111J917R44k78q81m34P02J711J944J341M09j54K6O35R12L15
56641A44243r04j830j708p18J71K31k51n40n32p69j352j568r36j03Pn37q89p27
56623A31288n44p01r20r21r01j082j179p41K21J201J666J402N82l68j066j402
56607A26535j406j051l30M90J034J150R45N61J74O1K93N31M11R4J3K40N06P28
$$ plain form
56722 89176 91000 92421 93222 93851 95105 97358 100054 102177 103288 103791 104131 104271 104260 104722 106167 108044
56706 108044 109224 109369 109274 109773 110867 112049 112967 113513 113688 113728 114147 115290 116933 118543 119912 121309 122983
56689 122983 124721 126065 126887 127553 128434 129501 130619 132070 134303 137099 139519 140982 141994 143412 145251
56674 145251 146696 147100 146408 144680 141921 138604 135781 134194 133502 132738 131464 130133 129418 129509 130188 131335
56658 131335 133023 135134 137051 137995 137717 136836 136402 137104 138815 140759 142100 142509 142355 142381 143016 143928 144243
56641 144243 143339 141509 139801 139083 139254 139485 139234 138694 138162 137393 136041 134473 133537 133434 133441 132904 132015 131288
56623 131288 130744 130043 129123 128202 127301 126219 125040 124299 124520 125721 127387 128789 129371 129003 127937 126535
56607 126535 125129 124078 123748 124238 125272 126422 127367 127928 128102 128163 128456 128987 129398 129492 129505 129745 130251 130979
56589A30979R90J094P54K25J61O76J109R32M15J17J87M51P97J175J414J372J110
56572A43958Q30Q02J332K465L716M398M377M138M137M429M957N773O860Q088R385
56557B09645J0634J1433J1358J0412Q752O110K248k045n239o634o956p143p208
56544B35367o755n921n172m600l987l287k629k062j577j173p49k43k2n43j521
56529A95126k020j650j025p02m26P6K97k39r70r58k48K52K9o34j320j768j622
56512A82198o96M76R84N40l29j066j551j804j775j553j285r01l02K01J54k42k17
56495A72832M77J081Q11o4n88l08K59L64j62q87j322j271p70k7N76O56K31k38
56477A71650m30n45p95p84mJ129J505P50k56n82l59j73j9M51J062J272J077J027
$$ plain form
56589 130979 131969 133063 133817 134042 134203 134879 135988 136920 137335 137452 137639 138090 138887 140062 141476 142848 143958
56572 143958 144788 145590 146922 149387 153103 157501 161878 166016 170153 174582 179539 185312 192172 200260 209645
56557 209645 220279 231712 243070 253482 262234 268344 270592 268547 263308 256674 249718 242575 235367
56544 235367 228612 222691 217519 212919 208932 205645 203016 200954 199377 198204 197455 197212 197190 196647 195126
56529 195126 193106 191456 190431 189729 189303 189379 189676 189437 188467 187509 187261 187513 187542 186908 185588 183820 182198
56512 182198 181502 181978 182962 183502 183173 182107 180556 178752 176977 175424 174139 173238 172936 173137 173291 173049 172832
56495 172832 173309 174390 175201 175137 174549 174241 174500 174864 174702 173815 172493 171222 170452 170425 171001 171657 171888 171650
56477 171650 171220 170675 169880 169096 169092 170221 171726 172476 172220 171638 171279 171106 171087 171538 172600 173872 174949 175976
56459A75976J335J596J467J108P74M13q1n26o56m24lN03J089J655J893J591J036
56442A88746J002J970L434M235L690K143M48p21j085p50l24n51j476k271k177
56427A96313j364m78K17Q62J392J525J240P90L00k09m63j01P04J160O65n10j465
56410B00578j507o95L34R71J103J004Q93P32M28M4k64l47r1M84J112J482J591
56393B07852J673J788J762J591J586J937K386K484K014J210O64Q89J676K100J571
56378B33183P16O18J323J823J490P44J19m14r45j122p18l4O01J159J499J310Q66
56361B42218J015J895K450J909J007Q98J507J890J729J511J456J220O17r7o31
56346B60594q34o06j37j3m99r54n58N62J504J697J353R69R16J347K025K432K405
$$ plain form
56459 175976 177311 178907 180374 181482 182256 182669 182588 182062 181406 180982 180979 181482 182571 184226 186119 187710 188746
56442 188746 189748 191718 195152 199387 203077 205220 205668 204947 203862 203112 202788 202237 200761 198490 196313
56427 196313 194949 194471 194688 195550 196942 198467 199707 200497 200797 200588 200125 200024 200728 201888 202553 202043 200578
56410 200578 199071 198376 198710 199681 200784 201788 202681 203413 203841 203885 203621 203274 203183 203667 204779 206261 207852
56393 207852 209525 211313 213075 214666 216252 218189 220575 223059 225073 226283 226947 227836 229512 231612 233183
56378 233183 233899 234517 235840 237663 239153 239897 240016 239602 238657 237535 236817 236783 237384 238543 240042 241352 242218
56361 242218 243233 245128 247578 249487 250494 251392 252899 254789 256518 258029 259485 260705 261322 261225 260594
56346 260594 259760 259154 259017 259004 258505 257551 256993 257555 259059 260756 262109 263078 263994 265341 267366 269798 272203
56329B72203K452L017L830M400M704M878M659L824K795K124J716J132L97j84o03
56314C11344r58r90n62j75k73m39q6M50N32N57J569L564N239N611N012M376M231
56297C39002M582N132N449N379N190N009M392L163K210K515L662M299M042L867
56283C97893M499N406N682N213M633M652N581P051Q230Q699Q957R553J0091R886
56269D96026R296R426J0557J1936J3092J4387J6103J7954J9743K1698K3899K6139
56257F90256K8596L1913L6292M1176M6064N1098N6611O2658O9144P5955Q2825
56246A272588Q9542R6198J02797J08659J12854J15074J15490J13985J10225J04237
56236B341649R6081Q5167P0913N3929L5643J6861k239k0870l7696n2313o5408
$$ plain form
56329 272203 274655 277672 281502 285902 290606 295484 300143 303967 306762 308886 310602 311734 312131 311947 311344
56314 311344 310386 309396 308834 308659 308386 307947 307861 308311 308843 309400 310969 314533 319772 325383 330395 334771 339002
56297 339002 343584 348716 354165 359544 364734 369743 374135 377298 379508 382023 385685 389984 394026 397893
56283 397893 402392 407798 413480 418693 423326 427978 433559 440610 448840 457539 466496 476049 486140 496026
56269 496026 505322 514748 525305 537241 550333 564720 580823 598777 618520 640218 664117 690256
56257 690256 718852 750765 787057 828233 874297 925395 982006 1044664 1113808 1189763 1272588
56246 1272588 1362130 1458328 1561125 1669784 1782638 1897712 2013202 2127187 2237412 2341649
56236 2341649 2437730 2522897 2593810 2647739 2683382 2700243 2698004 2677134 2639438 2587125 2521717
56225B521717p7087q6177r1773r4549r5912r6544r6269r4801r2168q8739q5068
56214A522630q1346p7118p2011o6495o1276n6276n1187m6603m3382m1088l8414
56203H87434l5169l2395l0379k8026k4710k1300j8744j6835j5033j3397j2042
56192F39404j0677r268q261p564o386m596l213k809k536j569n34m50j020j058
56178E79463j47R90J507J139K51l89j22R20K023K864L697M492M759M500M474N098
56162F15519N861O237O439O903P762R177J1388J4013J6136J7552J9140K1618K4708
56149G82453K7964L1607L6072M1427M7746N5292O3961P3164Q2590R2229J01469
56138A435974J08972J13711J15209J12617J04877R2422P7783O3942N2735M4930
$$ plain form
56225 2521717 2444630 2358453 2266680 2172131 2076219 1979675 1883406 1788605 1696437 1607698 1522630
56214 1522630 1441284 1364166 1292155 1225660 1164384 1108108 1056921 1010318 966936 925848 887434
56203 887434 852265 819870 789491 761465 736755 715455 696711 679876 664843 651446 639404
56192 639404 628727 619459 611198 603634 597248 592652 589439 586630 584094 582525 581991 581541 580521 579463
56178 579463 579316 580306 581813 582952 583203 582814 582692 583612 585635 588499 592196 596688 601447 605947 610421 615519
56162 615519 621380 627617 634056 640959 648721 657898 669286 683299 699435 716987 736127 757745 782453
56149 782453 810417 842024 878096 919523 967269 1022561 1086522 1159686 1242276 1334505 1435974
56138 1435974 1544946 1658657 1773866 1886483 1991360 2083782 2161565 2225507 2278242 2323172
56128B323172M0520L8236L5780L1313K4282J4812L440q268j8222k5545l1066l5949
56116B392505m1150m8247n8953p2929q7379r9536j08284j12925j12264j06146
56106A544692r6549q5847p4902o3786n3201m4050l6468l0220k5242k1124j7042
56095I96261j2910r569p259n080k645q85l89k36N93J835K850L749M784N717O542
56080I83358P656Q767Q937Q260P942Q264Q204P691Q190J0132J1878J2373J2765
56067A104417J4105J5460J5858J6073J6874J7391J6906J6535J7348J8526J9019
56056A288512J9324J9931J9818J8327J6804J6521J6702J6370J6260J7009J7491
56045A483069J7018J7214J9374K1969K3161K3846K5639K7739K8592K8950L0340
$$ plain form
56128 2323172 2363692 2401928 2437708 2469021 2493303 2508115 2511555 2503287 2485065 2459520 2428454 2392505
56116 2392505 2351355 2303108 2244155 2171226 2083847 1984311 1876027 1763102 1650838 1544692
56106 1544692 1448143 1362296 1287394 1223608 1170407 1126357 1089889 1059669 1034427 1013303 996261
56095 996261 983351 973782 966523 961443 958798 957913 957524 957288 957881 959716 962566 966315 971099 976816 983358
56080 983358 991014 999781 1008718 1016978 1024920 1033184 1041388 1049079 1057269 1067401 1079279 1091652 1104417
56067 1104417 1118522 1133982 1149840 1165913 1182787 1200178 1217084 1233619 1250967 1269493 1288512
56056 1288512 1307836 1327767 1347585 1365912 1382716 1399237 1415939 1432309 1448569 1465578 1483069
56045 1483069 1500087 1517301 1536675 1558644 1581805 1605651 1631290 1659029 1687621 1716571 1746911
56034A746911L2025L2472L2438L3630L5584L6815L7898M0414M3805M6164M7208
56023B165364M7866M8052M7490M7486M9177N1273N2247N3317N6361O0365O3125
56012B742123O5031O7984P1791P4999P8039Q2250Q6937R0635R4091R8770J03796
56001C656446J07773J12105J18882J27026J34250J41316J50444J61004J70894
55992D880140J80719J92457K05371K17546K30032K45156K62199K79150K97143
55983F989913L18599L42850L68305L96897M31204M69406N08726N51663O02788
55974A0980351O61762P26011P98080Q83314R82488J094297J223145J376888J559385
55965B0285721J773878K031668K349091K739604L219740L820708M582943N540723
$$ plain form
56034 1746911 1778936 1811408 1843846 1877476 1913060 1949875 1987773 2028187 2071992 2118156 2165364
56023 2165364 2213230 2261282 2308772 2356258 2405435 2456708 2508955 2562272 2618633 2678998 2742123
56012 2742123 2807154 2875138 2946929 3021928 3099967 3182217 3269154 3359789 3453880 3552650 3656446
56001 3656446 3764219 3876324 3995206 4122232 4256482 4397798 4548242 4709246 4880140
55992 4880140 5060859 5253316 5458687 5676233 5906265 6151421 6413620 6692770 6989913
55983 6989913 7308512 7651362 8019667 8416564 8847768 9317174 9825900 10377563 10980351
55974 10980351 11642113 12368124 13166204 14049518 15032006 16126303 17349448 18726336 20285721
55965 20285721 22059599 24091267 26440358 29179962 32399702 36220410 40803353 46344076
55957D6344076O719837Q139220R794593J1647300J3659181J5846320J8276616
55950A30427143K1007589K4046073K7353604L0795635L3955545L5928305L5351318
55943C38865212L0843602K1748783Q783826n902438j9474904k9597350l5296926
55936C09969805l6987787l5825348l3003566k9415250k5634222k1991953j8648137
55929A08463542j5666301j3075734j0883413r061283p557716o324651n322381
55922D0572063m507870l838194l284379k829115k453457k137295j869572j646202
55914A8005979j459199j297374j155765j034951r32226q41625p61192o92414o33378
55905I197855n79487n29859m86589m48777m13229l79847l50527l24064k97716
$$ plain form
55957 46344076 53063913 61203133 70997726 82645026 96304207 112150527 130427143
55950 130427143 151434732 175480805 202834409 233630044 267585589 303513894 338865212
55943 338865212 369708814 391457597 400241423 394338985 374864081 345266731 309969805
55936 309969805 272982018 237156670 204153104 174737854 149103632 127111679 108463542
55929 108463542 92797241 79721507 68838094 59776811 52219095 45894444 40572063
55922 40572063 36064193 32225999 28941620 26112505 23659048 21521753 19652181 18005979
55914 18005979 16546780 15249406 14093641 13058690 12126464 11284839 10523647 9831233 9197855
55905 9197855 8618368 8088509 7601920 7153143 6739914 6360067 6009540 5685476 5387760
55896E387760k72526k51566k34072k16659j99156j84072j71293j58480j45844
55887C554092j35574j27208j18275j08864j01234r5594r0575q7003q6739q8368
55877B514658q8302q5685q2297p8382p2796o6697o2775o1001n9088n6858n6188
55866A744589n6811n6105n3185m9639m6169m1985l7612l4872l3804l2700l1285
55855A270422l0846l1208l0615k8740k6911k5517k3941k2783k3153k4067k3556
55844I79085k2146k2012k2981k2729k0933j9753j9898j9667j8338j7252j6873
55833G56503j5914j4109j2897j2575j1639r821q869r405r767r013q417q852r260
55820F15965q962r092j0285j1163j0580r514r296r554r278q450p483o294m955
$$ plain form
55896 5387760 5115234 4863668 4629596 4412937 4213781 4029709 3858416 3699936 3554092
55887 3554092 3418518 3291310 3173035 3064171 2962937 2867343 2776768 2689765 2603026 2514658
55877 2514658 2426356 2340671 2258374 2179992 2107196 2040499 1977724 1916723 1857635 1800777 1744589
55866 1744589 1687778 1631673 1578488 1528849 1482680 1440695 1403083 1368211 1334407 1301707 1270422
55855 1270422 1239576 1208368 1177753 1149013 1122102 1096585 1072644 1049861 1026708 1002641 979085
55844 979085 956939 934927 911946 889217 868284 848531 828633 808966 790628 773376 756503
55833 756503 740589 726480 713583 701008 689369 679548 670679 661274 651507 642494 634077 625225 615965
55820 615965 607003 597911 587626 576463 565883 556369 547073 537519 528241 519791 512308 506014 501059
55807E01059m074l759l294k362j363k09J690L908N076M982M957N667O205N931
55793E24414N493N249M376K449L82j095k470m132n348n524n213n123n187n362
55779E02909o118p407q316q464q555q830q166n661k032J462M635P951J1229J3475
55765D78112J3431R981K960n776j2993j6583j7047j6223j5269j4335j3347j2380
55753C80531j1632j1324j1397j1273j0468r344q615q220p483o249n028m141l590
55740B71767l493l713l353j806l1M94j75q03j127j951l208l769l413l311l983
55725B38125m526m368m232m628m808m086k964k156j605j128r37q74j46J494L245
55710B06406M388N097N634N831N681N412M610K474o30l109m170m710n666o750
$$ plain form
55807 501059 496985 493226 489932 487570 486207 485998 487688 491596 496672 501654 506611 512278 518483 524414
55793 524414 529907 535156 539532 541981 542363 541268 538798 534666 529318 523794 518581 513458 508271 502909
55779 502909 496791 489384 481068 472604 464049 455219 447053 441392 439360 440822 445457 453408 464637 478112
55765 478112 491543 501524 504484 498708 485715 469132 452085 435862 420593 406258 392911 380531
55753 380531 368899 357575 346178 334905 324437 315093 306478 298258 290775 284526 279498 275357 271767
55740 271767 268274 264561 261208 259402 259371 259865 259690 258887 257760 255809 252601 248832 245419 242108 238125
55725 238125 233599 229231 224999 220371 215563 211477 208513 206357 204752 203624 202687 201813 201667 203161 206406
55710 206406 210794 215891 221525 227356 233037 238449 243059 245533 244903 241794 237624 232914 227248 220498
55696B20498p387p696p762p169n941m919m502m017l024k100j703j341n89J05L68
55681A62821N49Q14P47N14J076K462L162K307J114R22R92k07k436l954l862k774
55665A64247j504l36N32Q53O74K37k75n25n6J009J868K084K117K365K505K306
55649A78101K214K473K523K026J630J850K003J244n7r31j202j417j866k561l704
55634A82326n261o506o747o155n327m529l927l895m337m356l363j961r74l26L97
55619A25059Q98O44j26p95j293j866k277k119j557j070p81o24p48j153j431j393
55603A09368j450j832k055j750j303j087q39m09l50q86j206o68O8Q1m19p04q21
55586I3738j150j378r98l21R1M00R27J263R98O64Q06Q77K85k01M20J522J767J374
$$ plain form
55696 220498 213111 205415 197653 190484 184543 179624 175122 171105 168081 165981 164278 162937 162348 162453 162821
55681 162821 163370 164184 164931 165445 166521 168983 172145 174452 175566 176488 177480 177273 174837 170883 167021 164247
55665 164247 162743 162407 162939 163792 164466 164703 164428 163903 163847 164856 166724 168808 170925 173290 175795 178101
55649 178101 180315 182788 185311 187337 188967 190817 192820 194064 194007 193076 191874 190457 188591 186030 182326
55634 182326 177065 170559 163812 157657 152330 147801 143874 139979 135642 131286 127923 125962 124988 124662 125059
55619 125059 125957 126601 126475 125680 124387 122521 120244 118125 116568 115498 114717 114093 113345 112192 110761 109368
55603 109368 107918 106086 104031 102281 100978 99891 99052 98643 98293 97407 96201 95533 95601 95682 95263 94559 93738
55586 93738 92588 91210 90212 89891 89982 90382 91309 92572 93570 94234 95040 95917 96202 96001 96421 97943 99710 101084
55568A01084J696K810L323K658J779J378R17q9j137j661j764j651j258q20q80
55553A06385j410j718j458j032q58r77j331j746j709j061n86r09j172j65J444
55538I1697J671J85j049o30M10M86k43n76k17K36N21P71P68J86o14q90n45k69
55520I1898o52j530k229k190j550j071j290j746j605r06n27q00j062q11n17o93
55504G2719r71p84m33p12j712k608k571j450K59J721K277K054J856K137K283J413
55488G5478l04j611j574n70K81M72N41J193K283K900K443J285K58j92j62J45N95
55471H3461R76J029O53r3j036j831k081j840j681j910k011j345j86M82J84o32
55455G2139j216j132k79J040K078K131J275K91j65m8K76L63q9q74j243o51M85
$$ plain form
55568 101084 102780 105590 108913 111571 113350 114728 115645 115556 114419 112758 110994 109343 108085 107265 106385
55553 106385 104975 103257 101799 100767 99909 98932 97601 95855 94146 93085 92499 91590 90418 90253 91697
55538 91697 93368 93553 92504 91874 92284 92770 92527 91951 91734 91970 92491 93262 94030 94216 93602 92712 92167 91898
55520 91898 91246 89716 87487 85297 83747 82676 81386 79640 78035 77129 76602 75802 74740 73929 73412 72719
55504 72719 71748 70964 70531 69819 68107 65499 62928 61478 61737 63458 65735 67789 69645 71782 74065 75478
55488 75478 75174 73563 71989 71419 71700 72172 72713 73906 76189 79089 81532 82817 83075 82883 82721 82866 83461
55471 83461 84437 85466 86119 86026 84990 83159 81078 79238 77557 75647 73636 72291 72105 72587 72771 72139
55455 72139 70923 69791 69512 70552 72630 74761 76036 76327 76162 76114 76390 76753 76664 75790 74547 73896 74381
55438G4381J237J205Q03N58O19Q79J067Q72K50m59j031j588j894j174O44K075
55422G8444J629r1j083n82K80N42O95J354J988J782R68L85K95L69L29N6n94j474
55404H5292k025j959j686j628j509q57P1N06J79l48m22m8J72k02q62r74j40J062
55386G4622J741J668J203N15m35j272j354o52J34N26O90P87O30J97j64l36o01
55369G7899j033j297j336j482j616j091O2P74M22p9M22J525J830R71K2j12K06
55352G6087R4o01j225j175n68o1j30n22n86j06M70O99O49N83L81k86j392k343
55334F9968k415j403O9R94J017Q47J292K106K342J738R70M89o0r03j427r67J60
55317G4817R59Q03r6j042j409j079n28k11kL48M76o6p28m65N71J064N30PJ77J76
$$ plain form
55438 74381 75618 76823 77626 78184 78803 79682 80749 81621 81871 81412 80381 78793 76899 75725 76369 78444
55422 78444 80073 79982 78899 78317 78597 79139 79834 81188 83176 84958 85926 86311 86606 86975 87304 87360 86766 85292
55404 85292 83267 81308 79622 77994 76485 75628 75699 76205 76384 76036 75614 75566 75738 75536 74674 73700 73560 74622
55386 74622 76363 78031 79234 79749 79314 78042 76688 76036 76170 76696 77386 78173 78803 79000 78836 78500 77899
55369 77899 76866 75569 74233 72751 71135 70044 70106 70880 71302 71223 71645 73170 75000 75971 75993 75881 76087
55352 76087 76181 75580 74355 73180 72612 72551 72421 71899 71313 71207 71677 72376 73025 73608 73989 73703 72311 69968
55334 69968 67553 66150 66219 67213 68230 69077 70369 72475 74817 76555 77525 78014 77954 77051 75624 74657 74817
55317 74817 75776 76579 76483 75441 74032 72953 72425 72214 72212 72560 73036 72970 72242 71777 72348 73412 73942 73949 74126 74302
55297G4302p15j510r71L49R86Q19Q73J270J154M81K98R16J287P78K33N53J248
55280H2351J269O28K15L34L51k39j044j306q59k29J36L19N09M63j02p37o41O3
55262H1481K63m89j112m52J016J933J929J684J442P18n11j402j461j132r17o82
55246H2308k62Oj44m13m84n59q23r09m22L36O67L57k02n92o55l53K39P71Q03K32
55226G9901n40j005j032q95q32o64p3P63J166P86J14j07K12N98P31O05J92m84
55208G9436j017r65m95j41Q2O63J577K017J454M66J0K59N59L42k74p01n23N5L80
55189H3184J57j30O7M19J27p55j245q33k03p9j19L94J268J662J314P99N98N84
55171H7209N00L18Q4j99l21M0Q19J387J110P6q60p73M20J699J826O88m99o17L9
$$ plain form
55297 74302 73587 72077 71106 71455 72441 73260 74133 75403 76557 77038 77336 78252 79539 80317 80550 81103 82351
55280 82351 83620 84248 84463 84797 85148 84909 83865 82559 81700 81471 81607 81926 82435 82898 82796 82059 81418 81481
55262 81481 81744 81255 80143 79691 80707 82640 84569 86253 87695 88413 87902 86500 85039 83907 82990 82308
55246 82308 82046 82052 81908 81495 81011 80452 79629 78720 78298 78634 79301 79658 79456 78864 78209 77856 78095 78866 79669 79901
55226 79901 79361 78356 77324 76429 75597 74933 74860 75623 76789 77575 77689 77582 77794 78392 79123 79728 79920 79436
55208 79436 78419 77454 76959 76818 76900 77563 79140 81157 82611 83077 83087 83346 83905 84247 83973 83272 82749 82804 83184
55189 83184 83341 83211 83278 83697 83824 83069 81824 80991 80788 80709 80590 80984 82252 83914 85228 86027 86625 87209
55171 87209 87709 88027 88111 87912 87591 87631 88450 89837 90947 91023 90163 89390 89810 91509 93335 94023 93524 92907 92946
55152I2946K86l23j006r43l05J76J98K4j17k60m17m58l57l03m06m98l34O1M34
55133H8398N92N60M22J47l21q94j302j276p66j7N25N93L88L75O98R78Q41M04L5
55114I0380j86l78l69J44R26J245Q07J63j37l30q24j256q55L42J353J484J071
55097I3580P90P64P11O09O96J002J216J071N46k07q77j035n10K68O08L12j69l94
55079I8981l80l25j58K38O24N96J92r4K3K58K17k1j10k4j40o46j162j151n53J65
55059I6530N60O46O80P02M65j35p04o65M8P40N80n06j701k099j524n91nK8k08
55040I2841l36j52L60J025J500J443Q69K44K3J17qn66j054q20M4O88M61l50r38
55021I5391q61l73K6M0k62m83j02R69K046K207J366L69j24l54p86j146q81j95
$$ plain form
55152 92946 93232 92909 91903 90960 90655 90831 91029 91053 90936 90676 90259 89801 89444 89141 88735 88237 87903 87964 88398
55133 88398 88990 89550 89972 90119 89798 88904 87602 86326 85560 85543 86068 86661 87049 87424 88122 89100 89941 90345 90380
55114 90380 90194 89816 89447 89591 90517 91762 92569 92732 92595 92265 91441 90185 89330 89672 91025 92509 93580
55097 93580 94370 95134 95845 96454 97150 98152 99368 100439 100985 100778 99901 98866 98356 98624 99232 99544 99375 98981
55079 98981 98601 98276 98118 98356 98980 99576 99768 99674 99697 99955 100172 100151 100041 100017 99877 99231 98069 96918 96365 96530
55059 96530 97090 97736 98416 99118 99583 99448 98744 98079 98127 98867 99447 98941 97240 95141 93617 93026 93021 93049 92841
55040 92841 92505 92353 92713 93738 95238 96681 97550 97794 97817 97934 97926 97360 96306 95486 95530 96218 96679 96329 95391
55021 95391 94530 94157 94183 94223 93961 93478 93376 94345 96391 98598 99964 100333 100209 99855 99069 97923 97042 96847
55003I6847J35o6j50K69P52Q71Q94J185J462J277P88M63L05k2m74o34l67O9N07
54984A04111R24J112P90Q9n58r91j304j317o59N37J528J795J494J002N00J26Q1
54967A09260K85L42J19q9j24k62n55n08K04J045J228P13J50o8j24k85n10o24n60
54948A09637l80k54l57o16p23n69m86p67j136j035l79L81Q58J073J165J143J041
54931A08596J001J067J097J023J005J113J076O41J20K42J315K790L944M769N725
54916A35524O751P150O663O022N887N808M881L140J422K0j640l802n702o461o083
54901A59580n229m487m131m152m178l821l236k948k939k584j738j081j001q78
54887A17177j44O71P40K86K73R98J822K147K042J953K266L044L847M106L972M360
$$ plain form
55003 96847 96982 96916 96766 97035 97787 98658 99552 100737 102199 103476 104264 104727 105032 105010 104536 103902 103535 103604 104111
54984 104111 105035 106147 106937 107026 106468 105477 104173 102856 102197 102734 104262 106057 107551 108553 109053 109179 109260
54967 109260 109545 109887 110006 109917 109793 109531 108976 108468 108672 109717 110945 111658 111808 111740 111616 111331 110821 110197 109637
54948 109637 109257 109003 108646 108030 107307 106738 106252 105485 104349 103314 102935 103316 104174 105247 106412 107555 108596
54931 108596 109597 110664 111761 112784 113789 114902 115978 116619 116739 116981 118296 121086 125030 129799 135524
54916 135524 142275 149425 156088 162110 167997 173805 178686 181826 183248 183268 181628 177826 172124 165663 159580
54901 159580 154351 149864 145733 141581 137403 133582 130346 127398 124459 121875 120137 119056 118055 117177
54887 117177 117033 117704 118444 118730 119003 120001 121823 123970 126012 127965 130231 133275 137122 141228 145200 149560
54871A49560N652O903O979N924M495K959J246k10r67j577k964m922o339o848p008
54856A52883o969o255m997m069l631k906j771j265j779k181j623j011j453k308
54842A10665k193j253q66j374j614p90M66J247J453J294O50m62j358j345o67k36
54826A03617n14j015r82k60N56Q42O38M88O56P64L74l08o19k57M20Q23O02j93
54808A05632j154j609j070K43J423J706J176N99N43Q62J054R66Q69Q88P33J93
54792A13054l61m03kK87K97M35Q26Q80J21r06j197n46K59N73O06P93R94P84L08
54773A16802K65R60J852K306K442K847L645M350M605M611M682M832N024N387N816
54758A70426N831N214M428L886L100J278j444m050n814o758p034o644n949n621
$$ plain form
54871 149560 155212 162115 169094 175018 179513 182472 183718 183508 182541 180964 178000 173078 166739 159891 152883
54856 152883 145914 139659 134662 130593 126962 124056 122285 121020 119241 117060 115437 114426 112973 110665
54842 110665 108472 107219 106353 104979 103365 102575 103041 104288 105741 107035 107685 107223 105865 104520 103853 103617
54826 103617 103103 102088 101106 100846 101402 102244 102882 103370 104026 104790 105164 104856 104237 103980 104400 105223 105825 105632
54808 105632 104478 102869 101799 102042 103465 105171 106347 106946 107489 108351 109405 110371 111240 112128 112861 113054
54792 113054 112693 112290 112288 112575 112872 113307 114133 115013 115134 114228 113031 112485 112744 113317 113923 114716 115710 116494 116802
54773 116802 117067 118027 119879 122185 124627 127474 131119 135469 140074 144685 149367 154199 159223 164610 170426
54758 170426 176257 181471 185899 189785 192885 194163 192719 188669 182855 176097 169063 162419 156470 150849
54744A50849n681n351m234k989k307j855j000l9J82k98n00P3P38P25K48K2J54
54727A28737K13J74O10J738K835L019K410J988K427L522M753N845O555O478N514
54712A76818M148K836J445k68j963l143l953m858n754o115n904n501m823l486
54698A39479j918j236j663k093j717j155j244j595j322n96m09r70j417j129n23
54683A20492l25o64j170j563j806j899j708j115l18J87J57N0M80J253J523J009
54667A14583M01K78L23P6k07j40n0m06q63p41j86M2k07l87l02l68p18q82n74j12
54647A09560K23N81J047J335J371J524J921J980J131k70j242j227n47R3K98K32
54631A18010L01N65N98L5p75j105p52k81k28n14p18o06j82M00P70N70m0m17k37
$$ plain form
54744 150849 145168 139817 135583 132594 130287 128432 127432 127393 127575 127277 126777 126850 127588 128313 128561 128583 128737
54727 128737 128950 129124 129734 131472 134307 137326 139736 141724 144151 147673 152426 158271 164826 171304 176818
54712 176818 180966 183802 185247 184979 183016 179873 175920 171062 165308 159193 153289 147788 142965 139479
54698 139479 137561 136325 134662 132569 130852 129697 128453 126858 125536 124940 124531 123561 122144 121015 120492
54683 120492 120167 119503 118333 116770 114964 113065 111357 110242 109924 110111 110268 110318 110798 112051 113574 114583
54667 114583 114984 115262 115585 115661 115454 115314 115264 114858 113995 113254 113068 113110 112903 112516 112214 111846 111128 110246 109672 109560
54647 109560 109783 110364 111411 112746 114117 115641 117562 119542 120673 120403 119161 117934 117387 117480 117778 118010
54631 118010 118311 118876 119474 119509 118734 117629 116877 116596 116368 115854 115136 114530 114348 114748 115518 116088 116048 115631 115394
54612A15394Rk45p46p25N4R41J185P02N0j66J88O67O14j63j051j208m72M44P50
54593A16222L50k17m13j17L70N62J66n48p87n6J143J709J154Q9o61r84j211j278
54575A15493p73K42J038J043M54r4j88J43O14Q63P09M04M02P43R50P06L26K67
54557A23342M45L77r6n79o02j47L78N91N27N21O85O63J30n99q55m84K8L40O69
54538A25334J236J756J812J373O67q7o18o50l17j63m01o19m67j66J7K41N35L54
54520A29837n49j275p23Q01J788J399L23l58m34l48l69m00l99n19q38j133j039
54503A25764n26j08k93p88p03K61J249J317N76r5k06N8L76N53M85L52O16J350
54485A30238J881J676J137Q95P61J66o28q48m41j9K86Q66J510J481Q78P71J571
$$ plain form
54612 115394 115403 115158 114412 113687 113741 114682 115867 116569 116619 116453 116641 117308 117922 117759 116708 115500 115028 115472 116222
54593 116222 116572 116355 115942 115825 116195 116757 116923 116375 115588 115532 116675 118384 119538 119627 118966 117982 116771 115493
54575 115493 114720 114962 116000 117043 117497 117403 117215 117358 117972 118835 119544 119948 120350 121093 122043 122749 123075 123342
54557 123342 123787 124164 124068 123489 122887 122740 123118 123709 124236 124757 125442 126105 126235 125636 124781 124297 124325 124665 125334
54538 125334 126570 128326 130138 131511 132178 132091 131473 130823 130506 130343 129942 129323 128856 128690 128707 128948 129483 129837
54520 129837 129288 128013 127290 128091 129879 131278 131601 131243 130809 130461 130092 129692 129293 128774 127936 126803 125764
54503 125764 125238 125130 124837 124049 123346 123607 124856 126173 126749 126654 126448 126506 126882 127435 127920 128272 128888 130238
54485 130238 132119 133795 134932 135827 136588 136754 136126 135278 134837 134818 135104 135970 137480 138961 139839 140610 142181
54468A42181K334K182J446Q61N11K65L85J019J624J651J297J050R32P22M35J7
54452A58912q43k050k782k483j664j105p73k84J30J8k85m8O20Q44K89m32p58q04
54434A46502q31p73n53l76m27o39q93j095j076p49m78o92j125r25K37J594K205
54417A39906J993J544J153O57O4k42j43j43o94j328j099O4R94O71m23q96k10P68
54399A42636J030N81J11P1M56J071J593J661J240P49N26M74M32O02J106J521J281
54382A57141M28m70j055j363j423j120m88K10P51J051J069Q87Q07J119J718K270
54366A61532K651K933L037K719K021J350R86P11J46o38j101q96l90l14p82r89
54350A72976k74P37P01o93k214k625k123j738j890k163k227k179k056j715j257
$$ plain form
54468 142181 144515 146697 148143 149004 149515 149780 150165 151184 152808 154459 155756 156806 157738 158460 158895 158912
54452 158912 158069 156019 153237 150754 149090 147985 147212 146928 147058 147076 146791 146743 147363 148207 148496 148064 147306 146502
54434 146502 145671 144898 144345 143969 143542 142903 142010 140915 139839 139090 138612 137920 136795 135870 136107 137701 139906
54417 139906 141899 143443 144596 145253 145317 145075 144932 144789 144095 142767 141668 141732 142726 143397 142974 142078 141868 142636
54399 142636 143666 144247 144358 144429 144885 145956 147549 149210 150450 151199 151725 152199 152631 153233 154339 155860 157141
54382 157141 157569 157099 156044 154681 153258 152138 151650 151860 152611 153662 154731 155618 156425 157544 159262 161532
54366 161532 164183 167116 170153 172872 174893 176243 177229 177940 178086 177448 176347 175451 175061 174747 173965 172976
54350 172976 172702 173439 174140 173447 171233 168608 166485 164747 162857 160694 158467 156288 154232 152517 151260
54335A51260j023j045r81o71l62j75J37P05J118Q32j03j000j170n91O1J00m23
54318A46669p94m94K34Q36J129J255J204Q46K88k14o25r94j070n84R4J77m73j019
54300A46465o86K71R36Q25K81p5j8J80Q2l97q56p65m6Q47J374J373J089Q80Q53
54281A52613P59L11l57p21n26j28R4K36M61L97l92j452j729q99K34Q78J125J335
54263A52239J328P69K3j67K90O76M20k16n77m02L7M62R20J547K100K012J060j43
54245A62378o74l10K80L97N8l20n95r43j433j875k048j786r81J99J155J286O75
54228A55463N4j7K25J62l80q95q07j71L63K46l16n58pR67J570J469J024O98M65
54209A59555N1m90p18m37m6j45q20j522j620r65P0R68J402J333R58N57L48L75
$$ plain form
54335 151260 150237 149192 148211 147540 147178 147003 147140 147845 148963 149795 149692 148692 147522 146931 146992 147092 146669
54318 146669 145875 145381 145615 146451 147580 148835 150039 150885 151173 150959 150334 149340 148270 147686 147780 147957 147484 146465
54300 146465 145779 146050 146986 147811 148092 148017 147999 148179 148261 147864 147008 146243 146197 147044 148418 149791 150880 151760 152613
54281 152613 153372 153683 153326 152605 152079 151951 152045 152281 152742 153139 152747 151295 149566 148667 148901 149779 150904 152239
54263 152239 153567 154336 154359 154192 154482 155158 155578 155362 154785 154383 154420 154882 155802 157349 159449 161461 162521 162378
54245 162378 161704 161394 161674 162071 162129 161809 161214 160271 158838 156963 154915 153129 152148 152347 153502 154788 155463
54228 155463 155517 155500 155725 155887 155507 154612 153805 153634 153997 154243 153927 153369 153362 154329 155899 157368 158392 159090 159555
54209 159555 159606 159116 158398 157961 157915 157770 156950 155428 153808 152843 152913 153881 155283 156616 157574 158131 158479 158854
54191A58854N00M94J96l82j067j594j685j184k64N85R38Q55P37P30N86K44J08
54174A58651M88J024J163R78J008J329J335N68o83j730k055j496l48N71N12l06
54158A61009q57o31k87o54j563k163j960j086R3J057J226O28J87O12J256Q78m94
54141A57251j436j013J6L62j73p82r13p64o85o82n81l40l4K75N61P58P67N97M81
54122A53665O33Q93Q18L17n6K35R24J257J006P11Q57J273J516J479J356J335J519
54105A69738J986K603K932K631J939J538J857K603L068K820J962P63o52k047k789
54090A90952k333j059r2o7n36q30r78j277j448r47J23R93J100M75n70j580j936
54073A79990j409o29m03n93l91L44Q66P94O68R30J150P95J46r2K53P95J150J183
$$ plain form
54191 158854 159354 159848 160044 159662 158595 157001 155316 154132 153868 154453 155391 156246 156983 157713 158299 158543 158651
54174 158651 159139 160163 161326 162304 163312 164641 165976 166544 165861 164131 162076 160580 160232 160803 161315 161009
54158 161009 160152 159521 159234 158580 157017 154854 152894 151808 151901 152958 154184 154812 154999 155611 156867 157745 157251
54141 157251 155815 154802 154818 155180 155007 154225 153312 152548 151863 151181 150600 150260 150226 150501 151062 151820 152587 153184 153665
54122 153665 154298 155191 156009 156326 156270 156505 157429 158686 159692 160403 161260 162533 164049 165528 166884 168219 169738
54105 169738 171724 174327 177259 179890 181829 183367 185224 187827 190895 193715 195677 196440 195788 193741 190952
54090 190952 188619 187560 187468 187401 186865 186035 185057 183780 182332 181385 181508 182501 183601 184076 183506 181926 179990
54073 179990 178581 177952 177549 176956 176565 176909 177775 178569 179237 180167 181317 182112 182258 182166 182419 183214 184364 185547
54055A85547R69P98Q80R12L54n91r69l37N49Q21O33O81J117J667K339L235L987
54038B02592M172M109M463N182N557N296M861M655M533M280L986L730L315K553
54024B63284J541N83P6L49J234J916J618M39q79j841k422k637k536k568l226m216
54008B50715m650m272l816l888m162m011l426k768k149j581j332j645k218k513
53994B08284k380k054j687j342j185j299j368r92k48L93O05L71k30r74j413j220
53978A93261n98K3N99J299J917K031J759J726K135K497K570K875L836M922N333
53963B26185N123M998N062M586L070R43j014k481l527m126m133l638l015k605
53949B25428k389k014j146J05J159J561J535J693K279K998L564M002M343M450
$$ plain form
54055 185547 186516 187314 188194 189106 189460 188869 187900 187563 188112 188933 189566 190247 191364 193031 195370 198605 202592
54038 202592 206764 210873 215336 220518 226075 231371 236232 240887 245420 249700 253686 257416 260731 263284
54024 263284 264825 265408 265484 265833 267067 268983 270601 271040 270161 268320 265898 263261 260725 258157 254931 250715
54008 250715 246065 241793 237977 234089 229927 225916 222490 219722 217573 215992 214660 213015 210797 208284
53994 208284 205904 203850 202163 200821 199636 198337 196969 195977 195729 196122 196727 197098 196868 195894 194481 193261
53978 193261 192663 192686 193285 194584 196501 198532 200291 202017 204152 206649 209219 212094 215930 220852 226185
53963 226185 231308 236306 241368 245954 249024 249967 248953 246472 242945 238819 234686 231048 228033 225428
53949 225428 223039 221025 219879 219984 221143 222704 224239 225932 228211 231209 234773 238775 243118 247568
53935B47568M292M027L649K992K315K288K984L417K677J233M29Q72K001L072L835
53920B87651M182L986L536L488M051M664M843M868N244N887O294O238N853N153
53906C55938L983K380O96o74j504j756j603j376j351j587k058k746l539m218m718
53891C35867n187n638n827n721n781o366p039o991o102n148m809m907m795m221
53877B57335l426k630j827j119r01j437k389l054l096k824k671k644k498k269
53863B24550k201k275k124j558q74m74m53o80j052j448j661j582j377j294j346
53848B04151j327j105p53m39k49j08R9K88J75k80o01k82M76Q64M42l89r34q34
53830A99194r7J020J865J687N02o38p34L1O56O02K28R7L88Q82J233J155P17M23
$$ plain form
53935 247568 251860 255887 259536 262528 264843 267131 270115 273532 276209 277442 277871 278743 280744 283816 287651
53920 287651 291833 295819 299355 302843 306894 311558 316401 321269 326513 332400 338694 344932 350785 355938
53906 355938 359921 362301 362997 362323 360819 359063 357460 356084 354733 353146 351088 348342 344803 340585 335867
53891 335867 330680 325042 319215 313494 307713 301347 294308 287317 281215 276067 271258 266351 261556 257335
53877 257335 253909 251279 249452 248333 247432 245995 243606 240552 237456 234632 231961 229317 226819 224550
53863 224550 222349 220074 217950 216392 215518 215044 214591 213911 212859 211411 209750 208168 206791 205497 204151
53848 204151 202824 201719 200966 200527 200278 200170 200269 200557 200732 200452 199851 199569 200045 200909 201351 200962 200028 199194
53830 199194 199097 200117 201982 203669 204171 203533 202799 202830 203486 204088 204316 204413 204801 205683 206916 208071 208788 209211
53812B09211O72J281J777K034K228K319K142J916K125K774L276L348L439L983
53798B42525M573M411L418K478K479L406M434M746M193L237K435K006J821J648
53784B87810J361R39L63m33j485k620l435l652l444l237l229l352l593l979m228
53769B53786l932l252k909l173l388k945k158j652j341q18m06q47k029k953l081
53754B18902k855k583j849n10N10K83p38j174m94M48O50J38k90j17M12P27N86
53737B12046K32on1K2L08R13J562J707J166L86r6j57J30P99J695K187J747Q06
53719B25396M71J181K093K168J531J210J628J964J360K76qR49K259L023L370L792
53703B52663M034L491K409J814K125K606K504K097K185K946L844M405M610M625
$$ plain form
53812 209211 209883 211164 212941 214975 217203 219522 221664 223580 225705 228479 231755 235103 238542 242525
53798 242525 247098 251509 254927 257405 259884 263290 267724 272470 276663 279900 282335 284341 286162 287810
53784 287810 289171 290110 290473 290040 288555 285935 282500 278848 275404 272167 268938 265586 261993 258014 253786
53769 253786 249854 246602 243693 240520 237132 234187 232029 230377 229036 228218 227812 226965 224936 221983 218902
53754 218902 216047 213464 211615 211105 211615 211898 211160 209986 209492 209940 210590 210728 210438 210321 210733 211460 212046
53737 212046 212278 212272 212221 212243 212551 213464 215026 216733 217899 218285 218189 218032 218162 218961 220656 222843 224590 225396
53719 225396 225867 227048 229141 231309 232840 234050 235678 237642 239002 239278 239270 240219 242478 245501 248871 252663
53703 252663 256697 260188 262597 264411 266536 269142 271646 273743 275928 278874 282718 287123 291733 296358
53689B96358M474M068L323K287J199L83j36o43j339k043k498k685k650k283j556
53674B96259q38n67o42n36l5M38L38l51j103j408j214r28r63j235j208m98N48
53657B86057J109P20k36r25q03K9R99J512J346P87L94M81Q54J045Q59O13P84J481
53639B97106K297K700K501J958J510J456J755K121K299K356K599L176L870M375
53625C32079M623M664M404L783L097K790K848K782K363K042K375L233L945M088
53611C79116L877L725L764L858L853L679L364L084L082L360L583L444L086K854
53597D27729K707K215J257L69Q6J73n8p88j527j899k080k280k290j890j346j158
53581D19220j501k205l018l577l441k590j694j458j846k342k677k848k634j849
$$ plain form
53689 296358 300832 304900 308223 310510 311709 312092 311956 311313 309974 307931 305433 302748 300098 297815 296259
53674 296259 295421 294854 294212 293676 293641 294079 294417 294066 292963 291555 290341 289413 288450 287215 286007 285509 286057
53657 286057 287166 287886 287650 286725 285922 285951 286950 288462 289808 290595 290989 291470 292324 293369 294228 294841 295625 297106
53639 297106 299403 302103 304604 306562 308072 309528 311283 313404 315703 318059 320658 323834 327704 332079
53625 332079 336702 341366 345770 349553 352650 355440 358288 361070 363433 365475 367850 371083 375028 379116
53611 379116 382993 386718 390482 394340 398193 401872 405236 408320 411402 414762 418345 421789 424875 427729
53597 427729 430436 432651 433908 434277 434363 434536 434478 433690 432163 430264 428184 425904 423614 421724 420378 419220
53581 419220 417719 415514 412496 408919 405478 402888 401194 399736 397890 395548 392871 390023 387389 385540
53567C85540r91r00j590k087j628n39L99Q84J073J053Q15M67J56j54n43q88r14
53550C80153m41M53J328J628J304J081J589K439K823K929L717N135N736M742L515
53535D18131L905N819P537Q104Q188Q649R421J0102J0722J1510J2441J3383J4232
53522E42144J4759J4752J4526J4803J5897J7350J8551J9336J9860K0358K1128
53511G33464K2407K4049K5624K6930K7984K8598K8519K8130K8268K9078K9609
53500A032660K9000K7503K5986K4849K3974K3231K2502K1539K0362J9456J9133
53489A290195J9053J8883J8980J9674K0349K0164J9402J9003J8958J8318J6959
53478A499938J5997J5945J5694J4048J1353Q575N695K208j337l690m733n721p596
$$ plain form
53567 385540 384549 383649 382059 379972 378344 377805 378204 379088 380161 381214 382029 382496 382652 382498 381955 381067 380153
53550 380153 379712 380165 381493 383121 384425 385506 387095 389534 392357 395286 399003 404138 409874 414616 418131
53535 418131 422036 427855 435392 443496 451684 460333 469754 479856 490578 502088 514529 527912 542144
53522 542144 556903 571655 586181 600984 616881 634231 652782 672118 691978 712336 733464
53511 733464 755871 779920 805544 832474 860458 889056 917575 945705 973973 1003051 1032660
53500 1032660 1061660 1089163 1115149 1139998 1163972 1187203 1209705 1231244 1251606 1271062 1290195
53489 1290195 1309248 1328131 1347111 1366785 1387134 1407298 1426700 1445703 1464661 1482979 1499938
53478 1499938 1515935 1531880 1547574 1561622 1572975 1581550 1587245 1589453 1588116 1584426 1579693 1573972 1566376
53465A566376j0097j2712j5427j7986j9463j9384j8698j8828k0059k1511k2474
53454A369737k3060k3651k4297k4789k4941k4588k3674k2383k1090k0099j9453
53443A117712j8919j8047j6419j4012j1296q838o954n627m572l277j455M15J428
53430A010139J481J680L046N293P407R084J0731J2332J3322J3752J4648J6732
53418A119647J9446K1681K3085K4119K5210K6449K7937K9894L2272L4587L6343
53407A420670L7532L8603M0021M1855M3915M6139M8601N1110N3187N4714N6271
53396A932618N8422O0810O2521O3169O3178O3090O3116O3269O3309O2631O0860
53385B616993N8557N6557N4607N1605M7419M3375M0378L7533L3485K8358K3257
$$ plain form
53465 1566376 1556279 1543567 1528140 1510154 1490691 1471307 1452609 1433781 1413722 1392211 1369737
53454 1369737 1346677 1323026 1298729 1273940 1248999 1224411 1200737 1178354 1157264 1137165 1117712
53443 1117712 1098793 1080746 1064327 1050315 1039019 1030181 1023227 1017600 1013028 1009751 1008296 1008711 1010139
53430 1010139 1011620 1013300 1016346 1021639 1029046 1038130 1048861 1061193 1074515 1088267 1102915 1119647
53418 1119647 1139093 1160774 1183859 1207978 1233188 1259637 1287574 1317468 1349740 1384327 1420670
53407 1420670 1458202 1496805 1536826 1578681 1622596 1668735 1717336 1768446 1821633 1876347 1932618
53396 1932618 1991040 2051850 2114371 2177540 2240718 2303808 2366924 2430193 2493502 2556133 2616993
53385 2616993 2675550 2732107 2786714 2838319 2885738 2929113 2969491 3007024 3040509 3068867 3092124
53374C092124J8454J3212P238J183m440r993j6081k2899l0333l8104m5566n1865
53362B912930n6603o0014o2412o3793o4150o3787o3162o2590o2176o1751o0855
53351B231637n9140n6776n4267n1856m9486m7328m5832m5126m4759m4165m3118
53340A689784m1585l9410l6498l3085k9726k6930k4805k2981k0969j8768j6873
53329A378154j5476j4016j2022j0148r597j0522j1728j2185j2115j2182j2291
53318A245872j1803j0550q962p390n833m270k814j471j05J346K799M210N563O766
53304A213358P779Q782J0023J1569J3401J5593J8081K0357K1866K2763K3913K5920
53292A413405K8436L0588L1875L2387L2334L1692L0300K8147K5474K2716K0273
$$ plain form
53374 3092124 3110578 3123790 3131028 3132211 3127771 3117778 3101697 3078798 3048465 3010361 2964795 2912930
53362 2912930 2856327 2796313 2733901 2670108 2605958 2542171 2479009 2416419 2354243 2292492 2231637
53351 2231637 2172497 2115721 2061454 2009598 1960112 1912784 1866952 1821826 1777067 1732902 1689784
53340 1689784 1648199 1608789 1572291 1539206 1509480 1482550 1457745 1434764 1413795 1395027 1378154
53329 1378154 1362678 1348662 1336640 1326492 1316895 1306373 1294645 1282460 1270345 1258163 1245872
53318 1245872 1234069 1223519 1214557 1207167 1201334 1197064 1194250 1192779 1192674 1194020 1196819 1201029 1206592 1213358
53304 1213358 1221137 1229919 1239942 1251511 1264912 1280505 1298586 1318943 1340809 1363572 1387485 1413405
53292 1413405 1441841 1472429 1504304 1536691 1569025 1600717 1631017 1659164 1684638 1707354 1727627
53281A727627J8174J5995J3282R991O421K728j181n209q933j2087j5005j8079
53269A733724k1010k3024k3978k4761k6299k8440l0222l1138l1673l2507l3582
53258A427090l4295l4504l4786l5469l5826l4839l2792l1319l1479l2287l1922
53247A057572l0022k7969k6998k6916k6939k6795k6454k5564k3963k2281k1193
53236G72478k0321j8700j6204j3774j2187j1256j0383r263p937o680o068o563
53224F33142p834q931r352r511r931j0496j0889j1271j2009j2974j3638j3773
53212E02533j3564j3122j2290j1030r619q334p243o433o140o408o742o530n797
53199C89281n354n941p368q654q991q386p408o529n880n411n052m711m265l644
$$ plain form
53281 1727627 1745801 1761796 1775078 1785069 1791490 1794218 1793037 1787828 1778895 1766808 1751803 1733724
53269 1733724 1712714 1689690 1665712 1640951 1614652 1586212 1555990 1524852 1493179 1460672 1427090
53258 1427090 1392795 1358291 1323505 1288036 1252210 1217371 1184579 1153260 1121781 1089494 1057572
53247 1057572 1027550 999581 972583 945667 918728 891933 865479 839915 815952 793671 772478
53236 772478 752157 733457 717253 703479 691292 680036 669653 660390 652453 645773 639705 633142
53224 633142 625308 616377 607025 597514 587583 577087 566198 554927 542918 529944 516306 502533
53212 502533 488969 475847 463557 452527 442908 434574 427331 420898 414758 408350 401608 395078 389281
53199 389281 383927 377986 370618 361964 352973 344587 337179 330650 324770 319359 314307 309596 305331 301687
53185C01687k927k430k521l248m118m501m217l536k665j609o40l54r21j728k082
53170B64190j983j784j430o50L08P77N29M5j81j40j09k58o50j221j729j918j785
53153B52011j515j226j015j075j424j664j368n73L47J122J528J239K96m85l30
53138B45868M58R47R19R39J161J059N12J68L57N86N14N69R84J136N54j10K5P34
53120B57380J085P77K58j37l37j33N80J294J440J254J326J483R98j58j204j767
53104B64139k199k561k291j349o98r89j495j194l71j50p44j189r14n85j001j834
53088B44575k065j358m22o0l59p94q68m60J98P12P91M18k00q14j187j088n25O8
53070B36562K15L0M7L25J86p25j689j753j078p33j269k132k549k344j709q22O6
$$ plain form
53185 301687 298760 296330 293809 290561 286443 281942 277725 274189 271524 269915 269275 268921 268000 266272 264190
53170 264190 262207 260423 258993 258343 258651 259428 259957 260002 259821 259681 259572 259314 258664 257443 255714 253796 252011
53153 252011 250496 249270 248255 247180 245756 244092 242724 242151 242498 243620 245148 246387 246683 246198 245868
53138 245868 246326 247273 248192 249131 250292 251351 251863 252031 252388 252974 253488 254057 255041 256177 256731 256621 256646 257380
53120 257380 258465 259242 259500 259363 259026 258893 259473 260767 262207 263461 264787 266270 267268 267110 265906 264139
53104 264139 261940 259379 257088 255739 255041 254052 252557 251363 250992 250842 250098 248909 247995 247410 246409 244575
53088 244575 242510 241152 240730 240670 240311 239517 238649 238189 238387 239099 239890 240308 240108 239294 238107 237019 236494 236562
53070 236562 236777 236807 236854 237179 237365 236640 234951 233198 232120 231387 230118 227986 225437 223093 221384 220562 220628
53053B20628O25Q49J080J455J721J684J462J097M92j20k08K15M12k7n53n81m47
53036B29784p97j456j638j101l44J88M99O90P55P59P77O61K56k27m16k35R4L53
53018B28602L48p7o14n43L37J151J009K43j39J3Ml43l72J42M35n5p82r58o18l32
52998B27451l04l55m43n86o01k97J76O01J021J431J459Q38P0N5J009K137K545
52981B36207K153J590J416J647K009K398K819L033K577J440L39p8j27n88j432
52966B55403j716r45J73P74J047J724K681K853J624k95j604j708j092o24p34j176
52950B56385j450j347j097j021j165j368j522j630j644j409q31k1O69Q26K99n56
52934B43118j138j124p15k86j2J16N7k33o20q28o97l11K8k5o27j419j608o84Q64
$$ plain form
53053 220628 221253 222102 223182 224637 226358 228042 229504 230601 231093 230973 230765 230980 231392 231365 230812 230231 229784
53036 229784 228987 227531 225893 224792 224448 224636 225135 225825 226580 227339 228116 228777 229033 228806 228390 228155 228249 228602
53018 228602 228950 228873 228259 227716 228053 229204 230213 230456 230317 230330 230334 229991 229619 229761 230196 230141 229359 228401 227783 227451
52998 227451 227147 226792 226349 225763 225162 224865 225041 225642 226663 228094 229553 230391 230461 230516 231525 233662 236207
52981 236207 238360 239950 241366 243013 245022 247420 250239 253272 255849 257289 257628 257550 257423 256835 255403
52966 255403 253687 252742 252915 253689 254736 256460 259141 261994 263618 263323 261719 260011 258919 258295 257561 256385
52950 256385 254935 253588 252491 251470 250305 248937 247415 245785 244141 242732 241901 241880 242549 243375 243674 243118
52934 243118 241980 240856 240141 239855 239843 239959 240016 239783 239163 238335 237638 237327 237355 237330 236703 235284 233676 232992 233856
52915B33856J812J422K51m53j11O56R01M69K4J31O54J059J002M67l89j248j679
52898B38824j484r46m93j93J42N03O38N14M63O75Q76O77R8m44n95l63p7j10m86
52879B38219p25k87P19J459J275N41K89R83J963K250J687J035R64J318J492J297
52863B54479J152J407J883K174K198K172K183J998J301K8j524k846l552l663l481
52848B55909l206k844k510k483k787l016k871k560k353k066j472r05q43j032p38
52833B24223P1N93L98P9K70P06P42L99K24L94N33L24j92q53j472j703j290n25
52815B22921o1j62m14l12J26M55L28k13p17n81M36J779K418J878Q06J85J24j47
52797B28849j083k112k417k012j625j667j862j839j602j268q07l26j31k25r3O31
$$ plain form
52915 233856 235668 237090 237341 236888 236777 237433 238334 238803 238827 238958 239612 240671 241673 242140 241751 240503 238824
52898 238824 237340 236394 235901 235708 235850 236353 236991 237505 237968 238643 239519 240196 240294 239850 239255 238892 238815 238705 238219
52879 238219 237494 237207 237926 239385 240660 241201 241490 242473 244436 246686 248373 249408 250372 251690 253182 254479
52863 254479 255631 257038 258921 261095 263293 265465 267648 269646 270947 270975 269451 266605 263053 259390 255909
52848 255909 252703 249859 247349 244866 242079 239063 236192 233632 231279 229213 227741 226836 225993 224961 224223
52833 224223 224294 224887 225285 225364 225634 226340 227082 227481 227705 228099 228632 228956 228764 227911 226439 224736 223446 222921
52815 222921 222860 222698 222284 221972 222098 222553 222881 222668 221951 221370 221806 223585 226003 227881 228687 228872 228996 228849
52797 228849 227766 225654 223237 221225 219600 217933 216071 214232 212630 211362 210555 210229 210098 209873 209780 210411
52781B10411J510J805J422R06O06L49m8m38n65k99L30R70R27k08j785k555k072
52764B11266j126n99m95l92k86l66l51K21J150J645J355Q03O57R48J252J298J142
52747B18122R02P13Q22J471K467L162L041K282J508J057P63M84M39P90J211J220
52731B40454P58J56l55o92o96l10J29J80l0L2M15M69k99j595k721l241l036k171
52713B27447r79l8L20K40Qk70m73l73L1L61L55K06J67J63O6O2L34O28N60J71k11
52692B28775n08q57j102p61L41J671K393K124J314P94R19J212J018L67j61l30
52676B37209m53o97q22q13j074j576j533n04O44P68N5j80P45K101K746K330J382
52659B40328P18Q39J545K103K090J904K070K350K161J627J439J678J655J035K92
$$ plain form
52781 210411 211921 213726 215148 216054 216660 217009 216961 216523 215958 215659 215989 216959 217886 217678 215893 213338 211266
52764 211266 210140 209541 209046 208654 208368 208002 207651 207872 209022 210667 212022 212825 213482 214430 215682 216980 218122
52747 218122 219024 219737 220559 222030 224497 227659 230700 232982 234490 235547 236310 236794 237233 238023 239234 240454
52731 240454 241212 241368 241013 240321 239625 239315 239444 239624 239594 239626 240041 240510 240211 238616 235895 232654 229618 227447
52713 227447 226468 226430 226750 226990 226998 226728 226255 225882 225913 226274 226629 226835 227002 227165 227231 227293 227627 228255 228815 228986 228775
52692 228775 228267 227410 226308 225547 225888 227559 229952 232076 233390 234184 235103 236315 237333 237700 237539 237209
52676 237209 236756 236059 235237 234424 233350 231774 230241 229737 230381 231149 231204 231024 231769 233870 236616 238946 240328
52659 240328 241046 241885 243430 245533 247623 249527 251597 253947 256108 257735 259174 260852 262507 263542 263834
52644B63834k31q79j884k663k626k088j692j339m62P95J487J167N79P41J727K724
52628B59190L128L197L590M515N460N743N069L559J485p83k663l575l481k992
52614B81442k770k869k830k344j630j082p70m59j10rl02n90l85J78M39J16l52
52597B65673m91m27m96n86l14K91P22N81m6p57j132r35l24K71O43R86J373J412
52579B66444Q39J92K01P10Q67L83q5LL00J85l64q52r00n08L8K63j51r59j509j457
52559B63640j037n38J4M82M62j24o90o86l85m83j117j683j542n42R92K419K980
52542B62162K336R60j82m95j58K63M21M34N38O76M64j66n50M7J308J939J244J15
52524B71356j15N97J009K76j022j659j102J79J339J865J863J807K076K629L181
$$ plain form
52644 263834 263603 262724 260840 258177 255551 253463 251771 250432 249970 250765 252252 253419 253998 254739 256466 259190
52628 259190 262318 265515 269105 273620 279080 284823 289892 293451 294936 294153 291490 287915 284434 281442
52614 281442 278672 275803 272973 270629 268999 267917 267147 266688 266578 266569 266267 265677 265292 265470 265909 266025 265673
52597 265673 265182 264755 264259 263673 263359 263650 264372 264953 264907 264150 263018 262083 261759 262030 262673 263659 265032 266444
52579 266444 267283 267475 267676 268386 269253 269636 269551 269554 269854 270039 269675 268823 267923 267415 267453 267716 267565 266606 265097 263640
52559 263640 262603 262065 262079 262561 263023 262899 262209 261523 261138 260655 259538 257855 256313 255771 256763 259182 262162
52542 262162 264498 265458 265276 264781 264623 264886 265307 265741 266279 266955 267419 267253 266703 266750 268058 269997 271241 271356
52524 271356 271241 271838 272847 273123 272101 270442 269340 269519 270858 272723 274586 276393 278469 281098 284279
52509B84279L541L646L411K854K290K106K290K359J820N11j367l266m444m537
52495B95493m010l663l611l228k270j419j330j596j372p26n26j025j375r05j17
52480B68320Q4k81m59j63J72K96N43J149J736J894J785J794J904J851J658J577
52464B83860J653J747J881K211K699L167L518L634L187K061P77n0o20j642l092
52449C04991m046l988l590l674m034l867l005k049j511j395j500j613j455r57
52435B68307n54p14j198j254o36K4O5m28q58q36l80L03R56J309J271J027Q51Q02
52417B68057P19N06L69P20J785L226M284M436L946L578L847M726O005P524Q947
52402C22675R632R138P646N636L305O18k130m286n528o176o567o451n469m045
$$ plain form
52509 284279 287820 291466 294877 297731 300021 302127 304417 306776 308596 309107 307740 304474 300030 295493
52495 295493 291483 287820 284209 280981 278711 277292 275962 274366 272994 272268 271742 270717 269342 268437 268320
52480 268320 268404 268123 267664 267501 267673 267969 268512 269661 271397 273291 275076 276870 278774 280625 282283 283860
52464 283860 285513 287260 289141 291352 294051 297218 300736 304370 307557 309618 310395 310345 309725 308083 304991
52449 304991 300945 296957 293367 289693 285659 281792 278787 276738 275227 273832 272332 270719 269264 268307
52435 268307 267753 267039 265841 264587 263951 263975 264040 263612 262754 261918 261538 261841 262797 264106 265377 266404 267255 268057
52417 268057 268776 269282 269651 270371 272156 275382 279666 284102 288048 291626 295473 300199 306204 313728 322675
52402 322675 332307 341445 349091 354727 358032 358650 356520 352234 346706 340530 333963 327512 322043 317998
52388C17998l161l113l093k367j408j156j478j132M87K384L139K585J745J504
52374C12934J914K654L479M113M250L949L719L955M536N046N187M821L841K315
52360C66713N88q90j857k243k112j680j256q92k80P29J655J837J337R77J261J687
52344C65574J506R35R99K186L757M730N048N368O013O750P494Q503R723J0508
52330D39094J0500J0369J1155J3002J5001J6293J6874J7304J8014J9062K0270
52319F06938K1379K2173K2532K2362K1580K0331J9078J8169J7398J6343J5091
52308H23374J4199J3885J3748J3413J2951J2385J1391R920Q629Q079P848P094
52296I56916N823M795M222L352J525j085l983o948r573j1009j0841r962r706j0262
$$ plain form
52388 317998 314837 311724 308631 306264 304856 303700 302222 301090 301577 303961 307100 309685 311430 312934
52374 312934 314848 317502 320981 325094 329344 333293 337012 340967 345503 350549 355736 360557 364398 366713
52360 366713 367301 366411 364554 362311 360199 358519 357263 356371 356091 356820 358475 360312 361649 362626 363887 365574
52344 365574 367080 368015 369014 371200 374957 379687 384735 390103 396116 402866 410360 418863 428586 439094
52330 439094 449594 459963 471118 484120 499121 515414 532288 549592 567606 586668 606938
52319 606938 628317 650490 673022 695384 716964 737295 756373 774542 791940 808283 823374
52308 823374 837573 851458 865206 878619 891570 903955 915346 925266 933895 941974 949822 956916
52296 956916 962739 967534 971756 975108 976633 975548 971565 964617 955044 944035 933194 923232 913526 903264
52282I03264j0501r384p047m387k147n38O99K104M067O415Q564J0175J1408J2499
52268I25191J3473J4413J5511J6565J6799J5695J3801J2288J1675J1401J0708
52257A077520R592Q691Q429Q509Q316P620O753O038N266M009K273M94j181l197
52243A149132n914q976j1713j3875j5637j7015j7702j7512j6650j5561j4653j4186
52231I79738j4064j3839j3133j2058j1002j0112r213q169p046n934m967m346m025
52218H61830l441k066k68R77J331J590K621M232N434N579M907M162L905M133M372
52203H99298M271M012L943L854L201K138J682K396L499L859L484L278L623M035
52189I46573M268M774N727O335N733M182K735J859R96m66k359m088n462o709p799
$$ plain form
52282 903264 892763 883379 876332 871945 869798 869260 869959 872063 876130 882545 891109 901284 912692 925191
52268 925191 938664 953077 968588 985153 1001952 1017647 1031448 1043736 1055411 1066812 1077520
52257 1077520 1087112 1095803 1104232 1112741 1121057 1128677 1135430 1141468 1146734 1150743 1153016 1153510 1152329 1149132
52243 1149132 1143218 1134242 1122529 1108654 1093017 1076002 1058300 1040788 1024138 1008577 993924 979738
52231 979738 965674 951835 938702 926644 915642 905530 896317 888148 881102 875168 870201 865855 861830
52218 861830 858389 856323 856055 857032 858363 859953 862574 866806 872240 877819 882726 886888 890793 894926 899298
52203 899298 903569 907581 911524 915378 918579 920717 922399 924795 928294 932153 935637 938915 942538 946573
52189 946573 950841 955615 961342 967677 973410 977592 980327 982186 983182 982716 980357 976269 970807 964098 956299
52174I56299q236p760o912o535o754o816n980m333k598j383q04n74k62M63J580
52159H99395K715L530M028M394M658M706M514M146L553K639J574P42L31J35l5
52144I41025P7R08K406L853M601M778N007N396N308M387L453L792N660Q042R929
52129A008622J1311J2720J4517J6878J9937K3335K6100K7603K8380K9371L0590
52118A249364L1257L1113L0712L0301K9240K7000K4058K1269J8753J6060J3116
52107A522243J0335P811N011J537k198n317p367q527r118r239r012q855r164r768
52093A468372j0112j0116j0473j1784j3696j5297j6254j7009j7858j8354j7883
52082A309536j6419j4406j2180r812p379m951k443L13L250O031Q308R930J1046
$$ plain form
52174 956299 948063 940303 933391 926856 920102 913286 907306 902973 900375 898992 898188 897614 897352 897815 899395
52159 899395 902110 905640 909668 914062 918720 923426 927940 932086 935639 938278 939852 940594 940925 941060 941025
52144 941025 941102 942010 944416 948269 952870 957648 962655 968051 973359 977746 981199 984991 990651 998693 1008622
52129 1008622 1019933 1032653 1047170 1064048 1083985 1107320 1133420 1161023 1189403 1218774 1249364
52118 1249364 1280621 1311734 1342446 1372747 1401987 1428987 1453045 1474314 1493067 1509127 1522243
52107 1522243 1532578 1540389 1545400 1546937 1544739 1539422 1532055 1523528 1514410 1505171 1496159 1487304 1478140 1468372
52093 1468372 1458260 1448144 1437671 1425887 1412191 1396894 1380640 1363631 1345773 1327419 1309536
52082 1309536 1293117 1278711 1266531 1256719 1249340 1244389 1241946 1242259 1245509 1251540 1259848 1269778 1280824
52069A280824J2130J3691J5697J7364J7868J7245J6284J5533J4763J3580J2119
52058A447098J0750R393P583N286L150J764R79J99r18k340m118o439r138j1612
52044A451637j3470j5098j7230j9967k2495k3942k4288k4272k4446k4565k3974
52033A217890k2416k0258j8014j5930j4010j2208j0384q392o475n310n291n872
$$ plain form
52069 1280824 1292954 1306645 1322342 1339706 1357574 1374819 1391103 1406636 1421399 1434979 1447098
52058 1447098 1457848 1467241 1474824 1480110 1483260 1485024 1486003 1486202 1485284 1482944 1478826 1472387 1463249 1451637
52044 1451637 1438167 1423069 1405839 1385872 1363377 1339435 1315147 1290875 1266429 1241864 1217890
52033 1217890 1195474 1175216 1157202 1141272 1127262 1115054 1104670 1096278 1089803 1084493 1079202 1073330
$$ [...]
##END NTUPLES=NMR SPECTRUM
##END=
