
##TITLE=AC1398_2151uv_7519910_E9KT24DFFK
##JCAMPDX= 6.0         $$ Bruker NMR JCAMP-DX V2.0
##DATA TYPE= NMR SPECTRUM
##DATA CLASS= NTUPLES
##ORIGIN= BRUKER
##OWNER= Administrator
$$ 1.72 TOPSPIN		Version 2.1
$$ 2013-02-19 20:06:05.741 -0500  Administrator@X
$$ Compression mode = diff/dup
##.OBSERVE FREQUENCY= 400.02188249412
##.OBSERVE NUCLEUS= ^1H
##.ACQUISITION MODE= SIMULTANEOUS (DQD)
##.ACQUISITION SCHEME= undefined
##.AVERAGES= 64
##.DIGITISER RES= 22
##SPECTROMETER/DATA SYSTEM= spect
##.PULSE SEQUENCE= noesygpps1d.comp
##.SOLVENT NAME= COFFEE_meoh
##.SHIFT REFERENCE= INTERNAL, COFFEE_meoh, 1, 14.96095
##AUDIT TRAIL= $$ (NUMBER, WHEN, WHO, WHERE, PROCESS, VERSION, WHAT)
$$ ##TITLE= Audit trail, TOPSPIN		Version 2.1
$$ ##JCAMPDX= 5.01
$$ ##ORIGIN= Bruker BioSpin GmbH
$$ ##OWNER= Administrator
$$ $$ E:\/data/COFFEE/nmr/AC1398_2151uv_7519910_E9KT24DFFK/12/pdata/1/auditp.txt
$$ ##AUDIT TRAIL=  $$ (NUMBER, WHEN, WHO, WHERE, PROCESS, VERSION, WHAT)
(   1,<2013-02-19 20:05:59.647 -0500>,<Administrator>,<X>,<go>,<TOPSPIN 2.1>,
      <created by zg
	started at 2013-02-19 19:54:29.768 -0500,
	POWCHK enabled, PULCHK disabled,
       configuration hash MD5:
       86 BA 57 50 F2 9D 5C 9B 26 00 A9 28 5F 66 2E 89
       data hash MD5: 64K
       7E 3A 0C 6F E4 D7 98 AE 41 96 83 AE 1C 82 3B 08>)
(   2,<2013-02-19 20:06:02.866 -0500>,<Administrator>,<X>,<proc1d>,<TOPSPIN 2.1>,
      <Start of raw data processing
       efp LB = 0.3 FT_mod = 6 PKNL = 1 PHC0 = 0 PHC1 = 0 SI = 128K 
       data hash MD5: 128K
       2F CF 84 73 D5 DE 3F 2D 42 BE C0 27 5B BE 3A 70>)
(   3,<2013-02-19 20:06:03.928 -0500>,<Administrator>,<X>,<proc1d>,<TOPSPIN 2.1>,
      <pk PHC0 = 254.9432 PHC1 = 0 
       data hash MD5: 128K
       BB 2C 35 34 C5 91 69 B5 75 28 E2 E6 88 73 FF AF>)
(   4,<2013-02-19 20:06:04.709 -0500>,<Administrator>,<X>,<proc1d>,<TOPSPIN 2.1>,
      <abs ABSG = 1 
       data hash MD5: 128K
       8E 5B E7 EA 2C A9 4A 08 98 1A D4 60 4E CE 1D D1>)
(   5,<2013-02-19 20:06:04.866 -0500>,<Administrator>,<X>,<proc1d>,<TOPSPIN 2.1>,
      <abs ABSG = 2 
       data hash MD5: 128K
       BC FC FF 28 BA DC 42 7D 70 72 64 FD CB A0 D0 AB>)
(   6,<2013-02-19 20:06:05.053 -0500>,<Administrator>,<X>,<proc1d>,<TOPSPIN 2.1>,
      <abs ABSG = 3 
       data hash MD5: 128K
       34 3C E8 F7 B0 5D 68 EF 51 6E 48 3E BA 86 4D ED>)
(   7,<2013-02-19 20:06:05.209 -0500>,<Administrator>,<X>,<proc1d>,<TOPSPIN 2.1>,
      <abs ABSG = 4 
       data hash MD5: 128K
       6A E4 AE F2 BA EC B1 0A A9 40 25 41 22 22 AA 01>)
(   8,<2013-02-19 20:06:05.397 -0500>,<Administrator>,<X>,<proc1d>,<TOPSPIN 2.1>,
      <abs ABSG = 5 
       data hash MD5: 128K
       A2 3F 55 A5 40 F8 1C EF D3 94 F5 AA 7B 4C 55 2D>)
$$ ##END=
$$ 
$$ $$ hash MD5
$$ $$ F6 65 3C D4 93 BA F6 FF FF 90 8F DB B9 31 CB C9
##$RELAX= 
##$RELAX= 
##$RELAX= 
##$RELAX= 
##$RELAX= 
##$RELAX= 
##$RELAX= 
##$RELAX= 
$$ Bruker specific parameters
$$ --------------------------
##$DU= <E:\>
##$EXPNO= 12
$$ [...]
150 150 150 150 150 150 150 150
##$TP07= 0
##$TPNAME0= <>
##$TPNAME1= <>
##$TPNAME2= <>
##$TPNAME3= <>
##$TPNAME4= <>
##$TPNAME5= <>
##$TPNAME6= <>
##$TPNAME7= <>
##$TPOAL= (0..7)
0.5 0.5 0.5 0.5 0.5 0.5 0.5 0.5
##$TPOFFS= (0..7)
0 0 0 0 0 0 0 0
##$TUNHIN= 0
##$TUNHOUT= 0
##$TUNXOUT= 0
##$USERA1= <user>
##$USERA2= <user>
##$USERA3= <user>
##$USERA4= <user>
##$USERA5= <user>
##$V9= 5
##$VALIST= <valist>
##$VCLIST= <CCCCCCCCCCCCCCC>
##$VD= 0
##$VDLIST= <DDDDDDDDDDDDDDD>
##$VPLIST= <PPPPPPPPPPPPPPP>
##$VTLIST= <TTTTTTTTTTTTTTT>
##$WBST= 1024
##$WBSW= 4
##$XGAIN= (0..3)
0 0 0 0
##$XL= 0
##$YL= 0
##$YMAX_a= 6936108
##$YMIN_a= -11402258
##$ZGOPTNS= <>
##$ZL1= 120
##$ZL2= 120
##$ZL3= 120
##$ZL4= 120
##$ABSF1= 14.96095
##$ABSF2= -5.597232
##$ABSG= 5
##$ABSL= 3
##$ALPHA= 0
##$AQORDER= 0
##$ASSFAC= 0
##$ASSFACI= 0
##$ASSFACX= 0
##$ASSWID= 0
##$AUNMP= <proc_prof1d_extract.lims>
##$AXLEFT= 0
##$AXNAME= <>
##$AXNUC= <1H>
##$AXRIGHT= 0
##$AXTYPE= 0
##$AXUNIT= <>
##$AZFE= 0.1
##$AZFW= 0.1
##$BCFW= 0
##$BC_mod= 0
##$BYTORDP= 0
##$COROFFS= 0
##$CY= 15
##$DATMOD= 1
##$DC= 0
##$DFILT= <>
##$DTYPP= 0
##$F1P= 0
##$F2P= 0
##$FCOR= 0.5
##$FTSIZE= 131072
##$FT_mod= 6
##$GAMMA= 0
##$GB= 0
##$INTBC= 1
##$INTSCL= 1
##$ISEN= 128
##$LB= 0.3
##$LEV0= 0
##$LPBIN= 0
##$MAXI= 10000
##$MC2= 0
##$MEAN= 0
##$ME_mod= 0
##$MI= 0
##$NCOEF= 0
##$NC_proc= -2
##$NLEV= 6
##$NOISF1= 0
##$NOISF2= 0
##$NSP= 0
##$NTH_PI= 0
##$NZP= 0
##$OFFSET= 14.96095
##$PC= 1
##$PHC0= 254.9432
##$PHC1= 0
##$PH_mod= 1
##$PKNL= yes
##$PPARMOD= 0
##$PPDIAG= 0
##$PPIPTYP= 0
##$PPMPNUM= 2147483647
##$PPRESOL= 1
##$PSCAL= 4
##$PSIGN= 0
##$PYNMP= <proc.py>
##$REVERSE= no
##$SF= 400.020009657321
##$SI= 131072
##$SIGF1= 0
##$SIGF2= 0
##$SINO= 400
##$SIOLD= 131072
##$SPECTYP= <>
##$SREGLST= <1H.CDCl3>
##$SSB= 0
##$STSI= 131072
##$STSR= 0
##$SW_p= 8223.68421052631
##$SYMM= 0
##$S_DEV= 0
##$TDeff= 65536
##$TDoff= 0
##$TI= <>
##$TILT= no
##$TM1= 0
##$TM2= 0
##$TOPLEV= 0
##$USERP1= <user>
##$USERP2= <user>
##$USERP3= <user>
##$USERP4= <user>
##$USERP5= <user>
##$WDW= 1
##$XDIM= 131072
##$YMAX_p= 427096028
##$YMIN_p= -12085
##$CURPLOT= <Network HP LaserJet P1505>
##$CURPRIN= <$Network HP LaserJet P1505>
##$DFORMAT= <normdp>
##$LAYOUT= <+/1D_H.xwp>
##$LFORMAT= <normlp>
##$PFORMAT= <normpl>
##$SURQMSG= 1
$$ End of Bruker specific parameters
$$ ---------------------------------
##NTUPLES= NMR SPECTRUM
##VAR_NAME=  FREQUENCY,     SPECTRUM/REAL,   SPECTRUM/IMAG
##SYMBOL=    X,             R,               I
##VAR_TYPE=  INDEPENDENT,   DEPENDENT,       DEPENDENT
##VAR_FORM=  AFFN,          ASDF,            ASDF
##VAR_DIM=   131072,        131072,          131072
##UNITS=     HZ,            ARBITRARY UNITS, ARBITRARY UNITS
##FACTOR=    0.0627417313425164, 1,          1
##FIRST=     8223.62146879497, 2533,         -72633
##LAST=      0,             6088,            -72487
##MIN=       0,             -12085,          0
##MAX=       8223.62146879497, 427096028,    0
$$ Real data points
##PAGE= N=1
##DATA TABLE= (X++(R..R)), XYDATA
$$ [...]
61522D01940m060m207l887l589l522l572l500l127k575k128j704q43M09J116O48
61507C67399k90p06r10j818l017l047j703n85p95j441j228l76Q4M6K53Q84J282
61490C54032R79L21j5K96R57J271Q34P9j85J43L54Q7j87o1R6j48m17j8R79J749
61470C61146J599N40q58j819j830j076k79R0J67K35K74J69m0k63m24k62M02J191
61452C58962J436J102Q43R45R03L15m81j001j205j056k07J313K674L187L249L669
61436C74648M549N390O003O547O933O897O510O046N410M251K594R02l65r19m59
61421D34937J070K996M225M262L715L630M406N433N724M860L260J558o3j700l168
61406D75145m113m635n251o120o765o785o385o012n825n650n226m343l137k231
$$ y = [401940, 397880, 393673, 389786, 386197, 382675, 379103, 375603, 372476, 369901, 367773, 366069, 365226, 365635, 366751, 367399, 367109, 366403, 365493, 363675, 360658, 357611, 355908, 355323, 354528, 353087, 351859, 351483, 351567, 351613, 351866, 352750, 354032, 355011, 355332, 355317, 355613, 356570, 357841, 358675, 358754, 358569, 358712, 359066, 359153, 358966, 358905, 359001, 358853, 358436, 358418, 359397, 361146, 362745, 363285, 362427, 360608, 358778, 357702, 357423, 357513, 357680, 357915, 358189, 358358, 358318, 358055, 357631, 357369, 357771, 358962, 360398, 361500, 362343, 363288, 364191, 364506, 364025, 363024, 361819, 360763, 360556, 361869, 364543, 367730, 370979, 374648, 379197, 384587, 390590, 397137, 404070, 410967, 417477, 423523, 428933, 433184, 435778, 436680, 436315, 435396, 434937, 436007, 439003, 443228, 447490, 451205, 454835, 459241, 464674, 470398, 475258, 478518, 480076, 480013, 478313, 475145, 471032, 466397, 461146, 455026, 448261, 441476, 435091, 429079, 423254, 417604, 412378, 408035, 404898, 402667]
61392D02667k106k307j907q32p0l06j035j376j157p35k84J89O04R74J479J994
61376C95792J986J324O94P16J102J195J028J214J984K830L110K694K043J775K042
61361D21529K296K009J510J708K819M047M726N152N900O885P617Q009Q472R472
61347D92151J1234J3515J5514J6428J6359J6085J5817J4789J2597J0143Q753Q794
61335F52179R605J0273R929P938M493P50k169m081n379o346p245q420r705j0202
61321F41620r347p816o703o243n882n250m387l353k328j793j934k113j563m26
61307E82482N41J089J707K827M380O095P767R182J0105J0261R281O956L736N69
61293F56978k049m419o735q429q883q298p330o356n551n220n354n294m477l222
$$ y = [402667, 400561, 398254, 396347, 395515, 395445, 395139, 394104, 392728, 391571, 390836, 390552, 390741, 391345, 392319, 393798, 395792, 397778, 399102, 399796, 400512, 401614, 402809, 403837, 405051, 407035, 409865, 412975, 415669, 417712, 419487, 421529, 423825, 425834, 427344, 429052, 431871, 435918, 440644, 445796, 451696, 458581, 466198, 474207, 482679, 492151, 503385, 516900, 532414, 548842, 565201, 581286, 597103, 611892, 624489, 634632, 643385, 652179, 661784, 672057, 681986, 689924, 694417, 695167, 692998, 688917, 683538, 677192, 669947, 661527, 651822, 641620, 632273, 624457, 617754, 611511, 605629, 600379, 595992, 592639, 590311, 588518, 586584, 584471, 582908, 582482, 583023, 584112, 585819, 588646, 593026, 599121, 606888, 616070, 626175, 636436, 645717, 652673, 656409, 656978, 654929, 650510, 643775, 635346, 626463, 618165, 610835, 604479, 598928, 593708, 588354, 583060, 578583, 575361]
61279E75361k206j472n39P56K143L410M526N453O228P060Q016Q902R619J0215
61265F37472J0389R630Q191P218P445Q414R592J1381J4324J7899K0979K3046K4268
61252H10248K4779K4527K3402K0999J6909J1751P104L690M40l794q430j2149j4819
61239I04657j7123j8845j8984j7396j5081j2934j1245j0244j0056j0150r756q788
61227G44055p596o133m204k296j133n88J01J191K291L031L088K020kj670j869
61212G30286j110o62o54k46O26J090P53L4q52k024l052l135k241j040K25J896
61196G19894M018O387R261J2874J6505J9180K1152K3318K5380K6006K4765K2420
61184I31160J9374J5513J1702R626R551R767Q991P853P315P001O037M464K826
$$ y = [575361, 573155, 571683, 571144, 571900, 574043, 577453, 581979, 587432, 593660, 600720, 608736, 617638, 627257, 637472, 647861, 657491, 665682, 672900, 680345, 688759, 698351, 709732, 724056, 741955, 762934, 785980, 810248, 835027, 859554, 882956, 903955, 920864, 932615, 939719, 943409, 943849, 940055, 931625, 919476, 904657, 887534, 868689, 849705, 832309, 817228, 804294, 793049, 782805, 772749, 762599, 752843, 744055, 736459, 730326, 726122, 723826, 722693, 722105, 722206, 723397, 725688, 728719, 731807, 733827, 733825, 732155, 730286, 729176, 728514, 727860, 727614, 728240, 729330, 730083, 730117, 729265, 727241, 724189, 721054, 718813, 717773, 717998, 719894, 723912, 730299, 739560, 752434, 768939, 788119, 809271, 832589, 857969, 883975, 908740, 931160, 950534, 966047, 977749, 987375, 996926, 1006693, 1015684, 1023537, 1030852, 1037853, 1043890, 1048354, 1051180]
61171A051180J176o70k491l967n152o147o910p641q791j0409j2098j3765j5672
61158I58643j7612j8878j9191j8896j8098j6540j4466j2614j1144r499p453n356
61146G88896l227p29J787L268L225J989l39l881p744j0235j0845j0688j0547r846
61132G31084q165o298m934l560j600M40J928L222M868O551P855R295J1546J4308
61118G66540J6798J8844K0687K2285K3497K4545K5590K6326K6543K6532K6481
61107A024668K6034K4981K3850K3270K3166K2981K2164K0236J7061J3293R847
61096A251551O654K712k326p617j2393j6757k0760k3838k5731k7047k8218k8823
61084A067407k8534k7814k7078k5965k4141k2010k0036j8131j6253j4798j3780
$$ y = [1051180, 1052356, 1051686, 1049195, 1045228, 1040076, 1033929, 1027019, 1019378, 1010587, 1000178, 988080, 974315, 958643, 941031, 922153, 902962, 884066, 865968, 849428, 834962, 822348, 811204, 801705, 794252, 788896, 785669, 784940, 786727, 789995, 793220, 795209, 794870, 790989, 783245, 773010, 762165, 751477, 740930, 731084, 722919, 716621, 711687, 708127, 706527, 706967, 708895, 712117, 716985, 723536, 731391, 740686, 752232, 766540, 783338, 802182, 822869, 845154, 868651, 893196, 918786, 945112, 971655, 998187, 1024668, 1050702, 1075683, 1099533, 1122803, 1145969, 1168950, 1191114, 1211350, 1228411, 1241704, 1251551, 1258205, 1260917, 1258591, 1250974, 1238581, 1221824, 1201064, 1177226, 1151495, 1124448, 1096230, 1067407, 1038873, 1011059, 983981, 958016, 933875, 911865, 891829, 873698, 857445, 842647, 828867]
61073H28867j2555j0907r556q903q222o778m960l516k443j344j55J077K432L541
61059G66578L651K855K493L564N431O773P266P624Q547J0063J1637J2715J3516
61046H62713J5013J7575K0073K1344K2014K3431K5392K6742K7833L0078L3137
61035A125345L5015L5277L5680L7049L8139L8429L9364M1732M4347M6574M9586
61024A566537N3636N6624N7028N5928N4641N3096N2183N4676O1614P0515P9457
61013B215935Q9889J02812J15501J25448J34779J47419J64778J87921K20845K67241
61003C772568L26995M00705M94456O15046P64695R47676J177677J468296J818106
60994A1786220K212547K626808K994414L167246K955663K274039J268827K73577
$$ y = [828867, 816312, 805405, 795849, 786946, 778724, 771946, 766986, 763470, 761027, 759683, 759528, 760605, 763037, 766578, 770229, 773084, 775577, 779141, 784572, 791345, 798611, 806235, 814782, 824845, 836482, 849197, 862713, 877726, 895301, 915374, 936718, 958732, 982163, 1007555, 1034297, 1062130, 1092208, 1125345, 1160360, 1195637, 1231317, 1268366, 1306505, 1344934, 1384298, 1426030, 1470377, 1516951, 1566537, 1620173, 1676797, 1733825, 1789753, 1844394, 1897490, 1949673, 2004349, 2065963, 2136478, 2215935, 2305824, 2408636, 2524137, 2649585, 2784364, 2931783, 3096561, 3284482, 3505327, 3772568, 4099563, 4500268, 4994724, 5609770, 6374465, 7322141, 8499818, 9968114, 11786220, 13998767, 16625575, 19619989, 22787235, 25742898, 28016937, 29285764, 29559341]
60986B9559341l96994o22728m72737q2646M09857Q23603R18844N15882l43884
60977C0308538j383011k261927k779863k931211k819282k555337k223417j885278
60969A1469212j579522j317572j095014r07864p54645o30055n26448m40318l71563
60960C846211l17943k75176k40881k13957j91426j70212j50818j35323j22669
60951B027806j09631r5611q2781p2107o2762n5100n0786m9808n0232n0913n1899
60940A296176n2354n0804m7593m4573m2221l9401l6020l3473l2148l0792k8793
60929H58004k7008k5832k4425k2413k0616j9518j8555j7367j6275j5122j3190
60918F37683j0745r176r007r066q187o625n249m354l689k887j586J20J384J589
$$ y = [29559341, 29162347, 28539619, 28066882, 27984236, 28394093, 29217696, 30136540, 30652422, 30308538, 28925527, 26663600, 23883737, 20952526, 18133244, 15577907, 13354490, 11469212, 9889690, 8572118, 7477104, 6569240, 5814595, 5184540, 4658092, 4217774, 3846211, 3528268, 3253092, 3012211, 2798254, 2606828, 2436616, 2285798, 2150475, 2027806, 1918175, 1822564, 1739783, 1667676, 1604914, 1549814, 1499028, 1449220, 1398988, 1348075, 1296176, 1243822, 1193018, 1145425, 1100852, 1058631, 1019230, 983210, 949737, 917589, 886797, 858004, 830996, 805164, 780739, 758326, 737710, 718192, 699637, 682270, 665995, 650873, 637683, 626938, 617762, 608755, 599689, 591502, 584877, 579628, 575274, 571585, 568698, 567112, 567232, 568616, 570205]
60904E70205J436J965K781K636J611J130J606J761P71m70r08q11q63r78q79r49
60888E80044j533k110k006j416j045j191j802k958m605o146o833o562n902n524
60874E30411n688o115o303o117n911n845n435m335l163k796l036k871j908o07
60860D70281Q68K873N186O802P221P021O685N837M208K551J770J818K163K822
60846E28106M208O191P989Q860Q439O782M441K249O39o41j823k620k778k709k937
60831E64396l214k885j957j189j019j020o18Q9M59M8r83k038k562k523k459k919
60815E39606l804m467m533m397m730n715o966q074q845r058q418p009n462m395
60801D53733l927l914m289m754m536l190j537r67j694k414j998q02J05L64L59
$$ y = [570205, 571641, 573606, 576387, 579023, 580634, 581764, 583370, 585131, 585902, 585432, 584524, 583713, 582850, 581872, 580993, 580044, 578511, 576401, 574395, 572979, 571934, 570743, 568941, 565983, 561378, 555232, 548399, 541837, 535935, 530411, 524723, 518608, 512305, 506188, 500277, 494432, 488997, 484662, 481499, 478703, 475667, 472796, 470888, 470281, 471149, 474022, 479208, 486010, 493231, 500252, 506937, 512774, 516982, 519533, 521303, 523121, 525284, 528106, 532314, 538505, 546494, 555354, 563793, 570575, 575016, 577265, 577904, 577263, 575440, 572820, 570042, 567333, 564396, 561182, 558297, 556340, 555151, 554132, 553112, 552494, 552583, 553042, 553090, 552107, 550069, 547507, 544984, 542525, 539606, 535802, 531335, 526802, 522405, 517675, 511960, 504994, 496920, 488075, 479017, 470599, 463590, 458128, 453733, 449806, 445892, 441603, 436849, 432313, 429123, 427586, 426619, 424925, 422511, 420513, 419711, 419816, 420180, 420539]
60786D20539L24J69K0K65J014J943K657K982L004L070L508M139M334L860L321
60771D55149L350L800M197M637N543O770P695Q167Q597R065R011Q108O857N923
60757E46869N302M555L634L018K985L061K420Q09j073k172j962o67J119K706L419
60742E74023L008J968R63j52k108m839p121p986p840p599p413o954o472o471o628
60727E08379o040m601l267k705k493j896q76J21Q90J584K311K967L482M012M796
60712E06664N791O629P056P337P865Q416Q451Q234Q900J0917J3143J4142J3918
60699F27463J3584J3733J4095J4534J5298J6228J6633J6244J5508J4777J3871
60688G91968J2681J1572J0844J0365R954R641R292Q509P200N767M389K603Qk981
$$ y = [420539, 420863, 421032, 421052, 421317, 422331, 424274, 426931, 429913, 432917, 435987, 439495, 443634, 447968, 451828, 455149, 458499, 462299, 466496, 471133, 476676, 483446, 491141, 499308, 507905, 516970, 525981, 534089, 540946, 546869, 552171, 556726, 560360, 563378, 566363, 569424, 571844, 572653, 571580, 569408, 567446, 566779, 567898, 570604, 574023, 577031, 578999, 579962, 579810, 577702, 572863, 565742, 557756, 549916, 542317, 534904, 527950, 521478, 515007, 508379, 502339, 497738, 494471, 491766, 489273, 487377, 486501, 486622, 487512, 489096, 491407, 494374, 497856, 501868, 506664, 512455, 519084, 526140, 533477, 541342, 549758, 558209, 566443, 575343, 586260, 599403, 613545, 627463, 641047, 654780, 668875, 683409, 698707, 714935, 731568, 747812, 763320, 778097, 791968, 804649, 816221, 827065, 837430, 847384, 857025, 866317, 874826, 882026, 887793, 892182, 894785, 894793, 891812]
60674H91812n508p258q656j0255j2171j4131j5804j7059j7883j8134j7629j6609
60662G30715j5843j5822j6059j5690j4734j4082j4149j4183j3252j1447r618q272
60650E67564p171n952m635l445k450j527o41QJ03m97j626k904l912m322m061l406
60634E21126k696j947r40K14R94J175J235J725K557L229L536L567L285K589J711
60619E41360J023N37qo65j313k026k942l834m299m322m176l902l431l096l356
60604E05550l973m207l920l787m140m397m099l800m217m919m730l304j651q57
60590D53549q39p38j71L34K07l90q68j009j027r59n28K75R77J278J455J807K093
60573D55446K028J945K450L586M874O068P323Q676R918J0977J2096J3537J5275
$$ y = [891812, 886304, 879046, 870390, 860135, 847964, 833833, 818029, 800970, 783087, 764953, 747324, 730715, 714872, 699050, 682991, 667301, 652567, 638485, 624336, 610153, 596901, 585454, 575836, 567564, 560393, 554441, 549806, 546361, 543911, 542384, 541743, 541751, 541854, 541357, 539731, 536827, 532915, 528593, 524532, 521126, 518430, 516483, 515543, 515757, 516751, 517926, 519161, 520886, 523443, 526672, 530208, 533775, 537060, 539649, 541360, 542383, 542920, 542912, 542247, 540934, 538908, 535966, 532132, 527833, 523511, 519335, 515433, 512002, 508906, 505550, 501577, 497370, 493450, 489663, 485523, 481126, 477027, 473227, 469010, 464091, 459361, 456057, 454406, 453549, 452710, 451972, 451801, 452135, 452342, 451952, 451084, 450075, 449048, 448089, 447561, 447836, 448813, 450091, 451546, 453353, 455446, 457474, 459419, 461869, 465455, 470329, 476397, 483720, 492396, 502314, 513291, 525387, 538924, 554199]
60560E54199J6859J7414J6152J3216R641O177K566j469n142p382q222q479q290
60547E97240p022m634k003K56K382M627O788Q879J1380J4392J7302J9708K1899
60534F91194K3898K4708K3209J9334J3865P517Q50n316j0071j3022j4371j4500
60522G47295j3689j2072r769p122m836l492k954k627k292k160k116j636n63P06
60508F82673J982L502N082N953N910N904O854Q589J0639J3448J7847K3747L0234
60495H22364L6766M3475N0393N7119O3298O8674P2551P3758P1388O5278N5656
60484A480720M2676K6469P555j2851l2839n0325o3853p2961p7816p8748p6330
60473A091697p1460o5055n7720n0012m2745l6712l2175k8840k6228k3957k1834
$$ y = [554199, 571058, 588472, 604624, 617840, 627481, 633658, 636224, 634755, 629613, 622231, 614009, 605530, 597240, 590218, 585584, 583581, 583837, 586219, 590846, 597634, 606513, 617893, 632285, 649587, 669295, 691194, 715092, 739800, 763009, 782343, 796208, 803725, 804575, 799259, 789188, 776166, 761795, 747295, 733606, 721534, 711765, 704643, 699807, 696315, 693361, 690734, 688442, 686282, 684166, 682530, 681967, 682673, 684655, 688157, 693239, 699192, 705102, 711006, 717860, 726449, 737088, 750536, 768383, 792130, 822364, 859130, 902605, 952998, 1010117, 1073415, 1142089, 1214640, 1288398, 1359786, 1425064, 1480720, 1523396, 1549865, 1557420, 1544569, 1511730, 1461405, 1397552, 1324591, 1246775, 1168027, 1091697, 1020237, 955182, 897462, 847450, 804705, 767993, 735818, 706978, 680750, 656793, 634959]
60462F34959j9872j8077j6194j3961j1637r865q814p958o958o172n881n569m610
60449D99391l371k806l145l627l504k796j981j459j351j493j508j171o48k22R3
60434D70402L38K53m14j420k211k494k270j581p16l98j057j990k069j324j005
60419D52044j777k668k369r68L09P67Q61J181J571J527J075Q14J113J598J595
60404D56673J028N50O98J152J178O41J28O9K34L32N70J197J820J817J257Q84J115
60387D71343J612J983K327K777L009K666J964J381J026P40O74J099J730J930J661
60372D97922J598K049K388J985J206Q72J125J326R80K48l21k67M93J472J910J583
60356E16569J139J295J905K281K160J885J785J932K395L145L773L921L943M610
$$ y = [634959, 615087, 597010, 580816, 566855, 555218, 545353, 536539, 528581, 521623, 515451, 509570, 504001, 499391, 496020, 493214, 490069, 486442, 482938, 480142, 478161, 476702, 475351, 473858, 472350, 471179, 470531, 470309, 470402, 470740, 470993, 470579, 469159, 466948, 464454, 462184, 460603, 459887, 459489, 458432, 456442, 454373, 453049, 452044, 450267, 447599, 445230, 444262, 444571, 445338, 446199, 447380, 448951, 450478, 451553, 452367, 453480, 455078, 456673, 457701, 458251, 458949, 460101, 461279, 461920, 462048, 462117, 462351, 462683, 463253, 464450, 466270, 468087, 469344, 470228, 471343, 472955, 474938, 477265, 480042, 483051, 485717, 487681, 489062, 490088, 490828, 491502, 492601, 494331, 496261, 497922, 499520, 501569, 503957, 505942, 507148, 508020, 509145, 510471, 511451, 511699, 511378, 511111, 511604, 513076, 514986, 516569, 517708, 519003, 520908, 523189, 525349, 527234, 529019, 530951, 533346, 536491, 540264, 544185, 548128, 552738]
60342E52738O036P512Q447Q942R244R158Q261O283L250l90l710n909p067p843
60328E94952q434q378p538o543n887n246m116k673j591j262j547k009k051j231
60314E36446K50J629K367K625K839L212L800M646N592O432P485R515J2803J6786
60300F16427K0940K5263K9281L1289K9522K4021J6605R005J642n754j2921j8775
60288G66545k2101k2391k0149j6474j2402q648n793m278m109m847o025p330q419
60275F23579r033r376r890j0477j0491r739q839q243p484o011m221l021k642k561
60261E21551k350k069j842j619j326r51n20k05k26m84n77m07l55n72n92r9L93
60244E07750K71j81j98K79N83L40j13l10m1P24J805K685K941K827K922L285L453
$$ y = [552738, 558774, 566286, 574733, 583675, 592919, 602077, 610338, 616621, 619871, 619481, 615771, 609862, 602795, 594952, 586518, 578140, 570602, 564059, 558172, 552926, 548810, 546137, 544546, 543284, 541737, 539728, 537677, 536446, 536696, 538325, 540692, 543317, 546156, 549368, 553168, 557814, 563406, 569838, 577323, 586838, 599641, 616427, 637367, 662630, 691911, 723200, 752722, 776743, 793348, 802353, 803995, 798241, 785320, 766545, 744444, 722053, 701904, 685430, 673028, 664380, 658587, 654309, 650200, 645353, 639328, 631998, 623579, 614546, 605170, 595280, 584803, 574312, 564573, 555734, 547491, 540007, 533996, 529775, 526754, 524112, 521551, 519201, 517132, 515290, 513671, 512345, 511394, 510874, 510669, 510443, 509959, 509382, 508975, 508620, 508048, 507456, 507357, 507750, 508021, 507840, 507642, 507921, 508504, 508844, 508731, 508421, 508380, 509104, 510909, 513594, 516535, 519362, 522284, 525569, 529022]
60227E29022L224K915K758K617K393K310K562K972L169K922K288J609J368J755
60213E63884K397K746K707K659K919L443L981M239L965L135K134J548J714K425
60199F03896L052K991K275J655J746K125J799O41l73n83n08p35q56l06K78k85
60183F16812j933l250l278k586k316k768l271l041j955p04k15o96j344j219k38
60168E87998R21J616J580Q66m0l94mM10K14j30K39J232K024K388K846L489L643
60151F08898K946J920J223R72J060J461J894J864J370J085J479K277L024L779
60137F35252M791N924O848P537Q202Q835R105Q641P392N629L631J307j609m803
60123G06682p160p735o795n487m614m146l724l052j966o44L04M82K70J93K5o81
$$ y = [529022, 532246, 535161, 537919, 540536, 542929, 545239, 547801, 550773, 553942, 556864, 559152, 560761, 562129, 563884, 566281, 569027, 571734, 574393, 577312, 580755, 584736, 588975, 592940, 596075, 598209, 599757, 601471, 603896, 606948, 609939, 612214, 613869, 615615, 617740, 619539, 620180, 619807, 619224, 618716, 617981, 617125, 616819, 617097, 616812, 614879, 611629, 608351, 605765, 603449, 600681, 597410, 594369, 592414, 591710, 591495, 590799, 589455, 588236, 587998, 588919, 590535, 592115, 592981, 592941, 592547, 592543, 592953, 593167, 593037, 593276, 594508, 596532, 598920, 601766, 605255, 608898, 611844, 613764, 614987, 615959, 617019, 618480, 620374, 622238, 623608, 624693, 626172, 628449, 631473, 635252, 640043, 645967, 652815, 660352, 668554, 677389, 686494, 695135, 702527, 708156, 711787, 713094, 711485, 706682, 699522, 691787, 684992, 679505, 674891, 670745, 667021, 663969, 662003, 661359, 661663, 662145, 662415, 662608, 662633, 661952]
60107F61952j403j062L44J521J576R87M91j5q91j881k544k989l442l569k871j478
60091F44726R3J734L682N779P369Q024Q026Q075Q589R277R391Q530P138N982N219
60076G41634M319K906J141p92k953n165o868p766q211q609q865q763q467q263
60062F75278q105p832p548p451p490p475p336p039o532o015n921o288o467n784
60048E77995m357k898j912j374r95n02K98J346K319K952L351L830M499N113N235
60033E94900M558L205J682L71p98j974k865l060k818k938l750m790n589o195o708
60018E63231o922o805o747o878o678n734m478l626l196k675j864j086o51o18q87
60003E04386j146r11k0J041J697J970K209K396K201J658J223J166J350J633K099
$$ y = [661952, 660549, 659487, 659831, 661352, 662928, 663915, 664406, 664391, 663500, 661619, 659075, 656086, 652644, 649075, 646204, 644726, 644819, 646553, 650235, 656014, 663383, 671407, 679433, 687508, 696097, 705374, 714765, 723295, 730433, 736415, 741634, 745953, 748859, 750000, 749208, 746255, 741090, 734222, 726456, 718245, 709636, 700771, 692008, 683541, 675278, 667173, 659341, 651793, 644342, 636852, 629377, 622041, 615002, 608470, 602455, 596534, 590246, 583779, 577995, 573638, 570740, 568828, 567454, 566459, 565957, 566255, 567601, 569920, 572872, 576223, 580053, 584552, 589665, 594900, 599458, 602663, 604345, 604716, 603918, 601944, 599079, 596019, 593201, 590263, 586513, 581723, 576134, 569939, 563231, 556309, 549504, 542757, 535879, 529201, 523467, 518989, 515363, 512167, 509492, 507628, 506542, 505891, 505273, 504386, 503240, 502329, 502309, 503350, 505047, 507017, 509226, 511622, 513823, 515481, 516704, 517870, 519220, 520853, 522952]
59988E22952K805L630M416M984N051M497L749L480L722L706K797J336K15k33n06
59973E66601j140k024k674k897k858k652k202j610j208j054p73j27N29P65Q00
59958E47476J234K166L017L241K821K078J403J118J158R15j11j477k164j884j410
59943E59581j396j534j311j085j689l226m836n636n480m761l874k968k084j322
59929E18379q66q19j040j267j338j219q54k45M03Q63J229J785K513L016L024K760
59913E26324K664K988L606M134M233M004L907M124M231L842L293L073K867J941
59899E75231M50m49r1Q49J291J004N35L67O09J139J739K270K926M051N541O805
59883F04267P425P509P279O760O016N266M561L787L104K947L379L852L730K701
$$ y = [522952, 525757, 529387, 533803, 538787, 543838, 548335, 552084, 555564, 559286, 562992, 565789, 567125, 567340, 567107, 566601, 565461, 563437, 560763, 557866, 555008, 552356, 550154, 548544, 547336, 546282, 545509, 545382, 545911, 546676, 547476, 548710, 550876, 553893, 557134, 559955, 562033, 563436, 564554, 565712, 566627, 566516, 565039, 562875, 560991, 559581, 558185, 556651, 555340, 554255, 552566, 549340, 544504, 538868, 533388, 528627, 524753, 521785, 519701, 518379, 517513, 516694, 515654, 514387, 513049, 511830, 510976, 510731, 511134, 511997, 513226, 515011, 517524, 520540, 523564, 526324, 528988, 531976, 535582, 539716, 543949, 547953, 551860, 555984, 560215, 564057, 567350, 570423, 573290, 575231, 575681, 575232, 575141, 575990, 577281, 578285, 578820, 579187, 579796, 580935, 582674, 584944, 587870, 591921, 597462, 604267, 611692, 619201, 626480, 633240, 639256, 644522, 649083, 652870, 655974, 658921, 662300, 666152, 669882, 672583]
59869F72583P02j971m397n581n498n078m953m892m534l962l267k357j519j364
59855F23912j871k211j966j696j794j627m71J405L344N296P486R695J1617J3247
59841F64366J4175J3146R395M071n50l070l589k825j479j76P70J341J147o59m039
59826F92024p389r192r885j0897j2285j2702j1614j0112r322r200r205r144q878
59813E62199q063o679n223m030k937j875j187j084j290j472j522j316p55k20l35
59798E24211j022j427j120p61j115j886k139j652j190j427k013j997j031J10M67
59783E06008J33Q7P07J052J64j411k164j535m76%K7L54J165J930K167J990J856
59766E12054K049K389K456K085J609J520J981K644K862K162Q61J34J017L093M715
$$ y = [672583, 673285, 671314, 666917, 661336, 655838, 650760, 645807, 640915, 636381, 632419, 629152, 626795, 625276, 623912, 622041, 619830, 617864, 616168, 614374, 612747, 612276, 613681, 617025, 622321, 629807, 639502, 651119, 664366, 678541, 691687, 701082, 705153, 704603, 701533, 697944, 695119, 693640, 693464, 694234, 695575, 696722, 696063, 692024, 684635, 675443, 665558, 654661, 642376, 629674, 618060, 607948, 598626, 589426, 580221, 571077, 562199, 554136, 547457, 542234, 538204, 535267, 533392, 532205, 531121, 529831, 528359, 526837, 525521, 524766, 524546, 524211, 523189, 521762, 520642, 519881, 518766, 516880, 514741, 513089, 511899, 510472, 508459, 506462, 505431, 505541, 506008, 506141, 506228, 506935, 507987, 508151, 506740, 504576, 503041, 502565, 502565, 502592, 502946, 504111, 506041, 508208, 510198, 512054, 514103, 516492, 518948, 521033, 522642, 524162, 526143, 528787, 531649, 533811, 534672, 534806, 535823, 538916, 543631]
59751E43631M826M086L784M265M976N528N899N876N199M259L818L947L838K883
59737F06815J402J40n65q62r58q77n59j59o2m67r58q90k52K63K16r2l22n67q14
59718F00432o05J90Q99J009R80J420J997K028J654J530J756K028K442L217L964
59703F24941M253M529N411O340O111M688L289K667K441K211K133K172J808Q78
59689F73872j55j028j950k889l419l447l284k850j771m19J77l22j168j790k386
59674F47171k989l079k693k870m210n756o138n242m084l466l373l384l175k757
59660E93955k453k399k155j294k46K19K40O94J675K343K491L015M211M855L840
59645F08991J818J71q32j810k852l473l714m234n231o054n982m941l458k217j582
$$ y = [543631, 548457, 552543, 556327, 560592, 565568, 571096, 576995, 582871, 588070, 592329, 596147, 600094, 603932, 606815, 608217, 608357, 607792, 606930, 605972, 605095, 604536, 604377, 604315, 603848, 602890, 602000, 601748, 602011, 602227, 602135, 601813, 601246, 600432, 599827, 600017, 600916, 601925, 602905, 604325, 606322, 608350, 610004, 611534, 613290, 615318, 617760, 620977, 624941, 629194, 633723, 639134, 645474, 651585, 656273, 659562, 662229, 664670, 666881, 669014, 671186, 672994, 673872, 673717, 672689, 670739, 667850, 664431, 660984, 657700, 654850, 653079, 652660, 652837, 652515, 651347, 649557, 647171, 644182, 641103, 638410, 635540, 631330, 625574, 619436, 614194, 610110, 606644, 603271, 599887, 596712, 593955, 591502, 589103, 586948, 585654, 585408, 585627, 585867, 586561, 588236, 590579, 593070, 596085, 600296, 605151, 608991, 610809, 610980, 610148, 608338, 605486, 602013, 598299, 594065, 588834, 582780, 576798, 571857, 568399, 566182, 564600]
59630E64600j306r19m86n38j107j513j379j252j650k120j902j084m29l37n99r39
59614E47040j289j640k042k581l073k986k004m49J050K053K381K140J916K348
59600E42864L232L515K569J031j4j78J63N38O96O93R25J648K353K247J562J445
59584E65289K182K499J322o30j871k060j931j989k260k868l813m420m043l174
59570E42233k912l425l776l290k260j314p59o54q99j113r67o11m41m48k58K63
59554E19369R22J516J860J683J061P11J233K194K633K398K341L105M358N461O365
59539E57210P564R370J1644J4227J7421K1544K5546K6539K1889J2325K146m427
59527G22998o591o184m642k034J428M601O610P710Q459Q743Q043O193L480M42
$$ y = [564600, 563294, 562375, 561889, 561351, 560244, 558731, 557352, 556100, 554450, 552330, 550428, 549344, 548915, 548578, 547979, 547040, 545751, 544111, 542069, 539488, 536415, 533429, 531425, 530976, 532026, 534079, 536460, 538600, 540516, 542864, 546096, 549611, 552180, 553211, 553197, 553019, 553182, 553720, 554416, 555109, 556034, 557682, 560035, 562282, 563844, 565289, 567471, 569970, 571292, 570662, 568791, 566731, 564800, 562811, 560551, 557683, 553870, 549450, 545407, 542233, 539321, 535896, 532120, 528830, 526570, 525256, 524497, 523843, 522944, 521831, 520864, 520253, 519812, 519364, 519106, 519369, 520291, 521807, 523667, 525350, 526411, 527122, 528355, 530549, 533182, 535580, 537921, 541026, 545384, 550845, 557210, 564774, 574144, 585788, 600015, 617436, 638980, 664526, 691065, 712954, 725279, 727425, 722998, 716407, 710223, 705581, 703547, 704975, 709576, 716186, 723896, 732355, 741098, 749141, 755334, 758814, 759256]
59513G59256k288m340o049q109j0597j2707j3663j3523j2964j2542j2404j2372
59501F37698j2021j0922r079p042n482m689m454m282l750k779j722j019q16r23
59487E68718j070j108j049j030j152j258j012k92O36J448K121K908M033N474O847
59472E84214P532P170O071M843L639K169M04j195k245k660k331j185K72J275J919
59457F09892L158N332P578R231J0860J3091J5231J6118J5835J5423J5213J4672
59445G51634J3647J2608J1450R114M852p88o527j1351j4669j6133j5846j4542
59433G23449j3169j2215j1572j0920j0153r294q077o031l285r24J67O62K107M832
59419F45577P638R749J1877J4666J7382J9110K0248K1733K3647K5759K8209K9924
$$ y = [759256, 756968, 752628, 746579, 738470, 727873, 715166, 701503, 687980, 675016, 662474, 650070, 637698, 625677, 614755, 605676, 598634, 593152, 588463, 584009, 579727, 575977, 573198, 571476, 570457, 569641, 568718, 567648, 566540, 565491, 564461, 563309, 562051, 561039, 560747, 561383, 562831, 564952, 567860, 571893, 577367, 584214, 591746, 598916, 604987, 609830, 613469, 615638, 616042, 614847, 612602, 609942, 607611, 606426, 606698, 607973, 609892, 613050, 618382, 625960, 635191, 646051, 659142, 674373, 690491, 706326, 721749, 736962, 751634, 765281, 777889, 789339, 798453, 803305, 802517, 795990, 784639, 769970, 753837, 737991, 723449, 710280, 698065, 686493, 675573, 665420, 656126, 648049, 642018, 638733, 637809, 637976, 638638, 640745, 645577, 653215, 662964, 674841, 689507, 706889, 725999, 746247, 767980, 791627, 817386, 845595, 875519]
59407H75519K7320J7178J090j4831k5215k9021k7945k3472j6637q827j172N970
59395G79957J1484J2355N946o388j9332k7872l0922l0570k8746k5607k0870j5513
59383F03922j1302q989p745o489n041l678k341r88j44k39o72m37M44R93P92N47
59367E58633R22J613J997K094K367K926L320L079K236J390J268K145L687N428
59353E93105P151Q680R777J0581J1774J3801J6229J8375K0164K1763K2776K2663
59341G76839K1738K0990K0814K0579J9347J6510J1995O562J729j479l658o137
59329I05829r135j1675j3288j4637j6171j7211j6950j5633j4136j2928j1866j0744
59317G41455r586q588p895p354o531n258l943l008k331j723j546k090k663k241
$$ y = [875519, 902839, 920017, 921107, 906276, 881061, 852040, 824095, 800623, 783986, 775159, 773987, 779957, 791441, 803796, 809742, 803354, 784022, 756150, 725228, 694658, 665912, 640305, 619435, 603922, 592620, 583631, 575886, 569397, 564356, 560678, 558337, 557349, 557205, 556966, 556294, 555857, 556301, 557294, 558086, 558633, 559555, 561168, 563165, 565259, 567626, 570552, 573872, 576951, 579187, 580577, 581845, 583990, 587677, 593105, 600256, 608936, 618713, 629294, 641068, 654869, 671098, 689473, 709637, 731400, 754176, 776839, 798577, 819567, 840381, 860960, 880307, 896817, 908812, 915374, 917103, 915624, 911966, 905829, 896694, 885019, 871731, 857094, 840923, 823712, 806762, 791129, 776993, 764065, 752199, 741455, 731869, 723281, 715386, 708032, 701501, 696243, 692300, 689292, 686961, 685238, 683692, 681602, 678939, 676698]
59303F76698q96L42J017J733L056M920P277J0288J3723J7016K0125K3253K5329
59290H03881K3840J7116O334n119j3933j8434j8913j7039j4587j2181r483o466
59278G35016l841k047n67J332L779O435Q974J1161J2955J4686J6577J8115J8510
59265H41085J7856J7001J6130J4353J1004O520J766k835p106j0810j3872j6302
59253H74790j7798j8093j7722j7533j7325j6053j3674j1588j0732j0379r431p863
59241G06599o145m218j959R9J373K030K575L244M245N789P288P421N712L281J323
59226G38657k85k122l990n539p264r607j1740j2451j1829j0955j0292r506q510
59213F34567p532o415m939l721l661m520n015m430l211j972q68p6J2n71j143j123
$$ y = [676698, 675802, 676144, 677161, 678894, 681950, 686870, 694147, 704435, 718158, 735174, 755299, 778552, 803881, 827721, 844837, 851171, 846052, 832119, 813685, 794772, 777733, 763146, 750965, 741482, 735016, 731175, 729128, 728561, 729893, 733672, 740107, 749081, 760242, 773197, 787883, 804460, 822575, 841085, 858941, 875942, 892072, 906425, 917429, 923949, 925715, 922880, 915774, 904964, 891092, 874790, 856992, 838899, 821177, 803644, 786319, 770266, 756592, 745004, 734272, 723893, 714462, 706599, 700454, 696236, 694277, 694376, 695749, 697779, 700354, 703598, 707843, 713632, 720920, 728341, 734053, 737334, 738657, 738372, 736250, 732260, 726721, 719457, 709850, 698110, 685659, 673830, 662875, 652583, 643077, 634567, 627035, 620620, 615681, 611960, 608299, 603779, 598764, 594334, 591123, 589151, 588283, 588207, 588219, 587648, 586505, 585382]
59197E85382o16m3M10Q19J339K073K953L737M258M627N023N502O122O888P475
59182F35949P426O810O239O031N869N547N328N282M997M478M486N360O262O402
59168G16466O271O811P986R171J0314J1635J2636J2628J1936J1368J0682Q841
59156H36745N747K553P5j980m012n844p403r138j1152j2679j2924j2004j0673
59143G57311r550q855q504q195p681p051o414n471l963k457j879k127j954o44
59129F82566R68J761J979K850M751O660P584P864Q675J0539J2852J4815J6271
59116G80135J7455J8358J8849J9186J9872K0944K1847K2051K1374J9782J7400
59105I97253J4801J2711J1191R689P986O448N125L404R85j479l326m774o310p713
$$ y = [585382, 584766, 584723, 585133, 585952, 587291, 589364, 592317, 596054, 600312, 604939, 609962, 615464, 621586, 628474, 635949, 643375, 650185, 656424, 662455, 668324, 673871, 679199, 684481, 689478, 693956, 698442, 703802, 710064, 716466, 722737, 729548, 737534, 746705, 757019, 768654, 781290, 793918, 805854, 817222, 827904, 836745, 842492, 845045, 845120, 843140, 839128, 833284, 825881, 816743, 805591, 792912, 779988, 767984, 757311, 747761, 738906, 730402, 722207, 714526, 707475, 701061, 695590, 691627, 689170, 687291, 685164, 683210, 682566, 683534, 685295, 687274, 690124, 694875, 701535, 709119, 716983, 725658, 736197, 749049, 763864, 780135, 797590, 815948, 834797, 853983, 873855, 894799, 916646, 938697, 960071, 979853, 997253, 1012054, 1024765, 1035956, 1045645, 1053631, 1060079, 1065204, 1068608, 1069593, 1068114, 1064788, 1060014, 1053704, 1045991]
59091A045991q397q274p687o867o035n612n673n614n075m841o003q494j1149j3085
59077I43185j4375j5467j6499j7185j6985j5675j3946j2992j3036j2928j1746
59066G82351j0146r296r092q525p402o557o453o661o714o554o076n162m318m350
59052F85045n158n654n136m130l474l249k920k176j193l65J3q0l50l79J31J311
59036F52236L100N063O453O719N949M762M016M491O329Q574R965J0411J1112J2918
59022G52098J5381J7793K0264K2999K5328K6350K5965K4401K1369J6670J1153
59011I79771O039J619k437n823p737q031p274n802l633j127J163L142M922O215
58997I61007O715O778O777O219M482K083Q2j516l580o209q512j0026j1273j2739
$$ y = [1045991, 1037594, 1029320, 1021633, 1014766, 1008731, 1003119, 997446, 991832, 986757, 981916, 975913, 967419, 956270, 943185, 928810, 913343, 896844, 879659, 862674, 846999, 833053, 820061, 807025, 794097, 782351, 772205, 762909, 753817, 745292, 737890, 731333, 724880, 718219, 711505, 704951, 698875, 693713, 689395, 685045, 679887, 674233, 669097, 664967, 661493, 658244, 655324, 653148, 651955, 651590, 651603, 651523, 651173, 650794, 650925, 652236, 655336, 660399, 666852, 673571, 679520, 684282, 688298, 692789, 699118, 707692, 717657, 728068, 739180, 752098, 767479, 785272, 805536, 828535, 853863, 880213, 906178, 930579, 951948, 968618, 979771, 985810, 987429, 984992, 979169, 971432, 963401, 956127, 950325, 946692, 945565, 946728, 949870, 954792, 961007, 967722, 974500, 981277, 987496, 991978, 994061, 994143, 992627, 989047, 982838, 974326, 964300, 953027, 940288]
58983I40288j4301j5700j6749j7030j6255j4813j3162j0919p639m143j873r47
58971H06757j03J476L523N759Q267J0615J1981J2424J2889J3714J4330J4523J4739
58958I30894J4782J3613J0872P386L761k81m682q507j1261j3633j6121j7998j8345
58945H90480j7263j5425j3246j1048r125p044l877K87L967O003O617O176M129
58932H40631L10l780o287p129p717q926j0331j1179j1176j0436r387q649q490
58919G37454q496q079p146n932m635l497k835k519j925p69L89R61J285K177L819
58904G00252N538O697P470Q723J1065J3996J6151J6743J6415J6211J6100J5315
58892H50676J3922J2946J3067J4154J6188J9467K3517K6942K8818K9394K8976
$$ y = [940288, 925987, 910287, 893538, 876508, 860253, 845440, 832278, 821359, 813720, 809577, 807704, 806757, 806654, 808130, 811653, 817412, 825679, 836294, 848275, 860699, 873588, 887302, 901632, 916155, 930894, 945676, 959289, 970161, 977547, 981308, 981027, 976345, 967838, 956577, 942944, 926823, 908825, 890480, 873217, 857792, 844546, 833498, 824373, 817329, 813452, 813739, 817706, 823709, 830326, 836502, 840631, 840941, 837161, 830874, 823745, 816028, 807102, 796771, 785592, 774416, 763980, 754593, 745944, 737454, 728958, 720879, 713733, 707801, 703166, 699669, 696834, 694315, 692390, 691621, 692010, 692971, 694256, 696433, 700252, 705790, 712487, 719957, 728680, 739745, 753741, 769892, 786635, 803050, 819261, 835361, 850676, 864598, 877544, 890611, 904765, 920953, 940420, 963937, 990879, 1019697, 1049091, 1078067]
58881A078067K7127K3528J8764J3585Q182K708k320o781j1359j6400k0981k3944
58869A090176k5342k6089k6467k5759k3317j9524j5664j2973j1684j0985j0099
58858H82273r217q967r315r679r937j0415j0997j1203j1086j0958j0323q415n860
58845G55901m370m468m956n054n541o954q239q272p553p193p126o554n382m117
58831F70122k941j811j015p44o07k90j40m26p00n51l06l11k02L03P24O96P83J494
58813F64078K193J985J068K55k98q82j283j105p18r23j817k765l281l312k936
58798F50259k425k212k354k350k029j981k589l215l072k286j407m94O04J611K346
58783F28406L270M730O070O476O227O259O720O858O164M908L619K572J694N74
$$ y = [1078067, 1105194, 1128722, 1147486, 1161071, 1169253, 1171961, 1169641, 1162860, 1151501, 1135101, 1114120, 1090176, 1064834, 1038745, 1012278, 986519, 963202, 943678, 928014, 915041, 903357, 892372, 882273, 873056, 864089, 854774, 845095, 835158, 824743, 813746, 802543, 791457, 780499, 770176, 761761, 755901, 751531, 747063, 742107, 737053, 731512, 724558, 716319, 708047, 700494, 693301, 686175, 679621, 674239, 670122, 667181, 665370, 664355, 663611, 663004, 662714, 662574, 662148, 661448, 660897, 660591, 660280, 660078, 660381, 661105, 661801, 662584, 664078, 666271, 668256, 669324, 669579, 669281, 668399, 667116, 666011, 665293, 664370, 662553, 659788, 656507, 653195, 650259, 647834, 645622, 643268, 640918, 638889, 636908, 634319, 631104, 628032, 625746, 624339, 623845, 624449, 626060, 628406, 631676, 636406, 642476, 648952, 655179, 661438, 668158, 675016, 681180, 686088, 689707, 692279, 693973, 694547]
58769F94547j166l227m774n441n703n911n741m931l803k638j305j2N18K26J51
58754F50790R97K182L045L898N004N546M833L725L567M351N107N651O638Q248
58740G13582R873J1019J1624J1770J1796J2379J3777J5340J6396J7084J7777J8271
58728H80688J8162J7431J5963J3312R606N873K719m46m012o983q127p450n604
58715I31132k860K70K530L370L938N214O081M894K140k64j745l412n928q792j1578
58700I24990j4307j6677j8317j9711k1577k3360k3740k2550k0928j9549j7940
58689G06334j5616j2851j0188q126p160p301p677p435o735o151n566m663l869
58676F02996l694l662l059k229j880j603n08J168K491L537N190P486R630J1450
$$ y = [694547, 693381, 690154, 685380, 679939, 674236, 668325, 662584, 657653, 653850, 651212, 649907, 649895, 650413, 650639, 650790, 651787, 653969, 657014, 660912, 665916, 671462, 676295, 680020, 683587, 687938, 693045, 698696, 705334, 713582, 723455, 734474, 746098, 757868, 769664, 782043, 795820, 811160, 827556, 844640, 862417, 880688, 898850, 916281, 932244, 945556, 955162, 961035, 963754, 963308, 959296, 952313, 944186, 936736, 931132, 928272, 928542, 931072, 934442, 938380, 943594, 949675, 954569, 956709, 956445, 954700, 951288, 945360, 936568, 924990, 910683, 894006, 875689, 855978, 834401, 811041, 787301, 764751, 743823, 724274, 706334, 690718, 677867, 667679, 659553, 652393, 645092, 637415, 629980, 623245, 617094, 611528, 606865, 602996, 599302, 595640, 592581, 590352, 588472, 586869, 586361, 587529, 590020, 593557, 598747, 606233, 615863, 627313]
58662F27313J3432J5380J6420J6250J5131J2844R026M470P04j776l655n268o167
58649G14104o223n903n461m887m573m940n500n399m688m065l638k994k175j470
58635F52188o34M75J059M32n89p30j40K27M80J274K018J596N29M44J435K049J915
58618F64028K342L964N815P210Q819J1117J3321J4516J4603J3704J1760R100O342
58605G86641L514L61k491m001m311m601n277n689n620n615n741n501n042m988
58591G31639m964l819j516O74K109L535N700Q466J1445J4222J6010J6331J5978
58578H15810J5930J5572J3567J0251P370N517L758J823P00P90J381K328M463P922
58564I07182J1765J5569J9730K3950K7087K8802K9741K9913K8687K6466K4410
$$ y = [627313, 640745, 656125, 672545, 688795, 703926, 716770, 725796, 730266, 730970, 729194, 725539, 720271, 714104, 707881, 701978, 696517, 691630, 687057, 682117, 676617, 671218, 666530, 662465, 658827, 655833, 653658, 652188, 651554, 652029, 653088, 653520, 652931, 652201, 652061, 652288, 652768, 654042, 656060, 657656, 658185, 658629, 660064, 662113, 664028, 666370, 670334, 676149, 683359, 692178, 703295, 716616, 731132, 745735, 759439, 771199, 780299, 786641, 790155, 790516, 788025, 784024, 779713, 775112, 769835, 764146, 758526, 752911, 747170, 741669, 736627, 731639, 726675, 722856, 721340, 722014, 724123, 727658, 733358, 741824, 753269, 767491, 783501, 799832, 815810, 831740, 847312, 860879, 871130, 878500, 884017, 887775, 889598, 890298, 891088, 892469, 894797, 899260, 907182, 918947, 934516, 954246, 978196, 1005283, 1034085, 1063826, 1093739, 1122426, 1148892, 1173302]
58553A173302K2316J8867J4272J0413P796M609l69n977j0686j4484j7709j9883
58541A182467k0851k1633k3031k4583k5616k6137k6026k4811k2758k0950j9726
58530I26345j8317j6338j4280j2316j0088p873o323n022k973o26O11R17J886L604
58516H39207M264L271K283K445K858K720K743L360L618L000K552L041L685L642
58502H82689L177K597J636N47P9j00j190l072m318m771n751p293p621o126m336
58487H46147l110j427J047K835L375M377P078J0333J2752J4557J6131J6868J6703
58474I47666J6657J6744J5526J2672R507O211J225n282j0427j2601j3603j5113
58462I69182j5926j4724j2746j1443r961p248m417k678j056J564M151N412N971
$$ y = [1173302, 1195618, 1214485, 1228757, 1239170, 1246966, 1251575, 1251206, 1245229, 1234543, 1220059, 1202350, 1182467, 1161616, 1139983, 1116952, 1092369, 1066753, 1040616, 1014590, 989779, 967021, 946071, 926345, 908028, 891690, 877410, 865094, 855006, 847133, 840810, 835788, 832815, 832189, 832800, 833717, 835603, 839207, 843471, 846742, 849025, 851470, 854328, 857048, 859791, 863151, 866769, 869769, 872321, 875362, 879047, 882689, 885866, 888463, 890099, 890646, 890725, 890625, 889435, 886363, 882045, 877274, 871523, 864230, 856609, 850483, 846147, 843037, 841610, 842657, 845492, 848867, 853244, 860322, 870655, 883407, 897964, 914095, 930963, 947666, 964323, 981067, 996593, 1009265, 1018772, 1024983, 1026208, 1020926, 1010499, 997898, 984295, 969182, 953256, 938532, 925786, 914343, 904382, 897134, 892717, 890039, 888983, 890547, 894698, 900110, 906081]
58449I06081O649O553M924K881J385m94l300n341n242m199l641k782p39J213J840
58434I05788K347M092N912O176N695O105P144P882Q943J1166J3734J5873J8607
58421A019464K2723K6796K9367L1005L1970K9978K3010J2528J570q492j7029k2225
58409A180665k3024k1289j9452j7515j4698j2049j0895j0423r320q062p278n765
58397A020895k667L69J693K354L875N405N640N373N500M688J805j429k983l568
58383A046950m426m519k804q93l13M34K884N103M659K807K164K441K096K065L934
58368A062582O411P343P567R025J0865J1079J0310J0464J1157J1089J1125J2472
58356A181489J3694J2998J1567J1107J0329P581M702M267N152M897M321N584P725
$$ y = [906081, 912730, 919283, 924207, 927088, 928473, 927979, 924679, 919338, 914096, 909897, 906256, 903474, 902735, 903948, 905788, 908135, 912227, 918139, 924315, 930010, 936115, 943259, 951141, 960084, 971250, 984984, 1000857, 1019464, 1042187, 1068983, 1098350, 1129355, 1161325, 1191303, 1214313, 1226841, 1228411, 1219919, 1202890, 1180665, 1157641, 1136352, 1116900, 1099385, 1084687, 1072638, 1061743, 1051320, 1042000, 1033938, 1026660, 1020895, 1018228, 1018597, 1020290, 1022644, 1026519, 1031924, 1037564, 1042937, 1048437, 1053125, 1054930, 1053501, 1050518, 1046950, 1042524, 1038005, 1035201, 1034308, 1033995, 1034429, 1037313, 1042416, 1047075, 1049882, 1052046, 1054487, 1056583, 1058648, 1062582, 1068993, 1076336, 1083903, 1092928, 1103793, 1114872, 1125182, 1135646, 1146803, 1157892, 1169017, 1181489, 1195183, 1208181, 1219748, 1230855, 1241184, 1248765, 1253467, 1257734, 1262886, 1267783, 1272104, 1277688, 1285413]
58343A285413Q454Q461R681J1237J1342J1299J3277J6042J7157J7381J8633J9853
58331A448230J9244J8316J9086J9683J7519J4346J3210J2848J0358O970N706N681
58319A611197M285K747L785N945O204N910Q113J1197J1556J0522J2150J5878J7938
58306A727427J8367K0020K2284K2449K1799K3569K6384K6449K4694K4867K6154
58295A984463K4874K2025K1787K3766K4056K2760K3166K4725K4349K3361K5502
58284B244834K9320L0261K9014K9866L2195L1930L0122L1459L5317L6964L6646
58273B597928L8736M2798M4542M4772M8207N4157N7654N8998O2842O8656P1683
58262C190973P2588P6238Q1915Q4634Q5057Q7677R0514Q7717Q1263P8544P9392
$$ y = [1285413, 1293867, 1302328, 1312009, 1323246, 1334588, 1345887, 1359164, 1375206, 1392363, 1409744, 1428377, 1448230, 1467474, 1485790, 1504876, 1524559, 1542078, 1556424, 1569634, 1582482, 1592840, 1599810, 1605516, 1611197, 1615482, 1618229, 1622014, 1627959, 1634163, 1640073, 1648186, 1659383, 1670939, 1681461, 1693611, 1709489, 1727427, 1745794, 1765814, 1788098, 1810547, 1832346, 1855915, 1882299, 1908748, 1933442, 1958309, 1984463, 2009337, 2031362, 2053149, 2076915, 2100971, 2123731, 2146897, 2171622, 2195971, 2219332, 2244834, 2274154, 2304415, 2333429, 2363295, 2395490, 2427420, 2457542, 2489001, 2524318, 2561282, 2597928, 2636664, 2679462, 2724004, 2768776, 2816983, 2871140, 2928794, 2987792, 3050634, 3119290, 3190973, 3263561, 3339799, 3421714, 3506348, 3591405, 3679082, 3769596, 3857313, 3938576, 4017120, 4096512]
58251D096512P7467P3485P4394Q0048Q3716Q5489R1831J02001J08675J12131J19727
58240E105476J31210J38972J43184J51752J64758J74331J80467J91131K06178
58231F587459K17568K26064K40536K60220K75632K87685L06882L32834L54610
58222I089490L72452L98155M32510M64502M94443N34720N85674O35171O84086
58213A3691203P46555Q22917Q99816R79312J078534J198546J325469J464829J640311
58204B3847492J856268K099754K382622K740043L184790L710441M344285N146662
58196D9312357O157522P406756Q982038J1014770J3592555J6765274K0629848
58189A33861120K5277376L0603461L6224225M1452025M5009304M4738979L8272524
$$ y = [4096512, 4173979, 4247464, 4321858, 4401906, 4485622, 4571111, 4662942, 4764943, 4873618, 4985749, 5105476, 5236686, 5375658, 5518842, 5670594, 5835352, 6009683, 6190150, 6381281, 6587459, 6805027, 7031091, 7271627, 7531847, 7807479, 8095164, 8402046, 8734880, 9089490, 9461942, 9860097, 10292607, 10757109, 11251552, 11786272, 12371946, 13007117, 13691203, 14437758, 15260675, 16160491, 17139803, 18218337, 19416883, 20742352, 22207181, 23847492, 25703760, 27803514, 30186136, 32926179, 36110969, 39821410, 44165695, 49312357, 55469879, 62876635, 71858673, 82873443, 96465998, 113231272, 133861120, 159138496, 189741957, 225966182, 267418207, 312427511, 357166490, 395439014]
58182C95439014K4860312O796702j1363289k5404250l3488462l6091279l4715061
58175B86033687l1037173k6750236k3276834k1193169k0087660j9159562j7911340
58168A26617713j6297841j4472742j2594983j0801902r193006p798254o604463
58161D8854522n602899m782638m107493l538306l060720k666623k331297k032915
58153B0731631j773491j559204j379255j221578j089199r84154q94069q09732
58145A1020949p37585o81127o28272n70321n15643m71736m30985l86524l45466
58136F253290l14056k85411k54058k27736k13276k04640j95587j90301j91046
58127D177179j88998j78078j65311j57418j49369j36054j23149j16371j11112
$$ y = [395439014, 420299326, 427096028, 415732739, 390328489, 356840027, 320748748, 286033687, 254996514, 228246278, 204969444, 183776275, 163688615, 144529053, 126617713, 110319872, 95847130, 83252147, 72450245, 63257239, 55458985, 48854522, 43251623, 38468985, 34361492, 30823186, 27762466, 25095843, 22764546, 20731631, 18958140, 17398936, 16019681, 14798103, 13708904, 12724750, 11830681, 11020949, 10283364, 9602237, 8973965, 8403644, 7888001, 7416265, 6985280, 6598756, 6253290, 5939234, 5653823, 5399765, 5172029, 4958753, 4754113, 4558526, 4368225, 4177179, 3988181, 3810103, 3644792, 3487374, 3338005, 3201951, 3078802, 2962431, 2851319]
58118B851319j02510r5038r2762r0349q2958p5375p2526p0369o4547n8852n6954
58107A989079n4795m9135m4773m5481m6442m3457m0893m2737m4293m0809l6263
58096A500001l5611l5883l2918k9651k9884l0594k8010k4859k4409k3708j9669
58085A184805j5664j5188j5144j2175r570j1174j4283j5208j6127j9840k3374
58074A017058k3314k2198k3178k3676k0678j7141j6723j7117j4881j2150j2234
58063H13768j3129j1533r039q415q031n720l973n526p824p478o343p712j0296
58050G08749j1263j1506j2735j3171j1092q906q890q782o372m290n293o926o008
58037E93515m355m905o110n417m467n555o671n377l988n614q467r323r195j0366
$$ y = [2851319, 2748809, 2653771, 2561009, 2470660, 2387702, 2312327, 2239801, 2169432, 2104885, 2046033, 1989079, 1934284, 1885149, 1840376, 1794895, 1748453, 1704996, 1664103, 1621366, 1577073, 1536264, 1500001, 1464390, 1428507, 1395589, 1365938, 1336054, 1305460, 1277450, 1252591, 1228182, 1204474, 1184805, 1169141, 1153953, 1138809, 1126634, 1117064, 1105890, 1091607, 1076399, 1060272, 1040432, 1017058, 993744, 971546, 948368, 924692, 904014, 886873, 870150, 853033, 838152, 826002, 813768, 800639, 789106, 780067, 771652, 763621, 757901, 753928, 748402, 740578, 733100, 726757, 719045, 708749, 697486, 685980, 673245, 660074, 648982, 640076, 631186, 622404, 616032, 611742, 606449, 599523, 593515, 589160, 584255, 578145, 572728, 568261, 562706, 556035, 550658, 546670, 541056, 532589, 523266, 514071, 503705]
58023E03705j1173r107n977m724m208k247o51j948m126l924k524k738l455k240
58009D44663o09j288k715j754M35N95o93n66O59P02J97J299L098L180K266K722
57993D52191M131M646M983O696Q398Q054P055P706Q676P413N059M298M322K577
57979E36205j95j407j396k269l471l064j845j794k055q12M81o75l030l566k697
57964E08410k896l714k933j377j661l223l338k140k031l019l148k777l793n370
57950D66990n064l478l383m703m793l299k399k450j611L54J787K553M013N935
57936D50452P004P903J0321J3401J4857J4880J5340J5764J4099J0816Q302O622
57924E89761L819L2k608l890n551p625q535q635r850j1886j2471j1314j0345j0095
$$ y = [503705, 492532, 483425, 477448, 472724, 468516, 466269, 465618, 463670, 459544, 455620, 453096, 450358, 446903, 444663, 444054, 442766, 440051, 438297, 438732, 439327, 438634, 438068, 438727, 439429, 439626, 440925, 444023, 447203, 449469, 452191, 456322, 460968, 465951, 472647, 481045, 489099, 496154, 503860, 512536, 519949, 525008, 529306, 533628, 536205, 536010, 534603, 533207, 530938, 527467, 524403, 522558, 520764, 518709, 517897, 518378, 517703, 514673, 511107, 508410, 505514, 501800, 498867, 497490, 495829, 492606, 489268, 487128, 485097, 482078, 478930, 476153, 472360, 466990, 461926, 458448, 455065, 450362, 445569, 442270, 439871, 437421, 435810, 436164, 437951, 440504, 444517, 450452, 457456, 465359, 475680, 489081, 503938, 518818, 534158, 549922, 564021, 574837, 583139, 589761, 593580, 593612, 591004, 587114, 581563, 573938, 565403, 556768, 546918, 535032, 522561, 511247, 500902, 490807]
57910D90807r302q006p602p873p291o043n651n916n455m790n546p044p184o209
57896C96895o054o489n588l616k651k619j470P49J833J374J129J479J142M33J165
57881C77712L067L848K983K132J727O08r90j520j258j925l210l154j911j520j997
57866C74592j405J88O90Q3O30K637L902L891M602O604P993Q113Q595R840J0049
57851D41004Q712P703P824P544O117M805M127K915R42m52j056k145l692m215l868
57836D76265m465o019o501n540m922n058m428l138l199m474m165j410J259K216
57822D26421K864M200M841L961K900K441J637N83J038K950L822K945K786M493
57808D67882N528L754O28j777l876o444q232q066p072o604o153n072m249m313
$$ y = [490807, 481505, 473499, 465897, 458024, 450733, 444690, 439039, 433123, 427668, 422878, 417332, 410288, 403104, 396895, 390841, 384352, 378764, 375148, 372497, 369878, 368408, 369157, 370990, 372364, 373493, 374972, 376114, 376547, 377712, 380779, 384627, 387610, 389742, 391469, 392077, 391087, 389567, 388309, 386384, 383174, 380020, 378109, 376589, 374592, 373187, 373375, 374065, 374148, 374778, 377415, 381317, 385208, 389810, 396414, 404407, 412520, 421115, 430955, 441004, 449716, 457419, 465243, 472787, 478904, 483709, 487836, 490751, 491693, 491241, 490185, 488040, 484348, 480133, 476265, 471800, 465781, 459280, 453740, 448818, 443760, 439332, 436194, 432995, 428521, 424356, 422946, 424205, 426421, 429285, 433485, 438326, 442287, 445187, 447628, 449265, 449848, 450886, 453836, 457658, 460603, 463389, 467882, 473410, 477164, 477792, 476015, 472139, 465695, 457463, 449397, 442325, 435721, 429568, 424496, 420247, 415934]
57794D15934m228l358k777l133l257k381j567j561j418n56j0k88j89R73K097K425
57778C96706K759L514L848L739M433N919O499N843N660O316N748L121M41r44k402
57763D51200m879o801p077p275q715j0039r788q842q208o978m645k968l261l998
57749C57726l323j821p95j0R03J057L41N44K360L690K980J821J893J963M77j282
57733C68524j469r68j448k044j002R67J887J764J839J918J110J78N10J654K173
57718C75593K056K144K150J397N14L91M54j19n57J31J128J083L92K48M81K80P
57701C87773M71J342J959K611L489L623K555J661K106K898K733K216K336K352
57687D20125J361M73J130K584L301L645M849O503P471Q277J0290J3327J6357J9734
$$ y = [415934, 411706, 408348, 405571, 402438, 399181, 396800, 395233, 393672, 392254, 391698, 391688, 391400, 391211, 392184, 394281, 396706, 399465, 402979, 406827, 410566, 414999, 420918, 427417, 433260, 438920, 445236, 450984, 454105, 454546, 453602, 451200, 446321, 439520, 432443, 425168, 416453, 406414, 396626, 387784, 379576, 372598, 367953, 364985, 361724, 357726, 354403, 352582, 351787, 351777, 352680, 353737, 354078, 354622, 356982, 360672, 363652, 365473, 367366, 369329, 369806, 368524, 367055, 366087, 364639, 362595, 361593, 362560, 364447, 366211, 368050, 369968, 371078, 371256, 371766, 373420, 375593, 377649, 379793, 381943, 383340, 383854, 384245, 384699, 384580, 384023, 384154, 385282, 386365, 386757, 387005, 387486, 387766, 387773, 388244, 389586, 391545, 394156, 397645, 401268, 403823, 405484, 407590, 410488, 413221, 415437, 417773, 420125, 421486, 421959, 423089, 425673, 428974, 432619, 437468, 443971, 451442, 459719, 470009, 483336, 499693, 519427]
57673E19427K4683L1364L9469M9833O3302P8831R4628J09884J22619J26630J13852
57662A374522Q0931L2660k0395o6618r7515j10721j09975j01253q8870p5330o2805
57651G54631n2564m3934l5835k8696k3381j9263j5241j1659r477q248o870n407
57639D94056m515l862k834j913j639j270k22L56n83j716j102P80J977K154K428
57624D82095K862K470J345N45J91m20j076r46k03L01N05P57N85m36j320q75M00
57607D86780J347K127L417M571M594M084M191M426L655K425K147K599K518K003
57593E30884K044K262J453L9l24O07J512J794J985K167J928J620J802J859J062
57578E52694L83J179K643K778J472M00J95Nl39n1P98J314J547K271L084K847J832
$$ y = [519427, 544110, 575474, 614943, 664776, 728078, 806909, 901537, 1011421, 1134040, 1260670, 1374522, 1455453, 1488113, 1467718, 1401100, 1303585, 1192864, 1082889, 981636, 892766, 817436, 754631, 702067, 658133, 622298, 593602, 570221, 550958, 535717, 524058, 514581, 506333, 499463, 494056, 489541, 485679, 482845, 480932, 479293, 478023, 477801, 478157, 477574, 475858, 474756, 475536, 477513, 479667, 482095, 484957, 487427, 488772, 489317, 489508, 489088, 488012, 487066, 486863, 487164, 487669, 488426, 489011, 488575, 487255, 486380, 486780, 488127, 490254, 493671, 498242, 502836, 506920, 511111, 515537, 519192, 521617, 523764, 526363, 528881, 530884, 532928, 535190, 536643, 536682, 536358, 536965, 538477, 540271, 542256, 544423, 546351, 547971, 549773, 551632, 552694, 553077, 554256, 556899, 559677, 561149, 561549, 561744, 561749, 561410, 561359, 562157, 563471, 565018, 567289, 570373, 573220, 575052]
57561E75052J440J914K334K691L823N368N986N628N563O101O260N726N218M944
57547F38048M523M348M973N423M203J962R77J933L287L963M484N238N658N619
57533F94639N752O037N679M636L735L244K887K998M059N292N563N288N637O331
57519G61777O322O198P401R337R861Q649P591P647P828P576P618P946P378N718
57505H68847M188L212J939M22m5O53J017N02L14R47J255P96Q53K133L476L866
57489H94375L881M165M277M024M216N111N758N687N717O334O840O868P064P564
57475I71881P456O563O036O384O571N916N255N318N541N453N747O945Q316R077
57461A062459R445R787R874R622R430R228Q471P501P484Q558R434R312Q752Q280
$$ y = [575052, 576492, 578406, 580740, 583431, 587254, 592622, 598608, 604236, 609799, 615900, 622160, 627886, 633104, 638048, 642571, 646919, 651892, 657315, 661518, 663480, 664457, 666390, 669677, 673640, 678124, 683362, 689020, 694639, 700391, 706428, 712107, 716743, 720478, 723722, 726609, 729607, 733666, 738958, 744521, 749809, 755446, 761777, 768099, 774297, 781698, 791035, 800896, 809545, 817136, 824783, 832611, 840187, 847805, 855751, 863129, 868847, 873035, 876247, 878186, 878608, 878563, 879216, 880233, 880735, 881049, 881996, 883251, 884047, 884900, 887033, 890509, 894375, 898256, 902421, 906698, 910722, 914938, 920049, 925807, 931494, 937211, 943545, 950385, 957253, 964317, 971881, 979337, 985900, 991936, 998320, 1004891, 1010807, 1016062, 1021380, 1026921, 1032374, 1038121, 1045066, 1053382, 1062459, 1071904, 1081691, 1091565, 1101187, 1110617, 1119845, 1128316, 1135817, 1143301, 1151859, 1161293, 1170605, 1179357, 1187637]
57447A187637P767P506Q265R621J0036R170Q495Q925R558R500R261R505R943J0316
57433A315505J0992J1820J1827J0833R962R950J0280J0575J1214J2053J2142J1424
57421A448577J1083J1550J1817J1351J1013J1298J1446J1109J1143J1869J2353
57410A574609J2258J2590J3628J4014J3069J2166J2459J3005J2630J2050J2541
57399A715019J3748J4467J4520J4479J4421J4235J4217J4340J3897J2846J2492
57388A868681J3743J5731J7111J7705J7910J7610J6797J6277J6663J7490J8092
57377B053810J8539J8883J8540J7274J5918J5319J5363J5655J6171J6744J6946
57366B239162J6972J7582J8688J9249J8992J8872J9315J9495J9001J8748J9436
$$ y = [1187637, 1195404, 1202910, 1211175, 1220796, 1230832, 1240002, 1248497, 1257422, 1266980, 1276480, 1285741, 1295246, 1305189, 1315505, 1326497, 1338317, 1350144, 1360977, 1370939, 1380889, 1391169, 1401744, 1412958, 1425011, 1437153, 1448577, 1459660, 1471210, 1483027, 1494378, 1505391, 1516689, 1528135, 1539244, 1550387, 1562256, 1574609, 1586867, 1599457, 1613085, 1627099, 1640168, 1652334, 1664793, 1677798, 1690428, 1702478, 1715019, 1728767, 1743234, 1757754, 1772233, 1786654, 1800889, 1815106, 1829446, 1843343, 1856189, 1868681, 1882424, 1898155, 1915266, 1932971, 1950881, 1968491, 1985288, 2001565, 2018228, 2035718, 2053810, 2072349, 2091232, 2109772, 2127046, 2142964, 2158283, 2173646, 2189301, 2205472, 2222216, 2239162, 2256134, 2273716, 2292404, 2311653, 2330645, 2349517, 2368832, 2388327, 2407328, 2426076, 2445512]
57355B445512K0513K1388K2290K3177K3282K2498K1874K1994K2257K2340K2822
57344B689947K3714K4014K3514K3342K3950K4312K3888K3586K3840K3726K3006
57333B950839K3024K4332K5422K5203K4820K5431K6109K5649K4775K4685K4973
57322C225262K4792K4716K5570K6638K6839K6566K6642K6603K5769K4957K5353
57311C509707K6553K7335K7553K7777K7950K7842K7994K8823K9620K9667K9408
57300C820229K9385K9171K8531K8349K9075K9588K9057K8574K9310L0442L0669
57289D142380L0448L0861L1387L0876K9796K9568L0326L1197L2030L3105L3843
57278D485817L3603L3172L3662L4576L4648L4023L3863L4279L4371L3991L3796
$$ y = [2445512, 2466025, 2487413, 2509703, 2532880, 2556162, 2578660, 2600534, 2622528, 2644785, 2667125, 2689947, 2713661, 2737675, 2761189, 2784531, 2808481, 2832793, 2856681, 2880267, 2904107, 2927833, 2950839, 2973863, 2998195, 3023617, 3048820, 3073640, 3099071, 3125180, 3150829, 3175604, 3200289, 3225262, 3250054, 3274770, 3300340, 3326978, 3353817, 3380383, 3407025, 3433628, 3459397, 3484354, 3509707, 3536260, 3563595, 3591148, 3618925, 3646875, 3674717, 3702711, 3731534, 3761154, 3790821, 3820229, 3849614, 3878785, 3907316, 3935665, 3964740, 3994328, 4023385, 4051959, 4081269, 4111711, 4142380, 4172828, 4203689, 4235076, 4265952, 4295748, 4325316, 4355642, 4386839, 4418869, 4451974, 4485817, 4519420, 4552592, 4586254, 4620830, 4655478, 4689501, 4723364, 4757643, 4792014, 4826005, 4859801]
57267D859801L3848L3579L2913L2163L1180K9843K8816K8671K8765K8219K7422
57256E195220K7305K7722K7806K7383K6895K6470K6150K6356K7041K7175K6201
57245E491724K5159K5217K5945K6242K6006K5604K4720K3106K1620K1028K0625
57234E756996J9383J7635J6283J5268J4173J3461J3562J3675J2948J2060J2153
57223E917597J3009J3736J4301J5060J5594J5585J5804J6776J7476J6917J5920
57212F087775J5701J5785J5174J4423J4544J4839J3977J2407J1587J1372J0381
57201F237965Q488O921O180N695N238M938M247K565N24q58j876l399n086n930
57187F265612n984o000n996n763o024p368q814r219r291j0360j1989j2805j2987
$$ y = [4859801, 4893649, 4927228, 4960141, 4992304, 5023484, 5053327, 5082143, 5110814, 5139579, 5167798, 5195220, 5222525, 5250247, 5278053, 5305436, 5332331, 5358801, 5384951, 5411307, 5438348, 5465523, 5491724, 5516883, 5542100, 5568045, 5594287, 5620293, 5645897, 5670617, 5693723, 5715343, 5736371, 5756996, 5776379, 5794014, 5810297, 5825565, 5839738, 5853199, 5866761, 5880436, 5893384, 5905444, 5917597, 5930606, 5944342, 5958643, 5973703, 5989297, 6004882, 6020686, 6037462, 6054938, 6071855, 6087775, 6103476, 6119261, 6134435, 6148858, 6163402, 6178241, 6192218, 6204625, 6216212, 6227584, 6237965, 6246453, 6253374, 6259554, 6265249, 6270487, 6275425, 6279672, 6282237, 6282761, 6281903, 6280027, 6276628, 6271542, 6265612, 6259628, 6253628, 6247632, 6241869, 6235845, 6228477, 6219663, 6210444, 6201153, 6190793, 6178804, 6165999, 6153012]
57174F153012j3727j4972j5768j6306j7498j8967j9669k0113k1775k4587k7116
57163E942514k9029l1270l3995l6381l8437m1027m4142m6899m9160n1460n3571
57152E487143n4806n5385n5883n5735n4045n1308m8533m5204m0166l3990k8369
57141D963719k3638j8925j4369j1037r039p758p601r365j2340j5166j8147k2420
57129D793914k7182l0119l0438k9222k7002k3239j8030j2042m905M103J3879K2241
57117D631958K8786L4920M1285M7502N4216O3079P4637Q8432J04983J25401J49292
57106E444491J75316K03898K37286K77301L25320L84237M58119N50056O62518
57097H718542P99480R66168J167331J407703J692712K025346K402214K814026
$$ y = [6153012, 6139285, 6124313, 6108545, 6092239, 6074741, 6055774, 6036105, 6015992, 5994217, 5969630, 5942514, 5913485, 5882215, 5848220, 5811839, 5773402, 5732375, 5688233, 5641334, 5592174, 5540714, 5487143, 5432337, 5376952, 5321069, 5265334, 5211289, 5159981, 5111448, 5066244, 5026078, 4992088, 4963719, 4940081, 4921156, 4906787, 4895750, 4886711, 4878953, 4871352, 4861987, 4849647, 4834481, 4816334, 4793914, 4766732, 4736613, 4706175, 4676953, 4649951, 4626712, 4608682, 4596640, 4591735, 4595838, 4609717, 4631958, 4660744, 4695664, 4736949, 4784451, 4838667, 4901746, 4976383, 5064815, 5169798, 5295199, 5444491, 5619807, 5823705, 6060991, 6338292, 6663612, 7047849, 7505968, 8056024, 8718542, 9518022, 10484190, 11651521, 13059224, 14751936, 16777282, 19179496, 21993522]
57089B1993522L247917L686356M106137M482748M795170N024326N150503N156379
57081E7643058N026543M734925M238242L500684K535929J419491K53211q80347
57073G8471736j930781k863881l648932m261410m688644m930394m998612m917329
57065D6231753m718190m433332m092025l720606l340918k968351k613729k286367
57057A8058235j993036j735177j510271j315795j149947j009527q89949p87343
57049G667190o98937o21955n53967m93903m41152l94326l52133l14592k81938
57040C514287k53379k28141k06465j88152j71577j55549j40694j27504j14804
57031A928022j01906r0233q0681p1142n9115m5055l0466j4408N116K7797N2368
$$ y = [21993522, 25241439, 28927795, 33033932, 37516680, 42311850, 47336176, 52486679, 57643058, 62669601, 67404526, 71642768, 75143452, 77679381, 79098872, 79352083, 78471736, 76540955, 73677074, 70028142, 65766732, 61078088, 56147694, 51149082, 46231753, 41513563, 37080231, 32988206, 29267600, 25926682, 22958331, 20344602, 18058235, 16065199, 14330022, 12819751, 11503956, 10354009, 9344482, 8454533, 7667190, 6968253, 6346298, 5792331, 5298428, 4857276, 4462950, 4110817, 3796225, 3514287, 3260908, 3032767, 2826302, 2638150, 2466573, 2311024, 2170330, 2042826, 1928022, 1826116, 1735883, 1655202, 1584060, 1524945, 1479890, 1449424, 1435016, 1440132, 1467929, 1520297]
57020A520297P9282J06754J23935J14166O9349l4p1211j24701j53770j62199j56992
57009A344876j43719j26108j07170q9557p4973o3856n5666m9276m3333l7117l1174
56998E22927k6475k3000j9977j7425j6156j6045j5693j4332j2649j1198r296o340
56986C34341k914K96L592P297J0692J2606J2167Q612J694p008j4589j9399k1974
56973C25413k2981k2011j9162j6008j3676j1517q805o240m474k750l33K163M314
56960B03933P234J1862J7166K1623K5080K7449K6894K1345J1184j056j2893k2433
56948C37388k7915k8686k6224k2799j9428j6045j2766r870p190m587k267J27L613
56935A63351Q258J2778J6731K1531K8038L4494L8205L7776L2486K1427N456j1280
$$ y = [1520297, 1599579, 1706333, 1830268, 1944434, 2013783, 2013749, 1942538, 1817837, 1664067, 1501868, 1344876, 1201157, 1075049, 967879, 878322, 803349, 739493, 683827, 634551, 591218, 554101, 522927, 496452, 473452, 453475, 436050, 419894, 403849, 388156, 373824, 361175, 349977, 340681, 334341, 331427, 331723, 335315, 342612, 353304, 365910, 378077, 386689, 388383, 381375, 366786, 347387, 325413, 302432, 280421, 261259, 245251, 231575, 220058, 211253, 205013, 200539, 197789, 197456, 199619, 203933, 211167, 223029, 240195, 261818, 286898, 314347, 341241, 362586, 373770, 372714, 359821, 337388, 309473, 280787, 254563, 231764, 212336, 196291, 183525, 173655, 166465, 161878, 159611, 159738, 163351, 171609, 184387, 201118, 222649, 250687, 285181, 323386, 361162, 393648, 415075, 420531, 409251]
56923D09251k4046l1219l3952l3470l0590k6804k3556k0804j7838j4947j2812
56912A39213j1102r252p763p206o713n162l056j590o66N15J639J851J494J596
56898I3798K143K457K772L820N365O649P828R625J2016J4536J7346K0809K4609
56885B23773K8215L1253L2337K8994K0333Q861j826j0167j6144j9265j9152j7068
56873B90144j4672j1947q131l895o01J953N095R178J3708J8933K5404L2605L9833
56860C97607M7774N7047O5531O8883O3722M9210K6799M65k3641m0349m8641n0606
56848F13801m8008m1717l3436k5501j8750j2374n695J331Q987J7548K6606L6107
56836E18899M7356O1352P6847R1577J04021J11486J07745Q6460M8164J975m0354
$$ y = [409251, 385205, 353986, 320034, 286564, 255974, 229170, 205614, 184810, 166972, 152025, 139213, 128111, 118859, 111096, 103890, 97177, 92015, 88959, 87369, 86703, 87218, 88857, 90708, 92202, 93798, 95941, 98398, 101170, 104990, 110355, 117004, 124832, 134457, 146473, 161009, 178355, 199164, 223773, 251988, 283241, 315578, 344572, 364905, 373766, 371940, 361773, 345629, 326364, 307212, 290144, 275472, 263525, 255394, 251499, 250898, 252851, 257946, 267124, 280832, 299765, 325169, 357774, 397607, 445381, 502428, 567959, 636842, 700564, 749774, 776573, 777038, 753397, 713048, 664407, 613801, 565793, 524076, 490640, 465139, 446389, 434015, 428320, 429651, 438638, 456186, 482792, 518899, 566255, 627607, 704454, 796031, 900052, 1011538, 1119283, 1205743, 1253907, 1255882, 1215528]
56825A215528p1091q8229r3703r1104q3711p3490o1846n0546m0742l1814k2573
56814E06679j3182m531L664J2658K3033L4565M7152O0329P2123P9401P8719O6590
56802I67200M1270O402k8794n5549p1262p8024p7706p1392o1803n2388m4012l5519
56790D38423k7193k0782j6344j1933o575r02N130J2488K0856K8639L5164M0225
56778D97196M1488L5316K1062K416j5978l1242m1775m6793m7185m4889m0904l5443
56766B93269k9789k5660k2797j9465j5511j2600j1268j0204q748p658p086o153
56754A16330m992m817n507n475m406l759l996l753k433j309j244j447j305j399
56740G0488j954k166j768j457j257l76Q96J171K68m76m96n32o01J95J417J352
$$ y = [1215528, 1144437, 1056208, 962505, 871401, 787690, 714200, 652354, 601808, 561066, 529252, 506679, 493497, 488966, 492630, 505288, 528321, 562886, 610038, 670367, 742490, 821891, 900610, 967200, 1008470, 1014872, 986078, 930529, 859267, 781243, 703537, 632145, 570342, 517954, 473942, 438423, 411230, 390448, 374104, 362171, 355596, 354694, 359824, 372312, 393168, 421807, 456971, 497196, 538684, 574000, 595062, 597478, 581500, 550258, 508483, 461690, 414505, 369616, 328712, 293269, 263480, 237820, 215023, 195558, 180047, 167447, 156179, 145975, 137227, 129569, 122483, 116330, 111338, 106521, 101014, 95539, 91133, 87374, 83378, 79625, 77192, 75883, 74639, 73192, 71887, 70488, 68534, 66368, 64600, 63143, 61886, 61510, 62406, 63577, 63845, 63369, 62873, 62341, 61740, 61935, 63352, 64704]
56724F4704p3q35j3J012J265J582K355K425J365N63P87R15K68K4R43J824J606
56707H0717J111J263J433R85O94J148J335K50j405k442k745k635j965r92o29r72
56691G5151r18q5M02j03n87j53O04R47J187J544J351L61n18p37r04j323j224l24
56673G4671L53J74j44m5j23o87q68j25Q18J307J681K061J769P62J76N88J173J222
56655H4763J068Q99K69n28l05R82J745J120J47o9J98M75R51J467J286N94N58J291
56637I6911J583J181J303K292K885K631K739L623L931L096K570L173L512K471
56623A33901J176R16J069P14M53R57J394Q87M5l80q73j825k403k049j579j609
56607A30794j432o03k1j94k50K20K47m39l78J093K314J849O42N0l83j420k229
$$ y = [64704, 64631, 63796, 63783, 64795, 66060, 67642, 69997, 72422, 73787, 74350, 75137, 76052, 76320, 76344, 77287, 79111, 80717, 81828, 83091, 84524, 85509, 86203, 87351, 88686, 88936, 87531, 85089, 82344, 79709, 77744, 76752, 76123, 75151, 74233, 74148, 74550, 74447, 73860, 73707, 74311, 75258, 76445, 77989, 79340, 79701, 79183, 78446, 77542, 76219, 74995, 74671, 75024, 75198, 75054, 75009, 74886, 74199, 73331, 73206, 74024, 75331, 77012, 79073, 80842, 81604, 81780, 82368, 83541, 84763, 85831, 86730, 86999, 86471, 86166, 87148, 88893, 90013, 90160, 90091, 90289, 90764, 91715, 93182, 94468, 95062, 95620, 96911, 98494, 99675, 100978, 103270, 106155, 108786, 111525, 115148, 119079, 122175, 124745, 127918, 131430, 133901, 135077, 135993, 137062, 137776, 138229, 139186, 140580, 141467, 141512, 141132, 140259, 138434, 136031, 133982, 132403, 130794, 129362, 128759, 128738, 128544, 128294, 128514, 128761, 128322, 127944, 129037, 131351, 133200, 133842, 133892, 133509, 132089, 129860]
56590A29860j858j065q59p30k3M27k10j032q52r7L24O36J192J284N29L6O88J625
56572A29875J896K117K956L515K944K286K929M419N399N710O079O802P983R932
56558A94842J2252J3747J4129J4302J4223J2454Q955O104N539N981N752N330N665
56545C19275N988N185L699K213K00k486m379m585m479n449o705p115p326q157
56531B85879q773q389q117q958r760r174q030p679p618o759n477m458l169j440
56517A88078p61j996l568l953m005m779n090l726k091k013k679k382j623j766
56503A47646k217j652o53n00o32J00J055J086Q31J254J443L79o24M2J317J264
56487A50139L95M00R83P84J83L43P05J99l10M05J267O58m25l6J187J272N32P46
$$ y = [129860, 128002, 126937, 126078, 125348, 125325, 125752, 125542, 124510, 123658, 123561, 123885, 124521, 125713, 126997, 127526, 127562, 128250, 129875, 131771, 133888, 136844, 140359, 143303, 145589, 148518, 152937, 158336, 164046, 170125, 176927, 184910, 194842, 207094, 220841, 234970, 249272, 263495, 275949, 284904, 291008, 296547, 302528, 308280, 313610, 319275, 325263, 330448, 334147, 336360, 336560, 334074, 329695, 325110, 320631, 315182, 308477, 301362, 294036, 285879, 277106, 268717, 260600, 251642, 241882, 232708, 224678, 216999, 209381, 202622, 197145, 192687, 189518, 188078, 187317, 185321, 181753, 177800, 173795, 169016, 163926, 160200, 158109, 156096, 153417, 151035, 149412, 147646, 145429, 143777, 143124, 142624, 141992, 142092, 143147, 144233, 145064, 146318, 147761, 148140, 147516, 147558, 148875, 150139, 150534, 150934, 151917, 152701, 152884, 153227, 153932, 154131, 153821, 154226, 155493, 156151, 155726, 155690, 156877, 158149, 158681, 159427]
56469A59427J637J463L62PN02N73J88K67M51j15n45M85K087K485K034K172K440
56452A75920J544K85L23R19J42j497j782n39N31J069J966K672J794l9r02o87o91
56435A81028p93l2Q10K87p73n65K70j78j307r10P49J314M24j26R6o8l55O29K262
56416A82762K476J351Q39J130O92l42k95O54P21J4K63J203Q57n43o99N38Q13m78
56398A91956j269o69j95m93k31J061K103K397K709K719J362l20O9K290L579L051
56382B10119K682L429L834L166K649K811K638J995K011K601K483J867K053K407
56368B46745J044j404k382j876k389m122m312k210o36j281k292j859p57J40J493
56353B23902L204L616K431J535J777J775R57O85J300J158j65p35M08J606J561
$$ y = [159427, 161064, 162527, 162889, 162896, 163398, 163971, 164159, 164426, 164877, 164762, 164217, 164702, 166789, 169274, 171308, 173480, 175920, 177464, 177749, 178072, 178991, 179133, 177636, 175854, 175315, 175846, 176915, 178881, 181553, 183347, 183308, 182406, 181719, 181028, 180235, 180203, 181013, 181300, 180527, 179962, 180232, 180054, 178747, 177837, 178586, 179900, 180324, 180198, 180294, 180226, 179871, 180500, 182762, 185238, 186589, 187428, 188558, 189250, 188908, 188613, 189267, 189988, 190002, 190265, 191468, 192325, 191782, 191083, 191621, 192434, 191956, 190687, 190018, 189823, 189330, 189099, 190160, 192263, 194660, 197369, 200088, 201450, 201130, 201199, 203489, 207068, 210119, 212801, 216230, 220064, 223230, 225879, 228690, 231328, 233323, 235334, 237935, 240418, 242285, 244338, 246745, 247789, 246385, 244003, 242127, 239738, 235616, 231304, 229094, 228458, 227177, 224885, 223026, 222269, 222409, 223902, 227106, 230722, 233153, 234688, 236465, 238240, 239197, 239882, 241182, 242340, 242175, 241440, 241848, 243454, 245015]
56338B45015J168J292J333J076J390K167K146J388J336J899J417lk19J323K788
56323B65516L273L790M409L795K270J900K813K832J417M75N97J60j066j172P7
56308B91086M79n10p45M38R03j93q18J07J003J146K072M026M835L776K942L205
56292C13752K739R68J37J155J848J143J076K680L712K692J531J955K785K868L278
56277C44319M549N053M219M030N365O228N512N041O029O959O861P207Q591R195
56263D29158Q447Q539J0341J1615J1259J1537J3844J6239J7423J9282K3035K6741
56251F07460K9133L2106L6813M1121M3614M6310N0663N4599N6288N7185N8562
56240A113854N8697N6349N3334N0795M6581L9189L0637K2565J3325J940q880j6874
$$ y = [245015, 246183, 247475, 248808, 249884, 251274, 253441, 255587, 256975, 258311, 260210, 261627, 261624, 261405, 262728, 265516, 268789, 272579, 276988, 280783, 283053, 284953, 287766, 290598, 292015, 292490, 293087, 293247, 292181, 291009, 291086, 291565, 291055, 290310, 290748, 291651, 291458, 290640, 290747, 291750, 292896, 294968, 298994, 303829, 307605, 310547, 313752, 316491, 317459, 317596, 318751, 320599, 321742, 322818, 325498, 329210, 331902, 333433, 335388, 338173, 341041, 344319, 348868, 353921, 358140, 362170, 367535, 373763, 379275, 384316, 390345, 397304, 404165, 411372, 419963, 429158, 437605, 446144, 456485, 468100, 479359, 490896, 504740, 520979, 538402, 557684, 580719, 607460, 636593, 668699, 705512, 746633, 790247, 836557, 887220, 941819, 998107, 1055292, 1113854, 1172551, 1228900, 1282234, 1333029, 1379610, 1418799, 1449436, 1472001, 1485326, 1487266, 1478386, 1461512]
56228A461512k3680l1009l7094m0319m2650m6010m8693m8821m7873m7541m6491
56217A001331m3566m0698l9224l6947l2295k7807k5953k5015k2713k0301j9363
56206F67449j8196j5198j2431j1948j1983j0513r082r226q770n858l096l359m783
56193E43006m245k590k030j553N46K514K061P20J043K074J734J003J638K421J671
56178E50013P77J455K293J721J354K686L708K687J815L174M615L810K734L781
56164E86623N120M466L776N475P646P807P819J0081J2462J2224J1426J3129J5635
56151G03689J5964J5646J7530K0096K0638K0923K4028K8552L1767L5491M3003
56140I77327N2991O2389P2497Q6273J02138J16161J27828J37828J42818J38477
$$ y = [1461512, 1437832, 1406823, 1369729, 1329410, 1286760, 1240750, 1192057, 1143236, 1095363, 1047822, 1001331, 957765, 917067, 877843, 840896, 808601, 780794, 754841, 729826, 707113, 686812, 667449, 649253, 634055, 621624, 609676, 597693, 587180, 578098, 568872, 560102, 554244, 551148, 547789, 543006, 538761, 536171, 534141, 532588, 533134, 535648, 537709, 538429, 539472, 541546, 543280, 544283, 545921, 548342, 550013, 550790, 552245, 554538, 556259, 557613, 560299, 564007, 566694, 568509, 571683, 576298, 580108, 582842, 586623, 591743, 596209, 599985, 605460, 613106, 620913, 628732, 638813, 651275, 663499, 674925, 688054, 703689, 719653, 735299, 752829, 772925, 793563, 814486, 838514, 867066, 898833, 934324, 977327, 1030318, 1092707, 1165204, 1251477, 1353615, 1469776, 1597604, 1735432, 1878250, 2016727]
56130B016727J25776J09073R0631P2196N8586N3337N3159N2165M8801M3431L3121
56119B757003J5788l464j7007k3574k6884k8780l0189l5570m9018o7971q6782
56108B403552j03781j18877j28018j27327j19791j10762r9959q4942o8992n7565
56098A383538m9703m0888l1771k6194k3138j8663j3556j1172j0068o636k577j780
56086A147392k353Q3L784M065K534M350Q524R848Q563R151J1363J1296R776J0783
56072A239159J3244J3045J1540J3191J6708J7321J5995J7303K0276K0573J9630
56061A417985K2110K6268K6597K4129K4252K6199K4834K0975J9737K0409J8337
56050A671832J4995J5653J8881J9031J7255J9120K3314K3998K2381K4299K8331
$$ y = [2016727, 2142503, 2251576, 2342207, 2414403, 2472989, 2526326, 2579485, 2631650, 2680451, 2723882, 2757003, 2772791, 2769327, 2752320, 2728746, 2701862, 2673082, 2642893, 2607323, 2558305, 2490334, 2403552, 2299771, 2180894, 2052876, 1925549, 1805758, 1694996, 1595037, 1510095, 1441103, 1383538, 1333835, 1292947, 1261176, 1234982, 1211844, 1193181, 1179625, 1168453, 1158385, 1151749, 1149172, 1147392, 1145039, 1145122, 1148906, 1152971, 1155505, 1159855, 1168379, 1178227, 1186790, 1195941, 1207304, 1218600, 1228376, 1239159, 1252403, 1265448, 1276988, 1290179, 1306887, 1324208, 1340203, 1357506, 1377782, 1398355, 1417985, 1440095, 1466363, 1492960, 1517089, 1541341, 1567540, 1592374, 1613349, 1633086, 1653495, 1671832, 1686827, 1702480, 1721361, 1740392, 1757647, 1776767, 1800081, 1824079, 1846460, 1870759, 1899090]
56039A899090K8330K5858K7662L2493L3238L0590L1621L6100L7519L6506L9617
56028B258624M5845M8077M7055M9961N5989N7616N5333N6573O0887O1217N9020
56017B856197O2517P0459P3535P1665P3735Q0426Q3799Q3729Q7775R4905R6746
56006C735488R4952R9429J09340J14328J14436J19648J29846J35294J37092J46078
55996D935931J60998J69593J72114J81189J97340K08314K13986K27292K48380
55987F715137K63442K71705K87359L11882L31680L46242L70284M04554M34089
55978I736374M59078M96436N46923N93437O36114O94299P69143Q41458R11975
55969A5685237J004182J121206J242378J369512J531262J734247J959467K216087
$$ y = [1899090, 1927420, 1953278, 1980940, 2013433, 2046671, 2077261, 2108882, 2144982, 2182501, 2219007, 2258624, 2304469, 2352546, 2399601, 2449562, 2505551, 2563167, 2618500, 2675073, 2735960, 2797177, 2856197, 2918714, 2989173, 3062708, 3134373, 3208108, 3288534, 3372333, 3456062, 3543837, 3638742, 3735488, 3830440, 3929869, 4039209, 4153537, 4267973, 4387621, 4517467, 4652761, 4789853, 4935931, 5096929, 5266522, 5438636, 5619825, 5817165, 6025479, 6239465, 6466757, 6715137, 6978579, 7250284, 7537643, 7849525, 8181205, 8527447, 8897731, 9302285, 9736374, 10195452, 10691888, 11238811, 11832248, 12468362, 13162661, 13931804, 14773262, 15685237, 16689419, 17810625, 19053003, 20422515, 21953777, 23688024, 25647491, 27863578]
55961B7863578K545262K961490L450294M036243M789026N752168O943067Q439133
55953F6780261J0376115J2841634J5870278J9558208K4035549K9252233L4875193
55946B13589471M0315445M4476001M5320688M0276575K7987409J0065242r189152
55939D12841679k5197462l5467931m0014361m0193520l7555910l3438741k8887678
55932A72086076k4545388k0661743j7301348j4495294j2214620j0349783q797791
55925F3720109p514580o460531n568078m793580m140749l605626l149199k744136
55917B5743630k398879k115294j867204j639173j444954j289818j152501j020491
55909A2815316r07566q20930p44165o67304o02533n55962n13025m65259m24209
$$ y = [27863578, 30408840, 33370330, 36820624, 40856867, 45645893, 51398061, 58341128, 66780261, 77156376, 89998010, 105868288, 125426496, 149462045, 178714278, 213589471, 253904916, 298380917, 343701605, 383978180, 411965589, 422030831, 412841679, 387644217, 352176286, 312161925, 271968405, 234412495, 200973754, 172086076, 147540688, 126878945, 109577597, 95082303, 82867683, 72517900, 63720109, 56205529, 49744998, 44176920, 39383340, 35242591, 31636965, 28487766, 25743630, 23344751, 21229457, 19362253, 17723080, 16278126, 14988308, 13835807, 12815316, 11907750, 11086820, 10342655, 9675351, 9072818, 8516856, 8003831, 7538572, 7114363]
55900G114363l96072l68551l34856l05913k87270k67672k41625k20385k09607
55891D482412j98078j79287j63132j55649j47405j32336j18819j11787j02430
55882C173489q5672p0106o0796m9316l0521j2889l109L640R296M887j3652l6420
55870B828831n5136p3441r3511j07219j09826j08772j09926j08127r9694r1223
55860A871956q7243q1765p0757o0944n7573n5112m8614m2919m2152m1109l5688
55849A248080l1323l2587l4471l2213k9982l1694l2743k9034k5099k5238k5400
55838I18296k1642j8092j8781j9853j7457j5267j6739j7807j4686j1210j1233
55827G35529j1331q210n810p777j0116q700p039r326j2467j2247j0993j2060j2915
$$ y = [7114363, 6718291, 6349740, 6014884, 5708971, 5421701, 5154029, 4912404, 4692019, 4482412, 4284334, 4105047, 3941915, 3786266, 3638861, 3506525, 3387706, 3275919, 3173489, 3087817, 3017711, 2956915, 2907599, 2877078, 2864189, 2861080, 2864720, 2874016, 2878903, 2865251, 2828831, 2773695, 2700254, 2606743, 2499524, 2389698, 2280926, 2171000, 2062873, 1963179, 1871956, 1784713, 1702948, 1632191, 1571247, 1513674, 1458562, 1409948, 1367029, 1324877, 1283768, 1248080, 1216757, 1184170, 1149699, 1117486, 1087504, 1055810, 1023067, 994033, 968934, 943696, 918296, 896654, 878562, 859781, 839928, 822471, 807204, 790465, 772658, 757972, 746762, 735529, 724198, 715988, 710178, 702401, 692285, 683585, 676546, 667220, 654753, 642506, 631513, 619453, 606538]
55814F06538j0724q790j0505j2592j1009q029p123o410l483j066j568j489K351
55801E26101O547P227P011R505J2231J1433Q881P545N513N18m342n813o661j0291
55787E75405j3889j3384j0821j0202j0149p398l887l773o503q855j0765j3485
55775D62294j5156j3803j1611j1060j0082o141j511P53K334N646Q081O109J821
55762D17674n65j650m473p997q985q087q401r868j0233r692r766r553p726o056
55748C14622o604p668o786n268n439o105n156l955m613n575m469k671k461k434
55734B45418m50J617J043m80K43K147K080L91o13j529m044o400n867l914l849
55719B25793n049m576k848k518l147k175n2N67j24M17K293L339L374L999M919
$$ y = [606538, 595814, 587024, 576519, 563927, 552918, 544889, 537766, 531356, 527873, 526807, 525239, 523750, 526101, 532648, 539875, 546886, 556391, 568622, 580055, 588936, 596481, 601994, 602512, 598170, 592357, 585696, 575405, 561516, 548132, 537311, 527109, 516960, 509562, 505675, 501902, 495399, 486544, 475779, 462294, 447138, 433335, 421724, 410664, 400582, 394441, 392930, 393683, 396017, 401663, 409744, 415853, 417674, 417109, 415459, 410986, 402989, 394004, 385917, 377516, 367648, 357415, 347723, 337957, 328404, 320678, 314622, 308018, 300350, 293564, 288296, 282857, 276752, 271596, 267641, 263028, 257453, 252984, 250313, 247852, 245418, 244968, 246585, 247628, 247148, 247391, 249538, 251618, 252009, 251396, 249867, 245823, 239423, 233556, 229642, 225793, 220744, 216168, 213320, 210802, 207655, 205480, 205428, 205995, 205871, 206288, 208581, 211920, 215294, 219293, 224212]
55704B24212M494L242K906K831J052j908l942m998o302p185o359n016n039n433
55690A92555m186k224j767k168j298L18O31M2L55J155J043J035K761M691M289
55675A97232K533K144K642J514q97k057j826j990k237r93O33K34j323j105O82
55660A95186J191J56N5J373K142K070K808M142M120L086L364M842M991L443K444
55645B35413K421J297j326l264l742m463o009o787o321o223o947o919n637m633
55631A76860m631m582m128m138m402l558j809r44j321j488j022r47j222p17J90
55616A42141j35j572k368k316k842l841l565j953j007j460j977j954k214k543
55602A12394j597L18J214O19K3n2n83j439j279l81n31j673j746l42O03L44L04
$$ y = [224212, 228706, 231948, 234854, 237685, 238737, 236829, 232887, 227889, 221587, 214402, 208043, 203027, 197988, 192555, 188369, 186145, 184378, 182210, 180912, 181230, 181861, 181903, 182258, 183413, 184456, 185491, 188252, 192943, 197232, 199765, 201909, 204551, 206065, 205168, 203111, 201285, 199295, 197058, 196065, 196698, 196932, 195609, 194504, 195186, 196377, 196533, 196588, 197961, 200103, 202173, 204981, 209123, 213243, 216329, 219693, 224535, 229526, 232969, 235413, 237834, 239131, 237805, 234541, 230799, 226336, 220327, 213540, 207219, 200996, 194049, 187130, 181493, 176860, 172229, 167647, 163519, 159381, 154979, 151421, 149612, 148668, 147347, 145859, 144837, 143890, 142668, 141951, 142141, 142006, 140434, 138066, 135750, 132908, 129067, 125502, 123549, 122542, 121082, 119105, 117151, 114937, 112394, 110797, 111115, 112329, 112948, 112971, 112919, 112336, 110897, 109618, 109237, 108706, 107033, 105287, 104945, 105548, 105892, 106196]
55585A06196Q75M34j416k688k198j146n21L42J562J829Q91M10J191K006K156K683
55569A12606L995M724M186L628L823L694K507J267P41R4j237k341k559k629l043
55554A29456l063k312j648j554j394r41r37j444j492r78j065j997k459j797r53
55539A05422n40P7J061J417Q02K06J25j02n32j55J097J841J495J154J409J183
55523A15960l40k377l953m990n425m853l774l476m103m421l966l628l762l569
55509F3323k860k435k227j102R48K397K583K554K933L022K624K573K884K422J172
55494H0811O08J057R18n37j862j897j456j394j111j78M92K87lJ80J80l05m59n8
55476G5273p0o83o99K36Q22M35J39M23J49j007j400j55J151J145Q44J420J837
$$ y = [106196, 107071, 107505, 106089, 103401, 101203, 100057, 99536, 99878, 101440, 103269, 104160, 104570, 105761, 107767, 109923, 112606, 116601, 121325, 125511, 129139, 132962, 136656, 139163, 140430, 141171, 141265, 140028, 137687, 135128, 132499, 129456, 126393, 124081, 122433, 120879, 119485, 118544, 117607, 116163, 114671, 113693, 112628, 110631, 108172, 106375, 105422, 104882, 104959, 106020, 107437, 108239, 108445, 108570, 108468, 107936, 107781, 108878, 110719, 112214, 113368, 114777, 115960, 115620, 113243, 109290, 104300, 98875, 94022, 90248, 86772, 82669, 78248, 74282, 70654, 66892, 63323, 60463, 58028, 55801, 54699, 55647, 58044, 60627, 63181, 66114, 69136, 71760, 74333, 77217, 79639, 80811, 81419, 82476, 83394, 82857, 80995, 79098, 77642, 76248, 75137, 74959, 75451, 75738, 75735, 75915, 76095, 75790, 75331, 75273, 75203, 74520, 73821, 74057, 74879, 75314, 75453, 75876, 76025, 75018, 73618, 73463, 74614, 75759, 76603, 78023, 79860]
55459G9860P15j112j963j841j650j228J9J432J893J470R29L95k20m11J06O59O71
55442G9724N22N01J17o69q33Q7R90Q20k4p53j268j369m63R60J223q4j146n99N59
55423G8295R70J048J582J920J307O57J137K129K294J693J252J027N41m2m14r81
55407I4415j968k553k080j227q19n41Q8N45K94j57l05o33j389j597n63P25J020
55390H3255N13k2n41j012p11L80P84l66j715j643o30n3J10O08J048O07k36m35
55372G9941j63l08q18j032r11n82M38K103K922J848J58k29M67O55J01K1P93J482
55354H6886J444R44L27j40N7R80J637J163O6p76j520k536l103k408j120l77J8
55337H1542Q30J567J213K37J4O13Q61M15N5M7j51n86o30k33k0j03J8L81M90K26
$$ y = [79860, 80575, 79463, 77500, 75659, 74009, 72781, 72800, 74232, 76125, 77595, 78524, 78919, 78699, 78288, 78394, 79053, 79724, 80246, 80747, 80864, 80195, 79362, 79449, 80439, 81259, 81235, 80482, 79214, 77845, 77382, 78342, 79565, 79481, 78335, 77736, 78295, 79265, 80313, 81895, 83815, 85122, 85779, 86916, 89045, 91339, 93032, 94284, 95311, 95852, 95810, 95396, 94415, 92447, 89894, 87814, 86587, 85768, 85227, 85315, 85860, 86154, 85997, 85692, 85059, 83670, 82073, 81510, 82235, 83255, 83768, 83746, 83205, 82193, 81482, 81862, 82646, 82280, 80565, 78922, 78292, 78239, 78349, 78957, 80005, 80612, 80376, 79941, 79778, 79470, 78652, 77620, 76709, 76127, 76565, 78668, 81590, 83438, 83596, 83367, 83834, 84489, 84590, 84611, 85404, 86886, 88330, 89274, 89601, 89461, 89518, 90498, 92135, 93298, 93364, 92588, 91068, 88532, 85429, 83021, 81901, 81524, 81542, 82372, 83939, 85152, 85389, 85403, 86016, 86877, 87292, 87347, 87394, 87243, 86657, 86027, 85794, 85774, 85671, 85689, 86070, 86560, 86786]
55317H6786p6l24n52m77m4O1n93j244j064n34n22o69j22P15O96j26n83j88M56
55298H1596R18J277J368R66N42P39J227J213P78N97O64M24n7k78l43o86j034p73
55280H9138j07K23J43M9j86q27j328r66j82k9n47q08l95K78Q57J196R75J98l23
55261H7359J3N93N80K82L81N00m2p35o15L0J76j99l60l21n37n93J21R67R15M40
55241H8955O65J175P01l39k57R82J523N53o02q50o78n96j35P90J188N69k35n14
55223I2895o18q25o68o9J75k29m34N3M62J15m20l19K14M80L05o6l98l38M41J593
55203I2349K259K127J546O46o73j764j586l53M22J2o01m16J31K02k6J06N84R07
55185I5872R10P30M02lk87m51o38n55L19J737K603K269J256M09m4k77l81m21m40
$$ y = [86786, 86710, 86386, 85834, 85357, 85313, 85374, 84781, 83537, 82473, 81939, 81417, 80748, 80626, 81341, 82037, 81911, 81328, 81140, 81596, 82514, 83791, 85159, 86125, 86667, 87406, 88633, 89846, 90624, 91221, 91885, 92309, 92252, 91974, 91631, 90945, 89911, 89138, 89031, 89254, 89397, 89446, 89260, 88433, 87105, 86139, 85957, 85928, 85381, 84573, 84178, 84456, 85313, 86509, 87484, 87682, 87359, 87372, 87965, 88545, 88827, 89208, 89708, 89666, 88931, 88316, 88346, 88522, 88323, 87963, 87642, 87105, 86512, 86633, 87600, 88515, 88955, 89620, 90795, 91496, 91157, 90900, 91882, 93405, 93958, 93356, 92506, 91828, 91232, 91097, 91887, 93075, 93644, 93409, 92895, 92277, 91452, 90784, 90715, 90890, 90661, 90227, 90280, 90742, 90857, 90437, 90118, 90332, 90812, 91117, 91051, 90653, 90315, 90756, 92349, 94608, 96735, 98281, 98927, 98254, 96490, 94904, 94551, 94973, 94985, 94384, 93968, 94099, 94301, 94275, 94381, 94965, 95872, 96782, 97512, 97914, 97911, 97624, 97173, 96535, 95980, 96299, 98036, 100639, 102908, 104164, 104573, 104529, 104252, 103871, 103450, 103010]
55166A03010k12N52J592K241K278K008J600R84L87K00L17L76M96R34J155L29j176
55149A17071j987j580q73p72j160j578j891j921j387o48n14r79j062k83N81O60
55133A01677Q0n30q40q17n33l74o58r46m61O40J273Q66m4q07j320j517j184n52
55115I3953k01q4L82J127J374R75O76P67O54J23j63J22M92Q27J762L212L822K739
55097A12559R45j54m13m01j56M60R34O96K8m78q51j322j602j384j037r45o70K93
55079A06502J409J653R22P2l11m41o73r59j070r30o75n04m57l76k45m19j082j657
55061A00759j414n95r2k8M11J532K475K486J899J365Q62J04o66r65p14j68L79
55044A07630O17L93N7Q0K73N1m07k40O57J251Q36j00q17j218j247n06Q26J640
$$ y = [103010, 102798, 103350, 104942, 107183, 109461, 111469, 113069, 114053, 114440, 114640, 114957, 115333, 115829, 116763, 117918, 118247, 117071, 115084, 113504, 112631, 111859, 110699, 109121, 107230, 105309, 103922, 103274, 102760, 101781, 100719, 100436, 101017, 101677, 101757, 101227, 100387, 99570, 99037, 98663, 98005, 97059, 96598, 97238, 98511, 99377, 99333, 98526, 97206, 95689, 94505, 93953, 93752, 93668, 94050, 95177, 96551, 97526, 98202, 98969, 99623, 99746, 99583, 99705, 100197, 101024, 102786, 105998, 109820, 112559, 113504, 113350, 112937, 112536, 112380, 112840, 113774, 114470, 114498, 114020, 113169, 111847, 110245, 108861, 107824, 106879, 106209, 106502, 107911, 109564, 110486, 110558, 110247, 109806, 109133, 108174, 107104, 106174, 105499, 104995, 104538, 104162, 103917, 103498, 102416, 100759, 99345, 98750, 98658, 98630, 99041, 100573, 103048, 105534, 107433, 108798, 109660, 109764, 109098, 108133, 107419, 107251, 107630, 108247, 108640, 108697, 108777, 109050, 109101, 108694, 108454, 109111, 110362, 111198, 111098, 110281, 109063, 107816, 107310, 108136, 109776]
55026A09776J277M91K30K20l41j305j803j539j037p91q39r72q82l77K70N49M83
55009A03410N79Q63P81L71N33J536K237J572Q9q85q83l35M10J139J371Q69J78
54992A13835m5P2J11K20P23J244J113M18j58l07k95k94k29j22p7j6J38K38K28
54973A16797M18J003J625J796J504J070P17O28R21J274J050J94m86l74J81N51
54957A28869O94P85O04j8o01n62j5M76O06L19m38j376j672q18N96J474J407Q33
54939A31163L27J87L96O10M09j41m48j60M28R04J248J600K036K770L946N074N437
54922A55786N279N810P580R719J1138J1674J1609J0994R939Q716O988L887n45
54909B58574m902q085j0392j2212j2800j1462r034p004n805n050m687m757m657
$$ y = [109776, 111053, 111544, 111774, 111994, 111653, 110348, 108545, 107006, 105969, 105178, 104339, 103367, 102485, 102108, 102378, 102927, 103410, 103989, 104852, 105633, 106004, 106537, 108073, 110310, 111882, 111971, 111086, 110203, 109868, 110278, 111417, 112788, 113657, 113835, 113790, 113862, 113973, 114193, 114916, 116160, 117273, 117691, 117533, 117226, 116931, 116637, 116408, 116286, 116209, 116193, 116331, 116569, 116797, 117215, 118218, 119843, 121639, 123143, 124213, 124930, 125558, 126479, 127753, 128803, 128997, 128511, 128137, 128318, 128869, 129563, 130348, 130952, 130934, 130333, 129771, 129756, 130232, 130838, 131157, 130719, 129343, 127671, 126853, 127449, 128923, 130330, 131163, 131490, 131677, 132073, 132683, 133092, 132951, 132503, 132343, 132771, 133675, 134923, 136523, 138559, 141329, 145275, 150349, 155786, 161065, 166875, 174455, 184174, 195312, 206986, 218595, 229589, 239528, 248244, 255232, 259119, 258574, 253672, 245587, 235195, 222983, 210183, 198721, 189687, 182683, 176878, 171828, 167141, 162384, 157727]
54896A57727l832k730k072j638q83q8J65K06O74J242J176Q46J309K585L589L773
54880A62049L703M011M783O052P910R972J1482J2043J1742J0704R012O799L934
54867B64196J38m111p407q974r673j0634j1582j1564j0590r396q148o703n557
54854A59995n207m992m003k747k429k920k968k257j686j626j471j049r58j268
54840A24414j281q88p88j089j006k84L51N22P38J145J032J38o93p52m13k25k7
54823A20894M72R94J200J210J183J052R62J238J670J548P47m2l23l22k81r2J02
54806A32212j06n85p06m22l19m07OQ68J028k5j185j284o15j49q3n2n7k37k60J59
54786A27781O38P17O62R13J227J102O90N70Q51J198J576K234L091L639L557L019
$$ y = [157727, 153895, 151165, 149093, 147455, 146572, 146484, 146649, 146855, 147529, 148771, 149947, 150793, 152102, 154687, 158276, 162049, 165752, 169763, 174546, 180598, 188508, 198480, 209962, 222005, 233747, 244451, 253463, 260262, 264196, 264334, 260223, 252816, 243842, 234169, 223535, 211953, 200389, 189799, 180403, 172255, 165552, 159995, 154788, 149796, 145793, 143046, 140617, 137697, 134729, 132472, 130786, 129160, 127689, 126640, 125682, 124414, 123133, 122245, 121457, 120368, 119362, 119078, 119429, 119951, 120689, 121834, 122866, 123004, 122311, 121559, 121146, 120921, 120894, 121366, 122360, 123560, 124770, 125953, 127005, 127967, 129205, 130875, 132423, 133170, 133128, 132805, 132483, 132202, 132110, 132212, 132106, 131521, 130815, 130393, 130074, 129667, 129673, 130541, 131569, 131544, 130359, 129075, 128460, 128311, 128228, 128176, 128119, 127882, 127622, 127781, 128419, 129136, 129798, 130711, 131938, 133040, 133730, 134300, 135151, 136349, 137925, 140159, 143250, 146889, 150446, 153465]
54770A53465K513K565L481N107O965Q740J0429J1874J2598J2295J1164R493P244
54757B57933M290Q22k698n815q222r839j0770j0977j0186q494o781n857n377m409
54743A73620l006k256k596l066k691j702q10j16N77R17M57l81n84K19J349K003
54727A61934K208K658L796N210O157O609P370Q903J0516J1168J0706R584P784
54714B54603M961J458j844m684p391r653j0489r797q835q591q638q132p067n871
54700A70030m596l200k088j650j686j824k027k263k172j590q67l35J03M58L88
54685A46681j59o86r21j147j359r21K65J082N98m97p61L1P42M82m67j210j149
54668A40604l56M89O58J48l75o07r96j727k010j132L28J120Q32Q8m57o39m80o2
$$ y = [153465, 155978, 158543, 162024, 167131, 174096, 182836, 193265, 205139, 217737, 230032, 241196, 250689, 257933, 262223, 263045, 260347, 254532, 246310, 236471, 225701, 214724, 204538, 196044, 189263, 183406, 178029, 173620, 170614, 168358, 165762, 162696, 160005, 158303, 157493, 157377, 157954, 158871, 159328, 158947, 158363, 158582, 159931, 161934, 164142, 166800, 170596, 175806, 181963, 188572, 195942, 204845, 215361, 226529, 237235, 246819, 254603, 259564, 261022, 259178, 254494, 247103, 237450, 226961, 217164, 208329, 199738, 191100, 182968, 175901, 170030, 165434, 162234, 160146, 158496, 156810, 154986, 152959, 150696, 148524, 146934, 146067, 145732, 145835, 146293, 146681, 146522, 145836, 144915, 143768, 142409, 141488, 141753, 142835, 143433, 142936, 142175, 142206, 142948, 143430, 142963, 141753, 140604, 140248, 140737, 141395, 141543, 141168, 140561, 139565, 137838, 135828, 134696, 135024, 136144, 136976, 137064, 136607, 135968, 135488, 135426]
54650A35426L44N32N96O43N53L37L13M95L37l47q12m25K10J01o02q34k02N60P87
54631A38012O27N25O04P27P12L55l07q42r07p65q53j088j061p68n19l25M1M65
54613A34633N63K88n0k56k18L11J249J753J071k45q71m63lj76l72K09J264J792
54595A40479J410O60K08J83K19n5n76q17m05L28O95N25K94L04K97K7k67k63r8
54576A43148q7k13k26j00l2J1L59J221K309K966K672J538L11k56j36l7n48j392
54558A51508j698j025J34Q82Q42L60p3l31n30o40n01j25K72N33O75P52Q06R16
54540A52757J129J358J539J790K162K349K009J383J072J152J047M67mK91J104
54525A71605J543J159L39l17o11o73n53j44N14R95P77j18j036j408j374j339j231
$$ y = [135426, 135770, 136302, 136898, 137541, 138094, 138431, 138744, 139239, 139576, 139229, 138417, 137992, 138202, 138303, 137701, 136867, 136665, 137225, 138012, 138639, 139164, 139768, 140495, 141207, 141562, 141255, 140413, 139506, 138741, 137888, 136800, 135739, 134971, 134452, 134127, 134168, 134633, 135196, 135484, 135434, 135178, 134960, 135271, 136520, 138273, 139344, 139099, 138228, 137765, 137762, 137586, 137214, 137423, 138687, 140479, 141889, 142549, 142757, 142940, 143159, 143104, 142528, 141711, 141306, 141634, 142329, 142854, 143148, 143452, 143749, 143776, 143509, 143246, 143148, 143061, 142848, 142622, 142522, 142490, 142501, 142860, 144081, 146390, 149356, 152028, 153566, 153877, 153621, 153485, 153448, 152900, 151508, 149810, 148785, 148919, 149801, 150643, 151003, 150930, 150599, 150069, 149429, 148928, 148803, 149075, 149608, 150283, 151035, 151841, 152757, 153886, 155244, 156783, 158573, 160735, 163084, 165093, 166476, 167548, 168700, 169747, 170214, 170210, 170501, 171605, 173148, 174307, 174646, 174329, 173718, 173045, 172492, 172348, 172862, 173857, 174634, 174516, 173480, 172072, 170698, 169359, 168128]
54508A68128p22j7K13j97o69p70p09p36o57l13L4J82L75P97J126J041P96Q02J010
54489A69714J129J183J333J394J004J68p14j284j415j130n97LO52J400K015K144
54473A76999J894J723J702J486J189J500K497L200K848J930J258P76Q1m50k05
54458A98428M65O36K32P4N10R84J002P01K83l31j076j613j854k076k299k134j417
54441A90515n88j30l5L4K66N87P20L84m00j148j371j132r11r90j239j408j353
54424A81801r83l24L82Q46R82Q44N05J66P1J73J01k41m41j90K15L58K78J77K0
54405A84740j58LN60Q82N35Q9K92Q62R45M99K83N80R05R40Q78P80M23p1j67K90
54385A94090Q12R28N81r9q37j092n77R2pq13j349j057l44K48N92N39r1q27p46
$$ y = [168128, 167406, 167389, 167602, 167405, 166736, 165966, 165257, 164521, 163864, 163551, 163585, 163767, 164142, 164939, 166065, 167106, 167902, 168704, 169714, 170843, 172026, 173359, 174753, 175757, 175925, 175211, 173927, 172512, 171382, 170785, 170788, 171440, 172840, 174855, 176999, 178893, 180616, 182318, 183804, 184993, 186493, 188990, 192190, 195038, 196968, 198226, 199002, 199083, 198633, 198428, 198893, 199529, 199761, 199835, 200345, 201329, 202331, 203032, 203315, 202984, 201908, 200295, 198441, 196365, 194066, 191932, 190515, 189927, 189797, 189762, 189796, 190062, 190649, 191369, 191753, 191353, 190205, 188834, 187702, 186791, 185801, 184562, 183154, 181801, 180818, 180494, 180876, 181722, 182704, 183548, 184053, 184219, 184290, 184463, 184564, 184323, 183882, 183692, 183907, 184265, 184543, 184720, 184740, 184582, 184585, 185145, 186027, 186562, 186651, 186943, 187805, 188750, 189249, 189532, 190112, 191017, 191957, 192835, 193615, 194038, 193967, 193800, 194090, 194902, 195830, 196411, 196312, 195475, 194383, 193806, 193898, 193891, 193078, 191729, 190672, 190328, 190576, 191168, 191707, 191616, 190789, 190043]
54366A90043K08R26O36k5n5M85Q03O58M75M42K93nl1M10P86M20n71j298j203q33
54346A92564j033j592j488o30l34j365k487k114p96m50j392j832o84P88R34ko51
54329A77436o46o80j008j105p54m58n86q35p33k73J53K95L11N27R49J150Q98O80
54311A75321J112J948K311J933J472J422J530J600K075L151M027L829K804J843
54297B06378J158K87q12j522j554j390j602k174k753l113l150k734j832p73j31
54282A84283l62j411k631l157k584j304j47K74o6o81r73p25k88j24j64J24R63
54265A71027J873K158J615O01l39p67n64p0J69K2q0J96N31L96j23l41J44Q55R66
54246A78269K60o08q29l49J72K09r7l64n67r15j309j383j069o99n48m94k82J73
$$ y = [190043, 190251, 191177, 191813, 191788, 191733, 192218, 193021, 193679, 194154, 194596, 194889, 194884, 194853, 195263, 196049, 196469, 195898, 194600, 193397, 192564, 191531, 189939, 188451, 187821, 187487, 186122, 183635, 181521, 180725, 180275, 178883, 177051, 176367, 177155, 178089, 178087, 177436, 176790, 176110, 175102, 173997, 173243, 172785, 172199, 171364, 170631, 170358, 170511, 170806, 171117, 171644, 172593, 173743, 174641, 175321, 176433, 178381, 180692, 182625, 184097, 185519, 187049, 188649, 190724, 193875, 197902, 201731, 204535, 206378, 207536, 207823, 207011, 205489, 203935, 202545, 200943, 198769, 196016, 192903, 189753, 187019, 185187, 184414, 184283, 183921, 182510, 179879, 176722, 174138, 172834, 172687, 172961, 172895, 172214, 171241, 170516, 170228, 170104, 169940, 170064, 171027, 172900, 175058, 176673, 177274, 176935, 176168, 175604, 175534, 175703, 175725, 175645, 175841, 176372, 176768, 176645, 176304, 176448, 177303, 178269, 178529, 177921, 177092, 176743, 176915, 177124, 177027, 176663, 176096, 175181, 173872, 172489, 171420, 170721, 170173, 169679, 169397, 169570]
54228A69570P07J052R69M73j69p08j005q68j69O37O56l06j219j124m82m26r63
54211A66625j029k57M02J31o83j318j768k309k611k091q08M69J075R56N43L83
54195A57710O68J012R01M06J19L70Q90J283J371J042K54o16j005q85p92r84j114
54178A60630r20o15l71K6O89J268J422J173N89l70j438j979j713j028l57K41O89
54161A57936P13M02L07O28Q51O21L44M96Q62R68P74M37p5o59q39l48M40J067J473
54142A66398J544Q63n19j628j589o89J26M27M05K67J69L48P28P46J59m45m63j67
54124A66680o1P4O31J145Q36j0k05P47K051K746K695K318J919J549J130N34k23
54107A84556q97j284j474j639j763j786j733j481q37j03Lo61j248j032m41l04
$$ y = [169570, 170277, 171329, 172298, 172771, 172602, 171894, 170889, 170021, 169852, 170489, 171145, 170839, 169620, 168496, 168014, 167588, 166625, 165596, 165339, 165741, 165872, 165189, 163871, 162103, 159794, 157183, 155092, 154284, 154753, 155828, 156784, 157327, 157710, 158378, 159390, 160291, 160697, 160816, 161186, 162076, 163359, 164730, 165772, 166026, 165410, 164405, 163520, 162728, 161744, 160630, 159710, 159095, 158724, 158750, 159439, 160707, 162129, 163302, 163891, 163521, 162083, 160104, 158391, 157363, 157006, 157247, 157936, 158649, 159051, 159358, 159986, 160837, 161458, 161802, 162298, 163160, 164128, 164902, 165339, 165264, 164605, 163766, 163418, 163858, 164925, 166398, 167942, 168805, 168286, 166658, 165069, 164380, 164506, 164933, 165338, 165605, 165774, 166122, 166850, 167596, 167755, 167310, 166847, 166680, 166619, 166693, 167324, 168469, 169305, 169295, 169090, 169837, 171888, 174634, 177329, 179647, 181566, 183115, 184245, 184779, 184556, 183659, 182375, 180901, 179262, 177499, 175713, 173980, 172499, 171662, 171559, 171562, 170901, 169653, 168621, 168180, 167876]
54091A67876o10p47n99n72p71r09r02q59o21L8Q42J242J111P81N05L61M70Q44
54073A67480J289J755K414K999K717J350j75r99j373j762j688n90Q41J432J197
54058A76887R22N79m07j548j609n35M35O76P88J028P68o0m18K10R26R07O77J057
54040A81283J894K627L302M080M516M220L661L516L679L690L517L352L033K459
54026B28829K062K164K292J871J225J098J456J586J201P80P39Q90Q40M44j90q63
54010B46424j362j608j749j996k400k838l116l072k738k381k205k076j845j679
53996B15359j697j495p10J06K4q25j304q75k31LJ11L57L29o0N2J088J878J199
53978B13309j41j70J539L460M404M855N675O735P548Q409J0082J2777J5947J8655
$$ y = [167876, 167266, 166519, 165920, 165348, 164577, 163668, 162766, 161907, 161286, 161324, 162166, 163408, 164519, 165300, 165805, 166166, 166636, 167480, 168769, 170524, 172938, 175937, 178654, 180004, 179829, 178830, 177457, 175695, 174007, 173417, 174258, 175690, 176887, 177809, 178388, 177981, 176433, 174824, 174289, 174724, 175400, 176188, 177216, 177984, 177924, 177506, 177716, 178642, 179549, 180226, 181283, 183177, 185804, 189106, 193186, 197702, 201922, 205583, 209099, 212778, 216468, 219985, 223337, 226370, 228829, 230891, 233055, 235347, 237218, 238443, 239541, 240997, 242583, 243784, 244564, 245303, 246193, 247033, 247477, 247287, 246424, 245062, 243454, 241705, 239709, 237309, 234471, 231355, 228283, 225545, 223164, 220959, 218883, 217038, 215359, 213662, 212167, 211457, 211563, 211587, 210762, 209458, 208583, 208352, 208355, 208466, 208823, 209152, 209092, 209144, 210232, 212110, 213309, 213168, 212998, 214537, 217997, 222401, 227256, 232931, 239666, 247214, 255623, 265705, 278482, 294429, 313084]
53964C13084J9585J7216J1000K476n478j0826j3635j5112j5865j5508j3695j0925
53952B62317q231o304n158m371l425k053n50M04M56Q6L6M23Q17J150J915L357
53936B40869M914N812N883N517N053M499L719K686J557N96n9n48j029j361j320
53921B76788j028q39p70m76J78Q79J391J861K429K913L122L158L207L247L202
53906B99262L117L067L053L071K994K439J158l60j269j406j447j796k040j867
53892C07976j837k566l613m018l636l259l420l733l616l121k863l300m264n002
53878B59728m726l285j381n6P2q39k021k603k193j194l86j56k82m22m80m62l94
53861B38920m83r54j581j865j775j873k350k606k124j318r07q67o75l11k61o06
$$ y = [313084, 332669, 349885, 360885, 363361, 357883, 347057, 333422, 318310, 302445, 286937, 273242, 262317, 254086, 247782, 242624, 238253, 234828, 232775, 232225, 232629, 233085, 233171, 233207, 233630, 234447, 235597, 237512, 240869, 245783, 251595, 257478, 262995, 268048, 272547, 276266, 278952, 280509, 281105, 281046, 280498, 279469, 278108, 276788, 275760, 274921, 274151, 273675, 273853, 274732, 276123, 277984, 280413, 283326, 286448, 289606, 292813, 296060, 299262, 302379, 305446, 308499, 311570, 314564, 317003, 318161, 317801, 316532, 315126, 313679, 311883, 309843, 307976, 306139, 303573, 299960, 295942, 292306, 289047, 285627, 281894, 278278, 275157, 272294, 268994, 264730, 259728, 255002, 251717, 250336, 250280, 250352, 249513, 247492, 244889, 242696, 241502, 241116, 240960, 240678, 240256, 239776, 239314, 238920, 238437, 237483, 235902, 234037, 232262, 230389, 228039, 225433, 223309, 221991, 221084, 220217, 219542, 219231, 218970, 218364]
53845B18364p71l24M58R47Q05J59n71r06o30K4N90P69N79K12j12k52k89m41p29
53826B17882q85p02l23k7P1Nj22r7K76Q38J166J113R22O71J03o58q00K26J800
53807B21459K798K917K776K885L146L392L801M624N861P302Q558R205R221R334
53793B97279J0507J2988J6220J9555K2535K4237K2997J7482Q228k152j0571j5494
53781D23811j7464j7841j7296j5724j3308j0945r375q413p443o307n319m675m354
53768B85347m363m594m608m026l156k665k693k735k441k032j827j778j696j599
53754B45134j578j561j385r84m35N6J85j37m95k46O62J481J500R51P22J283K214
53737B47367K957L570M432N443O067O134O030N832M897K773J52j762k670l238
$$ y = [218364, 217593, 217269, 217727, 218674, 219479, 219638, 219067, 218161, 217531, 217555, 218145, 218914, 219493, 219705, 219593, 219341, 219052, 218611, 217882, 216997, 216295, 215972, 215945, 216016, 216021, 215899, 215802, 216078, 216916, 218082, 219195, 220117, 220788, 220891, 220233, 219433, 219659, 221459, 224257, 227174, 229950, 232835, 235981, 239373, 243174, 247798, 253659, 260961, 269519, 278724, 287945, 297279, 307786, 320774, 336994, 356549, 379084, 403321, 426318, 443800, 452028, 449876, 439305, 423811, 406347, 388506, 371210, 355486, 342178, 331233, 321858, 313445, 306002, 299695, 294376, 289701, 285347, 280984, 276390, 271782, 267756, 264600, 261935, 259242, 256507, 254066, 252034, 250207, 248429, 246733, 245134, 243556, 241995, 240610, 239626, 239191, 239247, 239432, 239295, 238800, 238554, 239216, 240697, 242197, 243148, 243870, 245153, 247367, 250324, 253894, 258326, 263769, 269836, 275970, 282000, 287832, 292729, 295502, 295654, 293892, 291222, 287984]
53723B87984l862m164l846l244k661j829n58O63J230J264J362J769K228K472K452
53708B81260K218J945J873J970J836J300P91Q49J488K292K893L096K920K777L224
53693C12732M192M829M511L568K685K043J564J478J925K385K209J480P14N7n44
53678C45828p42k63L12J86l96m85J8K28k56q00r86j223j684j640o72L00K11n50
53660C37386p08o5K57m55j459j628r84n56j059k165l022l053k201q13M90J046
53644C21011O98J6k78j62j78n43q39p05l61j14J86P71J385J620J521J433J378
53627C26839J202J130J601K504L115L013K611K617L196L857M037L685L296L314
53613C66017L647L908M082M525N201N499N117M612M603M931N059M940M829M623
$$ y = [287984, 284122, 279958, 276112, 272868, 270207, 268378, 267820, 268483, 269713, 270977, 272339, 274108, 276336, 278808, 281260, 283478, 285423, 287296, 289266, 291102, 292402, 293193, 294042, 295530, 297822, 300715, 303811, 306731, 309508, 312732, 316924, 321753, 326264, 329832, 332517, 334560, 336124, 337602, 339527, 341912, 344121, 345601, 346315, 346372, 345828, 345086, 344823, 345135, 345321, 344925, 344440, 344458, 344686, 344430, 343630, 342644, 341421, 339737, 338097, 337425, 337725, 337936, 337386, 336678, 336613, 336870, 336415, 334956, 333328, 332344, 331788, 330729, 328564, 325542, 322489, 320288, 319475, 319965, 321011, 321709, 321725, 321447, 321285, 321107, 320564, 319725, 319020, 318659, 318545, 318731, 319502, 320887, 322507, 324028, 325461, 326839, 328041, 329171, 330772, 333276, 336391, 339404, 342015, 344632, 347828, 351685, 355722, 359407, 362703, 366017, 369664, 373572, 377654, 382179, 387380, 392879, 397996, 402608, 407211, 412142, 417201, 422141, 426970, 431593]
53599D31593M043L275K757K500K217J929J779J499P81j2k48n9j56o74j022r43
53583D49259q88j213j678j956k047j956j639j313j307j454j321j098j490k592
53569D27307l599l912l780l565l065k021p14L64R77J005L96m40p50l50N5j45o17
53552D07146o64k04L17O80J124J880K847L612L772L372L002L180L719M090M267
53537D42140M651N254N633N712N969O627P412Q211R272J0514J1467J2140J3098
53524E48100J4329J4977J4757J4757J6106J8512K0818K2485K3703K4641K5485
53513G58670K6734K8595L0258L0654K9830K8842K8392K8253K8007K7693K7579
53502A073507K7820K8430K9271L0001L0388L0620L1023L1552L1818L1648L1264
$$ y = [431593, 435636, 438911, 441668, 444168, 446385, 448314, 450093, 451592, 452373, 452361, 452113, 452054, 451898, 451224, 450202, 449259, 448371, 447158, 445480, 443524, 441477, 439521, 437882, 436569, 435262, 433808, 432487, 431389, 429899, 427307, 423708, 419796, 416016, 412451, 409386, 407365, 406651, 407015, 407992, 408997, 409393, 408953, 408203, 407853, 407908, 407763, 407146, 406482, 406278, 406595, 407275, 408399, 410279, 413126, 416738, 420510, 423882, 426884, 430064, 433783, 437873, 442140, 446791, 452045, 457678, 463390, 469359, 475986, 483398, 491609, 500881, 511395, 522862, 535002, 548100, 562429, 577406, 592163, 606920, 623026, 641538, 662356, 684841, 708544, 733185, 758670, 785404, 813999, 844257, 874911, 904741, 933583, 961975, 990228, 1018235, 1045928, 1073507, 1101327, 1129757, 1159028, 1189029, 1219417, 1250037, 1281060, 1312612, 1344430, 1376078, 1407342]
53491A407342L1033L1151L1502L1663L1127K9730K7766K5615K3528K1730K0432
53480A712619J9520J8705J8115J8338J9579K1077K1692K0830J8640J5709J2734
53469A917558J0122P600M571J008k431n390q286j1581j5046j8187k0786k2700
53457A836452k3666k3896k4311k5670k7731k9775l1447l2666l3191l2944l2334
53446A518821l1727l0963k9926k9067k8744k8508k7724k6510k5254k3671k1218
53435A215509j8125j5227j2896j0992r527q526p338n093j839J590M801Q050J1169
53422A151556J3388J4554J5642J7502J9761K1581K2970K4653K6859K8979L0504
53411A387949L1833L3746L6274L8575M0140M1608M3824M6399M8108M8817N0039
$$ y = [1407342, 1438375, 1469526, 1501028, 1532691, 1563818, 1593548, 1621314, 1646929, 1670457, 1692187, 1712619, 1732139, 1750844, 1768959, 1787297, 1806876, 1827953, 1849645, 1870475, 1889115, 1904824, 1917558, 1927680, 1935280, 1939851, 1940859, 1938428, 1933038, 1924752, 1913171, 1898125, 1879938, 1859152, 1836452, 1812786, 1788890, 1764579, 1738909, 1711178, 1681403, 1649956, 1617290, 1584099, 1551155, 1518821, 1487094, 1456131, 1426205, 1397138, 1368394, 1339886, 1312162, 1285652, 1260398, 1236727, 1215509, 1197384, 1182157, 1169261, 1158269, 1148742, 1140216, 1132878, 1127785, 1125946, 1127536, 1132337, 1140387, 1151556, 1164944, 1179498, 1195140, 1212642, 1232403, 1253984, 1276954, 1301607, 1328466, 1357445, 1387949, 1419782, 1453528, 1489802, 1528377, 1568517, 1610125, 1653949, 1700348, 1748456, 1797273, 1847312]
53400A847312N3107N7603O2224O6361P0053P3036P4942P6060P6996P7783P8208
53389B613685P8662P9696Q0888Q1150Q0118P8261P5764P2325O8081O3759N9664
53378C432053N5501N1346M7872M5201M2436L8771L4435L0161K6268K2594J8708
53367C845346J3879P303j293j1660k3566l6704m9988o1783p1154p8275q3425q6445
53355C362235q7511q7640q7730q7655q6809q5094q2843q0283p7667p5570p4495
53344B448938p4310p4491p4699p4757p4335p3033p0697o7416o3446n9214n5202
53333A687338n1554m8019m4364m0548l6450l1968k7571k4217k2319k1155j9737
53322A319436j7917j6209j4787j3215j1181r012p319o275n420m225k693j216J69
$$ y = [1847312, 1900419, 1958022, 2020246, 2086607, 2156660, 2229696, 2304638, 2380698, 2457694, 2535477, 2613685, 2692347, 2772043, 2852931, 2934081, 3014199, 3092460, 3168224, 3240549, 3308630, 3372389, 3432053, 3487554, 3538900, 3586772, 3631973, 3674409, 3713180, 3747615, 3777776, 3804044, 3826638, 3845346, 3859225, 3866528, 3865235, 3853575, 3830009, 3793305, 3743317, 3681534, 3610380, 3532105, 3448680, 3362235, 3274724, 3187084, 3099354, 3011699, 2924890, 2839796, 2756953, 2676670, 2599003, 2523433, 2448938, 2374628, 2300137, 2225438, 2150681, 2076346, 2003313, 1932616, 1865200, 1801754, 1742540, 1687338, 1635784, 1587765, 1543401, 1502853, 1466403, 1434435, 1406864, 1382647, 1360328, 1339173, 1319436, 1301519, 1285310, 1270523, 1257308, 1246127, 1237115, 1229796, 1223521, 1218101, 1213876, 1211183, 1209967, 1210136]
53309A210136J970M411O858Q545R591J0736J2279J3919J5551J7411J9478K1444
53297A352329K3403K5826K8652L1124L2767L3934L5160L6563L8071L9599M0757
53286A718185M0959M0091L8555L6583L4184L1747K9836K8213K6059K3416K1290
53275B069118J9856J7807J4224J0011O508L604L65l320o907j0527j4770j9499
53263B086470k4001k8168l2445l6724m0316m2983m5088m6777m7901m8676m9448
53252A643943m9824m9030m7206m5428m4261m3207m1804m0339l9143l8041l6984
53241A168676l6515l7068l8271l9412m0110m0218l9563l8162l6299l4049l1131
53230G57878k7581k4053k1043j8273j5370j2774j1367j1267j1608j1507j0877
$$ y = [1210136, 1212106, 1216517, 1223375, 1231920, 1241511, 1252247, 1264526, 1278445, 1293996, 1311407, 1330885, 1352329, 1375732, 1401558, 1430210, 1461334, 1494101, 1528035, 1563195, 1599758, 1637829, 1677428, 1718185, 1759144, 1799235, 1837790, 1874373, 1908557, 1940304, 1970140, 1998353, 2024412, 2047828, 2069118, 2088974, 2106781, 2121005, 2131016, 2137524, 2141128, 2141493, 2138173, 2131266, 2120739, 2105969, 2086470, 2062469, 2034301, 2001856, 1965132, 1924816, 1881833, 1836745, 1789968, 1742067, 1693391, 1643943, 1594119, 1545089, 1497883, 1452455, 1408194, 1364987, 1323183, 1282844, 1243701, 1205660, 1168676, 1132161, 1095093, 1056822, 1017410, 977300, 937082, 897519, 859357, 823058, 789009, 757878, 730297, 706244, 685201, 666928, 651558, 638784, 627417, 616150, 604542, 593035, 582158]
53219E82158j0263j0165j0599j1146j1336j1070j0642j0342j0186j0054r876r575
53207D56904r020q229p429o750o126n630n563n865n761m636l141k753m001n725
53193C76275o476o127n519m954l985k637j854k194k893k907k459k594l436l879
53179C24361l167j876j006p76q65j187j705j955j509p78o26j210j814j853j469
53164C02565j018n69j56qj56j42M70J398J872J499O10k05o51p65o96o54q67j325
53146C01202j583j166k58L05m3q92j364j147o56k84j3K29K75O0j52j22P9K82L81
53127B95133K08l39q79p77p9K86k32q78n57N67J283R05n9q73j397j744j761j301
53109B87506o86n19j075k045k778k794k234j736j654j570r46j40j18j108k188
$$ y = [582158, 571895, 561730, 551131, 539985, 528649, 517579, 506937, 496595, 486409, 476355, 466479, 456904, 447884, 439655, 432226, 425476, 419350, 413720, 408157, 402292, 396531, 391895, 388754, 386001, 382000, 376275, 369799, 363672, 358153, 353199, 349214, 346577, 344723, 342529, 339636, 336729, 334270, 331676, 328240, 324361, 321194, 319318, 318312, 317536, 316671, 315484, 313779, 311824, 310315, 309537, 308911, 307701, 305887, 304034, 302565, 301547, 300978, 300822, 300814, 300658, 300516, 300986, 302384, 304256, 305755, 306365, 306160, 305509, 304744, 304048, 303394, 302527, 301202, 299619, 298453, 298195, 298500, 298457, 297565, 296201, 295054, 294398, 294114, 294101, 294330, 294605, 294665, 294513, 294391, 294470, 294752, 295133, 295341, 295002, 294123, 293346, 293267, 293553, 293321, 292443, 291886, 292453, 293736, 294641, 294582, 293709, 292312, 290568, 288807, 287506, 286820, 286301, 285226, 283181, 280403, 277609, 275375, 273639, 271985, 270415, 269469, 269329, 269211, 268103, 265915]
53094B65915k436k038j730j640j251l42O08J084J127J064R46N56q8n61m78O7O03
53077B61406P53M74r3p01r50m94M93J274J242N92L2l3J98L36K41l7m64j044j679
53058B61546k090j950j207k47M11O84R48J379J596J195L91k37m33k94J50R42J793
53041B64577K168J810R04k27j208j500p99L68R24M33l90o26k47K1k77q04r05l39
53023B63883M64Q74P47N48O40O68N8r89j532j062j56L50L25J33p6l96o97p62p33
53004B62287r40j196q72K12J328J565P71m78j535k053j841q04Q32K429L256L004
52988B65965K065J266J193J606J603N91r58j892j598n90K07M51M48M79N14N28
52972B71878O61R27J093R88O95L71J55L08J059K074K505J938J002O12Q21R09M77
$$ y = [265915, 263479, 261441, 259711, 258071, 256820, 256478, 257086, 258170, 259297, 260361, 261307, 261863, 261775, 261214, 260736, 260803, 261406, 262159, 262633, 262540, 261839, 260889, 260395, 260888, 262162, 263404, 263996, 264028, 263995, 264193, 264529, 264770, 264733, 264269, 263225, 261546, 259456, 257506, 256299, 256052, 256463, 257147, 258095, 259474, 261070, 262265, 262656, 262419, 261986, 261692, 261842, 262784, 264577, 266745, 268555, 269459, 269232, 268024, 266524, 265725, 266093, 267017, 267450, 267060, 266434, 266187, 266208, 265931, 265127, 264222, 263883, 264347, 265221, 265968, 266516, 267156, 267824, 267882, 266893, 265361, 264299, 264143, 264493, 264818, 264951, 264875, 264479, 263782, 263020, 262287, 261347, 260151, 259279, 259491, 260819, 262384, 263155, 262677, 261142, 259089, 257248, 256444, 257276, 259705, 262961, 265965, 268030, 269296, 270489, 272095, 273698, 274289, 273331, 271439, 269841, 269251, 269458, 269909, 270357, 270836, 271350, 271878, 272539, 273466, 274559, 275547, 276242, 276613, 276768, 277076, 278135, 280209, 282714, 284652, 285654, 286266, 287087, 287996, 288473]
52955B88473j27n47j025j902k807k868j785l68K07l34j089j111n23k21o02j111
52939B72260j122p32l88j99m5J6o0L4N49J051P97k78j445k028j956j539j158j150
52921B62607j565j934j744j099n20j77J66M34K81r4J00J097K055K079J277L37
52905B63300m22j000j254j085q21q41r89r13p06o53o08k00M50R30J277J853K478
52888B60796K542K109K050K691L063K093O6j712k381k128j570j155j037j045q08
52873B63574l28k80j120k111j996p12L41J19q16j298j144r82r73o49J56R86J481
52856B54248J680J651J450J474K107K784K264K47j975l013k957k863l219l628
52842B50250l675l371k785j922j027m92m24o51j008j339j322q36k72n7M5N76J432
$$ y = [288473, 288346, 287799, 286774, 284872, 282065, 279197, 277412, 277044, 277251, 276917, 275828, 274717, 274194, 273973, 273371, 272260, 271138, 270406, 270018, 269819, 269774, 269790, 269730, 269764, 270313, 271364, 272161, 271883, 270438, 268410, 266454, 264915, 263757, 262607, 261042, 259108, 257364, 256265, 255745, 255568, 255734, 256168, 256449, 256355, 256455, 257552, 259607, 261686, 262963, 263300, 262878, 261878, 260624, 259539, 258718, 257877, 256888, 255975, 255269, 254616, 254008, 253808, 254258, 255188, 256465, 258318, 260796, 263338, 265447, 267497, 270188, 273251, 275344, 275410, 273698, 271317, 269189, 267619, 266464, 265427, 264382, 263574, 263246, 262966, 261846, 259735, 257739, 257027, 257368, 257487, 256671, 255373, 254229, 253247, 252274, 251625, 251781, 252767, 254248, 255928, 257579, 259029, 260503, 262610, 265394, 267658, 267905, 265930, 262917, 259960, 257097, 253878, 250250, 246575, 243204, 240419, 238497, 237470, 236978, 236554, 235903, 234895, 233556, 232234, 231398, 231126, 231069, 231114, 231690, 233122]
52825B33122J934J843J598J401P90n15j871k313j630n23J87K76J85N18J394K290
52809B38686K773L192M238N877P195P281N847L024p09m235o261o528o040n681
52795B48659n177l934k287j149p56o05n06q18j521j826j144J0N55J03o76q68k86
52778B27774M39O11K01j92n5N05R93J148J136J125J020O81K77J05J32j3m20n84
52760B34883q9N75M84m17j126r57m85n15p45k70R43K013K488K734K892K493J451
52743B46352N44L11K75j82o98n44J21L84j49r35j246r04k61K00K52K01N82J340
52725B45643J683J062J1n51m99m75q32j208j160o86r5K95K98J4k19k28j91j84
52707B42678J02P62J134N54n70j134p83k51k02m35m42j41K41N48O82O00N20P00
$$ y = [233122, 235056, 236899, 238497, 239898, 240688, 240173, 238302, 235989, 234359, 233836, 234023, 234299, 234484, 235002, 236396, 238686, 241459, 244651, 248889, 254766, 261961, 269242, 275089, 278113, 277404, 273169, 266908, 260380, 254340, 248659, 243482, 239548, 237261, 236112, 235356, 234751, 234245, 233427, 231906, 230080, 228936, 228946, 229501, 229604, 228928, 228060, 227774, 228213, 228824, 229025, 228833, 228778, 229283, 230276, 231424, 232560, 233685, 234705, 235386, 235663, 235768, 235900, 235887, 235467, 234883, 234794, 235369, 235853, 235436, 234310, 233353, 232868, 232353, 231608, 231338, 232281, 234294, 236782, 239516, 242408, 244901, 246352, 246896, 247207, 247482, 247300, 246602, 246058, 246179, 246563, 246414, 245479, 244233, 243329, 243068, 243268, 243520, 243721, 244303, 245643, 247326, 248388, 248399, 247848, 247349, 246874, 246042, 244834, 243674, 242988, 242893, 243188, 243486, 243500, 243281, 243053, 242862, 242678, 242780, 243542, 244676, 245230, 244660, 243526, 242743, 242492, 242290, 241855, 241413, 241272, 241513, 242061, 242743, 243343, 243863, 244563]
52689B44563Q72L93p33j579j358l71N73J206J750K151K030J405Q63Q81J217J153
52673B55016K96r16j496q56M88J347J131M10P2K70N30N51M39K82Ll48n37m30n5
52654B56197O04J537K456K986L132L203L155K494J021p27k056k811l222l349l123
52639B61497k692k288j848j155l28K00K46J07K08P74J817L083M046M336M203M191
52623B76397M261L703K065j88k168l334l615l217k629k385k444k172j298m31k11
52608B62334l52j95K56M97M89N83O73K94m63j028j323j768k197j815n76M57O72
52591B56538Q39J738K744K808K146J754J675J086N1k22P30J648J223j9m12O34
52575B74961J966K179J144k23j116j352r99r5J065J754J398L18n47p15o06p59
$$ y = [244563, 245435, 245828, 245095, 243516, 242158, 241787, 242360, 243566, 245316, 247467, 249497, 250902, 251765, 252646, 253863, 255016, 255312, 254396, 252900, 252044, 252532, 253879, 255010, 255420, 255492, 255762, 256292, 256843, 257282, 257564, 257567, 257219, 256682, 256252, 256197, 256801, 258338, 260794, 263780, 266912, 270115, 273270, 275764, 276785, 276058, 274002, 271191, 267969, 264620, 261497, 258805, 256517, 254669, 253514, 253186, 253386, 253632, 253739, 253947, 254721, 256538, 259621, 263667, 268003, 272206, 276397, 280658, 284361, 286426, 286238, 284070, 280736, 277121, 273904, 271275, 268890, 266446, 264274, 262976, 262545, 262334, 261982, 261787, 262043, 262540, 263029, 263612, 264285, 264579, 264116, 263088, 261765, 259997, 257800, 255985, 255409, 255866, 256538, 257377, 259115, 261859, 264667, 266813, 268567, 270242, 271328, 271379, 271157, 271887, 273535, 274758, 274739, 274327, 274961, 276927, 279106, 280250, 280027, 278911, 277559, 276560, 276465, 277530, 279284, 280682, 281000, 280453, 279738, 279132, 278373]
52559B78373j016q26j16N92Q66P51N29L77L81N35O24K96n38j446j757j182j96
52542B76247K75l20j595k576k584j694m32P16J409J441Q86J07n39q60p88m21j23
52525B69149k80p42r30o36k61j29j2L20N98N72N85J028J603J740J525J481J665
52508B77276J675J508J584J906J884J231L66k20n25p48j050j699k794l651l226
52493B73517j524J47P63P23P81O42l00j440j466l18O47O92O98J496K320J969P64
52476B80111J83P60J531J661J389J154P12j22p47n64M5L89P20J762L192L710K806
52459B98692J512R47R69P73J59m56r51j627k589l514m030l945l221k052r07k35
52443B79525j36m25q64j180j118o74k08l7j63l85n04k84L54J007J005K32o48r87
$$ y = [278373, 277357, 276531, 276415, 277007, 277873, 278624, 279153, 279530, 279911, 280446, 281070, 281366, 280828, 279382, 277625, 276443, 276247, 276522, 276202, 274607, 272031, 269447, 267753, 267321, 268037, 269446, 270887, 271773, 271880, 271341, 270481, 269693, 269272, 269149, 268869, 268127, 267197, 266561, 266300, 266171, 266159, 266479, 267077, 267649, 268234, 269262, 270865, 272605, 274130, 275611, 277276, 278951, 280459, 282043, 283949, 285833, 287064, 287430, 287210, 286685, 285937, 284887, 283188, 280394, 276743, 273517, 271993, 272140, 272903, 273626, 274407, 275049, 274749, 273309, 271843, 271525, 272172, 272864, 273562, 275058, 277378, 279347, 280111, 280294, 281054, 282585, 284246, 285635, 286789, 287501, 287379, 286632, 286068, 286113, 286502, 287222, 288984, 292176, 295886, 298692, 300204, 301151, 302120, 302893, 303052, 302596, 301645, 300018, 297429, 293915, 289885, 285940, 282719, 280667, 279760, 279525, 279389, 278964, 278100, 276920, 275802, 275128, 274920, 274883, 274720, 274335, 273831, 273547, 273901, 274908, 275913, 276145, 275497, 274510]
52425B74510q06m43q5M9l52j083j257l56R63J705J748J587J345Q62M93Q66J854
52408B81600K621K832L091M021N470O868P911Q710R483J0161J0056Q185M334l98
52394C64945m538p409q967r023p533n451m136l832l579k781j942j625j539j132
52380C01458m11K86Q12J123J119Q98Q35J170J793K550L319L821L827L637L689
52365C29926L717K969J453J20m45p20j228j582j165j23Q71J443J561J188M98Q8
52349C38571L92J046J312R86N48N85J284K293K890K576J671J005R03R50R34J395
52333C59341K746M439N540N861O004O525P452Q495R295R672R815J0110J0629J1074
52319D66998J1259J1256J0980J0183R104Q541Q911R690J0196J0372J0488J0589
$$ y = [274510, 273704, 273261, 273176, 273225, 272873, 271790, 270533, 270177, 271140, 272845, 274593, 276180, 277525, 278387, 278880, 279746, 281600, 284221, 287053, 290144, 294165, 299635, 306503, 314414, 323124, 332607, 342768, 352824, 361009, 365343, 364945, 360407, 352998, 344031, 335008, 327475, 322024, 317888, 314056, 310477, 307696, 305754, 304129, 302590, 301458, 301047, 301333, 302145, 303268, 304387, 305285, 306120, 307290, 309083, 311633, 314952, 318773, 322600, 326237, 329926, 333643, 336612, 338065, 338185, 337740, 337020, 335792, 334210, 333045, 332922, 333793, 335236, 336797, 337985, 338483, 338571, 338963, 340009, 341321, 342307, 342855, 343440, 344724, 347017, 349907, 352483, 354154, 355159, 356062, 357012, 357946, 359341, 362087, 366526, 372066, 377927, 383931, 390456, 397908, 406403, 415698, 425370, 435185, 445295, 455924, 466998, 478257, 489513, 500493, 510676, 519780, 528321, 537232, 546922, 557118, 567490, 577978, 588567]
52307E88567J0692J1006J1522J1870J1972J2247J2700J2576J1577J0698J0995
52296G16422J2041J2571J2129J1069R350O552L109L27j090j656k086k492k809
52283G73437l209l658l692l081k285j901j985k175k175j816r79K49J483K309K616
52268G53138K628K700L112L872M762N638O584P672Q738R567J0085J0223R868R246
52254H47833R058R809J1176J2345J2785J2369J1089R170P214N746M683L657K643
52241I59577J806J027J71m30l44J99N50M38r1j216k975m493m621l490k493k470
52225I41145k819k785k630k862l134k790k025j588j587j384o41K69R78J630K427
52210I22204L212L718M027M424N007N647O278O839O958O080M249K507K084L074
$$ y = [588567, 599259, 610265, 621787, 633657, 645629, 657876, 670576, 683152, 694729, 705427, 716422, 728463, 741034, 753163, 764232, 773582, 780134, 783243, 783570, 782480, 780824, 778738, 776246, 773437, 770228, 766570, 762878, 759797, 757512, 755611, 753626, 751451, 749276, 747460, 746481, 746730, 748213, 750522, 753138, 755766, 758466, 761578, 765450, 770212, 775850, 782434, 790106, 798844, 808411, 818496, 828719, 838587, 847833, 856891, 866700, 877876, 890221, 903006, 915375, 926464, 935634, 942848, 948594, 953277, 956934, 959577, 961383, 962410, 962581, 962151, 961807, 962006, 962556, 962994, 962903, 961687, 958712, 954219, 949598, 946108, 943615, 941145, 938326, 935541, 932911, 930049, 926915, 924125, 922100, 920512, 918925, 917541, 916900, 917169, 918147, 919777, 922204, 925416, 929134, 933161, 937585, 942592, 948239, 954517, 961356, 968314, 974394, 978643, 981150, 983234, 986308]
52196I86308M306M730M570M813N843P032P518P009N835M559L646L187K786J859
52182A054001J34k098m150n419n848o038o622p441p688o998o023n595n757n928
52168I78530n712n067m077l053k526k554k337j178M58J530J861K101K438K298
52154I62712J457N64J65J7k77n23l33K04O54P56N94M66P30J432J982J641M26r33
52136I71734j981k904l766m050l339j973o23M24J292K214L537N580Q122J0356
52122I84623J1724J2491J3261J4245J5323J6360J7152J7332J6725J5553J4068
52111A148857J2417J1093J0921J2025J3148J2792J0873Q792P938Q552R948J1264
52099A278620J1993J2155J2131J2142J1941J1166R757P781N090J575k313n769
$$ y = [986308, 990614, 995344, 999914, 1004727, 1010570, 1017602, 1025120, 1032129, 1037964, 1042523, 1046169, 1049356, 1052142, 1054001, 1054135, 1052037, 1047887, 1042468, 1036620, 1030582, 1023960, 1016519, 1008831, 1001833, 995810, 990215, 984458, 978530, 972818, 967751, 963674, 960621, 958095, 955541, 953204, 952026, 952484, 954014, 955875, 957976, 960414, 962712, 964169, 964733, 964898, 964915, 964638, 964115, 963782, 963986, 964640, 965396, 965990, 966456, 967186, 968618, 970600, 972241, 972667, 971734, 969753, 966849, 963083, 959033, 955694, 953721, 953098, 953522, 954814, 957028, 960565, 966145, 974267, 984623, 996347, 1008838, 1022099, 1036344, 1051667, 1068027, 1085179, 1102511, 1119236, 1134789, 1148857, 1161274, 1172367, 1183288, 1195313, 1208461, 1221253, 1232126, 1240918, 1248856, 1257408, 1267356, 1278620, 1290613, 1302768, 1314899, 1327041, 1338982, 1350148, 1359905, 1367686, 1372776, 1374351, 1372038, 1366269]
52087A366269q401j0373j1820j2477j2110j1055j0008r307q572p167n045l040
52075A256894k089k219k532k225j311k63P11J711K792L897M957N825O283O368
52061A278799O517P047P643P760P395P095P181P416P474P366P191O766N763M121
52047A375534K126J28j672l172m271m988n617o491p527q153p975p308o730o269
52033A307615n510m524m112m753n776o097n584n165n616o664p315o835n318l612
52019A230734k738l104m127m724m324l304k364j657p87L80J207R12m96k285m121
52004A199202o570j0163j4355j7995k0629k2689k4368k5107k4542k3338k2565
51993I86881k2470k2340k1479j9902j8172j6810j5931j5251j4507j3835j3565
$$ y = [1366269, 1357868, 1347495, 1335675, 1323198, 1311088, 1300033, 1290025, 1280718, 1272146, 1264979, 1259934, 1256894, 1254805, 1252586, 1250054, 1247829, 1246518, 1246255, 1246966, 1248677, 1251469, 1255366, 1260323, 1266148, 1272431, 1278799, 1285316, 1292363, 1300006, 1307766, 1315161, 1322256, 1329437, 1336853, 1344327, 1351693, 1358884, 1365650, 1371413, 1375534, 1377660, 1377788, 1376116, 1372944, 1368673, 1363685, 1358068, 1351577, 1344050, 1335897, 1327922, 1320614, 1313884, 1307615, 1302105, 1297581, 1293469, 1288716, 1282940, 1276843, 1271259, 1266094, 1260478, 1253814, 1246499, 1239664, 1234346, 1230734, 1227996, 1224892, 1220765, 1216041, 1211717, 1208413, 1206049, 1204392, 1203605, 1203985, 1205192, 1206104, 1205608, 1203323, 1199202, 1192632, 1182469, 1168114, 1150119, 1129490, 1106801, 1082433, 1057326, 1032784, 1009446, 986881, 964411, 942071, 920592, 900690, 882518, 865708, 849777, 834526, 820019, 806184, 792619]
51982G92619j3637j3601j3179j2586j2078j1677j1509j1915j2832j3531j3401
51971F52673j2665j1770j0455q155n131k382l66J419L334M847N362N290N644O677
51957F34322P482O969M920K007r17l376n264o656p664q346q578q100o816m970
51943E95013k856m38K448N516Q047R594J0381J0805J0948J0801J0534J0085Q878
51930F89756O504L540R62j123l526o694j0051j2850j5010j6720j7755j7779j6974
51917E82280j5870j4705j3428j2122j0862r334p171m793l110k308j532j60J237
51904D88122J846K035L014N180P586R205R942J0098R492P650M598Q79k975o622
51890E50050r720j1970j3277j3510j2400j0086p552n767m443k377P19L545M805
$$ y = [792619, 778982, 765381, 752202, 739616, 727538, 715861, 704352, 692437, 679605, 666074, 652673, 640008, 628238, 617783, 609628, 604497, 602115, 601749, 603168, 606502, 611349, 616711, 622001, 627645, 634322, 641804, 648773, 653693, 655700, 654783, 651407, 646143, 639487, 631823, 623477, 614899, 606799, 599983, 595013, 592157, 591719, 594167, 599683, 607730, 617324, 627705, 638510, 649458, 660259, 670793, 680878, 689756, 696260, 699800, 700762, 699639, 696113, 689419, 679368, 666518, 651508, 634788, 617033, 599254, 582280, 566410, 551705, 538277, 526155, 515293, 505959, 498788, 493995, 490885, 488577, 487045, 486885, 488122, 489968, 492003, 495017, 500197, 507783, 516988, 526930, 537028, 546520, 554170, 558768, 559647, 556672, 550050, 540330, 528360, 515083, 501573, 489173, 479087, 471535, 465768, 461325, 458948, 459667, 463212, 468017]
51877D68017M983N790Q040J0801J2726J3598J4149J4673J4436J2525Q952M640
51865E93330N23k951n550o973p167o612n896n092l823j772J141M862R141J3393
51851E76554J7017J9937K2590K5445K8578L1408L2481K9879K2553J1384j423j3809
51839H02594k4339l1724l5028l4620l2089k8799k5028k0773j6532j2860r707o886
51827E24209m723l657l522l733l977m261m565m849n172n364m891l492j701k80
51813D70022O78J621K741L800M552M824M255K631M14j522k806l786m776n490n425
51798D71733m518l237k181j622j375j078o62m62p74j479k201k599k374j326K35
51783D46080J425J526P61n0m80q06j373k034k379k222j759j265p42J64J704L584
$$ y = [468017, 473000, 478790, 486830, 497631, 510357, 523955, 538104, 552777, 567213, 579738, 588690, 593330, 593853, 590902, 585352, 578379, 571212, 564600, 558704, 553612, 549789, 548017, 549158, 554020, 563161, 576554, 593571, 613508, 636098, 661543, 690121, 721529, 754010, 783889, 806442, 817826, 816403, 802594, 778255, 746531, 711503, 676883, 644794, 615995, 590967, 570194, 553662, 540802, 531095, 524209, 519486, 515829, 512307, 508574, 504597, 500336, 495771, 490922, 485750, 480386, 475495, 472003, 470302, 470022, 470700, 472321, 475062, 478862, 483414, 488238, 492493, 495124, 495538, 494016, 491210, 487424, 482648, 477158, 471733, 467215, 463978, 461797, 460175, 458800, 457722, 457060, 456598, 455824, 454345, 452144, 449545, 447171, 445845, 446080, 447505, 449031, 449792, 449742, 449262, 448456, 447083, 445049, 442670, 440448, 438689, 437424, 436682, 436846, 438550, 442134]
51767D42134N206O338P223Q005Q463Q484Q257P703O211L465J72k598m520o024
51753D98519p366q291q532q155p421o624n966n314m339l110k220j878j312K64
51739D28255K461M221N282O280P559Q788R889J1277J2786J3182J1380P749L770
51726E32879P60p03n21J102L646O360Q315Q379N715P77m399p495p735o213m517
51711E36350l294k320j563j692l289n784p569p355n182k063J070L699N341N425
51697E11774L793J058j715l602m160l371j453J273M291O738P605O313L130j043
51683E30631n129q199r721r765q853p339n150k233R79L770N593O161N420L841
51669E00006K467K182L009M333N737P325R394J1868J3957J4212J1435N815j030
$$ y = [442134, 447340, 453678, 460901, 468906, 477369, 485853, 494110, 501813, 508024, 511489, 511661, 509063, 504543, 498519, 491153, 482862, 474330, 466175, 458754, 452130, 446164, 440850, 436511, 433401, 431181, 429303, 427991, 428255, 430716, 434937, 440219, 446499, 454058, 462846, 472735, 484012, 496798, 509980, 521360, 529109, 532879, 533639, 532936, 532415, 533517, 537163, 543523, 551838, 560217, 565932, 566709, 562310, 554815, 547080, 540867, 536350, 533056, 530736, 529173, 527481, 524192, 518408, 510839, 503484, 498302, 496239, 497309, 501008, 506349, 511774, 515567, 516625, 514910, 511308, 507148, 503777, 502324, 503597, 507888, 514626, 522231, 528544, 531674, 530631, 525502, 517303, 507582, 497817, 488964, 481625, 476475, 474242, 475221, 478991, 484584, 490745, 496165, 500006, 502473, 504655, 507664, 511997, 517734, 525059, 534453, 546321, 560278, 574490, 585925, 591740, 590710]
51656E90710p381j2357j5521j6387j4956j2157q933n330j144K980N915P151O730
51643E19320M448K63m749q947j1731j3610j4711j4366j2466j0158q576p694o835
51630D10188n653m242k813j754j428j590j494q66k26j4k9O2K60O46J453K429K767
51613C97696K219J559J377J124Kj714l037l587l746l741l343k466j465p13k20
51598C79945L19J234K574L948M953N852P448R944J2449J3870J3918J2723J0103
51585D79280N986J350k124l436k883j321O13K587M460O411Q791J1708J4909J8127
51571E44458K1187K3746K5354K6049K6614K7825K9395K9988K8437K4957K1179
51560H29189J9111K0096K4391L1217L9084M6432N2177N5486N4970M8914L6931
$$ y = [590710, 583329, 570972, 555451, 539064, 524108, 511951, 503018, 497688, 496544, 499524, 505439, 512590, 519320, 523768, 524031, 519282, 510335, 498604, 484994, 470283, 455917, 443451, 433293, 424717, 417023, 410188, 404535, 400293, 397480, 395726, 394298, 392708, 391214, 390348, 390122, 390108, 390079, 390141, 390401, 391047, 392500, 394929, 397696, 399915, 401474, 402851, 403975, 403977, 402263, 399226, 395639, 391893, 388152, 384809, 382343, 380878, 380165, 379945, 380264, 381498, 384072, 388020, 392973, 398825, 406273, 416217, 428666, 442536, 456454, 469177, 479280, 485266, 486616, 484492, 481056, 478173, 476852, 477465, 480052, 484512, 490923, 499714, 511422, 526331, 544458, 565645, 589391, 614745, 640794, 667408, 695233, 724628, 754616, 783053, 808010, 829189, 848300, 868396, 892787, 924004, 963088, 1009520, 1061697, 1117183, 1172153, 1221067, 1257998]
51549A257998K1184N129q997k1042l1538m0335m6894n1200n3784n5099n5238n4123
51537H66061n1678m7988m3403l8414l3316k8264k3606j9785j6843j4328j1896
51526E36540r665p860o418n201m312m006m322m942n331n118m403l663l114k502
51512D65683j737j336j726k448k737k683l041l997m896n245n212n031m654m076
51498D16864l376k351r83r1n48j716j924q02J74Ll19M37J684J992J260N64K64
51481D11132k99j388k302k435j978j407r43o27m47k82q5j28o29j256j421j030
51465C94475o35q27j628k357k097o02J102J583O40m43n43K9L54K73L27R11K117
51448C92679L972O079P457P504O880O897Q268J0952J4688J8755K1592K1604J8486
$$ y = [1257998, 1279182, 1284311, 1275314, 1254272, 1222734, 1182399, 1135505, 1084305, 1030521, 975422, 920184, 866061, 814383, 766395, 722992, 684578, 651262, 622998, 599392, 579607, 562764, 548436, 536540, 526875, 519015, 512597, 507396, 503084, 499078, 494756, 489814, 484483, 479365, 474962, 471299, 468185, 465683, 463946, 462610, 460884, 458436, 455699, 453016, 449975, 445978, 441082, 435837, 430625, 425594, 420940, 416864, 413488, 411137, 410154, 410063, 409515, 407799, 405875, 405073, 405247, 405250, 404931, 405368, 407052, 409044, 410304, 410868, 411132, 410833, 409445, 407143, 404708, 402730, 401323, 400380, 399753, 399306, 399024, 398939, 398811, 398182, 396926, 395505, 394475, 393840, 393013, 391385, 389028, 386931, 386329, 387431, 389014, 389654, 389211, 388668, 388697, 389051, 389324, 389651, 390562, 392679, 396651, 402730, 410187, 417691, 424571, 431468, 439736, 450688, 465376, 484131, 505723, 527327, 545813]
51435E45813J3364P782L078K33m65K26R75O58j409n308j0070j3945j5841j6185
51421E08906j5735j4334j1659q553o362n232m230k981j970j304l88R34K002K405
51407D41499K516K661K527J813Q86M34Q72K096L438L952L391K770L273M706N734
51392D82568N635M971M588M760N382O279P220Q372J0649J4812K0230K5470L0165
51379F31101L5255M1343M7868N4176O0271O6067P0780P3464P3202O8604N8449
51368A280580M3596K7181J1853k431j7041l1852m4929n4629o0905o4648o6644
51357A020131o7203o6176o3091n7796n0980m3835l7232l1411k6288k1756j7844
51346E36519j4794j2893j2075j1856j1775j1606j1161j0256r033p939p087o062
$$ y = [545813, 559177, 566959, 570037, 570270, 569805, 570031, 571006, 571664, 570255, 564947, 554877, 540932, 525091, 508906, 493171, 478837, 467178, 458625, 452263, 447031, 442801, 439820, 437850, 436546, 436158, 437092, 439094, 441499, 444015, 446676, 449203, 451016, 451902, 452336, 453208, 455304, 458742, 462694, 466085, 468855, 472128, 476834, 482568, 488203, 493174, 497762, 502522, 507904, 514183, 521403, 529775, 540424, 555236, 575466, 600936, 631101, 666356, 707699, 755567, 809743, 870014, 936081, 1006861, 1080325, 1153527, 1222131, 1280580, 1324176, 1351357, 1363210, 1360779, 1343738, 1311886, 1266957, 1212328, 1151423, 1086775, 1020131, 952928, 886752, 823661, 765865, 714885, 671050, 633818, 602407, 576119, 554363, 536519, 521725, 508832, 496757, 484901, 473126, 461520, 450359, 440103, 431070, 423131, 416044, 409982]
51334D09982m571k968j869j470j541j758j867j778j666j815k204k506k571k495
51320C78903k290j783j009k49L69R42J398J563J608J894K276K228J765J547J840
51305C91002K040J649J006P23R56J579K450L090K784J518K12m98j105k245l531
51290D01630m137m077m012m147m122l804l388k794j704k12J174K206L069L854
51276C79536M329M254L583K441J203M88O14J133J287Q90M38M83J192K330L388
51261D07589L878L911M169M922N357M516K679J089L11l81j794l677n105n532n077
51246D16855m156l263k887l153l543l317k333j295j042j680k534k924k700k074
51232C79954j212k96L27M47L53M61O17L15l85p26l12K99M02J73L50J210K336L178
$$ y = [409982, 405411, 402443, 400574, 399104, 397563, 395805, 393938, 392160, 390494, 388679, 386475, 383969, 381398, 378903, 376613, 374830, 373821, 373572, 373941, 374883, 376281, 377844, 379452, 381346, 383622, 385850, 387615, 389162, 391002, 393042, 394691, 395697, 396420, 397376, 398955, 401405, 404495, 407279, 408797, 409009, 408511, 407406, 405161, 401630, 397493, 393416, 389404, 385257, 381135, 377331, 373943, 371149, 369445, 369233, 370407, 372613, 375682, 379536, 383865, 388119, 391702, 394143, 395346, 395834, 396448, 397581, 398868, 399758, 400196, 400679, 401871, 404201, 407589, 411467, 415378, 419547, 424469, 429826, 434342, 437021, 438110, 438421, 438040, 436246, 432569, 427464, 421932, 416855, 412699, 409436, 406549, 403396, 399853, 396536, 394203, 392908, 391866, 390186, 387652, 384728, 382028, 379954, 378742, 378446, 378773, 379220, 379573, 380034, 380651, 380966, 380581, 379855, 379543, 379842, 380244, 380417, 380767, 381977, 384313, 387491]
51214C87491L465L176K494J748J142O33J94OJ82N52R84J663K695L682M114M047
51198D18268M006M315M770M953M589L661K461J457Q91N64J49m14r75j453j782
51183D45460j802j462r70o14m93o05r12j184j088p28p48j562k701l293l005k197
51167D22096j379q61p21p28m13M20J418K162K676L121L303K940K199J424N00q59
51151D37298k348l220l300l238l596m138m282l844l105k418k000j869j812j572
51137C96556j119o67l95l04l12k89l7M49Q65R60J045J668K765L564L508K993K874
51120D14124L474M281M471L662K265J227J211J855K078J271O1m07K32J229J727
51105D42761J678J711K280L245M125M519M350L902L562L293K492P20j385k535
$$ y = [387491, 390956, 394132, 396626, 398374, 399516, 400149, 400343, 400349, 400531, 401083, 402067, 403730, 406425, 410107, 414221, 418268, 422274, 426589, 431359, 436312, 440901, 444562, 447023, 448480, 449371, 449935, 450084, 449670, 448695, 447242, 445460, 443658, 442196, 441226, 440612, 440119, 439514, 438602, 437418, 436330, 435602, 434854, 433292, 430591, 427298, 424293, 422096, 420717, 419856, 419135, 418407, 417994, 418414, 419832, 421994, 424670, 427791, 431094, 434034, 436233, 437657, 438157, 437298, 434950, 431730, 428430, 425192, 421596, 417458, 413176, 409332, 406227, 403809, 401809, 399940, 398128, 396556, 395437, 394770, 394375, 394071, 393759, 393470, 393433, 393882, 394747, 395707, 396752, 398420, 401185, 404749, 408257, 411250, 414124, 417598, 421879, 426350, 430012, 432277, 433504, 434715, 436570, 438648, 439919, 439980, 439573, 439805, 441034, 442761, 444439, 446150, 448430, 451675, 455800, 460319, 464669, 468571, 472133, 475426, 477918, 478638, 477253, 474718]
51091D74718k306j757k128l353m343m389l603k340r17J44M48L12M07O90N54O8
51075D52205J57J138K046K053J754K224L352M090M013L787M110M914N682O006
51061D97531N841N630O152P798R988J1587J1792J0301P098K736j280l243k609
51048E69322k12K824N792Q015Q762Q089P280P602Q745R101P668N261L639L772
51034F55660N198O708P159N711K076l032q028j1620j3749j5124j6101j6463j6031
51021E82364j4819j2661r464n900l143j589n22O98J801K312K459K789L397M095
51007E51817M924N932O787P170P292P524P759P643P193O764O502O288O000N543
50993F45138M781L815L041K732K850L533N171P632R919J1202J1837J2798J4438
$$ y = [474718, 472412, 470655, 468527, 465174, 460831, 456442, 452839, 450499, 449582, 449726, 450174, 450486, 450893, 451583, 452137, 452205, 452362, 453500, 455546, 457599, 459353, 461577, 464929, 469019, 473032, 476819, 480929, 485843, 491525, 497531, 503372, 509002, 515154, 522952, 532940, 544527, 556319, 566620, 573718, 576454, 575174, 571931, 569322, 569110, 571934, 577726, 585741, 594503, 602592, 609872, 617474, 626219, 635320, 642988, 648249, 651888, 655660, 660858, 667566, 674725, 680436, 682512, 679480, 671452, 659832, 646083, 630959, 614858, 598395, 582364, 567545, 554884, 545420, 539520, 536377, 534788, 534266, 534964, 536765, 539077, 541536, 544325, 547722, 551817, 556741, 562673, 569460, 576630, 583922, 591446, 599205, 606848, 614041, 620805, 627307, 633595, 639595, 645138, 649919, 653734, 656775, 659507, 662357, 665890, 671061, 678693, 688612, 699814, 711651, 724449, 738887]
50980G38887J6367J8170J9606K0455K0706K0727K0703K0275J9148J7645J6117
50969I48806J4415J2618J1643J2145J3316J3896J4098J5341J8175K1688K4987
50958A121128K8173L1484L4533L6786L8088L8377L7540L5792L3588L1009K7823
50947A494321K4265K1018J8284J5661J3163J1625J1784J3609J6686K0323K2907
50936A683646K2193J7243R660K221l513p723j0984j3258j4428j5145j6619j9521
50924A633772k3357k7085l0249l3226l6382l9474m2052m3981m5052m4713m2809
50913A225392m0199l7811l5378l2044k8045k4763k2994k2045k0868j9172j7237
50902I24836j5333j3783j2885j2380j1519j0004q360p108o133n114m100l283k693
$$ y = [738887, 755254, 773424, 793030, 813485, 834191, 854918, 875621, 895896, 915044, 932689, 948806, 963221, 975839, 987482, 999627, 1012943, 1026839, 1040937, 1056278, 1074453, 1096141, 1121128, 1149301, 1180785, 1215318, 1252104, 1290192, 1328569, 1366109, 1401901, 1435489, 1466498, 1494321, 1518586, 1539604, 1557888, 1573549, 1586712, 1598337, 1610121, 1623730, 1640416, 1660739, 1683646, 1705839, 1723082, 1732742, 1734963, 1731450, 1723727, 1712743, 1699485, 1685057, 1669912, 1653293, 1633772, 1610415, 1583330, 1553081, 1519855, 1483473, 1443999, 1401947, 1357966, 1312914, 1268201, 1225392, 1185193, 1147382, 1112004, 1079960, 1051915, 1027152, 1004158, 982113, 961245, 942073, 924836, 909503, 895720, 882835, 870455, 858936, 848932, 840572, 833464, 827331, 822217, 818117, 814834, 812141]
50889H12141k311k167k102j859j500j250r12k0J306K314K646K731K984L270L451
50874H18722L764M323M803N015N219N655O248P053Q298R750J0765J1304J2176
50861I13095J3821J5639J7040J8392K0267K2460K4577K7043L0652L5342M0254
50850A178582M4790M9061N3469N8327O3758O9496P4988Q0056Q5168R0609R5747
50839A944051R9584J01689J02046J00318R5951Q8909P9734O8938N6871M4145L1673
50828B813909K0162R920J200n477r500j0569q972n489q23M893J1739J9049K5198
50815B865240K8508K8172K4188J6879O799n176j8051l1031m3518n5135o5822p5604
50803B675449q4130r0617r4284r4724r1995q6763q0117p2738o4456n5111m5541
$$ y = [812141, 809830, 807663, 805561, 803702, 802202, 800952, 800040, 800020, 801326, 803640, 806286, 809017, 812001, 815271, 818722, 822486, 826809, 831612, 836627, 841846, 847501, 853749, 860802, 869100, 878850, 889615, 900919, 913095, 926916, 942555, 959595, 977987, 998254, 1020714, 1045291, 1072334, 1102986, 1138328, 1178582, 1223372, 1272433, 1325902, 1384229, 1447987, 1517483, 1592471, 1672527, 1757695, 1848304, 1944051, 2043635, 2145324, 2247370, 2347688, 2443639, 2532548, 2612282, 2681220, 2738091, 2782236, 2813909, 2834071, 2843991, 2845191, 2839714, 2830214, 2819645, 2810673, 2805184, 2804361, 2809254, 2820993, 2840042, 2865240, 2893748, 2921920, 2946108, 2962987, 2969786, 2964610, 2946559, 2915528, 2872010, 2816875, 2751053, 2675449, 2591319, 2500702, 2406418, 2311694, 2219699, 2132936, 2052819, 1980081, 1915625, 1860514, 1814973]
50792A814973l6789k8631k0021j0950k552M779J1778J8400K3035K4635K4318K3706
50780A846681K2694K0174J6101J1468O818K086k424o142r094j1665j3857j5729
50768A867111j8165k1992k6644l0840l4450l8413m2876m6633m8624m8966m8238
50757A461270m6717m4551m1949l8939l5512l1992k8630k5024k0736j6374j3016
50746A117830j0622q017m627j139J817M576P668J1042J4600J8595K2953K6892
50734A201568K9894L2496L5568L9226M2932M6203M8811N0654N1956N3224N4696
50723A687228N6057N7012N7625N7811N6905N4241M9848M4138L7182K8708J8726
50712B205481P851k902j2445j9941k5012k7518k7169k3755j7871j0966m356J529
$$ y = [1814973, 1778184, 1749553, 1729532, 1718582, 1716030, 1720809, 1732587, 1750987, 1774022, 1798657, 1822975, 1846681, 1869375, 1889549, 1905650, 1917118, 1923936, 1926022, 1923598, 1917456, 1908362, 1896697, 1882840, 1867111, 1848946, 1826954, 1800310, 1769470, 1735020, 1696607, 1653731, 1607098, 1558474, 1509508, 1461270, 1414553, 1370002, 1328053, 1289114, 1253602, 1221610, 1192980, 1167956, 1147220, 1130846, 1117830, 1107208, 1099191, 1094564, 1093425, 1095242, 1099818, 1107486, 1118528, 1133128, 1151723, 1174676, 1201568, 1231462, 1263958, 1299526, 1338752, 1381684, 1427887, 1476698, 1527352, 1579308, 1632532, 1687228, 1743285, 1800297, 1857922, 1915733, 1972638, 2026879, 2076727, 2120865, 2158047, 2186755, 2205481, 2213332, 2210430, 2197985, 2178044, 2153032, 2125514, 2098345, 2074590, 2056719, 2045753, 2041397, 2042926]
50700B042926O812J1531J5550J8639K0220J9365J5490Q890L82r212j8895k7249
50688B104449l3172l6702l8584l9055l7624l4062k8978k3174j6962j0439l981
50677A801716K101Q167J5023K3064L2051M1691N1942O2530P2558Q0948Q7007R0331
50665B369129R0445Q7064Q0646P2247O2849N3188M4084L6329L0065K4856K0496
50654B971398J7238J4856J2078P572J255n787j2452j8144k2472k5067k5909k5317
50642B889249k3418j9920j4573p738l44O728J3119J8879K3939K7845L0119L0724
50630B974609K9980K8255K5997K3860K2317K1329K0689K0057J7665R595p470l1882
50618C155001n6631p4420q2575q2568p6450o5589n1917l8004k5334j3797l220
$$ y = [2042926, 2049738, 2061269, 2076819, 2095458, 2115678, 2135043, 2150533, 2159423, 2159805, 2150593, 2131698, 2104449, 2071277, 2034575, 1995991, 1956936, 1919312, 1885250, 1856272, 1833098, 1816136, 1805697, 1801716, 1803817, 1811984, 1827007, 1850071, 1882122, 1923813, 1975755, 2038285, 2110843, 2191791, 2278798, 2369129, 2459574, 2546638, 2627284, 2699531, 2762380, 2815568, 2859652, 2895981, 2926046, 2950902, 2971398, 2988636, 3003492, 3015570, 3023142, 3024397, 3018610, 3006158, 2988014, 2965542, 2940475, 2914566, 2889249, 2865831, 2845911, 2831338, 2823600, 2823256, 2829984, 2843103, 2861982, 2885921, 2913766, 2943885, 2974609, 3004589, 3032844, 3058841, 3082701, 3105018, 3126347, 3147036, 3167093, 3184758, 3194353, 3186883, 3155001, 3098370, 3023950, 2941375, 2858807, 2782357, 2716768, 2664851, 2626847, 2601513, 2587716, 2584496]
50607B584496N684J2163J6015J6981J4467Q447j37j0321k1773l4107m6324n7458
50595B488133o7250p5523q1437q4056q3511q1055p7950p4623p0850o6409o1470
50584A663999n6385n1235m5734l9739l3672k8191k3528j9389j5388j1298p080
50573A332360k986N53L586O922J1152J5511J8376J9014J8339J7810J7980J8282
50561A476899J7922J6891J6294J7529K0969K5635L0571L6064M2946N1034N9088
50550A811842O6207P2330P7360Q0570Q1107P8572P3053O5307N6932M9691M4497
50539B557468M1485M0853M2751M6400N0399N4136N7976O1849O4796O6502O8280
50528C152895P1759P7269Q4114R1839J00313J08997J16954J23499J28388J31473
$$ y = [2584496, 2590180, 2602343, 2618358, 2635339, 2649806, 2658253, 2658116, 2647795, 2626022, 2591915, 2545591, 2488133, 2420883, 2345360, 2263923, 2179867, 2096356, 2015301, 1937351, 1862728, 1791878, 1725469, 1663999, 1607614, 1556379, 1510645, 1470906, 1437234, 1409043, 1385515, 1366126, 1350738, 1339440, 1332360, 1329374, 1329927, 1333513, 1340435, 1351587, 1367098, 1385474, 1404488, 1422827, 1440637, 1458617, 1476899, 1494821, 1511712, 1528006, 1545535, 1566504, 1592139, 1622710, 1658774, 1701720, 1752754, 1811842, 1878049, 1950379, 2027739, 2108309, 2189416, 2267988, 2341041, 2406348, 2463280, 2512971, 2557468, 2598953, 2639806, 2682557, 2728957, 2779356, 2833492, 2891468, 2953317, 3018113, 3084615, 3152895, 3224654, 3301923, 3386037, 3477876, 3578189, 3687186, 3804140, 3927639, 4056027, 4187500]
50518D187500J32563J31308J26936J18402J05246Q8144O8292M6438K2705k861
50508E024673k9704n6466q1274j02695j20496j34992j45667j51119j50470j44122
50498C907668j32904j17291r7914p6038n2938k9286n675J6721L6485N2410O3096
50487C564334O6747O2044M9074K9011L424k5660n5635q3949j08616j27962j40733
50476C232079j47139j49062j48247j44783j38184j29314j20038j11273j02640
50467B041399r3942q5742p8370p1489o5046n9623n5319n1113m6030m0372l5150
50456A359203l0655k6289k1675j7344j4135j2166j0658q794o587m724l600k821
50444A199755j826o13N22J653L148N013O762P930Q406Q349Q158Q445R630J1522
$$ y = [4187500, 4320063, 4451371, 4578307, 4696709, 4801955, 4890099, 4958391, 5004829, 5027534, 5024673, 4994969, 4938503, 4857229, 4754534, 4634038, 4499046, 4353379, 4202260, 4051790, 3907668, 3774764, 3657473, 3559559, 3483521, 3430583, 3401297, 3395622, 3412343, 3448828, 3501238, 3564334, 3631081, 3693125, 3742199, 3771210, 3774634, 3748974, 3693339, 3609390, 3500774, 3372812, 3232079, 3084940, 2935878, 2787631, 2642848, 2504664, 2375350, 2255312, 2144039, 2041399, 1947457, 1861715, 1783345, 1711856, 1646810, 1587187, 1531868, 1480755, 1434725, 1394353, 1359203, 1328548, 1302259, 1280584, 1263240, 1249105, 1236939, 1226281, 1217487, 1210900, 1206176, 1202576, 1199755, 1197929, 1197316, 1197838, 1199491, 1202639, 1207652, 1214414, 1222344, 1230750, 1239099, 1247257, 1255702, 1265332, 1276854]
50430A276854J3597J5697J8042K0649K3153K5308K7195K8827K9967L0573L1085
50419A540947L2045L3621L5682L8115M0879M3958M7525N1917N7217O2986O8637
50408B053529P3913P8695Q2523Q4751Q5310Q4860Q3883Q2016P8619P3792O8224
50397B930115O2051N4410M4305L1434J5927k140k2335m3236o2822p9467r2303
50386B835939j00906j05157j05397j02133r5691q6497p5483o3631n1194l8070
50376B011780k4840j2655k044P365J5577K1475K3699K1772J6000O917m754j7977
50364B062315l1653m4660n5592o3179o7321o9106o9341o7777o4211n9604n5337
50353A414534n1868m8831m6020m3523m1161l8532l5479l1997k8032k3952k0692
$$ y = [1276854, 1290451, 1306148, 1324190, 1344839, 1367992, 1393300, 1420495, 1449322, 1479289, 1509862, 1540947, 1572992, 1606613, 1642295, 1680410, 1721289, 1765247, 1812772, 1864689, 1921906, 1984892, 2053529, 2127442, 2206137, 2288660, 2373411, 2458721, 2543581, 2627464, 2709480, 2788099, 2861891, 2930115, 2992166, 3046576, 3090881, 3122315, 3138242, 3136102, 3113767, 3070531, 3007709, 2928242, 2835939, 2735033, 2629876, 2524479, 2422346, 2326655, 2240158, 2164675, 2101044, 2049850, 2011780, 1986940, 1974285, 1972241, 1979606, 1995183, 2016658, 2040357, 2062129, 2078129, 2085046, 2080292, 2062315, 2030662, 1986002, 1930410, 1867231, 1799910, 1730804, 1661463, 1593686, 1529475, 1469871, 1414534, 1362666, 1313835, 1267815, 1224292, 1183131, 1144599, 1109120, 1077123, 1049091, 1025139, 1004447]
50342A004447j8707j7057j4520j1354r004q078p669o844n869n484n750o182o582
50329H81347p051p363o939n530l665k181j419j018m99J74Q18J544K603L822M740
50314H59383N394O336P658Q689R064R389J0319J1548J2409J2905J3336J3368J2477
50301I92275J1079J0171R831R057P294N296M068L717L720L826M097M332L931K407
50287A075101o0k523l865l646k325m99J962N713J0878J6353K0107K0313J6750
50274A154259J1299O548L421O08l288p770j1242j3122j4020j4296j3725j2638
50262A086034j2019j2101j1872j0538q622p061n917m676l308k334k048k222k468
50249A000848k610k695k848k955k546j288M05J678K212K464K823L132L219L292
$$ y = [1004447, 985740, 968683, 954163, 942809, 933805, 925727, 918058, 911214, 905345, 899861, 894111, 887929, 881347, 874296, 866933, 859994, 854464, 850799, 848618, 847199, 846181, 845682, 845856, 846674, 848218, 850821, 854643, 859383, 864777, 871113, 878771, 887460, 896524, 905913, 916232, 927780, 940189, 953094, 966430, 979798, 992275, 1003354, 1013525, 1023356, 1032413, 1039707, 1045003, 1049071, 1052788, 1056508, 1060334, 1064431, 1068763, 1072694, 1075101, 1075041, 1072518, 1068653, 1065007, 1062682, 1062183, 1064145, 1069858, 1080736, 1097089, 1117196, 1137509, 1154259, 1165558, 1172106, 1175527, 1176135, 1172847, 1165077, 1153835, 1140713, 1126693, 1112397, 1098672, 1086034, 1074015, 1061914, 1050042, 1039504, 1030882, 1023821, 1017904, 1013228, 1009920, 1007586, 1005538, 1003316, 1000848, 998238, 995543, 992695, 989740, 987194, 985906, 986311, 987989, 990201, 992665, 995488, 998620, 1001839, 1005131]
50235A005131L507L645L592L662L947L791K512M71j171j726j604j670k250k909
50221A018928l049k645k458l314n132o821p237o195m434k812j707r82k32R04K542
50206I75356M490O382P914R134J0578J2898J6136J9614K2885K6537L1649L8524
50194A182097M6529N5110O4295P4067Q3906R3172J01298J07209J09221J06293
50184B023197R9102Q9359P8399O7119N7056N0352M8202M9751N2821N5244N5128
50173B725730N0454L9392K1406k330k9627n8040q4875j07284j23189j32122j34771
50162B164744j31821j23832j12145r8970q6026p3563o1182m9157l8319k9092k1466
50151A339171j5901j3411j4445j8122k2762k6851k9479l0372k9895k8765k7482
$$ y = [1005131, 1008638, 1012283, 1015875, 1019537, 1023484, 1027275, 1029787, 1030258, 1029087, 1027361, 1025757, 1024087, 1021837, 1018928, 1015879, 1013234, 1010776, 1007462, 1002330, 995509, 988272, 982077, 977643, 974831, 973124, 972142, 971910, 972814, 975356, 979846, 986228, 994142, 1003276, 1013854, 1026752, 1042888, 1062502, 1085387, 1111924, 1143573, 1182097, 1228626, 1283736, 1348031, 1422098, 1506004, 1599176, 1700474, 1807683, 1916904, 2023197, 2122299, 2211658, 2290057, 2357176, 2414232, 2464584, 2512786, 2562537, 2615358, 2670602, 2725730, 2776184, 2815576, 2836982, 2834652, 2805025, 2746985, 2662110, 2554826, 2431637, 2299515, 2164744, 2032923, 1909091, 1796946, 1697976, 1611950, 1538387, 1477205, 1428048, 1389729, 1360637, 1339171, 1323270, 1309859, 1295414, 1277292, 1254530, 1227679, 1198200, 1167828, 1137933, 1109168, 1081686]
50140A081686k6079k4465k2714k0912j8952j6627j3818j0495o784l117j24J790
50128I19389K685K857K488J599K91j039j754j425l34O44R29Q70J256K347L713
50113I34516M929N970O898P570P884Q077Q565R518J0662J1451J1515J1052J0734
50100A049341J1039J1848J2769J3645J4452J4986J5126J5334J6327J8213K0375
50089A213455K2329K4300K6741K9698L2884L6201M0005M4855N1095N8569O6799
50078A646931P5649Q5725R7849J12184J28129J44908J61721J77143J88821J94274
50068C013334J92161J82954J68771J52710J37959J26992J21092J20230J23035
50059D339238J26889J28343J23843J10467Q6650N2778J1274l4086p9182j20340
$$ y = [1081686, 1055607, 1031142, 1008428, 987516, 968564, 951937, 938119, 927624, 920840, 917723, 917599, 919389, 922074, 924931, 927419, 929018, 929309, 928270, 926516, 925091, 924757, 925401, 926330, 927200, 928456, 930803, 934516, 939445, 945415, 952313, 959883, 967767, 975844, 984409, 993927, 1004589, 1016040, 1027555, 1038607, 1049341, 1060380, 1072228, 1084997, 1098642, 1113094, 1128080, 1143206, 1158540, 1174867, 1193080, 1213455, 1235784, 1260084, 1286825, 1316523, 1349407, 1385608, 1425613, 1470468, 1521563, 1580132, 1646931, 1722580, 1808305, 1906154, 2018338, 2146467, 2291375, 2453096, 2630239, 2819060, 3013334, 3205495, 3388449, 3557220, 3709930, 3847889, 3974881, 4095973, 4216203, 4339238, 4466127, 4594470, 4718313, 4828780, 4915430, 4968208, 4979482, 4945396, 4866214, 4745874]
50049D745874j54826j81259j99659k11002k16548k17379k14046k06532j94902
50040B949721j80253j64569j49291j34379j19188j03854q9227p5786o3406n2219
50030A817549m3028l6606l2868l0805k9114k6984k4581k2696k1711k1220k0705
50019A507231k0223k0022k0064k0373k1337k3014k4616k5418k5805k6516k7264
50008A252579k7070k5730k3993k2374k0819j9491j8738j8076j6242j2663q058
49997A039325l363J090N041P873R202R268Q362O545M192K144Q82J45l64p12j337
49982A088293l070n884q405r351q921q095p195n845m015k208o68R99L248N989
49968A034872Q618J0530J1731J2875J4610J6972J9739K3174K7818L3684M0277
$$ y = [4745874, 4591048, 4409789, 4210130, 3999128, 3782580, 3565201, 3351155, 3144623, 2949721, 2769468, 2604899, 2455608, 2321229, 2202041, 2098187, 2008960, 1933174, 1869768, 1817549, 1774521, 1737915, 1705047, 1674242, 1645128, 1618144, 1593563, 1570867, 1549156, 1527936, 1507231, 1487008, 1466986, 1446922, 1426549, 1405212, 1382198, 1357582, 1332164, 1306359, 1279843, 1252579, 1225509, 1199779, 1175786, 1153412, 1132593, 1113102, 1094364, 1076288, 1060046, 1047383, 1039325, 1035962, 1037052, 1042093, 1049966, 1059168, 1068436, 1076798, 1083343, 1087535, 1089679, 1090561, 1090706, 1090342, 1089630, 1088293, 1085223, 1079339, 1070934, 1061583, 1052662, 1044567, 1037372, 1031527, 1027512, 1025304, 1024636, 1025635, 1028883, 1034872, 1043490, 1054020, 1065751, 1078626, 1093236, 1110208, 1129947, 1153121, 1180939, 1214623, 1254900]
49957A254900M7559N6188O6599P8507R1398J04760J17610J28407J35824J39035
49947B220787J37167J29404J16125R9446Q2322O7511N7387N3422N4972N9044O1805
49936C139392N9970N0838L2281M002l1501o9912j06870j38766j62839j77683j83539
49925B415373j81668j73520j60707j45108j28426j11928r6735q3706p2646o2437
49915A198492n2566m3907l7398l2676k8688k5004k1714j8538j5035j1365q105
49904I03496n426l018o28J874M606P466J0053J2167J3765J4185J2256P922K978
49891I81696o57k851m644o471q068r580j1558j3989j6330j8338k0010k0962k0873
49878H27365k0328k0227k0380j9708j7829j5543j3623j1976j0195q250o439n187
$$ y = [1254900, 1302459, 1358647, 1425246, 1503753, 1595151, 1699911, 1817521, 1945928, 2081752, 2220787, 2357954, 2487358, 2603483, 2702929, 2785251, 2852762, 2910149, 2963571, 3018543, 3077587, 3139392, 3199362, 3250200, 3282481, 3286483, 3254982, 3185070, 3078200, 2939434, 2776595, 2598912, 2415373, 2233705, 2060185, 1899478, 1754370, 1625944, 1514016, 1417281, 1333575, 1260929, 1198492, 1145926, 1102019, 1064621, 1031945, 1003257, 978253, 956539, 938001, 922966, 911601, 903496, 898070, 895052, 894424, 896298, 900904, 908370, 918423, 930590, 944355, 958540, 970796, 978718, 981696, 981039, 978188, 973544, 967073, 959005, 949425, 937867, 923878, 907548, 889210, 869200, 848238, 827365, 807037, 786810, 766430, 746722, 728893, 713350, 699727, 687751, 677556, 669306, 662867, 657680]
$$ [...]
##END NTUPLES=NMR SPECTRUM
##END=
