##TITLE=AC1398_2151uv_7519910_E9KT24DFFK
##JCAMPDX= 6.0         $$ Bruker NMR JCAMP-DX V2.0
##DATA TYPE= NMR SPECTRUM
##DATA CLASS= NTUPLES
##ORIGIN= BRUKER
##OWNER= Administrator
$$ 1.72 TOPSPIN		Version 2.1
$$ 2013-04-16 23:12:22.069 -0700  Administrator@X
$$ Compression mode = diff/dup
##.OBSERVE FREQUENCY= 400.02188249412
##.OBSERVE NUCLEUS= ^1H
##.ACQUISITION MODE= SIMULTANEOUS (DQD)
##.ACQUISITION SCHEME= undefined
##.AVERAGES= 64
##.DIGITISER RES= 22
##SPECTROMETER/DATA SYSTEM= spect
##.PULSE SEQUENCE= noesygpps1d.comp
##.SOLVENT NAME= COFFEE_meoh
##.SHIFT REFERENCE= INTERNAL, COFFEE_meoh, 1, 14.9613
##AUDIT TRAIL= $$ (NUMBER, WHEN, WHO, WHERE, PROCESS, VERSION, WHAT)
$$ ##TITLE= Audit trail, TOPSPIN		Version 2.1
$$ ##JCAMPDX= 5.01
$$ ##ORIGIN= Bruker BioSpin GmbH
$$ ##OWNER= Administrator
$$ $$ E:\/data/COFFEE/nmr/AC1398_2151uv_7519910_E9KT24DFFK/22/pdata/1/auditp.txt
$$ ##AUDIT TRAIL=  $$ (NUMBER, WHEN, WHO, WHERE, PROCESS, VERSION, WHAT)
(   1,<2013-04-16 23:12:17.116 -0700>,<Administrator>,<X>,<go>,<TOPSPIN 2.1>,
      <created by zg
	started at 2013-04-16 23:00:47.630 -0700,
	POWCHK enabled, PULCHK disabled,
       configuration hash MD5:
       33 CF 6A 21 5C D3 B9 40 6C 15 AA 8D 27 A2 4F 13
       data hash MD5: 64K
       E9 96 30 61 6D 25 AB B4 B7 57 BF E6 C3 FF 65 E9>)
(   2,<2013-04-16 23:12:20.054 -0700>,<Administrator>,<X>,<proc1d>,<TOPSPIN 2.1>,
      <Start of raw data processing
       efp LB = 0.3 FT_mod = 6 PKNL = 1 PHC0 = 0 PHC1 = 0 SI = 128K 
       data hash MD5: 128K
       47 3F F4 38 11 DC 04 A6 46 D5 35 90 FC 94 18 A3>)
(   3,<2013-04-16 23:12:21.007 -0700>,<Administrator>,<X>,<proc1d>,<TOPSPIN 2.1>,
      <pk PHC0 = -77.63489 PHC1 = 0 
       data hash MD5: 128K
       3C 24 F8 0B 93 1D 7D 90 D4 C1 5E 58 15 82 56 F8>)
(   4,<2013-04-16 23:12:21.413 -0700>,<Administrator>,<X>,<proc1d>,<TOPSPIN 2.1>,
      <abs ABSG = 1 
       data hash MD5: 128K
       E7 6D 38 57 D8 20 EF 8E F6 C5 30 86 5F 2B 08 89>)
(   5,<2013-04-16 23:12:21.554 -0700>,<Administrator>,<X>,<proc1d>,<TOPSPIN 2.1>,
      <abs ABSG = 2 
       data hash MD5: 128K
       B8 16 7B 28 12 FE 56 7D 05 A5 9B 37 89 40 0B E9>)
(   6,<2013-04-16 23:12:21.663 -0700>,<Administrator>,<X>,<proc1d>,<TOPSPIN 2.1>,
      <abs ABSG = 3 
       data hash MD5: 128K
       F1 03 09 30 AA 92 7C 28 13 33 09 E0 68 66 8D DC>)
(   7,<2013-04-16 23:12:21.757 -0700>,<Administrator>,<X>,<proc1d>,<TOPSPIN 2.1>,
      <abs ABSG = 4 
       data hash MD5: 128K
       3D B3 0E C1 3A 5A 1D B2 5F EA B0 25 F6 64 79 58>)
(   8,<2013-04-16 23:12:21.835 -0700>,<Administrator>,<X>,<proc1d>,<TOPSPIN 2.1>,
      <abs ABSG = 5 
       data hash MD5: 128K
       6E 8A 71 3F F9 1C 4F 44 2E 38 99 46 DD 2B B3 21>)
$$ ##END=
$$ 
$$ $$ hash MD5
$$ $$ E5 FA 74 70 BE 4B D7 42 B8 75 6D 33 CB 1E C5 27
##$RELAX= 
##$RELAX= 
##$RELAX= 
##$RELAX= 
##$RELAX= 
##$RELAX= 
##$RELAX= 
##$RELAX= 
$$ Bruker specific parameters
$$ --------------------------
##$DU= <E:\>
##$EXPNO= 22
$$ [...]
150 150 150 150 150 150 150 150
##$TP07= 0
##$TPNAME0= <>
##$TPNAME1= <>
##$TPNAME2= <>
##$TPNAME3= <>
##$TPNAME4= <>
##$TPNAME5= <>
##$TPNAME6= <>
##$TPNAME7= <>
##$TPOAL= (0..7)
0.5 0.5 0.5 0.5 0.5 0.5 0.5 0.5
##$TPOFFS= (0..7)
0 0 0 0 0 0 0 0
##$TUNHIN= 0
##$TUNHOUT= 0
##$TUNXOUT= 0
##$USERA1= <user>
##$USERA2= <user>
##$USERA3= <user>
##$USERA4= <user>
##$USERA5= <user>
##$V9= 5
##$VALIST= <valist>
##$VCLIST= <CCCCCCCCCCCCCCC>
##$VD= 0
##$VDLIST= <DDDDDDDDDDDDDDD>
##$VPLIST= <PPPPPPPPPPPPPPP>
##$VTLIST= <TTTTTTTTTTTTTTT>
##$WBST= 2048
##$WBSW= 25
##$XGAIN= (0..3)
0 0 0 0
##$XL= 0
##$YL= 0
##$YMAX_a= 7008179
##$YMIN_a= -14808680
##$ZGOPTNS= <>
##$ZL1= 120
##$ZL2= 120
##$ZL3= 120
##$ZL4= 120
##$ABSF1= 14.9613
##$ABSF2= -5.596882
##$ABSG= 5
##$ABSL= 3
##$ALPHA= 0
##$AQORDER= 0
##$ASSFAC= 0
##$ASSFACI= 0
##$ASSFACX= 0
##$ASSWID= 0
##$AUNMP= <proc_prof1d_extract.lims>
##$AXLEFT= 0
##$AXNAME= <>
##$AXNUC= <1H>
##$AXRIGHT= 0
##$AXTYPE= 0
##$AXUNIT= <>
##$AZFE= 0.1
##$AZFW= 0.1
##$BCFW= 0
##$BC_mod= 0
##$BYTORDP= 0
##$COROFFS= 0
##$CY= 15
##$DATMOD= 1
##$DC= 0
##$DFILT= <>
##$DTYPP= 0
##$F1P= 0
##$F2P= 0
##$FCOR= 0.5
##$FTSIZE= 131072
##$FT_mod= 6
##$GAMMA= 0
##$GB= 0
##$INTBC= 1
##$INTSCL= 1
##$ISEN= 128
##$LB= 0.3
##$LEV0= 0
##$LPBIN= 0
##$MAXI= 10000
##$MC2= 0
##$MEAN= 0
##$ME_mod= 0
##$MI= 0
##$NCOEF= 0
##$NC_proc= -2
##$NLEV= 6
##$NOISF1= 0
##$NOISF2= 0
##$NSP= 0
##$NTH_PI= 0
##$NZP= 0
##$OFFSET= 14.9613
##$PC= 1
##$PHC0= -77.63489
##$PHC1= 0
##$PH_mod= 1
##$PKNL= yes
##$PPARMOD= 0
##$PPDIAG= 0
##$PPIPTYP= 0
##$PPMPNUM= 2147483647
##$PPRESOL= 1
##$PSCAL= 4
##$PSIGN= 0
##$PYNMP= <proc.py>
##$REVERSE= no
##$SF= 400.020009515662
##$SI= 131072
##$SIGF1= 0
##$SIGF2= 0
##$SINO= 400
##$SIOLD= 131072
##$SPECTYP= <>
##$SREGLST= <1H.CDCl3>
##$SSB= 0
##$STSI= 131072
##$STSR= 0
##$SW_p= 8223.68421052631
##$SYMM= 0
##$S_DEV= 0
##$TDeff= 65536
##$TDoff= 0
##$TI= <>
##$TILT= no
##$TM1= 0
##$TM2= 0
##$TOPLEV= 0
##$USERP1= <user>
##$USERP2= <user>
##$USERP3= <user>
##$USERP4= <user>
##$USERP5= <user>
##$WDW= 1
##$XDIM= 131072
##$YMAX_p= 365425910
##$YMIN_p= -11820
##$CURPLOT= <Network HP LaserJet P1505>
##$CURPRIN= <$Network HP LaserJet P1505>
##$DFORMAT= <normdp>
##$LAYOUT= <+/1D_H.xwp>
##$LFORMAT= <normlp>
##$PFORMAT= <normpl>
##$SURQMSG= 1
$$ End of Bruker specific parameters
$$ ---------------------------------
##NTUPLES= NMR SPECTRUM
##VAR_NAME=  FREQUENCY,     SPECTRUM/REAL,   SPECTRUM/IMAG
##SYMBOL=    X,             R,               I
##VAR_TYPE=  INDEPENDENT,   DEPENDENT,       DEPENDENT
##VAR_FORM=  AFFN,          ASDF,            ASDF
##VAR_DIM=   131072,        131072,          131072
##UNITS=     HZ,            ARBITRARY UNITS, ARBITRARY UNITS
##FACTOR=    0.0627417313425164, 1,          1
##FIRST=     8223.62146879497, -3474,        -66424
##LAST=      0,             -1586,           -67836
##MIN=       0,             -11820,          0
##MAX=       8223.62146879497, 365425910,    0
$$ Real data points
##PAGE= N=1
##DATA TABLE= (X++(R..R)), XYDATA
$$ [...]
$$ plain form
63748 298539 297922 297714 297841 297978 298050 298554 300242 303313 307010 310161 312180 313398 314535 316122 318506 322032
63732 322032 326766 332135 337242 341671 345794 350185 355006 360077 365293 370712 376345 382140 388108 394269
63718 394269 400537 406790 412931 418585 422880 424970 424942 423846 422598 421063 418467 414500 409723 404972 400707
63703 400707 396974 393691 390762 388040 385410 382959 380972 379695 379087 378889 378930 379360 380496 382457 384944
63688 384944 387391 389275 390380 390867 391154 391599 392308 393290 394687 396607 398686 400195 400858 401390 402930 405914
63672 405914 409791 413848 418030 422839 428556 434740 440427 444789 447668 449541 450961 452078 452696 452654 451921
63657 451921 450434 448084 444886 440932 436204 430731 424932 419437 414439 409607 404792 400397 396752 393632
63643 393632 390912 389270 389415 390749 391656 391327 390605 390756 392104 394323 397374 401387 405996 410611 415304
$$ packed form
63748B98539o17k08J27J37P2N04J688L071L697L151K019J218J137J587K384L526
63732C22032M734N369N107M429M123M391M821N071N216N419N633N795N968O161
63718C94269O268O253O141N654M295K090k8j096j248j535k596l967m777m751m265
63703D00707l733l283k929k722k630k451j987j277o08j98M1M30J136J961K487
63688C84944K447J884J105M87K87M45P09R82J397J920K079J509O63N32J540K984
63672D05914L877M057M182M809N717O184N687M362K879J873J420J117O18m2p33
63657D51921j487k350l198l954m728n473n799n495m998m832m815m395l645l120
63643C93632k720j642J45J334R07l29p22J51J348K219L051M013M609M615M693
$$ plain form
63628 415304 420742 427195 434301 441955 450805 461458 473650 486633 500186 514824 531095 549018
63616 549018 568197 588232 609026 630862 654200 679280 705888 733555 761829 790238 818170
63605 818170 845059 870653 894734 916564 934865 948562 957398 961775 962253 959359 953693 945888 936465
63592 936465 925930 914874 903670 892013 879102 864399 847997 830196 811137 791178 771297
63581 771297 752529 735018 718158 701812 686920 674596 664934 657120 650512 645240 641776 640335 640803
63568 640803 642887 646079 649661 653081 656476 660634 666276 673346 681170 689317 698070 707923 718992 731368
63554 731368 745879 763788 785575 810568 838115 868607 902786 940417 980108 1020135 1058839
63543 1058839 1094527 1125840 1152268 1173526 1188334 1194654 1191633 1180886 1165513 1148313 1131179 1115451
$$ packed form
63628D15304N438O453P106P654Q850J0653J2192J2983J3553J4638J6271J7923
63616E49018J9179K0035K0794K1836K3338K5080K6608K7667K8274K8409K7932
63605H18170K6889K5594K4081K1830J8301J3697Q836M377M78k894n666p805r423
63592I36465j0535j1056j1204j1657j2911j4703j6402j7801j9059j9959j9881
63581G71297j8768j7511j6860j6346j4892j2324r662p814o608n272l464j441M68
63568F40803K084L192L582L420L395M158N642P070P824Q147Q753R853J1069J2376
63554G31368J4511J7909K1787K4993K7547L0492L4179L7631L9691M0027L8704
63543A058839L5688L1313K6428K1258J4808O320l021j0747j5373j7200j7134j5728
$$ plain form
63531 1115451 1101912 1090354 1079663 1068480 1055747 1040921 1023999 1005155 984105 960099 932926
63520 932926 903676 874007 844774 815798 786804 758019 729879 702799 677495 654980 635836
63509 635836 619698 605734 593436 582690 573302 564822 556848 549226 541916 534873 528137 521904 516350
63496 516350 511429 506971 502997 499776 497462 495785 494262 492701 491348 490586 490650 491620 493409 495726 498313
63481 498313 501394 505586 511183 517727 524475 531080 537556 543849 549732 554951 559147 561740 562283 560862
63467 560862 557894 553600 548017 541423 534349 527173 519969 512758 505610 498555 491790 485950 481744 479273
63453 479273 478072 477867 478868 481263 484915 489686 495572 502337 509580 517513 527199 539564 554529 571567
63439 571567 590772 612794 637942 665896 696178 728303 761467 794654 827169 858565 887832
$$ packed form
63531A115451j3539j1558j0691j1183j2733j4826j6922j8844k1050k4006k7173
63520I32926k9250k9669k9233k8976k8994k8785k8140k7080k5304k2515j9144
63509F35836j6138j3964j2298j0746r388q480p974p622p310p043o736o233n554
63496E16350m921m458l974l221k314j677j523j561j353p62O4R70J789K317K587
63481D98313L081M192N597O544O748O605O476O293N883N219M196K593N43j421
63467E60862k968m294n583o594p074p176p204p211p148p055o765n840m206k471
63453D79273j201k05J001K395L652M771N886O765P243P933R686J2365J4965J7038
63439E71567J9205K2022K5148K7954L0282L2125L3164L3187L2515L1396K9267
$$ plain form
63428 887832 913148 932804 946269 954279 958205 959655 960440 962497 967623 977118 991352 1009584 1030511
63415 1030511 1053266 1077668 1103271 1128505 1151307 1170498 1185952 1197335 1203402 1203089 1196976 1187057
63403 1187057 1175155 1162004 1147697 1132271 1115572 1097152 1076768 1054719 1031307 1006305 979430
63392 979430 951130 922324 893470 864453 835471 807497 781638 758439 738002 720348 705300
63381 705300 692387 681266 672144 665507 661540 660045 660726 663269 667262 672408 678788 686682 696127 706917
63367 706917 719023 732806 748737 767070 787752 810467 834742 860258 887179 916038 947121
63356 947121 979979 1013557 1046731 1078585 1108246 1134688 1156974 1174690 1187950 1196874 1201315 1201293
63344 1201293 1197432 1190530 1180832 1168228 1153229 1137040 1120352 1102548 1082652 1060733 1037799 1014501
$$ packed form
63428H87832K5316J9656J3465Q010L926J450P85K057N126R495J4234J8232K0927
63415A030511K2755K4402K5603K5234K2802J9191J5454J1383O067l13o113r919
63403A187057j1902j3151j4307j5426j6699j8420k0384k2049k3412k5002k6875
63392I79430k8300k8806k8854k9017k8982k7974k5859k3199k0437j7654j5048
63381G05300j2913j1121r122o637l967j495O81K543L993N146O380P894R445J0790
63367G06917J2106J3783J5931J8333K0682K2715K4275K5516K6921K8859L1083
63356I47121L2858L3578L3174L1854K9661K6442K2286J7716J3260Q924M441k2
63344A201293l861o902r698j2604j4999j6189j6688j7804j9896k1919k2934k3298
$$ plain form
63332 1014501 990529 965341 938962 911989 885266 859757 836500 816417 800207 788263 780356
63321 780356 775389 771837 768630 765462 762250 758534 753342 745236 732578 714424 691616 666751 642686
63308 642686 621020 601955 585089 570005 556420 544275 533682 524613 516746 509804 503820 498784
63296 498784 494224 489485 484323 478944 473594 468445 463752 459670 455937 452178 448559 445669 443605 441635
63282 441635 439081 436215 433910 432542 431559 430101 427823 425154 422961 421898 421879 422119 421816 420841 419772 419313
63266 419313 419699 420573 421312 421555 421535 421837 422763 423947 424685 424595 423914 423259 423241 424147 425820 427803 429714 431477
63248 431477 433255 435336 438119 441861 446217 450348 453908 457717 462900 469433 476142 482252 488272 495071
63234 495071 502730 510854 519564 529411 540416 551854 563102 574254 585839 598303 611796 626014
$$ packed form
63332A014501k3972k5188k6379k6973k6723k5509k3257k0083j6210j1944p907
63321G80356m967l552l207l168l212l716n192q106j2658j8154k2808k4865k4065
63308F42686k1666j9065j6866j5084j3585j2145j0593r069p867o942n984n036
63296D98784m560m739n162n379n350n149m693m082l733l759l619k890k064j970
63282D41635k554k866k305j368r83j458k278k669k193j063j9K40l03r75j069m59
63266D19313L86Q74P39K43k0L02R26J184P38r0o81o55j8R06J673J983J911J763
63248D31477J778K081K783L742M356M131L560L809N183O533O709O110O020O799
63234D95071P659Q124Q710R847J1005J1438J1248J1152J1585J2464J3493J4218
$$ plain form
63222 626014 640145 653435 666080 679188 693551 708736 723632 737660 751090 764336 777328
63211 777328 789566 800512 809864 817574 823622 827732 829411 828358 824641 818349 809330 797630 784050
63198 784050 769826 755641 741275 726353 711249 697039 684748 674829 667300 662166 659552 659449 661438
63185 661438 664857 669394 675429 683581 693842 705327 717011 728604 740616 753657 767842 782817
63173 782817 798123 813402 828403 843015 857277 871185 884390 896263 906393 914960 922433 928893
63161 928893 933707 935867 934523 929304 920394 908338 893623 876404 856830 835627 814007 792837
63149 792837 772073 751217 730092 709005 688441 669006 651569 636963 625357 616061 608021 600467
63137 600467 593182 586461 580797 576435 573116 570359 567961 566101 565016 564801 565413 566650 568167 569787 571782
$$ packed form
63222F26014J4131J3290J2645J3108J4363J5185J4896J4028J3430J3246J2992
63211G77328J2238J0946R352P710O048M110J679j053l717o292r019j1700j3580
63198G84050j4224j4185j4366j4922j5104j4210j2291r919p529n134k614j03J989
63185F61438L419M537O035Q152J0261J1485J1684J1593J2012J3041J4185J4975
63173G82817J5306J5279J5001J4612J4262J3908J3205J1873J0130Q567P473O460
63161I28893M814K160j344n219q910j2056j4715j7219j9574k1203k1620k1170
63149G92837k0764k0856k1125k1087k0564j9435j7437j4606j1606r296q040p554
63137F00467p285o721n664m362l319k757k398j860j085k15O12J237J517J620J995
$$ plain form
63122 571782 574533 577906 581298 584352 587291 590458 593876 597373 600737 603570 605463 606680 608251 610846
63108 610846 613884 616319 618120 620196 622863 625217 626429 627003 628077 629805 631194 631581 631654 632689 635156
63093 635156 638449 641770 644918 648179 651776 655611 659429 663100 666710 670406 674144 677618 680513 682824
63079 682824 684831 686715 688296 689158 688964 687681 685689 683761 682725 682965 684201 685787 687137 687934 688309
63064 688309 689053 691372 696032 702834 711196 721062 732819 746417 761207 776813 793697 812555 833474
63051 833474 855996 879766 904838 931536 960180 990737 1022517 1054464 1086036 1117576 1149619
63040 1149619 1182101 1214582 1246937 1279305 1311509 1343078 1373851 1404088 1433861 1462729 1490096
63029 1490096 1515583 1538859 1559361 1576261 1588563 1595348 1596267 1591734 1582239 1567504 1546842 1520396
$$ packed form
63122E71782K751L373L392L054K939L167L418L497L364K833J893J217J571K595
63108F10846L038K435J801K076K667K354J212N74J074J728J389L87P3J035K467
63093F35156L293L321L148L261L597L835L818L671L610L696L738L474K895K311
63079F82824K007J884J581Q62j94j283j992j928j036K40J236J586J350P97L75
63064F88309P44K319M660O802Q362R866J1757J3598J4790J5606J6884J8858K0919
63051H33474K2522K3770K5072K6698K8644L0557L1780L1947L1572L1540L2043
63040A149619L2482L2481L2355L2368L2204L1569L0773L0237K9773K8868K7367
63029A490096K5487K3276K0502J6900J2302O785R19m533r495j4735k0662k6446
$$ plain form
63017 1520396 1489470 1455429 1418903 1380410 1341167 1302643 1265706 1230803 1198761 1170723 1147327
63006 1147327 1128514 1114141 1104292 1098894 1097482 1099533 1104788 1113207 1124876 1139869 1157854 1177942
62994 1177942 1199395 1222443 1247800 1275315 1303682 1331693 1359087 1385873 1411595 1435919 1459368
62983 1459368 1482578 1504973 1524951 1541338 1553924 1562499 1566120 1563691 1554786 1539640 1518708 1492577
62971 1492577 1461959 1427404 1389201 1347823 1304303 1259928 1215691 1172233 1130100 1089814 1051750
62960 1051750 1016120 982938 951876 922388 894242 867755 843282 820635 799323 779164 760257
62949 760257 742480 725534 709489 694796 681530 669052 656763 644892 634120 624569 615579 606535
62937 606535 597594 589446 582554 576767 571542 566397 561218 556310 552137 548861 546090 543269 540340 537804
$$ packed form
63017A520396l0926l4041l6526l8493l9243l8524l6937l4903l2042k8038k3396
63006A147327j8813j4373r849n398j412K051N255Q419J1669J4993J7985K0088
62994A177942K1453K3048K5357K7515K8367K8011K7394K6786K5722K4324K3449
62983A459368K3210K2395J9978J6387J2586Q575L621k429q905j5146k0932k6131
62971A492577l0618l4555l8203m1378m3520m4375m4237m3458m2133m0286l8064
62960A051750l5630l3182l1062k9488k8146k6487k4473k2647k1312k0159j8907
62949G60257j7777j6946j6045j4693j3266j2478j2289j1871j0772r551q990r044
62937F06535q941q148o892n787n225n145n179m908m173l276k771k821k929k536
$$ plain form
62923 537804 535926 534117 531471 527883 524200 521192 518823 516784 515264 514644 514691 514651 514155 513480 512804 511759
62907 511759 510054 508192 507163 507574 509302 511806 514475 516839 518808 520772 523206 526142 529089 531485
62893 531485 533098 534108 534999 536376 538624 541632 544908 548058 551060 554053 556979 559547 561517 562933
62879 562933 563985 564747 565182 565362 565475 565411 564580 562412 559050 555209 551310 547073 542109 536591 531133 526262
62863 526262 522273 519310 517183 515242 512871 510164 507830 506438 506004 506267 506930 507625 508068 508462 509316 510655
62847 510655 511772 512076 511811 511472 510877 509551 507989 507631 509146 511334 512366 511829 510878 510526 510537 510259 509775
62830 509775 509711 510292 511221 512322 513690 515243 516657 517905 519359 521185 523079 524820 526694 529032 531691
62815 531691 534338 536947 539602 542100 544258 546406 549031 551988 554644 556778 558813 561120 563704 566735
$$ packed form
62923E37804j878j809k646l588l683l008k369k039j520o20M7m0m96o75o76j045
62907E11759j705j862j029M11J728K504K669K364J969J964K434K936K947K396
62893E31485J613J010Q91J377K248L008L276L150L002K993K926K568J970J416
62879E62933J052P62M35J80J13o4q31k168l362l841l899m237m964n518n458m871
62863E26262l989k963k127j941k371k707k334j392m34K63O63O95M43L94Q54J339
62847E10655J117L04k65l39n95j326j562l58J515K188J032n37r51l52J1k78m84
62830E09775o4N81R29J101J368J553J414J248J454J826J894J741J874K338K659
62815E31691K647K609K655K498K158K148K625K957K656K134K035K307K584L031
$$ plain form
62801 566735 570681 575475 580133 583832 587094 591298 597070 603741 610439 617272 625135 634614 645382 656703
62787 656703 668472 681580 697151 715497 736115 758752 783978 812364 843510 876492 911152
62776 911152 948258 988272 1030533 1073961 1118079 1162900 1208147 1253061 1296813 1338542 1376937
62765 1376937 1410309 1437385 1457851 1471839 1479042 1478547 1469574 1452247 1427642 1397133 1361691 1321713
62753 1321713 1277515 1229980 1180680 1131304 1082946 1035959 990488 947025 906412 869331 835843
62742 835843 805451 777576 751939 728488 707110 687680 670409 655838 644145 634546 625706 616843
62730 616843 608190 600367 593663 588138 583992 581380 580029 579450 579502 580347 581890 583768 585963 588970 593098
62715 593098 598016 603293 609071 615848 623839 632952 643238 654914 668044 682561 698591 716433 736282
$$ packed form
62801E66735L946M794M658L699L262M204N772O671O698O833P863R479J0768J1321
62787F56703J1769J3108J5571J8346K0618K2637K5226K8386L1146L2982L4660
62776I11152L7106M0014M2261M3428M4118M4821M5247M4914M3752M1729L8395
62765A376937L3372K7076K0466J3988P203m95q973j7327k4605l0509l5442l9978
62753A321713m4198m7535m9300m9376m8358m6987m5471m3463m0613l7081l3488
62742H35843l0392k7875k5637k3451k1378j9430j7271j4571j1693r599q840q863
62730F16843q653p823o704n525m146k612j351n79N2Q45J543J878K195L007M128
62715E93098M918N277N778O777P991R113J0286J1676J3130J4517J6030J7842J9849
$$ plain form
62702 736282 758306 782953 810716 841492 874594 909575 946712 986482 1028886 1073592 1120389
62691 1120389 1169115 1219203 1269680 1319574 1368018 1413865 1455468 1491071 1519424 1539970 1552418
62680 1552418 1556232 1550711 1535679 1511944 1480806 1443147 1399428 1350714 1299220 1247358 1196361 1146129
62668 1146129 1096334 1047333 1000106 955712 914795 877269 842415 809718 779688 753447 731284
62657 731284 712002 694022 676796 660815 646573 634071 623168 613692 605058 596358 587220 578293
62645 578293 570588 564503 559699 555696 552235 549229 546694 544694 543134 541716 540364 539514 539532 539904 539540
62630 539540 538018 536015 534283 532727 530911 528992 527491 526371 525052 523373 521913 521185 521063 521191 521512
62615 521512 522073 522773 523654 525072 527131 529221 530641 531506 532558 534136 535898 537618 539764 543050 547751
$$ packed form
62702G36282K2024K4647K7763L0776L3102L4981L7137L9770M2404M4706M6797
62691A120389M8726N0088N0477M9894M8444M5847M1603L5603K8353K0546J2448
62680A552418L814n521j5032k3735l1138l7659m3719m8714n1494n1862n0997n0232
62668A146129m9795m9001m7227m4394m0917l7526l4854l2697l0030k6241k2163
62657G31284j9282j7980j7226j5981j4242j2502j0903r476q634q700r138q927
62645E78293p705o085m804m003l461l006k535k000j560j418j352q50J8L72l64
62630E39540j522k003j732j556j816j919j501j120j319j679j460p28j22J28L21
62615E21512N61P00Q81J418K059K090J420Q65J052J578J762J720K146L286M701
$$ plain form
62600 547751 553721 560857 569290 579211 590700 603613 617570 632235 647729 664651 683561 704508
62588 704508 727039 750443 773862 796433 817609 837227 854999 870040 881214 888035 891018 891038
62576 891038 888428 882785 873535 860603 844547 826148 805959 784306 761663 738827 716571 695214
62564 695214 674736 655271 637293 621223 607071 594538 583339 573225 563824 554815 546374 539195
62552 539195 533788 529866 526620 523587 520951 518943 517251 515299 512961 510743 509264 508763 509114 510043 511256
62537 511256 512452 513351 513710 513460 512948 512913 513910 515760 517837 519949 522622 526421 531368 537224 543998 551841
62521 551841 560683 570394 581190 593448 607165 622022 638059 655934 676317 699285 724465 751494
62509 751494 780112 810013 840946 872905 905827 938983 970897 1000152 1026289 1049839 1071479
$$ packed form
62600E47751N970P136Q433R921J1489J2913J3957J4665J5494J6922J8910K0947
62588G04508K2531K3404K3419K2571K1176J9618J7772J5041J1174O821K983K0
62576H91038k610n643r250j2932j6056j8399k0189k1653k2643k2836k2256k1357
62564F95214k0478j9465j7978j6070j4152j2533j1199j0114r401r009q441p179
62552E39195n407l922l246l033k636k008j692j952k338k218j479n01L51R29J213
62537E11256J196Q99L59k50n12l5R97J850K077K112K673L799M947N856O774P843
62521E51841Q842R711J0796J2258J3717J4857J6037J7875K0383K2968K5180K7029
62509G51494K8618K9901L0933L1959L2922L3156L1914K9255K6137K3550K1640
$$ plain form
62498 1071479 1091215 1108363 1122188 1132535 1139952 1145307 1149266 1152086 1153996 1155756 1158602 1163476 1170441
62485 1170441 1178999 1188709 1199096 1209190 1217867 1224763 1230234 1233944 1234003 1228071 1215221 1196364 1173113
62472 1173113 1146699 1117669 1085881 1050673 1011648 969637 926537 884096 843184 804261 767930
62461 767930 734592 703982 675681 649962 627685 609274 594162 581350 570293 561057 553748 548038
62449 548038 543322 539215 535731 532967 530816 529143 528084 527908 528608 529849 531290 532696 533793 534333 534455
62434 534455 534661 535250 535934 536201 535872 535111 533990 532266 529624 526115 522397 519431 517750 516936 516001 514282
62418 514282 511812 508933 505907 502974 500406 498305 496584 495303 494666 494570 494504 494107 493531 493035 492639 492428 492762
62401 492762 493779 495162 496922 499917 504851 510987 516727 521430 525876 530911 536523 542525 549310 557292
$$ packed form
62498A071479J9736J7148J3825J0347P417N355L959K820J910J760K846M874O965
62485A170441Q558R710J0387J0094Q677O896N471L710N9n932j2850j8857k3251
62472A173113k6414k9030l1788l5208l9025m2011m3100m2441m0912l8923l6331
62461G67930l3338l0610k8301k5719k2277j8411j5112j2812j1057r236p309n710
62449E48038m716m107l484k764k151j673j059j76P00J241J441J406J097N40J22
62434E34455K06N89O84K67l29p61j121j724k642l509l718k966j681q14r35j719
62418E14282k470k879l026k933k568k101j721j281o37r6o6l97n76m96l96k11L34
62401D92762J017J383J760K995M934O136N740M703M446N035N612O002O785P982
$$ plain form
62387 557292 566188 575450 585073 595404 606362 617427 628274 638962 649485 659607 669206 678476
62375 678476 687708 697100 706818 716997 727618 738569 749900 761910 774990 789561 806160 825365
62363 825365 847565 872911 901536 933686 969581 1009362 1053232 1101353 1153327 1207890 1263411
62352 1263411 1318742 1373338 1426521 1476881 1522582 1562074 1594358 1618797 1635091 1643455 1644533 1638980
62340 1638980 1627269 1609909 1587575 1560871 1530215 1496152 1459548 1421212 1381484 1340427 1298352
62329 1298352 1255919 1213828 1172658 1132835 1094481 1057365 1021363 986871 954427 923990 895026
62318 895026 867323 841229 816970 794272 772915 753199 735415 719207 703995 689896 677779
62307 677779 668394 661748 657244 654005 651121 648076 645178 643347 643243 644652 646820 649222 651940 655395
$$ packed form
62387E57292Q896R262R623J0331J0958J1065J0847J0688J0523J0122R599R270
62375F78476R232R392R718J0179J0621J0951J1331J2010J3080J4571J6599J9205
62363H25365K2200K5346K8625L2150L5895L9781M3870M8121N1974N4563N5521
62352A263411N5331N4596N3183N0360M5701L9492L2284K4439J6294Q364J078n553
62340A638980j1711j7360k2334k6704l0656l4063l6604l8336l9728m1057m2075
62329A298352m2433m2091m1170l9823l8354l7116l6002l4492l2444l0437k8964
62318H95026k7703k6094k4259k2698k1357j9716j7784j6208j5212j4099j2117
62307F77779r385o646m504l239k884l045k898j831j04J409K168K402K718L455
$$ plain form
62293 655395 659816 664868 669745 673710 676630 678957 681147 683204 684798 685740 686249 686776 687600 688542 689076 688825
62277 688825 687977 687186 687054 687769 689254 691576 695121 700455 708061 718209 730978 746271 763865 783586
62263 783586 805598 830498 858969 891317 927524 967746 1012360 1061298 1113603 1168054 1224012
62252 1224012 1281102 1338082 1392666 1442739 1487269 1525628 1556534 1578343 1590294 1592905 1587086 1573362
62240 1573362 1552038 1523656 1489024 1449030 1404617 1356721 1306183 1253962 1201505 1150437 1101658
62229 1101658 1055098 1010655 969040 931323 897898 868304 841851 817999 796378 776960 760081
62218 760081 745740 732957 720468 708107 696865 687395 679120 671160 663561 657095 652217 648689 645957
62205 645957 643510 641040 638663 636843 635863 635631 636242 638270 642048 647015 652426 658454 665882 674814 684469
$$ packed form
62293F55395M421N052M877L965K920K327K190K057J594R42N09N27Q24R42N34k51
62277F88825q48p91j32P15J485K322L545N334P606J0148J2769J5293J7594J9721
62263G83586K2012K4900K8471L2348L6207M0222M4614M8938N2305N4451N5958
62252A224012N7090N6980N4584N0073M4530L8359L0906K1809J1951K611n819j3724
62240A573362k1324k8382l4632l9994m4413m7896n0538n2221n2457n1068m8779
62229A101658m6560m4443m1615l7717l3425k9594k6453k3852k1621j9418j6879
62218G60081j4341j2783j2489j2361j1242r470q275p960p599o466m878l528k732
62205F45957k447k470k377j820r80k32O11K028L778M967N411O028P428Q932R655
$$ plain form
62190 684469 694328 704766 716314 729014 742810 757894 774034 790015 804433 817009 828607 839999
62178 839999 851051 861134 869960 877816 885233 892698 900688 909895 921305 935947 954501 977153 1003757
62165 1003757 1034005 1067424 1103432 1141584 1181613 1222982 1264349 1303626 1338741 1368385 1392107
62154 1392107 1409861 1421702 1427877 1428902 1425190 1416708 1403416 1386087 1366241 1344966 1322225 1297768
62142 1297768 1272394 1247680 1224477 1202311 1180460 1159169 1139477 1122115 1106874 1092960 1079834
62131 1079834 1067669 1056984 1047752 1039044 1029812 1019841 1009623 999517 989617 980366 972667 967127 963734
62118 963734 962421 963398 966656 971707 978214 986366 996156 1006742 1017077 1026799 1035861 1043634 1049210 1052506
62104 1052506 1054292 1054949 1053924 1050763 1046183 1041657 1038162 1035692 1033896 1032828 1032921 1034324 1036361 1037788 1037724
$$ packed form
62190F84469R859J0438J1548J2700J3796J5084J6140J5981J4418J2576J1598J1392
62178H39999J1052J0083Q826P856P417P465P990R207J1410J4642J8554K2652K6604
62165A003757L0248L3419L6008L8152M0029M1369M1367L9277L5115K9644K3722
62154A392107J7754J1841O175J025l712q482j3292j7329j9846k1275k2741k4457
62142A297768k5374k4714k3203k2166k1851k1291j9692j7362j5241j3914j3126
62131A079834j2165j0685r232q708r232r971j0218j0106r900r251p699n540l393
62118I63734j313R77L258N051O507Q152R790J0586J0335R722R062P773N576L296
62104A052506J786O57j025l161m580m526l495k470j796j068R3J403K037J427o4
$$ plain form
62089 1037724 1036410 1035081 1035167 1037598 1042710 1050556 1061224 1074775 1090841 1108385 1126215 1143942 1162313
62076 1162313 1182412 1204643 1228549 1253395 1278719 1304503 1331036 1358448 1386282 1413682 1440187
62065 1440187 1466024 1491370 1515659 1538066 1558496 1577498 1595167 1610568 1622438 1630169 1633992 1634434
62053 1634434 1631718 1625536 1615248 1600397 1581112 1558023 1531890 1503318 1472625 1439835 1404889 1368023
62041 1368023 1329777 1290573 1250595 1210308 1170766 1133028 1097467 1064014 1032783 1003966 977306
62030 977306 952285 928810 907228 887715 870225 854950 842067 830830 819711 807879 796003
62019 796003 785090 774971 764573 753468 742460 732514 723607 714892 705873 697159 690030 685341 683001
62006 683001 682554 683958 687429 692653 698687 704844 711339 718746 727041 735407 742869 748894 753413 756406
$$ packed form
62089A037724j314j329Q6K431N112P846J0668J3551J6066J7544J7830J7727J8371
62076A162313K0099K2231K3906K4846K5324K5784K6533K7412K7834K7400K6505
62065A440187K5837K5346K4289K2407K0430J9002J7669J5401J1870P731L823M42
62053A634434k716o182j0288j4851j9285k3089k6133k8572l0693l2790l4946l6866
62041A368023l8246l9204l9978m0287l9542l7738l5561l3453l1231k8817k6660
62030I77306k5021k3475k1582j9513j7490j5275j2883j1237j1119j1832j1876
62019G96003j0913j0119j0398j1105j1008r946q907q715r019q714p129m689k340
62006F83001m47J404L471N224O034O157O495P407Q295Q366P462O025M519K993
$$ plain form
61992 756406 757489 755975 751488 744495 735939 726301 715342 702877 689478 676078 663152 650570 638167
61979 638167 626121 614817 604625 595793 588357 582087 576666 572011 568343 565921 564743 564503 564797 565339
61965 565339 565960 566498 566897 567501 569033 571957 575895 580002 583974 588441 594294 601893 611063 621591 633508
61950 633508 647029 662434 679902 699299 720266 742673 766846 793168 821586 851769 883737
61939 883737 918005 954961 994263 1035024 1076471 1118120 1159285 1198797 1235599 1269569 1301293
61928 1301293 1330922 1357583 1380049 1397623 1410117 1417463 1419892 1418212 1413343 1405644 1395271 1383142
61916 1383142 1370906 1359790 1350024 1341623 1335352 1332619 1334689 1342157 1354864 1372059 1392767 1416012
61904 1416012 1440530 1464401 1485499 1502410 1514569 1521491 1522369 1516543 1503909 1484782 1459908 1430715
$$ packed form
61992G56406J083j514m487o993q556r638j0959j2465j3399j3400j2926j2582j2403
61979F38167j2046j1304j0192q832p436o270n421m655l668k422j178k40K94N42
61965E65339O21N38L99O04J532K924L938M107L972M467N853P599R170J0528J1917
61950F33508J3521J5405J7468J9397K0967K2407K4173K6322K8418L0183L1968
61939H83737L4268L6956L9302M0761M1447M1649M1165L9512L6802L3970L1724
61928A301293K9629K6661K2466J7574J2494P346K429j680m869p699j0373j2129
61916A383142j2236j1116r766q401o271k733K070P468J2707J7195K0708K3245
61904A416012K4518K3871K1098J6911J2159O922Q78n826j2634j9127k4874k9193
$$ plain form
61892 1430715 1398855 1365165 1329636 1292678 1255693 1219904 1185381 1151901 1120146 1091132 1064755
61881 1064755 1039876 1015758 992647 970967 950742 931976 914936 899765 886233 874132 863626
61870 863626 855140 849129 845905 845402 847184 851095 857817 868338 882880 900812 921620 945432 972498
61857 972498 1002775 1036411 1074216 1117084 1164958 1216679 1270919 1327162 1385806 1447352 1511456
61846 1511456 1576709 1641249 1703472 1762167 1816208 1864325 1905061 1936899 1958771 1970735 1974007
61835 1974007 1970150 1960442 1946247 1929490 1912215 1895907 1881818 1871665 1867150 1868652 1875052 1885042
61823 1885042 1898038 1913516 1929948 1944788 1955261 1959087 1954924 1942519 1922181 1893908 1857301 1812474
61811 1812474 1760645 1703526 1642471 1578630 1513625 1449501 1387928 1329725 1275115 1224113 1176616
$$ packed form
61892A430715l1860l3690l5529l6958l6985l5789l4523l3480l1755k9014k6377
61881A064755k4879k4118k3111k1680k0225j8766j7040j5171j3532j2101j0506
61870H63626q486o011l224n03J782L911O722J0521J4542J7932K0808K3812K7066
61857I72498L0277L3636L7805M2868M7874N1721N4240N6243N8644O1546O4104
61846A511456O5253O4540O2223N8695N4041M8117M0736L1838K1872J1964L272
61835A974007l857r708j4195j6757j7275j6308j4089j0153m515J502O400R990
61823A885042J2996J5478J6432J4840J0473L826m163j2405k0338k8273l6607m4827
61811A812474n1829n7119o1055o3841o5005o4124o1573n8203n4610n1002m7497
$$ plain form
61800 1176616 1132496 1091894 1055387 1023584 996368 972620 950944 930693 912112 895414 880166
61789 880166 865855 852669 841155 831285 822455 814345 807158 800931 795255 789912 785217 781373 777950
61776 777950 774357 770508 766726 763386 760953 759882 760025 760488 760603 760761 761772 763665 765716 767509 769273
61761 769273 771235 773272 775365 777788 780626 783557 786414 789467 792807 795825 797763 798564 798697 798233 796627
61746 796627 793507 789292 784820 780624 776795 773300 770106 767144 764490 762557 761784 762080 762868 763781 765040
61731 765040 767047 769965 773919 779203 785852 793256 800727 808343 816761 826178 835985 845477 854382 862569
61717 862569 869831 876279 882420 888310 892875 894667 893267 889615 885015 880104 874717 868351 860660 851781
61703 851781 842329 832951 823831 814743 805614 796852 789042 782368 776468 770864 765482 760671 756755 753725
$$ packed form
61800A176616m4120m0602l6507l1803k7216k3748k1676k0251j8581j6698j5248
61789H80166j4311j3186j1514r870q830q110p187o227n676n343m695l844l423
61776G77950l593l849l782l340k433j071J43M63J15J58J011J893K051J793J764
61761G69273J962K037K093K423K838K931K857L053L340L018J938Q01J33m64j606
61746G96627l120m215m472m196l829l495l194k962k654j933p73K96P88R13J259
61731G65040K007K918L954N284O649P404P471P616Q418R417R807R492Q905Q187
61717H62569P262O448O141N890M565J792j400l652m600m911n387o366p691q879
61703H51781r452r378r120r088r129q762p810o674n900n604n382m811l916l030
$$ plain form
61689 753725 751419 749760 748548 747218 745177 742412 739404 736428 733377 730346 727845 726100 724551 722466
61675 722466 719843 717301 715289 713794 712599 711407 709867 707936 706159 705133 704702 704142 703183 702336 702090
61660 702090 702195 702022 701241 699909 698163 696194 694397 693241 693002 693756 695503 698101 701155 704237 707254
61645 707254 710499 714313 718696 723171 727015 729753 731576 733123 734688 735742 735377 733177 729447 724727
61631 724727 719384 713683 707879 702049 696075 690057 684588 680328 677400 675429 674058 673149 672564 672183 672145
61616 672145 672615 673156 672737 670649 667052 662374 656591 649550 641657 633547 625224 616160 606279 596217 586506
61601 586506 577102 567949 559405 551729 544564 537383 530186 523365 517146 511548 506685 502645 499120 495534
61587 495534 491596 487512 483672 480300 477344 474570 471789 469104 466779 464777 462643 460058 457298 454937
$$ packed form
61689G53725k306j659j212j330k041k765l008k976l051l031k501j745j549k085
61675G22466k623k542k012j495j195j192j540j931j777j026m31n60r59q47k46
61660G02090J05j73p81j332j746j969j797j156k39P54J747K598L054L082L017
61645G07254L245L814M383M475L844K738J823J547J565J054l65k200l730m720
61631G24727n343n701n804n830n974o018n469m260k928j971j371r09n85l81l8
61616F72145M70N41m19k088l597m678n783p041p893q110q323r064r881j0062r711
61601E86506r404r153q544p676p165p181p197o821o219n598m863m040l525l586
61587D95534l938m084l840l372k956k774k781k685k325k002k134k585k760k361
$$ plain form
61573 454937 453260 452165 451416 450735 449866 448848 448059 447674 447280 446336 444835 443158 441513 439983 438916 438693
61557 438693 439118 439606 440014 440782 442140 443664 444817 445509 445984 446560 447632 449420 451470 452856 453288 453678
61541 453678 455139 457671 460332 462560 464807 467779 471478 475245 478514 481227 483466 484933 485095 483954
61527 483954 482400 481402 480879 479764 477323 474048 470979 468479 466090 463375 460390 457282 453920 450296 446997
61512 446997 444873 444099 443800 442782 440618 437862 435243 432921 430705 428771 427724 427898 428904 430052 430974
61497 430974 431633 431968 431890 431565 431354 431444 431786 432435 433635 435374 437098 438173 438564 438773 439115 439378 439320 439167
61479 439167 439300 439620 439610 439040 438238 437583 437139 436991 437522 438928 440618 441617 441583 441166 441257 442160 443523 444799
61461 444799 445653 446087 446289 446340 446110 445547 444943 444695 444906 445479 446501 448142 450150 451905 453207 454674 457108
$$ packed form
61573D54937j677j095p49o81q69j018p89l85l94r44j501j677j645j530j067k23
61557D38693M25M88M08P68J358J524J153O92M75N76J072J788K050J386M32L90
61541D53678J461K532K661K228K247K972L699L767L269K713K239J467J62j141
61527D83954j554r98n23j115k441l275l069k500k389k715k985l108l362l624l299
61512D46997k124p74k99j018k164k756k619k322k216j934j047J74J006J148R22
61497D30974O59L35p8l25k11R0L42O49J200J739J724J075L91K09L42K63n8j53
61479D39167J33L20j0n70q02o55m44j48N31J406J690R99l4m17R1R03J363J276
61461D44799Q54M34K02N1k30n63o04k48K11N73J022J641K008J755J302J467K434
$$ plain form
61444 457108 460659 464750 468643 471934 474751 477723 481591 486596 492272 497900 503055 507734 512196 516786
61430 516786 521611 526251 530081 533027 535673 538440 541099 543439 545943 549286 553401 557614 561508 565073
61416 565073 568097 570125 571054 571155 570293 567809 563504 558241 553108 548304 543307 537856 532243 526721 521178
61401 521178 515553 510284 506056 503163 501198 499429 497477 495607 494270 493497 492958 492538 492429 492577 492501 492041
61385 492041 491915 492981 495069 497037 498023 498160 498024 497983 498351 499739 502640 506715 510865 514129 516378 518206
61369 518206 520383 523368 527065 530871 534067 536372 538209 540419 543718 548306 553880 559952 566210 572749
61355 572749 580040 588688 599055 611013 624090 637966 652792 668896 686227 704285 722584 740874
61343 740874 758842 775873 791330 804866 816299 825470 832528 837995 842063 843995 842775 838378 831918
$$ packed form
61444D57108L551M091L893L291K817K972L868N005N676N628N155M679M462M590
61430E16786M825M640L830K946K646K767K659K340K504L343M115M213L894L565
61416E65073L024K028R29J01q62k484m305n263n133m804m997n451n613n522n543
61401E21178n625n269m228k893j965j769j952j870j337p73n39m20j09J48p6m60
61385D92041j26J066K088J968R86J37j36m1L68J388K901M075M150L264K249J828
61369E18206K177K985L697L806L196K305J837K210L299M588N574O072O258O539
61355E72749P291Q648J0367J1958J3077J3876J4826J6104J7331J8058J8299J8290
61343G40874J7968J7031J5457J3536J1433R171P058N467M068J932j220m397o460
$$ plain form
61330 831918 824502 816507 808059 799492 790921 781953 772440 763145 754998 747950 741209 734524 728563 723995
61316 723995 720775 718496 716866 715658 714699 714201 714738 716580 719384 722797 726998 732390 739132 747307 757082
61301 757082 768102 779012 788281 795559 801640 807046 811157 812928 811954 808539 803110 795977 787547 778446
61287 778446 769428 761230 754317 748654 743880 739894 737114 736023 736632 738584 741545 745253 749429 754069
61273 754069 759678 766803 775355 784824 795095 806464 818708 830861 842391 854195 867857 884080
61261 884080 902326 921814 942273 963717 986122 1009503 1033825 1058466 1082010 1102822 1119694
61250 1119694 1131895 1139010 1141050 1138482 1131757 1120990 1106384 1088865 1069909 1050716 1031859 1013711
61238 1013711 996864 981836 968543 956346 944760 934059 925034 918127 912952 908822 905507 903090
$$ packed form
61330H31918p416p995q448q567q571q968r513r295q147p048o741o685n961m568
61316G23995l220k279j630j208r59m98N37J842K804L413M201N392O742Q175R775
61301G57082J1020J0910R269P278O081N406M111J771r74l415n429p133q430r101
61287G78446r018q198o913n663m774l986k780j091O09J952K961L708M176M640
61273G54069N609P125Q552R469J0271J1369J2244J2153J1530J1804J3662J6223
61261H84080J8246J9488K0459K1444K2405K3381K4322K4641K3544K0812J6872
61250A119694J2201P115K040k568o725j0767j4606j7519j8956j9193j8857j8148
61238A013711j6847j5028j3293j2197j1586j0701r025o907n175m130l315k417
$$ plain form
61226 903090 901177 898949 896332 894561 894928 897221 899966 902106 903775 905401 906759 907301 906964 906201 905432
61211 905432 904775 904182 903602 903127 903155 904275 906800 910561 915230 920677 926841 933556 940829 949204 959544
61196 959544 972466 988155 1006556 1027471 1050510 1075204 1101173 1127972 1154865 1181062 1206202
61185 1206202 1230185 1252466 1271837 1287219 1298478 1306213 1310964 1312978 1312650 1310749 1307929 1304188 1298942
61172 1298942 1291566 1281833 1269993 1256585 1242011 1226141 1208480 1188926 1168226 1147353 1126461 1104862
61160 1104862 1082102 1058752 1035939 1014522 995017 978005 963967 952757 943691 936311 930719 926995
61148 926995 924709 923331 922869 923683 925678 928035 929815 930587 930305 928836 925915 921580 916341 910749 905005
61133 905005 899273 894286 891334 891529 895203 902036 911501 923124 936615 952029 969695 989845 1012362
$$ packed form
61226I03090j913k228k617j771L67K293K745K140J669J626J358N42l37p63p69
61211I05432o57n93n80m75K8J120K525L761M669N447O164O715P273Q375J0340
61196I59544J2922J5689J8401K0915K3039K4694K5969K6799K6893K6197K5140
61185A206202K3983K2281J9371J5382J1259P735M751K014l28j901k820l741n246
61172A298942p376r733j1840j3408j4574j5870j7661j9554k0700k0873k0892k1599
61160A104862k2760k3350k2813k1417j9505j7012j4038j1210r066p380n592l724
61148I26995k286j378m62Q14J995K357J780P72k82j469k921m335n239n592n744
61133I05005n732m987k952J95L674O833R465J1623J3491J5414J7666K0150K2517
$$ plain form
61120 1012362 1036941 1063217 1090613 1118443 1146512 1175309 1205174 1235453 1264973 1293250 1320639
61109 1320639 1347333 1372757 1396125 1416998 1434986 1449340 1459398 1465289 1467800 1467502 1464136 1456884
61097 1456884 1445187 1429268 1409825 1387206 1361147 1331548 1299285 1265808 1232036 1198199 1164766
61086 1164766 1132814 1103148 1075532 1049261 1024199 1000884 979922 961626 946054 932882 921365
61075 921365 910779 900950 892171 884687 878467 873324 869022 865406 862645 861183 861273 862672 865030 868411
61061 868411 873159 879424 887037 895671 904858 914113 923475 933776 945936 960069 975706 992841 1012093
61048 1012093 1033683 1056789 1080435 1104726 1130757 1159281 1189862 1221431 1253342 1285628 1318340
61037 1318340 1351134 1383674 1416114 1448807 1481659 1514148 1545969 1577288 1608375 1639478 1671190
$$ packed form
61120A012362K4579K6276K7396K7830K8069K8797K9865L0279K9520K8277K7389
61109A320639K6694K5424K3368K0873J7988J4354J0058N891K511k98l366p252
61097A456884j1697j5919j9443k2619k6059k9599l2263l3477l3772l3837l3433
61086A164766l1952k9666k7616k6271k5062k3315k0962j8296j5572j3172j1517
61075I21365j0586r829q779p484o220n143m302l616k761j462R0J399K358L381
61061H68411M748O265P613Q634R187R255R362J0301J2160J4133J5637J7135J9252
61048A012093K1590K3106K3646K4291K6031K8524L0581L1569L1911L2286L2712
61037A318340L2794L2540L2440L2693L2852L2489L1821L1319L1087L1103L1712
$$ plain form
61026 1671190 1704454 1739913 1777490 1816863 1858058 1901431 1947457 1996879 2050651 2109346 2172862
61015 2172862 2241131 2314881 2395455 2484289 2583084 2694222 2820375 2963719 3126074 3309969
61005 3309969 3519531 3760635 4040717 4368651 4754951 5212368 5756220 6403602 7172460
60996 7172460 8082317 9155440 10414763 11878683 13557172 15448656 17529814 19739325
60988 19739325 21976985 24136850 26153693 28011487 29694366 31131529 32208271 32845477
60980 32845477 33066493 32978845 32693376 32268359 31722300 31068447 30305964 29376621 28158583
60971 28158583 26534790 24485213 22120061 19629614 17201146 14964876 12985934 11280805
60963 11280805 9835993 8622756 7608095 6760811 6052934 5459856 4960887 4539082 4180067
$$ packed form
61026A671190L3264L5459L7577L9373M1195M3373M6026M9422N3772N8695O3516
61015B172862O8269P3750Q0574Q8834R8795J11138J26153J43344J62355J83895
61005C309969K09562K41104K80082L27934L86300M57417N43852O47382P68858
60996G172460R09857J073123J259323J463920J678489J891484K081158K209511
60988A9739325K237660K159865K016843J857794J682879J437163J076742O37206
60980C2845477K21016q7648k85469m25017n46059o53853p62483r29343j218038
60971B8158583j623793k049577k365152k490447k428468k236270j978942j705129
60963A1280805j444812j213237j014661q47284p07877n93078m98969m21805l59015
$$ plain form
60954 4180067 3871589 3603956 3369649 3162046 2975329 2805792 2652042 2513107 2386927
60945 2386927 2271179 2164697 2067151 1977627 1894325 1815536 1740225 1667695 1597322 1528837 1462519
60934 1462519 1398986 1338964 1283232 1232391 1186517 1145197 1107966 1074529 1044498 1017185 991903
60923 991903 968427 947012 928000 911475 897203 884737 873558 863328 854134 846458 840804 837260
60911 837260 835435 834818 835143 836331 838094 839734 840526 840331 839673 839069 838339 836710 833571 828964 823365 817150
60895 817150 810324 802584 793648 783679 773431 763676 754375 744749 734396 724041 714778 706795 699308
60882 699308 691685 684143 677218 670996 665104 659202 653334 647956 643735 641076 639673 638698 637586 636455
60868 636455 635709 635542 635989 637234 639478 642634 646408 650705 655726 661652 668439 676019 684511 694048 704438
$$ packed form
60954D180067l08478k67633k34307k07603j86717j69537j53750j38935j26180
60945B386927j15748j06482r7546q9524q3302p8789p5311p2530p0373o8485o6318
60934A462519o3533o0022n5732n0841m5874m1320l7231l3437l0031k7313k5282
60923I91903k3476k1415j9012j6525j4272j2466j1179j0230r194p676n654l544
60911H37260j825o17L25J188J763J640P92j95o58o04p30j629l139m607n599o215
60895H17150o826p740q936r969j0248r755r301r626j0353j0355r263p983p487
60882F99308p623p542o925o222n892n902n868n378m221k659j403r75j112j131
60868F36455p46j67M47J245K244L156L774M297N021N926O787P580Q492R537J0390
$$ plain form
60853 704438 715216 726116 737281 748694 759484 768293 774598 779387 784156 789403 794396 798191 800381
60840 800381 800959 800021 797741 794262 789451 783082 775395 767083 758578 749689 740150 730285 720880 712539 705226
60825 705226 698315 691056 683237 675382 668058 661095 653910 646459 639278 632510 625618 618305 611116 604716
60811 604716 599133 594107 589625 585572 581442 577105 573500 571807 572050 573092 573878 574137 574105 574230 575116 577056
60795 577056 579567 581904 584061 586697 590011 593319 595988 598277 600948 604436 608688 613563 619001 624894
60781 624894 631099 637610 644620 652251 660163 667624 674212 680443 687279 694931 702601 709643 716370 723255
60767 723255 729906 735614 740573 745650 751058 756194 760838 765624 771008 776563 781718 786559 791415 796121
60753 796121 800227 803673 806830 810118 813888 818454 823838 829582 835015 839708 843645 847216 851161 856216
$$ packed form
60853G04438J0778J0900J1165J1413J0790Q809O305M789M769N247M993L795K190
60840H00381N78r38k280l479m811o369p687q312q505q889r539r865r405q341p313
60825G05226o911p259p819p855p324o963p185p451p181o768o892p313p189o400
60811F04716n583n026m482m053m130m337l605j693K43J042P86K59l2J25Q86J940
60795E77056K511K337K157K636L314L308K669K289K671L488M252M875N438N893
60781F24894O205O511P010P631P912P461O588O231O836P652P670P042O727O885
60767G23255O651N708M959N077N408N136M644M786N384N555N155M841M856M706
60753G96121M106L446L157L288L770M566N384N744N433M693L937L571L945N055
$$ plain form
60739 856216 862614 869988 877779 885542 893013 900404 908630 918647 930335 942566 954663 967233 981107
60726 981107 996017 1010874 1025017 1038555 1051640 1064038 1075377 1085333 1093544 1099726 1103944 1106447
60714 1106447 1107175 1105696 1101670 1095215 1086863 1077280 1066835 1055242 1041777 1026148 1008993 991195 972882
60701 972882 953539 933044 912091 891505 871557 852154 833353 815374 798261 781783 765638
60690 765638 749637 733780 718311 703683 690380 678663 668427 659237 650600 642271 634392 627319
60678 627319 621366 616634 612990 610107 607634 605390 603326 601399 599646 598360 597816 597674 596990 595138 592536
60663 592536 590096 588113 586049 583390 580334 577599 575822 575233 575651 576610 577613 578381 578904 579425 580562 583255
60647 583255 588074 594429 600750 605717 609209 611991 614765 617765 620989 624399 627844 631114 634146 636986
$$ packed form
60739H56216O398P374P791P763P471P391Q226J0017J1688J2231J2097J2570J3874
60726I81107J4910J4857J4143J3538J3085J2398J1339R956Q211O182M218K503
60714A106447P28j479m026o455q352r583j0445j1593j3465j5629j7155j7798j8313
60701I72882j9343k0495k0953k0586j9948j9403j8801j7979j7113j6478j6145
60690G65638j6001j5857j5469j4628j3303j1717j0236r190q637q329p879p073
60678F27319n953m732l644k883k473k244k064j927j753j286n44j42o84j852k602
60663E92536k440j983k064k659l056k735j777n89M18R59J003P68N23N21J137K693
60647E83255M819O355O321M967L492K782K774L000L224L410L445L270L032K840
$$ plain form
60633 636986 639438 641031 641547 641451 641471 641748 641675 640689 638955 637034 635090 632740 629661 625992 622012 617745
60617 617745 613117 608361 603988 600318 597171 594040 590509 586526 582301 577971 573445 568717 564273 560910
60603 560910 559004 558113 557405 556347 554803 552730 550147 547429 545311 544355 544437 544852 544898 544394 543704 543353 543651
60586 543651 544610 546017 547455 548410 548707 548896 549901 552087 554865 557397 559466 561427 563502 565557 567575
60571 567575 570043 573727 579160 586414 595195 605066 615675 626901 638852 651764 665866 681143 697126
60558 697126 713005 728027 741706 753642 763439 770962 776396 779699 780238 777420 771680 764459 757214
60545 757214 750837 746008 743532 743959 747240 753107 761573 772738 786368 802097 819884 839747 861100
60532 861100 882822 904145 924942 944855 962560 976400 985550 990095 990181 985726 977160 965845 953383
$$ packed form
60633F36986K452J593N16r6K0K77p3r86j734j921j944k350l079l669l980m267
60617F17745m628m756m373l670l147l131l531l983m225m330m526m728m444l363
60603E60910j906q91p08j058j544k073k583k718k118r56Q2M15M6n04o90l51K98
60586E43651R59J407J438R55K97J89J005K186K778K532K069J961K075K055K018
60571E67575K468L684N433P254Q781R871J0609J1226J1951J2912J4102J5277J5983
60558F97126J5879J5022J3679J1936R797P523N434L303N39k818n740p221p245
60545G57214o377m829k476M27L281N867Q466J1165J3630J5729J7787J9863K1353
60532H61100K1722K1323K0797J9913J7705J3840R150M545Q6m455q566j1315j2462
$$ plain form
60519 953383 940827 928836 918160 909350 902154 895782 889820 884512 880213 877073 875310 875244 876855 879817
60505 879817 884216 890720 899703 910655 922966 936976 953779 974222 998655 1027458 1061254 1100528
60493 1100528 1145404 1195721 1250936 1309990 1371667 1435024 1499014 1561738 1620498 1672586 1715627
60482 1715627 1747357 1765867 1770412 1761502 1739969 1706313 1661105 1605550 1541454 1471179 1397893 1325178
60470 1325178 1255672 1190290 1129108 1072623 1021589 975961 934812 897319 863320 832929 806121
60459 806121 782836 762974 746053 731163 717473 704618 692618 681659 671996 663747 656673 650359
60447 650359 644651 639649 635286 631241 627337 623619 619990 616219 612503 609569 607803 606606 605007 602688
60433 602688 600043 597472 595129 593200 591815 590619 588975 586784 584741 583510 582940 582296 581061 579390 577988
$$ packed form
60519I53383j2556j1991j0676q810p196o372n962n308m299l140j763o6J611K962
60505H79817M399O504Q983J0952J2311J4010J6803K0443K4433K8803L3796L9274
60493A100528M4876N0317N5215N9054O1677O3357O3990O2724N8760N2088M3041
60482A715627L1730J8510M545q910k1533l3656m5208n5555o4096p0275p3286p2715
60470A325178o9506o5382o1182n6485n1034m5628m1149l7493l3999l0391k6808
60459H06121k3285j9862j6921j4890j3690j2855j2000j0959r663q249p074o314
60447F50359n708n002m363m045l904l718l629l771l716k934j766j197j599k319
60433F02688k645k571k343j929j385j196j644k191k043j231n70o44j235j671j402
$$ plain form
60418 577988 577699 578854 580839 582540 583496 584316 585738 587613 589249 590451 591627 593010 594358 595502 596569
60403 596569 597472 597750 597264 596705 596993 598369 600372 602483 604448 606176 607748 609491 611690 614169 616440
60388 616440 618317 620162 622415 625026 627448 629175 630235 631214 632717 634813 637078 639158 641136 643244
60374 643244 645476 647639 649629 651401 652810 653777 654527 655454 656708 658083 659237 659925 660198 660592 661884 664284
60358 664284 666956 668811 669795 671034 673582 677405 681706 685911 690032 694300 698740 703187 707589 712275
60344 712275 717770 724218 731061 737576 743663 749755 755956 761705 766455 770289 773483 775672 775813 772983
60330 772983 767119 759165 750618 742726 735853 729651 723882 718834 714787 711412 708137 704954 702439 700975
60316 700975 700306 699989 699978 700577 701976 704051 706603 709682 713633 718839 725460 733486 743055 754654 768915
$$ packed form
60418E77988k89J155J985J701R56Q20J422J875J636J202J176J383J348J144J067
60403E96569R03K78m86n59K88J376K003K111J965J728J572J743K199K479K271
60388F16440J877J845K253K611K422J727J060R79J503K096K265K080J978K108
60374F43244K232K163J990J772J409R67P50R27J254J375J154O88K73L94J292K400
60358F64284K672J855R84J239K548L823M301M205M121M268M440M447M402M686
60344G12275N495O448O843O515O087O092O201N749M750L834L194K189J41k830
60330G72983n864p954q547p892o873o202n769n048m047l375l275l183k515j464
60316G00975o69l17j1N99J399K075K552L079L951N206O621Q026R569J1599J4261
$$ plain form
60301 768915 786168 806050 827429 848771 868935 887760 905648 922329 936209 945272 948674 947216
60289 947216 942205 934134 922700 907937 890988 873664 857441 843001 830438 819391 808916 797785
60277 797785 785385 772228 759289 747058 735580 725114 716020 708009 700244 692502 685644 680494 676733
60264 676733 673341 669846 666616 664164 662623 661769 661091 659996 658384 656950 656452 656768 657068 656838 656269 655682
60248 655682 655167 654849 654973 655512 656071 656333 656220 655505 653873 651689 650158 650179 651305 652375 653023 653999 656055
60231 656055 659108 662704 666772 671459 676389 680570 683273 684809 686319 688828 692616 697298 702225 706731
60217 706731 710395 713359 716279 719734 723741 728042 732663 737818 743350 748710 753609 758259 762779 766691
60203 766691 769352 770721 771460 772332 773666 775233 776415 776569 775504 773650 771668 769905 768320 766778 765253
$$ packed form
60301G68915J7253J9882K1379K1342K0164J8825J7888J6681J3880R063L402j458
60289I47216n011q071j1434j4763j6949j7324j6223j4440j2563j1047j0475j1131
60277G97785j2400j3157j2939j2231j1478j0466r094q011p765p742o858n150l761
60264F76733l392l495l230k452j541q54o78j095j612j434m98L16L00k30n69n87
60248F55682n15l18J24N39N59K62j13p15j632k184j531K1J126J070O48R76K056
60231F56055L053L596M068M687M930M181K703J536J510K509L788M682M927M506
60217G06731L664K964K920L455M007M301M621N155N532N360M899M650M520L912
60203G66691K661J369P39Q72J334J567J182J54j065j854j982j763j585j542j525
$$ plain form
60188 765253 763717 762034 760036 757613 754689 751206 747258 743298 740127 738470 738410 739245 740001 740082 739438 738324
60172 738324 737162 736534 736980 738608 741005 743509 745525 746753 747486 748599 750774 753588 755789 756700 756964
60157 756964 757624 758893 760278 761602 763274 765573 768229 770941 773906 777571 782029 786868 791559 795839
60143 795839 799820 803827 808149 812888 817925 822992 827825 832455 837408 843404 850627 858357 865525 871564
60129 871564 876603 880906 884318 886288 886318 884410 881162 877355 873291 868673 863278 857618 852606 848618 845182
60114 845182 841698 838233 835410 833601 832399 830908 828558 825639 823049 821556 821250 821606 821899 821677 821130
60099 821130 821120 822562 825621 829751 834575 840342 847201 854493 861373 867928 875074 883314 892153 900753 908696
60084 908696 915937 922551 928729 934561 939584 942910 944129 943744 942392 939910 935564 928921 920111 909390
$$ packed form
60188G65253j536j683j998k423k924l483l948l960l171j657o0Q35P56Q1o44j114
60172G38324j162o28M46J628K397K504K016J228P33J113K175K814K201R11K64
60157G56964O60J269J385J324J672K299K656K712K965L665M458M839M691M280
60143G95839L981M007M322M739N037N067M833M630M953N996P223P730P168O039
60129H71564N039M303L412J970L0j908l248l807m064m618n395n660n012l988l436
60114H45182l484l465k823j809j202j491k350k919k590j493l06L56K93k22n47
60099H21130j0J442L059M130M824N767O859P292O880O555P146Q240Q839Q600P943
60084I08696P241O614O178N832N023L326J219l85j352k482m346o643q810j0721
$$ plain form
60070 909390 896901 882929 868107 853322 839505 827332 816844 807358 798020 788494 779063 770148
60058 770148 761991 754725 748457 743146 738539 734370 730599 727419 724999 723212 721693 720247 719129 718818
60044 718818 719548 721232 723711 726712 729586 731607 732794 733998 735808 737654 738386 737489 735312 732301 728553
60029 728553 724066 718902 713016 706342 699171 692030 685050 677833 670222 662866 656702 651954 647928 643737
60015 643737 639074 634273 629818 625925 622657 620281 619264 619737 621189 622927 624739 626778 628952 630827
60001 630827 632254 633692 635748 638588 641995 645765 649924 654680 660235 666428 672563 677923 682584 687377
59987 687377 692843 698564 703797 708390 712595 716203 718477 719034 718329 717040 715288 712681 708957 704345 699368
59972 699368 694484 689941 685881 682480 679934 678261 677225 676589 676433 677086 678692 680956 683399 685779 688228
$$ packed form
60070I09390j2489j3972j4822j4785j3817j2173j0488r486r338r526r431q915
60058G70148q157p266o268n311m607m169l771l180k420j787j519j446j118l11
60044G18818P30J684K479L001K874K021J187J204J810J846P32q97k177l011l748
60029G28553m487n164n886o674p171p141o980p217p611p356o164m748m026m191
60015F43737m663m801m455l893l268k376j017M73J452J738J812K039K174J875
60001F30827J427J438K056K840L407L770M159M756N555O193O135N360M661M793
59987F87377N466N721N233M593M205L608K274N57p05j289j752k607l724m612m977
59972F99368m884m543m060l401k546j673j036o36j56O53J606K264K443K380K449
$$ plain form
59957 688228 691016 694244 697683 700840 703271 704976 706452 708207 710142 711533 711704 710575 708457 705510
59943 705510 701749 697516 693502 690040 686687 682849 678597 674483 670658 666592 661768 656283 650747 645938
59929 645938 642647 641345 641672 642524 642983 643054 643267 643876 644780 646038 647946 650636 653955 657820 662326 667388
59913 667388 672614 677730 682882 688320 693957 699483 704778 709940 714884 719186 722427 724591 726062 727338
59899 727338 728838 730873 733567 736736 740002 743166 746429 750137 754391 759005 763815 768841 774117 779483
59885 779483 784599 789130 792961 796344 799732 803301 806675 809382 811549 813828 816503 818985 820424 820584
59871 820584 819854 818560 816588 813695 809928 805682 801363 796990 792100 786273 779831 773851 769268 766066
59857 766066 763504 760974 758461 756356 755065 754740 755136 755792 756569 757921 760376 763862 767889 772395 778080
$$ packed form
59957F88228K788L228L439L157K431J705J476J755J935J391J71j129k118k947
59943G05510l761m233m014l462l353l838m252m114l825m066m824n485n536m809
59929F45938l291j302L27Q52M59P1K13O09R04J258J908K690L319L865M506N062
59913F67388N226N116N152N438N637N526N295N162M944M302L241K164J471J276
59899G27338J500K035K694L169L266L164L263L708M254M614M810N026N276N366
59885G79483N116M531L831L383L388L569L374K707K167K279K675K482J439J60
59871H20584p30j294j972k893l767m246m319m373m890n827o442n980m583l202
59857G66066k562k530k513k105j291l25L96O56P77J352K455L486M027M506N685
$$ plain form
59842 778080 785760 795572 806794 818258 828937 838381 846746 854302 860931 866204 869824 871795 872308 871780
59828 871780 870903 870150 869088 866540 861606 854263 844794 833042 818664 802070 784753 768484 754195
59815 754195 741622 730002 719003 708938 700178 692706 686388 681327 677564 674640 671985 669664 668205
59802 668205 667626 667170 666162 664658 663015 661329 659612 658049 656609 654754 652047 648878 646041 643721 641366
59787 641366 638589 635762 633608 632503 632266 632373 632309 631893 631340 630898 630525 630116 629954 630581 632135 634074 635779
59770 635779 637300 639347 642523 646672 651052 655139 659073 663168 667204 670695 673900 677943 683503 689765
59756 689765 695301 699716 703778 708052 712266 716209 720455 725639 731480 737147 742301 747185 751851 755965
59742 755965 759416 762495 765164 766646 766210 764235 762083 760870 760589 760443 759808 758764 757831 757396 757356 757222
$$ packed form
59842G78080P680R812J1222J1464J0679R444Q365P556O629N273L620J971N13n28
59828H71780q77p53j062k548m934p343r469j1752j4378j6594j7317j6269j4289
59815G54195j2573j1620j0999j0065q760p472o318n061l763k924k655k321j459
59802F68205n79m56j008j504j643j686j717j563j440j855k707l169k837k320k355
59787F41366k777k827k154j105k37J07o4m16n53m42l73m09j62O27J554J939J705
59770F35779J521K047L176M149M380M087L934M095M036L491L205M043N560O262
59756F89765N536M415M062M274M214L943M246N184N841N667N154M884M666M114
59742G55965L451L079K669J482m36j975k152j213k81j46o35j044r33m35m0j34
$$ plain form
59726 757222 756538 755235 753642 752254 751492 751582 752435 753598 754495 754891 755110 755738 757194 759593 762860 766804
59710 766804 771161 775759 780592 785597 790515 795194 799932 805172 810843 816350 821333 826082 830973 835796
59696 835796 839975 843311 846145 848752 850878 851983 851826 850678 849021 847146 845047 842617 839810 836662
59682 836662 833324 830147 827437 824919 821756 817460 812609 808148 804139 799832 795031 790546 786968 783670
59668 783670 779618 774665 769430 764325 759457 755225 752110 749860 747688 745473 744120 744414 746018 747896
59654 747896 749354 750352 751155 752031 753094 754162 754884 755140 755082 754677 753474 751095 747709 743749 739313 734183
59638 734183 728419 722670 717795 714247 711760 709589 707134 704430 702036 700392 699356 698348 696870 694865
59624 694865 692678 690694 688953 687145 685084 683052 681457 680221 678839 677092 675359 674156 673614 673537 673666
$$ packed form
59726G57222o84j303j593j388p62R0Q53J163Q97L96K19O28J456K399L267L944
59710G66804M357M598M833N005M918M679M738N240N671N507M983M749M891M823
59696H35796M179L336K834K607K126J105j57j148j657j875k099k430k807l148
59682H36662l338l177k710k518l163m296m851m461m009m307m801m485l578l298
59668G83670m052m953n235n105m868m232l115k250k172k215j353K94J604J878
59654G47896J458R98Q03Q76J063J068P22K56n8m05j203k379l386l960m436n130
59638G34183n764n749m875l548k487k171k455k704k394j644j036j008j478k005
59624F94865k187j984j741j808k061k032j595j236j382j747j733j203n42p7J29
$$ plain form
59609 673666 673656 673133 672064 670966 670444 670642 671363 672582 674542 677281 680282 682682 683885 684079 684235 685448
59593 685448 688035 691316 694295 696498 698118 699582 701152 702776 704052 704455 703863 702858 702266 702349 702550 702062
59577 702062 700508 698005 694731 690579 685379 679442 673680 668959 665317 662059 658629 655121 651863 648968
59563 648968 646579 645183 645127 645915 646498 646374 646080 646511 648050 650410 653014 655384 657382 659291 661526 664214
59547 664214 667243 670720 675110 680720 687367 694816 703341 713543 725790 740084 756237 773663 791048
59534 791048 806939 821004 834228 847345 859318 868001 872356 873563 873862 874836 877103 881114 887384
59521 887384 895725 904760 912628 918162 921272 922241 920886 916484 908514 897343 884150 870217 856365
59508 856365 842962 830138 817831 805794 793893 782403 771926 763003 755838 750259 745736 741601
$$ packed form
59609F73666j0n23j069j098n22J98P21J219J960K739L001K400J203J94J56J213
59593F85448K587L281K979K203J620J464J570J624J276M03n92j005n92Q3K01m88
59577G02062j554k503l274m152n200n937n762m721l642l258l430l508l258k895
59563F48968k389j396n6P88N83j24k94M31J539K360K604K370J998J909K235K688
59547F64214L029L477M390N610O647P449Q525J0202J2247J4294J6153J7426J7385
59534G91048J5891J4065J3224J3117J1973Q683M355J207K99R74K267M011O270
59521H87384Q341R035P868N534L110R69j355m402p970j1171j3193j3933j3852
59508H56365j3403j2824j2307j2037j1901j1490j0477q923p165n579m523m135
$$ plain form
59496 741601 737474 733493 730023 727250 725235 724107 723850 724021 724115 724185 724715 725880 727409 729263 731955 735934
59480 735934 741046 746858 753170 759969 767186 774832 783001 791415 799234 805725 810904 815122 818308 820110
59466 820110 820636 820516 820226 819865 819704 820525 823198 828168 835486 845036 856567 869647 883826 898843 914622
59451 914622 931082 947928 964623 980615 995547 1009029 1020124 1027492 1030372 1029207 1024934 1017759
59439 1017759 1007094 992647 975223 956420 937838 920526 904784 890417 877415 866330 857661
59428 857661 851046 845577 841004 838105 837758 840173 845301 853426 864880 879426 896319 914860 934649
59415 934649 955583 977798 1001260 1024936 1046551 1063760 1075659 1082878 1086162 1085099 1078319 1064902
59403 1064902 1045726 1023731 1002815 986014 974229 966331 960342 954686 948699 942241 934729 924527
$$ packed form
59496G41601m127l981l470k773k015j128k57J71R4P0N30J165J529J854K692L979
59480G35934N112N812O312O799P217P646Q169Q414P819O491N179M218L186J802
59466H20110N26j20k90l61j61Q21K673M970P318R550J1531J3080J4179J5017J5779
59451I14622J6460J6846J6695J5992J4932J3482J1095P368K880j165m273p175
59439A017759j0665j4447j7424j8803j8582j7312j5742j4367j3002j1085q669
59428H57661o615n469m573k899l47K415N128Q125J1454J4546J6893J8541J9789
59415I34649K0934K2215K3462K3676K1615J7209J1899P219L284j063o780j3417
59403A064902j9176k1995k0916j6801j1785p898n989n656n987o458p512j0202
$$ plain form
59391 924527 909562 888861 863497 836053 809306 785359 765414 749702 737644 728477 721883 717861
59379 717861 716135 715973 716583 717415 718093 718424 718614 719264 720931 723674 727028 730386 733477 736615 740452 745351
59363 745351 751078 757179 763566 770597 778679 788006 798582 810260 822764 835907 849862 865113 882200
59350 882200 901550 923320 947141 972140 997519 1023061 1048786 1074280 1098716 1121445 1142059
59339 1142059 1159850 1173751 1182985 1187400 1186994 1181627 1171531 1157651 1141026 1121989 1100422 1076685
59327 1076685 1051914 1027425 1004050 982006 961144 941248 922274 904413 888014 873554 861586
59316 861586 852361 845339 839359 833577 828091 823539 820355 818589 818056 818293 818611 818619 818603 819046 819982 821251 823227
59299 823227 826734 832253 839635 848577 858932 870541 883261 897323 913220 931037 950170 969735
$$ packed form
59391I24527j4965k0701k5364k7444k6747k3947j9945j5712j2058r167o594m022
59379G17861j726j62O10Q32O78L31J90O50J667K743L354L358L091L138L837M899
59363G45351N727O101O387P031Q082R327J0576J1678J2504J3143J3955J5251J7087
59350H82200J9350K1770K3821K4999K5379K5542K5725K5494K4436K2729K0614
59339A142059J7791J3901R234M415m06n367j0096j3880j6625j9037k1567k3737
59327A076685k4771k4489k3375k2044k0862j9896j8974j7861j6399j4460j1968
59316H61586r225p022n980n782n486m552l184j766n33K37L18Qj6M43R36J269J976
59299H23227L507N519P382Q942J0355J1609J2720J4062J5897J7817J9133J9565
$$ plain form
59287 969735 988892 1006735 1022387 1035379 1045443 1051751 1052920 1048322 1039134 1027749 1016393 1006594
59275 1006594 999500 995924 995967 999043 1004484 1011986 1021457 1032559 1044397 1055680 1065322 1072967 1078669 1082053
59261 1082053 1082209 1078624 1071783 1062467 1050892 1037024 1021367 1004723 987341 969090 950476 932750
59249 932750 916740 902181 888545 876098 865729 858031 852917 849956 848804 849374 851766 855910 861226
59236 861226 866871 872485 878384 884789 891037 895860 898340 898368 896245 892142 885991 877764 867769 856743
59222 856743 845618 835106 825345 815918 806189 795818 785169 775238 767053 761032 756874 753926 751549
59209 751549 749375 747483 746303 746104 746634 747500 748723 750505 752557 754286 755793 758108 762055 767316 772994
59194 772994 778755 784965 791890 799328 806996 814894 823154 831735 840292 848218 854935 860408 865343 870646
$$ packed form
59287I69735J9157J7843J5652J2992J0064O308J169m598r188j1385j1356r799
59275A006594p094l576M3L076N441P502R471J1102J1838J1283R642P645N702L384
59261A082053J56l585o841r316j1575j3868j5657j6644j7382j8251j8614j7726
59249I32750j6010j4559j3636j2447j0369p698n114k961j152N70K392M144N316
59236H61226N645N614N899O405O248M823K480K8k123m103o151q227r995j1026
59222H56743j1125j0512r761r427r729j0371j0649r931q185o021m158k948k377
59209G51549k174j892j180j99N30Q66J223J782K052J729J507K315L947N261N678
59194G72994N761O210O925P438P668P898Q260Q581Q557P926O717N473M935N303
$$ plain form
59180 870646 876581 882558 887742 891799 895112 898429 902269 906621 911221 916070 921559 928063 935627 944126
59166 944126 953514 963784 974784 986156 997275 1007266 1015342 1021163 1024581 1025094 1022145 1016155 1008696
59153 1008696 1001087 993157 983842 972644 960020 946687 933322 920832 910148 901511 894350 887885
59141 887885 881585 875145 868633 862723 858303 855667 854390 854022 854461 855625 857269 859297 861798 864727 868050
59126 868050 872331 878456 886485 895366 904307 913903 925304 938713 953420 969067 986092 1004907 1025361
59113 1025361 1047182 1070288 1094279 1118080 1140570 1161384 1180791 1198941 1215543 1230180 1242529
59102 1242529 1252185 1258636 1261684 1261801 1259831 1256297 1251108 1243925 1234706 1223908 1212309 1200721 1189691
59089 1189691 1179327 1169418 1159722 1150078 1140254 1129895 1118764 1106864 1094227 1080705 1066181 1050839
$$ packed form
59180H70646N935N977N184M057L313L317L840M352M600M849N489O504P564Q499
59166I44126R388J0270J1000J1372J1119R991Q076N821L418N13k949n990p459
59153A008696p609p930r315j1198j2624j3333j3365j2490j0684q637p161o465
59141H87885o300o440o512n910m420k636j277l68M39J164J644K028K501K929L323
59126H68050M281O125Q029Q881Q941R596J1401J3409J4707J5647J7025J8815K0454
59113A025361K1821K3106K3991K3801K2490K0814J9407J8150J6602J4637J2349
59102A242529R656O451L048J17j970l534n189p183r219j0798j1599j1588j1030
59089A189691j0364r909r696r644r824j0359j1131j1900j2637j3522j4524j5342
$$ plain form
59077 1050839 1035057 1019144 1003382 988171 973853 960453 947812 935914 924854 914591 905020
59066 905020 896199 888153 880549 872947 865414 858491 852479 847089 841862 836579 831191 825805 820905 817123
59052 817123 814438 811916 808674 804937 801872 800454 800697 801819 802933 803713 804645 806550 809708 813565 817455
59037 817455 821410 826033 831716 838314 845541 853410 862220 872216 883354 895385 908304 922730 939665
59024 939665 959692 982416 1006695 1031247 1054997 1077118 1097040 1114369 1128706 1139603 1146819 1150417
59012 1150417 1150655 1148001 1143386 1138101 1133117 1128687 1124786 1121702 1119914 1119652 1120953 1123934 1128539 1134102
58998 1134102 1139642 1144628 1149049 1152718 1154981 1155379 1154173 1151843 1148218 1142531 1134317 1124010 1112521 1100325
58984 1100325 1087150 1072589 1056958 1041440 1027356 1015406 1005659 998109 992996 990567 990650 992652 996006
$$ packed form
59077A050839j5782j5913j5762j5211j4318j3400j2641j1898j1060j0263r571
59066I05020q821q046p604p602p533o923o012n390n227n283n388n386m900l782
59052H17123k685k522l242l737l065j418K43J122J114P80R32J905L158L857L890
59037H17455L955M623N683O598P227P869Q810R996J1138J2031J2919J4426J6935
59024I39665K0027K2724K4279K4552K3750K2121J9922J7329J4337J0897P216L598
59012A150417K38k654m615n285m984m430l901l084j788k62J301K981M605N563
58998A134102N540M986M421L669K263L98j206k330l625n687q214j0307j1489j2196
58984A100325j3175j4561j5631j5518j4084j1950r747p550n113k429Q3K002L354
$$ plain form
58971 996006 1000605 1006722 1014536 1023893 1034662 1047070 1061368 1077179 1093601 1110021 1126409 1142589
58959 1142589 1157661 1170531 1180668 1187879 1191564 1190839 1185458 1176117 1163679 1148532 1130922 1111579
58947 1111579 1091678 1072290 1054148 1037874 1024157 1013577 1006359 1002354 1001211 1002400 1005045 1007915
58935 1007915 1009858 1010272 1009017 1005897 1000519 992700 982678 970760 957158 942421 927645 913765 900864
58922 900864 888611 877251 867598 860057 854184 849330 845256 841986 839521 837966 837611 838623 840849 844135
58908 844135 848560 854227 861088 869217 879023 890908 904898 920816 938554 957878 978186 998927
58896 998927 1020200 1042605 1066408 1091124 1115991 1140664 1165444 1191022 1218027 1246574 1276076
58885 1276076 1305488 1333709 1359699 1382354 1400551 1413393 1420262 1420746 1414785 1402978 1386443 1366217
$$ packed form
58971I96006M599O117P814R357J0769J2408J4298J5811J6422J6420J6388J6180
58959A142589J5072J2870J0137P211L685p25n381r341j2438j5147j7610j9343
58947A111579j9901j9388j8142j6274j3717j0580p218m005j143J189K645K870
58935A007915J943M14j255l120n378p819j0022j1918j3602j4737j4776j3880j2901
58922I00864j2253j1360r653p541n873m854m074l270k465j555l55J012K226L286
58908H44135M425N667O861Q129R806J1885J3990J5918J7738J9324K0308K0741
58896I98927K1273K2405K3803K4716K4867K4673K4780K5578K7005K8547K9502
58885A276076K9412K8221K5990K2655J8197J2842O869M84n961j1807j6535k0226
$$ plain form
58873 1366217 1342938 1317153 1289662 1261315 1232737 1204534 1177596 1152819 1130624 1110969 1093685
58862 1093685 1078386 1064192 1050176 1036263 1023207 1011433 1000349 989099 977546 966110 955046
58851 955046 944434 934546 925543 916886 907719 897849 887811 877939 868020 857966 848152 838831 829773
58838 829773 820817 812334 804791 798313 792965 788998 786385 784578 783191 782488 782679 783171 783225 783003 783235 783948
58822 783948 784317 783808 782814 782086 782053 782737 783702 784009 782904 780769 778813 777570 776341 774408 772195 770644
58806 770644 769884 769149 767810 765957 764089 762648 761789 761179 760047 757772 754488 750988 748138 746566 746605 748001
58790 748001 749738 750766 751158 752239 755325 760538 767012 773997 781451 789668 798579 807464 815321 821620
58776 821620 826763 831592 836272 839852 841204 840229 837750 834329 829769 823892 817232 810530 804027 797818
$$ packed form
58873A366217k3279k5785k7491k8347k8578k8203k6938k4777k2195j9655j7284
58862A093685j5299j4194j4016j3913j3056j1774j1084j1250j1553j1436j1064
58851I55046j0612r888r003q657r167r870j0038r872r919j0054r814r321r058
58838H29773q956q483p543o478n348l967k613j807j387p03J91M92N4k22K32P13
58822G83948L69n09r94p28l3O84R65L07j105k135j956j243j229j933k213j551
58806G70644p60p35j339j853j868j441q59o10j132k275l284l500k850j572L9J396
58790G48001J737J028L92J081L086N213O474O985P454Q217Q911Q885P857O299
58776H21620N143M829M680L580J352r75k479l421m560n877o660o702o503o209
$$ plain form
58762 797818 792591 789283 787969 787788 788120 789299 791887 795707 799982 804086 807844 811350 814928 819104 824323
58747 824323 830737 838316 846971 856503 866884 878757 893080 909855 927735 945494 963463 982778
58735 982778 1003541 1024641 1045304 1065834 1086527 1106696 1125229 1141473 1155116 1165713 1172955 1177110
58723 1177110 1178689 1177839 1174523 1169207 1162927 1156618 1150727 1145464 1141107 1137841 1135417 1133156 1130339 1126515
58709 1126515 1121389 1114498 1105242 1093337 1079076 1062936 1045039 1025248 1003718 981052 957887 934550
58697 934550 911132 887711 864505 842015 820967 801893 784774 769316 755510 743589 733458
58686 733458 724560 716404 708934 702277 696390 691112 686347 682069 678276 675054 672599 671216 671389 673581
58672 673581 677683 682914 688749 695792 705180 717126 730691 745081 760444 777068 794410 811338
$$ packed form
58762G97818n227l308j314j81L32J179K588L820M275M104L758L506L578M176N219
58747H24323O414P579Q655R532J0381J1873J4323J6775J7880J7759J7969J9315
58735I82778K0763K1100K0663K0530K0693K0169J8533J6244J3643J0597P242M155
58723A177110J579q50l316n316o280o309n891n263m357l266k424k261k817l824
58709A126515n126o891r256j1905j4261j6140j7897j9791k1530k2666k3165k3337
58697I34550k3418k3421k3206k2490k1048j9074j7119j5458j3806j1921j0131
58686G33458q898q156p470o657n887n278m765m278l793l222k455j383J73K192
58672F73581M102N231N835P043R388J1946J3565J4390J5363J6624J7342J6928
$$ plain form
58660 811338 826901 840384 850923 857579 859790 857610 851763 843582 834484 825135 815383 805160 795053
58647 795053 785718 777219 769412 762627 757405 753767 751222 749344 747901 746642 745462 744646 744417 744288 743315
58632 743315 741068 737979 734760 731825 729237 726752 723894 720445 717021 714839 714703 716445 719432 723407
58618 723407 728768 736214 746164 758244 771257 783916 795775 807311 819003 830514 840814 848898
58606 848898 854228 856700 856492 853967 849589 843867 837404 830934 825166 820525 817019 814384 812363 810960
58592 810960 810562 811964 816145 823726 834427 847189 861026 875735 891626 908728 926547 944557
58580 944557 962474 979862 995805 1009331 1020142 1028736 1035834 1041829 1046854 1051280 1056035 1062332 1071041
58567 1071041 1082504 1096966 1114971 1137026 1162971 1192000 1223213 1255802 1288703 1320501 1349889
$$ packed form
58660H11338J5563J3483J0539O656K211k180n847q181r098r349r752j0223j0107
58647G95053r335q499p807o785n222l638k545j878j443j259j180q16k29j29r73
58632G43315k247l089l219k935k588k485k858l449l424k182j36J742K987L975
58618G23407N361P446R950J2080J3013J2659J1859J1536J1692J1511J0300Q084
58606H48898N330K472k08k525m378n722o463o470n768m641l506k635k021j403
58592H10960l98J402M181P581J0701J2762J3837J4709J5891J7102J7819J8010
58580I44557J7917J7388J5943J3526J0811Q594P098N995N025M426M755O297Q709
58567A071041J1463J4462J8005K2055K5945K9029L1213L2589L2901L1798K9388
$$ plain form
58556 1349889 1376066 1398627 1417215 1431294 1440115 1443041 1440148 1432391 1420781 1405553 1386506 1363966
58544 1363966 1338864 1311989 1283824 1255106 1226729 1198896 1171143 1143494 1116864 1091924 1068337
58533 1068337 1045705 1024609 1006009 990072 976318 964619 955330 948613 944222 941858 941202 941747 943056
58520 943056 945067 947759 950774 953858 957403 961926 967118 971975 975890 979147 982331 985637 988835 991513
58506 991513 993312 994128 994099 993233 991222 987818 983200 977718 971529 964810 958068 951801 946000 940372 935019
58491 935019 930597 927890 927380 929052 932457 937271 943943 953398 965880 980545 996478 1013507 1031560
58478 1031560 1049872 1067479 1083961 1098940 1111316 1119896 1124547 1125839 1123721 1117403 1106541 1091859
58466 1091859 1074666 1056441 1038744 1022671 1008284 995177 983521 973976 966753 961553 958415 957772
$$ packed form
58556A349889K6177K2561J8588J4079Q821K926k893p757j1610j5228j9047k2540
58544A363966k5102k6875k8165k8718k8377k7833k7753k7649k6630k4940k3587
58533A068337k2632k1096j8600j5937j3754j1699r289o717m391k364o56N45J309
58520I43056K011K692L015L084L545M523N192M857L915L257L184L306L198K678
58506I91513J799Q16k9q66k011l404m618n482o189o719o742o267n801n628n353
58491I35019m422k707n10J672L405M814O672R455J2482J4665J5933J7029J8053
58478A031560J8312J7607J6482J4979J2376Q580M651J292k118o318j0862j4682
58466A091859j7193j8225j7697j6073j4387j3107j1656r545p223n200l138o43
$$ plain form
58454 957772 959611 963271 968097 973564 978772 982669 984953 986053 986120 984799 982103 978692 975062 971204 967269
58439 967269 963790 960998 958766 957537 958449 962014 967368 973424 980225 988620 999019 1011012 1023886 1037117
58425 1037117 1050623 1064890 1080552 1097656 1115597 1133881 1152406 1170837 1188295 1203995 1217673
58414 1217673 1229026 1237276 1241788 1242767 1240796 1235865 1227199 1213971 1196063 1174493 1151350 1129018 1109158
58401 1109158 1092409 1078894 1068519 1060784 1054929 1050587 1047808 1046253 1044929 1043045 1040698 1038310 1035773
58388 1035773 1032521 1028125 1022478 1015643 1007904 999816 991902 984394 977362 970922 965278 960794 958032 957459
58374 957459 959060 962542 967842 975077 984080 994423 1005902 1018468 1031782 1045378 1059293 1073887
58362 1073887 1089022 1104049 1118671 1133096 1147145 1160032 1171326 1181450 1190831 1199212 1206234 1212148
$$ packed form
58454I57772J839L660M826N467N208L897K284J100O7j321k696l411l630l858l935
58439I67269l479k792k232j229R12L565N354O056O801Q395J0399J1993J2874J3231
58425A037117J3506J4267J5662J7104J7941J8284J8525J8431J7458J5700J3678
58414A217673J1353Q250M512R79j971m931q666j3228j7908k1570k3143k2332j9860
58401A109158j6749j3515j0375p735n855m342k779j555j324j884k347k388k537
58388A035773l252m396n647o835p739q088p914p508p032o440n644m484k762n73
58374I57459J601L482N300P235R003J0343J1479J2566J3314J3596J3915J4594
58362A073887J5135J5027J4622J4425J4049J2887J1294J0124R381Q381P022N914
$$ plain form
58350 1212148 1217466 1222319 1226619 1230582 1234742 1239707 1246041 1254080 1263733 1274757 1287267 1301552 1317437
58337 1317437 1334306 1351738 1369582 1387440 1404718 1421136 1436558 1450415 1462098 1471838 1480333 1487526
58325 1487526 1492752 1496122 1498678 1501079 1503294 1505805 1509790 1515616 1522348 1529290 1536928 1545814 1555763 1566827
58311 1566827 1579803 1594908 1611042 1627384 1644745 1664275 1685624 1707404 1728749 1749447 1769267
58300 1769267 1788210 1806896 1825720 1844046 1861112 1877249 1893444 1910171 1927431 1945399 1964231
58289 1964231 1983648 2003411 2023805 2045177 2067646 2091758 2118505 2147940 2178625 2209415 2241111
58278 2241111 2275391 2312760 2352537 2394258 2438032 2483948 2532163 2583398 2638455 2697395 2759694
58267 2759694 2824949 2893039 2964004 3038078 3115260 3194502 3274073 3352918 3430886 3507526 3581844
$$ packed form
58350A212148N318M853M300L963M160M965O334Q039R653J1024J2510J4285J5885
58337A317437J6869J7432J7844J7858J7278J6418J5422J3857J1683R740Q495P193
58325A487526N226L370K556K401K215K511L985N826O732O942P638Q886R949J1064
58311A566827J2976J5105J6134J6342J7361J9530K1349K1780K1345K0698J9820
58300A769267J8943J8686J8824J8326J7066J6137J6195J6727J7260J7968J8832
58289A964231J9417J9763K0394K1372K2469K4112K6747K9435L0685L0790L1696
58278B241111L4280L7369L9777M1721M3774M5916M8215N1235N5057N8940O2299
58267B759694O5255O8090P0965P4074P7182P9242P9571P8845P7968P6640P4318
$$ plain form
58256 3581844 3653585 3723384 3791340 3856974 3921192 3986583 4054960 4126358 4201350 4282348 4371225
58245 4371225 4467459 4570231 4680701 4800456 4929299 5066358 5212026 5366934 5530462 5702206
58235 5702206 5883677 6076607 6280818 6495815 6723184 6965280 7222706 7495385 7785083
58226 7785083 8094659 8425728 8779262 9157677 9564250 10001415 10471759 10979813 11530830
58217 11530830 12128793 12777714 13484028 14255890 15101615 16031208 17058469 18199712 19472055
58208 19472055 20895614 22496703 24307725 26366927 28722594 31438781 34598190 38305032
58200 38305032 42691474 47923199 54197387 61733702 70764941 81535439 94310313 109380676
58192 109380676 127036363 147502736 170872942 197029003 225472987 255075480 284007796
$$ packed form
58256C581844P1741O9799O7956O5634O4218O5391O8377P1398P4992Q0998Q8877
58245D371225R6234J02772J10470J19755J28843J37059J45668J54908J63528J71744
58235E702206J81471J92930K04211K14997K27369K42096K57426K72679K89698
58226G785083L09576L31069L53534L78415M06573M37165M70344N08054N51017
58217A1530830N97963O48921P06314P71862Q45725R29593J027261J141243J272343
58208A9472055J423559J601089J811022K059202K355667K716187L159409L706842
58200C8305032M386442N231725O274188P536315R031239J0770498J2774874J5070363
58192A09380676J7655687K0466373K3370206K6156061K8443984K9602493K8932316
$$ plain form
58185 284007796 310173371 331982304 348748412 360178627 365425910 362855872 351046965
58178 351046965 330191410 302565040 271664370 240835102 212407338 187582000 166674246
58171 166674246 149384387 135083785 123123765 113010932 104338510 96617815 89262287
58164 89262287 81785211 74021533 66160137 58568821 51573837 45349176 39932393 35283949
58156 35283949 31325778 27960573 25091392 22636450 20528199 18706698 17121181 15734088
58148 15734088 14516502 13441094 12483469 11626642 10857885 10162744 9527114 8943221 8408027
58139 8408027 7916493 7461172 7037703 6645977 6285809 5955283 5653108 5378745 5129758
58130 5129758 4902037 4692672 4499981 4321201 4152979 3993788 3843020 3698101 3555512
$$ packed form
58185B84007796K6165575K1808933J6766108J1430215N247283k570038j1808907
58178C51046965k0855555k7626370l0900670l0829268k8427764k4825338k0907754
58171A66674246j7289859j4300602j1960020j0112833q672422p720695p355528
58164H9262287p477076p763678p861396p591316o994984o224661n416783m648444
58156C5283949l958171l365205k869181k454942k108251j821501j585517j387093
58148A5734088j217586j075408r57625q56827p68757o95141o35630n83893n35194
58139H408027m91534m55321m23469l91726l60168l30526l02175k74363k48987
58130E129758k27721k09365j92691j78780j68222j59191j50768j44919j42589
$$ plain form
58121 3555512 3414612 3277883 3147511 3024210 2908914 2802632 2704390 2611836 2524091 2441821
58111 2441821 2364699 2291256 2221371 2156387 2096369 2039442 1984331 1931571 1881824 1834757 1789902
58100 1789902 1747039 1705548 1665006 1626435 1591335 1559488 1529376 1500655 1474310 1450417 1427811
58089 1427811 1406258 1387014 1370712 1356345 1342725 1329374 1315577 1300181 1282856 1264221 1244315
58078 1244315 1222262 1197838 1172067 1145917 1119610 1093434 1067952 1043162 1018708 995194 973995
58067 973995 955523 938984 924060 911385 900974 891532 881940 872314 863155 854510 846400 839096 832568
58054 832568 826497 820956 816109 811208 805080 797705 790067 782357 773726 764047 754420 745407 736187 726101
58040 726101 715783 706048 696756 687487 678322 669264 659858 650103 640948 633208 626677 620736 615028 609119
$$ packed form
58121C555512j40900j36729j30372j23301j15296j06282r8242r2554q7745q2270
58111B441821p7122p3443o9885o4984o0018n6927n5111n2760m9747m7067m4855
58100A789902m2863m1491m0542l8571l5100l1847l0112k8721k6345k3893k2606
58089A427811k1553j9244j6302j4367j3620j3351j3797j5396j7325j8635j9906
58078A244315k2053k4424k5771k6150k6307k6176k5482k4790k4454k3514k1199
58067I73995j8472j6539j4924j2675j0411r442r592r626r159q645q110p304o528
58054H32568o071n541m847m901o128p375p638p710q631r679r627r013r220j0086
58040G26101j0318r735r292r269r165r058r406r755r155p740o531n941n708n909
$$ plain form
58026 609119 602423 595058 587982 581777 576033 570332 564980 560269 555889 551621 547891 545106 543072 541485
58012 541485 540280 539287 538390 538276 539966 543219 546488 549058 552085 556833 562929 569274 575743 582974 591169
57997 591169 600059 609511 619261 628455 636287 642781 648356 653009 656474 658716 659762 659472 657941 655572
57983 655572 652369 647869 642279 636857 632434 628232 623011 616767 610474 604678 599275 594264 589789 585690
57969 585690 581834 578665 576703 575715 575067 574635 574651 574877 574729 574140 573568 573145 572371 570684 567901 564119 559596
57952 559596 554744 549940 545359 541086 537148 533408 529814 526864 525308 525161 525705 526746 529159 533763 540357
57937 540357 548407 557854 568526 579574 590473 601967 614876 628395 640693 650928 659455 666209
57925 666209 670146 670649 668467 664773 659931 653595 645583 636318 626626 617174 607897 598082 587287 576000
$$ packed form
58026F09119o696p365p076o205n744n701n352m711m380m268l730k785k034j587
58012E41485j205r93q97j14J690L253L269K570L027M748O096O345O469P231Q195
57997E91169Q890R452R750R194P832O494N575M653L465K242J046k90j531k369
57983F55572l203m500n590n422m423m202n221o244o293n796n403n011m475m099
57969E85690l856l169j962r88o48m32J6K26j48n89n72m23p74j687k783l782m523
57952E59596m852m804m581m273l938l740l594k950j556j47N44J041K413M604O594
57937E40357Q050R447J0672J1048J0899J1494J2909J3519J2298J0235Q527O754
57925F66209L937N03k182l694m842o336q012r265r692r452r277r815j0795j1287
$$ plain form
57911 576000 565041 554652 544661 535198 526563 518566 510689 502833 495267 487956 480583 473154 465901 458668
57897 458668 451123 443590 436926 431457 426751 422550 419220 417108 416076 415874 416346 417106 417726 418431 419903
57882 419903 422050 423682 423906 423197 422545 422020 420830 418456 415133 411371 407538 403845 400229 396304 391824
57867 391824 387244 383537 381403 380872 381701 383855 387482 392538 398643 405342 412432 419924 427670 435281 442638
57852 442638 450298 458976 468573 478008 486224 493105 499220 504874 509704 513176 515208 516179 516427 515911 514394
57837 514394 511799 508255 503885 498828 493496 488465 483920 479499 474914 470501 466783 463762 461107 458933
57823 458933 457781 457744 458146 458357 458550 459244 460376 461287 461547 461326 460811 459717 457763 455493 454100 454216 455174
57806 455174 455668 454901 452842 449679 445600 440969 436083 430689 424373 417605 411721 407439 404023 400438 396785
$$ packed form
57911E76000j0959j0389r991r463q635p997p877p856p566p311p373p429p253p233
57897D58668p545p533o664n469m706m201l330k112j032k02M72P60O20P05J472
57882D19903K147J632K24p09o52n25j190k374l323l762l833l693l616l925m480
57867C91824m580l707k134n31Q29K154L627N056O105O699P090P492P746P611P357
57852D42638P660Q678R597R435Q216O881O115N654M830L472K032R71K48n16j517
57837E14394k595l544m370n057n332n031m545m421m585m413l718l021k655k174
57823D58933j152l7M02K11J93O94J132R11K60k21n15j094j954k270j393J16R58
57806D55174M94p67k059l163m079m631m886n394o316o768n884m282l416l585l653
$$ plain form
57791 396785 393867 391732 389621 387259 385344 384530 384643 385260 386506 388842 392267 396145 399770 402915 405852
57776 405852 408885 411885 414402 416320 418202 420718 423764 426392 427502 426485 423393 418864 413791 408662
57762 408662 403160 396627 388865 380222 371018 361332 351354 341575 332499 324403 317420 311644 307107 303840
57748 303840 301768 300389 298722 296051 292635 289349 286670 284379 282068 279490 276422 272713 268555 264374
57734 264374 260472 257088 254636 253310 252533 251491 250279 249885 250864 252671 254496 256118 257641 259072 260579
57719 260579 262548 264885 266747 267511 267623 267912 268490 268890 268978 268996 268889 268330 267417 266687 266357 266153 266094 266813 268738
57700 268738 271347 273722 275625 277626 280222 283244 286185 288760 290952 292720 294064 295299 296958 299210
57686 299210 301647 303935 306616 311006 318258 328710 342178 358697 378876 403640 433775 469788
$$ packed form
57791C96785k918k135k111k362j915q14J13O17J246K336L425L878L625L145K937
57776D05852L033L000K517J918J882K516L046K628J110j017l092m529n073n129
57762D08662n502o533p762q643r204r686r978r779r076q096o983n776m537l267
57748C03840k072j379j667k671l416l286k679k291k311k578l068l709m158m181
57734B64374l902l384k452j326p77j042j212l94R79J807J825J622J523J431J507
57719B60579J969K337J862P64J12K89N78M00Q8J8j07n59r13p30l30k04n9P19J925
57700B68738K609K375J903K001K596L022K941K575K192J768J344J235J659K252
57686B99210K437K288K681M390P252J0452J3468J6519K0179K4764L0135L6013
$$ plain form
57674 469788 512288 562397 621508 690461 769127 856819 952481 1053624 1155084 1249702 1330999
57663 1330999 1395203 1440394 1463812 1460506 1425383 1357353 1262064 1150596 1035023 924426 823901
57652 823901 735664 660079 596085 541985 496403 458331 426440 399146 375542 355586 339093
57641 339093 325149 312884 302215 293263 285502 278139 271146 265233 260777 257276 254013 250826 247954
57628 247954 245331 242479 239203 236103 233951 232567 230885 228419 226142 225246 225407 225150 223851 222404 221703
57613 221703 221402 220725 219783 219375 219913 221166 222779 224474 225931 226958 227698 228353 228920 229415 229977 230459 230322
57596 230322 229449 228619 228598 229099 229288 229032 228894 229014 228805 227866 226499 225066 223415 221227 218593 215953 213709
57579 213709 212027 210771 209488 207689 205322 202845 200736 199030 197374 195441 193229 191051 189203 187694
$$ packed form
57674D69788M2500N0109N9111O8953P8666Q7692R5662J01143J01460R4618Q1297
57663A330999O4204M5191K3418l306l5123o8030r5289j11468j15573j10597j00525
57652H23901q8237p5585o3994n4100m5582l8072l1891k7294k3604j9956j6493
57641C39093j3944j2265j0669q952p761p363o993n913m456l501l263l187k872
57628B47954k623k852l276l100k152j384j682k466k277q96J61k57j299j447p01
57613B21703l01o77r42m08N38J253J613J695J457J027P40O55N67M95N62M82j37
57596B30322q73q30k1N01J89k56j38J20k09r39j367j433j651k188k634k640k244
57579B13709j682j256j283j799k367k477k109j706j656j933k212k178j848j509
$$ plain form
57565 187694 186380 185258 184369 183410 181992 180473 179961 181001 182637 183365 182753 181611 180829 180727 181417 182969
57549 182969 185076 187151 188937 190608 192192 193449 194433 195577 197045 198511 199854 201504 203758 206224
57535 206224 208448 210664 213382 216437 219031 220679 221675 222615 223840 225394 227155 228795 229842 230065 229770
57520 229770 229604 229977 230701 231211 231103 230462 229670 228995 228433 227972 227846 228411 229685 231062 231648 231069 229872 228967
57502 228967 228633 228294 227315 225750 224165 222887 221672 220022 217721 215151 213167 212484 213046 214078 214770 214771
57486 214771 214070 212846 211543 210650 210132 209469 208485 207633 207025 205824 203344 200365 198412 197849 197592 196781 195834
57469 195834 195534 195828 196035 195751 195056 194211 193565 193532 194261 195467 196856 198545 200813 203584 206345 208604 210352
57452 210352 212187 214858 218441 221950 224126 224654 224344 224145 224399 225117 226396 228248 230372 232472 234574
$$ packed form
57565A87694j314j122q89r59j418j519n12J040J636P28o12j142p82j02O90J552
57549A82969K107K075J786J671J584J257R84J144J468J466J343J650K254K466
57535B06224K224K216K718L055K594J648R96R40J225J554J761J640J047K23k95
57520B29770j66L73P24N10j08o41p92o75n62m61j26N65J274J377N86n79j197r05
57502B28967l34l39r79j565j585j278j215j650k301k570j984o83N62J032O92J
57486B14771p01j224j303q93n18o63r84q52o08j201k480k979j953n63k57q11r47
57469A95834l00K94K07k84o95q45o46l3P29J206J389J689K268K771K761K259J748
57452B10352J835K671L583L509K176N28l10j99K54P18J279J852K124K100K102
$$ plain form
57437 234574 236824 239205 241631 244008 246005 247126 247302 247137 247269 247762 248421 249370 250801 252427 253698 254527
57421 254527 255308 256195 256804 256788 256437 256516 257652 259892 262640 264978 266282 266717 267013 267744 268952 270477 272353
57404 272353 274625 277030 279223 281356 283940 286921 289279 290036 289512 289042 289506 290742 292503 295139 298773
57389 298773 302480 305135 306809 308539 310901 313657 316735 320532 324952 329059 332248 335202 339075 344077
57375 344077 349343 353906 357437 360241 362937 365972 369194 372102 374601 377167 380078 383026 385851 389162
57361 389162 393694 399319 405178 410557 415252 419376 423306 427562 432191 436485 439873 442939 446950 452421
57347 452421 458663 464730 470272 475429 480455 485627 491084 496559 501600 506165 510677 515429 520242 524830
57333 524830 529241 533821 538952 544809 551137 557345 563096 568759 574904 581440 587760 593694 599722 606119
$$ packed form
57437B34574K250K381K426K377J997J121J76j65J32M93O59R49J431J626J271Q29
57421B54527P81Q87O09j6l51P9J136K240K748K338J304M35K96P31J208J525J876
57404B72353K272K405K193K133K584K981K358P57n24m70M64J236J761K636L634
57389B98773L707K655J674J730K362K756L078L797M420M107L189K954L873N002
57375C44077N266M563L531K804K696L035L222K908K499K566K911K948K825L311
57361C89162M532N625N859N379M695M124L930M256M629M294L388L066M011N471
57347D52421O242O067N542N157N026N172N457N475N041M565M512M752M813M588
57333E24830M411M580N131N857O328O208N751N663O145O536O320N934O028O397
$$ plain form
57319 606119 612546 618838 625620 633562 642369 651052 659101 666897 675053 683808 693132 703002 713346 723924
57305 723924 734461 744873 755311 766038 777274 789070 801333 814008 827171 840864 854914
57294 854914 869091 883416 898118 913232 928435 943445 958481 974092 990559 1007715 1025464
57283 1025464 1044182 1064333 1085814 1108027 1130619 1153747 1177525 1201592 1225490 1249130 1272468
57272 1272468 1294987 1316021 1335691 1355102 1375528 1397648 1421577 1447168 1474027 1501575 1529404
57261 1529404 1557447 1585605 1613396 1640202 1665641 1689471 1711291 1730802 1748358 1764929 1781483
57250 1781483 1798585 1816577 1835819 1856644 1879287 1903926 1930480 1958347 1986666 2015104 2044030
57239 2044030 2073661 2103361 2132232 2160199 2188028 2216364 2245293 2274857 2305388 2337104 2369880
$$ packed form
57319F06119O427O292O782P942Q807Q683Q049P796Q156Q755R324R870J0344J0578
57305G23924J0537J0412J0438J0727J1236J1796J2263J2675J3163J3693J4050
57294H54914J4177J4325J4702J5114J5203J5010J5036J5611J6467J7156J7749
57283A025464J8718K0151K1481K2213K2592K3128K3778K4067K3898K3640K3338
57272A272468K2519K1034J9670J9411K0426K2120K3929K5591K6859K7548K7829
57261A529404K8043K8158K7791K6806K5439K3830K1820J9511J7556J6571J6554
57250A781483J7102J7992J9242K0825K2643K4639K6554K7867K8319K8438K8926
57239B044030K9631K9700K8871K7967K7829K8336K8929K9564L0531L1716L2776
$$ plain form
57228 2369880 2403724 2439093 2476382 2515499 2556325 2599223 2644518 2691647 2739424 2787129 2834840
57217 2834840 2882656 2930142 2976780 3022621 3068237 3114201 3160801 3208109 3256152 3304981 3354639
57206 3354639 3405055 3456127 3508017 3561121 3615530 3670616 3725441 3779507 3832858 3885665 3938134
57195 3938134 3990725 4044005 4098231 4153411 4209766 4267671 4327176 4388050 4450403 4514758 4581391
57184 4581391 4650006 4720225 4791894 4864608 4937365 5009038 5078918 5146565 5211518 5273562 5333103
57173 5333103 5390919 5447578 5503265 5558046 5612112 5665815 5719470 5773039 5826092 5878350 5930135
57162 5930135 5981854 6033029 6082321 6128620 6171701 6211700 6248468 6281712 6311462 6338187 6362733
57151 6362733 6386251 6409878 6434438 6460689 6489560 6521438 6555395 6590119 6625806 6664079 6705412
$$ packed form
57228B369880L3844L5369L7289L9117M0826M2898M5295M7129M7777M7705M7711
57217B834840M7816M7486M6638M5841M5616M5964M6600M7308M8043M8829M9658
57206C354639N0416N1072N1890N3104N4409N5086N4825N4066N3351N2807N2469
57195C938134N2591N3280N4226N5180N6355N7905N9505O0874O2353O4355O6633
57184D581391O8615P0219P1669P2714P2757P1673O9880O7647O4953O2044N9541
57173E333103N7816N6659N5687N4781N4066N3703N3655N3569N3053N2258N1785
57162E930135N1719N1175M9292M6299M3081L9999L6768L3244K9750K6725K4546
57151F362733K3518K3627K4560K6251K8871L1878L3957L4724L5687L8273M1333
$$ plain form
57140 6705412 6747342 6785859 6818065 6843083 6861128 6872460 6876896 6873736 6862383 6843388 6818594 6790127
57128 6790127 6759871 6730137 6703872 6683499 6670022 6663660 6664564 6672388 6686049 6704875 6729593 6761503
57116 6761503 6801108 6847944 6901110 6959480 7022430 7091377 7170191 7263753 7377032 7516016 7688015
57105 7688015 7899694 8155670 8460216 8819681 9242821 9740809 10329353 11030657 11872440
57096 11872440 12886012 14105867 15568362 17307120 19348718 21712374 24410275 27444726
57088 27444726 30805623 34472264 38415397 42596344 46969983 51492821 56115958 60744813
57080 60744813 65188728 69153677 72301977 74344886 75116147 74603528 72939408 70351196
57072 70351196 67082072 63321526 59189310 54772432 50170364 45509710 40929020 36555615
$$ packed form
57140F705412M1930L8517L2206K5018J8045J1332M436l160j1353j8995k4794k8467
57128F790127l0256k9734k6265k0373j3477o362R04P824J3661J8826K4718L1910
57116F761503L9605M6836N3166N8370O2950O8947P8814R3562J13279J38984J71999
57105G688015K11679K55976L04546L59465M23140M97988N88544P01304Q41783
57096A1872440J013572J219855J462495J738758K041598K363656K697901L034451
57088B7444726L360897L666641L943133M180947M373639M522838M623137M628855
57080F0744813M443915L964949L148300K042909P71261n12619j664120k588212
57072G0351196l269124l760546m132216m416878m602068m660654m580690m373405
$$ plain form
57064 36555615 32487793 28785223 25469738 22535759 19962378 17720163 15774617 14090510
57056 14090510 12635454 11379697 10294570 9353365 8533320 7815572 7183922 6624737 6127180
57047 6127180 5682115 5281277 4918335 4589679 4292635 4023081 3775751 3546362 3332450
57038 3332450 3132623 2946219 2773552 2615409 2471990 2342598 2226026 2120807 2025543 1939629
57028 1939629 1863439 1797363 1741047 1693878 1655598 1626012 1604824 1592573 1591144 1602482 1626960
57017 1626960 1663299 1709134 1760719 1812970 1861321 1903272 1936533 1955432 1950849 1915143 1847412
57006 1847412 1754256 1646310 1534137 1425776 1326046 1236997 1158910 1091159 1032622 982009 938294
56995 938294 900867 869195 842483 819837 800717 785069 772938 763992 757469 752618 749070 746706
$$ packed form
57064C6555615m067822l702570l315485k933979k573381k242215j945546j684107
57056A4090510j455056j255757j085127r41205q20045p17748o31650n59185m97557
57047F127180m45065m00838l62942l28656k97044k69554k47330k29389k13912
57038C332450j99827j86404j72667j58143j43419j29392j16572j05219r5264q5914
57028A939629p6190o6076n6316m7169l8280k9586k1188j2251j429J1338K4478
57017A626960L6339M5835N1585N2251M8351M1951L3261J8899m583l5706o7731
57006A847412r3156j07946j12173j08361r9730q9049p8087o7751n8537n0613m3715
56995I38294l7427l1672k6712k2646j9120j5648j2131q946o523m851l548k364
$$ plain form
56983 746706 745263 744229 743019 741054 737692 732323 724535 714041 700603 684401 666419 648073 630454
56970 630454 614276 600359 589486 581669 576218 572760 571563 572666 575546 580227 587889 599415 613611
56957 613611 627747 639726 649122 656299 661322 663650 662163 655365 642369 624003 602577 580426 559108
56944 559108 539901 524160 512600 504762 499794 497578 498722 503666 512287 524315 539635 558025 578757
56931 578757 600581 621981 641499 657967 670560 678536 680820 675939 662644 640914 612541 580639
56919 580639 548329 517623 489323 463742 441341 422698 407992 396674 387742 380348 374077 368671
56907 368671 363781 359260 355545 353298 352589 352831 353677 355550 359051 364259 370982 379350 389595 401405
56893 401405 414131 427614 442349 458768 476879 496684 518312 541296 564084 584726 601990
$$ packed form
56983G46706j443j034j210j965l362n369p788j0494j3438j6202j7982j8346j7619
56970F30454j6178j3917j0873p817n451l458j197J103K880M681P662J1526J4196
56957F13611J4136J1979R396P177N023K328j487o798j2996j8366k1426k2151k1318
56944E59108j9207j5741j1560p838m968k216J144M944Q621J2028J5320J8390K0732
56931E78757K1824K1400J9518J6468J2593P976K284m881j3295k1730k8373l1902
56919E80639l2310l0706k8300k5581k2401j8643j4706j1318q932p394o271n406
56907C68671m890m521l715k247p09K42Q46J873L501N208O723Q368J0245J1810
56893D01405J2726J3483J4735J6419J8111J9805K1628K2984K2788K0642J7264
$$ plain form
56882 601990 615576 625409 631100 632057 627880 618686 605345 589520 573365 558940 547674 540145 536266
56869 536266 535887 539375 547541 560991 579770 603806 633450 669145 710445 755501 801464 845268
56857 845268 884244 916459 940685 955793 960075 951586 929726 896659 856991 815891 777374 743981
56845 743981 717413 699037 689823 690206 700279 720122 749834 789318 838222 896154 962525 1035628
56833 1035628 1111666 1185101 1250522 1304426 1345098 1370758 1378103 1363045 1323403 1261438 1184123
56822 1184123 1100722 1019406 945339 881136 828273 787599 758944 741259 733707 736407 749755 773202
56810 773202 805133 843834 887945 935610 983486 1027302 1063665 1091044 1108579 1114067 1103755 1074721
56798 1074721 1027612 967117 899983 832628 769897 714854 668920 632230 604224 584160 571344
$$ packed form
56882F01990J3586R833N691R57m177r194j3341j5825j6155j4425j1266p529l879
56869E36266l79L488Q166J3450J8779K4036K9644L5695M1300M5056M5963M3804
56857H45268L8976L2215K4226J5108M282q489k1860l3067l9668m1100l8517l3393
56845G43981k6568j8376r214L83J0073J9843K9712L9484M8904N7932O6371P3103
56833A035628P6038P3435O5421N3904M0672K5660P345j5058l9642o1965p7315
56822A184123q3401q1316p4067o4203n2863m0674k8655j7685p552K700J3348K3447
56810G73202L1931L8701M4111M7665M7876M3816L6363K7379J7535N488j0312k9034
56798A074721m7109o0495o7134o7355o2731n5043m5934l6690k8006k0064j2816
$$ plain form
56787 571344 565220 565409 571549 583075 599242 619196 641634 664423 685057 701821 714165 721661
56775 721661 722840 715428 697789 670132 634663 594825 554090 514957 478782 446328 418081 393947
56763 393947 373155 354887 338882 325196 313676 303997 296024 289687 284556 279881 275096 270190 265645
56750 265645 262056 259568 257598 255380 252878 250694 248951 246947 244286 241665 239841 238428 236645 234847
56736 234847 234201 234844 235401 234581 232497 230183 228500 227709 227472 227032 225942 224816 224767 225938 227275 227961 228357
56719 228357 229125 230169 231018 231764 232916 234566 236231 237408 237999 238311 238841 239823 240877 241378 241210 240761 240200
56702 240200 239392 238652 238726 239608 240062 238968 236607 234006 231600 229254 227198 226001 225756 225942 226073 225925 225303
56685 225303 224183 223001 222215 221685 221004 220263 219886 219843 219777 219845 220617 222012 223111 223334 223119 223060 223038 222761 222650
$$ packed form
56787E71344o124J89O140J1526J6167J9954K2438K2789K0634J6764J2344P496
56775G21661J179p412j7639k7657l5469l9838m0735l9133l6175l2454k8247k4134
56763C93947k0792j8268j6005j3686j1520r679p973o337n131m675m785m906m545
56750B65645l589k488j970k218k502k184j743k004k661k621j824j413j783j798
56736B34847o46O43N57q20k084k314j683p91k37m40j090j126m9J171J337O86L96
56719B28357P68J044Q49P46J152J650J665J177N91L12N30R82J054N01j68m49n61
56702B40200q08p40P4Q82M54j094k361k601k406k346k056j197k45J86J31j48o22
56685B25303j120j182p86n30o81p41l77m3o6O8P72J395J099K23k15n9k2k77j11
$$ plain form
56666 222650 223489 225339 227391 228860 229613 229913 229993 229973 229875 229539 228786 227824 227313 227738 228858 230068 231277 233040
56648 233040 235631 238335 240054 240530 240613 241333 243054 245549 248505 251750 255231 258975 263006 267280 271842
56633 271842 276882 282284 287151 290370 291847 292680 293897 295497 297049 298599 300330 301746 301998 300927 299194
56618 299194 297409 295695 294109 292849 291867 290781 289404 288004 286801 285563 284015 282459 281613 281832 282675
56603 282675 283289 283159 282416 281447 280375 279061 277491 275836 274092 272053 269837 268104 267403 267511 267674 267355
56587 267355 266459 265106 263584 262456 262247 262933 263970 264846 265443 265936 266571 267471 268545 269660 270996 272949
56571 272949 275515 278145 280556 283397 287645 293568 300767 308980 318208 328221 338670 349757 362088
56558 362088 375678 389727 403640 417585 431648 445009 456668 466711 476226 485928 495346 503378
$$ packed form
56666B22650Q39J850K052J469P53L00Q0k0r8l36p53r62n11M25J120J210J209J763
56648B33040K591K704J719M76Q3P20J721K495K956L245L481L744M031M274M562
56633B71842N040N402M867L219J477Q33J217J600J552J550J731J416K52j071j733
56618B99194j785j714j586j260r82j086j377j400j203j238j548j556q46K19Q43
56603B82675O14j30p43r69j072j314j570j655j744k039k216j733p01J08J63l19
56587B67355q96j353j522j128k09O86J037Q76N97M93O35R00J074J115J336J953
56571B72949K566K630K411K841M248N923P199Q213R228J0013J0449J1087J2331
56558C62088J3590J4049J3913J3945J4063J3361J1659J0043R515R702R418Q032
$$ plain form
56546 503378 509237 512744 514146 514044 513321 512634 511731 509516 505038 498360 490210 480990 470576 459118 447404
56531 447404 436021 424609 412462 399648 386955 374901 363441 352710 343366 335790 329383 323176
56519 323176 317014 311713 308019 305709 303924 302194 300768 299917 299259 298206 296841 295861 295576 295496 295088 294479
56503 294479 294071 293947 294071 294651 295724 296656 296734 296158 295830 296132 296423 295852 294253 292164 290326 289204 288654
56486 288654 288038 286979 285934 285634 286019 286247 285773 284902 284100 283319 282322 281282 280646 280572 280796 281064 281420 282056
56468 282056 282925 283682 284068 284235 284415 284347 283594 282571 282583 284296 286637 287910 287697 286955 286545 286563 287002 288064
56450 288064 289589 290990 292042 293084 294180 294777 294540 293918 293523 293480 293707 294282 295141 295910 296416 296918 297522
56433 297522 297897 297983 298424 299771 301678 303461 305009 306546 307874 308577 308816 309218 309987 310691 311017 311247 311840
$$ packed form
56546E03378N859L507J402j02p23o87r03k215m478o678q150r220j0414j1458j1714
56531D47404j1383j1412j2147j2814j2693j2054j1460j0731r344p576o407o207
56519C23176o162n301l694k310j785j730j426q51o58j053j365r80k85q0m08o09
56503B94479m08j24J24N80J073R32P8n76l28L02K91n71j599k089j838j122n50
56486B88654o16j059j045l00L85K28m74q71q02p81r97j040o36p4K24K68L56O36
56468B82056Q69P57L86J67J80o8p53j023J2J713K341J273k13p42m10J8M39J062
56450B88064J525J401J052J042J096N97k37o22l95m3K27N75Q59P69N06N02O04
56433B97522L75Q6M41J347J907J783J548J537J328P03K39M02P69P04L26K30N93
$$ plain form
56416 311840 312869 313921 314368 313736 312098 310113 308494 307475 306887 306563 306389 306183 305925 306005 306871 308407 310059
56399 310059 311539 313015 314501 315479 315457 314670 313916 313692 313788 313777 313679 313925 314781 316059 317415 318640 319538 319858
56381 319858 319709 319800 320828 322625 324346 325506 326414 327515 328792 330063 331440 333113 334928 336534 337808
56366 337808 338882 339906 341058 342608 344666 346851 348456 348999 348501 347305 345798 344302 343098 342443 342521
56351 342521 343349 344722 346355 348052 349692 351137 352347 353483 354671 355718 356406 357092 358544 360915 363258
56336 363258 364488 364721 365232 367014 369720 372185 373704 374498 375091 375716 376483 377665 379263 380553 380648 379635
56320 379635 378642 378639 379705 381534 383965 386586 388517 389301 389596 390356 391645 392875 393774 394391 394538 394173 394146
56303 394146 395563 398426 401773 405137 408866 412942 416578 419323 421651 423980 425962 427219 428016 428677 429034
$$ packed form
56416C11840J029J052M47o32j638j985j619j019n88l24j74k06k58Q0Q66J536J652
56399C10059J480J476J486R78k2p87p54k24R6j1r8K46Q56J278J356J225Q98L20
56381C19858j49R1J028J797J721J160R08J101J277J271J377J673J815J606J274
56366C37808J074J024J152J550K058K185J605N43m98j196j507j496j204o55P8
56351C42521Q28J373J633J697J640J445J210J136J188J047O88O86J452K371K343
56336C63258J230K33N11J782K706K465J519P94N93O25P67J182J598J290R5j013
56320C79635r93lJ066J829K431K621J931P84K95P60J289J230Q99O17J47l65k7
56303C94146J417K863L347L364L729M076L636K745K328K329J982J257P97O61L57
$$ plain form
56288 429034 429122 429783 431884 435227 438885 442408 446204 450835 456284 461846 466702 470778 475011 480310 486335
56273 486335 491918 496648 501282 506528 512410 519139 527552 537983 549569 561445 573941 587840 603063
56260 603063 619039 635908 654439 675064 697829 723054 751155 781909 814691 849481 886986
56249 886986 927760 971738 1018611 1068030 1119345 1171698 1224489 1277335 1329454 1379443 1425836
56238 1425836 1467623 1504074 1534282 1557109 1571697 1577967 1576463 1567581 1551170 1527239 1496836 1461669
56226 1461669 1422882 1380821 1336091 1290157 1244591 1200255 1157423 1116120 1076061 1036911 999056
56215 999056 963643 931495 902442 875950 851778 829646 808984 789525 771639 755572 740878
56204 740878 727125 714597 703753 694447 686195 678776 672099 665980 660534 656266 653308 651092 649213
$$ packed form
56288D29034Q8O61K101L343L658L523L796M631N449N562M856M076M233N299O025
56273D86335N583M730M634N246N882O729Q413J0431J1586J1876J2496J3899J5223
56260F03063J5976J6869J8531K0625K2765K5225K8101L0754L2782L4790L7505
56249H86986M0774M3978M6873M9419N1315N2353N2791N2846N2119M9989M6393
56238A425836M1787L6451L0208K2827J4588O270j504q882j6411k3931l0403l5167
56226A461669l8787m2061m4730m5934m5566m4336m2832m1303m0059l9150l7855
56215I99056l5413l2148k9053k6492k4172k2132k0662j9459j7886j6067j4694
56204G40878j3753j2528j0844r306q252p419o677o119n446m268k958k216j879
$$ plain form
56191 649213 647957 647513 647411 647372 647915 649357 650996 652173 653452 655664 658351 660208 660764 660584 660239 660076
56175 660076 660765 662944 666282 669763 672833 675650 678500 681824 686561 693498 702182 711174 719390 726717
56161 726717 733609 740745 748852 758198 768359 778981 790405 803020 816548 830722 846181 863874
56149 863874 883930 905932 929905 956276 985361 1017720 1054494 1096476 1143491 1195768 1255336
56138 1255336 1324780 1405051 1495826 1597529 1711254 1836535 1970545 2109619 2250474 2389946
56128 2389946 2524922 2652805 2771184 2877119 2968050 3043697 3106010 3157101 3198074 3229643
56118 3229643 3252336 3265574 3267593 3256794 3232549 3194727 3143572 3080328 3006974 2924779 2833641
56107 2833641 2732925 2622376 2502512 2375268 2244506 2115118 1991419 1876677 1773429
$$ packed form
56191F49213j256m44j02l9N43J442J639J177J279K212K687J857N56j80l45j63
56175F60076O89K179L338L481L070K817K850L324M737O937Q684Q992Q216P327
56161G26717O892P136Q107R346J0161J0622J1424J2615J3528J4174J5459J7693
56149H63874K0056K2002K3973K6371K9085L2359L6774M1982M7015N2277N9568
56138A255336O9444Q0271R0775J01703J13725J25281J34010J39074J40855J39472
56128B389946J34976J27883J18379J05935R0931P5647O2313N1091M0973L1569
56118C229643K2693J3238K019j0799k4245l7822n1155o3244p3354q2195r1138
56107B833641j00716j10549j19864j27244j30762j29388j23699j14742j03248
$$ plain form
56098 1773429 1682924 1604464 1536609 1478965 1431629 1393223 1361113 1333718 1311093 1293039 1278216
56087 1278216 1265657 1255732 1248997 1245231 1244097 1245607 1249386 1254510 1260539 1267733 1276010 1284835 1294435 1305857
56073 1305857 1319257 1333379 1347346 1361855 1377925 1395491 1413910 1432873 1452076 1470761 1488310
56062 1488310 1504711 1520008 1533991 1546741 1558763 1570265 1581102 1591686 1603042 1615611 1628855
56051 1628855 1642340 1656367 1671222 1686724 1702916 1720438 1739914 1761570 1785483 1811382 1838264
56040 1838264 1865166 1892329 1920693 1950458 1981331 2013943 2049527 2088056 2128135 2168923 2210854
56029 2210854 2254339 2299209 2345577 2393862 2443718 2494396 2546383 2601162 2659127 2719194 2780635
56018 2780635 2843740 2908496 2974362 3041711 3111843 3185241 3261405 3340605 3423942 3511449 3602108
$$ packed form
56098A773429r0505p8460o7855n7644m7336l8406l2110k7395k2625j8054j4823
56087A278216j2559r925o735l766j134J510L779N124O029P194Q277Q825R600J1422
56073A305857J3400J4122J3967J4509J6070J7566J8419J8963J9203J8685J7549
56062A488310J6401J5297J3983J2750J2022J1502J0837J0584J1356J2569J3244
56051A628855J3485J4027J4855J5502J6192J7522J9476K1656K3913K5899K6882
56040A838264K6902K7163K8364K9765L0873L2612L5584L8529M0079M0788M1931
56029B210854M3485M4870M6368M8285M9856N0678N1987N4779N7965O0067O1441
56018B780635O3105O4756O5866O7349P0132P3398P6164P9200Q3337Q7507R0659
$$ plain form
56007 3602108 3696162 3795428 3900812 4011504 4127181 4249000 4377812 4513339 4655772 4806184
55997 4806184 4964666 5130041 5302087 5482202 5671432 5870049 6079502 6302417 6539875
55988 6539875 6791055 7056327 7338429 7639957 7962103 8306650 8676650 9074392 9501397
55979 9501397 9961309 10460151 11002862 11592423 12233398 12933562 13701264 14544420 15473563
55970 15473563 16503245 17649742 18930967 20370409 21998808 23851970 25971937 28413934
55962 28413934 31251862 34579148 38511542 43194436 48805877 55548363 63636319 73293200
55954 73293200 84763016 98320839 114254835 132813161 154144056 178233722 204766256
55947 204766256 232861600 260890553 286734086 308529686 325305344 336781456 342450308
$$ packed form
56007C602108R4054R9266J05384J10692J15677J21819J28812J35527J42433J50412
55997D806184J58482J65375J72046J80115J89230J98617K09453K22915K37458
55988F539875K51180K65272K82102L01528L22146L44547L70000L97742M27005
55979I501397M59912M98842N42711N89561O40975P00164P67702Q43156R29143
55970A5473563J029682J146497J281225J439442J628399J853162K119967K441997
55962B8413934K837928L327286L932394M682894N611441O742486Q087956R656881
55954G3293200J1469816J3557823J5933996J8558326K1330895K4089666K6532534
55947B04766256K8095344K8028953K5843533K1795600J6775658J1476112N668852
$$ plain form
55940 342450308 340984067 330832451 311596247 284865760 253748450 221586686 190922899
55933 190922899 163217267 139065216 118498972 101224353 86809700 74812761 64825971
55926 64825971 56483980 49479051 43570691 38568721 34312500 30670056 27540974 24844551
55918 24844551 22507730 20468399 18680579 17107419 15713733 14470022 13356945 12359463
55910 12359463 11460830 10646356 9907522 9237466 8626560 8066312 7553248 7084982 6656134
55901 6656134 6261459 5899170 5567815 5263305 4982051 4723614 4487307 4269370 4066358
55892 4066358 3878329 3706009 3547691 3401434 3267360 3145198 3032418 2927410 2831909 2747737
55882 2747737 2673551 2607334 2549761 2502472 2464937 2435443 2413369 2398133 2387322 2377788 2367270
$$ packed form
55940C42450308j466241j0151616j9236204k6730487l1117310l2161764l0663787
55933A90922899k7705632k4152051k0566244j7274619j4414653j1996939r986790
55926F4825971q341991p004929n908360n001970m256221l642444l129082k696423
55918B4844551k336821k039331j787820j573160j393686j243711j113077r97482
55910A2359463q98633q14474p38834o70056o10906n60248n13064m68266m28848
55901F656134l94675l62289l31355l04510k81254k58437k36307k17937k03012
55892D066358j88029j72320j58318j46257j34074j22162j12780j05008r5501q4172
55882B747737p4186o6217n7573m7289l7535k9494k2074j5236j0811r534j0518
$$ plain form
55871 2367270 2353456 2333222 2304479 2267160 2220904 2163553 2093669 2013084 1925693 1835337 1745972
55860 1745972 1661626 1584196 1512693 1446084 1385342 1331480 1283445 1239582 1199565 1163377 1129954
55849 1129954 1098420 1069099 1041891 1015231 988142 961819 937659 915230 893605 873057 853838
55838 853838 834853 815296 796225 778885 762840 747350 733130 720924 709683 698064 686592
55827 686592 676473 667391 658380 649894 643022 637380 631618 625428 619339 613148 606270 599194 593068 588336
55813 588336 585029 583646 584225 585244 585165 584681 585913 589762 595439 602122 609572 617331 624734 631540 637383
55798 637383 640900 640631 636611 629988 621379 610598 597626 582777 566362 549264 533394 520347 509936
55785 509936 501064 493554 487909 483823 480393 477597 476141 475845 475433 474029 471982 470249 469839 471684 476007
$$ packed form
55871B367270j3814k0234k8743l7319m6256n7351o9884q0585q7391r0356q9365
55860A745972q4346p7430p1503o6609o0742n3862m8035m3863m0017l6188l3423
55849A129954l1534k9321k7208k6660k7089k6323k4160k2429k1625k0548j9219
55838H53838j8985j9557j9071j7340j6045j5490j4220j2206j1241j1619j1472
55827F86592j0119r082r011q486o872n642n762o190o089o191o878p076o126m732
55813E88336l307j383N79J019p9m84J232L849N677O683P450P759P403O806N843
55798F37383L517k69m020o623q609j0781j2972j4849j6415j7098j5870j3047j0411
55785E09936q872p510n645m086l430k796j456k96m12j404k047j733m10J845M323
$$ plain form
55770 476007 481765 487460 492409 496661 500094 502398 503416 502561 498436 490222 479198 467757 457131 447126
55756 447126 437699 429385 422082 414671 406192 396625 386489 376415 367035 358388 349502 339389 328465
55743 328465 318206 309534 302305 296159 290850 285834 280634 275770 272403 270855 270201 269391 268057 266220
55729 266220 264065 262125 260905 260133 258991 257092 254550 251213 246721 241521 236985 234175 232950 232409 231758
55714 231758 230780 230003 230389 232361 235263 238236 241301 244763 247950 249676 249968 250215 251324 252678 253236 252755
55698 252755 251458 249242 245811 241169 235550 229282 222965 217392 213007 209725 207419 206149 205845 206245 207318
55683 207318 209255 211894 214641 217230 220068 223491 227070 230023 232128 233867 235719 237479 238343 237742 236116
55668 236116 234652 234107 234192 234319 234555 235390 236906 238824 241158 244192 247876 251837 255994 260502 265056 268793
$$ packed form
55770D76007N758N695M949M252L433K304J018q55m125q214j1024j1441j0626j0005
55756D47126r427q314p303p411q479r567j0136j0074r380q647q886j0113j0924
55743C28465j0259q672p229o146n309n016n200m864l367j548o54q10j334j837
55729B66220k155j940j220p72j142j899k542l337m492n200m536k810j225n41o51
55714B31758r78p77L86J972K902K973L065L462L187J726K92K47J109J354N58m81
55698B52755j297k216l431m642n619o268o317n573m385l282k306j270l04M00J073
55683B07318J937K639K747K589K838L423L579K953K105J739J852J760Q64o01j626
55668B36116j464n45Q5J27K36Q35J516J918K334L034L684L961M157M508M554L737
$$ plain form
55652 268793 271055 271853 271493 270124 267684 263954 258721 252261 245494 239192 233146 226636 219623 212831 206761
55637 206761 201276 196257 191990 188690 186156 184037 182039 179853 177371 175051 173463 172387 170926 168700
55623 168700 166332 164527 163167 161668 159819 158001 156767 156413 156692 156893 156468 155542 154522 153338 151641
55608 151641 149665 148171 147354 146453 144845 143034 142128 142607 143905 144984 145085 144157 142799 141655 140782 139747
55592 139747 138363 137000 136127 135791 135695 135584 135506 135836 136950 138668 140212 141088 141793 143216 145477 147947 150265
55575 150265 152675 155280 157684 159642 161509 163755 166489 169731 173703 178443 183418 187821 191092 193042
55561 193042 193750 193501 192647 191354 189616 187432 184732 181257 176969 172470 168540 165229 161986 158718 156100
55546 156100 154605 153834 153190 152724 152869 153687 154804 155918 156974 157932 158589 158673 158066 157027 156117 155708 155608
$$ packed form
55652B68793K262P98l60j369k440l730n233o460o767o302o046o510p013o792o070
55637B06761n485n019m267l300k534k119j998k186k482k320j588j076j461k226
55623A68700k368j805j360j499j849j818j234l54K79K01m25r26j020j184j697
55608A51641j976j494q17r01j608j811r06M79J298J079J01r28j358j144q73j035
55592A39747j384j363q73l36r6j11p8L30J114J718J544Q76P05J423K261K470K318
55575A50265K410K605K404J958J867K246K734L242L972M740M975M403L271J950
55561A93042P08k49q54j293j738k184k700l475m288m499l930l311l243l268k618
55546A56100j495p71o44m66J45Q18J117J114J056R58O57Q4o07j039r10m09j00
$$ plain form
55529 155608 155337 154624 153389 151493 149003 146512 144623 143134 141338 139168 137411 136689 136780 137113 137331 137201
55513 137201 136492 135217 133619 131817 129892 128280 127409 126940 126073 124772 123823 123444 122698 120768 118046 115394
55497 115394 113031 110745 108602 106747 104976 103158 101694 100968 100755 100763 101245 102392 103593 104101 104164 104652 105744
55480 105744 106808 107481 108055 108683 108936 108389 107205 105929 105055 104848 105303 106186 107286 108568 109915 110922
55464 110922 111266 111089 110777 110604 110876 112010 113970 115945 117190 117974 119040 120359 121138 121042 120647 120537 120631
55447 120631 120659 120739 121149 121853 122533 122921 122980 122923 123031 123202 122818 121412 119387 117685 116797 116563 116748 117212 117472
55428 117472 116884 115498 114171 113513 113286 113186 113606 115085 117390 119803 122106 124716 127860 131095 133746
55413 133746 135517 136605 137433 138327 139331 140276 141014 141502 141631 141193 140117 138570 136711 134574 132365 130566
$$ packed form
55529A55608k71p13j235j896k490k491j889j489j796k170j757p22R1L33K18j30
55513A37201p09j275j598j802j925j612q71m69q67j301r49l79p46j930k722k652
55497A15394k363k286k143j855j771j818j464p26k13QM82J147J201N08O3M88J092
55480A05744J064O73N74O28K53n47j184j276q74k07M55Q83J100J282J347J007
55464A10922L44j77l12j73K72J134J960J975J245P84J066J319P79r6l95j10R4
55447A20631K8Q0M10P04O80L88N9n7J08J71l84j406k025j702q88k34J85M64K60
55428A17472n88j386j327o58k27j00M20J479K305K413K303K610L144L235K651
55413A33746J771J088Q28Q94J004R45P38M88J29m38j076j547j859k137k209j799
$$ plain form
55397 130566 129416 128487 127207 125752 124956 125199 125749 125511 124234 122732 121925 121934 122210 122362 122555 123045 123621 123766
55379 123766 123272 122380 121351 120270 119368 119105 119565 120081 119939 119340 119239 120238 122016 123892 125435 126427 126682
55362 126682 126305 125878 126024 126833 127882 128680 128898 128396 127358 126323 125803 125836 126099 126324 126433 126332 125921 125270
55344 125270 124597 124114 124066 124734 126041 127292 127759 127521 127291 127395 127434 127073 126644 126659 127120 127609 127789 127595 127219
55325 127219 127086 127494 128095 128128 127392 126554 126204 126122 125889 125698 126016 126845 127973 129508 131397 132722 132415 130665
55307 130665 128776 127525 126374 124509 121972 119598 118310 118599 120063 121370 121305 120150 119385 119874 120980
55292 120980 121727 122008 122159 122101 121661 121283 121581 122408 123059 123296 123578 124265 125153 125875 126368 126798 127316 127940 128539
55273 128539 128911 129038 129141 129335 129386 129033 128416 127971 127998 128547 129522 130626 131328 131238 130534 129814 129533 129745 130240
$$ packed form
55397A30566j150r29j280j455p96K43N50k38j277j502q07RK76J52J93M90N76J45
55379A23766m94q92j029j081r02k63M60N16j42n99j01R99J778J876J543R92K55
55362A26682l77m27J46Q09J049P98K18n02j038j035n20L3K63K25J09j01m11o51
55344A25270o73m83m8O68J307J251M67k38k30J04L9l61m29J5M61M89J80j94l76
55325A27219j33M08O01L3p36q38l50q2k33j91L18Q29J128J535J889J325l07j750
55307A30665j889j251j151j865k537k374j288K89J464J307o5j155p65M89J106
55292A20980P47K81J51n8m40l78K98Q27O51K37K82O87Q88P22M93M30N18O24N99
55273A28539L72J27J03J94N1l53o17m45K7N49R75J104P02r0p04p20k81K12M95
$$ plain form
55254 130240 130676 130655 129983 128941 128111 127865 128088 128383 128412 128084 127558 127060 126633 126123 125521 125187 125566 126614 127660
55235 127660 127905 127123 125888 125128 125365 126410 127753 129130 130580 132098 133474 134435 134815 134643 134261 134185 134610
55218 134610 135183 135527 135775 136206 136586 136462 135963 135670 135677 135540 135187 135065 135164 134750 133543 132345 131914 131875 131482
55199 131482 130887 130830 131402 131997 132340 132784 133604 134578 135344 135705 135662 135564 136081 137495 139124 139968 139864 139476 139237
55180 139237 138904 138181 137206 136289 135657 135600 136424 138007 139706 140866 141248 141000 140541 140507 141414 143214 145362 147323
55162 147323 148850 149830 150189 150049 149767 149814 150658 152449 154552 155709 155191 153617 152186 151237 150194 148795
55146 148795 147592 147067 146948 146736 146379 146017 145549 144938 144600 144960 145694 145886 145059 143761 142974 143101 143738 144352
55128 144352 144913 145610 146171 145973 144950 143902 143516 143476 142964 141828 140741 140301 140497 141013 141551 141845 141771 141524
$$ packed form
55254A30240M36k1o72j042q30k46K23K95K9l28n26m98m27n10o02l34L79J048J046
55235A27660K45p82j235p60K37J045J343J377J450J518J376R61L80j72l82p6M25
55218A34610N73L44K48M31L80j24m99k93Pj37l53j22R9m14j207j198m31l9l93
55199A31482n95n7N72N95L43M44Q20R74P66L61m3r8N17J414J629Q44j04l88k39
55180A39237l33p23r75r17o32n7Q24J583J699J160L82k48m59l4R07J800K148J961
55162A47323J527R80L59j40k82M7Q44J791K103J157n18j574j431r49j043j399
55146A48795j203n25j19k12l57l62m68o11l38L60P34J92q27j298p87J27O37O14
55128A44352N61O97N61j98j023j048l86m0n12j136j087m40J96N16N38K94p4k47
$$ plain form
55110 141524 141348 141182 140898 140769 141185 141917 142272 142048 141830 142163 142897 143514 143688 143308 142435 141475 141096 141680 142987
55091 142987 144413 145365 145448 144737 143972 144044 145146 146678 147998 148839 149037 148530 147788 147639 148301 149062 149225 148928
55073 148928 148720 148758 148861 148977 149205 149627 150378 151493 152438 152247 150592 148323 146530 145481 144945 145022 145902 147093
55055 147093 147719 147541 147041 146533 145864 145065 144609 144757 145206 145637 146148 146815 147259 147053 146356 145787 145793 146409 147442
55036 147442 148563 149235 149036 148170 147445 147455 147902 147974 147363 146645 146541 147042 147494 147463 147191 147181 147569 148060 148317 148295
55016 148295 148214 148282 148452 148474 148190 147704 147203 146815 146788 147555 149223 151096 152137 152013 151369 151001 151139 151671 152688
54997 152688 154435 156828 159251 160873 161253 160814 160659 161565 163122 164156 164075 163389 162804 162288 161332 159792 158185
54980 158185 157323 157866 159844 162324 163912 164031 163522 163664 164785 166204 167269 167936 168406 168760 169079 169566 170317
$$ packed form
55110A41524j76j66k84j29M16P32L55k24k18L33P34O17J74l80q73r60l79N84J307
55091A42987J426R52Q3p11p65P2J102J532J320Q41J98n07p42j49O62P61J63k97
55073A48928k08L8J03J16K28M22P51J115R45j91j655k269j793j049n36P7Q80J191
55055A47093O26j78n00n08o69p99m56J48M49M31N11O67M44k06o97n69OO16J033
55036A47442J121O72j99q66p25J0M47P2o11p18j04N01M52l1k72j0L88M91K57k2
55016A48295q1O8J70K2k84m86n01l88k7P67J668J873J041j24o44l68J38N32J017
54997A52688J747K393K423J622L80m39j55R06J557J034q1o86n85n16r56j540j607
54980A58185q62N43J978K480J588J19n09J42J121J419J065O67M70L54L19M87P51
$$ plain form
54963 170317 171182 172020 172985 174460 176727 179651 182659 185090 186655 187493 187815 187729 187459 187378 187582 187650 187149 186252
54945 186252 185584 185544 186068 186963 188145 189470 190603 191264 191635 192457 194580 198240 202871 207784 213019 219168
54929 219168 226465 234545 243217 252870 263661 274857 285492 295413 305050 314298 322200 327679 330130
54916 330130 329308 325191 318092 308607 297388 285118 272578 260428 248999 238626 229957 223423 218549
54903 218549 214352 210453 207227 204836 202832 200981 199773 199592 199883 199759 199168 198918 199690 201603 204698 209189
54887 209189 215072 221971 229782 239042 250140 262287 273860 283858 292577 300635 307859 313646 317967
54874 317967 321198 322945 321917 317295 309615 299948 288866 276798 264788 254010 244657 236062 227799
54861 227799 220036 212909 206359 200652 196303 193243 190678 188038 185493 183286 181210 179116 177300 175904
$$ packed form
54963A70317Q65Q38R65J475K267K924L008K431J565Q38L22q6k70q1K04O8n01q97
54945A86252o68m0N24Q95J182J325J133O61L71Q22K123L660M631M913N235O149
54929B19168P297Q080Q672R653J0791J1196J0635R921R637R248P902N479K451
54916C30130q22m117p099r485j1219j2270j2540j2150j1429j0373q669o534m874
54903B18549m197l899l226k391k004j851j208j81K91j24n91k50P72J913L095M491
54887B09189N883O899P811R260J1098J2147J1573R998Q719Q058P224N787M321
54874C17967L231J747j028m622p680r667j1082j2068j2010j0778r353q595q263
54861B27799p763p127o550n707m349l060k565k640k545k207k076k094j816j396
$$ plain form
54847 175904 174437 172492 170500 169162 168445 167818 167215 167024 167189 167133 166697 166488 166955 167645 167765 167113 166124 165279
54829 165279 164851 165002 165690 166521 167063 167399 168094 169485 171187 172475 173072 173428 174153 175334 176465 177060 177132
54812 177132 177038 177002 176983 176918 176842 176778 176788 177130 178039 179163 179604 178873 177597 176892 177149 177874 178618 179506 180727 182027
54792 182027 182951 183270 182930 182033 181158 181242 182644 184643 186379 187992 190284 193524 197326 201599 206828 213230
54776 213230 220333 227697 235534 244370 254470 265751 277726 289407 299858 309119 317941 326228 332468
54763 332468 335288 334978 332755 329050 323407 315775 306876 297332 287306 277179 267769 259556 252208 245164
54749 245164 238303 231842 226077 221414 218283 216751 216445 216957 218024 219271 220255 220989 222043 223848 226221
54734 226221 228828 231846 235885 241428 248532 256875 265908 275123 284352 293616 302617 310604 316896 321244
$$ packed form
54847A75904j467j945j992j338p17o27o03j91J65n6m36k09M67O90J20o52r89q45
54829A65279m28J51O88Q31N42L36O95J391J702J288N97L56P25J181J131N95P2
54812A77132r4l6j9o5p6o4J0L42R09J124M41p31j276p05K57P25P44Q88J221J300
54792A82027R24L19l40q97q75Q4J402J999J736J613K292L240L802M273N229O402
54776B13230P103P364P837Q836J0100J1281J1975J1681J0451R261Q822Q287O240
54763C32468K820l10k223l705n643p632q899r544j0026j0127r410q213p348p044
54749B45164o861o461n765m663l131j532l06N12J067J247R84P34J054J805K373
54734B26221K607L018M039N543P104Q343R033R215R229R264R001P987O292M348
$$ plain form
54720 321244 323500 323227 320062 314329 306974 298836 290191 280985 271337 261741 252810 244824 237507 230352
54706 230352 223254 216766 211662 208221 205947 203953 201666 199246 197287 196117 195489 194970 194351 193567 192570
54691 192570 191632 191434 192306 193519 193917 193281 192471 192181 192181 191974 191537 191032 190327 189292 188179 187257 186418 185553
54673 185553 184994 185018 185246 185111 184704 184536 184561 184132 182989 181652 180636 179845 179008 178256 177857 177715 177505 177143
54655 177143 176809 176671 176880 177693 179182 180832 181798 181735 181192 181047 181697 182891 184074 184742 184608 183784 182768
54638 182768 181968 181255 180249 179074 178413 178638 179242 179425 178940 177987 176618 174873 173358 172983 173928 175369 176440
54621 176440 176988 177207 177105 176787 176798 177526 178486 178786 178273 177718 177784 178289 178662 178752 178852 179167 179611 180155 181070 182601
54601 182601 184468 185949 186543 186422 186052 185630 185234 185350 186586 188629 190004 189457 187353 185298 184502 184955
$$ packed form
54720C21244K256k73l165n733p355q138q645r206r648r596q931p986p317p155
54706B30352p098o488n104l441k274j994k287k420j959j170o28n19o19p84r97
54691A92570r38j98Q72J213L98o36q10k90%k07m37n05p05j035j113r22q39q65
54673A85553n59K4K28j35m07j68K5m29j143j337j016p91q37p52l99j42k10l62
54655A77143l34j38K09Q13J489J650R66o3n43j45O50J194J183O68j34q24j016
54638A82768q00p13j006j175o61K25O04J83m85r53j369j745j515l75R45J441J071
54621A76440N48K19j02l18J1P28R60L00n13n55O6N05L73R0J00L15M44N44R15J531
54601A82601J867J481N94j21l70m22l96J16J236K043J375n47k104k055p96M53
$$ plain form
54585 184955 186074 187511 189099 190496 191320 191561 191608 191813 192122 192130 191560 190764 190674 191968 194180 195886 195997 194808
54567 194808 193646 193549 194487 195768 196846 197560 197862 197744 197514 197726 198600 199701 200436 200741 200959 201161 201021 200456
54549 200456 199983 200226 201298 202823 204293 205244 205391 204968 204706 205154 206105 207021 207864 209099 210878 212664 213863
54532 213863 214521 215197 216293 217697 218954 219584 219296 218092 216327 214657 213791 214077 215207 216417 217105 217268
54516 217268 217268 217278 217076 216392 215296 214139 213216 212506 211767 210893 210079 209531 209087 208367 207437 207019 207749 209376 211035
54497 211035 212243 213236 214248 214948 214893 214278 213782 213719 213728 213429 213096 213410 214696 216645 218774 220842 222712 224077
54479 224077 224657 224641 224711 225499 227071 228950 230595 231872 233115 234643 236216 237164 237213 236957 237168 237801 238109
54462 238109 237755 237312 237483 238265 239158 239847 240300 240468 240347 240214 240380 240671 240516 239630 238426 237624 237615 238161 238575
$$ packed form
54585A84955J119J437J588J397Q24K41M7K05L09Qn70p96r0J294K212J706J11j189
54567A94808j162r7R38J281J078P14L02j18k30K12Q74J101P35L05K18K02j40n65
54549B00456m73K43J072J525J470R51J47m23k62M48R51R16Q43J235J779J786J199
54532B13863O58O76J096J404J257O30k88j204j765j670q66K86J130J210O88J63
54516B17268%J0k02o84j096j157r23p10p39q74q14n48m44p20r30m18P30J627J659
54497B11035J208R93J012P00n5o15m96o3Rk99l33L14J286J949K129K068J870J365
54479B24077N80j6P0P88J572J879J645J277J243J528J573R48M9k56K11O33L08
54462B38109l54m43J71P82Q93O89M53J68j21j33J66K91j55q86j204q02rN46M14
$$ plain form
54443 238575 238156 236623 234240 231579 229265 227832 227495 227816 227881 227134 225944 225053 224621 224215 223715 223699 224695
54426 224695 226413 228045 229127 229775 230196 230299 229888 228951 227621 226100 224774 224240 224842 226184 227418 228091
54410 228091 228439 228738 228839 228622 228505 228927 229593 229858 229777 230086 231086 232246 233095 233823 234636 235232 235401 235583
54392 235583 236214 236918 237015 236500 235925 235531 235194 235018 235310 236008 236690 237149 237448 237499 237182 236853 237089 237781 238068
54373 238068 237303 235746 234206 233390 233563 234423 235276 235773 236360 237482 238581 238672 237869 237407 237951 238786 239020 238663
54355 238663 238029 237009 235683 234901 235211 235758 235235 233681 232382 232100 232323 232336 232120 231940 231759 231441 231009 230348
54337 230348 229051 226918 224352 222028 220385 219581 219592 220115 220681 221140 221794 222779 223594 223714 223505 223980 225532
54320 225532 227387 228553 228989 229440 230358 231521 232717 234261 236514 239209 241681 243569 244932 245800 246061
$$ packed form
54443B38575m19j533k383k661k314j433l37L21O5p47j190q91m32m06n00j6R96
54426B24695J718J632J082O48M21J03m11r37j330j521j326n34O02J342J234O73
54410B28091L48K99J01k17j17M22O66K65q1L09J000J160Q49P28Q13N96J69J82
54392B35583O31P04R7n15n75l94l37j76K92O98O82M59K99N1l17l29K36O92K87
54373B38068p65j557j540q16J73Q60Q53M97N87J122J099R1q03m62N44Q35K34l57
54355B38663o34j020j326p82L10N47n23j554j299k82K23J3k16j80j81l18m32o61
54337B30348j297k133k566k324j643q04J1N23N66M59O54R85Q15J20k09M75J552
54320B25532J855J166M36M51R18J163J196J544K253K695K472J888J363Q68K61
$$ plain form
54305 246061 245847 245536 245173 244193 242027 238883 235768 233745 233110 233102 232484 230691 228482 227148 227067 227386 227108
54288 227108 226053 224561 222911 221450 220843 221512 222949 224102 224380 223916 222999 221782 220541 219718 219543 219857
54272 219857 220439 221200 222031 222695 222974 222782 222165 221402 220971 221096 221363 221178 220593 220287 220655 221320 221778 222127 222855
54253 222855 224129 225564 226569 226722 225978 224748 223731 223445 223933 224913 226017 226802 226809 225925 224593 223474 222938
54236 222938 222995 223497 224127 224400 224097 223678 223857 224636 225173 224781 223788 223081 223009 223070 222648 221724 220783 220215 219932 219494
54216 219494 218575 217330 216239 215513 214796 213667 212328 211455 211361 211639 211766 211729 211832 212127 212290 211943 210945 209596
54198 209596 208703 209112 210755 212435 212961 212412 211836 211878 212215 212337 212241 212185 212247 212435 212803 213228 213379 213163 212831
54179 212831 212462 211681 210235 208475 206960 205851 205033 204514 204283 204089 203822 203900 204724 205893 206540 206407 206051
$$ packed form
54305B46061k14l11l63r80k166l144l115k023o35qo18j793k209j334q1L19k78
54288B27108j055j492j650j461o07O69J437J153K78m64r17j217j241q23j75L14
54272B19857N82P61Q31O64K79j92o17p63m31J25K67j85n85l06L68O65M58L49P28
54253B22855J274J435J005J53p44j230j017k86M88R80J104P85Pq84j332j119n36
54236B22938N7N02O30K73l03m19J79P79N37l92r93p07p2O1m22r24r41n68k83m38
54216B19494r19j245j091p26p17j129j339q73r4K78J27l7J03K95J63l47r98j349
54198B09596q93M09J643J680N26n49n76M2L37J22r6n6O2J88L68M25J51k16l32
54179B12831l69p81j446j760j515j109q18n19k31j94k67P8Q24J169O47j33l56
$$ plain form
54162 206051 205926 205862 205607 205359 205413 205662 205871 206216 207147 208758 210521 211719 211960 211342 210326 209589 209787 211117
54144 211117 212932 214015 213626 212292 211316 211440 212230 212851 212983 212776 212379 212022 212194 213170 214473 215379 215890
54127 215890 216616 217685 218411 218242 217514 216976 217051 217862 219548 222032 224718 226840 228110 228769 229164 229556 230181
54110 230181 231126 232083 232492 232030 230850 229364 227899 226545 225206 223815 222570 221896 222017 222597 222928 222543
54094 222543 221574 220485 219558 218743 217973 217416 217245 217301 217278 217269 217731 218694 219307 218590 216574 214392 213280 213694 215235
54075 215235 217009 218167 218466 218394 218465 218564 218371 218216 218801 220038 220949 221022 220924 221437 222330 222914 223170 223589 224176
54056 224176 224436 224265 224141 224338 224561 224527 224436 224686 225466 226750 228402 230115 231522 232506 233246 233970 234891 236357
54038 236357 238656 241609 244661 247532 250491 253852 257482 260996 264260 267517 271134 275308 279897 284446
$$ packed form
54162B06051j25o4k55k48N4K49K09L45R31J611J763J198K41o18j016p37J98J330
54144B11117J815J083l89j334r76J24P90O21J32k07l97l57J72R76J303R06N11
54127B15890P26J069P26j69p28n38P5Q11J686K484K686K122J270O59L95L92O25
54110B30181R45R57M09m62j180j486j465j354j339j391j245o74J21N80L31l85
54094B22543r69j089r27q15p70n57j71N6k3rM62R63O13p17k016k182j112M14J541
54075B15235J774J158K99p2P1R9j93j55N85J237R11P3r8N13Q93N84K56M19N87
54056B24176K60j71j24J97K23l4r1K50P80J284J652J713J407R84P40P24R21J466
54038B36357K299K953L052K871K959L361L630L514L264L257L617M174M589M549
$$ plain form
54024 284446 288490 291848 294532 296531 297980 299475 301705 304602 307219 308695 309078 309022 309031 309268 309782 310464
54008 310464 310933 310921 310708 310937 312059 314278 317920 323451 331039 340399 351124 362892 375246 387431
53994 387431 398601 408122 415633 421011 424162 424546 420952 412251 398768 382621 366426 351729 338728
53981 338728 327090 316511 306729 297615 289440 282682 277422 273260 269875 267335 265621 264235 262663 261011
53967 261011 259751 258951 258129 256925 255547 254446 253844 253741 254091 254713 255214 255263 254969 254831 255324 256576 258343
53950 258343 260160 261639 262865 264457 267057 270646 274539 278073 281188 284325 287950 292284 297265 302547
53936 302547 307605 312070 316005 319738 323441 326995 330192 332810 334470 334766 333813 332471 331707 331726 331940 331693
53920 331693 330705 328935 326605 324506 323768 324818 326853 328841 330828 333736 337971 342799 347203 350793 353696
$$ packed form
54024B84446M044L358K684J999J449J495K230K897K617J476L83n6RK37N14O82
54008C10464M69j2k13K29J122K219L642N531P588R360J0725J1768J2354J2185
53994C87431J1170R521P511N378L151L84l594q701j3483j6147j6195j4697j3001
53981C38728j1638j0579r782r114q175o758n260m162l385k540j714j386j572j652
53967B61011j260q00q22j204j378j101o02j03L50O22N01M9k94j38M93J252J767
53950B58343J817J479J226J592K600L589L893L534L115L137L625M334M981N282
53936C02547N058M465L935L733L703L554L197K618J660K96r53j342p64J9K14k47
53920C31693r88j770k330k099p38J050K035J988J987K908M235M828M404L590K903
$$ plain form
53905 353696 356130 358427 361006 363811 366084 367166 367362 367568 368203 368914 369183 368664 367057 364288 360971 358061
53889 358061 355798 353463 350453 347073 343843 340560 336702 332448 328480 324845 320833 316221 311926 308920
53875 308920 307000 305202 303122 301169 299659 298374 297137 296195 295646 294956 293556 291703 290238 289549 289185
53860 289185 288540 287517 286398 285375 284394 283267 281797 279987 278265 277232 276965 276774 275948 274647 273762 273931
53844 273931 274992 276373 277718 278978 280118 280991 281495 281761 282158 283079 284656 286742 289250 292462 296864
53829 296864 302642 309437 316665 324068 332032 341400 352887 366478 381277 395994 409588 421506 431530
53816 431530 439556 445395 448549 448256 444072 436518 426974 416830 406818 397118 387820 379202 371656 365442
53802 365442 360384 355859 351347 347029 343616 341479 340201 339072 337789 336550 335733 335625 336170 336768 336677 335904
$$ packed form
53905C53696K434K297K579K805K273J082J96K06O35P11K69n19j607k769l317k910
53889C58061k263k335l010l380l230l283l858m254l968l635m012m612m295l006
53875C08920j920j798k080j953j510j285j237r42n49o90j400j853j465o89l64
53860B89185o45j023j119j023r81j127j470j810j722j033k67j91q26j301q85J69
53844B73931J061J381J345J260J140Q73N04K66L97R21J577K086K508L212M402
53829B96864N778O795P228P403P964R368J1487J3591J4799J4717J3594J1918J0024
53816D31530Q026N839L154k93m184p554r544j0144j0012r700r298q618p546o214
53802C65442n058m525m512m318l413k137j278j129j283j239q17j08N45N98r1p73
$$ plain form
53786 335904 335450 336217 337902 339432 340307 340886 341361 341171 339833 337831 336122 334917 333472 331158 328342 325979
53770 325979 324489 323310 321592 319098 316224 313252 309981 306267 302607 299781 297968 296568 294926 292917
53756 292917 290810 288910 287460 286569 286046 285534 284976 284667 284640 284355 283346 281971 281104 281208 282050 283212 284430
53739 284430 285428 285877 285753 285447 285344 285438 285537 285626 285912 286602 287748 289210 290743 292240 293915 296073 298671
53722 298671 301329 303805 306116 308124 309360 309572 309224 309136 309753 310990 312542 314070 315280 316225 317369 318934
53706 318934 320363 321058 321586 323451 327350 332244 336611 340115 343496 347168 350731 353807 356639 359605 362683
53691 362683 365800 369311 373589 378184 381854 383695 384083 384295 385230 386688 387986 388986 390194 391828 393262
53676 393262 393690 393071 392041 391077 390182 389386 389003 389155 389425 389286 388637 387670 386496 385224 384215 383810 383796 383515
$$ packed form
53786C35904m54P67J685J530Q75N79M75j90j338k002j709j205j445k314k816k363
53770C25979j490j179j718k494k874k972l271l714l660k826j813j400j642k009
53756B92917k107j900j450q91n23n12n58l09k7k85j009j375q67J04Q42J162J218
53739B84430R98M49j24l06j03R4R9Q9K86O90J146J462J533J497J675K158K598
53722B98671K658K476K311K008J236K12l48q8O17J237J552J528J210R45J144J565
53706C18934J429O95N28J865L899M894M367L504L381L672L563L076K832K966L078
53691C62683L117L511M278M595L670J841L88K12R35J458J298J000J208J634J434
53676C93262M28o19j030r64q95p96l83J52K70j39o49r67j174j272j009m05j4k81
$$ plain form
53658 383515 382606 381354 380199 379163 378001 376715 375686 375237 375202 375034 374361 373411 372792 372820 373132 373042 372203 370815
53640 370815 369295 367948 366971 366480 366431 366650 367035 367611 368352 369145 370065 371444 373362 375236 376296 376581 377126
53623 377126 378936 382036 385727 389559 393613 397842 401710 404809 407529 410650 414347 418093 421560 425171
53609 425171 429480 434376 439241 443686 447744 451458 454829 458150 461951 466368 470888 474930 478404 481507
53595 481507 484269 486701 489128 491890 494701 496762 497674 497910 498212 498815 499460 499911 500085 499790 498785 497234
53579 497234 495770 494881 494336 493411 491695 489543 487732 486704 486107 485053 482900 479926 477183 475650 475525
53564 475525 476339 477518 478568 478888 477965 476023 474189 473612 474394 475577 476095 475597 474470 473475 473337 474381
53548 474381 476286 478306 479879 480973 481860 482799 484011 485788 488385 491859 496107 501026 506559 512674 519378
$$ packed form
53658C83515r09j252j155j036j162j286j029m49l5j68o73r50o19K8L12r0q39j388
53640C70815j520j347r77m91m9K19L85N76P41P93R20J379J918J874J060K85N45
53623C77126J810L100L691L832M054M229L868L099K720L121L697L746L467L611
53609D25171M309M896M865M445M058L714L371L321L801M417M520M042L474L103
53595D81507K762K432K427K762K811K061R12K36L02O03O45M51J74k95j005j551
53579D97234j464q89n45r25j716k152j811j028n97j054k153k974k743j533j25
53564D75525Q14J179J050L20r23j942j834n77P82J183N18m98j127r95j38J044
53548D74381J905K020J573J094Q87R39J212J777K597L474M248M919N533O115O704
$$ plain form
53533 519378 526699 534553 542792 551514 561277 572807 586393 601585 617424 633011 648000 662678
53521 662678 677610 693123 709157 725454 741710 757584 772933 788260 804660 822980 843191
53510 843191 864867 888083 913351 940683 969210 997929 1026544 1055344 1084588 1114291 1144373
53499 1144373 1174624 1204564 1233739 1262281 1290973 1320595 1351299 1382685 1414298 1445859 1477093
53488 1477093 1507584 1536976 1565247 1592682 1619602 1646171 1672361 1697925 1722379 1745228 1766460
53477 1766460 1786711 1806745 1826701 1846015 1864133 1881169 1897703 1913972 1929426 1943034 1953905
53466 1953905 1961521 1965661 1966399 1964184 1959519 1952395 1942276 1928941 1913072 1895611 1876685 1855738 1832711
53453 1832711 1808438 1783631 1758085 1731348 1703629 1675414 1646535 1616390 1585049 1553510 1522742
$$ packed form
53533E19378P321P854Q239Q722R763J1530J3586J5192J5839J5587J4989J4678
53521F62678J4932J5513J6034J6297J6256J5874J5349J5327J6400J8320K0211
53510H43191K1676K3216K5268K7332K8527K8719K8615K8800K9244K9703L0082
53499A144373L0251K9940K9175K8542K8692K9622L0704L1386L1613L1561L1234
53488A477093L0491K9392K8271K7435K6920K6569K6190K5564K4454K2849K1232
53477A766460K0251K0034J9956J9314J8118J7036J6534J6269J5454J3608J0871
53466A953905P616M140P38k215m665p124j0119j3335j5869j7461j8926k0947k3027
53453A832711k4273k4807k5546k6737k7719k8215k8879l0145l1341l1539l0768
$$ plain form
53442 1522742 1492971 1464022 1435820 1408383 1381713 1355992 1331654 1309188 1289093 1271920 1257890
53431 1257890 1246379 1236367 1227601 1220857 1216828 1215298 1215697 1217972 1222435 1229169 1238092 1249300 1262814
53418 1262814 1278261 1295312 1314234 1335464 1358810 1383633 1409759 1437671 1467794 1500018 1533900
53407 1533900 1568931 1604717 1641416 1679982 1721471 1765952 1812588 1860835 1911089 1964132 2020481
53396 2020481 2080387 2143837 2210265 2278760 2348891 2420892 2494779 2569802 2645138 2720628 2796384
53385 2796384 2872124 2947460 3022394 3096791 3169549 3239100 3304758 3366994 3426284 3482329 3534538
53374 3534538 3582706 3626912 3667248 3704023 3737830 3768805 3795898 3817310 3831749 3838999 3839224 3832032
53362 3832032 3816428 3791597 3757469 3714518 3663205 3603894 3537275 3464623 3387493 3307283 3225161
$$ packed form
53442A522742k9771k8949k8202k7437k6670k5721k4338k2466k0095j7173j4030
53431A257890j1511j0012q766o744m029j530L99K275M463O734Q923J1208J3514
53418A262814J5447J7051J8922K1230K3346K4823K6126K7912L0123L2224L3882
53407A533900L5031L5786L6699L8566M1489M4481M6636M8247N0254N3043N6349
53396B020481N9906O3450O6428O8495P0131P2001P3887P5023P5336P5490P5756
53385B796384P5740P5336P4934P4397P2758O9551O5658O2236N9290N6045N2209
53374C534538M8168M4206M0336L6775L3807L0975K7093K1412J4439P250K25p192
53362C832032j5604k4831l4128m2951n1313n9311o6619p2652p7130q0210q2122
$$ plain form
53351 3225161 3142178 3059150 2976499 2894489 2813582 2734292 2656642 2580093 2504147 2428839 2354559
53340 2354559 2281634 2210263 2140630 2072870 2007076 1943507 1882692 1825111 1770916 1720170 1673185
53329 1673185 1630245 1591092 1555064 1521859 1491828 1465408 1442481 1422401 1404336 1387453 1371163
53318 1371163 1355589 1341608 1330022 1320763 1313197 1307034 1302478 1299502 1297592 1296474 1296653 1298823 1302997
53305 1302997 1308609 1315350 1323530 1333628 1345783 1359780 1375313 1392232 1410660 1430913 1453128 1477149
53293 1477149 1502952 1531067 1562088 1595651 1630281 1664532 1698143 1731902 1766546 1801950 1837221
53282 1837221 1871379 1904047 1935600 1966549 1996608 2024627 2049716 2072222 2093214 2113071 2131036
53271 2131036 2146192 2158312 2167410 2172929 2173994 2170420 2162971 2152440 2138820 2121536 2100179 2074750
$$ packed form
53351C225161q2983q3028q2651q2010q0907p9290p7650p6549p5946p5308p4280
53340B354559p2925p1371o9633o7760o5794o3569o0815n7581n4195n0746m6985
53329A673185m2940l9153l6028l3205l0031k6420k2927k0080j8065j6883j6290
53318A371163j5574j3981j1586r259p566o163m556k976j910j118J79K170M174
53305A302997N612O741Q180J0098J2155J3997J5533J6919J8428K0253K2215K4021
53293A477149K5803K8115L1021L3563L4630L4251L3611L3759L4644L5404L5271
53282A837221L4158L2668L1553L0949L0059K8019K5089K2506K0992J9857J7965
53271B131036J5156J2120R098N519J065l574p449j0531j3620j7284k1357k5429
$$ plain form
53259 2074750 2045385 2012239 1975668 1936240 1894429 1850482 1804648 1757395 1709329 1661025 1613026
53248 1613026 1565828 1519719 1474733 1430899 1388418 1347419 1307611 1268415 1229443 1190670 1152166
53237 1152166 1113926 1076019 1038678 1002102 966308 931309 897322 864679 833644 804474 777565
53226 777565 753398 732249 714004 698217 684323 671914 660857 650966 641512 631384 620114 608637
53214 608637 598523 590250 582570 573855 563802 553473 543888 535058 526454 517931 509872 502622 496117
53201 496117 489957 483646 476813 469431 461886 454734 448431 443289 439435 436534 433724 430248 426152 422006
53187 422006 417897 413251 407876 402697 398929 396742 395220 393491 391328 388635 385026 380434 375817 372670
53173 372670 371711 372233 372866 372791 372089 371160 370166 369181 368480 368271 368264 367945 367362 367191 367788 368517 368387 367123 365293
$$ packed form
53259B074750k9365l3146l6571l9428m1811m3947m5834m7253m8066m8304m7999
53248A613026m7198m6109m4986m3834m2481m0999l9808l9196l8972l8773l8504
53237A152166l8240l7907l7341l6576l5794l4999l3987l2643l1035k9170k6909
53226G77565k4167k1149j8245j5787j3894j2409j1057r891r454j0128j1270j1477
53214F08637j0114q273p680q715j0053j0329r585q830q604q523q059p250o505
53201D96117o160o311o833p382p545p152o303n142l854k901k810l476m096m146
53187D22006m109m646n375n179l768k187j522j729k163k693l609m592m617l147
53173C72670r59N22O33p5p02r29r94r85p01k09pl19n83j71N97P29j30j264j830
$$ plain form
53154 365293 363583 362312 361487 360915 360272 359403 358555 357981 357420 356254 354224 351710 349401 347913 347566 348075
53138 348075 348562 348322 347510 346678 345807 344496 343023 342343 342756 343407 343506 343354 343572 343953 343821 343201 342889 343501
53120 343501 344987 346903 348615 349417 349124 348536 348686 349533 349898 348832 346625 344263 342283 340508 338693 337059
53104 337059 336007 335388 334385 332410 329996 328273 327493 326695 325119 323241 321786 320400 318251 315548 313362
53089 313362 312012 310792 309497 309089 310276 312330 313974 314808 315221 315455 315573 315915 316783 317851 318581 319100
53073 319100 319967 321145 321896 321789 321218 320753 320558 320599 320952 321581 322223 322772 323429 324203 324639 324355 323532 322503
53055 322503 321221 319673 318545 318730 320143 321669 322548 323212 324432 326136 327549 328180 328100 327439 326270 324987
53039 324987 324222 324180 324429 324554 324669 325048 325569 325851 325790 325715 326025 326769 327439 327164 325340 322242 318876 316108
$$ packed form
53154C65293j710j271q25n72o43q69q48n74n61j166k030k514k309j488l47N09
53138C48075M87k40q12q32q71j311j473o80M13O51R9j52K18L81j32o20l12O12
53120C43501J486J916J712Q02k93n88J50Q47L65j066k207k362j980j775j815j634
53104C37059j052o19j003j975k414j723p80p98j576j878j455j386k149k703k186
53089C13362j350j220j295m08J187K054J644Q34M13K34J18L42Q68J068P30N19
53073C19100Q67J178P51j07n71m65j95M1L53O29O42N49O57P74M36k84q23j029
53055C22503j282j548j128J85J413J526Q79O64J220J704J413O31q0o61j169j283
53039C24987p65m2K49J25J15L79N21K82o1p5L10P44O70k75j824l098l366k768
$$ plain form
53021 316108 314128 312769 311990 311800 312001 312339 312709 312970 312791 312007 311018 310495 310750 311612 312776 313994 315092
53004 315092 316123 317406 319091 320789 321922 322343 322336 322159 321975 322077 322717 323693 324519 325004 325287 325330 324917 324248
52986 324248 324076 325006 326940 329363 331803 333848 335063 335301 335004 334903 335328 335900 335906 335022 333632 332377 331416
52969 331416 330434 329454 329203 330283 332320 334426 336271 338162 340240 342238 343967 345375 346095 345628 344135
52954 344135 342495 341334 340471 339436 337968 335961 333582 331655 331168 332038 332983 333010 332401 331775 330891 329118
52938 329118 326651 324545 323661 324096 325359 326633 327114 326647 325876 325351 324789 323650 322105 320876 320321 320262 320502
52921 320502 320902 321086 320711 320038 319654 319723 319981 320355 320949 321448 321249 320325 319382 318879 318454 317615 316592 316145 316735
52902 316735 318150 319797 321188 322268 323326 324538 325703 326684 327937 330120 333122 335935 337714 338603 339258
$$ packed form
53021C16108j980j359p79j90K01L38L70K61j79p84r89n23K55Q62J164J218J098
53004C15092J031J283J685J698J133M21pj77j84J02O40R76Q26M85K83M3m13o69
52986C24248j72R30J934K423K440K045J215K38k97j01M25N72Oq84j390j255r61
52969C31416r82r80k51J080K037K106J845J891K078J998J729J408P20m67j493
52954C44135j640j161q63j035j468k007k379j927m87Q70R45K7o09o26q84j773
52938C29118k467k106q84M35J263J274M81m67p71n25n62j139j545j229n55n9K40
52921C20502M00J84l75o73l84O9K58L74N94M99j99r24r43n03m25q39j023m47N90
52902C16735J415J647J391J080J058J212J165R81J253K183L002K813J779Q89O55
$$ plain form
52887 339258 339837 339842 338826 336954 334825 332952 331479 330208 328704 326448 323214 319544 316622 315281 315082
52872 315082 314753 313599 312087 310977 310415 310176 310261 310741 311435 312236 313481 315398 317398 318563 318699 318400 318185
52855 318185 318144 318322 318762 319137 318979 318385 317924 317714 317166 315801 313828 311729 309743 307938 306286 304459 301998
52838 301998 298976 296147 294196 293122 292519 292105 291793 291545 291330 291057 290537 289805 289364 289605 290044 289820 288989
52821 288989 288592 289242 290409 291487 292775 294798 297299 299736 302387 306139 311250 316951 322258 326665 330096
52806 330096 332622 334305 335043 334497 332343 328510 323101 316412 309273 302983 298413 295333 292969 291032 289810
52791 289810 289465 289730 290201 290532 290428 289875 289303 289125 289136 288771 287928 287133 286881 287144 287613 288119 288714 289525 290546
52772 290546 291444 291701 291240 290797 291343 293071 295215 296824 297503 297492 297368 297676 298548 299556 300133 300117 299753 299330
$$ packed form
52887C39258N79Nj016j872k129j873j473j271j504k256l234l670k922j341j99
52872C15082l29j154j512j110n62k39Q5M80O94Q01J245J917K000J165J36k99k15
52855C18185m1J78M40L75j58n94m61k10n48j365j973k099j986j805j652j827k461
52838C01998l022k829j951j074o03m14l12k48k15k73n20p32m41K41M39k24q31
52821B88989l97O50J167J078J288K023K501K437K651L752N111N701N307M407L431
52806C30096K526J683P38n46k154l833n409o689p139o290m570l080k364j937j222
52791B89810l45K65M71L31j04n53n72j78J1l65q43p95k52K63M69N06N95Q11J021
52772B90546Q98K57m61m43N46J728K144J609O79j1j24L08Q72J008N77j6l64m23
$$ plain form
52754 299330 299104 299405 300425 301847 303040 303670 303852 303753 303388 302852 302407 302237 302356 302783 303562 304631 305894
52737 305894 307328 308620 308942 307706 305617 304302 304574 305610 306147 305937 305532 305241 305034 305212 306298 308209
52721 308209 310124 311379 311956 311916 310917 308736 305931 303528 302127 301645 301740 302105 302389 302341 302192 302510 303442 304392
52703 304392 304745 304642 304652 304885 304942 304694 304560 304878 305444 305924 306329 306789 307212 307489 307753 308075 308222 308110 308203 308942
52683 308942 310044 311015 312131 314123 316820 319004 319951 320363 321255 322560 323496 323900 324303 324886 325185 324991 324894
52666 324894 325558 326884 328211 329077 329471 329555 329436 329178 328803 328297 327749 327423 327540 328035 328712 329577 330752 332089
52648 332089 333131 333606 333756 333931 333980 333370 331941 330245 328983 328305 327828 327245 326688 326552 327145 328523 330449
52631 330449 332507 334419 336333 338613 341246 343657 345262 346051 346324 345969 344463 341755 338704 336243 334298
$$ packed form
52754B99330k26L01J020J422J193O30J82r9l65n36m45j70J19M27P79J069J263
52737C05894J434J292L22j236k089j315K72J036N37k10m05k91k07J78J086J911
52721C08209J915J255N77m0r99k181k805k403j401m82R5L65K84m8j49L18R32R50
52703C04392L53j03J0K33N7k48j34L18N66M80M05M60M23K77K64L22J47j12R3P39
52683C08942J102R71J116J992K697K184R47M12Q92J305R36M04M03N83K99j94r7
52666C24894O64J326J327Q66L94Q4j19k58l75n06n48l26J17M95O77Q65J175J337
52648C32089J042M75J50J75M9o10j429j696j262o78m77n83n57j36N93J378J926
52631C30449K058J912J914K280K633K411J605P89K73l55j506k708l051k461j945
$$ plain form
52616 334298 332058 329268 326691 325106 324355 323808 323363 323391 323882 324324 324471 324607 324859 324791 324053 323020 322356 322194
52598 322194 322184 322100 322007 321935 321861 321958 322479 323315 324038 324461 324914 325828 327288 329058 330833 332364 333521 334366 335042
52579 335042 335486 335370 334550 333515 333169 333979 335349 336088 335638 334698 334424 335182 336402 337507 338385 338865 338443
52562 338443 336999 335347 334488 334540 334804 334607 333657 331924 329815 328226 327727 327797 327521 326879 326575 326698 326543 325914
52544 325914 325564 325960 326561 326859 327259 328155 328907 328707 327996 327949 328807 329667 329892 329779 329740 329726 329790 330417 331819 333408
52524 333408 334485 335095 335788 336828 338046 339283 340490 341438 341736 341278 340466 339922 340075 341048 342749 344933
52508 344933 347225 349216 350584 351144 350809 349590 347657 345316 342886 340637 338820 337516 336298 334360 331457
52493 331457 328600 327229 327583 328407 328541 328214 328307 328868 329161 328961 328946 329688 330916 332120 333411 335378 338316
$$ packed form
52616C34298k240k790k577j585p51n47m45K8M91M42J47J36K52o8p38j033o64j62
52598C22194j0q4r3p2p4R7N21Q36P23M23M53R14J460J770J775J531J157Q45O76
52579C35042M44j16q20j035l46Q10J370P39m50r40k74P58J220J105Q78M80m22
52562C38443j444j652q59N2K64j97r50j733k109j589m99P0k76o42l04J23j55o29
52544C25914l50L96O01K98M00Q96P52k00p11m7Q58Q60K25j13l9j4O4O27J402J589
52524C33408J077O10O93J040J218J237J207R48K98m58q12n44J53R73J701K184
52508C44933K292J991J368N60l35j219j933k341k430k249j817j304j218j938k903
52493C31457k857j371L54Q24J34l27R3N61K93k00j5P42J228J204J291J967K938
$$ plain form
52476 338316 341839 345180 347797 349804 351853 354347 356761 358064 357895 357037 356643 357282 358791 360634 362186
52461 362186 363048 363394 363756 364226 364136 362843 360508 357764 354876 351723 348400 345291 342559 340087 337966 336570
52445 336570 335944 335511 334682 333510 332532 332151 332347 332826 333230 333312 333086 332713 332211 331447 330559 330046 330174 330474 330241
52426 330241 329519 329144 329717 330820 331521 331433 331046 331077 331783 332890 333996 334965 336059 337705 339981 342309 343909
52409 343909 344741 345813 348342 352669 358217 364364 370979 378062 385250 391978 397898 402898 406841 409554
52395 409554 410936 410780 408660 404376 398526 392273 386467 381321 376943 373667 371560 370068 368592 367219
52381 367219 366461 366466 366928 367651 368724 370102 371500 372852 374446 376445 378621 380780 383076 385594 387934 389623
52365 389623 390732 391712 392655 393163 392986 392448 392100 392180 392532 392907 393235 393731 394788 396638 399041 401392 403175
$$ packed form
52476C38316L523L341K617K007K049K494K414J303j69q58l94O39J509J843J552
52461C62186Q62L46L62M70r0j293k335k744k888l153l323l109k732k472k121j396
52445C36570o26m33q29j172r78l81J96M79M04Q2k26l73n02p64q88n13J28L00k33
52426C30241p22l75N73J103P01q8l87L1P06J107J106R69J094J646K276K328J600
52409C43909Q32J072K529M327N548O147O615P083P188O728N920N000L943K713
52395D09554J382j56k120m284n850o253n806n146m378l276k107j492j476j373
52381C67219p58NM62P23J073J378J398J352J594J999K176K159K296K518K340J689
52365C89623J109R80R43N08j77n38l48Q0L52L75L28M96J057J850K403K351J783
$$ plain form
52348 403175 404246 404734 404841 404804 404832 405002 405306 405894 407103 409080 411474 413691 415444 417030 419075 422046
52332 422046 425894 430121 434270 438446 443273 449308 456520 464397 472381 480071 487246 493928 500408 506938
52318 506938 513373 519336 524784 530215 536216 543020 550585 558852 567730 576953 586269 595713 605482 615580
52304 615580 625845 636310 647252 658787 670666 682561 694278 705570 716109 725940 735683 745790
52292 745790 755768 764652 772237 779242 786142 792508 797873 802655 807557 812391 816305 819131 821689 824551
52278 824551 827168 828713 829373 830179 831741 833652 835167 836045 836590 837156 837869 838721 839788 841342 843707 846872
52262 846872 850255 853117 855394 857985 861946 867380 873331 878877 884104 889842 896550 903810 910939 917812
52248 917812 924813 932148 939489 946328 952517 958360 964275 970369 976281 981449 985678 989476 993713 998890
$$ packed form
52348D03175J071M88J07l7K8J70L04N88J209J977K394K217J753J586K045K971
52332D22046L848M227M149M176M827O035P212P877P984P690P175O682O480O530
52318E06938O435N963N448N431O001O804P565Q267Q878R223R316R444R769J0098
52304F15580J0265J0465J0942J1535J1879J1895J1717J1292J0539R831R743J0107
52292G45790R978Q884P585P005O900O366N365M782M902M834L914K826K558K862
52278H24551K617J545O60Q06J562J911J515Q78N45N66P13Q52J067J554K365L165
52262H46872L383K862K277K591L961N434N951N546N227N738O708P260P129O873
52248I17812P001P335P341O839O189N843N915O094N912N168M229L798M237N177
$$ plain form
52234 998890 1004766 1010669 1016061 1020812 1025101 1029157 1033010 1036417 1039110 1041082 1042466 1043128 1042645 1040902 1038607
52219 1038607 1036945 1036654 1037484 1038458 1038603 1037544 1035710 1033988 1033086 1033065 1033471 1033872 1034197 1034681 1035664 1037410 1039851
52202 1039851 1042456 1044624 1046423 1048770 1052560 1057658 1063007 1067721 1071838 1075925 1080297 1084852 1089462 1094163
52188 1094163 1098926 1103437 1107172 1109609 1110441 1109754 1107939 1105329 1102001 1098062 1093929 1089973 1086027 1081710
52174 1081710 1077226 1073331 1070312 1067566 1064509 1061429 1058988 1057237 1055634 1053842 1051981 1050204 1048574 1047355
52160 1047355 1046906 1047221 1047934 1048804 1049767 1050459 1050187 1048610 1046193 1043868 1042444 1042320 1043350 1044883 1046305 1047663
52144 1047663 1049499 1051948 1054333 1055809 1056084 1055442 1054414 1053537 1053081 1052848 1052562 1052512 1053389 1055426 1058234 1061640
52128 1061640 1066009 1071403 1077092 1082490 1088053 1094626 1102230 1110174 1118070 1126058 1134131 1141895 1148976 1155169
$$ packed form
52234I98890N876N903N392M751M289M056L853L407K693J972J384O62m83j743k295
52219A038607j662k91Q30R74J45j059j834j722r02k1M06M01L25M84R83J746K441
52202A039851K605K168J799K347L790N098N349M714M117M087M372M555M610M701
52188A094163M763M511L735K437Q32o87j815k610l328l939m133l956l946m317
52174A081710m484l895l019k746l057l080k441j751j603j792j861j777j630j219
52160A047355m49L15P13Q70R63O92k72j577k417k325j424j24J030J533J422J358
52144A047663J836K449K385J476K75o42j028q77m56k33k86n0Q77K037K808L406
52128A061640M369N394N689N398N563O573P604P944P896P988Q073P764P081O193
$$ plain form
52114 1155169 1160280 1164372 1168169 1172643 1178162 1184408 1191103 1198369 1206453 1215637 1226386 1239030 1253193
52101 1253193 1267990 1282860 1297724 1312323 1326034 1338550 1350140 1360884 1370095 1376897 1381124 1383386
52089 1383386 1384530 1385297 1386253 1387667 1389480 1391423 1393057 1393773 1393198 1391701 1390095 1388704 1387082 1384807 1382095
$$ packed form
52114A155169N111M092L797M474N519O246O695P266Q084R184J0749J2644J4163
52101A253193J4797J4870J4864J4599J3711J2516J1590J0744R211O802M227K262
52089A383386J144P67R56J414J813J943J634P16n75j497j606j391j622k275k712
$$ [...]
##END NTUPLES=NMR SPECTRUM
##END=
