##TITLE=AC1399_2357uv_7519954_JKoHcfTaAp
##JCAMPDX= 6.0         $$ Bruker NMR JCAMP-DX V2.0
##DATA TYPE= NMR SPECTRUM
##DATA CLASS= NTUPLES
##ORIGIN= BRUKER
##OWNER= Administrator
$$ 1.72 TOPSPIN		Version 2.1
$$ 2013-04-17 00:05:06.000 -0700  Administrator@X
$$ Compression mode = diff/dup
##.OBSERVE FREQUENCY= 400.02188249412
##.OBSERVE NUCLEUS= ^1H
##.ACQUISITION MODE= SIMULTANEOUS (DQD)
##.ACQUISITION SCHEME= undefined
##.AVERAGES= 8
##.DIGITISER RES= 22
##SPECTROMETER/DATA SYSTEM= spect
##.PULSE SEQUENCE= zg30
##.SOLVENT NAME= COFFEE_meoh
##.SHIFT REFERENCE= INTERNAL, COFFEE_meoh, 1, 14.98509
##AUDIT TRAIL= $$ (NUMBER, WHEN, WHO, WHERE, PROCESS, VERSION, WHAT)
$$ ##TITLE= Audit trail, TOPSPIN		Version 2.1
$$ ##JCAMPDX= 5.01
$$ ##ORIGIN= Bruker BioSpin GmbH
$$ ##OWNER= Administrator
$$ $$ E:\/data/COFFEE/nmr/AC1399_2357uv_7519954_JKoHcfTaAp/20/pdata/1/auditp.txt
$$ ##AUDIT TRAIL=  $$ (NUMBER, WHEN, WHO, WHERE, PROCESS, VERSION, WHAT)
(   1,<2013-04-17 00:04:59.187 -0700>,<Administrator>,<X>,<go>,<TOPSPIN 2.1>,
      <created by zg
	started at 2013-04-17 00:03:53.139 -0700,
	POWCHK enabled, PULCHK disabled,
       configuration hash MD5:
       33 CF 6A 21 5C D3 B9 40 6C 15 AA 8D 27 A2 4F 13
       data hash MD5: 64K
       E6 5E E8 8A CB 7F D2 B7 DF 53 4A 24 EA FF 5B 28>)
(   2,<2013-04-17 00:05:02.093 -0700>,<Administrator>,<X>,<proc1d>,<TOPSPIN 2.1>,
      <Start of raw data processing
       efp LB = 0 FT_mod = 6 PKNL = 1 PHC0 = 0 PHC1 = 0 SI = 32K 
       data hash MD5: 32K
       A3 99 7E 22 BC 42 47 D4 FC F3 A9 05 3C B9 5B 15>)
(   3,<2013-04-17 00:05:02.375 -0700>,<Administrator>,<X>,<proc1d>,<TOPSPIN 2.1>,
      <pk PHC0 = 97.88818 PHC1 = 0 
       data hash MD5: 32K
       F7 43 3D A5 C0 2F 8E 12 82 FC 3F FC 79 DD 50 AD>)
(   4,<2013-04-17 00:05:02.468 -0700>,<Administrator>,<X>,<proc1d>,<TOPSPIN 2.1>,
      <abs ABSG = 1 
       data hash MD5: 32K
       D5 B2 A0 BD 34 DC 05 39 0E 0C CE 25 FB BF 21 4E>)
(   5,<2013-04-17 00:05:02.547 -0700>,<Administrator>,<X>,<proc1d>,<TOPSPIN 2.1>,
      <abs ABSG = 2 
       data hash MD5: 32K
       0E 79 8F 95 62 77 0E CD 7C 3E 64 C0 CD 78 FD B3>)
(   6,<2013-04-17 00:05:02.609 -0700>,<Administrator>,<X>,<proc1d>,<TOPSPIN 2.1>,
      <abs ABSG = 3 
       data hash MD5: 32K
       50 BF 21 F7 D0 CC 2E C6 D5 6F 58 ED DA 73 0D DB>)
(   7,<2013-04-17 00:05:02.656 -0700>,<Administrator>,<X>,<proc1d>,<TOPSPIN 2.1>,
      <abs ABSG = 4 
       data hash MD5: 32K
       9E 73 66 A3 53 09 EA 47 D8 4E 78 C0 1A 00 BF E9>)
(   8,<2013-04-17 00:05:02.703 -0700>,<Administrator>,<X>,<proc1d>,<TOPSPIN 2.1>,
      <abs ABSG = 5 
       data hash MD5: 32K
       EA 9E 81 7D 6D 84 99 4C 36 62 5B 28 95 26 33 3A>)
$$ ##END=
$$ 
$$ $$ hash MD5
$$ $$ D8 2B 2B 11 5C 98 03 95 E3 CC 65 8B 33 58 C9 3D
##$RELAX= 
##$RELAX= 
##$RELAX= 
##$RELAX= 
##$RELAX= 
##$RELAX= 
##$RELAX= 
$$ Bruker specific parameters
$$ --------------------------
##$DU= <E:\>
##$EXPNO= 20
##$NAME= <AC1399_2357uv_7519954_JKoHcfTaAp>
##$PROCNO= 1
$$ [...]
##$TP= (0..7)
150 150 150 150 150 150 150 150
##$TP07= 0
##$TPNAME0= <>
##$TPNAME1= <>
##$TPNAME2= <>
##$TPNAME3= <>
##$TPNAME4= <>
##$TPNAME5= <>
##$TPNAME6= <>
##$TPNAME7= <>
##$TPOAL= (0..7)
0.5 0.5 0.5 0.5 0.5 0.5 0.5 0.5
##$TPOFFS= (0..7)
0 0 0 0 0 0 0 0
##$TUNHIN= 0
##$TUNHOUT= 0
##$TUNXOUT= 0
##$USERA1= <user>
##$USERA2= <user>
##$USERA3= <user>
##$USERA4= <user>
##$USERA5= <user>
##$V9= 5
##$VALIST= <valist>
##$VCLIST= <CCCCCCCCCCCCCCC>
##$VD= 0
##$VDLIST= <DDDDDDDDDDDDDDD>
##$VPLIST= <PPPPPPPPPPPPPPP>
##$VTLIST= <TTTTTTTTTTTTTTT>
##$WBST= 2048
##$WBSW= 25
##$XGAIN= (0..3)
0 0 0 0
##$XL= 0
##$YL= 0
##$YMAX_a= 643909
##$YMIN_a= -546228
##$ZGOPTNS= <>
##$ZL1= 120
##$ZL2= 120
##$ZL3= 120
##$ZL4= 120
##$ABSF1= 14.98509
##$ABSF2= -5.573092
##$ABSG= 5
##$ABSL= 3
##$ALPHA= 0
##$AQORDER= 0
##$ASSFAC= 0
##$ASSFACI= 0
##$ASSFACX= 0
##$ASSWID= 0
##$AUNMP= <proc_prof1d_extract_pilot.lims>
##$AXLEFT= 0
##$AXNAME= <>
##$AXNUC= <1H>
##$AXRIGHT= 0
##$AXTYPE= 0
##$AXUNIT= <>
##$AZFE= 0.1
##$AZFW= 0.1
##$BCFW= 0
##$BC_mod= 0
##$BYTORDP= 0
##$COROFFS= 0
##$CY= 15
##$DATMOD= 1
##$DC= 0
##$DFILT= <>
##$DTYPP= 0
##$F1P= 0
##$F2P= 0
##$FCOR= 0.5
##$FTSIZE= 32768
##$FT_mod= 6
##$GAMMA= 0
##$GB= 0
##$INTBC= 1
##$INTSCL= 1
##$ISEN= 128
##$LB= 0
##$LEV0= 0
##$LPBIN= 0
##$MAXI= 10000
##$MC2= 0
##$MEAN= 0
##$ME_mod= 0
##$MI= 0
##$NCOEF= 0
##$NC_proc= -8
##$NLEV= 6
##$NOISF1= 0
##$NOISF2= 0
##$NSP= 0
##$NTH_PI= 0
##$NZP= 0
##$OFFSET= 14.98509
##$PC= 1
##$PHC0= 97.88818
##$PHC1= 0
##$PH_mod= 1
##$PKNL= yes
##$PPARMOD= 0
##$PPDIAG= 0
##$PPIPTYP= 0
##$PPMPNUM= 2147483647
##$PPRESOL= 1
##$PSCAL= 4
##$PSIGN= 0
##$PYNMP= <proc.py>
##$REVERSE= no
##$SF= 400.02
##$SI= 32768
##$SIGF1= 0
##$SIGF2= 0
##$SINO= 400
##$SIOLD= 32768
##$SPECTYP= <>
##$SREGLST= <1H.CDCl3>
##$SSB= 0
##$STSI= 32768
##$STSR= 0
##$SW_p= 8223.68421052631
##$SYMM= 0
##$S_DEV= 0
##$TDeff= 65536
##$TDoff= 0
##$TI= <>
##$TILT= no
##$TM1= 0
##$TM2= 0
##$TOPLEV= 0
##$USERP1= <user>
##$USERP2= <user>
##$USERP3= <user>
##$USERP4= <user>
##$USERP5= <user>
##$WDW= 1
##$XDIM= 32768
##$YMAX_p= 468384947
##$YMIN_p= -735209
##$CURPLOT= <Network HP LaserJet P1505>
##$CURPRIN= <$Network HP LaserJet P1505>
##$DFORMAT= <normdp>
##$LAYOUT= <+/1D_H.xwp>
##$LFORMAT= <normlp>
##$PFORMAT= <normpl>
##$SURQMSG= 1
$$ End of Bruker specific parameters
$$ ---------------------------------
##NTUPLES= NMR SPECTRUM
##VAR_NAME=  FREQUENCY,     SPECTRUM/REAL,   SPECTRUM/IMAG
##SYMBOL=    X,             R,               I
##VAR_TYPE=  INDEPENDENT,   DEPENDENT,       DEPENDENT
##VAR_FORM=  AFFN,          ASDF,            ASDF
##VAR_DIM=   32768,         32768,           32768
##UNITS=     HZ,            ARBITRARY UNITS, ARBITRARY UNITS
##FACTOR=    0.250966925370066, 1,           1
##FIRST=     8223.43324360094, -146827,      8054
##LAST=      0,             -223728,         359
##MIN=       0,             -735209,         0
##MAX=       8223.43324360094, 468384947,    0
$$ Real data points
##PAGE= N=1
##DATA TABLE= (X++(R..R)), XYDATA
$$ [...]
19538a25855q5040d6270F54L31392e58024b44694M4578j13228G2487M8631c20066
19526a34903A23483n2347P3256b2295A18166c42189g2154k1200j35737B04036
19515c05912C06961a56626B92311A05841a961k38879a15079p8558j17070A45178
19504b22817A60264b55410a11614C23002a3989B20135b1881A57975a16082c8049
19493A35446c2434j90592D18268a88492A98868b52391j750c3475B0425d45149
19482f4520c0982B7193O9208c16901b3920j28783j15096C8165b5300q2768J3733
19471i4335A10371a34314I176d1185H8134Q8804a99651b4662j59322f9869I4559
19459d3704n6749j08203L21a6650F5152a67935g3144o7418k3444A80856b32463
$$ plain form
19538 -125855 -210895 -46270 654 332046 -558024 -244694 -200116 -313344 72487 121118 -320066
19526 -134903 123483 71136 144392 -22295 118166 -342189 -72154 -93354 -229091 204036
19515 -305912 306961 -156626 292311 105841 -1961 -240840 -115079 -193637 -310707 145178
19504 -222817 160264 -255410 -111614 323002 -13989 220135 -21881 157975 -116082 -38049
19493 135446 -32434 -223026 418268 -188492 198868 -252391 -254141 -33475 20425 -445149
19482 -64520 -30982 27193 96401 -316901 -23920 -152703 -267799 38165 -25300 -108068 -94335
19471 -94335 110371 -134314 9176 -41185 88134 176938 -199651 -24662 -183984 -69869 94559
19459 -43704 -100453 -208656 -208335 -16650 65152 -167935 -73144 -140562 -164006 180856 -232463
19447a68861A40881F9392B4490a97200O324j8660l8261d9035j03034K4856b4420
19435e3501k44443c5654A63842N0632D1948P8464B1630a07451A35219M874g0829
19423a1352F0739a71508B26202L0456a24321b3018F6044b55662c7290A65711D0716
19411B38785a57381A82239a11413N2533j58292B24280o4420a67792B64837B8401
19400b53592a06486l78403a47943D8035J05721d39079a11288a3915r6069B00271
19389a08385l08167A11885A0907d68518d7438a4296n5780l17259J86126d6611
19378b64456a3115r9969L9354l2898j74200D4223a46631K1639A01352b59308a20143
19366a60135C1121a34694k24564J76408J3915o965j40930b8160m5135j74860P4134
$$ plain form
19447 -168861 140881 69392 24490 -197200 -190876 -209536 -247797 -49035 -152069 -127213 -24420
19435 -53501 -297944 -35654 163842 214474 41948 120412 21630 -107451 135219 140093 -70829
19423 -11352 60739 -171508 226202 256658 -124321 -23018 66044 -255662 -37290 165711 40716
19411 238785 -157381 182239 -111413 -58880 -217172 224280 159860 -167792 264837 28401
19400 -253592 -106486 -484889 -147943 48035 153756 -439079 -111288 -13915 -109984 200271
19389 -108385 -416552 111885 10907 -468518 -47438 -14296 -70076 -387335 -201209 -46611
19378 -264456 -13115 -113084 -73730 -106628 -280828 44223 -146631 -124992 101352 -259308 -120143
19366 -160135 31121 -134694 -359258 -182850 -168935 -175900 -316830 -28160 -73295 -248155 -174021
19355a74021A13941f2663D5665c10553M3724M9960n0332L2932q3184f8950C30354
19343a27476O3124D7485L3015K3955a76930B28950h9726E51K27851b79510G0045
19331e69817A08881b15565K6139P4617l00522G0895B1633K05481a54292j34812
19321b89104a8573l26556a43371F7874Q1059a73970A63794A4495L6190K4673d4857
19309C0017a12088P835H4398d47720A09676a37311G2486K6948j51m02C1283Q8883
19297A20166a10443o8407B3883d0410k45064j6120g5836l65771D1842a40428d517
19285b7653j8665A22344b17618Q7658C84578F5457c72894A81069d73372K29282
19275b44090O3422G4493J62061f7985p4067f1753o6921K7149k74156J02689E2564
$$ plain form
19355 -174021 113941 -62663 45665 -310553 -266829 -216869 -267201 -234269 -317453 -68950 330354
19343 -127476 -64352 47485 80500 104455 -176930 228950 -89726 551 228402 -279510 70045
19331 -569817 108881 -215565 -189426 -114809 -415331 70895 21633 227114 -154292 -289104
19321 -289104 -18573 -345129 -143371 67874 148933 -173970 163794 14495 50685 75358 -44857
19309 30017 -112088 -104253 84398 -447720 109676 -137311 72486 99434 99283 98881 31283 120166
19297 120166 -110443 -178850 23883 -40410 -285474 -301594 -75836 -441607 41842 -140428 -4517
19285 -27653 -46318 122344 -217618 -129960 384578 65457 -372894 181069 -473372 -244090
19275 -244090 -180668 74493 236554 -67985 -142052 -61753 -128674 -101525 -375681 -272992 52564
19263f7335r8499e252j06053a7990G3543B9340J42227G3040h8189A19128a47545
19251a20392Q43j94302D6697a15657o8380o4146F5315a39471B33143I7485l0912
19240F6573R9748C8532p813O7728J085i3438J9648q7153r7481K0804J06801K066
19228a28753A34877n4939l3480j051L6180K35436d60862g273k9697n5647j0753
19217a03370A97969f8125j43271j29895J27271d7589A58440E1070b21785A10741
19206I697a49657j15968g8201p3257B91835d28710I7063b51248a13181k52792
19196c65973A75870c4848j38742a2717r9948I2672a86123B28185b15525B87026
19185a30444A72119a44509f8224k89206f2322H22g3528k8149l82106a10890E0291
$$ plain form
19263 -67335 -165834 -5252 -111305 -17990 73543 29340 171567 73040 -88189 119128 -147545
19251 -120392 -119549 -313851 46697 -115657 -184037 -248183 65315 -139471 233143 97485 66573
19240 66573 166321 38532 30719 98447 99532 -93438 -73790 -160943 -258424 -237620 -130819 -128753
19228 -128753 134877 79938 46458 45407 81587 317023 -460862 -7273 -36970 -92617 -103370
19217 -103370 197969 -68125 -211396 -341291 -214020 -47589 158440 51070 -221785 110741
19206 9697 -149657 -265625 -78201 -151458 291835 -428710 97063 -251248 -113181 -365973
19196 -365973 175870 -34848 -173590 -12717 -112665 92672 -186123 228185 -215525 287026
19185 -130444 172119 -144509 -68224 -357430 -62322 822 -73528 -101677 -483783 -110890 50291
19173b17148C9795d21113J11067a53340n7758A69128c98725E7501a23991j76569
19163c00560O1751C99934b05124E636h7162j03808M3855i642l42302a20581H0711
19151i6946C31969a0403A7212a17358M4760b3964D2090K6270a3687A12886J18749
19140B31635A252L34918D4468b86701d8777C00024a6307j65735m2907J3704D66385
19128a22504K8390n2881C8063a80147L380Q3263B34262b06073M9608J6999B68340
19116A32203c97871C13175b21729N6719b0774j89289c5926k05223A32500a91293
19105G5217j7318d4520j54693A55766f673k37156P4015L9208H4509i7754A11792
19093A769c9680k63802A84669j2266K01769K437a57413A93110b81796e4966q2846
$$ plain form
19173 -217148 39795 -421113 -310046 -153340 -211098 169128 -398725 57501 -123991 -300560
19163 -300560 -238809 399934 -205124 5636 -87162 -190970 -147115 -9642 -351944 -120581 80711
19151 -96946 331969 -10403 17212 -117358 -72598 -23964 42090 68360 -13687 112886 231635
19140 231635 1252 336170 44468 -286701 -48777 300024 -16307 -182042 -224949 -211245 466385
19128 -122504 -94114 -146995 38063 -180147 -176767 -93504 234262 -206073 -156465 -139466 268340
19116 132203 -397871 313175 -221729 -165010 -20774 -210063 -35926 -241149 132500 -191293
19105 75217 57899 -44520 -199213 155766 -6673 -243829 -169814 -130606 84509 -97754 111792
19093 1769 -39680 -303482 184669 172403 374172 376609 -157413 193110 -281796 -54966 -137812
19082a37812B7751J20272b23226A14292c47855A05176b84799L9678A4619c4854
19071I8523L04109j47716b3357j79571L8544c0368l02638J62343D5613d4672n7274
19060a01946P863l4624A4517a03576l23146b3534A06811a4576m0104C256c44983
19048b02329B36194b70457G1725o351d9773A94644b46244a17657n6877A90673
19037f532l53288a50888A52528C6111a03210A35606F0922a22450k81695a87356
19026F978J61305J00877b2163G8231e5852A81259L3567a67872M3086K3703A06397
19014F1748B3543N3561J87845h7741k9158k84203a07168j49887J28462K0313N3910
19003e4370K5427p3355j87545a9032k22585e992A18520D3048K7932K9313j0114
$$ plain form
19082 -137812 27751 148023 -223226 114292 -347855 105176 -284799 -245121 14619 -34854
19071 98523 402632 254916 -23357 -202928 -164384 -30368 -333006 -170663 45613 -44672 -101946
19060 -101946 -94083 -128707 14517 -103576 -426722 -23534 106811 -14576 -54680 3256 -344983
19048 -202329 236194 -270457 71725 65374 -49773 194644 -246244 -117657 -174534 190673
19037 -6532 -359820 -150888 152528 36111 -103210 135606 60922 -122450 -404145 -187356
19026 6978 168283 269160 -22163 78231 -55852 181259 214826 -167872 -124786 -101083 106397
19014 61748 23543 77104 264949 -87741 -116899 -401102 -107168 -257055 -128593 -108280 -54370
19003 -54370 -28943 -102298 -289843 -19032 -241617 -5992 118520 43048 70980 100293 90179
18992I0179a13033H6782a52126C2336g1293k49934A21331J20861a06172M8232
18982e7940k55949A10054P464Q2225q4292c02769k10800A27490c8865I3336h5044
18970b88405K672A29629m2723a17875B31321a87867P6352n759c9256h123j06474
18959a14597C74518b67781B60971a45797k53409g08j42551l3855a7255F6879J75223
18948B42102a08391A50118a04666A46076a81164g7911j19730Q2490n43403A49401
18937a29335A00942c7180D9744a781E6697b42772P1688f2496A37834J2224a62708
18925h2295G1419i5587G9871h0368B30103e9900n8036B1130e8412j62489Q4141
18914a36760C00911d2291l98278I2510f7930j86186k04324b06439e3177l90319
$$ plain form
18992 90179 -113033 86782 -152126 32336 -71293 -321227 121331 242192 -106172 -57940
18982 -57940 -313889 110054 117518 199743 115451 -302769 -513569 127490 -38865 93336 -85044
18970 -288405 -285733 129629 86906 -117875 231321 -187867 -111515 -117274 -39256 -8123 -114597
18959 -114597 374518 -267781 260971 -145797 -399206 -708 -143259 -177114 -17255 66879 242102
18948 242102 -108391 150118 -104666 146076 -181164 -77911 -197641 -115151 -658554 149401
18937 -129335 100942 -37180 49744 -1781 56697 -242772 -171084 -62496 137834 150058 -162708
18925 -82295 71419 -95587 79871 -80368 230103 -59900 -117936 21130 -58412 -220901 -136760
18914 -136760 300911 -42291 -440569 92510 -67930 -254116 -458440 -206439 -53177 -443496
18904d43496b6183q8426j59295I5422a48821a886A30318a7119k23284A71876R6784
18893B68660e1916C13707c11779a48128c5275C8241L09448d5111F798J46987K4071
18882A77856f3746A29144c4482j16441A48719e4406j30581d016l24149B1490c59423
18870A43367F2864a53877C19547a66932o8387C5700a99876d0198B70723m9701
18860B21022a80068F2738L8496b01464d4605m8470D0010h3453A5703J59316n4134
18849A20885l8141a43267C8848J46026a09525D92463b2226m3563j21880O4540
18839a23129F4245R2765E5965a05911h126j09807k81518A57786E2442e0006l86664
18828d36670d7297m0071J8919A23824b14834b483k14150C05723h3148B0741b03186
$$ plain form
18904 -443496 -26183 -114609 -273904 95422 -148821 -1886 130318 -17119 -240403 171876 268660
18893 268660 -51916 313707 -311779 -148128 -35275 38241 347689 -45111 6798 153785 177856
18882 177856 -63746 129144 -34482 -150923 148719 -54406 -184987 -4016 -328165 21490 -359423
18870 143367 62864 -153877 319547 -166932 -235319 35700 -199876 -40198 270723 221022
18860 221022 -180068 62738 101234 -201464 -44605 -93075 40010 -83453 15703 175019 120885
18849 120885 82744 -143267 38848 184874 -109525 492463 -22226 -65789 -187669 -123129
18839 -123129 64245 157010 55965 -105911 -8126 -117933 -399451 157786 52442 -50006 -436670
18828 -436670 -47297 -87368 -68449 123824 -214834 -2483 -216633 305723 -83148 20741 -203186
18816F9925d6792n5141C2842c9130I3517C5842g4228B77777h3411n684m896j85578
18804b79569I9687k4936i2995Q116B76067e0780A3281J83852B4872a91048F4022
18792G6506A8865O9587c99400F0663d0127H6052J02665m9171b34489g6602j12553
18781a89155D0415b94022A4831K0684b20812c9930k57387B91673b44983d8202
18770b24470D2072a41742O3714K3318A36066e5787a0181j70166A82041b841k00385
18759b03226l54209e505j12336r7875F2575K4585a32028j14310a06979A86802
18748b93990d9982j69935A52957c3205l74469h2548j50442R1323j45482O0561
18738b26588F7968K06260f1390j8650A51083L1838A3840M5385L0584J95559a40263
$$ plain form
18816 69925 -46792 -101933 32842 -39130 93517 35842 -74228 277777 -83411 -89095 -93991 -279569
18804 -279569 99687 74751 -92995 -84879 276067 -50780 13281 197133 24872 -191048 64022
18792 76506 18865 88452 -399400 60663 -40127 86052 188717 139546 -234489 -76602 -189155
18781 -189155 40415 -294022 14831 35515 -220812 -39930 -297317 291673 -244983 -48202
18770 -224470 42072 -141742 -78028 -54710 136066 -55787 -10181 -180347 182041 -2841 -203226
18759 -203226 -557435 -5505 -117841 -215716 62575 87160 -132028 -246338 -106979 186802
18748 -293990 -49982 -219917 152957 -33205 -407674 -82548 -232990 -141667 -287149 -226588
18738 -226588 67968 274228 -61390 -80040 151083 182921 13840 59225 89809 285368 -140263
18726a81459R216A51229O4289B7753c75682a43101k40142B71788a46700M2154
18716a04546n0032r7004P8429g5855j24069i7164K9040D3149J50603E2306b78129
18704E3500a00962n6968j58050J05716B2414b25948h9088n3571D4102K00962o7405
18693A77659J9455b8291j31261I5461a6756j09059K7246j47199C13045g1888C49455
18681a17435A716i744A65861D4329a47691B45377E6252J25324b5343j34048L1527
18670a27864A22054i1172j41383A35186a19893L0353a1720B54178n5729f1714
18659b61294F955J61131n0143Q7388b78154P7309l2862B18673a0717d502l30120
18648c34622J19695P68f33k16213j28277J10145K2019c2861A93653a20777l48724
$$ plain form
18726 -181459 -172243 151229 215518 27753 -375682 -143101 -383243 271788 -146700 -104546
18716 -104546 -154578 -251582 -173153 -75855 -199924 -97164 -68124 43149 193752 52306 -278129
18704 53500 -100962 -157930 -315980 -210264 22414 -225948 -89088 -142659 44102 245064 177659
18693 177659 197114 -28291 -159552 95461 -16756 -125815 -98569 -245768 313045 -71888 349455
18681 -117435 1716 -9744 165861 44329 -147691 245377 56252 181576 -25343 -159391 -127864
18670 -127864 122054 -91172 -232555 135186 -119893 -89540 -11720 254178 198449 -61714
18659 -261294 6955 168086 117943 205331 -278154 -200845 -233707 218673 -10717 -4502 -334622
18648 -334622 -214927 -214159 -633 -216846 -345123 -234978 -212959 -32861 193653 -120777 -469501
18637d69501J21049a06709n1244a837G5664F97b6380j52115A57471E3878a3290
18625a24198j73434a44305J2850A52171e0487q8987N6629B16949a51467E4233
18614g7540k5064k75775E987L13230F4972a88836l4744I1373d1763l21693J59971
18603b03485l1325N7925h6158A99900F1002a82777m1668Q5368a6701r9781A41451
18591b26759L0240P6426k51776D6473a23018A95761n1522a45145B35743G8690
18580F1412H830c61828a05762b6508j39892A33521b98737g5441k69306A38328
18569B70053d13332I3875b4370H4940b49004A70101a68984B06852c00431F3739
18558A80452b37340a02542C9753a80556A13503b30467f7930o57765B52027J66686
$$ plain form
18637 -469501 -348452 -106709 -157953 -1837 75664 697 -26380 -178495 157471 53878 -13290
18625 -124198 -297632 -144305 -131455 152171 -50487 -139474 -82845 216949 -151467 54233
18614 -77540 -102604 -378379 5987 319217 64972 -188836 -223580 91373 -41763 -363456 -203485
18603 -203485 -234810 -176885 -86158 199900 61002 -182777 -224445 -139077 -16701 -116482 141451
18591 -226759 -196519 -120093 -371869 46473 -123018 195761 144239 -145145 235743 78690
18580 61412 8830 -361828 -105762 -26508 -166400 133521 -298737 -75441 -344747 138328
18569 270053 -413332 93875 -24370 84940 -249004 170101 -168984 206852 -300431 63739
18558 180452 -237340 -102542 39753 -180556 113503 -230467 -67930 -725695 252027 418713
18548D18713c48901A39648b38632f5802k03043K3955j5805I7103g1233B13727
18537a22651k7103o5429E4403g9048H5382a50788O8001j1720D5881K9499b71245
18525F3313J58960H2915b57460A38459i4356C07938i8542B055c7155A96298b40787
18513a84017g0319l29393C5965a2697B99b58330A04988k5914Q411m191d3927g828
18500B85896A06797h8698h886k95659k4334i7282A03152Q1473a68037I301a9442
18488f5567j74694B47231F8549R3505a15350B25349a03000J4018A06111B8051
18477I5665k5180k5444J38551c47789c0956I5031a71238l441C611K6735J77273
18466B07619b9587j68149b2819A75926c10207J31141C00358r5632h7503l447j37253
$$ plain form
18548 418713 -348901 139648 -238632 -65802 -268845 -244890 -260695 97103 -71233 213727
18537 -122651 -149754 -215183 54403 -79048 85382 -150788 -82787 -94507 45881 75380 -271245
18525 63313 222273 82915 -257460 138459 -94356 307938 -98542 2055 -37155 196298 -240787
18513 -184017 -70319 -399712 35965 -12697 299 -258330 104988 79074 87485 83294 -43927 -7828
18500 285896 106797 -88698 -8886 -304545 -328879 -97282 103152 184625 -168037 9301 -19442
18488 -65567 -240261 247231 68549 162054 -115350 225349 -103000 -88982 106111 28051
18477 95665 70485 45041 183592 -347789 -30956 95031 -171238 -174679 3611 30346 207619
18466 207619 -29587 -197736 -22819 175926 -310207 -179066 300358 204726 -87503 -90950 -228203
18455b28203N6013d6335j57458A90122n3446C4360i0828H9194d7661m80468a89713
18443b30591d9714j80926b6104f850k937C3325b06639B72625a21004j13673o2738
18432b97415h9225r7319p7363F286O8482d6058C5456j0851K01694N8249a68912
18420A15433J24179J91191b61789F2679a59596A45641E1028a40497O937d2749
18409a12852L5514n4249L770r4708f4622F0487R2256a11081j32831Q6385A51722
18397F4071M1900a90075I6727a20757F936R8372a23077D3007b8554A14921i1299
18385A58554m5693a34526j13285A30124b97834A48113e4140a6838C562a08123
18374d6154A22103b33516K4242A57023C9129a68016A33920P7050G3981c4334k44274
$$ plain form
18455 -228203 -172190 -46335 -203793 190122 136676 34360 -90828 89194 -47661 -528129 -189713
18443 -230591 -49714 -230640 -26104 -6850 -9787 33325 -206639 272625 -121004 -234677 -297415
18432 -297415 -89225 -186544 -263907 6286 74768 -46058 35456 24605 226299 284548 -168912
18420 115433 239612 430803 -261789 62679 -159596 145641 51028 -140497 -133560 -42749
18409 -112852 -77338 -131587 -127817 -222525 -64622 60487 152743 -111081 -243912 -157527 151722
18397 64071 105971 -190075 96727 -120757 6936 105308 -123077 43007 -28554 114921 -91299
18385 158554 112861 -134526 -247811 130124 -297834 148113 -54140 -16838 3562 -108123
18374 -46154 122103 -233516 -209274 157023 39129 -168016 133920 210970 73981 -34334 -278608
18363b78608B75839g6260d96A95010A4655h0257A93394e5790m1143k3722j5854
18352a36509N5659K7124B82751h9550C90811G4415a17082e5092n4989d82p2782
18341g3264C7162a06144L429j22977J05567I114d04351a77101P8234H5717b94475
18329c81691a68494c4633G5969b18142N8037B66582e01796I8294a55864A75537
18318a27482F283b79858a5793A42716e0959k49802o3760b0124D97073a2950I0541
18306a25167K8181j85913B93271c48832J67362A9266c45869C874O846a04083L2222
18295g1861c4107k81075M1710l0657B00845f3323A23208N4160q0664b22200g8059
18283A78435q2455b24555n197c0994j56605M6173n9577G0201a28905j97019a08209
$$ plain form
18363 -278608 275839 -76260 -496 195010 14655 -80257 193394 -55790 -96933 -120655 -136509
18352 -136509 -80850 -53726 282751 -89550 390811 74415 -117082 -55092 -110081 -482 -73264
18341 -73264 37162 -106144 -102715 -225692 -120125 9114 -404351 -177101 -98867 85717 -294475
18329 -381691 -168494 -34633 75969 -218142 -160105 266582 -501796 98294 -155864 175537
18318 -127482 6283 -279858 -15793 142716 -50959 -300761 -364521 -20124 497073 -12950 90541
18306 -125167 -96986 -282899 293271 -348832 -181470 19266 -345869 3874 10720 -104083 -71861
18295 -71861 -34107 -315182 -273472 -304129 200845 -63323 123208 177368 96704 -222200 -78059
18283 178435 95980 -224555 -229752 -30994 -187599 -141426 -201003 70201 -128905 -325924 -108209
18271b15952E5174A9310b28104m1945F6966A22J9722b32573A59240G483b8644
18259B39043l3123h152m66599A55549a95545R7741A93649h7563c4640r4200b1560
18247e2287j77707a6274k92396I158J72968C4118a14589a4603F7985J52423p8993
18236A41415b04277N9719O5695b3537j14662E3195j4621i7772l1131e1315E7489
18224C7204a29083b8771j48557g0258n033r3348d7335k24948e9607o5620j48031
18213b73258D01051E7834b50177O5951p3234b1703B6359a10754C290J28067b99575
18201f8512D0829b32944c0348A09922l9397h4894L521J2070H4167O5231g5552
18189C06174d20520J88767L7774H2029f096j8197A96139c10232a28592A75992
$$ plain form
18271 -215952 55174 19310 -228104 -270049 66966 122 19844 -232573 159240 7483 -28644
18259 239043 205920 -8152 -474751 155549 -195545 -97804 193649 -87563 -34640 -128840 -21560
18247 -52287 -229994 -16274 -308670 9158 182126 34118 -114589 -14603 67985 220408 141415
18236 141415 -204277 -144558 -78863 -23537 -138199 53195 38574 -97772 -128903 -51315 57489
18224 37204 -129083 -28771 -177328 -70258 -75291 -168639 -47335 -272283 -59607 -125227 -273258
18213 -273258 401051 57834 -250177 -184226 -257460 -21703 26359 -110754 3290 131357 -299575
18201 -68512 40829 -232944 -30348 109922 70525 -84894 -81373 -69303 84167 149398 -75552
18189 306174 -420520 -231753 -193979 82029 -6096 -24293 196139 -310232 -128592 175992
18178b22868h7871j60353d5968j3658k13134M4844R4306I6376a78422J8516J4692
18167a45214a3413l29595a27765d0828k55502c8604F9688f7151C54767f9300l6996
18156a06296B77561G8371B9953c0203l2695C24670b70179e8965B77786H4296M3970
18145A28266c4248B6631e5947D6774a98242n208b2171A64521B1847J90303G8624
18133A27704a19671A11236b59763a01908j39660A73301F6177b61656b3949G155
18122f245k18967j67994I0861P5223b21851R5322L1595d1847d864j52561p0759
18111b28184d5885C78773j60528m5565i8128J6278B00209c20371O8664k1691G9299
18099b19975h3056j01211A68073b68948e7498n0275B38997L0198c40219e303j59924
$$ plain form
18178 -222868 -87871 -248224 -45968 -59626 -272760 -227916 -133610 96376 -178422 -159906 -145214
18167 -145214 -13413 -343008 -127765 -40828 -296330 -38604 69688 -67151 354767 -69300 -106296
18156 -106296 277561 78371 29953 -30203 -62898 324670 -270179 -58965 277786 84296 128266
18145 128266 -34248 26631 -55947 46774 -198242 -203450 -22171 164521 21847 212150 78624
18133 127704 -119671 111236 -259763 -101908 -241568 173301 66177 -261656 -23949 7155
18122 -6245 -225212 -393206 90861 166084 -221851 -126529 -94934 -41847 -4864 -157425 -228184
18111 -228184 -45885 378773 218245 172680 -98128 -81850 200209 -320371 -251707 -273398 79299
18099 -219975 -83056 -184267 168073 -268948 -57498 -107773 238997 269195 -340219 -5303 -165227
18088a65227a5576j39617d0451C23893d0923a1265P07A96d2744j41287A38664
18076a39818q4607A12483h4493A69011g8778H1224b99138b3963p5200R419o9071
18065a58815A16245K2627b15584i5396j28638L5728h1990A39407F5120L6908A9657
18053A87048i051j97120B1276R135L14620C2867J52173N4914D8527b11429J05591
18042a05838p5933A34689a13042j96473D81239c5693l03580I2911L2352a36443
18031H1634a96926a4847k35737k8462a1244j32524A09452J38304g9961A35293
18020F8223a31072f0568D3351g637n8133C42039r2511j13625L8433b8153H5175
18008B01610I2683b11852E4902a47A74369j3986b1297k39903a0991A10504i9981
$$ plain form
18088 -165227 -15576 -155193 -40451 323893 -40923 -11265 -10558 196 -42744 -184031 138664
18076 -139818 -224425 112483 -84493 169011 -78778 81224 -299138 -23963 -99163 -89744 -158815
18065 -158815 116245 138872 -215584 -95396 -224034 -188306 -81990 139407 65120 102028 19657
18053 187048 -9051 -206171 21276 30411 345031 32867 185040 239954 48527 -211429 -105838
18042 -105838 -181771 134689 -113042 -309515 481239 -35693 -339273 92911 125263 -136443
18031 81634 -196926 -14847 -250584 -279046 -11244 -143768 109452 247756 -79961 135293
18020 68223 -131072 -60568 43351 -7637 -65770 342039 249528 135903 174336 -28153 85175
18008 201610 92683 -211852 54902 -147 174369 160383 -21297 -261200 -10991 110504 -99981
17996I3055g4659A27995a02995Q831a4588j06226j39274J09406C59579C0616e4697
17984a98591h8280n148j62745J22298b3988l28240A00534b12756B11672e231A1670
17972A75031E2393f4259J9420B86043a63213L2085j9251j8538k569j89119A47504
17960B53772a01352d7560C41513a47266G419R2916P2375n8718J59391b72852B07479
17948a53354d0341D53343a49635B5108J71232m6464F1244J02517a3943E6248b87567
17936b37763r8216h1345j98315C35784a10146L6734j4967H7394b52256B05086
17925B37248E3351d8165F5147O9015L37331a85654c9943E9840B2445L11530A7619
17913E0939a72560B4899b68573P6021G1901J48508h095j62311p6320F9167M6388
$$ plain form
17996 93055 -74659 127995 -102995 -94164 -14588 -120814 -260088 -150682 359579 30616 -54697
17984 -198591 -88280 -93428 -256173 -133875 -23988 -352228 100534 -212756 211672 -5231 11670
17972 175031 52393 -64259 -44839 286043 -163213 -131128 -150379 -168917 -171486 -360605 147504
17960 253772 -101352 -47560 341513 -147266 7419 100335 172710 113992 273383 -272852 207479
17948 -153354 -40341 453343 -149635 25108 196340 149876 61244 163761 -13943 56248 -287567
17936 -237763 -335979 -81345 -279660 335784 -110146 -73412 -88379 87394 -252256 205086
17925 237248 53351 -48165 65147 134162 471493 -185654 -39943 59840 22445 333975 17619
17913 50939 -172560 24899 -268573 -192552 71901 220409 -8095 -170406 -246726 69167 115555
17902A15555h1951A50552b84967A4341a14703n5714h2186j22761o1374A9824a9985
17890A10328m0508c58925J33892A00822h3592B00242B5109a32134j91426O3201
17880b60359B17152i1809B8004M24037A61465a06319B22709a17054d3232D3954
17869C286b8845G8063a40141c0511j63303J4386d0908n6268I6455h4624a3504
17857c6718r9599a4297j8926k7162B89328b61687B09433A5493N98771b05468E920
17845B5766f9446q6157j3744I8138a57600e6108a0889C23002h2306k21948J06327
17834a97927j49091A29643b20554A03365D8464a5807j88881j60238G8631b9102
17823F8861c11942B61038b00701g1902c1334A7758J10468O8188a2335B91577a02352
$$ plain form
17902 115555 -81951 150552 -284967 14341 -114703 -170417 -82186 -204947 -266321 19824 -19985
17890 110328 69820 -358925 -225033 100822 -83592 200242 25109 -132134 -323560 -260359
17880 -260359 217152 -91809 28004 452041 161465 -106319 222709 -117054 -43232 43954
17869 3286 -28845 78063 -140141 -30511 -193814 -179428 -40908 -97176 96455 -84624 -13504
17857 -36718 -136317 -14297 -33223 -60385 289328 -261687 209433 15493 614264 -205468 5920
17845 25766 -69446 -155603 -169347 98138 -157600 -56108 -10889 323002 -82306 -304254 -197927
17834 -197927 -347018 129643 -220554 103365 48464 -15807 -204688 -364926 78631 -29102
17823 68861 -311942 261038 -200701 -71902 -31334 17758 128226 196414 -12335 291577 -102352
17811a69939L4917k47161f6289C0702K30602b48847j6815h5951K1260B86143G5074
17799a10940k70946a72992A47801k9399a07475H6847A3131f156j8267q8538q3198
17788a96159A05803k7565a50835B10982a79400Q8128k02257C16559a85062A64121
17777A60246N2735c0001A19837e9635A84891L8857p7760J7703a26311D59387A2941
17765B50541b60531C2851L750a06485C8811d11762I760b39133C34913B8729L35169
17754C63898E780J57906k6463f6581q8009A42054g6921A17475a0967j67856j89272
17743c68095C14762B9107f4990E9731A3133K14525E9424i9428A71233i7610j0226
17732a07836C9023M7878A472a22580K9089j810G6271c47758C4465K49391e2634
$$ plain form
17811 -169939 -135022 -382183 -66289 30702 261304 -248847 -265662 -85951 -64691 286143 75074
17799 -110940 -381886 -172992 147801 118402 -107475 86847 13131 -6156 -24423 -112961 -196159
17788 -196159 105803 78238 -150835 210982 -179400 -91272 -293529 316559 -185062 164121
17777 160246 212981 -30001 119837 -59635 184891 223748 145988 163691 -126311 459387 12941
17765 250541 -260531 32851 36601 -106485 38811 -411762 9760 -239133 334913 28729 363898
17754 363898 5780 163686 137223 -66581 -154590 142054 -76921 117475 -10967 -178823 -368095
17743 -368095 314762 29107 -64990 59731 13133 227658 59424 -99428 171233 -97610 -107836
17732 -107836 39023 86901 1472 -122580 -93491 -95301 76271 -347758 34465 283856 -52634
17720g5049L3703A14254D2887r116R7619a69897A17963O4933o6554l1625i341
17708A78029q8764f3357G3748a95800a7813j85346I3037a63543A76403c23480
17697D8936M7710b00697A88579g1109A63684o2446h3231B14990e7729n0971k17338
17686c26038A39339j1380J06199g5748A60561h5237k5302j05323E7953Q594J93539
17675B60086E2787J8224K92580b83379B37736J2441c2003J1455j99870A467K5122
17664B6589b86859i1384B9446L83255a18525b4134B64167g8946B29074c2864A01424
17652A06669M2323p3695a25843A93775a23881f1392j51423a02591A92167K3292
17642B15459A04704J88466g3155D9765a15586d3917A12655P223a95164B14238
$$ plain form
17720 -75049 -41346 114254 42887 33771 131390 -169897 117963 182896 116342 84717 -9341
17708 178029 89265 -63357 73748 -195800 -17813 -203159 93037 -163543 176403 -323480
17697 48936 96646 -200697 188579 -71109 163684 101238 -83231 214990 -57729 -108700 -326038
17686 -326038 139339 127959 234158 -75748 160561 -85237 -110539 -215862 57953 66547 260086
17675 260086 52787 71011 363591 -283379 237736 250177 -32003 -20548 -220418 1467 26589
17664 26589 -286859 -91384 29446 412701 -118525 -24134 264167 -78946 229074 -32864 101424
17652 106669 148992 75297 -125843 193775 -123881 -61392 -212815 -102591 192167 215459
17642 215459 104704 293170 -73155 49765 -115586 -43917 112655 119878 -195164 214238
17631B64764j19970b93852B37595L907c02930a48084l4595f4093A46686b93529
17620b83196A8118K63997A173a99574D8855J07165b0039B17792E1065a83855B38870
17608G2641a62495B20485a65709A11005a80064G8692a00254j82624a41331j47966
17598b89297B83877a56006a4413A14754A9332a93633B93691p9117b7182B66136
17587E634K72120c37033J55984A13165J14497p5620M2688a21259d6439B611K26113
17576B28724K9274j28335c14727B4839J35626E3468a08120A53631a13513D24645
17565B84639b40484B19885j8662H6094b32831d222j05198A5117b25866c5597A92322
17553c8516A42576E0251a169k5055J2160o314j14957A0622R2951J86241a72562
$$ plain form
17631 264764 144794 -293852 237595 241502 -302930 -148084 -182679 -64093 146686 -293529
17620 -283196 18118 282115 1173 -199574 48855 156020 -20039 217792 51065 -183855 238870
17608 72641 -162495 220485 -165709 111005 -180064 78692 -100254 -282878 -141331 -289297
17598 -289297 283877 -156006 -14413 114754 19332 -193633 293691 214574 -27182 266136
17587 5634 277754 -337033 -181049 113165 227662 152042 194730 -121259 -46439 2611 228724
17576 228724 257998 129663 -314727 24839 160465 53468 -108120 153631 -113513 424645
17565 284639 -240484 219885 201223 86094 -232831 -4222 -109420 15117 -225866 -35597 192322
17553 -38516 142576 50251 -1169 -26224 -14064 -20378 -135335 10622 103573 289814 -172562
17541D34830a77430b2020D8378a38209J0578A12464N2533f7703A92160J73695
17531C65855c0228A87507e872B46607o3071d1652C63270D0458A824L90691A19578
17519F2955J00512d0951l5562J2351F19694F0190K91770j63590a17054C1267L46301
17508C77568j85379l6503a52328O0073A7923g609j23751J2392A98818K2797N4079
17497B75694O7657r3048J19296H8702j4550L94919I3629L83613k02186H4131J32337
17486B16468L4456n3624d12862E1065e9643m7122n6990B16426I4952D6937O1106
17475A08043L373J99367m7121J10920D6521L8450R2871K76212A10040J57935I3076
17463B09564D1208K7473k5718Q5816D6233R2642B6216O01704e9929A81245q5022
$$ plain form
17541 434830 -177430 -22020 48378 -138209 -127631 112464 164997 -67703 192160 365855
17531 365855 -30228 187507 -5872 246607 183536 -41652 363270 40458 1824 392515 119578
17519 62955 163467 -40951 -76513 -64162 619694 60190 351960 188370 -117054 31267 377568
17508 377568 192189 155686 -152328 -92255 17923 -7609 -131360 -118968 198818 221615 275694
17497 275694 343351 250303 369599 88702 74152 469071 93629 477242 275056 84131 216468
17486 216468 250924 197300 -412862 51065 -59643 -106765 -163755 216426 94952 46937 108043
17475 108043 111416 310783 263662 374582 46521 84971 177842 454054 110040 267975 93076
17463 209564 41208 68681 42963 128779 46233 138875 26216 627920 -59929 181245 96223
17452I6223J67325n7683J20637j01279L7298N07J2471O2777m4800J4023N750h1926
17439B37719Q2317J68484j72343K43102B28329A08196O2289M23880B28689J44614
17429C73303D4040K42117f9720A23697b04304E4045J75290J60437j72036b3037
17418E69228A65021G0847K39018k6274J19855k0867q3725A48903m5737K80851
17408C84017B38L4469M30126A20661J18004A9891J35634a76871A86346P944D1026
17396A18816K30263I9173j5688K64223j54946h678k56123C71737h378j77521B47794
17384B72914o9848L42855F6053L79067A45886n2557k2760J9829d6877o6578m1829
17373a55284A44789L12a74540B66982J8625n0710N201J34856e0210D12753a2242
$$ plain form
17452 96223 263548 205865 326502 225223 262521 263028 275499 338276 293476 307499 313249 -81926
17439 237719 320036 488520 316177 559279 228329 108196 170485 594365 228689 373303
17429 373303 44040 286157 -69720 123697 -204304 54045 229335 389772 217736 -23037
17418 569228 165021 70847 309865 283591 403446 382579 298854 148903 103166 384017
17408 384017 238 34707 464833 120661 238665 19891 155525 -176871 186346 194290 41026
17396 118816 349079 99173 83485 347708 192762 -8678 -264801 371737 -8378 -185899 247794
17384 272914 203066 545921 66053 445120 145886 93329 70569 90398 -46877 -113455 -155284
17373 -155284 144789 145101 -174540 266982 285607 234897 240098 374954 -50210 412753 -12242
17361C29492F7864P9641n1874a21168F3331b4065A94798A2827R3433r475f5555
17349C23539A11206c133B2375K42899m7215C6089M3360f2912C60137j36403I1083
17337e1677D2281R9973D43J64639m9730f1194o5292C41941O7960H0283l273J76604
17325B53614K87749j43944I9649J00430J16341p9633D7989R5292J19561J93399
17315D56241B07540N3528b13368g8894A86158L90691B28829m6057K21853k00751
17305B03874J04819M4788l6157p2523o2712j919q0875R9650K15343A90191J59221
17294C49412J35303k9333j98034a36885E061K09804J06390f7419j6551c6290B01870
17282D63134j70469k0525o2488j966Q4402j8153H5055b19717i3525C52264j25336
$$ plain form
17361 329492 67864 147505 95631 -121168 63331 -24065 194798 12827 106260 96785 -65555
17349 323539 111206 -3133 22375 265274 218059 36089 79449 -62912 360137 223734 91083
17337 -51677 42281 142254 443 165082 115352 -61194 -126486 341941 409901 80283 77010 253614
17325 253614 541363 397419 99649 200079 316420 236787 47989 143281 262842 456241
17315 456241 207540 261068 -213368 -78894 186158 576849 228829 182772 404625 203874
17305 203874 308693 353481 317324 244801 182089 180170 99295 198945 414288 190191 349412
17294 349412 484715 455382 257348 -136885 5061 214865 321255 -67419 -83970 -36290 201870
17282 463134 292665 272140 209652 207686 292088 273935 85055 -219717 -93525 352264 226928
17271B26928R1239A31751g513A63903J43402a7016B60638J16194n7415k2856p2943
17260B23618o6162L07091j66303N5134K0613A36007k2595i8985b9605A26455L2343
17249A58798O2027q0762N798K20527e1172b259E42761j66745a75152B70905p9021
17238A91884J70171o7769G2623Q7449Q8516n2600Q1950j31100J53636n426A42299
17226d1211F1916k6635M18494k21990J29921A44060J4934L89946i5812A34655
17215B99223A35483O1591J07715p7372J60956J88779j18853A01035J71464M85706
17205G58205k89535k04315J65410K3422j89470j969H8396L84774A11967K00439
17195C12406A374L27513O3581L5352I2757K09205k3824r4543D4624L33416d477
$$ plain form
17271 226928 318167 131751 -7513 163903 307305 -17016 260638 376832 319417 296561 223618
17260 223618 157456 464547 298244 353378 373991 136007 113412 -98985 -29605 126455 158798
17249 158798 220825 140063 145861 366388 -51172 -2259 542761 376016 -175152 270905 191884
17238 191884 362055 294286 72623 160072 248588 195988 277938 146838 300474 295048 142299
17226 -41211 61916 35281 453775 231785 361706 144060 158994 548940 -95812 134655
17215 299223 135483 197074 304789 227417 388373 577152 458299 101035 272499 758205
17205 758205 468670 264355 429765 453187 263717 261748 88396 473170 111967 312406
17195 312406 1374 328887 392468 427820 92757 301962 278138 183595 44624 378040 -4477
17183H2410B4929J37202J03796r5347p6958N01161j55115j11440A59620n8856
17173A00764K68668j35397q524Q2453A8857J87346Q306O5099k8404A23648P0977
17162A94625j0887L66647B56833K01262C0822L76772k6070A63406J87450O9046
17152D19902i580D27841K49803C28864O9741r5329j15543J94182J53870j67569
17142C68216K99730l13890J62813d2425E14565l0978k09647j0506P0012n0243
17132B83203P2386m2794m0670m4460O17815C65663j81824K21097Q9491B31919
17121F53709C15651K75552d3523B48057K5691R6682j34285M3256J3098J86789
17111D79288A29409M5994a7314F6719K07069q101N91140l72812j06267p6820J74297
$$ plain form
17183 82410 24929 162131 265927 170580 93622 594783 439668 328228 159620 100764
17173 100764 369432 234035 225511 307964 18857 206203 214509 279608 251204 123648 194625
17162 194625 183738 550385 256833 458095 30822 407594 381524 163406 350856 419902
17152 419902 -9580 427841 677644 328864 398605 303276 187733 381915 535785 368216
17142 368216 667946 354056 516869 -42425 514565 483587 273940 263434 333446 283203
17132 283203 355589 312795 272125 227665 845480 365663 183839 404936 494427 231919
17121 653709 315651 591203 -43523 248057 273748 370430 236145 279401 292499 479288
17111 479288 129409 175403 -17314 66719 273788 265687 856827 484015 377748 300928 475225
17100D75225o3319j27372M30717l25181A04157K7916L20442j1321j3873J64642
17090E91963q702k29395J83284j86724L46869k28351A80613J60023O5074M97710
17080I03420l37984j32278J87512j51153n5036J80336O4139k91855K62617p231
17070F22487j26020k36193J97065J28855k0531l2066k31812K51277r8677k19191
17060B35194M23332n8514N93K47613B10161K3658K85653j61675K38167j69051
17050D26913J17549M7996L36634k85563k91833k004K38303B60359K27194M1378
17040E28931J82023o3212j39077N1435J72228m6332j12009l661K60891k87631
17030E43586K28801q097l529C63999M56091C39721L58200j73426P2455J04894
$$ plain form
17100 475225 411906 284534 715251 390070 104157 132073 452515 441194 427321 591963
17090 591963 583261 353866 537150 350426 697295 468944 180613 340636 405710 903420
17080 903420 565436 433158 620670 469517 414481 594817 658956 367101 629718 622487
17070 622487 496467 260274 457339 586194 565663 533597 301785 553062 454385 235194
17060 235194 658526 600012 600605 848218 210161 233819 519472 357797 595964 426913
17050 426913 544462 592458 929092 643529 351696 349692 587995 260359 487553 528931
17040 528931 710954 647742 508665 560100 732328 685996 573987 570326 831217 543586
17030 543586 772387 764290 760761 363999 820090 339721 697921 524495 596950 701844
17020G01844r23J0046l62K68820k59602k4243N121K97704l3272k5064K55903D42763
17007H91609l51154K18035L10816m65984q0688L95901o9044j86581K19441M76809
16997A359160l17323l48032K84075m13826J10998L15518l82906K59019K38952
16988A105635m13535L22578k81154K19739k53801N5347m9010K29694j05275r3486
16978G36732K79237j16151k1718N02623l59026M2907m37575J94552j97424L67184
16968I91341j18219J41335k52386M20661n7640K13521j36109k55600L3788O40050
16958A620742l87098J37404l35587M6173p955m0934L91361k22539j00551L3687
16948A134703o1244J6550J78336k9492J31099l59535K32913L1748Q460l2078R4900
$$ plain form
17020 701844 700921 710967 710605 979425 719823 695580 700701 998405 965133 940069 1195972 442763
17007 891609 540455 758490 1069306 603322 522634 918535 849491 662910 882351 1359160
16997 1359160 1041837 693805 977880 564054 675052 990570 607664 866683 1105635
16988 1105635 692100 1014678 733524 953263 699462 754809 705799 935493 830218 736732
16978 736732 1015969 899818 878100 1380723 1021697 1064604 627029 821581 624157 991341
16968 991341 873122 1014457 762071 1182732 1125092 1338613 1202504 946904 980692 1620742
16958 1620742 1233644 1371048 1035461 1081634 1073679 1032745 1424106 1201567 1101016 1134703
16948 1134703 1073459 1090009 1268345 1238853 1369952 1010417 1243330 1275078 1283538 1251460 1346360
16937A346360Q8015k90025K57715j54137j69103L31862q0871k45931M16104n2544
16927A447445K50301q5341k2692r6729J78483m85827N34862O3296r567l00925
16917A473306j41056M12379k21241K1352j33432K81253n0564K78577j29150L59912
16907B151336o19859M32008m27276M64364l14794m3311J91973j2135J66836M9599
16897B038741m6290P9720j22283K0092j05449K61708m62475M12903o005J49154
16887B219816M0738L1744R9711J7325p9834k42359K26243J14105M10121n56792
16877B280818K40797l45923K89816j32923K19876J37951J63415q6526J60835m6036
16867B882100j21274K62112J4549K28776l82150N9315J41413J01303j2528L54236
$$ plain form
16937 1346360 1434375 1144350 1402065 1247928 1078825 1410687 1329816 1083885 1499989 1447445
16927 1447445 1697746 1612405 1589713 1492984 1671467 1185640 1720502 1783798 1774231 1473306
16917 1473306 1332250 1744629 1523388 1544740 1411308 1692561 1641997 1920574 1791424 2151336
16907 2151336 1531477 1963485 1536209 2000573 1685779 1642468 1834441 1822306 1989142 2038741
16897 2038741 1992451 2072171 1949888 1969980 1864531 2126239 1663764 2076667 2070662 2219816
16887 2219816 2260554 2292298 2392009 2409334 2329500 2087141 2313384 2427489 2837610 2280818
16877 2280818 2521615 2175692 2465508 2332585 2552461 2690412 2853827 2767301 2928136 2882100
16867 2882100 2760826 3022938 3037487 3266263 2884113 2943428 3084841 3186144 3173616 3527852
16857C527852l99674J57202Q1881M30086n47065K28172m5693M4742k26286K25102
16847C476319L34070j20763N15245n55230M42865Q233j3080N8707L40290k76186
16837D210470K23873j62825J78295J09171J4979k05207O88949k43291R1422j14211
16827D791625J93279l2285K43431P4161L66768J13800q9750P7349J98258q8200
16817E848436J52550P1967K73488p351J49718L52145K03356k91497K30953K99142
16807G282907L44130j29318L13869j93672O56221L78968k58753K94599M8748M44225
16797I181924j34839N70098p3536L75861J99845O8531M37184L30965L22606K00311
16787A1478950L75155N44790K05582j3747O89013m9411P48463L94937L40642O19441
$$ plain form
16857 3527852 3128178 3285380 3367261 3797347 3250282 3478454 3432761 3477503 3251217 3476319
16847 3476319 3810389 3689626 4204871 3649641 4092506 4100739 4087659 4146366 4486656 4210470
16837 4210470 4434343 4271518 4449813 4558984 4573963 4368756 5057705 4814414 4905836 4791625
16827 4791625 4984904 4952619 5196050 5270211 5636979 5750779 5661029 5738378 5936636 5848436
16817 5848436 6000986 6072953 6346441 6339090 6488808 6840953 7044309 6752812 6983765 7282907
16807 7282907 7627037 7497719 7811588 7617916 8274137 8653105 8394352 8688951 8737699 9181924
16797 9181924 9047085 9617183 9543647 9919508 10119353 10187884 10625068 10956033 11278639 11478950
16787 11478950 11854105 12398895 12604477 12590730 13279743 13230332 13978795 14373732 14714374 15333815
16777A5333815M13635N9213O10165P41913J94210O54013O87333Q31569O07046
16768B0132912N20396P91093Q63141R75512O57758P52843P66976J308519J426587
16759B8195737N56622J049280J352136J429037J793380Q40658J517070J904661
16751C8638581J691129J725841J870727K020800K301096J999009K851140K172766
16743E5271089K818974L371604L302003L213849L715207L581398M256934M177860
16735H3708918M279684N361451M669573N777914M846868N740978N806371O002577
16727A26194334N955948O205333N573234N593088N973965M601489M553114L648622
16719A68299127K781487K632174J352166k49888j59216j944087k260952l615768
$$ plain form
16777 15333815 15747450 15806663 16416828 17158741 17352951 18006964 18694297 19525866 20132912
16768 20132912 20653308 21444401 22307542 23283054 23940812 24693655 25460631 26769150 28195737
16759 28195737 28752359 29801639 31153775 32582812 34376192 35216850 36733920 38638581
16751 38638581 40329710 42055551 43926278 45947078 48248174 50247183 53098323 55271089
16743 55271089 58090063 61461667 64763670 67977519 71692726 75274124 79531058 83708918
16735 83708918 87988602 93350053 98019626 103797540 108644408 114385386 120191757 126194334
16727 126194334 132150282 138355615 143928849 149521937 155495902 160097391 164650505 168299127
16719 168299127 171080614 173712788 175064954 174815066 174655850 172711763 170450811 166835043
16711A66835043m105019m685151n340850n661494o167234n949179n929920o191720
16703A22804476n981477o100027n406531n730492m972274m986295n074812m732735
16695G9819833l770824m284864l812759l505065l268405l338601k503005k841460
16687E2494850k887019k265985k361057k257421j908360j458718k026461j636621
16679C5693208j359178j693245j342446j531094j252924p44383j563068j029660
16671B5177210o99982o92179q61928q45971j252856l58423j030292n84896o27051
16662A8223632m99762m53030q71462m78817m31218l83093o26464m52052n11553
16653A3516181j46324l18426q74700j05528j9574j170600L88265p43416l01714
$$ plain form
16711 166835043 162730024 158044873 152704023 147042529 140875295 134926116 128996196 122804476
16703 122804476 116822999 110722972 105316441 99585949 94613675 89627380 84552568 79819833
16695 79819833 76049009 71764145 67951386 64446321 61177916 57839315 55336310 52494850
16687 52494850 49607831 47341846 44980789 42723368 40815008 39356290 37329829 35693208
16679 35693208 34334030 32640785 31298339 29767245 28514321 27769938 26206870 25177210
16671 25177210 24477228 23785049 22923121 22077150 20824294 20465871 19435579 18850683 18223632
16662 18223632 17723870 17270840 16399378 15920561 15489343 15106250 14479786 14027734 13516181
16653 13516181 13369857 13051431 12176731 12071203 12051629 10881029 11269294 10525878 10224164
16644A0224164l6951j99367k23458j70840m64948J72416n75705m33176K73627
16635H565762l69010l02799l32952p6121L5454l05315q729k95115k10008J22844
16625F824011m79530N5839j33256p7421j46122n16092O4614j37879j64046n0738
16615E239380k68232J5573k11689J36420k84815O9766J07327j09742L5597j29981
16605D599604j98522j68042K64595l59594L4746l59097K5250l10277J95699j38115
16595C586247l37449R9524K4582K57314k60790j80714J22192J41398o74203j29968
16585B648133M19427l1479p7814P4958k99751J98897l72413J93580K62650m25159
16575B591029r2828N8833J42587n0149l25070n4905l3228M78416l15239m4444
$$ plain form
16644 10224164 10187213 9987846 9764388 9593548 9128600 9301016 8725311 8292135 8565762
16635 8565762 8196752 7893953 7561001 7484880 7520334 7215019 7206290 6911175 6701167 6824011
16625 6824011 6344481 6400320 6267064 6189643 6043521 5527429 5592043 5454164 5290118 5239380
16615 5239380 4971148 4986721 4775032 4911452 4626637 4696403 4803730 4693988 4729585 4599604
16605 4599604 4401082 4233040 4497635 4138041 4172787 3813690 3838940 3528663 3724362 3586247
16595 3586247 3248798 3348322 3372904 3630218 3369428 3188714 3310906 3452304 2778101 2648133
16585 2648133 3067560 3036081 2958267 3033225 2733474 2932371 2559958 2753538 3016188 2591029
16575 2591029 2498201 2557034 2699621 2649472 2324402 2269497 2236269 2714685 2399446 2355002
16565B355002p3310R2354p14284N60054j39389K20602r0458o9071k4705n8701
16555B058094P4321j40309m0667l0418J57629j14949r7773k42717j91821N29401
16545A960791k75627p1181o6236J45633k87031m5731K13742J04237O6384j30589
16535A614392r1069K1930J52246N3025k80375r0975L43295m26862L46485m63986
16525A178106J80559k83937K41004o4444j58345J0886K84573l03969J22719k67783
16515I39369K46336j49220j4161k0097k1288J81458o3998J01487k36451L10243
16505A273678k75477p0358p8858k6766K61059L1028p4226l08200M12981k33895
16495I10966j42186q8850M61383k77383l9480P1735r8781O27008o11558J50022
$$ plain form
16565 2355002 2281692 2374046 1659762 2219816 2080427 2301029 2210571 2141500 2116795 2058094
16555 2058094 2132415 1992106 1951439 1921021 2078650 1963701 1865928 1623211 1431390 1960791
16545 1960791 1685164 1613983 1547747 1693380 1406349 1360618 1574360 1678597 1744981 1614392
16535 1614392 1523323 1545253 1697499 1750524 1470149 1379174 1722469 1295607 1642092 1178106
16525 1178106 1358665 1074728 1315732 1251288 1092943 1103829 1388402 1084433 1207152 939369
16515 939369 1185705 1036485 1022324 1002227 980939 1162397 1098399 1199886 963435 1273678
16505 1273678 998201 927843 848985 822219 1083278 1114306 1040080 731880 1144861 910966
16495 910966 768780 679930 1141313 863930 824450 896185 797404 1424412 812854 962876
16485I62876K77092j88467J64908m28813N01974m78244J01243J35858l15699J56876
16475H89604K11672k99725k91973L06405j2715o1694J25387C71547K16376K40021
16465H27944k72305J86555k23309N19748k87012m2273k3838l6086J88952K7327
16455H65703k7359B73647L66819j01568j18338l2565K18838J62779q7469l03364
16445C78779L84356R0932j00971j23726J44425C04241J17540N2779J49084j56177
16435D67467M7008K52765l12456o0696K33358m8647K3316k86171o6713L94213
16425F43444k47239N3260L7775j11231L7381L21781k51821n9778j44k3791J9201
16414D18838M6732J06710N3853j37134M85011l84735B71777j32185K25760J76341
$$ plain form
16485 962876 1239968 1051501 1216409 787596 1289570 811326 912569 1048427 732728 889604
16475 889604 1101276 801551 509578 815983 803268 741574 866961 371547 587923 827944
16465 827944 555639 742194 518885 1038633 751621 709348 685510 649424 838376 865703
16455 865703 838344 273647 640466 538898 420560 387995 606833 769612 682143 378779
16445 378779 763135 854067 753096 629370 773795 304241 421781 474560 623644 467467
16435 467467 514475 767240 454784 394088 627446 578799 602115 315944 249231 643444
16425 643444 396205 449465 487240 376009 413390 735171 483350 423572 423428 399637 418838
16414 418838 465570 572280 626133 488999 974010 589275 271777 139592 365352 541693
16404E41693j9570j34816K54786N9921B59075K19842k08818m0045J63831L15515
16394G09400k03861M1433j06128M7520n1436J0232j13115M4516J30123r6194B9021
16382B39900J51297M9097A93531C4449K95035N3097J39277B26062k6245k8977
16372A70840J49390i1741A49970B9648N35743j95213Q974j28601I7009d9125H9059
16360C28568M2881P7005f2403A94798q729E0272J14316J42314D1559J29177K05682
16349C76418F2983J72544J6966L44598k60886D7310a11881B73329K45724q7123
16339D31930o6392A07097K98970M4432g6690D55296J10445j06001b02476b5216
16328B86352M1728j41213J12155L13518k29417q5758A18010J93187L62131B46958
$$ plain form
16404 541693 522123 387307 642093 702014 259075 478917 270099 230054 393885 709400
16394 709400 505539 546972 440844 488364 436928 447160 334045 378561 508684 412490 29021
16382 239900 391197 440294 193531 34449 329484 382581 521858 226062 199817 170840
16372 170840 320230 -91741 149970 29648 565391 370178 379152 250551 97009 -49125 89059
16360 328568 371449 448454 -62403 194798 186069 50272 164588 306902 41559 170736 376418
16349 376418 62983 235527 252493 597091 336205 47310 -111881 273329 519053 431930
16339 431930 365538 107097 406067 450499 -76690 455296 565741 459740 -202476 -25216
16328 286352 328080 186867 299022 612540 383123 297365 118010 311197 673328 246958
16317C72895j10110c0625B98281m9295K71633g4055A50252M64595k69252j02532
16307B43063N8542o1653r6172J6119f2286p196D52714k04859L5641o2409l3804
16296A87283n3637j0930J10654I0563J10581o7429c26460b4165A26355J28523
16286B54878O1954G2917J76330b2479A15583J64178A05006m612L0175a2982A39834
16274B34019a55971A0932J00367d7620C53201j14179j10488a16853F1921M05211
16264D67132B07152J75414A67959k7531E3774K04733J87512G3736k2893J98442
16254B49285a04050I72J46211R4970J03851e8496C53662A65857J88939A54639
16243D19496c4928B32429a29215B24392D5602K75876Q1170d4722A75375D6580
$$ plain form
16317 372895 262785 -30625 298281 248986 520619 -74055 150252 614847 345595 243063
16307 243063 301605 239952 143780 159899 -62286 -69482 452714 247855 283496 221087 187283
16296 187283 133646 122716 233370 90563 201144 133715 -326460 -24165 126355 254878
16286 254878 316832 72917 249247 -22479 115583 279761 105006 100394 130569 -12982 139834
16274 234019 -155971 10932 111299 -47620 353201 239022 128534 -116853 61921 467132
16264 467132 207152 382566 167959 140428 53774 258507 446019 73736 50843 249285
16254 249285 -104050 972 147183 242153 346004 -58496 353662 165857 354796 154639
16243 419496 -34928 232429 -129215 224392 45602 321478 402648 -44722 175375 46580
16232A80159J77487e7487G8550a81902E9140B5503J52652b41553A11519f2015
16221A15370A3516J6690b43C1120J88069G4869K54999j31252a64212J0995A3291
16209a46910A45707N3050h2309F6690J62657H7112N4282m203a15527b4725j06210
16198a30935H9776K60579j67793b9500B1597J00099m6350J23182r1285k6293f2305
16186a47595A27020K22967g104C47755C351K06096a57508A03878A1050N8623a80580
16174a36180K3666B78h1070j2929c963E9445K02097B5872J57859Q0151J31341
16163C95223C4160J21594J13979H0207a62352O6047j2254D9722J59241B6745J37919
16152A64664a42901F1687A3068a37279D39963F9071a0461B07797J0493f6192A01715
$$ plain form
16232 180159 357646 -57487 78550 -181902 59140 25503 178155 -241553 111519 -62015
16221 115370 13516 30206 -243 31120 219189 74869 329868 198616 -164212 -153217 13291
16209 -146910 145707 198757 -82309 66690 229347 87112 141394 137191 -115527 -24725 -130935
16198 -130935 89776 350355 182562 -29500 21597 121696 75346 198528 107243 80950 -62305
16186 -147595 127020 349987 -7104 347755 3351 209447 -157508 103878 11050 69673 -180580
16174 -136180 -112514 278 -81070 -93999 -3963 59445 261542 25872 183731 263882 395223
16163 395223 34160 155754 269733 80207 -162352 -96305 -108559 49722 208963 26745 164664
16152 164664 -142901 61687 13068 -137279 439963 69071 -10461 207797 218290 -66192 101715
16140f414C43637f6184Q963F7238b68181e9883A75073C6808a39B24812G0660C4262
16127B91889E4031b80311c6312A08508b5617B3197a14721j35668b3989A16937
16116b06206F5853k8210d94799b1734E4213g3559B37663b29410E8755b04132C09493
16104b4060k6410B8204L21003Q6482I3419K83309j76182i6732B2016R8163L60612
16093D80791a03959L9843b4371j1051j22641F3024c63159J69875C2948g5926E4764
16081b87541J17764A17038Q652K23882a2707m5647m8325e1187j23352A67063b3702
16069d26874G017i2616J1348D15029b07976b1451c788l86054B6318i2362B24355
16057a85305N3642j9413c7698E1684K3807b7423k5219B26903b69886e1990l65893
$$ plain form
16140 -6414 343637 -66184 -57221 67238 -268181 -59883 175073 36808 -139 224812 70660 34262
16127 291889 54031 -280311 -36312 108508 -25617 23197 -114721 -250389 -23989 116937
16116 -206206 65853 37643 -494799 -21734 54213 -73559 237663 -229410 58755 -204132 309493
16104 -24060 -50470 28204 349207 435689 93419 376728 200546 -96732 22016 120179 480791
16093 480791 -103959 -64116 -24371 -35422 -158063 63024 -363159 -193284 32948 -75926 54764
16081 -287541 -169777 117038 125690 349572 -12707 -58354 -106679 -51187 -174539 167063 -23702
16069 -426874 7017 -92616 -81268 415029 -207976 -21451 -3788 -389842 26318 -92362 224355
16057 -185305 -131663 -151076 -37698 51684 75491 -27423 -52642 226903 -269886 -51990 -417883
16046d17883P2728e9480C58158j36674l5992h6472K6439q8012k14111a9303i563
16034A75900a63051H6891J12180a53751M4351q0746I1233R3238l0373m1023k2739
16023I0336j5766a23451m6131K9693j08546A26024a61275B85812A3680a92283
16012E640a58166A29687K651a35025m569D46613d2236B16924I6505a70416K2497
16001a47919B18649B6281j426a48889C815g973n364o0306a4792n5105I7045e828
15988b30890A45599a98659l0323B43889a71895G97a24953B49527A17171Q5677
15978B02848a13453A01420J0049R5540E7749P6079l650N7641A2536Q351i8421
15966b09726H9670a24711F3722a25132m4748B23567q5107J6522e9185b5557B85252
$$ plain form
16046 -417883 -345155 -59480 358158 221484 185492 -86472 -60033 -148045 -362156 -19303 -9563
16034 175900 -163051 86891 199071 -153751 -109400 -190146 91233 184471 154098 113075 90336
16023 90336 74570 -123451 -169582 -139889 -248435 126024 -161275 285812 13680 -192283
16012 5640 -158166 129687 132338 -135025 -139594 446613 -42236 216924 96505 -170416 -147919
16001 -147919 218649 26281 24855 -148889 3815 -7973 -13337 -73643 -14792 -69897 97045 -5828
15988 -230890 145599 -198659 -228982 243889 -171895 797 -124953 249527 117171 202848
15978 202848 -113453 101420 111469 207009 57749 133828 130178 187819 12536 20887 -98421
15966 -209726 89670 -124711 63722 -125132 -169880 223567 138460 154982 -59185 -25557 285252
15954F3165a86428a8842j18437d2547n951m7110B5775J72679E6397a53823c6521
15942b46229a00604A02744K48311a44528A99390c7286J8537B57781a65648B28004
15931c55841c990A95067I4247d0987j62754i008B20797B384K3449b49996D7929
15919g4154a168H8327J9393a64291O5376d1058k18518B6825J9934a10229B71849
15907A50378E8063b74325J07828A96827c28952A50742O4869b03129A2523b74057
15896B30540J06771k3549C8017e9406B32574j06520c17725a04021c0327A57895
15885A63900b70900A56189K2270j4577b58638A41102a29227m8740k18612j75307
15875e71886K37421c4961j29740k01149d0660j99230R4019G1783h2887l12244
$$ plain form
15954 63165 -186428 -18842 -137279 -42547 -48498 -95608 25775 198454 56397 -153823 -36521
15942 -246229 -100604 102744 351055 -144528 199390 -37286 -18749 257781 -165648 228004
15931 -355841 -3990 195067 94247 -40987 -203741 -9008 220797 2384 25833 -249996 47929
15919 -74154 -1168 88327 107720 -164291 -98915 -41058 -259576 26825 46759 -110229 271849
15907 150378 58063 -274325 -166497 196827 -328952 150742 215611 -203129 12523 -274057
15896 230540 337311 313762 38017 -59406 232574 126054 -317725 -104021 -30327 157895
15885 163900 -270900 156189 178459 163882 -258638 141102 -129227 -177967 -396579 -571886
15875 -571886 -334465 -34961 -164701 -365850 -40660 -239890 -145871 71783 -82887 -395131
15865c95131a53594D6644a37198F4824h3654j38959B47499O336J45157c5032j04642
15854a39674B03765C0845K08818a89265B32995a50078B80909c06350h7859c3168
15843d5380H101J25207f1409k7619D6397i7026A58470f9903b9526G0072C2824
15831a1411l57639a79446k8389d700k2187l402D9523b17636i0369p01A50548L4567
15819A85115i0668m8120E4584a60649j0899A33607a48056d562j48339e3955G1390
15807a49302j2539P2347E9178b34632A35063c58161E255J59361d8491m1358j04232
15796a94081g5538E3953j5026P1605f165k14177a06709A00571r62b35935A34492
15784g4796n5491A2448K988a30979d3345J7823k6613j4523b1165B2758J59902
$$ plain form
15865 -395131 -153594 46644 -137198 64824 -83654 -222613 247499 253835 398992 -35032 -139674
15854 -139674 203765 30845 239663 -189265 232995 -150078 280909 -306350 -87859 -33168
15843 -45380 8101 133308 -61409 -89028 46397 -97026 158470 -69903 -29526 70072 32824
15831 -11411 -369050 -179446 -207835 -4700 -26887 -30289 49523 -217636 -90369 -91070 150548 185115
15819 185115 -90668 -138788 54584 -160649 -171548 133607 -148056 -4562 -152901 -53955 71390
15807 -149302 -161841 -89494 59178 -234632 135063 -358161 5255 164616 -48491 -89849 -194081
15796 -194081 -75538 53953 38927 110532 -6165 -220342 -106709 100571 99609 -235935 134492
15784 -74796 -130287 12448 15436 -130979 -43345 -25522 -52135 -66658 -21165 22758 182660
15773A82660c8438A45082B3497b54301i3494A6401a91101A7629c11327f6842A08653
15761A77568b61349A51772J73336A40055G27J04256J65750E365a5936j68517A77732
15749D6499J50206a06847k60043a41195A61317c12282J36937M754c9078k19583
15739b58661A94453b51146h5574I0509d9335o0691a1298B05525L3166a25130j33579
15728b58709l4050A33587d22599J17472J49250f7340j21382L5921A08291m3472
15718F4819b25236O983B0201a77091f6021r8846j41061A130a57430A06233c4961
15706C9337e1053G5613c32279J27481q0749k6172a44339A01818e301j98759l2184
15695b36244H2357N9183d4728E096J82877b35881A28946d9910J2484k50936a04235
$$ plain form
15773 182660 -38438 145082 23497 -254301 -93494 16401 -191101 17629 -311327 -66842 108653
15761 177568 -261349 151772 325108 140055 727 104983 270733 5365 -15936 -184453 177732
15749 46499 196705 -106847 -366890 -141195 161317 -312282 -175345 -170591 -39078 -258661
15739 -258661 194453 -251146 -85574 90509 -49335 -110026 -11298 205525 238691 -125130 -258709
15728 -258709 -292759 133587 -422599 -305127 -155877 -67340 -188722 -152801 108291 64819
15718 64819 -225236 -218253 20201 -177091 -66021 -164867 -305928 1130 -157430 106233 -34961
15706 39337 -51053 75613 -332279 -204798 -285547 -311719 -144339 101818 -5301 -204060 -236244
15695 -236244 82357 141540 -44728 5096 187973 -235881 128946 -49910 -37426 -288362 -104235
15683c387C09536c4168A42263b62752B60994d111o8376j23213A1097h7375b6716
15671a71948A02642B0661K6815b57811A51512c23768a53727o7100d5534j33698
15661a79232C2444K04164a03353d5203r1855A55889d0169l4960q7104j51782a03241
15649b19946B15359c2630n8789m4917A06829k6773K42910e5896B95072k3830J28253
15638C99495a28328O2724A68219B4740K36100j08231Q63l229a12356F9631O528
15627G6159i6907I7527a9955I063O0486a80424O8358j57555J14658E40244A25841
15615i1806A98570n0094n6228b56802P7749A63540b04063A87417a50885G5757
15604B4137b03934A51183B5963e6485A80629D3709e8057r1520E0508g9865L8925
$$ plain form
15683 -3387 309536 -34168 142263 -262752 260994 -4111 -72487 -195700 11097 -87375 -26716
15671 -171948 102642 20661 47476 -257811 151512 -323768 -153727 -220827 -45534 -179232
15661 -179232 32444 236608 -103353 -45203 -137058 155889 -40169 -75129 -162233 -314015 -103241
15649 -219946 215359 -32630 -91419 -136336 106829 80056 322966 -55896 295072 271242 399495
15638 399495 -128328 -65604 168219 24740 260840 152609 153472 150243 -112356 69631 76159
15627 76159 -96907 97527 -19955 9063 69549 -180424 -112066 -269621 -154963 540244 125841
15615 -91806 198570 148476 92248 -256802 -179053 163540 -204063 187417 -150885 75757
15604 24137 -203934 151183 25963 -56485 180629 43709 -58057 -149577 50508 -79865 -40940
15593d0940a0527j43478K0133L1989j7307I4043c29979a32648A9606h2272c5866
15581a94074O8476j5678k0996B6704B805g556B52383e5137a89H2147d8489J44
15569d8345A19775k0889a43880B05400b39588C78323A22467K27142c1012a1951
15558C26706a74580a1812j67376F8464B237b68414B30658m3074b9432k77409A06898
15546C814K3709g3643B4411f1273B97192j41984b88705E7107K96149a9916B01046
15534a14206a5539A73562G6899C8328C587R3277d3249G7917a70482L1934j5418
15523a53966H5803d7052k1630b7507I6456m0599c7194j76403O6605A15658a28995
15511B48234D343a2298l7875B19906f7564C56531n4015c5709a3377j93593N2719
$$ plain form
15593 -40940 -10527 -154005 -133872 -101883 -119190 94043 -329979 -132648 19606 -82272 -35866
15581 -194074 -125598 -141276 -162272 26704 2805 -7556 252383 -55137 -189 82147 -48489 -48345
15569 -48345 119775 98886 -143880 205400 -239588 378323 122467 349609 -31012 -11951
15558 326706 -174580 -11812 -179188 68464 2237 -268414 230658 187584 -29432 -306841 106898
15546 3814 27523 -73643 24411 -61273 297192 155208 -288705 57107 353256 -19916 201046
15534 -114206 -15539 173562 76899 38328 3587 96864 -43249 77917 -170482 -138548 -153966
15523 -153966 85803 -47052 -68682 -27507 96456 55857 -37194 -213597 -146992 115658 -128995
15511 248234 4343 -12298 -50173 219906 -67564 356531 302516 -35709 -13377 -206970 -154251
15500a54251k5019A1839b342E39751k39032m6918b18002A39378h7718r8675C18153
15488B45877b9424D8905c37340C20042b50727B08774b84104O2184B66391I3731
15477B76585a98711H2706C8118O5317J23339q2799a09744H4126B6921a35494J3056
15466a22438n4311M8278A00700A7709Q7637a48540e5595I7038o479B7748L6273
15455F4021B9828J96191p6100A3423L8542j5375h607r3125a1068E9325a5871C2713
15442B00527I688c5222j83j31705B97111K4511m9501a51578r7712A43513B4896
15430b98145A04481R423d0987l7729B41947i3025H6772a54453E7322P1695e2298
15418b42446N5094H2447J23651F2259k3117R223J29049b00764B06506E0900i4004
$$ plain form
15500 -154251 -179270 11839 -2342 539751 300719 253801 -218002 139378 -87718 -186393 318153
15488 245877 -29424 48905 -337340 320042 -250727 208774 -284104 -221920 266391 93731
15477 276585 -198711 82706 38118 103435 226774 143975 -109744 84126 26921 -135494 -122438
15466 -122438 -176749 -128471 100700 17709 105346 -148540 -55595 97038 90559 27748 64021
15455 64021 29828 226019 149919 13423 51965 36590 -8607 -101732 -11068 59325 -15871 32713
15442 200527 9688 -35222 -35405 -167110 297111 321622 272121 -151578 -249290 143513 24896
15430 -298145 104481 113904 -40987 -78716 241947 -93025 86772 -154453 57322 129017 -52298
15418 -242446 -187352 82447 206098 62259 39142 48365 177414 -200764 206506 50900 -94004
15406C3059R0756C1149d0302j55353r1324a29853A0046N06417G0922a57407i823
15394h1600j11693A56086a5871A31689i5705K0350B4403q896O5828l3412O3864
15383A11787a60851a3188p5869m5411P949q3365A6843L0872b21609B1505L47822
15372C69327A34428F3701b78896g1621C67386c3695j25588J0792D40171A46416
15361d8583j43656e6798A03613a49043E8064J39686n7889a42184C0198C744c99350
15349f7380A55486a51262A88168b2480l9501B62571a40053k5410A42903L6771
15339A79674f0206l26938d5029A1390J38411a484j19610C30992A3725N6921J63375
15328B34021I378K22060I7356l0455g3730I4436b58752I2481b09484C8747J16474
$$ plain form
15406 33059 123815 31149 -40302 -195655 -286979 -129853 10046 516463 70922 -157407 -9823
15394 -81600 -193293 156086 -15871 131689 -95705 -75355 24403 15507 81335 47923 111787
15383 111787 -160851 -13188 -89057 -134468 -126519 -209884 16843 47715 -221609 21505 369327
15372 369327 134428 63701 -278896 -71621 367386 -33695 -159283 -148491 440171 146416
15361 -48583 -192239 -56798 103613 -149043 58064 197750 139861 -142184 30198 3744 -399350
15349 -67380 155486 -151262 188168 -22480 -61981 262571 -140053 -165463 142903 179674
15339 179674 -60206 -387144 -45029 11390 149801 -1484 -121094 330992 13725 70646 234021
15328 234021 9378 231438 97356 66901 -73730 94436 -258752 92481 -209484 38747 155221
15317A55221c5791G7565K17351d0733C07462G4736i3516A78845f4396r6719G7840
15305D3407N0233a08425k1944A52677K9067D0378K30259A18195A8043a72704B17423
15293A61888N4113K8417m7756J45905j44173D9743a26978F7760M2196P8571o5891
15282A22636o245f0759B53654J9014H0752J48497E4355K24614H6008L52549A87362
15270D0024O6866b11873Q6858A10724b99270F9088j5095L4063a3218n8890A92632
15258A78956b47953A81556i8991F9333g2481j58212A56677b21404C49105J304
15248C50409J15044L96886K94159Q56360l17911M47953l68928F40315k83214A11536
15237B27979B6735L82839A41920K60410g850A22322R7175b10797L5156G4552a17300
$$ plain form
15317 155221 -35791 77565 294916 -40733 307462 74736 -93516 178845 -64396 -161115 77840
15305 43407 93640 -108425 -130369 152677 181744 40378 270637 118195 18043 -172704 217423
15293 161888 216001 244418 196662 342567 198394 49743 -126978 67760 109956 188527 122636
15282 122636 116391 -60759 253654 272668 80752 229249 54355 278969 86008 438557 187362
15270 40024 106890 -211873 -125015 110724 -299270 69088 53993 88056 -13218 -72108 192632
15258 178956 -247953 181556 -98991 69333 -72481 -230693 156677 -221404 349105 350409
15248 350409 465453 862339 1156498 2012858 1694947 2142900 1773972 640315 357101 111536
15237 227979 26735 409574 141920 402330 -7850 122322 219497 -210797 -175641 74552 -117300
15225C79696G4964J14071O0727p8238C5903P502a54271D66931A25869J89817a28842
15213C87895A51434A7594a01503A70077j5582K12044l9449j04702k4844G8496
15202G0626a75634D1128K5820J46324d27447g6531C03948A42709o1251j5774b65277
15190E788L83806A64448K7313a36193A58279a58293B60415e3048b6084B48190
15179B7187a50229B1619J22462J04325G0442Q7754R1359E5162a73978H1081B4109
15167c0718A76724F1395L6757K26150R6167A67116Q9385b27024Q1950A28840m76
15156A28364a61592N0124B47696r9388d7501D53905B07497B0423H19K35303D6063
15144b38118B7904J83928G1387K04237N4362M597m0777p848M3933G164c9683F776
$$ plain form
15225 379696 74964 189035 249762 171524 35903 43405 -154271 466931 125869 315686 -128842
15213 387895 151434 17594 -101503 170077 154495 366539 327090 222388 197544 78496
15202 70626 -175634 41128 66948 213272 -427447 -76531 303948 142709 81458 65684 -265277
15190 5788 389594 164448 191761 -136193 158279 -158293 260415 -53048 -26084 248190
15179 27187 -150229 21619 144081 248406 70442 158196 249555 55162 -173978 81081 24109
15167 -30718 176724 61395 98152 324302 420469 167116 256501 -227024 -145074 128840 128364
15156 128364 -161592 -111468 247696 148308 -47501 453905 207497 20423 819 236122 46063
15144 -238118 27904 211832 71387 275624 329986 334583 293806 285958 329891 7164 -39683 6776
15131I0610L15598A4731J62753a13302B98129J33422q7986b77667A45082O6841
15121B11923p8416J79220L2402A21326g382l8241a7146B89293A43477K1065h8591
15109h792A89389K24171j86886m1499c0580d430B05998K56557f1081B65801j17332
15098A48469a039j75633R827I9201f8266E7232R0821J46375G7573J69111H0537
15086B35482b88107C43961o964L7431a50227E4471J26472G5345J52305m6739J30744
15075C11655F9838K1479D5052i4849C36241i2360C1705K66217Q1012c017B8788
15063A45088A9057c707A62724R7028Q2363h1206B79609R6348j60026K3014m5347
15052A93598c36951A42471o0480a17160A79260b6992E6359A8297J28366J1550
$$ plain form
15131 90610 406208 14731 177484 -113302 298129 431551 343565 -277667 145082 211923
15121 211923 133507 312727 345129 121326 -7382 -45623 -17146 289293 143477 164542 -88591
15109 -8792 189389 413560 226674 185175 -30580 -4430 205998 462555 -61081 265801 148469
15098 148469 -1039 -176672 -166845 99201 -68266 57232 148053 294428 77573 246684 80537
15086 235482 -288107 343961 336997 374428 -150227 54471 180943 75345 227650 180911 311655
15075 311655 69838 91317 45052 -94849 336241 -92360 31705 297922 378934 -3017 28788
15063 145088 19057 -3707 162724 259752 342115 -81206 279609 375957 215931 238945 193598
15052 193598 -336951 142471 81991 -117160 179260 -26992 56359 18297 146663 158213
15042A58213M9708P0788j7033a840B19435j00689k4924J67586F6768L3528b8110
15030B98459l2128a54438C76590J32056h3005B48625A18920B9129L20600n8834
15020B90895M26773A18401e1836B9395M55448k31407G3857M57598A59353C984
15009A79676A707J62773f269A73314E1568J35047l5346i529j26817B93022j15367
14998A77655J90999r4208Q5219A1056J71370J41321m6064J14072j29581K04615
14988D66789I3469J69149l0432J09414A19283K00896N5201H4365K8219L32604
14978D45188B2827K82779C0443J92268R0981c9771A61393P3882K46842j80379
14968C01738J12847r3491J20194j67048K67890j49204A43572M05949o3656A38531
$$ plain form
15042 158213 207921 278709 261676 -1840 219435 118746 93822 261408 66768 100296 -28110
15030 298459 266331 -154438 376590 508646 -83005 248625 118920 29129 349729 290895
15020 290895 717668 118401 -51836 29395 484843 253436 73857 531455 159353 3984
15009 179676 1707 164480 -6269 173314 51568 186615 151269 -9529 -136346 293022 177655
14998 177655 368654 274446 359665 11056 182426 323747 277683 391755 262174 466789
14988 466789 93469 262618 232186 341600 119283 320179 375380 84365 112584 445188
14978 445188 22827 305606 30443 222711 313692 -39771 161393 235275 482117 301738
14968 301738 414585 321094 441288 274240 542130 392926 143572 549521 485865 138531
14957B41605A8731K81364j04090N4793q61d4587B8071R0445K36054K20127K17375
14946G92072B79447j0171A07434c1640D36947L6734k17425J82717q5591o5536
14936B87846K7273L2859E8589K97787l6574n1315J41165E2043K00628j7047A00934
14924E58898A04646M06851j18351j81475a91828B74276J93924k03159K56831A31276
14913E24848j84483Q6999j61330J47878j10265J98465A87221J44402L28132B58209
14902D17660A37597K00155p0645g116A96237J57984J39159A69035J26206b5148
14891E36055A54836J46017N9513j40821o8825L34732O6023j54430n8155R033J29107
14880D77030r5460j5619A46056J77282l5268K70340B13543l2432Q9658L6301q1119
$$ plain form
14957 241605 18731 300095 196005 250798 249937 -44587 28071 118516 354570 574697 792072
14946 792072 279447 269276 107434 -31640 436947 473681 256256 438973 353382 287846
14936 287846 315119 347978 58589 356376 319802 268487 409652 52043 252671 235624 100934
14924 558898 104646 511497 393146 211671 -191828 274276 468200 265041 521872 131276
14913 524848 340365 427364 266034 413912 303647 502112 187221 331623 659755 258209
14902 417660 137597 337752 267107 -7116 196237 354221 493380 169035 295241 -25148
14891 536055 154836 300853 360366 219545 150720 485452 551475 397045 338890 347923 477030
14880 477030 381570 365951 146056 323338 288070 558410 213543 181111 270769 307070 225951
14869B25951J43079A18322L59870j73218J80126A80098K06274A33215N95598G9432
14858E15735M388p8193M9455j62389J41661P713J7091k7692j58757M3088r081
14847C43019J36204J50878P1338C33666J27508j37233Q3049J35260m07j32116
14837D09727K70423k97257m1285K26444k63431K44437n3186j88034l7898f5487
14826F27211k42345Q4365j37923K68679j3382K453B15508K97441p3010J99871
14816F39810j98468k15434J16057M03176l29848J15126J85920C33547L87122j16665
14806F04004k3594K68426j4702j95268C14764J96874B53951L44671K743j0961
14796E90404B91841N30201l64401q7971R6783M1351O7739J5990A26335J13652
$$ plain form
14869 225951 369030 118322 478192 304974 485100 180098 386372 133215 728813 79432
14858 515735 520123 441930 491385 328996 470657 478370 495461 467769 309012 352100 343019
14847 343019 479223 630101 701439 333666 461174 323941 406990 542250 541843 409727
14837 409727 680150 382893 341608 568052 304621 549058 495872 307838 269940 -65487
14826 627211 384866 469231 331308 599987 586605 589058 215508 512949 439939 639810
14816 639810 441342 225908 341965 745141 415293 530419 716339 333547 720669 604004
14806 604004 580410 848836 834134 638866 314764 511638 253951 598622 601365 590404
14796 590404 291841 822042 457641 369670 466453 507804 575543 591533 126335 239987
14786B39987M33749j8232Q4696C00940C7583M22170j20826L35939O8614j02162
14776F41318K46261l21772J32523j9398k3192k4955P4904l31581J44808K87532
14766H06448k26442P2273j78097J2125K16272j51763J82209l03801P3892J25344
14756F28460J43948j35784p8219O4063M1378j28920N521L9927K03504l77624K44270
14745F50524j02785J07366p2008j893j19786M10992l4712k33285K18959J85663
14735A009035l84293j12570L31027l28953L86173j52887k50271L37270L10430
14726A144961n45054Q2770L24592N0792q3806l39045L94953j17153l84389K49069
14716G77690k07904M14952L5756k43846R8901k92108J67609J52336j6794o8544
$$ plain form
14786 239987 673736 655504 740200 300940 37583 459753 338927 674866 743480 641318
14776 641318 887579 565807 698330 678932 655740 630785 705689 374108 518916 806448
14766 806448 580006 652279 474182 486307 702579 550816 733025 429224 503116 628460
14756 628460 772408 636624 558405 622468 663846 534926 540447 580374 783878 406254 650524
14745 650524 547739 655105 583097 581204 461418 872410 837698 604413 823372 1009035
14735 1009035 624742 512172 843199 514246 900419 747532 497261 834531 1144961
14726 1144961 599907 682677 1007269 1058061 974255 635210 1030163 913010 528621 777690
14716 777690 569786 984738 1020494 776648 875549 583441 751050 903386 886592 818048
14706H18048K01224j06072P220J80373l53762K27973q1339k02k34044L9215k1403
14695F77231j27638L08880l8313m8436j5532K47256J17778j63639J89094l31790
14685H14891O5969J82466j49048M7555j70920K52870J18619k72596M9580L42119
14675A281505n96236M68180l07984N8445M2325L70526l32497l05584K06777L7612
14665I23069L2645j30265L61493k70393J62734j88934N06486p2929m12989J95457
14655A106374J6295O2965k5828j54890J03367p669k42478K06483J21964p5757
14645A110826k58083J93027L6924l8813l65155P14297k12608J56424o4329l84714
14635H87796J29674J01193L15535j08923K20157J89211o32052J46470r422m6108
$$ plain form
14706 818048 1019272 913200 920420 1100793 747031 975004 893665 893463 659419 698634 677231
14695 677231 549593 858473 820160 771724 756192 1003448 1121226 957587 1146681 814891
14685 814891 880860 1063326 914278 961833 790913 1043783 1162402 889806 939386 1281505
14675 1281505 685269 1153449 845465 903910 946235 1316761 984264 678680 885457 923069
14665 923069 955714 825449 1186942 916549 1079283 890349 1396835 1323906 910917 1106374
14655 1106374 1122669 1185634 1159806 1004916 1108283 1100614 858136 1064619 1186583 1110826
14645 1110826 852743 1045770 1082694 1043881 678726 1393023 1180415 1336839 1272510 887796
14635 887796 1017470 1118663 1434198 1325275 1545432 1734643 1102591 1249061 1239639 1193531
14625A193531J10509j74824P10651k55793r3374R2429j16983P5053k50858J00398
14615A390739N4514J50828j61567M89505k71015J35569l49388K68874k11031J6598
14605A513626m1790R3911N5864J92077j20223l66662P8013L9831J74051M07068
14595B025766l79723n3856r0386j81864K61547K30826k04275K63326J72437j23140
14585A920658j28799K51740k64527j47689L45868k43260L56988j39811J23419
14576B074587r4092K48091m13571K53672k92605N38978k57286P0868p2403N84261
14566B640500l71664J85188J17856l22733J55656k2847Q6960J93524Q7259J58837
14556B908536M43652k48737Q154O28979J87071O86944R81228J545388L965743
$$ plain form
14625 1193531 1304040 1129216 1839867 1584074 1490700 1583129 1466146 1541199 1290341 1390739
14615 1390739 1445253 1596081 1434514 1924019 1653004 1788573 1439185 1708059 1497028 1513626
14605 1513626 1471836 1565747 1621611 1813688 1693465 1326803 1404816 1444647 1618698 2025766
14595 2025766 1646043 1592187 1501801 1319937 1581484 1812310 1608035 1871361 2043798 1920658
14585 1920658 1791859 2043599 1779072 1631383 1977251 1733991 2090979 1951168 2074587
14576 2074587 1980495 2228586 1815015 2068687 1776082 2315060 2057774 2128642 2056239 2640500
14566 2640500 2268836 2454024 2571880 2249147 2404803 2381956 2468916 2662440 2749699 2908536
14556 2908536 3352188 3103451 3111605 3740584 3927655 4614599 5595827 7141215 11106958
14547A1106958J2343993J7525892K098179A9607381H877008k511065L12176k825320
14539C852799j560300m43556j05517K08900j71586O9071o4123J72774M9740L31293
14529B339495j41645L6647n51924O05426p6835J55572k76250L08004K17157k21353
14519B394294M2772j03325n5015K00398J0753J84774j68461K26828M0367j21514
14509B651871J37242k37640L66506j91963J02285j70262K98255K38931l44518
14500B850707J84923L60073l54156J00299j4625k67073L33063L60625k22388O3977
14490C395425J5464O218l7117P7665j25493Q7797L17390l5986l92761K93172N418
14479C607192K64317j18640K60434n4026J92881j97598K50691J28849k58674J28122
$$ plain form
14547 11106958 23450951 40976843 43075022 19607381 8877008 6365943 6678119 3852799
14539 3852799 2292499 1848943 1743426 1952326 1780740 1849811 1785688 1958462 2008202 2339495
14529 2339495 2197850 2234497 1682573 2287999 2211164 2366736 2090486 2398490 2615647 2394294
14519 2394294 2437066 2333741 2278726 2479124 2489877 2674651 2506190 2733018 2773385 2651871
14509 2651871 2789113 2551473 2917979 2726016 2828301 2658039 2956294 3195225 2850707
14500 2850707 3035630 3395703 3041547 3141846 3127221 2860148 3193211 3553836 3331448 3395425
14490 3395425 3410889 3417107 3379990 3457655 3332162 3419959 3737349 3701363 3308602 3601774 3607192
14479 3607192 3871509 3752869 4013303 3959277 4152158 3954560 4205251 4334100 4075426 4203548
14469D203548R9291J43486j15040J44821J85799q0030j04448J34501Q4957j05203
14459D591682P16372m40983L3945L43010l20753r9966M31319J79798l9914M5407
14449E439917k16372o5439K10623j1597K59779K9661M7222M6019J27892J37627
14439F005332k23114K70141J21602k1415j8217K03009L36472l48177l9425M29689
14429F715897j2242M49831l55040J97158J4338M66214j46637L65235j32357M63507
14419H025904k86699K35881L12J01888K76338K17516K28762o6802J32437k20889
14409H644648K51077J75159k15101L08254P38539k52558j9849J62351L15541N26129
14399A0634190j40716o556K49003R1707J08837L72152J9091O04109k67276L88848
$$ plain form
14469 4203548 4302839 4446325 4331285 4476106 4661905 4581875 4477427 4611928 4696885 4591682
14459 4591682 5308054 4867071 4901016 5244026 4923273 4823307 5254626 5434424 5394510 5439917
14449 5439917 5223545 5158106 5368729 5357132 5616911 5646572 5693794 5739813 5867705 6005332
14439 6005332 5782218 6052359 6173961 6152546 6134329 6337338 6673810 6325633 6286208 6715897
14429 6715897 6703655 7153486 6798446 6995604 7009942 7476156 7329519 7694754 7562397 8025904
14419 8025904 7739205 7975086 7975398 8077286 8353624 8571140 8799902 8733100 8865537 8644648
14409 8644648 8895725 9070884 8855783 9164037 9902576 9650018 9630169 9792520 10108061 10634190
14399 10634190 10493474 10486918 10735921 10827628 10936465 11308617 11327708 11931817 11664541 12053389
14389A2053389J06114k82199R53959K57799j61279L56806L81428K18713J80610
14380A4065340Q1973N14145m4891L27104M40067J21774L91946Q5052P42482K99982
14370A7024974j96612O67227N49126L6925K92157O83494K50840N90940K44651
14361B0143722N79508P38479J21665O54072K86945N39577O33621M11073P81133
14352B4889795K58142O94729P68682O11206P54994O19918M23944J161974Q70874
14343C1054258P12886P23110J076489N99160Q97045J115997J054374J180171R01408
14334C9314898J271122J009101J619088J143744J276008J744134J225405J558316
14326E0161816J474144J977651J901042J709047J960813K829724J553732K393680
$$ plain form
14389 12053389 12159503 11877304 12831263 13089062 12927783 13284589 13666017 13884730 14065340
14380 14065340 14147313 14661458 14616567 14943671 15383738 15505512 15897458 15982510 16724992 17024974
14370 17024974 16828362 17495589 18044715 18081640 18373797 19057291 19308131 19899071 20143722
14361 20143722 20723230 21461709 21583374 22237446 22524391 23063968 23697589 24108662 24889795
14352 24889795 25147937 25842666 26611348 27222554 27977548 28597466 29021410 30183384 31054258
14343 31054258 31767144 32490254 33566743 34165903 35062948 36178945 37233319 38413490 39314898
14334 39314898 40586020 41595121 43214209 44357953 45633961 47378095 48603500 50161816
14326 50161816 51635960 53613611 55514653 57223700 59184513 62014237 63567969 65961649
14318F5961649K537691K601355K313023L201935L058695L094018L130227L462179
14310H9360772L788397L982866M389281M229008M645386N178853N114519N283326
14302A25972408O123275O180033O538668P058982P744311P801306Q067383R217656
14294A84704022R556294R820038J0441196J1110005J2268177J2005326J3269134
14287B63174192J3297386J4162594J4438546J4959674J5254069J5637361J5260550
14280C66184372J5954697J4841034J4617581J3281759J2968110J0954441R561447
14273D58363441O897736L123770k934048l419927j012113k483383k595904n896234
14265D50043338q385034r722591j2845020j4267990j5676280j6161618j6458118
$$ plain form
14318 65961649 68499340 71100695 73413718 76615653 79674348 82768366 85898593 89360772
14310 89360772 93149169 97132035 101521316 105750324 110395710 115574563 120689082 125972408
14302 125972408 132095683 138275716 144814384 151873366 159617677 167418983 175486366 184704022
14294 184704022 194260316 204080354 214521550 225631555 237899732 249905058 263174192
14287 263174192 276471578 290634172 305072718 320032392 335286461 350923822 366184372
14280 366184372 382139069 396980103 411597684 424879443 437847553 448801994 458363441
14273 458363441 465261177 468384947 465450899 462030972 461018859 458535476 455939572 450043338
14265 450043338 441658304 431935713 419090693 404822703 389146423 372984805 356526687
14258C56526687j6017671j6445827j5618438j5778495j4660480j4159488j2608424
14251B51237864j1866372j2156631j1938701j0817362j0279231r537279r221994
14244A75420294q317041p854419p830412p271521p123581n608399n810484n493129
14236A20111308n422520m764670m556285m984413l926961l411020l922286l684170
14228H5438983l394635l103118l207815k630472k769103k468443k584798k069871
14220F3210728j868887k372047j958865j880194j947594j662932j103241j613106
14212D8803862j662220j704978j074614j553236j008226k52660j648633j228281
14204C8671014j487127q28524j095802o86311p35396o33807j435330p71173q39820
$$ plain form
14258 356526687 340509016 324063189 308444751 292666256 278005776 263846288 251237864
14251 251237864 239371492 227214861 215276160 204458798 194179567 184642288 175420294
14244 175420294 167103253 159248834 151418422 144146901 137023320 131414921 125604437 120111308
14236 120111308 114688788 109924118 105367833 100383420 96456459 93045439 89123153 85438983
14228 85438983 82044348 78941230 75733415 73102943 70333840 67865397 65280599 63210728
14220 63210728 61341841 58969794 57010929 55130735 53183141 51520209 50416968 48803862
14212 48803862 47141642 45436664 44362050 42808814 41800588 41547928 39899295 38671014
14204 38671014 37183887 36355363 35259561 34573250 33837854 33204047 31768717 30997544 30157724
14195C0157724m14103q55021q14901q75322q89200k60244n48867q20848q52956
14186B3826262n6570n47747r66929J11232n43587r13462K6537p33401k20574m38205
14176A9543556p29464k41780q7685o44445m82874m51885j57821j02211n90995
14167A6054396L5793l93517l84594m75424l51379r469O4230k82267k77134o04695
14157A3375940k00785l1203k83076K45250r69149J48567n05182N3277j61995k83722
14147A1387922j94343m29877J71386l36995J07497l19909l17702J36923o27933
14138I576969K62366L5151m42166j08408o3672n87033L35552l83632K01263l71368
14128H455022j44914l16733k20605P255j3649J74656J5664m30769J72489k43058
$$ plain form
14195 30157724 29743621 28888600 28073699 27198377 26309177 26048933 25500066 24679218 23826262
14186 23826262 23769692 23221945 22255016 22366248 21822661 20909199 20935736 20202335 19981761 19543556
14176 19543556 18814092 18572312 18484627 17840182 17357308 16905423 16747602 16645391 16054396
14167 16054396 16090189 15696672 15312078 14836654 14485275 14475806 14540036 14257769 13980635 13375940
14157 13375940 13175155 13143952 12860876 13106126 12136977 12285544 11780362 11833639 11671644 11387922
14147 11387922 11193579 10763702 10935088 10598093 10705590 10385681 10067979 10204902 9576969
14138 9576969 9839335 9874486 9432320 9323912 9260240 8673207 9008759 8625127 8826390 8455022
14128 8455022 8310108 7993375 7772770 7780025 7766376 7941032 7956696 7525927 7698416 7455358
14118G455358k05960K27837j03643p9151l52674k11342l63705N20655m10350L14921
14108F791946p1586k14217k10783l28537K45317R2192l46680Q415p4311J10894
14098F002650n10398J15349j81138J76843j02517j82148R4313m94195K88836J11351
14088E318946k35549k48265L38733n6653k32169j1861K54164n45664o6008J19354
14078D635028l12016O30513n77238n9225O1832j44681j58778K23489k31639j78080
14068C889205K85961k71123L8528K57908j48815m9764M3104m2092j99882K83298
14058D086328l0852l11470j68493j55096K14219k16493l7954J00606M6630o8945
14048C458480P5290k48037j4865m821k47849O468O11217o84852K85180j18844
$$ plain form
14118 7455358 7249398 7477235 7373592 7294441 6941767 6730425 6366720 6887375 6477025 6791946
14108 6791946 6720360 6506143 6295360 5966823 6212140 6304332 5957652 5966067 5891756 6002650
14098 6002650 5492252 5607601 5426463 5603306 5500789 5318641 5412954 4918759 5207595 5318946
14088 5318946 5083397 4835132 5173865 5117212 4885043 4873182 5127346 4581682 4515674 4635028
14078 4635028 4323012 4953525 4376287 4317062 4378894 4234213 4075435 4298924 4067285 3889205
14068 3889205 4175166 3904043 3942571 4200479 4051664 4001900 4045004 4002912 3803030 4086328
14058 4086328 4055476 3744006 3575513 3420417 3634636 3418143 3380189 3480795 3527425 3458480
14048 3458480 3533770 3285733 3270868 3266047 3018198 3024666 3635883 2951031 3236211 3117367
14038C117367m5845j17962J14678K11943m76777J14241k07447k0520M96289q5703
14028C100264j49402j26844m4529J97055L02126o61563r4636L06924n5458m95590
14018B278347L01268j2587J82891m49832M39188k6954m70534J98487Q4517m01882
14008B122909K94581j00997j25315N4125J86111m59864K24702p9806k98738M5434
13998A863142K82558j59855P186L77312l41670K9030J63839o1824M53202L44967
13988B957887K419489J0194567J9353847J1930954k0790662j2917918n379458
13981G768706k089673j289449p02120n74792l35435l160j26927n2673M6382N6081
13971B696940m260k16431q581j2833l541j01000j0926J25441m43762j25283J80780
$$ plain form
14038 3117367 3071522 2953560 3068238 3280181 2803404 2917645 2710198 2689678 3185967 3100264
14028 3100264 2950862 2824018 2779489 2976544 3278670 2617107 2522471 2829395 2773937 2278347
14018 2278347 2579615 2567028 2749919 2300087 2739275 2712321 2241787 2440274 2524791 2122909
14008 2122909 2417490 2316493 2191178 2245303 2431414 1971550 2196252 2116446 1817708 1863142
13998 1863142 2145700 1985845 1993031 2370343 2028673 2057703 2221542 2159718 2612920 2957887
13988 2957887 5377376 15571943 34925790 46856744 26066082 13148164 7768706
13981 7768706 5679033 4389584 3687464 3112672 2777237 2774077 2647150 2594477 2640859 2696940
13971 2696940 2692680 2476249 2467668 2454835 2451294 2350294 2339368 2464809 2021047 1895764 2076544
13960B076544K6717n9329m01474P13240n77618L05277O5770l78219J3701k58616
13950A525993M09618j53956K91204j26434j76812K88014m75313L6154j03882J92211
13940A706797r9707J2842r1552k32229L22441K75003n3203j72098j12573j14380
13930A441341L26740k89265k42163K71763J14320j02729m6760J65705N2565l53068
13920A338449P6438L42682j44918l42482r9402m488L36307l4767l48364p1265
13910A048190o6568M53088P5240m52409K67563R3967Q1764j59166k1069M3516
13900A364116K99687p81728Q7853O42828m79300O4994q2622J49947L64278m61462
13890A168591K29186K06477k61656j24461L5426j64198O6687J08096j03911K61830
$$ plain form
13960 2076544 2103261 2043932 1642458 2355698 1778080 2083357 2149127 1770908 1784609 1525993
13950 1525993 1935611 1781655 2072859 1946425 1769613 2057627 1582314 1618468 1514586 1706797
13940 1706797 1607090 1619932 1528380 1296151 1618592 1893595 1840392 1668294 1555721 1441341
13930 1441341 1768081 1478816 1236653 1508416 1622736 1520007 1473247 1638952 1691517 1338449
13920 1338449 1414887 1757569 1612651 1270169 1170767 1166279 1502586 1467819 1119455 1048190
13910 1048190 981622 1434710 1509950 1057541 1325104 1419071 1500835 1341669 1320600 1364116
13900 1364116 1663803 882075 969928 1612756 1133456 1198450 1115828 1265775 1630053 1168591
13890 1168591 1397777 1604254 1342598 1218137 1253563 1089365 1156052 1264148 1160237 1422067
13880A422067l05848J63472k69499l0166L65420k32868n1089K151K16736m73089
13870H07287q8226J14815K57281o0415k89616K94730k3567j16460L86124n45891
13860G36062L29178j03849j69090J83842J0028R5632k14346K20908j39041K6146
13850I75470L09298r2447k02544k43881K04784k58001M55865k02733j28013L41192
13840A158990n4508j00159N3302j40730j94593J05167N4558q1816J4767J93701
13830A008679l6961j76565K31K54772r6105P3294m85469K72509K34593j61499
13820H87479L50934l75989L3818j35264J75077k05649R5035J01583L8514K00936
13810A166474l44476J32195r0752j27674o7720p7304P7674J24102o1028J51351
$$ plain form
13880 1422067 1116219 1279691 1010192 980026 1345446 1112578 1061489 1063640 1280376 807287
13870 807287 719061 833876 1091157 1030742 741126 1035856 1012289 895829 1281953 736062
13860 736062 1065240 961391 792301 976143 986171 1081803 867457 1088365 949324 975470
13850 975470 1284768 1192321 989777 745896 950680 692679 1148544 945811 817798 1158990
13840 1158990 1104482 1004323 1057625 916895 722302 827469 882027 800211 814978 1008679
13830 1008679 971718 795153 795384 1050156 954051 1027345 541876 814385 1048978 887479
13820 887479 1238413 862424 896242 760978 936055 730406 825441 927024 965538 1166474
13810 1166474 821998 954193 863441 735767 668047 590743 668417 792519 731491 882842
13800H82842k00727J34094N1668M3734l17175N32727n14951J13080k36450L01181
13790G90023L6420Q3431m49852K08421p0052J11321j67100M53601k03413K76864
13780A069664l90452J61971m12894J84945j49614K22262k06693M24839l00133
13771F03895R8078j1064k01068j15724J09555K62630R0015Q8355C59484j04820
13761B54664M96178K1313k28262L72204l51413J23560k66841K62566K10773m39408
13751D55334K28885j35732j4873K01327k24009j47021K40121k09659L24306q7896
13741F30783M7383k348B92252L21210J10302m8637J6566k27460J03544L71087
13731I38864k96778J71437k21862J8165j47411K9806r6245J97068l8093A36469
$$ plain form
13800 882842 682115 816209 867877 911611 594436 1127163 612212 725292 488842 790023
13790 790023 826443 909874 460022 668443 598391 709712 542612 996213 792800 1069664
13780 1069664 679212 841183 428289 613234 463620 685882 479189 904028 603895
13771 603895 701973 690909 489841 374117 483672 746302 836317 924672 359484 254664
13761 254664 750842 772155 543893 916097 564684 688244 421403 683969 894742 455334
13751 455334 684219 548487 533614 734941 510932 363911 604032 394373 718679 630783
13741 630783 678166 675818 292252 613462 723764 675127 691693 464233 567777 938864
13731 938864 642086 813523 591661 609826 462415 492221 395976 593044 554951 136469
13720F29171L6782B52480M82553k54467m3050K73813j09713l1664J24175B24180
13709G81835j6791l02957q7861j83253p4552M77711A78187M38755o3855K58105
13699H11192k10084J31515j77401J1859p6410J22484j40894K51975N2397k29080
13689E47553l9798q2417J32274j22479J51395l6206O0928j72359O2383k44214
13679B57060Q4826J75440p0149B05926K66682K50285A85805J48324K85776L5844
13669F55749j05051J80026k78436q024N5494n5768k07954J34104M62960C71987
13658B96339J37187K76785B97868E0275d0017F29502k20153j15820L6545K34886
13648E64960n6004J0820J97019A87562J92658R7542B20722K23488j12559J60653
$$ plain form
13720 629171 665953 252480 735033 480566 437516 711329 601616 569952 694127 224180
13709 781835 765044 462087 374226 190973 116421 594132 178187 616942 553087 811192
13699 811192 601108 732623 555222 567081 490671 613155 472261 724236 776633 547553
13689 547553 507755 425338 557612 435133 586528 550322 611250 438891 501274 257060
13679 257060 341886 517326 447177 205926 472608 722893 185805 334129 619905 655749
13669 655749 550698 730724 452288 444264 499758 443990 236036 370140 833100 371987
13658 296339 433526 710311 297868 50275 -40017 629502 409349 293529 330074 564960
13648 564960 508956 519776 716795 187562 380220 477762 220722 444210 331651 492304
13638D92304K73618j36617A78790K63879J48526B74895o3782M13367l03705J61141
13628D81916A2887K56404n7535J30878J23875j25942I7279a50070D94867A63203
13617C16814K64242B35781K93423J13j32850j19896J06963K55188j22872M2477
13607E58327k57746B6724N47385j37141J92200k87453q6658J45820k3527J45717
13597E23067j93554c0500B88027K1052j12914M00209B86020P194A40851M59554
13587F00405K1893A28683J81674Q3752J19495B10904p2079K96719K07768I1620
13576B24824L58642q9197A46867J66936p5445R9549J72220A54342O5067r5934
13566A23475N810L76749N5409A52164J60633n0015J43243j46623b651B55532m3639
$$ plain form
13638 492304 765922 629305 178790 442669 591195 274895 211113 624480 320775 481916
13628 481916 12887 269291 211756 342634 466509 340567 97279 -150070 494867 163203
13617 316814 581056 235781 529204 529317 396467 276571 383534 638722 515850 558327
13607 558327 300581 26724 574109 436968 629168 341715 255057 400877 377350 523067
13597 523067 329513 -30500 288027 309079 196165 596374 286020 293214 140851 600405
13587 600405 622298 128683 310357 394109 513604 210904 138825 435544 643312 91620
13576 224824 583466 494269 146867 313803 238358 337907 510127 154342 219409 123475
13566 123475 129285 506034 561443 152164 312797 262782 406025 259402 -2651 255532 211893
13555B11893r7627K56365j3469K51680B09635Q5670M67403A24472J34400j3939
13545B44933Q7613j3971j43161K69157k15398O765J21030f842F88363k96090A42740
13533c6941B11290M6259L3197K92238j42648j12564J11119A50815P6254J2360
13523B39429J4641Q7017b0692B87563K11704I7997M2363o1581R4423J58160A61224
13511a14716A01819N770M34679A08798P3270D5276L22784j5415J68380k30562
13501B90463j18076B0885K05858d669A70493l1473n0811P5679b81676H8109J52141
13490B40250J2917r2942L7281F5975J01238J97432J26096F7462K10175J6817I1375
13478C42920H115L17297j58464e0381E15006A43429p623K11799A73335K08436
$$ plain form
13555 211893 114266 370631 357162 608842 209635 295305 762708 124472 258872 244933
13545 244933 332546 318575 175414 444571 229173 235938 356968 -6842 688363 392273 142740
13533 -36941 211290 257549 290746 582984 440336 327772 438891 150815 227069 239429
13523 239429 254070 341087 -20692 287563 499267 97997 140360 78779 173202 331362 161224
13511 -114716 101819 107589 542268 108798 182068 45276 368060 352645 521025 290463
13501 290463 172387 20885 226743 -4669 170493 139020 88209 163888 -281676 88109 240250
13490 240250 253167 160225 197506 65975 167213 364645 490741 67462 277637 294454 91375
13478 342920 8115 325412 166948 -50381 515006 143429 135806 347605 173335 381771
13468C81771j23127J65485j82593n8638J62274A23575R0387J36857a38408A51283
13457A32342a20027G72307C66295j03047n6062G8170L64087A42309J15277m6371
13447B11215J96158A91348J37673a00389Q171B01620a23402A27219J45125b31785
13436A74075K33545h0131A36401L0340J989P3812o5538n5518c5899D10374A39230
13424A56278K12724A72631C0858K93359N7595C0121a19207A88171K79473B33087
13413D65573c0397A28146J35744a59959D5574O309M2769B5690b09133A14302Q8321
13402B02623a15364A65545Q2742J25293l4785j21553i8760C20878p9387P9740
13392C21231p6290H9363l8481J33002c7343H7959J42746n7642L07076D9350J14758
$$ plain form
13468 381771 258644 424129 241536 182898 345172 123575 213962 350819 -138408 151283
13457 132342 -120027 772307 366295 263248 207186 78170 442257 142309 257586 211215
13447 211215 407373 191348 329021 -100389 -92218 201620 -123402 127219 272344 -231785
13436 174075 407620 -80131 136401 166741 168730 242542 177004 121486 -35899 410374 139230
13424 156278 369002 172631 30858 324217 381812 30121 -119207 188171 467644 233087
13413 465573 -30397 128146 263890 -159959 45574 51883 94652 25690 -209133 114302 202623
13402 202623 -115364 165545 248287 373580 338795 217242 -98760 320878 241491 321231
13392 321231 244941 89363 50882 183884 -37343 87959 230705 173063 480139 49350 164108
13381A64108J00708i6573C74256N7180A50690D6526J7694K37886L25106B68912
13370B43711o0239R3132G7382M17235k36701J39548A1560J45206O9694J88269
13360D14729J42050A93853b68223M6463C58026A65953D4653L27066A84526B989
13349D30090B07276Q6624J32942p1894j69602K76645b4285C68019j55069K70730
13339D83680B01745q0292K10456b4476r3774B38622C1497a34337B84487L187Q3406
13328C71080H1416b95660C19894G546L28398G4214J71580J46270E8463P8279J28113
13317B64855k4774M4104l8249L5810k1949H9643J42836j8262j4695C6114a55334
13305B52494A18691P8803q4459Q794J46240b7944j39673i908D53847H9276L27974
$$ plain form
13381 164108 264816 -96573 374256 431436 150690 46526 64220 302106 627212 268912
13370 243711 183472 276604 77382 494617 257916 397464 11560 156766 226460 414729
13360 414729 556779 193853 -268223 -221760 358026 165953 44653 371719 184526 2989
13349 430090 207276 293900 426842 354948 185346 461991 -24285 368019 212950 483680
13339 483680 201745 121453 331909 -24476 -118250 238622 31497 -134337 284487 287674 371080
13328 371080 81416 -295660 319894 7546 335944 74214 245794 392064 58463 136742 264855
13317 264855 240081 284185 245936 281746 259797 89643 232479 214217 199522 36114 -155334
13305 252494 118691 197494 113035 121829 268069 -27944 -167617 -9908 453847 89276 417250
13294D17250f1462A85596l1312D6438L02079j60651K50496B999K30738A12557
13283B39750j07530E5879J24890A6320i886m1466B64792c7545D16487c36643B15571
13271B036M6545P9345c7174L70B4558J43286K16898A4058M14479f168A58202J44580
13259C02782b1601C25308E2246J17648E8975b23371N9544A69518a06805B39566
13248D22891B6618J60794K79706F5844K55499A01989P5529G5015c9248F5404k6433
13237C8971g1342C22321E520L32826a5775F2562f6354C7005d347F9064N3457J76760
13225B99281g6460j08299A47505a39567N7403A64514h010B0662K29744A23547
13214A56944B7479Q8048K54685j05938h6643A47703k390K40293D682i4119D4079
$$ plain form
13294 417250 -61462 185596 154284 46438 348517 187866 438362 2999 233737 112557
13283 239750 132220 55879 180769 16320 -9886 -51352 264792 -37545 416487 -336643 215571
13271 2036 48581 127926 -37174 -36804 24558 167844 384742 14058 428537 -6168 158202 302782
13259 302782 -21601 325308 52246 169894 58975 -223371 -163827 169518 -106805 239566
13248 422891 26618 187412 467118 65844 321343 101989 177518 75015 -39248 65404 38971
13237 38971 -71342 322321 5520 338346 -15775 62562 -66354 37005 -4347 69064 122521 299281
13225 299281 -76460 -184759 147505 -139567 -82164 164514 -8010 20662 250406 123547
13214 156944 27479 115527 370212 264274 -86643 147703 145313 385606 4682 -94119 44079
13202E18342C6786A4897n879O758a41575b2931A38996i2190A80429i2831A82696
13190A20760a55800A94926G7890K8445k4759J0802a70316E1735K28385A12252
13179A43185b96058A28683a38024A55737b3561p306B59667Q5709g1173o3287I9474
13167B17096e83I702J1638a7000C79097A890J71727e0194A50293k5666M769m2824
13155H6572L634L1424l4883i601G3850j0751c9866A71241J5917A8942j559K14541
13143B31924d5933A08158a53488C25530a2422A22116a04603C21371j24881a76589
13132E8485a76841Q59c663C34090n0039b7049F9268d9965e474A16549n7955a42604
13119a35737K5520A67257G360a84868l6206B64050a14115A65810B5347K70132
$$ plain form
13202 518342 36786 14897 9018 15776 -141575 -22931 138996 -92190 180429 -92831 182696
13190 120760 -155800 194926 77890 106335 81576 92378 -170316 51735 280120 112252
13179 143185 -296058 128683 -138024 155737 -23561 -30867 259667 345376 -71173 -134460 99474
13167 217096 -583 9702 21340 -17000 379097 1890 173617 -50194 150293 124627 129396 86572
13155 86572 90206 121630 86747 -9601 73850 63099 -39866 171241 187158 18942 17383 231924
13143 231924 -45933 108158 -153488 325530 -12422 122116 -104603 321371 196490 -176589
13132 58485 -176841 -175982 -3663 334090 284051 -27049 69268 -49965 -5474 116549 58594 -142604
13119 -135737 -110217 167257 7360 -184868 -221074 264050 -114115 165810 25347 295479
13109B95479a62184I1476P8097n6125J3484b06121f6495C26129a82511a4504G6865
13097A38768K44570h8774B22828K8732a36211I8343J343b1756B7745h7943b9128
13085B45014j3190o5909j8951g7622A97179b37111e0984B17715C2303b50751a0477
13073a27001A33017a5046M855j50584A98534i4989b5405l21172a36287N848C96494
13061C277d5084A6233J39598J34976p2870K2908Q9190A709M2780L7229P3849a06935
13048B318i4365A21872m5661k4094a2588A36018b78201A34964P7459m8562m4491
13037A19370K16292H490P3336b69818C90312A45089n0740L15178j56401F8672
13026F1758j0047R1734C0351J1189K71346A31631g0991c4461B17381h3797o7522
$$ plain form
13109 295479 -162184 91476 169573 113448 126932 -206121 -66495 326129 -182511 -14504 76865
13097 138768 383338 -88774 222828 251560 -136211 98343 99686 -21756 27745 -87943 -29128
13085 245014 231824 165915 146964 -77622 197179 -237111 -50984 217715 32303 -250751 -10477
13073 -127001 133017 -15046 -10191 -160775 198534 -94989 -25405 -346577 -136287 -130439 396494
13061 3277 -45084 16233 155831 290807 217937 240845 330035 1709 44489 81718 155567 -106935
13048 2318 -94365 121872 76211 52117 -12588 136018 -278201 134964 212423 163861 119370
13037 119370 335662 8490 81826 -269818 390312 145089 94349 409527 253126 68672
13026 61758 51711 143445 30351 41540 312886 131631 -70991 -34461 217381 -83797 -151319
13015a51319A19079Q4214a23982q8597A8425a24250B1165a07798A29679J24324
13005B54003L0846A19941F614J94264d8536k2932E5621N2730E2753c31132C35931
12993C31902b36940A22510c09010d5220e609A31224h506A47025K22365C101c6939
12981g785B19214e2839H0117a19227C50054B3397K52983l3568G6574n84R0794
12970A66784a88522O5097M8778K7603A76625c35627g5526K1216A51594h2602R997
12959g2605A47714o7753J1187J875J31793o6310B5341a00755A42760K6580N9949
12948B29289H7926M57172A6684J7911c7410k24056J04042O395a6569r6361m4148
12937a57078K1152G1296K91818b14041c0044A24056C4350b6015C41498j0356h6516
$$ plain form
13015 -151319 119079 203293 -123982 -212579 18425 -124250 21165 -107798 129679 254003
13005 254003 284849 119941 6614 200878 -48536 -71468 55621 108351 52753 -331132 335931
12993 331902 -236940 122510 -309010 -45220 -5609 131224 -8506 147025 369390 3101 -36939
12981 -7785 219214 -52839 80117 -119227 350054 23397 276380 242812 76574 75990 166784
12970 166784 -188522 -123425 -74647 -47044 176625 -335627 -75526 -54310 151594 -82602 -72605
12959 -72605 147714 79961 91148 93023 224816 158506 25341 -100755 142760 169340 229289
12948 229289 87926 545098 16684 34595 -37410 -261466 -157424 -151029 -16569 -112930 -157078
12937 -157078 -135926 71296 363114 -214041 -30044 124056 34350 -26015 341498 331142 -86516
12925a61102A10740J61761A06133M7731J99376a78274G8912f1556D8583a9712
12914A30143E4199c22176O846B94740e0909A64310a20612G8244K2069J5157i698
12902f7657H0825a50352M153j005L3627A75023b31818L2041i8375M8112A99342
12890C60510F2382J12852H7143Q4548K5172A852d4807C12549j14219Q7323b41847
12878I4147O4126a43868j68111A14096b02844O2269D0626K59714A10143J52014
12868B62157p4058J1887h2131D6254a61272e0752A03234c1863B3310b96864i3972
12856B5369g4562q8951D7283d04524J48027C85865a2368H3078i9010h137k81887
12845b90024a34505C1886J44182M0900G3707J30612O9990J32628H0639c5029F6909
$$ plain form
12925 -161102 110740 272501 106133 153864 353240 -178274 78912 -61556 48583 -19712
12914 130143 54199 -322176 -315330 294740 -50909 164310 -120612 78244 100313 115470 -9698
12902 -67657 80825 -150352 -146199 -147204 -113577 175023 -231818 -199777 -98375 -50263 199342
12890 360510 62382 175234 87143 171691 196863 1852 -44807 312549 198330 285653 -241847
12878 94147 158273 -143868 -311979 114096 -202844 -140575 40626 300340 110143 262157
12868 262157 188099 199986 -82131 46254 -161272 -50752 103234 -31863 23310 -296864 -93972
12856 25369 -74562 -163513 47283 -404524 -256497 385865 -12368 83078 -99010 -8137 -290024
12845 -290024 -134505 31886 176068 216968 73707 204319 274309 406937 80639 -35029 66909
12833A85645j0389n3805Q3807E5747a33680A05963P1881R8478i0255A07063E802
12821B31274H9206h0606D8471P7880N2374e38204B5895b75419E0716J8948L15646
12810C85310a24363r2987B92118a16273A7748J61326E2228a55623c6850A48156
12799B51307H6951M1697b31284R1945M4733n1164I7392j3073J43675a04506C0581
12787A81975a64445e3083k94012a25608k65794F9098a84546A1369J59430g8320
12776a00990G3074b20227G6918C066a15974m8289e2051D9896J00490b49741P7292
12765a72449c288B49343h365C1980J23474o5446P144K50267d6642E3566J76339
12754B29905a58947H0928q386B2198G330g7359K2082A70599g480j95275A46796
$$ plain form
12833 185645 175256 121451 205258 55747 -133680 105963 177844 276322 -90255 107063 5802
12821 231274 89206 -80606 48471 126351 178725 -538204 25895 -275419 50716 69664 385310
12810 385310 -124363 -217350 292118 -116273 17748 179074 52228 -155623 -36850 148156
12799 251307 86951 128648 -231284 -139339 -94606 -145770 97392 84319 227994 -104506 30581
12787 181975 -164445 -53083 -347095 -125608 -391402 69098 -184546 11369 170799 -78320
12776 -100990 73074 -220227 76918 3066 -115974 -164263 -52051 49896 150386 -249741 -172449
12765 -172449 -3288 249343 -8365 31980 155454 90008 97152 347419 -46642 53566 229905
12754 229905 -158947 80928 72542 22198 7330 -77359 -55277 170599 -7480 -202755 146796
12742f2247C2386F836a5847C93175a28823f3233j23566J1453D9231L11628c93682
12730A39961D99Q6468b7889J114A86464c476D6187b62318b3831j5704B24338M779
12718B29117b79442B62887a05974D6657k2691a48555C31827l632H1338J35757
12708B17095f9975A26622B6521K14673B6259M77413a44419e2636A33659O3974
12698A97633J09363a09274K5326B33100a78883G3486J30460r1196K16153A49609
12687b34410A16208C8412K27725b504j56639j33009d2994D138g579E6522J35571
12676A92093J27715e219n5953E0347L05534j25880R7962o150p2032A9356L43899
12665C63255F650R4307M8597L30773A40279a06291b3953B44531A8924K1515b80388
$$ plain form
12742 -62247 32386 6836 -15847 393175 -128823 -63233 -186799 -175346 49231 360859 -393682
12730 139961 499 86967 -27889 -26775 186464 -3476 46187 -262318 -23831 -39535 224338 229117
12718 229117 -279442 262887 -105974 46657 23966 -148555 331827 328195 81338 217095
12708 217095 -69975 126622 26521 241194 26259 503672 -144419 -52636 133659 197633
12698 197633 306996 -109274 -83948 233100 -178883 73486 203946 112750 328903 149609
12687 -234410 116208 38412 266137 -2504 -159143 -292152 -42994 4138 -7579 56522 192093
12676 192093 319808 -5219 -61172 50347 355881 230001 327963 321813 249781 19356 363255
12665 363255 6650 100957 149554 480327 140279 -106291 -23953 244531 18924 40439 -280388
12653a6419A97310g3014A30841L14253A13905k1683i5885b8271n5455d1008C50820
12641A22871a42200H2054h7335B50808i8446o6373g6110A02486J11891k7986C5238
12629A54906J12814m3912L8754r3325g226C00159A10893D4001J69241M8227Q0892
12618C42361j16162d9140B35190B5874a44085A22252a111p1470E8938k7231M0372
12607G2079b29982B71256G7112a45644d4597B43873n9958q6876M2111L8600q0013
12596I7737a04958c7591j00783A38585K43987j13454e6307D2528L15420A07038
12585C35576A29739a12898I9746C3891M8858g1932B07735i5021a0949A71382l9315
12574A32067C2705c09305h6528K1055c317j47420H7463A262R3492K48175a83147
$$ plain form
12653 -16419 197310 -73014 130841 445094 113905 92222 -95885 -28271 -83726 -41008 350820
12641 122871 -142200 82054 -87335 250808 -98446 -164819 -76110 102486 214377 186391 35238
12629 154906 267720 223808 262562 169237 -7226 300159 110893 44001 213242 261469 342361
12618 342361 226199 -49140 235190 25874 -144085 122252 -1111 -72581 58938 31707 72079
12607 72079 -229982 271256 77112 -145644 -44597 243873 183915 97039 139150 177750 97737
12596 97737 -104958 -37591 -138374 138585 382572 269118 -56307 42528 357948 107038
12585 335576 129739 -112898 99746 33891 82749 -71932 207735 -95021 -10949 171382 132067
12574 132067 32705 -309305 -86528 -65473 -3317 -150737 87463 1262 94754 342929 -183147
12562a90589A83026F6988C2732l546c9564G6031J89131c32275C904c34849J02997
12551b31852F9528N1621a84916B24808q2169a80666j87388C44513Q2745A64803
12540A88912F0149C044a0967E8488j273J94013I4796a31975A12946c5331j2477
12529d7808q5738q2233A78732c5736C00007G8406K27291D4573f4947k60542i6811
12517a8908H7238O5139J25961P8326N1194j20774b0393C80932p0883a40437A35193
12505B01665O1165I9255h6063C58602F8655B4352M99885E4710M7177a07077B2662
12493h0099a0423j31841G972d2912A07822c178k43316C61236C0068K20172a9448
12481A03051b28277a2216F2853b14389C75647I3013P010D3838M1665a9459F2672
$$ plain form
12562 -190589 183026 66988 32732 29186 -39564 76031 265162 -332275 3904 -334849 -231852
12551 -231852 69528 121149 -184916 224808 142639 -180666 -368054 344513 427258 164803
12540 188912 60149 3044 -10967 58488 57215 251228 94796 -131975 112946 -35331 -47808
12529 -47808 -133546 -215779 178732 -35736 300007 78406 305697 44573 -64947 -325489 -96811
12517 -18908 87238 152377 278338 356664 407858 287084 -20393 380932 310049 -140437 135193
12505 201665 262830 99255 -86063 358602 68655 24352 524237 54710 101887 -107077 22662
12493 -80099 -10423 -142264 7972 -42912 107822 -3178 -246494 361236 30068 250240 -19448
12481 103051 -228277 -12216 62853 -214389 375647 93013 100023 43838 85503 -19459 62672
12469A607d4286B43611B9687b03176F3169a10728b4240B47944b37480a8929A81344
12457e9815p5649j13244i3132B27690H2088a32119e5616B17449a52653f1734A84588
12445a13683b7149o9203k2381A5200a43096J9572L9654J7433F9336b24941o5159
12434b90100B05558C5983C544i8351j0532B63470A20826N2569i790k75889a05285
12422E762J89755f189B47946e6919A48468a59605P8597A26283J23655a42565G3066
12410a0650j95752M4599B19323a86124d8184A16204a55138E9604K7064b42363
12399c12521A91041E8673a51427j11842f3778I7986a54310B01555b06808P4086
12389a32722J2020d8904n6035n8380A87872p4967E1481K7577e6025d821k51893
$$ plain form
12469 1607 -44286 243611 29687 -203176 63169 -110728 -24240 247944 -237480 -18929 181344
12457 -59815 -135464 -248708 -93132 227690 82088 -132119 -55616 217449 -152653 -61734 184588
12445 -113683 -27149 -96352 -118733 15200 -143096 -123524 -83870 -66437 69336 -224941 -290100
12434 -290100 205558 35983 3544 -98351 -108883 263470 120826 173395 -9790 -285679 -105285
12422 5762 195517 -6189 247946 -56919 148468 -159605 -81008 126283 249938 -142565 73066
12410 -10650 -206402 -161803 219323 -186124 -48184 116204 -155138 59604 86668 -242363
12399 -312521 191041 58673 -151427 -263269 -63778 97986 -154310 201555 -206808 -132722
12389 -132722 -120702 -48904 -104939 -163319 187872 112905 51481 79058 -56025 -4821 -256714
12378b56714B24525a07147A72879a92916F1304J48747N1136l3667a13279C379
12367a50245B01408J37601A49471g3105J7170p9320f273n9039B03174f2470B36364
12355a00224j19905a07929o5209A18655a48497A98245a31927B02500r4188p53
12345A07559J19549A10594O607M9125C0738R3718c86412e0648C6346b1898l14543
12334c36441a55298D3909L5844l0041R3876i4588j73342A63317b08668i6835K9418
12323f7417j81110B55198b34757C74626a15995B04236r8898a87044l1082E2247
12312a64077N6689k9371G9426b6129B1409J73678D1263K35804F2760b30576G9103
12300C42555A55831a8051l6891A01367g4736B14586c18345A34130D8231j5857
$$ plain form
12378 -256714 224525 -107147 172879 -192916 61304 210051 261187 227520 -113279 3379
12367 -150245 201408 339009 149471 -73105 -55935 -135255 -6273 -65312 203174 -62470 236364
12355 -100224 -220129 -107929 -173138 118655 -148497 198245 -131927 202500 108312 107559
12345 107559 227108 110594 117201 166326 30738 124456 -386412 -50648 36346 -21898 -336441
12334 -336441 -155298 43909 79753 49712 143588 -94588 -267930 163317 -208668 -96835 -67417
12323 -67417 -248527 255198 -234757 374626 -115995 204236 105338 -187044 -218126 52247
12312 -164077 -107388 -136759 79426 -26129 21409 195087 41263 277067 62760 -230576 79103
12300 342555 155831 -18051 -54942 101367 -74736 214586 -318345 134130 48231 32374
12290C2374a48504c2866B13681l9869f0652B75113C3765R5544d8723A07409k7496
12279G9913h9297n6687A83804r0960j9077a02067B4365a97776c8793a5238B5587
12267H9850K8931n6049i8087H226R0840c3486B9099J09461m3363L05991A12519
12255A51865C3299a67162E5494J90918g5275C7670J04098g0144B69474a38862
12244I2568K03983i4A91916m9206M6193q6780J44665r0996b09043C14537B7280
12232A06038D4900P4196Q6446Q1634J07066J60052D9798M32076A41382a93654
12221G7546J85281J85554j66023M2667L52180C07765K3500G7195Q7413P4811M1638
12210B81057H7229J0356J32388p0119J02131P1855A37296a3574E9323J26290F2975
$$ plain form
12290 32374 -148504 -32866 213681 173812 -60652 275113 33765 129309 -48723 107409 79913
12279 79913 -89297 -145984 183804 92844 73767 -102067 24365 -197776 -38793 -15238 25587
12267 89850 118781 62732 -98087 8226 99066 -33486 29099 138560 95197 401188 112519
12255 151865 33299 -167162 55494 246412 -75275 37670 141768 -70144 269474 -138862
12244 92568 296551 -94 191916 142710 188903 102123 246788 155792 -209043 314537 27280
12232 106038 44900 119096 205542 287176 394242 554294 49798 481874 141382 -193654
12221 77546 262827 448381 282358 325025 677205 307765 331265 77195 164608 239419 281057
12210 281057 87229 97585 229973 159854 261985 333840 137296 -13574 59323 185613 62975
12198D16262G6381J69112B6195J16860j8124J63857C1204J23353J18614L1316
12188C04487A25291B7192K12910j16727a00889B46985O129A01461a4376H6107
12177a88078k3453d1194k30199h2422c8534A93468G0341M56205k62692J67710
12167D31564a14986e0449C51047J4367H8901J48205r7145d4797D27319c43405
12156C74808E734g4239A06210J2418a65293L9944B1691q178L32212e5834A77294
12144a22130m8152D9789j6328J3430K8363H607M0164b0333A9494b01567H0802
12132A48594H096h6865A56457a79922h9039K0751C85134j32904A19426b12670
12121i6203B1930a59997A01594K56144D6599K27511A34963F2524J65864d2195
$$ plain form
12198 416262 76381 245493 26195 143055 124931 288788 31204 154557 273171 304487
12188 304487 125291 27192 240102 123375 -100889 246985 253114 101461 -14376 86107
12177 -188078 -211531 -41194 -271393 -82422 -38534 193468 70341 526546 263854 431564
12167 431564 -114986 -50449 351047 365414 88901 237106 139961 -44797 427319 -343405
12156 374808 5734 -74239 106210 118628 -165293 -125349 21691 13513 345725 -55834 177294
12144 -122130 -170282 49789 33461 46891 75254 8607 48771 -20333 19494 -201567 80802
12132 148594 8096 -86865 156457 -179922 -89039 -68288 385134 252230 119426 -212670
12121 -96203 21930 -159997 101594 357738 46599 274110 134963 62524 228388 -42195
12110a00087A78740m2018C0341J62341q6626B1620a43033G8706C2309a72554J6923
12099a55631p9167c760A31095a7979A13731A1595K27461c14702A1988J35438D6541
12087A19932O9601a04511A17789c26907A79149J77210D3846h9773j13515i8368
12076a43347B93824b7690A5285K11295a9366j697I2374L9733b19803q5443G215
12064a9668j52842L2806I5157Q4666J18256g3139C9973L85291J11970J171840
12054A709074m56875C71593E0490J6337J76166h2831A55527G2655B1835c97325
12043h3099B68538g9296B48618A20824a46284D8408g7440l5195e3398j46223A00487
12031C32848f6756b2152F9718b52213N7812A82762J06435E7418N5204j0710b32886
$$ plain form
12110 -100087 178740 136722 30341 192682 106056 21620 -143033 78706 32309 -172554 -155631
12099 -155631 -234798 -3760 131095 -17979 113731 11595 239056 -314702 11988 147426 46541
12087 119932 189533 -104511 117789 -326907 179149 356359 43846 -89773 -203288 -98368
12076 -143347 293824 -27690 15285 226580 -19366 -21063 92374 132107 -219803 -305246 7215
12064 -19668 -172510 -139704 95157 179823 298079 -73139 39973 425264 537234 1709074
12054 1709074 1252199 371593 50490 66827 242993 -82831 155527 72655 21835 -397325
12043 -83099 268538 -79296 248618 120824 -146284 48408 -77440 -112635 -53398 -199621 100487
12031 332848 -66756 -22152 69718 -252213 -194401 182762 289197 57418 112622 101912 -232886
12019a47231B45730C3777b4155r7774B09169K337a57899B0487a66109g1237B41455
12007I1677J88774J08629A71717c9769E4537j5390J93694a95881g890B19405A03041
11995A57702R0709c99951a03002I4838h8477j78822A69831a43810a9071k60001
11985b79072k49198c616q8907H2737L0617b533M57I9455c7633C19973b29298i0422
11972c6709B989J69655k8745R868d5401G2800k6845J53170a75780c4201a0770
11960C00821G6749M0920D6692k1324d0747l04138F184L47487A31486e59A74355
11948a47642C72504C9788d6576o8171C57253d31472a19243A69210E4736A0264
11937a87913k9290B95369a36928e1409O354j29882q4966A32266c1672F0200a33490
$$ plain form
12019 -147231 245730 33777 -24155 -121929 209169 211506 -157899 20487 -166109 -71237 241455
12007 91677 280451 389080 171717 -39769 54537 39147 232841 -195881 -7890 219405 103041
11995 157702 248411 -399951 -103002 94838 -88477 -267299 169831 -143810 -19071 -279072
11985 -279072 -528270 -3616 -92523 82737 113354 -2533 -2076 99455 -37633 319973 -229298 -90422
11972 -36709 2989 172644 143899 153767 -45401 72800 45955 199125 -175780 -34201 -10770
11960 300821 76749 117669 46692 25368 -40747 -344885 6184 353671 131486 -559 174355
11948 -147642 372504 39788 -46576 -114747 357253 -431472 -119243 169210 54736 10264
11937 -187913 -217203 295369 -136928 -51409 -45055 -174937 -259903 132266 -31672 60200 -133490
11925C27226G8652b43410D9790e0751j54671R676m02557J99060J71648J03577
11915a24018j4526O4370c892o1756j92758c8482B81382c65580C018c27905D60488
11903A66309J31825d7917F4140a7104D486c58024J72304B07864a03184J452l2921
11892a34653M5970A69616d8023H9133k1034f9495H2498L67441d6762A25341P4673
11881B00014E0955b3044r9149j49774A62912C3783A6458e3237k08138A84071d43926
11869f1208E4519k0481J05205n9071e7845A36385d9326j2499j4027k89182A47965
11857I0338b73767D1062J33554b95928C01588b3328A75251N3453q3531j8393g2078
11845A02612f1516j57166b7111k87830h3080E3761c29008i2052J3781m30780B56946
$$ plain form
11925 327226 78652 -243410 49790 -50751 -205422 -195746 -598303 -399243 -227595 -124018
11915 -124018 -138544 -74174 -3892 -65648 -258406 -38482 281382 -365580 3018 -327905 460488
11903 166309 298134 -47917 64140 -17104 4486 -358024 -185720 207864 -103184 -101732 -134653
11892 -134653 -88683 169616 -48023 89133 68099 -69495 82498 449939 -46762 125341 200014
11881 200014 50955 -23044 -122193 -271967 162912 33783 16458 -53237 -261375 184071 -443926
11869 -61208 54519 34038 139243 80172 -57845 136385 -49326 -61825 -75852 -365034 147965
11857 90338 -273767 41062 174616 -295928 301588 -23328 175251 228704 145173 126780 -72078
11845 102612 -61516 -218682 -27111 -314941 -83080 53761 -329008 -92052 -78271 -509051 256946
11833c53708J54471P9201q0808R5403j280k01121A71785B7398b24039q7424f5588
11821i2670j57106m9269C60132A14668h581k766o0938k68274e0231F6667a94432
11809C27904b4634o1429n6211k19992a25518A4783J65649E1036P2063a67660a01
11797a67390A72714m2182a9623D7957c4387j90389b4872n0535B43323a522j92759
11786a94281e7742B71306a35809b7559q2179A07211o426K5704n067B5611d8559
11774a08411c6988H8751M4909Q1103B7069b09699B2377d11423b03934B02632a07256
11762C5773a8032G6483C0672L5244j0214a66355d7786C13893A16848a36129J7022
11751a19107e6906B10030C5156h2706D2063J66390E9597a064l9530C51673C0924
$$ plain form
11833 -353708 -199237 -120036 -200844 -105441 -106721 -307842 171785 27398 -224039 -311463 -65588
11821 -92670 -249776 -299045 360132 114668 -8581 -11347 -72285 -340559 -50231 66667 -194432
11809 327904 -24634 -86063 -142274 -362266 -125518 14783 180432 51036 123099 -167660 -101
11797 -167390 172714 130532 -19623 47957 -34387 -224776 -24872 -75407 243323 -1522 -194281
11786 -194281 -57742 271306 -135809 -27559 -109738 107211 100785 126489 121422 25611 -48559
11774 -108411 -36988 88751 133660 214763 27069 -209699 22377 -411423 -203934 202632 -107256
11762 35773 -18032 76483 30672 65916 55702 -166355 -47786 313893 116848 -136129 -119107
11751 -119107 -56906 210030 35156 -82706 42063 208453 59597 -1064 -40594 351673 30924
11739B68441H1677J99891a80277C66523D8783F545c27967R1377I7893a43379n2704
11728a96083d8667N480n8989A79722a89528R3132d1689k03C7341J0274c03883
11716h6216e495D8381A4977b08799B87295a53557B8534e074D13746a5491I0825
11704C26225j28348l1169k668h7281E1039b10358H7503b5984m5917H2866L08134
11693C91000a1721q4136j17125C64110a94012b9284a1043B0346L3698e7122F6744
11681D4337a54383f4073j02368o0463B8353b05457A4307b03928o4737G4828d6603
11669a8298k12271J12619e4597B56049B0334g4078j99922C6696i8349q3233B32152
11657B06888a99196D751L795C738L23912o5626D8892M6112b54068I405a29878
$$ plain form
11739 268441 81677 281568 -180277 366523 48783 6545 -327967 -236590 97893 -143379 -196083
11728 -196083 -48667 -43187 -102176 179722 -189528 -96396 -41689 -41892 37341 47615 -303883
11716 -86216 -5495 48381 14977 -208799 287295 -153557 28534 -5074 413746 -15491 90825
11704 326225 197877 166708 164040 -87281 51039 -210358 87503 -25984 -71901 82866 391000
11693 391000 -11721 -95857 -212982 364110 -194012 -29284 -11043 20346 54044 -57122 66744
11681 44337 -154383 -64073 -166441 -226904 28353 -205457 14307 -203928 -268665 74828 -46603
11669 -18298 -230569 -117950 -54597 256049 20334 -74078 -274000 36696 -98349 -181582 232152
11657 206888 -199196 4751 8546 3738 327650 262024 48892 95004 -254068 9405 -129878
11645B07636G2613A9103K9559K41360G3611L64438f8822i608j77085C03123j22440
11634A80683m4451K8565a42593H1044K23061C3265j0851N1571d7753J6843q4347
11623a15257A74898J6367E7258O1923L6803O4758a53615c9298E1896a65714d1637
11611C25163H5559a5200l07647e5096C1226c9732C26488j23483L0642q4047a63242
11599i15j40659I6055j3003d0808B86173c49488A390d929B63849j18927R9565
11588B44487c16968C22507J8481I2961a82741o0824a20709B04969I1273J45435
11578B36708D6495J82625a2793D09396A3078c36627f9281m6839O664D28899h004
11566b6584A38092K0689b21291C00632B2490J570K4170i4825K7960B31732d2846
$$ plain form
11645 207636 72613 19103 48662 290022 73611 438049 -68822 -9608 -186693 303123 180683
11634 180683 136232 164797 -142593 81044 304105 33265 22414 73985 -47753 -30910 -115257
11623 -115257 174898 191265 57258 119181 155984 220742 -153615 -39298 51896 -165714 -41637
11611 325163 85559 -15200 -322847 -55096 31226 -39732 326488 203005 233647 149600 -163242
11599 -915 -141574 96055 83052 -40808 286173 -349488 1390 -4929 263849 144922 244487
11588 244487 -316968 322507 340988 92961 -182741 -243565 -120709 204969 91273 236708
11578 236708 46495 229120 -12793 409396 13078 -336627 -69281 -116120 -109456 428899 -8004
11566 -26584 138092 158781 -221291 300632 22490 24060 48230 -94825 -66865 231732 -42846
11554F4614a15785A03334J63950E533L9622a28428C44255F6117a13225O41E2994
11542a05039A78309c86572B8480o483Q3677n1307m08b20610E7068a75791B52945
11530B02968b23992A5864c7544j965D06235A79534b4579k05872f3430A32603b2489
11518I7883J26047b05016A1023J44581k0013h73B79944r9404q0622k0498J37354
11507B16774D7084O5944J13802Q8663D3124K25012a49629I1829G526c4831B09190
11495C7624A3575K01573f2634B06869J0751o3517J26005H0676a87213E61346B39363
11483E8227L28724I4150L18606a04800L6772B68587N5447k4047i5465A94185c9350
11471E2477K70297B921K30281J76850j71791o9253L2366m3530E999L80101D7783
$$ plain form
11554 64614 -115785 103334 267284 5533 45155 -128428 344255 66117 -113225 -112584 52994
11542 -105039 178309 -386572 28480 21997 105674 54367 53959 -220610 57068 -175791 252945
11530 202968 -223992 15864 -37544 -39509 406235 179534 -24579 -230451 -63430 132603 -22489
11518 97883 223930 -205016 11023 155604 135591 -873 279944 180540 99918 79420 216774
11507 216774 47084 113028 226830 315493 43124 268136 -149629 91829 7526 -34831 209190
11495 37624 13575 215148 -62634 206869 217620 154103 280108 80676 -187213 561346 239363
11483 58227 386951 94150 412756 -104800 -68028 268587 324034 299987 -95465 194185 -39350
11471 52477 322774 2921 233202 410052 238261 169008 201374 157844 5999 386100 47783
11459C99191A67344J18138J16080A22815J48441J42924g4128B8684d0201H6121
11448B66791j5741J72686g9688a2949r8047D5591A1022K98412A41868C1096L82861
11437D13957a9586A43920a20683I7683J67954I6880J08775D9742Q4932Q8767K7160
11426B50601C0299N9950c36804B30300d6388C27460h709E1891b70624a7570o1942
11415g9512A18833c20697a19492q1015C6651c75053D8598A6197J06943O2910I1522
11403a7220j5689r0971A83717d4715A85131a9150j13182L3257A74067a85537C12596
11391a34939e2174A0417J42184a99086G4378m797J78897O4468C6173c71379F6819
11379C83586g4801B6796J52281a02132A32737J55720k8230G2799a38151D3291
$$ plain form
11459 399191 167344 285482 401562 122815 271256 414180 -74128 28684 -40201 86121
11448 266791 251050 423736 -79688 -12949 -110996 45591 11022 309434 141868 31096 413957
11437 413957 -19586 143920 -120683 97683 265637 96880 205655 49742 134674 223441 250601
11426 250601 30299 90249 -336804 230300 -46388 327460 -8709 51891 -270624 -17570 -79512
11415 -79512 118833 -320697 -119492 -200507 36651 -375053 48598 16197 123140 186050 91522
11403 -17220 -32909 -123880 183717 -44715 185131 -19150 -132332 -99075 174067 -185537 312596
11391 -134939 -52174 10417 152601 -199086 74378 69581 248478 312946 36173 -371379 66819
11379 383586 -74801 26796 179077 -102132 132737 288457 260227 72799 -138151 43291
11368F727b76469e3837A05544a49449A50847a05966E8490A4293b71527A80661
11357a27264O1954A28531f2197a2633G8063K78337D4147b47776k81414b36891
11346a14133f185n1314l05196I2476a0695C62848b69272j46598B54283g1788k11864
11335b83652E400e6174j0993A3017f7949B2883d39313a14005j67370c6793B38750
11323a44765A8717M39284B9582A889O8440b5733p7728M9914P218r7310B33588
11311H0310b6059k44812J19725o4013p0814a8060C5234O4108h487j81054g3443
11299b61775A31186b4426F3020j3937a31168I0098b83947D0104a48318r3149o0729
11288c02196a24754G3892J7525g0103c2130r8777N6357B4453N9908b4347C11583
$$ plain form
11368 6727 -276469 -53837 105544 -149449 150847 -105966 58490 14293 -271527 180661
11357 -127264 -65310 128531 -62197 -12633 78063 356400 44147 -247776 -529190 -236891
11346 -114133 -6185 -57499 -362695 92476 -10695 362848 -269272 -415870 254283 -71788 -283652
11335 -283652 5400 -56174 -67167 13017 -67949 22883 -439313 -114005 -281375 -36793 238750
11323 -144765 18717 458001 29582 1889 70329 -25733 -103461 -53547 -46329 -143639 233588
11311 80310 -26059 -270871 -151146 -215159 -285973 -18060 35234 99342 -8487 -189541 -73443
11299 -261775 131186 -24426 63020 49083 -131168 90098 -283947 40104 -148318 -241467 -302196
11288 -302196 -124754 73892 91417 -70103 -32130 -130907 -74550 24453 84361 -24347 311583
11276a81818L0182j9867M3259F2001a47744E1771m398c3755A88517J6756K34929
11265D40202j54432c27298C2137f4139K9475o5330D1041a52277I294b6727j25895
11254a52622g4094A864J39019m8784l526l6551L11899e9171A76066a34080j9927
11243a54007A07553f9102j02239A6145J42610b35142A11135b77377C5376a38498
11232A89341d0742l90597g7311B97713c0301j6590D55198D4325J99123b96858
11221a4203q8011q6993B02549a1873k57749A71478a2379o1365D400b15656R6751
11210a18905A02108n0418f6448q5277a1312n4727P823j43884N652a5808k38984
11199b54792k0077h5926j7550j68905j5452A39470c21014a38381A20539O3537
$$ plain form
11276 -181818 -151636 -171503 -128244 62001 -147744 51771 47373 -33755 188517 205273 440202
11265 440202 285770 -327298 32137 -64139 -34664 -99994 41041 -152277 9294 -26727 -152622
11254 -152622 -74094 1864 140883 92099 88573 52022 363921 -59171 176066 -134080 -154007
11243 -154007 107553 -69102 -171341 16145 158755 -235142 111135 -277377 35376 -138498
11232 189341 -40742 -431339 -77311 297713 -30301 -46891 455198 44325 243448 -296858
11221 -14203 -102214 -189207 202549 -11873 -269622 171478 -12379 -73744 4400 -215656 -118905
11210 -118905 102108 51690 -66448 -151725 -11312 -66039 -58216 -202100 -196448 -15808 -254792
11199 -254792 -274869 -85926 -103476 -272381 -287833 139470 -321014 -138381 120539 184076
11189A84076c98819b7229D9406e5882G8652C1928K5565R0405a7852m6805k6539
11178i1196j91677N1342B0890a19727A11490N6644d3938A26737c59411A47997
11167A41876d2373r9290a7697k15779G0045b58166Q6171B41998q1486c01551J4236
11156b87315A4008b85830L8633F6270b20683f8223h140C4552a50671E6258O648
11145F2906J14665H4138a5797I1951h7648A18978p780p40a10356c883j02982A74469
11132I7788g4697C27610b00009A86021N0840M6602A39521C6046b50383H6236c23483
11120a57398A28583D8892g0252H9568b31539J6110A06835D2806e6405D0844a8046
11108G7403J65037a24343C18264A3303K40864Q1223A55413J95180j36548r3362
$$ plain form
11189 184076 -398819 -27229 49406 -55882 78652 31928 57493 147898 -17852 -64657 -91196
11178 -91196 -282873 -231531 20890 -119727 111490 168134 -43938 126737 -359411 147997
11167 141876 -42373 -141663 -17697 -233476 70045 -258166 -171995 241998 160512 -301551 -287315
11156 -287315 14008 -285830 -247197 66270 -220683 -68223 -8140 34552 -150671 56258 62906
11145 62906 177571 84138 -15797 91951 -87648 118978 111198 110458 -110356 -3883 -106865 174469
11132 97788 -74697 327610 -200009 186021 236861 283463 139521 36046 -250383 86236 -323483
11120 -157398 128583 48892 -70252 89568 -231539 -215429 106835 42806 -56405 40844 -18046
11108 77403 242440 -124343 318264 13303 254167 335390 155413 350593 214045 120683
11098A20683J27812Q2845j00387i5068A73132K98281J05908k12816H5355k5243
11088F0112A4205L79554k022m1190d039A10873J65333A25910K48323j47871K24154
11077D50516j35774j32009q8607J09180J03247j322H9561K99210p2308J74690
11067D91153j84516N922r461M5444J41252K9592R8236J17631n8090A84931O28525
11056H13456p1295M4870l39564K58264O7009l5114Q0826L04448j61324J50099
11046A111675j73424j27002j87751K83162q5702j40970J72058m4130k4772J58027
11036I41171k25648N62300n88860J55915L56309m11106J38815r9619J03681L290
11026I36248J41080r4237j44598j52699J46866p3972K60262l28802j2242J14711
$$ plain form
11098 120683 248495 331340 230953 -95068 173132 471413 577321 364505 85355 60112
11088 60112 14205 393759 391737 350547 -4039 110873 276206 125910 374233 226362 450516
11077 450516 314742 182733 94126 203306 306553 305231 89561 388771 316463 491153
11067 491153 306637 312559 303098 348542 489794 519386 617622 735253 677163 184931 813456
11056 813456 742161 787031 447467 705731 772740 737626 818452 1122900 961576 1111675
11046 1111675 938251 811249 623498 906660 820958 679988 852046 807916 783144 941171
11036 941171 715523 1277823 688963 844878 1201187 790081 928896 829277 932958 936248
11026 936248 1077328 983091 838493 685794 832660 758688 1018950 690148 677906 792617
11016G92617l64084N53422k91528J4674J486j29780J80136k31878J32640J59423
11006H17128J42714k74160k4316j19220L12901C70334N27248N3532k3724l98941
10996E28449M41758k81369p4042M5965K29715q357K70547m43556j17414K9731
10986F21427L96035J37121L8687o6792K84476n7675K17295j19371J88409L6122
10976A675734K5491N35460J80834O9512R10689J99896K63535J90222j67719K6068
10966C909722j82268q48126o3017o49639l51450q6263m46773O1668j12675K41077
10956A472256k95128l4932K23010m18071J45726j54727l22949j96974j16A77336
10945C83082k0947l0601J89843k04793J253m0681A03725M0766l6737N1877h1519
$$ plain form
11016 792617 428533 981955 690427 705101 706587 576807 756943 525065 657705 817128
11006 817128 959842 685682 661366 542146 855047 370334 897582 951114 927390 528449
10996 528449 970207 688838 614796 660761 890476 882119 1152666 709110 591696 621427
10986 621427 1017462 1154583 1193270 1126478 1410954 1353279 1570574 1451203 1639612 1675734
10976 1675734 1701225 2236685 2417519 2487031 3397720 3597616 3861151 4051373 3883654 3909722
10966 3909722 3727454 2879328 2816311 2166672 1815222 1728959 1282186 1343854 1231179 1472256
10956 1472256 1177128 1142196 1365206 947135 1092861 938134 615185 418211 418095 177336
10945 383082 362135 331534 521377 316584 317837 277156 103725 144491 107754 159631 -81519
10933A79304d203n6812A64154p1127P6206H56L00914c7956D23793E4981K46228
10922C01209b62727A71008m9597A1841a1089B96432A32788c53749A77321H1163
10911a73657D7751b55808G5189a80408B4275b78065J6592D25M17328j85391K2650
10900B55012N5183a30334j18736a18280k02670E7496A1574J8979b9236B47579
10889E9664K83575a29834c6029l12640B37024b58075f8595j1476n9835p3283K3517
10878a89672j03736B31391d6016A25887M1793a77440A81968b87133G7277L41737
10868D19014B3154a60637j48380A55588a54050F7236d1270A48243Q7346a27267
10857A22799K3338h647C90218a25050A67342G000K8330K4686c13004a02914n9337
$$ plain form
10933 179304 -4203 -61015 164154 93027 169233 856 301770 -37956 423793 54981 301209
10922 301209 -262727 171008 121411 11841 -11089 296432 132788 -353749 177321 81163
10911 -173657 47751 -255808 75189 -180408 24275 -278065 -261473 425 417753 232362 255012
10900 255012 310195 -130334 -249070 -118280 -320950 57496 11574 30553 -29236 247579
10889 59664 343239 -129834 -36029 -348669 237024 -258075 -68595 -80071 -139906 -213189 -189672
10878 -189672 -293408 231391 -46016 125887 167680 -177440 181968 -287133 77277 419014
10868 419014 23154 -160637 -309017 155588 -154050 67236 -41270 148243 235589 -127267
10857 122799 146137 -8647 390218 -125050 167342 7000 35330 60016 -313004 -102914 -162251
10846a62251r128B37827a96426J8323I4243b45314J03197K8348F1555c94338A15590
10834B01126a65842j32948C1712J0890J38429g8049j17529F3590c84190a01010
10823b22820p7516e8414a2404p1903E1112J5266b78555P5126A87950a59385K3679
10812a35706k15732e0521m0069A29159p915A8926a46815I07R212a65674l07602
10801d73276F1440j3767e0483N236D4501O4731b71808C02133a56556d6945k47072
10790b94017a2528I8759J07438P842B1066c85821J64994K0364e018j40261A66054
10778b38532j6896a02174B0802d87247A6026L1827c30229a17203A03824C0758
10767b41228B2942p695a62027j43300R8446A07456e1540j04273m0804j1571A19575
$$ plain form
10846 -162251 -171379 237827 -196426 -178103 94243 -245314 -142117 -113769 61555 -394338 115590
10834 201126 -165842 -298790 31712 42602 181031 -78049 -195578 63590 -384190 -101010
10823 -222820 -300336 -58414 -12404 -84307 51112 66378 -278555 -203429 187950 -159385 -135706
10812 -135706 -351438 -50521 -90590 129159 121244 18926 -146815 907 10119 -165674 -473276
10801 -473276 61440 47673 -50483 -45247 44501 109232 -271808 302133 -156556 -46945 -294017
10790 -294017 -12528 98759 206197 214039 21066 -385821 -220827 -200463 -5018 -145279 166054
10778 -238532 -255428 -102174 20802 -487247 16026 47853 -330229 -117203 103824 30758
10767 -241228 22942 15247 -162027 -305327 -206881 107456 -51540 -155813 -196617 -208188 119575
10755c82279A77871K23571b01237a1529B45953C5227e22222B04617I5869K00055
10745B95924d15500a8261l12230a12593B9333a08847c4744k19346a17211q4068
10735b01279G862a61979o7663E6487E84f374I4163h2572A50004f3413A97980c74521
10722G3187a81751H6530b28571A10814K36810d20497C85498b93502g2486l9370
10712a11856C04557a50243A46767c8606j36629K9300j07758A64133c14541C7939
10701b26255A6343b62619A26429a01867A38728m3813c07452A13959D5263J30540
10691A75803B8150a26805A24398d8901B34387E5576d0547A11116a75424A73575
10680b2721m7139k68508Q5058E0550c34048A46602a38385B3460Q1057K51165a35983
$$ plain form
10755 -382279 177871 401442 -201237 -11529 245953 35227 -522222 204617 95869 295924
10745 295924 -415500 -18261 -330491 -112593 29333 -108847 -34744 -254090 -117211 -201279
10735 -201279 7862 -161979 -229642 56487 584 -6374 94163 -82572 150004 -63413 197980 -374521
10722 73187 -181751 86530 -228571 110814 347624 -420497 385498 -293502 -72486 -111856
10712 -111856 304557 -150243 146767 -38606 -175235 -145935 -253693 164133 -314541 37939
10701 -226255 16343 -262619 126429 -101867 138728 94915 -307452 113959 45263 175803
10691 175803 28150 -126805 124398 -48901 234387 55576 -40547 111116 -175424 173575
10680 -22721 -69860 -338368 -253310 50550 -334048 146602 -138385 23460 104517 355682 -135983
10668b77036A4147b13909k73517H5292a5213j64289C14484a01284b0163D1555
10657b72151E1862b90605K2583b7655A18011a92906g0147C11959A3516K5960R6083
10646A35559h3373J6284E4193h0930A25885C4420b89390K6825g2543b4583G9977
10634a47596L5837B03737d4027C6948O82a45252C68399j04065m8316C0364i452
10622A14912m5168i967l5843j78210G5226g2084A06161n1218c19423h0768B5594
10610c9349a76l8562D06439f5003A31698n6297q377a94848I3539d8677o4775j47001
10598b60453A76846i9394D41749d5815B97292a86433O0111k9789r3268F358b48510
10586b28129c0836j07092j82260J23286b859I4333j0073L0006A8581a06459A6701
$$ plain form
10668 -277036 14147 -213909 -487426 85292 -15213 -179502 314484 -101284 -20163 41555
10657 -272151 51862 -290605 -268022 -27655 118011 -192906 -70147 311959 13516 39476 135559
10646 135559 -83373 -67089 54193 -80930 125885 34420 -289390 -262565 -72543 -24583 79977
10634 -147596 -111759 203737 -44027 36948 37630 -145252 368399 264334 216018 30364 -9452
10622 114912 69744 -9967 -45810 -224020 75226 -72084 106161 54943 -319423 -80768 25594
10610 -39349 -176 -38738 406439 -65003 131698 75401 67024 -194848 93539 -48677 -113452 -260453
10598 -260453 176846 -99394 441749 -45815 297292 -186433 -126322 -156111 -249379 6358 -248510
10586 -228129 -30836 -137928 -320188 -196902 -2859 94333 84260 114266 18581 -106459 16701
10574F8155P2827h4649k22226a03924p932k57691h9589k41193A29932m4328c95399
10562a61644D0785c04553J06070g5183k7311C31734I7420K03519H9403a74932
10551E0635h15A00670l7524K35607j48719b21934A99308b05290E7381K75274c07308
10539i3259F7768a34291L5455B9828c8528k901B2134M9988e4074k44552H8104
10527b70382e0317k29396a12145E2247K59599j48168c41758m7277N09D3497b9374
10515B21408i1293q0490A45652m8588K27726A4451j502b5430B33888F1444a36571
10503c98297J26560k07449A01041a48592B88929m7754E3052b3881j04438B4642
10492b2549j25284n3609H1875g0917k71907A47037b54743f0670q0580A42013B1328
$$ plain form
10574 68155 140982 -84649 -306875 -103924 -111856 -369547 -89589 -330782 129932 85604 -395399
10562 -161644 40785 -304553 -198483 -75183 -102494 331734 97420 300939 89403 -174932
10551 50635 -815 100670 63146 298753 150034 -221934 199308 -205290 57381 332655 -307308
10539 -93259 67768 -134291 -98836 29828 -38528 -41429 22134 72122 -54074 -298626 88104
10527 -270382 -50317 -279713 -112145 52247 311846 163678 -341758 -389035 -388526 43497 -29374
10515 221408 -91293 -171783 145652 97064 324790 14451 12949 -25430 233888 61444 -136571
10503 -398297 -271737 -479186 101041 -148592 288929 241175 53052 -23881 -128319 24642
10492 -22549 -147833 -201442 81875 -70917 -342824 147037 -254743 -60670 -141250 142013 21328
10480e6474G9382f9060B11112L8885d5160K0894A74852B7461K87025f4223B0995
10468G2659K21497i1029j11638c5371o2107a6474l2140q8552m2764A19374b18588
10456C34427b95407A12102f5237j03046j7449a5055n3971B84416b69307B08652
10445e9983A05055J71822i6089A22496A4691R1615e4288j45715i2687B25713a13709
10433b62788A68215d13665a55766A5316J96646a39587M4872j58852A35728m3085
10423I2643P4752k8436K33361f9613j85463C9868b15730p6644h7691A8516K78865
10412B97381c81815D06795c09718f4366a6044f283p8871a7636D1941a2151q6208
10401i8359p324A77917A5822J0812b2244Q717B57630a947B51282A4314J38645
$$ plain form
10480 -56474 79382 -69060 211112 249997 -45160 -24266 174852 27461 314486 -64223 20995
10468 72659 294156 -91029 -202667 -35371 -97478 -16474 -48614 -137166 -179930 119374 -218588
10456 334427 -295407 112102 -65237 -168283 -185732 -15055 -69026 284416 -269307 208652
10445 -59983 105055 276877 -96089 122496 14691 106306 -54288 -200003 -92687 225713 -113709
10433 -262788 168215 -413665 -155766 15316 211962 -139587 -94715 -253567 135728 92643
10423 92643 167395 138959 372320 -69613 -255076 39868 -215730 -292374 -87691 18516 297381
10412 297381 -381815 406795 -309718 -64366 -16044 -6283 -85154 -17636 41941 -12151 -98359
10401 -98359 -105683 177917 15822 26634 -22244 -13527 257630 -1947 251282 14314 152959
10390A52959e5719p2811D13427A99655L19764h2962H8575a24111A67542P6735
10380B44277A19821Q5277I3852K79515K39125p9874r4783p1056r8377J5433A9282
10368C62295j23637Q8198k8309K16966O8055j45598o1926A60397K41520q3531
10358C18386L2004l0151L7813A48058R4837J94349q2173J10012N16099j44714
10348H36468C98505A59525L96536A27202J16415K29575B00405a8635B70058q2485
10338A87573o7903n6170J91634q3441J25246e8060B29132q7059J72137r6004k5889
10327A92317o6784l7085a63533B68520j4841n7146q1941K78326E9422h4751B4925
10315A57698J1549a43590j4672A07164h2219j43849Q2439C07695b0368p2681J5989
$$ plain form
10390 152959 -55719 -128530 413427 199655 519419 -82962 88575 -124111 167542 244277
10380 244277 119821 205098 93852 373367 612492 532618 437835 366779 268402 283835 19282
10368 362295 238658 326856 298547 515513 583568 437970 376044 160397 401917 318386
10358 318386 350390 320239 358052 148058 242895 437244 355071 465083 981182 836468
10348 836468 398505 159525 556061 127202 243617 473192 200405 -18635 270058 187573
10338 187573 119670 63500 255134 171693 296939 -58060 229132 142073 314210 218206 192317
10327 192317 125533 88448 -163533 268520 253679 196533 114592 392918 59422 -84751 24925
10315 157698 169247 -143590 -158262 107164 -82219 -226068 -143629 307695 -20368 -93049 -77060
10304g7060A51412Q2515H4953h5676A0960a62632d9473A58711J4148n4044a2117
10292A48256J61732j36745a13945b0089H8001a51051A26899a27512c8585j52124
10282a90709m7415a751k63039j46960J45549a10972l29677B72578m8180r6826
10272A27572C3803J76359o3437R529e594m01059a93674D0511R2407C2282J19723
10261A52005K84055c5157b062B76055j12140L36789C5588L38665A06599a67707
10250h5838p6716K3081A99608b17152M1910C8546i94j88611b7992k49254j10904
10239c88150J90660f5150B23671f4151p5157e4306j04256p6960E97J24496c9020
10227A8649a75137Q0265k2311c8881A08915n3926a62716j7273P9067n5373M9581
$$ plain form
10304 -77060 151412 233927 84953 -85676 10960 -162632 -49473 158711 172859 118815 -12117
10292 148256 309988 173243 -113945 -20089 88001 -151051 126899 -127512 -38585 -190709
10282 -190709 -238124 -1751 -264790 -411750 -266201 -110972 -440649 272578 224398 127572
10272 127572 33803 210162 146725 156254 -5594 -406653 -193674 40511 132918 32282 152005
10261 152005 436060 -35157 -2062 276055 163915 500704 35588 374253 106599 -167707
10250 -85838 -162554 -139473 199608 -217152 -175242 38546 -994 -189605 -27992 -277246 -388150
10239 -388150 -197490 -65150 223671 -64151 -139308 -54306 -158562 -235522 597 125093 -39020
10227 18649 -175137 -94872 -117183 -38881 108915 54989 -162716 -179989 -100922 -156295 -106714
10216a06714A1872d7251p5855J4847d7233q5890K2712L2980A26713n2217M0163
10205A14659I296h6352k8961M8173j02898A24805J05533a82177H4823J34555c18151
10193A98253g4846r6397Q1652F0079h1382D0438b03928Q2198D146h6806p2925
10182a59731E5516K0835E225g742D5537c7842l358j19889f1637J6521A2611K36247
10170B48858d11540B70656a32893A32323n0528a29737B62949c83292i4985j39610
10160b34595j15023a34291k92122A18623N2852b40768i3107A6412c08429N6385
10150b52044h4347C7845K82712o7026D6446i4252k87360k7988E9120M8393b30766
10138b86638e7151q9522d3361l03304e1743j82588k9212G478a84271A7347L586
$$ plain form
10216 -106714 11872 -47251 -123106 -108259 -47233 -133123 -110411 -77431 126713 74496 114659
10205 114659 9296 -86352 -115313 -67140 -170038 124805 230338 -182177 84823 219378 -318151
10193 198253 -74846 -171243 -89591 60079 -81382 40438 -203928 -121730 4146 -86806 -159731
10182 -159731 55516 76351 5225 -7742 45537 -37842 -41200 -161089 -61637 -45116 12611 248858
10170 248858 -411540 270656 -132893 132323 81795 -129737 262949 -383292 -94985 -234595
10160 -234595 -349618 -134291 -426413 118623 171475 -240768 -93107 16412 -308429 -252044
10150 -252044 -84347 37845 320557 253531 46446 -94252 -381612 -409600 59120 107513 -230766
10138 -286638 -57151 -146673 -43361 -346665 -51743 -234331 -263543 7478 -184271 17347 20933
10127B0933a11799A3718i0075A43568f6569b2406j43806A06552d0651C4802a1056
10115b53223A86778b18727G1652c44992A16438a03574e296B8129O2121n747R1689
10104A76192F3632b30553B05900b44947h1281A05361i6592r0298j31653G287b10669
10092a61290B48340q6616h9401B0326b10503a00218q939c2656G1680a01199o1022
10081a62221p992N1464L8706I3296F559L2721d03275A0962d76097B1821L12403
10070C34224j42231D9691O9257b2482C0025a22705m8904l3588I7493a13227B56852
10058a73681A76928c19015A47533a90017f3757n3432j8880H126d222r0032I751
10046c7056r6821j48609a30073j52930k3098h743B27922E5624b86530J33281n3122
$$ plain form
10127 20933 -111799 13718 -90075 143568 -66569 -22406 -166212 106552 -40651 34802 -11056
10115 -253223 186778 -218727 71652 -344992 116438 -103574 -5296 28129 90250 84503 176192
10104 176192 63632 -230553 205900 -244947 -81281 105361 -96592 -186890 -318543 7287 -210669
10092 -161290 248340 161724 -89401 20326 -210503 -100218 -109157 -32656 71680 -101199 -162221
10081 -162221 -170213 -118749 -80043 93296 6559 39280 -403275 10962 -476097 21821 334224
10070 334224 191993 49691 118948 -22482 30025 -122705 -171609 -205197 97493 -113227 256852
10058 -173681 176928 -319015 147533 -190017 -63757 -117189 -136069 8126 -4222 -94254 9751
10046 -37056 -133877 -282486 -130073 -283003 -306101 -8743 227922 55624 -286530 -153249 -206371
10035b06371j7525p5928I3734a27045K63N5879A97221E7418b72575e7842A60110
10023g5104E3824b09670c2988j98616B0175f460k26244k0133a5507j72501A4174
10011h0286j94021e2291M488B1384b12692A3028c99654H9339K94872g0410G0534
9999a95539C2349J69704h1511B03488a93141q0875E2402b98893A06581b347j72967
9988a75314G5691a75576b4298B7140K09027a73230f3991A61137N1546a48218f9782
9976c84432A25715J919b2945k50364O1494m6788N3431L6733A83980a57715j24028
9965b81743i2235k17989A26380c42283L5513i5870A08253P2403D7862i1260I9289
9953b4141m6389L0607k33766J21806A24453f7068q6630A71105B3417d32710a78045
$$ plain form
10035 -206371 -223896 -299824 93734 -127045 -126782 -70903 197221 57418 -272575 -57842 160110
10023 -75104 53824 -209670 -32988 -231604 20175 -6460 -232704 -252837 -15507 -188008 14174
10011 -80286 -274307 -52291 -47803 21384 -212692 13028 -399654 89339 384211 -70410 70534
9999 -195539 32349 202053 -81511 203488 -193141 -274016 52402 -298893 106581 -2347 -175314
9988 -175314 75691 -175576 -24298 27140 236167 -173230 -63991 161137 212683 -148218 -69782
9976 -384432 125715 127634 -22945 -273309 -211815 -258603 -205172 -168439 183980 -157715 -281743
9965 -281743 -92235 -310224 126380 -342283 -306770 -95870 108253 180656 47862 -91260 99289
9953 -24141 -70530 -39923 -273689 -151883 124453 -67068 -153698 171105 23417 -432710 -178045
9941a05052B82542A00939b79401j7645b8068j53732R445a2856j33991k18645G3069
9929h3602j38443F1884b45717B01382c57174A54748l7769A2244b22947c0464E4384
9917d62592a1996o0626a1607n26752A08693e2087C85560b61431J00236J7977j96821
9906c40039A05490a84680e0328H1086a77756I4244b61181f3077o7932j002f0265
9894b49444C4926J25865h9610j80231J34859k78057J75381A41719a1586B024K9427
9883C1451a34749q9975R1296f457A48008D243c55936F467a08354G9237j2411a44371
9870b07403j07470b8577k26450Q450h9984F425J82956f4554j69985e1429j18881
9859a70310k46055A42203O2857a17975a4950B6229d7781l77373B2303c1182I6879
$$ plain form
9941 -105052 282542 100939 -279401 -297046 -28068 -181800 -172355 -12856 -146847 -365492 73069
9929 -83602 -222045 61884 -245717 201382 -357174 154748 116979 12244 -222947 -30464 54384
9917 -462592 -11996 -72622 -11607 -538359 108693 -52087 385560 -261431 -161195 -143218 -340039
9906 -340039 105490 -184680 -50328 81086 -177756 94244 -261181 -63077 -131009 -132011 -60265
9894 -249444 34926 160791 -89610 -269841 -134982 -413039 -237658 141719 -11586 2024 31451
9883 31451 -134749 -224724 -133428 -6457 148008 4243 -355936 6467 -108354 79237 66826 -144371
9870 -207403 -314873 -28577 -255027 -246577 -89984 6425 189381 -64554 -234539 -51429 -170310
9859 -170310 -416365 142203 205060 -117975 -14950 26229 -47781 -425154 22303 -31182 96879
9847f0476A3584a51484c996k6825A0581g8169Q534E8681J78699D713J26254b1046
9834b70260C81159A44178m7532a10104r4396m1267A45093c0891A41150J18556
9824B59706A9733a07514p2007P2357B67399a44881A04871M7143E8659K8026c8680
9812A63439G8526P7884C305K64771a59230B08295a66614O5385o7949c1711C9324
9800a20185H1030R5210a00499J9964L2864A77783E2309b1666F821J79536C0869
9788A01320j7230c6977q8271C25018F0386c54256J48040h749E8260J6917a12910
9776a55021l88158a10483J6709L9458k31989a25702m2872m32312a42871A40966
9765D8397K2655j6268a76508A84233p85B5313b24088a175G7236c23967a61328
$$ plain form
9847 -60476 13584 -151484 -3996 -30821 10581 -78169 -69635 58681 237380 4713 130967 -21046
9834 -270260 381159 144178 96646 -110104 -204500 -245767 145093 -30891 141150 259706
9824 259706 19733 -107514 -179521 -107164 267399 -144881 104871 152014 58659 86685 -38680
9812 163439 78526 156410 3305 268076 -159230 208295 -166614 -101229 -169178 -31711 39324
9800 -120185 81030 176240 -100499 -80535 -47671 177783 52309 -21666 6821 186357 30869
9788 101320 84090 -36977 -125248 325018 60386 -354256 -206216 -8749 58260 75177 -112910
9776 -155021 -543179 -110483 -93774 -54316 -286305 -125702 -168574 -600886 -142871 140966
9765 48397 71052 54784 -176508 184233 183448 25313 -224088 -1175 77236 -323967 -161328
9753B61815a31768K245j51571a32284l6803p2499R1317O0329F2345K2825c7425
9741D1142b45316a7462j6109a5995j24703B6863J48282b05103Q7948M7101k48238
9730c18292a20729j11529B6168J18464a36114B0830c49869r4268P5734J82017
9720a86386H3673A3073J74990b37531n1719H3209J30746b59561P0250A14051Q580
9709A22631j7279K08513a22220c8583m52270B8689a15087E4802a32452A63343
9698e739m6844l7037k3604A05531d178l886k7999j62816j9897A26408b51789N1768
9686b00021O5754R449l64865i3889C13160c94747C7920j2341b97483A1036J56745
9675A67781a88388J1631J6530D3521b42465O1114A10158P2767B1289c98200a5744
$$ plain form
9753 261815 -131768 -129523 -281094 -132284 -169087 -241586 -150269 -89940 62345 85170 -37425
9741 41142 -245316 -17462 -33571 -15995 -140698 26863 175145 -205103 -117155 -70054 -318292
9730 -318292 -120729 -232258 26168 144632 -136114 20830 -349869 -444137 -368403 -186386
9720 -186386 83673 13073 188063 -237531 -289250 83209 213955 -259561 -189311 114051 122631
9709 122631 105352 313865 -122220 -38583 -490853 28689 -115087 54802 -132452 163343
9698 -5739 -52583 -89620 -113224 105531 -4178 -8064 -36063 -198879 -218776 126408 -251789 -200021
9686 -200021 -134267 -124818 -489683 -93889 313160 -394747 37920 25579 -297483 11036 167781
9675 167781 -188388 -176757 -160227 43521 -242465 -181351 110158 182925 21289 -398200 -15744
9663c29020a18279k91647J68518O4388B8590a87603F1177J3419A7791a71108b9519
9651f6630j42228k0311i0135j7667n9050q4120g6077k07195A63703A7705P1947
9640H9652e5233B4900a51782J1320B58563H7290K36423a50297i946o1850C73839
9628D6717M8986b70816D105c35611B9444J45058F3532a08560A6778a24862b3721
9616a19473C24440f1207k03405p9852r0151J51014J25945b0043l72983G8187b74415
9604b18785K7854k58044A16693f4277D4665b72009Q470O2686a5502j06135B12720
9592a84629j20218R413o0176B38616c54040d1094k65318J21868f9940k0092k6831
9581a16863e705E8475d15797a4259j53243Q0664A54124e1259k8753A80816E3982
$$ plain form
9663 -329020 -118279 -409926 -241408 -177020 28590 -187603 61177 74596 17791 -171108 -29519
9651 -66630 -208858 -229169 -90135 -107802 -166852 -250972 -76077 -283272 163703 17705 89652
9640 89652 -55233 24900 -151782 -140462 258563 87290 323713 -150297 -9946 -71796 373839
9628 46717 95703 -270816 4105 -335611 29444 174502 63532 -108560 16778 -124862 -23721
9616 -119473 324440 -61207 -264612 -344464 -434615 -283601 -157656 -20043 -393026 78187 -274415
9604 -218785 -190931 -448975 116693 -64277 44665 -272009 -263539 -200853 -15502 -121637 212720
9592 -184629 -304847 -295434 -355610 238616 -354040 -41094 -306412 -184544 -69940 -90032 -116863
9581 -116863 -5705 58475 -415797 -14259 -167502 -86838 154124 -51259 -80012 180816 53982
9569b44504A35265n0540b07126a1284m60182J46889M5637E582a66434L1494j36344
9558b71284a06812L6254F2322b94246f8158B2175g003B79917i6329B2543b47552
9546h2200k86333A38285j6401Q5570b10188F5558g5766j30690G5561a09792N2898
9535e6894o1236C19237C2125M1469b289j19097N1801D2363b29154A13603c38550
9523c0676r1393E2109a22746k8100H8967d4507D5725a39221f1401q6162O7996
9512g9567b8458J1757G6993b02157M6669O4409m6207j74550K9886p3007R3284
9501b61673H810J00789N7993b29056B46589r7065c32123E7394O3847d03453a73457
9489b63576L2436f500m10407B2320b30306F637a00348H0481L03862A17210a79551
$$ plain form
9569 -244504 135265 84725 -207126 -11284 -471466 -324577 -278940 5582 -166434 -134940 -271284
9558 -271284 -106812 -70558 62322 -294246 -68158 22175 -7003 279917 -96329 22543 -247552
9546 -82200 -368533 138285 121884 207454 -210188 65558 -75766 -206456 75561 -109792 -56894
9535 -56894 -118130 319237 32125 73594 -2289 -121386 -69585 42363 -229154 113603 -338550
9523 -30676 -122069 52109 -122746 -150846 88967 -44507 45725 -139221 -61401 -147563 -79567
9512 -79567 -28458 -16701 76993 -202157 -155488 -91079 -137286 -311836 -281950 -354957 -261673
9501 -261673 8810 109599 167592 -229056 246589 149524 -332123 57394 121241 -403453 -173457
9489 -263576 -231140 -6500 -416907 22320 -230306 6637 -100348 80481 384343 117210 -179551
9477c62732h1551H0997K7417m7924a81011A14977a72417a8827j49913l9544F7961
9465A00407a58277O7928q9593c5754a3797j1732j20814A47101e2655A1042b33829
9453c8538a1931I2538a29370o5434M0437N0263j01911p6642a11427A4729d48271
9441A01048B308a33937l393A92960b79982R0181p3562i5150E0245a12019j9090
9430a31109I0394b04387K9919h3246a0324B6491O709a20256j06446A43161a71942
9418b70100A27864b60837D9132a57323I6387f745A84234a76984A49641a42535
9407C4056b16754B04743a47448B9829j865a8088l7420A22899c35975m4258A0604
9395d00046a71213d2201a5274k95811h8755J4937A35933j8709M7734B5861a92343
$$ plain form
9477 -362732 -81551 80997 108414 60490 -181011 114977 -172417 -18827 -168740 -208284 67961
9465 100407 -158277 -90349 -179942 -35754 -13797 -25529 -146343 147101 -52655 11042 -233829
9453 -38538 -11931 92538 -129370 -194804 -154367 -104104 -206015 -282657 -111427 14729 -448271
9441 101048 2308 -133937 -137330 192960 -279982 -189801 -263363 -95150 50245 -112019 -131109
9430 -131109 90394 -204387 -174468 -83246 -10324 26491 33200 -120256 -226702 143161 -171942
9418 -270100 127864 -260837 49132 -157323 96387 -6745 184234 -176984 149641 -142535
9407 34056 -216754 204743 -147448 29829 27964 -18088 -55508 122899 -335975 -380233 10604
9395 -400046 -171213 -42201 -15274 -311085 -88755 -73818 135933 117224 164958 25861 -192343
9383a87496M3106k23711a09440H0273Q726J42848a53425b4684I6781J63526g4020
9371g1122M467j4712K5627l51988a73096B1949a57313H2246J59687K00238A33136
9359A69329a42632k32871a45373A44923a54779f3887D7796L35j9292J98475c06833
9347A33052D1631g6014m3149A14432B2293K5080a07533B59788g3592j10005H2116
9335B33300a76630A81146F1844c52403I7314c78068b5608B6717c35517B31871
9324g0850C24328c10736a0015l09359H2053a09838B69982H9838b57439R1478L8911
9313a27050p497L4717l6911I4700j7975b74187A74220C2736b87492c6007A22615
9301a64603l0028C5889Q433K11321c78357M1144Q9390A86653C2368a70384e8859
$$ plain form
9383 -187496 -144390 -368101 -109440 80273 88999 231847 -153425 -24684 96781 260307 -74020
9371 -71122 -66655 -81367 -55740 -407728 -173096 21949 -157313 82246 241933 442171 133136
9359 169329 -142632 -375503 -145373 144923 -154779 -63887 47796 48131 28839 227314 -306833
9347 133052 41631 -76014 -119163 114432 22293 47373 -107533 259788 -73592 -183597 82116
9335 233300 -176630 181146 61844 -352403 97314 -378068 -25608 26717 -335517 231871
9324 -70850 324328 -310736 -10015 -319374 82053 -109838 269982 89838 -257439 -165961 -127050
9313 -127050 -134547 -99830 -136741 94700 76725 -274187 174220 32736 -287492 -36007 122615
9301 -164603 -194631 35889 44322 255643 -378357 -337213 -247823 186653 32368 -170384 -58859
9289c57040B0086c27229K4798b5919o8106B9087L2773b4587H6369J23980b09673
9277c4496A13595c1944D5069e6163r9328G855K48905i2262B58882a59721n1750
9266b11471A00241b43275f0903j99320c4565L52A84989B9796k36P5215b28446
9254b30347A14673b40559F1696c6158B4584a38444j75558a04642k25712a62011
9243a48921k09596f5336p1914H0586c3420k27269a2001k08122E0428i9091l8104
9232a37195H379b15610n9091E5765a1921k79228L6669C6563d3432E3057a47806
9220I9492a33753A60886e09863b44896H824J81673C6610a2235A51444b3427k11831
9209b35258l8597C9026j1297J13033c14876I41b43050F1087a68353B57350a47488
$$ plain form
9289 -357040 20086 -327229 -302431 -25919 -94025 29087 61860 -24587 86369 210349 -209673
9277 -34496 113595 -31944 45069 -56163 -155491 7855 256760 -92262 258882 -159721 -211471
9266 -211471 100241 -243275 -60903 -260223 -34565 -34213 184989 29796 29560 104775 -228446
9254 -230347 114673 -240559 61696 -36158 24584 -138444 -314002 -104642 -330354 -162011
9243 -148921 -358517 -65336 -137250 80586 -33420 -260689 -12001 -220123 50428 -99091 -137195
9232 -137195 8379 -215610 -274701 55765 -11921 -291149 -254480 36563 -43432 53057 -147806
9220 99492 -133753 160886 -509863 -244896 8824 190497 36610 -12235 151444 -23427 -235258
9209 -235258 -273855 39026 27729 140762 -314876 941 -243050 61087 -168353 257350 -147488
9197D5029d5506r5103O6732C5459E73M43333G0990c5521h809B2454h3466j16278
9185a99744g0200A9508K0926f7332A84733G1783f9152J4485j49896J01846l6547
9174a39264H7893a15668j84412J39570c8716A1446a13508C9974j263K4838a8692
9162a18474j12054h6646A05184c36150E7232k1500d76989c4575A82123A6691d90122
9150a97007E6158a43545A0031a70389b1993A33262a07291K8798A69169l8293c1730
9138b63487A82692i0970H2836d067B51297b6351l3069k06464A27184a64662d9386
9126D3910M8707B4106e31158b1138A39755m3843a38992N3527K2734k98865d9885
9114G3623l799b52611A19345a88698j0670f3174n8847n3898C21916b00892a7388
$$ plain form
9197 45029 -45506 -140609 -73877 35459 573 443906 70990 -35521 -8809 22454 -83466 -199744
9185 -199744 -70200 19508 40434 -67332 184733 71783 -69152 -54667 -204563 -102717 -139264
9174 -139264 87893 -115668 -300080 -160510 -38716 11446 -113508 39974 38711 63549 -18692
9162 -118474 -230528 -86646 105184 -336150 57232 35732 -476989 -34575 182123 16691 -490122
9150 -197007 56158 -143545 10031 -170389 -21993 133262 -107291 -78493 169169 130876 -31730
9138 -263487 182692 -90970 82836 -4067 251297 -26351 -59420 -265884 127184 -164662 -49386
9126 43910 92617 24106 -531158 -21138 139755 95912 -138992 -85465 -62731 -361596 -49885
9114 73623 69824 -252611 119345 -188698 -199368 -63174 -122021 -175919 321916 -200892 -17388
9102a08643A62278A9212b17740j21739J23969J5048r7095a25211p5155i9224M4560
9091e4664A9481e8772o5678j13949b4317g924C7008a64729b6539j56762G1095
9079a69790r2840J03644j4930G4839f7255A19722a0190L178k65355a21216C56593
9067d8522p9339D0610a50827G7665c9847E460b10119A09714h1966j85167d3142
9055c61387c28m49748J78046b4580j08762G7000R0755c25505A21978e06373E3083
9043b60684E7277P6762c18308C1286a2490p3233o0769H4706f2193K2795C13174
9031c9480j22588e2901H1865a70297o0249B39759a6446j10010C4860c2760j02936
9020a35696b6364j10547A07482O0247b47381a03968k6654G4403h3948q0236b0255
$$ plain form
9102 -108643 162278 19212 -217740 -339479 -215510 -200462 -297557 -125211 -200366 -99224 -54664
9091 -54664 19481 -58772 -124450 -238399 -24317 -7924 37008 -164729 -26539 -183301 71095
9079 -169790 -262630 -158986 -173916 74839 -67255 119722 -10190 -7012 -272367 -121216 356593
9067 -48522 -127861 40610 -150827 77665 -39847 5460 -210119 109714 -81966 -267133 -43142
9055 -361387 -328 -450076 -272030 -24580 -133342 77000 167755 -325505 121978 -506373 53083
9043 -260684 57277 134039 -318308 31286 -12490 -85723 -146492 84706 -62193 -39398 313174
9031 -39480 -162068 -52901 81865 -170297 -230546 239759 -16446 -126456 34860 -32760 -135696
9020 -135696 -26364 -136911 107482 167729 -247381 -103968 -130622 74403 -83948 -164184 -20255
9008i747j77189H8401a51111F8006b71038o7396j05324A53484b86388G0273L5451
8997A05724b0620k34022g4392A14684m8957c88186a58739G7896K8555r326P1642
8986A68767b24646I1445B396c4555A53270a30284N0002m0622n4780I5388J16567
8975B11955f6719k29102A23896b72215e892A41737b27137r1254a4431n0202b4560
8963C8245M4275i7369A95765d8779A30034l0123O5077h9861A39672a56021B31686
8951A61224c15180r1719c5154q803k22109J24520A9718a16844l2778A89998a74478
8939b8969E7997O3485d74687a8750j49294J0016j7773B76936c4946k37628B07251
8927B1459g8258j17057Q8977A35972K60680P77827J270873I09367G5400J88392
$$ plain form
9008 -9747 -186936 88401 -151111 68006 -271038 -338434 -443758 153484 -286388 70273 105724
8997 105724 -20620 -254642 -74392 114684 65727 -388186 -158739 77896 106451 97125 168767
8986 168767 -224646 91445 2396 -34555 153270 -130284 -80282 -120904 -175684 95388 211955
8975 211955 -66719 -295821 123896 -272215 -5892 141737 -227137 -318391 -14431 -64633 -24560
8963 38245 82520 -97369 195765 -48779 130034 99911 164988 -89861 139672 -156021 231686
8951 161224 -315180 -406899 -35154 -43957 -266066 -141546 19718 -116844 -149622 189998 -174478
8939 -28969 57997 121482 -474687 -18750 -168044 -158028 -175801 276936 -34946 -272574 207251
8927 21459 -78258 -195315 -106338 135972 396652 1174479 2445352 909367 75400 263792
8917B63792M683f4767i73j4542j37544l2437d6473A31442A7599b23529C3661b04027
8904b37266h9745L5159A98819Q2535F5266c45772d8834G7209b15324C9353b88292
8892a42872j27163h9148A49787c34352E6130d9221j44930B08575B6110b5142j58948
8881a84090B94723o9887a83692e9048j73569e6924E8986b7646m2828k72666A2372
8869b79794G1035K76388c01943A6127b3633n8060r4338G7551d36957a27065B9834
$$ plain form
8917 263792 268475 -64767 -973 -15515 -153059 -185496 -46473 131442 17599 -223529 33661 -204027
8904 -237266 -89745 -54586 198819 281354 65266 -345772 -48834 77209 -215324 39353 -288292
8892 -142872 -270035 -89148 149787 -334352 56130 -49221 -194151 208575 26110 -25142 -184090
8881 -184090 294723 224836 -183692 -59048 -232617 -56924 58986 -27646 -70474 -343140 12372
8869 -279794 71035 347423 -301943 16127 -23633 -81693 -176031 77551 -436957 -127065 29834
$$ [...]
##END NTUPLES=NMR SPECTRUM
##END=
