
##TITLE=AC1400_DOM12184_7525329_u6JawmxKED
##JCAMPDX= 6.0         $$ Bruker NMR JCAMP-DX V2.0
##DATA TYPE= NMR SPECTRUM
##DATA CLASS= NTUPLES
##ORIGIN= BRUKER
##OWNER= Administrator
$$ 1.72 TOPSPIN		Version 2.1
$$ 2013-02-20 00:05:44.447 -0500  Administrator@X
$$ Compression mode = diff/dup
##.OBSERVE FREQUENCY= 400.02188249412
##.OBSERVE NUCLEUS= ^1H
##.ACQUISITION MODE= SIMULTANEOUS (DQD)
##.ACQUISITION SCHEME= undefined
##.AVERAGES= 8
##.DIGITISER RES= 22
##SPECTROMETER/DATA SYSTEM= spect
##.PULSE SEQUENCE= zg30
##.SOLVENT NAME= COFFEE_meoh
##.SHIFT REFERENCE= INTERNAL, COFFEE_meoh, 1, 14.98509
##AUDIT TRAIL= $$ (NUMBER, WHEN, WHO, WHERE, PROCESS, VERSION, WHAT)
$$ ##TITLE= Audit trail, TOPSPIN		Version 2.1
$$ ##JCAMPDX= 5.01
$$ ##ORIGIN= Bruker BioSpin GmbH
$$ ##OWNER= Administrator
$$ $$ E:\/data/COFFEE/nmr/AC1400_DOM12184_7525329_u6JawmxKED/10/pdata/1/auditp.txt
$$ ##AUDIT TRAIL=  $$ (NUMBER, WHEN, WHO, WHERE, PROCESS, VERSION, WHAT)
(   1,<2013-02-20 00:05:36.228 -0500>,<Administrator>,<X>,<go>,<TOPSPIN 2.1>,
      <created by zg
	started at 2013-02-20 00:04:29.930 -0500,
	POWCHK enabled, PULCHK disabled,
       configuration hash MD5:
       86 BA 57 50 F2 9D 5C 9B 26 00 A9 28 5F 66 2E 89
       data hash MD5: 64K
       C6 84 65 06 48 EA 4A DE AC 9A 39 8B 51 25 17 62>)
(   2,<2013-02-20 00:05:39.369 -0500>,<Administrator>,<X>,<proc1d>,<TOPSPIN 2.1>,
      <Start of raw data processing
       efp LB = 0 FT_mod = 6 PKNL = 1 PHC0 = 0 PHC1 = 0 SI = 32K 
       data hash MD5: 32K
       1B 7B 8E 5A E6 88 7A 73 22 A2 11 51 81 25 88 D9>)
(   3,<2013-02-20 00:05:39.838 -0500>,<Administrator>,<X>,<proc1d>,<TOPSPIN 2.1>,
      <pk PHC0 = 72.01538 PHC1 = 0 
       data hash MD5: 32K
       FC 33 82 64 6F A9 BF 0C DF 90 98 09 A8 D9 A0 D8>)
(   4,<2013-02-20 00:05:40.056 -0500>,<Administrator>,<X>,<proc1d>,<TOPSPIN 2.1>,
      <abs ABSG = 1 
       data hash MD5: 32K
       2E B6 34 3C FB F8 8B 3D 06 92 0A AF CD 7D 00 BA>)
(   5,<2013-02-20 00:05:40.228 -0500>,<Administrator>,<X>,<proc1d>,<TOPSPIN 2.1>,
      <abs ABSG = 2 
       data hash MD5: 32K
       BD C6 3B F5 9D 4E 9E 1D 64 5F 51 1F A7 3B 80 2D>)
(   6,<2013-02-20 00:05:40.369 -0500>,<Administrator>,<X>,<proc1d>,<TOPSPIN 2.1>,
      <abs ABSG = 3 
       data hash MD5: 32K
       C2 AE 6D D6 2F 98 9F A3 DC 8E EF 3C 1C B7 8A 8B>)
(   7,<2013-02-20 00:05:40.494 -0500>,<Administrator>,<X>,<proc1d>,<TOPSPIN 2.1>,
      <abs ABSG = 4 
       data hash MD5: 32K
       8F 0F 2A FE 6C 2E 93 73 A8 43 22 C4 61 0E FE 96>)
(   8,<2013-02-20 00:05:40.697 -0500>,<Administrator>,<X>,<proc1d>,<TOPSPIN 2.1>,
      <abs ABSG = 5 
       data hash MD5: 32K
       CC D1 FD DF A6 E0 A7 3E A0 CA 3F 17 24 52 DA C8>)
$$ ##END=
$$ 
$$ $$ hash MD5
$$ $$ B1 E4 68 7A 0A DA D6 4B A9 3B B8 07 6F AE 1F 5E
##$RELAX= 
##$RELAX= 
##$RELAX= 
##$RELAX= 
##$RELAX= 
##$RELAX= 
##$RELAX= 
$$ Bruker specific parameters
$$ --------------------------
##$DU= <E:\>
##$EXPNO= 10
##$NAME= <AC1400_DOM12184_7525329_u6JawmxKED>
$$ [...]
150 150 150 150 150 150 150 150
##$TP07= 0
##$TPNAME0= <>
##$TPNAME1= <>
##$TPNAME2= <>
##$TPNAME3= <>
##$TPNAME4= <>
##$TPNAME5= <>
##$TPNAME6= <>
##$TPNAME7= <>
##$TPOAL= (0..7)
0.5 0.5 0.5 0.5 0.5 0.5 0.5 0.5
##$TPOFFS= (0..7)
0 0 0 0 0 0 0 0
##$TUNHIN= 0
##$TUNHOUT= 0
##$TUNXOUT= 0
##$USERA1= <user>
##$USERA2= <user>
##$USERA3= <user>
##$USERA4= <user>
##$USERA5= <user>
##$V9= 5
##$VALIST= <valist>
##$VCLIST= <CCCCCCCCCCCCCCC>
##$VD= 0
##$VDLIST= <DDDDDDDDDDDDDDD>
##$VPLIST= <PPPPPPPPPPPPPPP>
##$VTLIST= <TTTTTTTTTTTTTTT>
##$WBST= 1024
##$WBSW= 4
##$XGAIN= (0..3)
0 0 0 0
##$XL= 0
##$YL= 0
##$YMAX_a= 517350
##$YMIN_a= -514006
##$ZGOPTNS= <>
##$ZL1= 120
##$ZL2= 120
##$ZL3= 120
##$ZL4= 120
##$ABSF1= 14.98509
##$ABSF2= -5.573092
##$ABSG= 5
##$ABSL= 3
##$ALPHA= 0
##$AQORDER= 0
##$ASSFAC= 0
##$ASSFACI= 0
##$ASSFACX= 0
##$ASSWID= 0
##$AUNMP= <proc_prof1d_extract_pilot.lims>
##$AXLEFT= 0
##$AXNAME= <>
##$AXNUC= <1H>
##$AXRIGHT= 0
##$AXTYPE= 0
##$AXUNIT= <>
##$AZFE= 0.1
##$AZFW= 0.1
##$BCFW= 0
##$BC_mod= 0
##$BYTORDP= 0
##$COROFFS= 0
##$CY= 15
##$DATMOD= 1
##$DC= 0
##$DFILT= <>
##$DTYPP= 0
##$F1P= 0
##$F2P= 0
##$FCOR= 0.5
##$FTSIZE= 32768
##$FT_mod= 6
##$GAMMA= 0
##$GB= 0
##$INTBC= 1
##$INTSCL= 1
##$ISEN= 128
##$LB= 0
##$LEV0= 0
##$LPBIN= 0
##$MAXI= 10000
##$MC2= 0
##$MEAN= 0
##$ME_mod= 0
##$MI= 0
##$NCOEF= 0
##$NC_proc= -8
##$NLEV= 6
##$NOISF1= 0
##$NOISF2= 0
##$NSP= 0
##$NTH_PI= 0
##$NZP= 0
##$OFFSET= 14.98509
##$PC= 1
##$PHC0= 72.01538
##$PHC1= 0
##$PH_mod= 1
##$PKNL= yes
##$PPARMOD= 0
##$PPDIAG= 0
##$PPIPTYP= 0
##$PPMPNUM= 2147483647
##$PPRESOL= 1
##$PSCAL= 4
##$PSIGN= 0
##$PYNMP= <proc.py>
##$REVERSE= no
##$SF= 400.02
##$SI= 32768
##$SIGF1= 0
##$SIGF2= 0
##$SINO= 400
##$SIOLD= 32768
##$SPECTYP= <>
##$SREGLST= <1H.CDCl3>
##$SSB= 0
##$STSI= 32768
##$STSR= 0
##$SW_p= 8223.68421052631
##$SYMM= 0
##$S_DEV= 0
##$TDeff= 65536
##$TDoff= 0
##$TI= <>
##$TILT= no
##$TM1= 0
##$TM2= 0
##$TOPLEV= 0
##$USERP1= <user>
##$USERP2= <user>
##$USERP3= <user>
##$USERP4= <user>
##$USERP5= <user>
##$WDW= 1
##$XDIM= 32768
##$YMAX_p= 456479377
##$YMIN_p= -754734
##$CURPLOT= <Network HP LaserJet P1505>
##$CURPRIN= <$Network HP LaserJet P1505>
##$DFORMAT= <normdp>
##$LAYOUT= <+/1D_H.xwp>
##$LFORMAT= <normlp>
##$PFORMAT= <normpl>
##$SURQMSG= 1
$$ End of Bruker specific parameters
$$ ---------------------------------
##NTUPLES= NMR SPECTRUM
##VAR_NAME=  FREQUENCY,     SPECTRUM/REAL,   SPECTRUM/IMAG
##SYMBOL=    X,             R,               I
##VAR_TYPE=  INDEPENDENT,   DEPENDENT,       DEPENDENT
##VAR_FORM=  AFFN,          ASDF,            ASDF
##VAR_DIM=   32768,         32768,           32768
##UNITS=     HZ,            ARBITRARY UNITS, ARBITRARY UNITS
##FACTOR=    0.250966925370066, 1,           1
##FIRST=     8223.43324360094, 62944,        -152411
##LAST=      0,             22930,           -211741
##MIN=       0,             -754734,         0
##MAX=       8223.43324360094, 456479377,    0
$$ Real data points
##PAGE= N=1
##DATA TABLE= (X++(R..R)), XYDATA
$$ [...]
23861 188622 239568 1802 2063 149638 81048 157956 36481 -131611 -74071 -300274 136583
23849 -107541 17880 -53643 -38692 -287979 10357 48525 104671 53529 217190 -97292 82351
23837 -110496 206431 -207531 -228650 304964 59512 169638 121667 50577 -153928 -196965
23827 -196965 -269679 -114550 -133958 28062 -271243 -190081 -11889 -58204 -46713 47884 -7058
23815 -227007 8637 44140 -98800 -124196 36546 -75442 -28911 81948 -184285 151542 268470
23804 268470 301020 -231428 -56645 6265 67326 -45302 -55824 56269 -92207 89434 -69658
23792 -332614 -119881 -214650 -329897 -296086 -24195 78995 -138343 147034 -342740 -92831
23781 -262194 -120470 62270 70937 -83335 2837 -260217 524044 141587 -79025 71979 -47497
23769 65470 -141310 -146934 51440 -125658 -199272 -38211 96456 176341 -188205 39246 17727
23757 147047 130610 157633 -3773 -254961 107002 -148014 206300 -244917 -112202 -97306
23747 -97306 -68054 229412 -152565 -44094 29306 -80452 130532 208409 -22215 239692 -120867
23735 -99302 161719 -7887 -154456 -202745 -37073 -423007 93754 43932 -15521 51563 68352
23724 68352 214048 -224795 -281712 -204622 -354632 -371970 -163713 -173608 -32188 140469 -99829
23712 259005 -87944 155871 -163774 -368381 7505 118304 -40772 195247 -66239 68695 52319
23701 52319 -52285 -309372 563675 -99781 7110 165514 -62399 194925 -199412 99217 120815
23690 120815 -52420 225175 -43626 -124429 209562 47032 160812 248851 116979 48144 -37257
23678 -70256 -311438 252317 146354 117484 -280509 -173504 78795 10372 -178076 -244833
23668 -244833 -290436 -383294 -26235 294079 47268 -373379 138079 57785 53845 -53704 -84655
23657 -84655 -8919 -129271 130199 3852 104204 15385 131315 38461 215869 100730 -146887
23645 -447791 116222 -239221 165651 -126541 -29777 -90537 -53837 -193123 5904 -160156
23634 -30106 -159562 -264455 -439180 38248 -108244 -53038 24909 -382541 -119250 -387185
23624 -387185 23196 -144646 -139141 -84935 155468 -251688 -17818 30677 10216 133710 -121636
23612 -226764 152290 199952 263323 86489 -224618 61046 125236 97595 -267895 142364 17473
23600 11456 298177 -115705 -205175 7153 -34392 -56110 -225242 -112638 95168 228790 -305018
23588 -86676 54829 -169653 -263756 108180 164522 10246 337210 129107 -127929 84308 -61066
23576 -20528 292125 -315 -85073 144911 3007 87978 -289355 197205 -145573 -17651 -123124
23565 -123124 -17899 106303 185482 -4959 -164351 117453 177646 96733 -70706 -19054 -316705
23554 -316705 -132610 -395738 -77906 232674 61450 157612 161143 -481250 1418 -64787 -28703
23542 182272 247616 -278550 -50573 -8145 -162725 77041 -319832 -16517 54777 -38329 48056
23530 -193216 -94172 148372 354816 42655 -51749 -55618 -122877 -45769 129938 -40258 134482
23518 181357 54521 32665 -63708 13014 274998 87137 -135715 -125152 33019 26069 -292758
23506 -181960 145620 2101 21782 -29142 112932 25473 -139289 331226 175693 -110445
23495 -127801 -221121 -219914 -119159 67555 -38875 8612 -266673 -28515 119652 -20406 -184833
23484 -184833 68384 36667 61499 4442 -35468 224494 155514 178737 68551 -128307 -337282
23473 -337282 33097 -8880 1958 -139897 26422 32284 -104479 11506 -379846 199780 -71873
23461 -108960 41853 206729 53341 -43715 3116 9002 -159882 298697 -372968 -127160 -255573
23450 -255573 -72954 -70901 97139 -35120 -48514 168281 107280 -287262 55104 56926 -482703
23438 428145 311796 -94179 91606 -363360 66129 255455 -85710 55972 -83078 228733 90690
23426 72738 -64984 53375 -21941 -256736 -88340 -60466 100374 189529 -17011 -239272 -121291
23415 -121291 -30567 214935 -301235 198493 -52346 -21272 11038 123538 221156 -79681 -16687
23403 114096 230503 4794 168122 -160491 -225091 -127996 267931 57727 104526 224926 433325
23392 433325 -47571 59636 -143494 212211 -72639 180090 -97050 -1497 -67494 200600 63313
23380 -164542 -10563 36821 75262 88450 -51829 -190072 -84886 -72874 13145 -41975 118395
23368 -67888 -97823 133241 78473 -71737 99301 57735 125284 120868 -114775 34255 33516 -182516
23355 139321 69786 43921 -100485 30432 -86350 -210416 -213856 79268 -563608 -66568 -251186
23344 -251186 -100781 -36078 43879 -165126 -247494 -80915 -304759 -252506 -631941 -37640 238167
23332 -107632 68313 -71831 149353 54906 -115638 -35040 133907 -171078 -15353 307747
23321 -236136 -216028 64031 3667 -104001 179031 -47537 127989 112064 -318747 107185 -402991
23309 -345960 -242355 -314802 -13509 -84041 -26818 -129113 2798 143464 -246529 25180 -89888
23297 -4570 -204510 -10979 141164 312829 -417004 -218804 -225713 263044 248372 -99165 110202
23285 156510 69730 -202314 1977 20740 90231 409008 30390 -142836 -106310 -65111 51155
23273 -199931 -159481 -213860 -109749 33572 232162 -244741 -206434 -130046 61066 102617 102733
23262 102733 261893 120853 -135361 -189133 224735 -164403 -73205 -3684 69238 -109250
23251 -139758 -101453 234828 -315990 -113015 151453 -331790 -41367 -150701 -66988 25618
23240 -90077 34623 -156518 41341 158861 -89191 -122513 252134 -24049 -347539 -161804 -159818
23229 -159818 224464 -175619 -161632 194094 -68209 75436 454167 -90913 -151738 85317 -340766
23217 -7062 78455 -14924 132653 -87183 236858 -1356 146023 -243543 171087 -75424 -396241
23206 -396241 114592 -109484 100596 -378544 116037 -161698 111731 -137430 -41757 105158
23195 449739 -90330 -57325 20096 199417 -223162 -114129 -14900 -78644 -6729 -144867 -149107
23184 -149107 -13037 -127906 -106811 -247165 199833 47227 -92856 -130480 -289769 131634
23173 -20823 132709 -89769 230702 130940 147195 -24436 -153182 64090 71484 58339 154682
23162 154682 -29701 35506 -225775 -52341 -369131 -266267 47039 -37465 -56400 53246 -329279
23150 -297555 247075 -235848 -165367 221706 -117604 -130502 -20225 -115458 -80383 -52967 -151268
23139 -151268 -226649 -360027 217298 117249 10567 57134 122501 179028 142247 -2125 -14492
23128 -14492 51919 77599 -223993 50729 13547 -174565 55264 -160148 -186297 60138 -138874
23116 264421 -14729 -74353 -23622 -219088 -240596 141989 -15512 -194403 -159988 -160233 138293
23104 19127 259531 -36741 255343 368430 -58264 -240230 5459 139371 234661 -151233 19089
23092 -95045 86868 216503 587906 -142272 124733 -64298 15648 179488 -75497 -345841
23082 -345841 -178657 -161494 -90077 294032 225357 -138299 239490 -148999 -23746 51343
23071 45807 194927 123879 197597 -216553 -153181 70961 24242 -91826 -179146 92280 497869
23060 497869 17327 262836 -53908 180922 -101424 80541 12035 -80412 -80839 221709 -92857
23048 -256708 -112115 265208 126075 128619 -7735 304744 -3009 40351 16435 147418 -82211
23036 -118297 -112927 -16528 -269196 41155 388210 135974 -241711 -153284 -138444 122820 -101590
23024 -34230 128945 -171111 -129177 31237 44801 -18050 -293905 27719 101162 -65760 -199260
23013 -199260 289933 223247 268960 -66670 76010 61086 -11746 95326 1097 81253 24429
23001 -38533 -160375 -274257 264960 -201723 -83325 25251 28749 -143236 41212 -29347 -260709
22990 -260709 193576 -149958 -231538 77541 35094 -213005 -61115 38484 28916 230690 15268
22978 -132600 35858 -130114 -64876 -98259 -142615 -88325 -300779 -267639 -150882 36110 -138355
22966 -119600 -182471 143768 197512 -326342 -10718 -221850 -54693 -226489 31285 -230302
22955 -44582 -66846 6143 -257129 -78100 -153490 297658 73926 107754 -91526 36135 -80891
22943 -88814 -35645 84965 204008 -238095 128675 84686 24693 205936 336893 138773
22932 89966 -81382 -441742 -26801 -86780 -198920 76900 -144142 34450 -81435 107632 -75867
22920 11942 50924 -158645 40703 56703 13649 -31721 -146579 163993 -42376 -95573 -121064
22909 -121064 178692 -211695 292826 -126694 -59980 -165350 -33414 -23175 -82112 92612
22898 -136753 146332 7214 139026 -311403 -104668 -67332 -201566 -271455 -257009 -137550
22888 -137550 -93834 -119378 -31329 180459 -287166 189090 -241043 -6686 -116857 49987 -274418
22876 -136883 10196 -28497 30983 -220486 -135060 -152514 56787 129775 -278800 14274 -39686
22864 -54635 12725 13200 82371 -78182 -303829 -148715 13306 -47397 51787 188393 -204397
22852 93100 -59259 -380878 120806 -280582 179 -6352 -117855 56056 -222762 173872 -165099
22840 -23448 31173 211617 310963 163907 -90383 -22410 -187723 -184220 -25635 -73985 74360
22828 41380 36879 -160910 -236628 -169727 111473 -120619 144904 -329997 -89947 187608 -122531
22816 130628 -122835 81858 -81334 121013 -420326 -4289 -63655 -365969 98716 -268374 192359
22804 33354 12823 99238 153651 267867 -130644 120104 76435 139308 -12337 -113007 -96418
22793 -96418 5949 -86716 39614 -9929 211629 -114492 12926 3097 28740 11592 -259620 241852
22780 260477 -124431 354989 250007 138603 237216 -121427 -9225 99012 -151029 138769
22769 -200930 -162493 -393836 -108083 -43990 -148941 -211364 120944 65733 16942 -167876
22758 -202859 237144 242897 -46557 -102488 29666 -72948 260306 111671 -10849 -225437 104503
22746 -146318 -94966 -39447 25260 -343980 -57737 76040 2393 -67223 -260261 83027 70982
22735 70982 -109809 -69111 89758 -185518 -298405 -134254 162518 -42480 71822 231048
22725 231048 -345827 193268 43191 117392 -160284 -67694 -36991 -152873 -370935 113377
22714 -186801 4633 14224 -6813 259894 -139096 45982 18471 -60367 145892 -263460 -215665
22703 -215665 16492 -276307 -477383 -298088 -52605 -259017 -6744 -299884 -224318 -82239 -160000
22692 -160000 -196093 -266085 -30531 -22011 -24825 -100236 134290 -23832 -268504 -187306 -76646
22680 -71397 -114539 206196 -291578 79033 -195722 -202378 267289 -157582 -52184 -85251 95894
22668 -407540 368459 14001 235542 201317 256652 -5452 -181808 198481 -59848 -312618 233884
22656 214824 105405 -97333 118529 186198 -175304 -49864 102750 7295 -390271 277447
22645 32728 -194576 89528 -16156 -138808 89507 -112973 234293 -55442 -124767 -15080 -13678
22634 -13678 -205075 -161788 -204353 -222400 -77256 -29569 147917 139737 347983 -312278 -45231
22622 -18696 -93960 -175257 -165362 -195542 28496 187239 -186065 205370 42635 121167 -76758
22610 -134157 144654 -135508 37436 -58018 183262 -218415 -29893 9011 90483 -174243 -140384
22599 -140384 21463 6094 -149977 -86480 18077 34468 248787 199634 -61086 177837 156076
22588 156076 -177413 202995 39921 -200279 323690 63688 -337208 -119004 248386 -192808
22577 176257 -79787 5743 124455 -74939 -111130 92386 44408 28464 -252963 -169590 63565
22565 139829 -331770 30568 70339 -177202 -155709 -31174 -118414 -243707 130852 -281584
22554 -223375 30052 72987 147753 -9695 -49280 -131875 -98756 -196268 127647 -225668 -207412
22543 -207412 -45428 240390 149126 -517252 -249158 -24590 -392238 -102772 -76297 -380088
22533 -380088 -284328 68821 -17566 -2455 20697 167653 -283304 -45342 -41264 -107031 15058
22521 98579 230078 -256863 243807 -277473 -104053 100015 -153690 92793 -40045 -234461
22511 -234461 -152827 93131 -236609 -10874 -17894 -120599 -184900 31367 68783 184425 -85367
22499 365970 167255 81016 -273634 -65361 -457335 -244623 211816 80863 -114045 -48303
22488 -298560 66279 -301868 19507 69615 -57200 -151196 -111552 -8473 -119548 35706 -79695
22476 39714 131174 -123878 -457249 -113540 51937 151394 -249426 -197787 176811 248359 212120
22465 212120 146229 -217808 -224293 154897 -158400 289665 -64242 201153 50039 -9634 282404
22453 73535 -291426 -246233 -24089 257611 279049 -167950 17065 335763 71332 -266738 -161543
22442 -161543 72040 -145049 156338 120747 -97789 313553 -327059 -157116 60664 -87177
22431 106620 -14686 -8103 -58795 -45263 175270 78823 130084 -420037 186265 -31062 75607
22419 -114688 -139063 27523 -256453 136845 102728 371606 -45353 -288107 -43041 218757
22408 -75055 -178972 81756 2063 -157899 -336871 -136977 -89221 41678 -121433 -229422 47484
22396 92759 157353 -29469 65203 -104968 61546 78465 123241 -231234 -38293 -479767 272461
22384 116060 -272970 233865 42394 -36941 25012 -53454 -17525 -25057 -70404 -186156 -34932
22372 -161172 -84925 242442 -76770 -6454 -442067 -111722 81740 -23173 -7139 -209247 179965
22360 350653 86587 -105463 -317122 136799 -210961 123260 177413 -119560 108997 -40041
22349 49970 258739 109211 -89791 -32155 -239668 52104 -76224 11185 -77801 -25547 -49823
22338 -49823 -321539 -6530 142214 -18725 95432 -52868 153080 -7949 24394 135366 21622
22326 20933 -18548 60441 -242476 216499 -347794 -75118 -331158 -147681 -88443 209984
22315 216578 -6395 -9855 -340680 -61891 -157650 -73108 -225934 13185 365518 20493 83909
22304 83909 110239 1979 -189681 -154924 26348 -198499 15975 -73842 -145480 245231 -150191
22292 -241288 85107 124448 -57304 60802 -77471 205330 -147076 185004 -182232 29844 104723
22281 104723 -278774 -113985 -19493 -143480 -97194 167917 -11092 -106601 -137579 -114386 -97991
22270 -97991 50146 1000 397942 141730 15353 -283539 145861 -141865 -229462 -298729 63723
22258 255733 -68187 308841 -99304 92496 3753 -144882 150711 -269008 -165710 -54226 -117823
22247 -117823 -190353 -292784 38502 352960 -264550 -540468 -176519 224929 180389 119113
22237 119113 -25340 -277667 66010 38611 212335 -114094 -12818 -589549 -118488 73201
22226 -73360 -393715 -121360 218150 -413095 7574 -170839 78037 -25555 -27890 -148306 -150540
22215 -150540 57477 -111518 -101891 -182636 150176 -28763 -73167 -9341 -35341 116149 20946
22203 -162153 223210 -305108 76959 -186004 18276 -113748 -13404 58809 -286181 124729
22192 -266583 -11695 112015 4158 -36396 132479 -1291 121803 128334 129306 -267220 79566 -195955
22179 125976 -175721 164304 172222 127584 1277 -73534 -373262 -70049 164173 -50216 36083
22167 -118734 -125735 194991 -426644 -119300 185861 59181 -416269 19844 10775 -92911 -246195
22156 -246195 137580 -35990 -186086 274678 -175333 53218 -248068 5429 32157 77340 51692
22145 51692 -198266 -184046 79504 -39120 -116236 5642 -58520 -32158 -24779 -91976 -268028 3203
22132 154431 -252993 213752 -48514 -256515 188451 412412 -259002 45897 -113100 -40450
22121 264407 23916 -31492 136806 244770 -188360 68827 76469 -186224 51424 -17239 -17408
22110 -17408 -133080 74771 -74834 120003 40242 -76408 168585 149236 173776 -229265 35702
22098 -258783 -112264 -34137 61039 -8288 -12099 44383 255609 -330556 93563 -38647 -195573
22087 -195573 -80186 98234 -36674 -79437 -22599 63616 -157060 62586 -189740 40152 -21163
22075 191205 -33079 -6222 -396430 -12009 -272045 -16935 69320 -116070 -186948 161175 -106789
22063 -169906 -297887 304870 -36831 5299 85495 -114766 57726 9617 -208093 183604 -350629
22051 -11888 -473560 -85696 -221234 6150 -134850 74635 -53470 -226703 -259952 -269238 -240812
22040 -240812 -276511 -87866 6721 128359 -78772 8271 -11414 209497 79602 157019 -51749
22028 -170224 52805 159570 -236417 145369 170667 15652 -39981 -105529 95474 -185896 -107901
22017 -107901 -169178 174159 501231 71064 -92368 143912 -369948 -139753 264719 -39656
22006 125125 50027 -200607 -281555 -160999 -227451 -333983 -116240 -191598 -317467 300077
21995 150490 67158 82072 -151391 -211674 -186824 24392 59064 270814 -168351 -310082 214075
21983 -160367 33920 -161036 254359 -123942 -248837 29949 -45870 -59150 -37552 -51822 -142897
21972 -142897 -212908 323104 -134497 332249 41569 -970 -274768 -66326 -99133 -116351 -120902
21961 -120902 -170348 354183 -8592 -31476 -96567 -198738 -20175 15726 -129154 -240382 -170958
21950 -170958 -147224 -94935 -33536 206904 93193 -284138 -72985 418937 183742 231941 73560
21938 -167366 162379 274052 -55990 1097 -202004 288002 -216619 290191 -136056 68694
21927 -113362 129127 -73712 -56123 163200 -228595 -124715 -367159 116035 -181922 -239865
21917 -239865 1188 57797 46324 -246400 55531 -173286 415333 113577 -70591 -12770 407577
21905 -344277 30355 133982 -149901 101681 29680 57745 35096 -8894 722 -16584 68535
21893 17417 -145974 282481 -163201 6685 -119764 81924 97078 -209267 -197748 50534 -24929
21881 -67328 -139683 -106043 -116734 93058 39527 -225653 -246755 -293615 115503 205058 -236508
21869 -393925 -173962 -42558 48645 123832 -40925 -493560 -25728 -184059 -209325 -754734 16947
21857 320826 73514 -119910 -224852 25299 269989 -213992 117085 92822 -237262 -258557
21847 -258557 -117260 112726 -63369 -5334 -119624 -167215 -41144 -30876 51772 -117714 -76313
21836 -76313 84527 -31903 -52956 -171103 22140 -286100 -337303 22153 -69962 9469 11472 39128
21824 39128 257849 -55148 115639 123064 -110815 57418 -281697 75658 -41687 -8727 120750
21812 -151118 4440 -36259 -220642 -55112 -446255 55474 165491 102490 20263 2666 120756
21801 120756 -70582 423546 159973 -117410 135258 -102026 81739 41452 105616 186255
21791 186255 7573 -136097 -578147 -24896 249995 140536 -1182 216716 -21453 23699 -343010
21779 168394 1540 124029 -258897 -96850 -110109 -1660 173365 -383968 -101467 -290130 -33789
21767 -44225 49273 -160276 84164 237518 -145519 152290 -28024 20171 197304 -84769 -24463
21755 -21215 13669 11281 63631 -147755 -34554 -361271 63270 67264 234779 -81153 126680
21743 144999 68909 179313 -151990 224307 -231650 -66773 -389832 228781 74325 -228209
21732 -170100 -245814 -1801 87523 44002 6798 161728 133345 -184571 -272344 -95264 345888
21720 122156 202367 143962 66947 60929 -149127 -53243 -161768 -4073 -119689 71572 -81970
21708 -52930 122616 60745 -79250 -249005 206116 -135893 -498006 -295300 -115301 -4837
21697 261267 -183070 -81450 -365004 -43385 -143117 107689 175836 -162251 -1745 123416 71540
21686 71540 92969 -114776 -5827 223443 12192 -243377 123605 65990 -226723 122434 -52137
21674 -48567 -329100 -204855 -166543 -56362 -10135 241247 -183486 53876 59500 329124 -174000
21662 86395 20799 -586124 2853 -99465 -73937 230561 -12780 -253827 87909 61500 1451
21650 -81413 -444096 -69636 -209884 172558 25897 -44428 283269 27502 -141178 -185852 98711
21638 229753 39455 -40897 74119 -167423 39682 -170851 53170 -135131 179765 -370884
21627 -171077 -126959 -218208 -3062 -61573 355276 158924 286846 -328752 -157984 -62075 -128183
21616 -128183 -318810 148586 -12227 -81771 -245611 133128 59783 -31449 -15625 -144575
21606 -144575 -282948 -145849 -92569 -261484 119402 35901 -53198 -328703 -201057 11057
21595 27534 -193146 -103801 161228 -52589 -207330 -1150 -235287 -292051 113969 218764 165946
21584 165946 56306 -234349 158370 -252399 -40439 17212 126005 -295793 188746 -90553
21573 -8438 -300306 -192843 -74790 -177012 -163878 -57954 -75088 -169842 -22119 3077 -30946
21561 -31383 -156490 199315 277463 173594 -74010 -346314 292053 40583 -57828 55813 -240079
21549 162652 -153714 -95016 -214978 -489107 -362841 -40513 -206220 -1121 4267 106814 -12314
21537 218116 5435 -147559 -35702 -144313 -147265 15766 -134940 5960 256512 203995 95741
21525 -192251 228232 -54864 -64192 -334983 93468 295109 -59432 5754 335323 -79026 -99009
21514 -99009 -46849 -97580 -123118 120099 63825 132532 -63959 -252636 -96847 152111 105964
21503 105964 -517449 43164 93586 -19488 -175526 -2447 88729 89693 -319534 -247739 -12873
21491 -222907 92412 -85620 20220 18406 -366596 -144245 -235550 117453 40255 -75698 86394
21479 -78313 -131883 -277189 -16937 150991 -8956 43151 -103912 -143539 166673 -8359 -24762
21468 -24762 28351 38969 50999 50102 26287 -169902 -15240 286730 -362686 -110956 65171
21456 109888 49392 49499 -56394 -178388 -217029 -123356 -196351 159202 -116150 -120895 -77899
21445 -77899 -267811 141891 26962 -160945 6481 -40060 29228 282402 147193 234456 225251
21434 225251 87897 415620 226391 143637 -250008 -42000 -142194 -33996 99094 79801 116270
21423 116270 -6452 -78625 23545 199990 169226 146034 -97264 -56608 282408 -314178 -126940
21411 -83940 -25670 -76147 161039 -206757 135054 -23844 4486 -188404 -254418 -153780 -11451
21399 220415 -288857 -154785 -210248 142505 101856 169433 -68711 25079 -46519 -27286 280938
21387 -34070 -134211 -3730 258768 -14203 -251607 -103466 97649 -89601 -104772 -95541 193676
21375 49489 -153750 -207186 226609 -297527 113277 -16938 -495961 -76628 -290832 -948 -127575
21364 -127575 -170489 -36269 -93226 -196470 -131233 59004 -186987 46454 63660 -68280 74296
21352 27946 -157976 61011 -14695 -88771 -49137 219675 8639 60017 99355 5426 171010
21341 171010 293295 -124729 43544 220877 -30796 -225927 81186 -140617 263604 -275800
21330 110956 -23300 -226318 129411 -96681 -4657 -14334 -190179 -138260 -202044 230034 -240867
21318 46563 -67669 148856 -397307 -184741 95348 61114 -40600 -171563 214745 -130165
21307 -147061 -246013 9513 -294538 -228798 -212194 -66464 -136882 -102879 -142121 -267598 -41238
21295 -433273 111331 105845 -52474 -121121 -134601 -183156 -141077 117164 -16023 29192 82270
21284 82270 -113875 120698 248478 -15828 -89291 -47869 -146615 102353 -134242 -119039 281149
21272 190200 -53191 196113 -117623 27494 19852 190009 77322 9119 -88480 -70429 -222912
21261 -222912 112911 77836 68668 180410 183781 19461 -78138 -45443 -87041 -145991 -245695
21250 -245695 127111 -79320 -166629 225063 52207 -531306 -137311 -421695 59217 -206842
21239 -73721 53183 -89177 17565 -61213 -284970 -156079 -185839 103455 -5792 50068 -90581
21227 -72197 26674 -190133 185277 -124198 -5523 -227150 -231717 -265896 -170952 -188653 373808
21215 -29433 -96886 -97215 -224455 -56992 -240163 -126068 27468 274033 -80707 -182908 386488
21203 -108097 17358 82426 10515 -241444 -67667 51695 54947 -37217 -81370 5542 31783 63056
21191 63056 -161894 39711 -195618 -256904 -35850 -371892 -367329 -47589 -10287 14897 111713
21180 111713 -421057 -41916 -318022 -82757 -46898 30647 244569 23273 -389429 -187889
21169 -248256 90045 139161 -109061 -90513 142830 -416415 -197776 103208 -20632 -37075
21159 -37075 -201269 -264295 -54761 29535 -191552 -153958 -223837 103412 -229918 -15096 88098
21147 316743 -287154 122448 -42968 85113 75424 -46773 -62499 200092 202950 11031 95191
21136 95191 48374 -38238 -215243 -512057 307875 -22665 -814 -187564 243648 49826 1323
21124 -139202 -235494 17194 112848 -154400 17377 -201066 -90752 178328 -126012 88193 -28321
21112 48863 -279427 196826 150011 40641 61085 83156 80848 -80746 49894 117889 166108
21101 166108 -140440 137261 33336 -169680 -53559 485458 -31814 -69458 365399 27257
21090 -291471 -152601 -82866 15238 -366697 -65497 -112546 -242874 -25542 -297409 -106896
21079 -318670 -23205 29448 -36381 -38383 25058 -74399 -424664 -69899 96733 -546714 -190377
21067 -491662 -99799 220100 -37748 254000 270738 -200768 -196285 97007 -82831 -123896 -113600
21056 -113600 -72388 -142100 -196134 -147929 -76508 -127481 -90183 -1370 -80941 38589 -106198
21044 -54171 7711 -88183 -141299 -141257 5540 -17514 29276 -152152 16600 -151030 263703 44297
21031 -325714 -18208 33698 -241029 186469 237735 -156620 -31952 -51718 64025 157696 65107
21019 25183 73392 235488 -239703 107195 -195915 -151871 -315459 53913 57093 -15519 53811
21007 143744 -195728 30353 -364336 -41101 171031 60816 -121916 -160262 -75373 -129551 337354
20995 155037 -119717 127671 66941 211863 -274647 294207 160228 -49141 50570 -194454
20984 279886 107056 103502 184472 33546 170147 -28205 -40731 -61113 153414 199406 -13809
20972 -288694 -256566 -100176 -104246 70432 -61480 -119887 168826 -68100 51142 -125298 -211895
20961 -211895 49966 -151602 145179 -9744 103352 89370 -102502 63477 67286 -318946 41186
20949 95681 129605 -183077 -240954 118057 51218 -234245 -79258 63912 220305 137694 -442737
20937 79151 -6708 -348110 -112416 239211 121735 -396514 159236 -384384 -149753 24553
20926 -307688 -392498 -106571 -124386 -46061 -346562 -16576 -21458 83831 89584 -274646 10440
20914 -395139 54620 -23788 -176698 -386612 6352 -178581 -71801 20734 -40484 -285091 -179575
20903 -179575 -85666 278128 -296686 -123445 -116622 395924 -855 33592 -73781 -196570 -522434
20892 -522434 -247691 -288769 7329 -121868 205140 14980 -236724 172325 -15493 -288675
20882 -288675 -378457 -387643 -264919 114959 -670738 93758 -63581 -215869 8532 209939 137246
20871 137246 -185309 32273 -42252 -257675 256418 91384 -55824 324736 112067 -163616
20860 140254 -68472 157730 -185517 -380710 -34456 125050 -175367 -175685 -238923 87831 -172309
20848 -324514 46539 -321447 -209480 -187053 -87863 -393881 83938 -63979 69283 -292026 -187048
20837 -187048 48029 -134509 -29494 -231769 -6131 194949 101938 -254752 -410836 229513
20826 122156 -26311 11944 -233218 -216417 -102467 -10692 -188261 -317588 -313723 12441 141883
20815 141883 292252 -73883 19783 1555 121244 -83963 -227752 -157109 52235 -103866 -19339
20803 -150924 -7791 -142928 -135802 -68047 -3500 2503 -179431 115579 -184944 184043 126976
20792 126976 -212884 -407962 -275428 15597 -104406 464135 -412986 -200929 71857 108541
20782 108541 73290 148106 -449957 -404349 -106783 -34142 -129080 -42264 116344 42798 -34460
20770 125712 -408926 -326969 390747 -129404 -26394 42756 -239842 -265184 92644 -59778 -69027
20759 -69027 -494106 53051 -109704 137255 148291 -28900 -174069 -141476 109522 -340687
20748 -268026 -539469 -99297 -31606 122583 283267 111523 12771 -66639 -142359 -264224
20738 -264224 -196352 60508 203732 73190 -77218 140928 -59860 -284968 -25350 -276485 8608
20726 317470 130747 -11334 -26480 -241039 19159 86563 164306 -279056 -199375 -228459 -194753
20715 -194753 -49376 178538 -52578 138151 433415 115012 26449 38557 -147428 75261
20704 -114436 -227864 -4702 -69386 294570 270781 25652 43265 -178734 -62222 -259013 86652
20692 -72555 235107 178668 5529 -169645 -816 -83270 -279477 77350 -329319 43290 -25309
20680 -361885 -254307 97788 105634 -67872 -50647 82386 214316 65207 -156218 27017 -294278
20668 -172406 -161305 45385 -279730 -354772 -119346 -368513 -54841 -53233 247294 238063 -147322
20656 -251780 -4603 -13470 53273 -276685 -280027 -249241 -164295 -74003 -48955 -45717 -93812 148125
20643 42410 -274586 -53975 -55871 10824 45829 38666 -13033 -155194 138396 59562 -234971
20631 49143 -218915 -567871 -178296 69826 -198774 182540 36312 22421 46014 -294203
20620 -217018 -170708 -247650 -169065 -353336 -137818 -149883 -130800 160321 42303 169879 -130145
20608 -114089 -94167 178792 -415203 227758 98714 -156306 -53853 -142997 -43891 130715
20597 156401 -42416 -94815 71877 -34388 -134801 -76091 -430200 -274736 -14177 218008 165656
20586 165656 -174155 157939 112124 418677 102216 120664 -105207 -85077 -132102 262930
20575 102850 -144792 -39981 -278920 -126422 215058 -23163 129220 17041 -64296 43934
20564 27074 -161743 141758 14554 119084 -419655 -74680 -101040 46430 -129274 -84252 -116657
20553 -116657 85981 -22901 -268616 74550 -440602 115892 278295 -45380 112849 24589
20542 -166 -13849 30920 -105310 -161100 17601 414030 -10635 195852 58844 -102978 59390
20530 139627 -203738 -295929 247007 -152554 347383 -162781 28286 68963 -173501 163833
20519 -165520 43343 -88446 -156253 -184845 -54761 131071 -106435 -195989 -316636 171126 4359
20507 -194031 -137745 -109748 263493 -135646 -403891 -10004 -160152 -111274 -62579 189882
20496 76454 -85197 22627 -112675 -174401 -149956 -172390 -74602 157483 101009 -55439 158618
20484 -120790 -148605 -216551 412700 279832 87598 -141296 -192541 -61351 -207365 60609 20270
20472 -68717 51265 -164308 -202905 162882 21644 120068 -119477 -277054 -41787 -20406 -155047
20461 -155047 -108823 49660 -385135 59249 252001 24965 -115212 -247989 195038 94607
20450 -19265 2197 -303248 -92023 -263289 -26135 45219 -187008 -122452 -177135 117482 -180982
20438 110232 281829 -187828 -157115 -58669 -29676 -56411 -198180 -118782 9406 -81866 282243
20426 -279519 -59344 -203568 -323383 -45647 -241537 -152627 -79310 129151 -25857 -71418 -228985
20415 -228985 -334630 83002 179875 -160264 -285099 89991 -63558 -325929 146204 11405
20404 -400079 -135247 55399 -183321 -159794 196058 272737 -64064 -344668 -249284 -223561 21827
20392 16865 -185133 -102702 -97751 -208639 69090 89843 -222222 -184104 -12910 -218795 -136422
20381 -136422 40539 -91261 50162 255116 -87918 256660 -66227 -136491 -57579 199217 218856
20370 218856 189750 124676 28527 94257 -82396 -39846 -107361 51317 -142729 -134101 -34284
20358 -152972 49181 211093 218019 -54168 -322677 -260114 -275919 90755 -172414 -23209 -50709
20347 -50709 -75668 -20167 -138964 -65768 108129 -128493 -175139 -106622 -17174 -8067 36685
20335 121613 -372111 -25019 -265298 -160796 36204 66027 -135726 -193063 -227549 -179056 144180
20323 44870 60881 -70206 -43142 111039 186976 -2155 -13076 57218 364309 290698 -70905
20311 -228376 -91818 -154497 -280670 180421 -375786 -33141 -118754 -321528 -109447 208848
20300 -212439 301447 51238 172096 -50948 85892 -630422 -197713 -11705 -60251 22394 -58454
20288 206462 -282625 204548 157404 158191 -235110 -127843 -9187 -120489 -90574 -18141 225474
20276 -181494 -75306 -173302 35054 -71000 -168314 101753 196568 -163135 234563 -274832 113705
20264 196237 -95797 12780 4479 117693 86 -111725 235504 -19035 -94593 142389 184287
20253 184287 -145998 48763 -35237 15249 -286203 -399836 -49673 -37553 -108732 -191963 -387305
20242 -387305 117875 183505 -1715 -137747 -352436 -402060 -140393 75280 -48353 121748 -121114
20230 139331 -520461 79732 -263265 184558 74634 -11490 -42127 105900 246889 -268439
20219 -426028 38083 141450 -243049 -122306 165326 106038 -36311 35774 -239376 233151
20208 5104 -398172 -300038 107907 -68916 -38238 -141604 -322321 -63250 -500450 43140 -137787
20196 212403 185038 -131214 9134 132319 89134 -158614 47319 -297987 -71274 237253 102653
20184 30432 406915 -44548 85361 143385 -147947 38997 -154432 -64119 -445994 -18612 -283114
20173 -283114 -116145 42627 -103052 209395 -54497 290216 -100360 84182 -70509 -377837
20163 -377837 -102152 -69791 10231 -99781 -135570 -43180 135407 -97957 -163872 66189 -452448
20151 29059 26656 185692 -153553 -251453 -413180 -160962 130831 143448 239362 -292289 -472809
20140 -472809 14078 -137710 -57580 -94593 -37953 -197464 92269 -133538 -200914 -216541 -20369
20128 225569 168815 -99311 -4884 -164619 -71204 126669 -166103 40931 109126 -355992 179034
20116 150658 49848 63448 163255 -400632 -15359 -202439 -67369 135374 -215948 33199 -252445
20104 -120828 163396 27522 37323 -171946 119806 1948 -153142 -238550 -391453 -55901 77898
20092 -153812 -120422 -27230 251473 -63519 -32834 -252954 192144 -3880 229546 237821 -139534
20080 -233122 44940 304976 212508 -66549 -379446 30817 -157541 -195985 -197204 -357571 107840
20068 -388431 -293499 39870 239038 -123451 210559 -113018 177898 142846 -225867 -214168
20058 -214168 -321051 -149136 -74400 -198225 -5198 58033 141462 95703 6686 209462 -91620
20046 -77952 46252 83691 -150337 -216501 -136238 187068 -127749 100650 106358 -116878 -187639
20035 -187639 -28864 -296806 71187 -114944 238309 10820 -122016 -59842 -50347 -237816 -122150
20024 -122150 30116 -151390 -135630 94646 -133327 -119519 -143902 -56426 153139 -164259 -39969
20012 48319 30284 -170779 -183087 -298882 -30271 239647 47292 -207803 -292937 -192565 -85581
20000 161632 -386550 -303358 -132707 -345351 12014 -50305 -178170 109706 114935 -8409 -267659
19989 -267659 157106 171395 -54231 107698 44581 121689 223500 -357654 -17684 -275460
19979 -275460 -319338 -288859 120428 86183 -143388 158624 -9198 -366224 69024 -182404 37262
19967 -31358 90922 -236419 -78412 -210008 -222693 -86456 -144059 -80609 37557 -7675 132258
19955 45864 -72393 -168187 87932 -157675 -162785 88676 -212568 283976 -38064 113777 -110755
19943 157375 -251058 92020 -55089 -37286 67194 -287688 179931 28346 -271415 49812 38798
19932 38798 77132 172184 143260 -140152 221618 6869 -80045 59132 -90050 22657 -282522
19920 63963 40130 -14383 -29489 -16371 -188760 -18037 -261447 -7517 31748 178814 -122942
19908 -112187 -31933 -143414 -78570 17536 82164 -374516 -108843 -108475 -113625 140334 163721
19897 163721 137665 120098 -135203 -146958 -62426 -156002 4978 -229853 189250 -60619 434883
19885 -179333 -149282 28845 43951 -26718 45989 2551 -167743 -151665 -44434 -136761 268798
19873 -165378 -57078 61776 281039 -90277 72544 -154114 -317771 133871 -352617 -11994
19862 13872 -134845 -18103 -186638 -180287 196066 136358 -226480 37044 -63535 24402 -326484
19850 -509219 -295910 -62870 -59811 153705 74991 -11553 106043 -77403 2990 193473 236606
19839 236606 -120145 47999 -137238 -56093 -184111 -204852 245641 -276864 85014 51711
19829 51711 -116027 83272 96367 -319662 161618 -41355 61634 -69344 53271 -50588 299386
19817 -221955 268014 -44531 17949 -346690 -189508 -78110 66597 -12299 102436 -185581
19806 63306 -164180 -105742 -347525 -60365 347951 -153134 -323686 -46539 -275081 -27452
19795 -242236 -316929 -68572 88464 -45921 -241309 -365386 -110105 68344 -23270 -263577 27285
19783 42959 -76305 14702 -459192 -836 272148 -17366 244760 -273438 -255907 7837 86655
19772 86655 -32712 -95542 107747 -88472 -387089 -43870 8268 -66433 -74238 -262774 -247949
19761 -247949 -190512 -320739 92614 133240 -308699 -114946 -49362 200316 -110190 141864
19750 -244050 -356236 -316571 171214 -395363 -133227 140408 -219781 -141054 -43125 56061
19739 -32126 132978 -7443 52850 171205 1621 -64712 155306 -143947 -240482 -904 126982
19727 -144374 -157320 -140232 172911 -6316 -178728 143585 -243824 -95710 -183332 113832 -38982
19715 97578 -115905 41124 -12819 -57721 10714 130897 -54230 -59322 13637 -191189 -52694
19703 144734 195987 -23804 -275949 -287129 -11918 65670 153951 -90634 203983 -258453 -88570
19691 -186124 146214 -28410 -359415 -350747 18912 -70959 -22182 159773 284581 13447 -117624
19679 -81673 -194154 -246196 -120426 -340272 112959 -335424 -12900 -244143 -164080 60691
19668 -121480 -186092 -106709 -222447 218253 54163 9873 91751 188506 -56036 155838 -19103
19656 262289 -210355 -55235 -312744 134118 -142321 233311 165345 -247443 -15478 -48853
19646 -48853 202882 -223732 -204926 -100344 -123998 102876 3552 -183553 -19794 206389 -80930
19634 -7786 -243571 -160013 -36957 -193740 145370 4077 -235266 100131 -88444 -109774 2916
19622 7985 105059 -39142 -94015 -35521 -273555 79144 137219 -425149 -32003 -368990 -165461
19610 -37148 -105391 152258 -64655 91805 -253738 22102 -241944 12510 129063 -174238 -212587
19599 -212587 26009 -208215 127542 -153774 -77695 -385175 -131901 104207 -51651 -127777
19589 -127777 -132903 233645 -137061 153567 50540 -213302 -29491 -108910 -236359 -205278 201607
19577 150236 31689 94276 -167631 -115148 -122743 -529253 -43459 -73893 -164281 -95404 107694
19565 -47160 -314323 -83006 -182162 137820 266981 -243254 -172499 -23345 -269948 13981 129661
19554 129661 -136429 -5885 60027 94807 -19438 40037 119885 6636 -223821 -75453 105772
19542 161052 21453 -527 -142215 -81069 -232592 70438 -24899 -216127 290348 -154535 -81719
19531 -81719 -45936 -123298 -75558 -291511 -16564 106746 -520004 -5214 -13787 -216844 -138711
19520 -138711 119837 -200082 82637 139904 -83445 50032 -65334 -193119 -32830 -413094 136324
19508 210769 50513 -100202 -67980 31915 -241451 -157122 -61147 3447 -251818 -183907 213000
19496 -268431 -132015 -262731 -359465 -181750 -158499 -56648 -158526 -47338 -322358 -393079
19486 -393079 217149 -117340 -376064 50996 -13693 251751 -218180 -79769 -301027 -36523
19475 111214 -26175 -139136 17230 110144 -298572 -166903 176035 243985 -344357 -167577
19464 -119076 100016 29413 83265 -134588 194672 112561 -75781 139861 254493 -31226
19453 -187563 -74680 106168 30781 -2828 -68967 337812 -31485 10096 -13469 -37535 8115
19441 223856 85438 -161779 5068 -14234 -176508 -14462 -63688 -418240 -33849 282333 113071
19429 -178106 126655 -96215 -194639 -92142 -130259 -151871 46201 5157 -29280 -121079 -299779
19418 -299779 -90438 -118427 -371265 178465 136148 -104470 -375746 -25670 -208807 -199597 138296
19406 -76195 251578 -262463 -178187 171684 -114427 -259963 -167910 -335658 -193083 -140535
19396 -140535 -1434 -91464 -161639 -176035 -138096 62598 -52631 -11417 7340 -16378 126293 152825
19384 152825 -56581 -66106 -69454 15561 -84457 62834 -200892 -165883 335088 71565 -17767
19372 -187051 -282821 224225 -214934 -20363 -57585 -59237 -318929 171300 -115418 -301594
19362 -301594 101064 -87786 -111094 -41861 -135965 -25283 -398114 -182145 134855 108017 118180
19351 118180 29010 -4214 31330 -112390 31202 -322360 -63569 -238743 -83412 313784 -132538
19339 162916 181862 -326023 15387 -9353 -272722 -330349 -88186 -42322 -38083 -152962 141809
19327 61836 -194748 36429 -40229 138322 -12502 -323174 -233729 436105 194951 66255 -287512
19315 122873 -38157 102409 26035 175649 -460054 -22373 96821 -176636 -94332 202852
19304 -201999 -137003 -115864 -275152 -93496 -146277 -67760 255908 73140 79861 -85900 -61268
19293 -61268 -292336 -65047 150118 33773 -10829 239479 -274461 198960 -467772 -167447
19282 -214183 -314327 -143528 -282613 -474663 -328804 39504 -357410 167902 -36267 -34662
19272 -34662 -96823 -34207 -101332 -305092 -11998 -14976 54219 -299477 -220612 166116 -176138
19260 -158559 257426 -165738 -298424 -139319 -266685 -137467 -19722 -440582 89317 50263
19250 50263 1664 -57761 266504 60243 -89082 -73161 -220886 -373009 -201724 -166395 -61746
19238 -5225 46303 -22440 203059 -302243 -228892 -102940 -3672 -12678 -437027 32223 96643
19227 96643 1615 -143604 218889 -102923 240631 -119003 -24782 -45260 -327792 69637 -154726
19215 -177927 -40436 158279 -183576 7269 -20710 -1861 -137657 -40408 -129319 -180431 -19252
19203 82204 -327680 -795 107249 -122168 35178 -166520 208812 -187136 -129225 -51658 -130654
19192 -130654 43458 -56729 -34938 -148955 144012 -68710 225139 -117872 -94182 -315051
19182 -315051 83381 92172 114231 -106697 62756 -104216 159262 144207 55251 -289306 35769
19170 107003 -161884 144394 126763 -127908 -35817 -221350 -311212 -111986 -179983 -188046 354252
19158 -230566 196772 87331 95443 -292352 13332 -198726 -157162 -35215 -55009 -179073 41754
19146 -258601 -165481 95369 145662 244042 -163271 639 45410 -389960 8250 -205439 214944
19134 -141511 -218102 -103821 -161398 -228715 325224 -180697 -165611 -334717 98374 -129507
19123 152245 -53421 314892 -218852 20363 40766 -30273 -132193 15349 -70079 -132492 -233654
19112 -233654 177147 -111890 35101 200932 57471 -339298 -87378 57763 -117623 40193
19101 66102 5932 126151 212017 -92831 47066 277924 -608234 -132771 -37733 -90798 -1462
19089 19254 74360 111458 -172635 78013 -42771 -488 -54558 -56266 58756 -201287 141012 -65545
19076 -231970 -170838 -427064 486863 -204788 -323636 -21310 -35609 135419 191062 -174309
19065 -204937 -364200 -24510 24417 563307 -113962 -299616 76407 -72969 -75581 -410602 10519
19053 187446 94024 -188230 -248105 -66144 54049 81570 -19203 -210582 122412 -167558 -501792
19042 -501792 -59724 -132224 -37587 -91180 -341935 -228676 179008 400842 -176905 165700
19031 -219285 40842 215558 -40882 -5002 91172 146730 19005 -41199 169164 -96745 -117450
19020 -117450 201578 47315 -302156 145567 -201972 182711 -195336 -151409 -25532 -290511
19010 -290511 -18575 -280651 -298671 -26873 68207 92308 -116300 136475 -200129 -73525 -119593
18999 -119593 -306010 -38724 51091 -184247 -43220 -95446 -40198 146076 92258 -91397 -51088
18988 -51088 -209188 183327 194773 296133 -505390 59225 -169527 -56546 -57618 -95513 -72942
18977 -72942 182248 215263 -21622 -150926 35251 85713 -154783 238974 112111 -147229
18966 -193119 -89357 -46095 58817 -333651 -298008 181900 -395135 148919 -214247 1237 -39051
18954 -302860 -126681 79579 -103165 84017 208800 31491 422807 119437 137301 116341
18944 116341 -271861 -22724 412127 123225 19855 -85429 72270 -102295 154729 54168
18933 123645 -26676 176891 -70050 122871 -39383 -34073 -86032 -47787 159466 175888 99147
18922 99147 -254672 44450 -21384 -214132 -224821 -74194 4762 -222116 -452380 -226782 -156721
18911 -156721 -7439 242365 142626 -31056 -321873 -119908 193543 299571 -136596 -49158
18900 27532 -195617 161103 51107 161186 48136 37891 16514 -219932 -120121 -84805 27486
18888 -84782 -257568 147167 5385 2371 -270622 102935 208559 49155 -54696 -166150 166022
18876 -217754 184428 52244 -37369 -334686 -186765 -94901 69362 144720 18057 -641997 124609
18864 178224 -69851 343917 -135701 -159664 -11919 -235445 217289 -93103 -216257 50340
18853 -234633 -326387 -34186 -152862 -67401 -28257 170432 33494 106100 55023 -184228 241011
18841 -283751 119402 -38003 59645 -133573 157673 70655 110768 52222 -61393 1215 -25952
18829 -234243 71606 -120470 345869 -70785 -408864 -180249 14673 -153726 -102591 -151975
18819 -151975 106125 98869 -53560 33644 273721 86685 142960 -257348 -60167 -48093 129444
18807 225509 -101034 111093 109000 -162934 -68914 -145066 230911 -252972 -45702 -110430 -309037
18796 -309037 23667 35675 131964 -56726 172183 11610 78062 -224336 -170116 164823 12822
18784 -121172 32035 118776 -270834 160433 -366995 -497657 -113792 -107567 -126795 -204193 -425633
18773 -425633 -35015 7126 -146325 106531 -54204 -62183 327138 172032 59184 -18685 -370031
18762 -370031 -175605 -53792 -125342 -42874 -148314 200205 153474 133259 299243 -275377
18751 -65708 209229 4095 88040 -176760 -72098 -278330 -269046 30275 -306789 108626 -143178
18739 -71522 -137089 256492 -75909 119793 -246784 -188651 -209189 -296749 -205112 58768 78076
18728 78076 -42279 -242850 -141018 -105591 441930 -203432 394335 -46118 -159940 35687
18717 -78910 -52331 9030 249560 -94450 -149893 45704 66866 -184219 146448 -59710 47689
18705 -173218 -197357 -154082 -114719 225 -45294 -145165 47581 116124 180764 -163799 236788
18693 -13285 -135978 -138464 -117049 -270083 -382886 -203012 179139 -283195 237700 -94425
18682 316262 -46852 -106774 -53451 36290 68194 -69816 -162817 -172927 119948 -93094 -89353
18671 -89353 -177849 -345399 354552 -27220 -110458 -306686 88919 293574 58134 40521 -41668
18659 -145930 86304 -468466 -267502 -23896 95358 -348257 -51536 -83356 -115818 -54032 -137613
18648 -137613 -128314 -179873 361153 -126906 58221 17792 40612 15193 174237 -29562 37902
18636 90543 137718 -196556 95475 -56545 7949 -185895 1245 4002 50203 189339 76989 -53871
18623 115590 50127 105400 16747 -48253 -268687 -163462 236144 -123990 -88639 -58542 124054
18611 -173387 -248731 29 -23120 51596 148563 101090 -160482 134447 190224 -117414 -391892
18600 -391892 121659 -219046 -89824 -146729 -148852 -193738 -464733 -67322 -26428 110790 -89714
18588 -148914 -86865 317291 170857 -134145 279620 -227019 -119653 55923 -127419 -174572
18578 -174572 248537 12067 109728 87926 -37070 -18373 -92632 -34199 -149483 -228554 -102168
18566 -316545 -176247 -40894 38308 -80775 -574354 176845 9499 47458 230438 -350774 -44345
18554 -25256 -229092 4038 -156146 60737 -100132 -117618 -301781 -1426 44927 -43372 -86352
18543 -86352 -132619 219625 -242030 -415317 -48593 53872 -183476 91358 -251227 212571
18532 -156632 -88172 11613 196846 -318551 53941 154026 31617 180107 -242333 2831 212478
18521 212478 -283482 122517 -103520 -120697 2612 151303 -14896 -231105 -213397 140459
18510 283366 -66770 135116 98213 -193653 170158 -48640 -153477 -317102 56462 -1600 -79952
18499 -79952 -124447 -17121 -179179 -261803 -55148 -339714 -99454 -210493 -13775 181769 34174
18487 -5507 -49706 183836 18672 19414 -114865 110542 -21503 -50415 100780 -313369 -85995
18475 34071 -13164 135966 -127279 -37407 -265469 101869 -58108 -36382 -4315 -205678 182315
18463 -133481 -289414 99126 66285 143186 202637 -212783 8558 90000 -7232 -116096 53724
18451 -15867 -39882 -34031 -85834 -154091 -343590 -143731 65178 -283728 -37945 -71280 254696
18439 -224077 264559 224043 -131679 167873 -55879 -105982 227676 -169074 -80507 103602
18428 -141027 -198925 92127 -10426 -309098 29999 15913 -83883 -311374 88282 200357 -12471
18416 -446531 -84050 -140364 -261073 154164 -27190 66763 -207164 -68992 113179 132817 178225
18405 178225 -86746 31479 -88732 -60733 -111515 -375290 25968 4994 151837 264275 -86804
18393 -133081 148245 -303963 -112990 -75092 -201413 28828 179155 -476674 -16529 103241
18382 -46169 -244479 -204189 -41348 131380 -21464 157724 195168 -39397 -6694 222595 -65855
18370 67862 48050 -147333 -99842 -156963 354981 90781 -23047 264238 -25387 -73253 91964
18358 -57504 114463 -195479 296744 -221437 217958 -14156 -63640 -169386 -31169 -43515
18348 -43515 -40057 -64896 -126271 284846 -165547 -289353 167034 -95314 -260334 20588 176350
18337 176350 243550 143327 -71183 159040 121460 168108 -170189 -205931 110534 -333980
18326 -41333 274382 -191821 -17553 -60412 267498 111592 195281 -143791 -103493 -172892 -274375
18315 -274375 1261 75310 -101806 -94859 72353 -196123 -158943 253241 -113245 -339204 -62891
18303 -443984 -417807 -214541 144271 -142497 -248979 -184971 -191746 -119787 -119334 10543 -99539
18291 -255061 -214955 -36693 39677 -258021 307718 -78287 -102107 -75903 -159531 -270042 -458470
18280 -458470 -131607 -229168 -77391 -11508 -71672 69803 243032 140109 -54316 67093 -488352
18268 -343975 86831 -52235 47181 -153900 -250962 -72758 194545 12757 213241 83671 177770
18257 177770 -115143 -15973 354159 207477 -299426 -61035 145449 -222228 -155369 -41420
18246 -79867 288647 -103228 -46867 -271359 -136210 -179668 202220 -49593 -304105 42464
18235 -36660 -160164 140807 -54566 -56264 -254642 245679 205624 -167773 -439680 241276
18224 -54214 14418 -17529 106774 -88447 -211431 -157159 140920 157248 -70382 -200815 76557
18212 138116 -137581 23614 197775 -26370 -86936 -285712 365192 -128679 93885 78324
18202 78324 -162852 -46520 -124919 206924 -35346 -135716 -259288 -305351 -129083 -164673 -41310
18190 50675 -174351 -454656 221043 -73932 -140179 -6959 96850 6589 -164463 -285408 -80214
18178 25238 111177 140027 -250340 18780 -99552 266882 -31173 90300 -265518 253557 -78500
18166 -159540 243913 -262936 -146376 1964 -3994 167696 -206099 -65004 16636 14603 -168939
18154 86349 -140773 -146899 49123 -449694 -70759 4958 -36847 31092 16807 35413 262767
18143 262767 115596 -161958 -177396 -283434 -147377 28584 5842 -52216 101849 -39453 -308482
18132 -308482 128235 34808 -45725 60879 -129471 -20428 -125706 -125214 -73895 -233582 -2991
18120 176735 102620 68065 -47021 -111469 -242916 -66450 154045 -34316 88911 36656 -25059
18108 -214471 123294 -291993 -189835 -375385 99360 252595 82635 -172034 111177 -115586
18097 -48951 -460518 103234 -321128 24669 -35754 98069 -309822 -291500 -157366 -5524 -248630
18086 -248630 1414 -93121 -160173 -102769 104227 46731 -135606 53944 -97381 114511 -137401
18074 605 -276133 96146 -39844 -267010 -129695 -4208 181065 -17933 71175 110503 -64838
18062 229102 -46194 -151514 132045 -228495 -179975 -347424 -16834 -235607 98432 -227571
18051 -130379 85793 -15472 69877 -87689 345880 -188901 154672 42632 -53237 -52437 63977
18039 -304941 98542 -111519 -73985 61964 90910 -8642 -196120 50022 49553 21498 -29092 96855
18026 295243 196794 76528 -90999 -12122 26988 73785 90650 -47735 175269 86880 -104739
18014 -56575 -28668 24111 -55512 -94407 -181247 63227 -32470 -54975 10595 -14045 -205628
18003 -205628 171265 41815 -167712 -143313 144341 38525 249645 138422 13063 -108335
17992 351363 41229 -169305 201338 -27159 -149892 18412 39635 73597 39886 42238 -14117
17980 -91555 76070 -80406 -29729 68419 221443 101969 158096 -129527 -31201 -58618 40892
17968 157750 -54339 -52121 -133038 -239755 128511 18943 -308639 233428 -137492 110125
17957 -79399 -109105 -70157 -438539 -18879 319492 253717 135907 -60917 204424 -433042 -54901
17945 -310311 -111787 -192099 -111312 188251 47103 -96787 -139967 -70319 18652 -51019 -31631
17934 -31631 169399 -235528 273397 82304 122783 88506 289150 131986 -161122 17939
17923 112139 -102996 -140369 -184795 -134556 -266735 5788 -122208 -191921 261907 -127899 -283902
17912 -283902 -49252 -318744 -173403 201844 -182722 5699 151217 158320 33384 -70565 5328
17900 -223639 -39471 90560 -20366 -117476 -55685 -63644 -31851 307291 -55831 170481 17798
17888 -14855 169068 -86104 38 -18161 -261967 154502 -133236 169819 184508 149016 -201415
17876 97564 208446 -277607 -75728 -191309 202111 -66856 141119 -86766 -156042 233664
17865 163212 80934 -141656 -132379 324694 238545 451861 -72646 -233087 -222953 20893 242197
17854 242197 -309392 -33135 -16840 -184542 304691 -156842 -31896 -132828 -17065 85103
17843 -264196 -138345 23894 -396378 70819 79531 10365 206272 45658 -305387 492573 98657
17831 -48962 -436066 -150739 -216048 68479 631 119295 -135700 -33686 -153504 -12994 -185629
17820 -185629 247288 -111042 45928 234626 52073 -30595 -303113 54309 -108793 -262997
17810 -262997 -36361 -261089 156737 -155174 -124830 -17765 -43870 8426 -67451 -49673 96269
17798 49179 71156 -164432 -36960 -57974 -136534 -116048 -13603 116994 283827 -31519 122397
17786 -297559 -78877 162388 -12419 265314 91915 -230436 -197916 149806 107501 -126475
17775 -284101 222482 -71786 -246714 173595 121688 -214689 92085 -22271 395135 -340630
17764 -37222 -246498 202606 -18366 -26291 174863 -29721 74656 23768 184788 -335106 -47441
17752 190285 59428 249125 -371342 133027 -192878 66460 -399925 284980 -391951 241241
17741 -415534 230687 25875 91613 42504 -163726 116885 73822 -36245 -132932 139656 -194594
17729 204206 1746 183299 -44804 195210 -54225 28320 259197 104550 -63132 232729 255571
17718 255571 129277 129539 -97339 31239 220276 -3900 -162187 -231111 -25364 139348 65160
17706 -119974 -35931 332650 -305595 239381 -306092 305664 13831 8842 70143 -233463
17695 -69257 -250005 262278 258937 65658 -51086 85212 -64675 267894 -199616 28668 -39207
17683 -98149 -25204 44634 -139436 -285395 -377518 169974 202677 -141815 241896 -219349
17672 -199636 254925 27283 -236887 227101 82699 -183054 -11851 -202566 190581 193738
17662 193738 226323 58110 -28569 409671 -214329 -166430 426566 -338 139034 149453 89094
17651 89094 209057 -260512 124357 190686 -5399 -16080 -321392 99894 57748 282074 -151465
17639 -90951 42664 -80493 301071 -77287 68660 174558 -51988 233177 239074 61515 -129776
17627 107815 9482 -211738 -5153 -280739 154003 231925 -62896 -85994 46720 207998 -101072
17615 67566 -142870 -200733 101733 7338 -27718 45931 -251550 144747 170495 -190842 -65142
17603 -79657 -34035 73328 -71155 -127009 -114026 42044 60478 338062 3065 -144010 236125
17591 -214832 241914 65525 -13216 -155950 253954 -231412 79744 -280343 -175597 -107121
17581 -107121 15322 -3511 99279 10122 -126744 97642 -146786 49305 -158407 14885 14895 15951
17569 15951 8355 -161590 180749 -154449 5366 -128996 38160 -342446 -20444 -39629 93626
17557 101353 251780 -115070 171747 98769 10697 135274 -94656 130117 234077 267851
17547 267851 95195 138815 -53192 503286 -174832 -147434 -247893 177437 465102 29489
17536 -201401 90010 57962 96351 245634 232239 121175 125931 -29974 -125158 2362 139802
17525 139802 -116665 180097 139934 247611 46965 34147 -85919 -119651 -101477 -265186 -176816
17514 -176816 38750 -211317 174272 284992 -93829 -96432 43210 137509 -243437 89656 206510
17503 206510 -199065 33600 -183464 -143615 103450 107491 81077 138129 136336 11021 213333
17492 213333 177602 271263 106015 -223172 199447 305167 -132846 250693 -81809 24053
17481 185702 -17554 -76623 109579 335507 -18085 28071 -340153 236091 134223 533382
17471 533382 375279 -33379 184173 218940 -136345 83318 -102767 129222 32661 167856
17461 167856 -38457 343723 421663 146675 -157164 -11609 165907 -140056 134891 138176
17451 138176 205437 180989 6766 302481 172070 34811 41778 186991 200245 -247968 4269
17439 -47855 147133 161374 406351 224132 -50544 59298 267358 82101 320643 239525 477854
17428 477854 121095 -54371 242739 227049 244780 -53722 27094 -14719 150055 29708 193485
17417 193485 11938 322419 349302 136785 284964 98132 212676 115523 182071 151726 -99697
17405 -104365 188102 -44245 427527 305790 -200286 312734 29600 121665 114583 277207
17395 277207 131743 -144488 -80376 -58118 187861 324643 41379 20750 246517 46205
17384 164661 154937 207406 -192026 -115531 -325346 200854 203323 237958 201517 135513 142773
17373 142773 144356 139788 153931 -30296 144298 41194 154906 -100924 61433 105887 155174
17362 155174 93930 187755 675522 -170612 292716 179707 226862 164957 297395 53077
17351 -14043 157441 181411 -205261 159776 544873 64998 -203081 -19951 -50076 390872
17340 241131 114555 73236 17675 88394 14514 214823 -129809 -20730 279947 -172714
17329 298835 133085 384505 439654 256304 428640 115776 121746 284173 -34680 29020
17318 254986 180358 14821 -27277 314473 -43073 -7994 60034 128018 167494 34948 186170
17307 186170 58034 318793 49419 34519 102183 -90257 254232 84303 278960 -151725 48970
17295 -45583 213664 139854 110159 -83693 97692 -38245 32406 3492 -265800 294027 168001
17284 168001 89992 154115 109199 163378 214318 18207 -129841 87328 653387 121169 197333
17273 197333 264934 115031 131371 128332 85788 47939 -647039 246727 43072 196160 44835
17261 38210 324301 248406 294191 219082 287549 403945 138429 136024 130234 -44070 298392
17249 328945 669463 370048 216686 1853 269850 322648 331169 -41690 92005 241433 88255
17237 171831 271641 -57883 -20284 -102512 263753 273558 -76784 354947 417479 201313 145118
17226 145118 -14523 115183 250544 155866 346867 -44487 144726 294623 -11493 166435
17215 271443 527373 486510 -126937 44807 300376 -195614 287160 -102244 430583 -35285
17204 123339 310756 113578 222389 81832 209733 380373 -7609 145518 -49520 194534
17193 313222 -57341 406642 249750 434362 320974 364306 45929 -88381 110174 352806
17183 352806 290773 221056 133937 288167 364739 396714 62227 331656 418915 288116 413855
17172 413855 128264 414588 -285137 161647 84179 192745 714672 290502 43181 179084
17162 179084 284913 183060 125541 16598 69822 353438 -96810 31660 467010 150719
17151 499665 149094 93384 317581 52510 162427 236754 88002 207505 86467 199090
17141 199090 18670 411933 540463 239436 229725 359303 469453 487134 390689 477890 89252
17129 344452 153795 534568 297450 268981 658126 514238 463075 -12969 119640 500393
17119 500393 -96230 140219 215980 307030 142488 6431 -193758 187315 -107082 404474
17108 242490 215035 75020 344911 310998 71181 435958 378788 203575 483796 447740 310379
17097 310379 455387 182089 32604 393484 491381 165375 480593 406943 632976 736713
17087 736713 359551 124569 21915 -142719 548883 733251 557806 328316 794370 44305
17076 335891 506059 424992 328865 -158628 324676 553380 292642 399869 478462 88750
17065 201214 216080 580441 290714 673683 124887 428668 335753 366406 810712 287098
17054 530887 362640 475264 539516 494408 456309 262663 263893 306410 440373 205900 652446
17043 652446 419386 457741 350929 584502 669144 584142 230025 770394 543516 585229
17033 585229 281308 430374 751203 432527 680613 420947 374029 583102 541877 613439
17023 613439 726190 770756 567333 713550 232732 355845 616222 243794 578979 902276
17013 902276 315735 614502 500567 685618 893074 420354 368256 771220 651238 654448
17003 654448 799549 773616 718323 736504 797450 640257 541490 657776 643408 644641 661478
16992 661478 576549 373603 699728 604354 575027 602575 628775 894941 636401 834094
16982 834094 431199 607922 816301 829725 715762 948898 605642 760584 765647 577779
16972 577779 579102 955172 568719 934621 861248 817653 703969 1205136 780258 621934
16962 621934 827017 773070 676906 675775 1265150 1000462 829578 909625 870279 830008 1001004
16951 1001004 1087205 941887 779984 739375 888027 1030594 890114 998182 1063605 1025934
16941 1025934 1184606 1206380 705461 976177 985659 1043747 1027302 1215862 1045255 936608
16931 936608 986991 917923 1294804 734285 1157450 1288707 1283602 1087404 1082061 1116599 1149170
16920 1149170 1123310 1212765 1083435 1027092 1094957 1287177 1450642 1404579 1350057 1402398 1386870
16909 1386870 1424168 1389497 1206982 1417161 1557823 1446051 1530006 1565907 1245269 1650992
16899 1650992 1835993 1513358 1559220 1483181 1623713 1631134 1607382 1793058 1742285 1714949 1754420
16888 1754420 1814473 1720890 1684348 1530904 1917828 1468109 1920104 1904660 1959209 2064425
16878 2064425 1730352 1995721 1882048 1772594 2312802 2260656 2225062 1780172 2162119 2142383
16868 2142383 1743058 2322202 2347686 2222064 2459986 1989910 1972893 2410852 2390323 2492326
16858 2492326 2537741 2704270 2883544 2379846 2648799 2634181 2578622 2865509 2778712 2711603
16848 2711603 2904756 3025992 3047381 3168953 3159404 3070385 3219381 3206387 3432527 3395220
16838 3395220 3534068 3282005 3841493 3975936 3841483 3624649 3845165 3609577 3699080 4049042
16828 4049042 3943463 4001887 4247063 4252583 4378503 4351135 4743655 4359212 4477860 5085286
16818 5085286 4833969 4899812 5269681 5300211 5235560 5449939 5251039 5467758 5657083 5778730
16808 5778730 5809148 5829852 5807182 6297119 6512755 6447987 6425868 6961093 7010572 7137387
16798 7137387 7564784 7585447 7551041 8116027 8347781 8175944 8617711 8767332 8805787 9160409
16788 9160409 9483855 9638001 9839018 10264457 10552777 10696948 10955475 11400399 11283739
16779 11283739 12167668 12491495 13008681 13169559 13622739 14223271 14640185 15345921 15586209
16770 15586209 16206744 16688605 17331292 18188684 18483448 19382078 20094330 20894003 21745837
16761 21745837 22714128 23554911 24575482 25477143 26801706 27652432 28621878 30190038 31848292
16752 31848292 33062159 35115018 36350915 38162533 40311472 42426648 44791916 47274853
16744 47274853 49492267 52450013 55532324 58585124 62470706 66146025 69916980 74200630
16736 74200630 78930155 84083728 89233485 94737494 101348257 107729524 113969060 121259183
16728 121259183 128811493 136042677 143407497 151367373 159095539 165925021 172590643 178209938
16720 178209938 183306000 187024353 189573463 190598584 190299217 188817765 185971211 181773366
16712 181773366 176467045 170418288 163452664 156073923 148738371 141047434 133283476 126009468
16704 126009468 118345903 111266219 104677865 98121307 92265145 86589586 81208063 76530996
16696 76530996 71993730 67855064 63771228 60312322 56739313 53468280 50590131 47401617
16688 47401617 45244319 42833221 40518387 38761738 36754536 34821413 33336154 31576078
16680 31576078 30317765 28696547 27625395 26386703 25221697 24146623 23079761 22118472
16672 22118472 21092538 20382342 19823715 19082166 18463873 17540822 17064066 16424266 15666993
16663 15666993 14992556 14700258 14388039 13646129 13321105 12772853 12335328 11972451 11621404
16654 11621404 11006805 11267758 10751347 10330448 10078848 9606501 9744791 9174351 8772641
16645 8772641 8517572 8518149 8282212 8248129 7983026 7932640 7748885 7087448 6939001 6922019
16635 6922019 7143713 6226138 6255284 6290985 6201486 6148356 5839647 5521802 5459487 5402678
16625 5402678 5581552 5195334 5067437 4699686 4803303 4825266 4560245 4570218 4608589 4494324
16615 4494324 4607040 4364281 4320509 3521473 3782410 3779466 3690886 3561818 3937222 3737054
16605 3737054 3457679 3532629 3632171 3125393 3355636 3179674 3101781 3183020 3251903 2987965
16595 2987965 2922600 2655734 2956709 2825475 2744031 2907566 2466855 2824667 2497385 2399385
16585 2399385 2229475 2450699 2327452 2241430 2201633 2362146 2188442 2279745 2475502 2229154
16575 2229154 2172029 1952492 2202252 2061676 2144879 1905976 2161238 2108205 1912979 1909378
16565 1909378 1970239 1698086 1639293 1539098 1701755 1601513 1540465 1677657 1751989 1483513
16555 1483513 1649781 1600920 1499623 1708071 1511773 1546766 1151629 1597375 1400231 1469283
16545 1469283 1664439 1228448 1332800 1479423 1686570 1681909 1411583 1439039 1226921 877566
16535 877566 1312491 1274551 1325951 1380682 1050932 1223344 989955 1438466 1452842 1104874
16525 1104874 1160781 1233300 1559505 1185693 1002272 1435863 1034757 1101551 1118034 756730
16515 756730 888398 1164609 1107056 937675 1085868 885920 969397 932039 1263781 894479
16505 894479 723658 983004 983393 952184 919841 1033941 1145590 770468 999918 894869
16495 894869 799706 750437 654732 677836 652250 781137 1001054 1098030 799721 643624 929893
16484 929893 746075 767537 650468 1278201 564278 516245 1080118 599986 618062 703689
16474 703689 770311 710151 781607 1064880 579152 425575 977248 623379 730582 548483
16464 548483 613376 544635 605119 525661 543135 541398 479344 494752 588659 892180 584475
16453 584475 693757 663943 388299 746399 422168 370565 637625 674992 456454 909723
16443 909723 596049 817239 481847 408535 491470 365573 282226 467104 613392 498777
16433 498777 344052 207701 625731 350187 613718 343990 655666 420004 592659 159243
16422 569463 622588 619839 726393 621447 250538 614975 581217 572679 431754 399225 583341
16411 583341 624551 516815 407026 454930 253196 208499 115448 368064 640431 354112
16401 354112 85303 262686 559536 370804 289193 65394 300607 75305 -41971 498869
16390 512620 594698 527178 222752 355295 24141 401776 63297 410731 318960 387955 158522
16378 372777 511639 293620 123275 388465 403350 100459 219615 -12259 688879 84715
16367 281884 236516 493291 306785 553633 281407 355038 295305 196200 353407 40776
16356 383029 259081 428166 179459 430076 276185 328392 136095 279532 187597 526461
16346 526461 397996 380379 434473 34728 182088 649368 -2318 175952 286344 212109 160962
16335 160962 49921 357250 278994 335378 51783 269872 196622 278928 94046 90568 227633
16324 227633 81100 141361 392037 284341 303909 211014 -15464 232702 120524 72446 347482
16313 347482 336089 260731 402731 216556 31453 171106 27399 54600 -184457 -250570 304704
16301 235266 23207 128050 120870 144235 -55340 368210 359185 61553 -77882 120087 229406
16290 229406 186134 124171 114189 171575 -74981 269126 35747 474710 293064 172551 287578
16279 287578 104939 -2926 116933 15554 -4571 178413 65198 219972 218409 2043 -2256 -136308
16267 -136308 235853 48079 285019 128566 -119119 307112 365650 22522 -142475 181231
16256 247064 116810 -39906 247003 -101112 -296498 -277749 383939 -44434 366198 124041
16245 -224221 166726 110380 35760 272623 182711 330346 72108 -14450 245533 294162 334963
16234 334963 -41976 89214 108498 -15807 249762 433950 320414 39771 203803 307919
16224 307919 477659 113298 150800 373949 273293 -3156 496778 95301 97756 24864 304780
16213 304780 -95096 142633 344439 82306 -74795 10936 285225 -75872 -9481 190503 80684
16201 -843 -47825 -256852 10125 175119 -41266 140110 182133 -55730 -81292 453333 -73568
16189 194203 -158448 211397 -267644 -35479 -25391 125460 404208 258387 371842 197157
16179 197157 -110357 68558 -191709 88633 -15619 -50428 258081 -6002 129509 146426 -149047
16167 -85306 95999 37401 354567 -12805 98667 -76003 374712 249801 -53952 -72828 88609
16155 157164 216326 -69933 -55220 -19302 -95981 -11754 166229 309349 82606 26388 11534
16143 -245841 -199178 285891 45048 245881 223872 -119748 172170 -170940 72978 -86150
16132 -216559 337274 -59085 151764 -81419 89885 -128936 370352 43563 93694 58307 -26245
16120 118032 -85113 104092 -116246 -197798 -151297 104194 -76189 -79305 222584 -24981 197402
16108 89673 -87480 -130745 193218 407412 -234012 -248199 265331 8386 114355 124269 -56967
16096 -18845 240568 54558 -83259 -347446 175326 39267 -51305 273003 304605 104180 -64068
16084 256603 17742 84561 155952 92689 -245921 44890 -143046 -35558 -230831 -76620 386007
16072 46396 -2540 -148393 20766 -36837 -91076 -200054 185421 -80546 -103679 117667 -228932
16060 -325121 268697 -28825 -120020 -31870 -188334 -190918 212615 -168183 -142774 181858 167193
16049 167193 134844 -112727 365585 286056 92534 -186067 81543 123223 -82581 130466 194494
16038 194494 -180256 69722 -182534 -91048 13677 -189523 39038 214265 -249861 -254422 -224961
16027 -224961 -101205 -204208 -166983 57286 -371234 -56693 -350304 156504 -126280 -183907
16017 -183907 -159330 225649 194026 -54653 142251 -236255 -286457 -1760 30363 131667 158910
16006 158910 -359490 -115770 -103564 130979 -113523 -172628 125301 -76799 -147295 143675
15995 -117461 47690 -180915 -133586 101824 148544 -12419 -12794 61002 15694 60258 222295
15984 222295 106924 165769 35628 167927 -941 80927 82248 27895 -5878 366822 67492 20353
15971 -193681 61345 183741 -92976 -161348 -8573 -30931 -340073 386077 -4597 -147210 250480
15959 16866 -152378 -105551 -11397 191606 370091 -29818 -19490 28495 61201 4646 26454
15948 26454 -122035 329570 -15585 185861 -41432 -85418 15546 -58068 7338 343689 73503
15936 -152619 -252169 -423512 31268 25021 186385 150028 -542820 -16117 -33988 183358 -54141
15924 -247258 101859 136122 -307591 -305035 -110709 282882 112783 -275188 -12962 -48003
15914 -48003 206241 -81612 556952 -71106 146273 -149128 -188824 57709 -550820 125838
15903 -60117 13370 -159833 -340220 -31336 -144834 316807 -285783 -125754 -137765 51587
15892 -203195 -46650 194087 -165469 -116987 -83985 43511 41748 -159526 -33231 -55475 -192836
15881 -192836 -149287 44616 92714 14405 -105793 -109749 -39432 -87409 50976 30393 122914
15870 122914 -75244 108580 23667 172346 64734 -69736 126659 -176976 -155716 -191324 -75902
15858 -28947 162852 -262854 21435 -117005 6674 -64393 -42546 178799 -177503 37743 -6287
15846 50111 -297010 48561 -17510 179657 -302469 -474756 -20321 -57674 335636 160586
15835 182834 327396 -42959 -15158 -185065 -236657 94495 -115216 -59831 -171653 -157728 -4885
15823 -639022 53526 43344 -125516 -117664 -117135 -6745 -425384 -110269 71040 58737 -166700
15811 18643 -16756 -241648 -150909 -302727 -96071 -127302 37713 -94523 106883 37478 382421
15800 382421 -141693 -116736 -125843 -52831 -68170 101867 4009 -2350 -67646 -109998 77115 143416
15788 143416 -189911 -75778 76262 -160612 -297574 -224694 -337063 -218940 103138 -170986
15777 -155918 -408261 -205065 -74568 -453055 96018 32473 112998 -52429 211820 156044 -29133
15765 -84115 -218296 50680 -311094 152276 17825 39451 22608 -78758 141790 119904 -74403
15753 169774 54149 -77383 -308143 -137473 -54633 144263 -50299 251090 -16145 -129416
15743 -129416 42212 67407 -111021 36825 -55638 46482 47266 -16171 16708 116070 -151382
15731 -108967 59312 -139978 108203 -111645 -95137 -355664 -48650 -100344 -315204 195913
15720 -256579 -130656 -61930 -181614 109931 -286538 43091 -228411 -41647 -267622 178322
15709 -305382 67174 -156839 -352533 128311 -31859 116764 -227818 -326383 -140957 301094
15698 -77842 -53068 134824 105233 257755 -154602 -413802 39026 -146376 -448098 -341550
15688 -341550 -41229 186442 92270 -345824 102031 -296448 110946 -137313 -99136 -123204
15678 -123204 -158597 -30130 20763 -11329 -277864 -111628 -217253 107275 -454 -71070 -98555
15667 -98555 124815 -189520 152802 -230979 295003 31508 46305 -99365 -307225 -72959
15656 -164213 93089 101219 -38438 316111 163370 -108783 -93496 376941 -750 -36930 -82126
15645 -82126 148666 28067 -742 -53708 30448 121576 -157759 178076 -173112 -11507 -139759
15634 -139759 -131974 172475 230745 -146636 -119927 35641 46799 -224813 34900 16165 155818
15623 155818 -311166 -40719 21112 -94856 -262193 -71648 34002 40235 14035 290187 -48977
15611 -149346 82415 6516 175287 -74320 111222 -34444 -306072 15822 -2706 96209 -336292
15599 -292869 19139 -254000 -286182 -9618 -114232 -84957 169564 -218623 -153610 -94478 -213723
15588 -213723 -149848 -88281 90062 142202 -139905 171435 -95241 69933 195645 193338 -173396
15576 -145186 -144583 165900 -137646 43750 -216922 -83373 -13828 -69025 20510 40842 -266411
15564 -62940 -157435 -58095 119381 80696 -54348 -170668 -53413 82319 42691 -31937 -47166
15553 -47166 280778 -252017 30017 -118521 228043 150825 -182049 -102561 -69062 -189357
15543 -189357 26802 -103785 28462 383905 -170938 109856 -12815 63495 -170986 103430
15532 152669 77675 -49115 17934 108905 26346 -138128 42708 91433 -121166 -97349 287139
15520 100820 162512 160378 168257 27006 93507 60916 122821 -185251 369986 36997 -139522
15508 237402 -381364 -272478 -26527 -10628 -49906 164347 -23195 -109121 -401040 154522
15497 -52808 43595 62183 138988 -305152 -79410 -119679 52943 -2140 286490 247170 169183
15486 169183 -71742 -37963 -65905 61758 -115950 91106 199757 -136421 -33706 229752 -118558
15474 -3407 -248228 -244757 135297 -57138 38756 225 44161 -112738 118316 -61241 49312 -178300
15461 -108776 -83637 64409 232003 86153 -73779 -96281 -56621 -55319 -210703 -13798 -1945
15449 -394115 -160854 39550 -36282 -174507 -358647 48816 -143479 113000 -95747 -154041
15439 -154041 -11021 -69665 193807 -252024 138057 -352770 218525 -270452 -120447 -5265
15428 206098 262250 -283729 -141309 -130 22222 -108278 10515 213245 -71899 -13597 109512
15416 115867 -292872 1610 -6602 -200074 239317 -78291 -126933 -26545 -94575 -56003 -39991
15405 -39991 202158 -100133 -33790 275129 45222 -197879 73031 56474 -78711 -29836 72725
15393 74103 -107457 -85828 -117961 80583 104443 86269 -465312 63349 -94741 -220316 -255397
15382 -255397 -130156 -102024 -186183 167231 -79220 -191698 273471 -67428 56700 -13957 68512
15370 -95244 57269 -163695 52318 184984 97025 -135847 6280 -103460 -305108 99072 -196623
15358 -192594 150458 -198860 -242649 -79195 -120347 85965 -115938 79880 -14423 150051 28262
15346 311817 -82354 118715 -288430 -175324 160876 99984 -125034 79724 158116 -113057
15335 -160816 66262 -404615 268767 148266 -327984 201028 146948 54341 233607 80388
15324 -169585 26941 -146135 310754 150465 -317608 -85504 -81502 130083 -100305 -127847
15314 -127847 3514 -66326 152164 653422 -93073 309223 303484 160817 243409 371051 -43061
15302 -184526 -102956 28863 66698 -243503 21355 235451 -108454 100832 256920 100030
15291 -158160 182383 -330681 25306 -14611 -46890 67211 289250 103573 146924 290881
15281 290881 -319316 -294187 507936 154554 -59727 -73682 -67997 76242 -129112 -177361 355885
15269 245539 48637 -92744 -28606 -52097 81175 211779 -356211 -200538 -233091 16685 34335
15258 34335 -61642 -77145 175590 -258944 408149 240564 -6507 -228656 91896 420937 1556052
15247 1556052 2098251 1234352 1866864 1400936 499346 256018 130223 189722 297466 189409
15237 189409 -69551 -216792 -326014 22677 87898 -100907 137212 48746 -88207 -292402
15227 -292402 82238 20832 -88517 153040 -203286 227983 246190 73012 -93123 179368 2520
15215 232851 135386 -159134 31475 239591 51965 247932 195803 65566 -92279 -225359 -116710
15204 -116710 158827 121357 -78282 214715 30862 249096 258943 180004 -59128 10378 -13754
15192 144339 51292 22768 -96977 47539 333281 115495 106589 141443 48710 156995 94758
15181 94758 -68276 56967 182662 -171654 -47523 118509 206184 -92694 85630 -19368 342020
15169 -52619 62283 22358 6746 421100 163723 79355 -92066 -1543 -216212 -10826 98195
15157 234506 159174 192704 -173702 72023 30849 -187755 212918 3949 222810 -190586 -37076
15145 257432 -337620 77173 28610 126742 -23326 210356 51811 -67499 226214 275078 423290
15134 423290 -152099 255191 297293 271057 -44872 212226 103392 231559 178727 -23966
15123 -10075 -115381 226035 -37398 278561 248422 125894 -104842 11140 -129209 276899
15112 48838 -175693 63364 -145427 16156 145783 -20716 -3194 -155613 -41411 46831 48920
15101 48920 121813 147120 273779 -16776 20283 246978 299288 300285 199635 -83373 370246
15089 303801 259950 -192820 83318 18014 161544 26051 48447 81317 125408 -46361 152907
15077 136034 58072 22465 122439 104061 -75765 13138 66016 66203 33139 210561 -7112 341409
15064 274670 258005 108142 277397 -15500 179432 -112008 237088 7028 226042 345303
15054 345303 274129 -101235 282691 -1578 94324 8881 32181 158579 177233 83086 480666
15043 480666 20844 71597 396723 204514 301236 177738 -77919 -82503 -23334 313976 58395
15031 57729 -6751 331357 79888 55669 274665 129402 341076 95774 -13954 330368 -4888
15019 110872 245234 -166493 137979 367237 341055 83264 79266 -123416 28049 338911
15009 338911 322439 -3892 164919 19406 94467 158033 471086 270894 195106 149057 145963
14998 145963 78321 191520 139918 -97096 239228 189303 128244 125795 8493 77545 371362
14987 371362 96166 270706 -14026 55650 158811 -10320 144415 23941 81474 112502 232467
14976 232467 -204601 108775 189350 206716 279410 45786 156816 405008 -38880 228552
14965 169906 251954 89005 109247 43492 171791 448536 81108 28740 71791 -70769 141351
14953 440188 251961 370579 301519 144140 121437 235714 216366 77259 188102 812402
14943 812402 174417 325143 500516 -16286 473369 71701 59757 281847 565931 111804
14932 187900 175591 263740 133574 31978 510124 15206 498992 304898 -10279 60179 35652
14921 35652 63066 81906 370889 97872 325194 142473 -2937 168349 397974 479137 298357
14910 298357 -10181 514345 438893 390915 137167 221593 247759 405335 164438 406382
14900 406382 216285 231300 148554 799497 -1636 508432 253889 166646 705987 364303
14890 364303 37526 21688 517702 321111 307338 425497 626359 278907 27574 503339
14880 503339 253693 311132 698793 152696 614562 210703 153125 439867 96780 -5335
14869 633295 253638 425595 221725 282049 531226 264639 194941 763542 443305 403423
14859 403423 99938 69098 449544 738897 234258 412677 409469 613362 214341 208891 582665
14848 582665 536528 435644 259526 515694 264982 303733 425462 549047 74232 93916
14838 93916 202155 217446 277859 418719 370048 340905 298929 149020 311797 467260 170628
14826 281044 760575 388825 546774 342530 721402 222056 399161 154483 424780 247885
14816 247885 582966 573502 326848 216393 91584 585933 299116 387164 433561 700075
14806 700075 315285 593509 309903 799421 554217 501124 379651 25896 334637 274225
14796 274225 334535 641647 359466 282583 415649 526978 621599 267349 474324 419110
14786 419110 398299 444818 371618 405043 672218 258567 523614 399643 475392 651807
14776 651807 577466 446620 340870 356661 584656 186936 505850 169541 533008 539173
14766 539173 629352 389775 584650 473612 777151 585145 718528 356531 519701 186861
14755 346600 261578 617176 654250 603853 824241 442161 587331 523211 659125 483804
14745 483804 321198 760236 675685 382093 862381 198257 658219 573845 431315 770875
14735 770875 804824 765977 833427 612717 803219 438674 482096 785475 542845 898546
14725 898546 428332 406876 957664 724912 705010 628052 592289 648172 701060 892693 465345
14714 465345 868845 571788 849752 1087889 641409 605753 796486 666016 623032 683099
14704 683099 806855 966344 643364 856637 506999 778348 754959 780587 771917 896609
14694 896609 567103 278015 838077 1032486 788500 532216 692232 639532 1020346 428895
14683 765364 957780 770364 1059180 975528 570331 803288 666105 974180 871049 985923
14673 985923 962062 883514 817613 757419 1011025 997091 878115 1157713 906051 1202655
14663 1202655 848443 686273 963673 916877 1117989 712257 1065354 964385 1100283 1117044
14653 1117044 1065707 1177070 1122292 853856 1172249 857962 950167 716975 1413500 1029609
14643 1029609 915807 1153265 945879 972087 1076708 1235995 1013143 1212065 1353563 860349
14633 860349 852429 1599456 858769 1050726 775274 1012675 1159801 1238475 1148724 1206332
14623 1206332 1056568 1459565 1077674 1354581 1000043 1327444 1367254 1026510 1411408 1535099
14613 1535099 1385475 1208189 1504235 1403634 1389839 1472929 1271919 1172715 1292822 1231566
14603 1231566 1530969 1325948 1463323 1291682 1400746 1462899 1344878 1400875 1585256 1194769
14593 1194769 1379462 1312950 1543344 1504000 1430146 1690739 1630418 1289320 1955793 1525691
14583 1525691 1371489 1915139 1896929 1763487 1533103 2291049 1496495 1746293 1685791 1992702
14573 1992702 1870128 2036789 1993144 2244361 1846435 2087085 1979931 1948905 1780780 2190780
14563 2190780 2582310 2219323 2247801 2298527 2739523 2292627 2648518 2914546 2698500 3287231
14553 3287231 3070215 3788303 4022216 4825896 6566490 10286228 18534763 38053119 44645525
14544 44645525 21945567 10914552 4650284 3065288 2295926 1861394 2041987 1945578
14536 1945578 1594838 1950967 1921946 2137294 2043589 1883371 1567703 1693605 1884934 2319440
14526 2319440 1876388 2218484 2259431 1982528 1917731 2141606 2063267 2097721 2072645 2223315
14516 2223315 2473784 2194204 2473564 2345245 2322549 2597459 2458229 2564158 2760880 2635126
14506 2635126 2608883 2685785 2629493 2738197 2921076 2813058 2644078 3071201 2511343 3160473
14496 3160473 2810366 3001492 2801594 2704803 2943338 3024674 2909258 3160022 3152647 3313108
14486 3313108 3118171 3470590 3327201 3381444 3336535 3618712 3601008 3556479 3537370 3460920
14476 3460920 3908282 3559347 3573893 3682902 3775789 3881332 4001039 3942049 3896363 3787521
14466 3787521 3923471 3892023 3993668 4381976 4374252 4562119 4513133 3898324 4712506 4471159
14456 4471159 4380620 4419517 4610424 4676674 4766225 4738092 4777410 4677310 4999930 4998958 4932457
14445 4932457 5075574 5341764 5100635 5435865 5168172 5587029 5247748 5894455 5515958
14436 5515958 5896649 5956746 5752238 6267575 6006121 6417659 6411551 6221747 6333626 6697371
14426 6697371 6711252 6803023 6698686 6795024 7097794 7048418 7282171 7011242 7703982 7572944
14416 7572944 7572272 7698509 7876449 8348141 7741072 8210729 7977887 8154331 8414103 8273558
14406 8273558 8445418 8496319 8871263 8707248 9245527 9386199 9450414 9772618 9747532 10145167
14396 10145167 10043234 10329933 10646155 10494151 11011588 10896917 11164464 11545423 11758610
14387 11758610 11932098 11992358 12154390 12473309 12434690 12791528 12922664 13251162 13740551 13439469
14377 13439469 14416481 14337685 14795660 14933523 15293218 15317107 15398519 16486656 16167748 16551610
14367 16551610 16970746 17473500 17415333 17711945 18555517 18736070 19229878 19703059 19791055 20635593
14357 20635593 20766933 21521015 22109231 22466853 23095330 23305957 23587942 24799854 24782817
14348 24782817 25490765 26279852 27103207 27597566 28503284 29147359 29890158 30694141 31466141
14339 31466141 32580361 33200806 34304909 35401037 36723350 37381595 38606543 39297263
14331 39297263 40999412 42324869 43585933 45254203 46346292 47806179 49606318 51082108
14323 51082108 53159153 54804301 56736302 58986328 60797855 63208777 65356220 67887892
14315 67887892 70336170 73300023 76051671 79117497 81997406 85811808 89309601 92876692
14307 92876692 97255996 101726110 106059457 110851793 115505502 121796609 127070112 133731836
14299 133731836 139979261 146708016 154692791 162598644 170686284 179782992 188923704 199109322
14291 199109322 209744402 221393811 233086177 245760866 258669084 272546028 286712184
14284 286712184 301804399 317153553 332673770 348630082 364426909 379831445 394912818
14277 394912818 409692407 423016342 434792493 444820155 452420877 455422635 456479377
14270 456479377 456315147 455290274 454267382 450823376 443651249 434278748 423872990 411667443
14262 411667443 397698040 382621122 366924001 350799453 334955583 319221255 303413902
14255 303413902 288128480 274429778 260809181 247614671 234887851 222701016 211349342
14248 211349342 200395522 189991365 180527290 171308349 163267807 155328078 147613704 140495793
14240 140495793 133977504 127674873 122032565 116598823 111413244 106471882 101787199 97085124
14232 97085124 93225590 89840025 86016051 82547941 79631822 76146500 73226924 70556292
14224 70556292 68055722 65628264 63103955 60961158 58709681 57061013 54774727 52776961
14216 52776961 50966928 49529532 48197623 47248595 45332762 43756237 41912874 40983581
14208 40983581 40238978 39401898 38171482 36985385 35829587 34782684 33515577 33155938
14200 33155938 32443605 31457387 30591798 29971634 29023882 28303811 27666516 26894779 26120967
14191 26120967 25723268 24917380 24134400 23717119 23235850 22653224 22058878 21372338 21076510
14182 21076510 20779766 20390846 19789512 19280356 19024481 18708026 17906846 18320973 17198192
14173 17198192 17332022 16490001 16151039 16096587 15682788 15208059 14912975 14940243 14659857 14251263
14163 14251263 13931802 13965997 13437818 13195400 13152428 12676033 12316785 12337370 12287741 11954542
14153 11954542 11592799 11501611 11377475 11253554 11023564 10775021 10560015 10562716 10609250 10216470
14143 10216470 9966521 9779491 9831487 9682887 9317858 9304898 9001370 8785820 8598844 8948851
14133 8948851 8702200 8638368 8448057 8310211 7875878 7700514 7810397 7679525 7967424 7343221
14123 7343221 7678468 7326287 7140235 7121272 7179509 6932178 7015134 6640853 6778715 6528208
14113 6528208 6558478 6397553 6294622 6276305 6123158 5993404 6130433 5889293 6081767 5904387
14103 5904387 5836214 5645388 5325074 5727039 5720496 5531938 5568091 5169442 5374372 5484436
14093 5484436 5253264 5047662 4902332 5056684 4917504 4754648 5042130 4917856 4575414
14084 4575414 4870646 4534889 4708961 4710850 4310523 4589845 4121111 4357434 4406133 4005117
14074 4005117 4024029 3995948 3799730 3961530 3798635 4074746 3854560 4048487 3814501 3722367
14064 3722367 4017132 3619018 3493747 3555200 4002755 3467630 3887023 3739805 3306653 3737649
14054 3737649 3422680 3301925 3234273 3829273 3520875 3189552 3032231 3335863 3347120 3305986
14044 3305986 3073602 3023618 3018890 3048629 2624969 3013992 2766558 2773375 3065614 2815765
14034 2815765 2790328 2750617 2884375 2718437 2934803 2854648 2775349 2553991 2762757 2612287
14024 2612287 2836551 2717325 2621942 2546379 2533198 2533860 2401001 2497925 2460359 2331210 2245987
14013 2245987 2295672 2277413 2314201 2131680 2109225 2135242 1979837 2273754 2075771 2358409
14003 2358409 2107703 2086390 1971519 1982941 2052769 1824397 1770253 1578900 1878296 2068948
13993 2068948 1800356 1657355 1915260 2185520 3069203 5375089 12090803 31372382 45676042
13984 45676042 26051783 12059352 7591185 5735351 4344417 4010161 3016942 3185950
13976 3185950 2871032 2785895 2965343 2562900 2528651 2153849 2187511 2309617 2201519 2224127
13966 2224127 2298591 2200707 2176835 2307485 1711398 2041630 2042290 1782646 2030682 1971715 1535442
13955 1535442 2050458 1842758 1912039 1812550 1592468 1815974 1668976 2015980 1969243 1738409
13945 1738409 1830461 1865666 1848735 1627368 1704209 1430125 1888085 1450975 1379203 1352284
13935 1352284 1475653 1235069 1688669 1717333 1712854 1736175 1604403 1171150 1783457 1827041
13925 1827041 1734934 1443932 1491235 1528939 1488781 1416955 1410548 1628667 1406380 1335370 1203127
13914 1203127 1216929 1358686 1635695 1127275 1255533 1403898 1023986 1192278 1193075 1221089
13904 1221089 1222814 1013468 1364798 1243919 1057434 1186732 1097622 1221129 1330357 1071689
13894 1071689 988674 1106702 1446843 1273815 1064334 1066440 1118833 1082293 1210394 1203841 1134691
13883 1134691 1403908 1222880 1091495 1098708 1152156 1345280 1020237 926035 981220 832144
13873 832144 920744 1193321 1078534 1013535 631895 1236187 883992 1249200 1194290 830272
13863 830272 905021 842538 987493 996299 705443 1374157 1057796 938001 914709 840536 800334
13852 800334 448360 1053813 831065 861208 1139307 733564 847805 732969 676251 1048388
13842 1048388 922723 860246 1084136 794196 943534 657713 916498 983523 853116 628618
13832 628618 902492 1183669 1122920 1001023 679460 979875 773175 1004478 687449 861353
13822 861353 831214 715260 941584 1142520 647587 871076 749757 714068 693355 513613
13812 513613 692603 824486 640865 912402 556514 605451 621365 912399 644175 758065
13802 758065 976521 422898 845323 981090 693791 587835 690163 720119 833846 943059
13792 943059 946375 807134 623427 386528 901650 987858 673521 477716 512997 859461
13782 859461 661697 542412 734873 950448 604559 355196 673654 705953 685997 1018894
13772 1018894 610870 474393 517195 634901 800973 725593 551453 490540 480437 688075
13762 688075 467992 555377 993466 801153 1003146 791848 632453 544785 941463 558938
13752 558938 817792 784045 616255 635521 571823 739202 388113 743871 392813 501795
13742 501795 532813 838955 855623 425881 525484 -109090 678630 672091 603406 807441 754232
13731 754232 374990 508754 183660 483379 410046 413948 375771 824544 497879 270317
13721 270317 482874 700344 267620 785551 635674 620713 493120 725367 273578 400850
13711 400850 328457 702372 367275 322345 441404 169529 814896 532067 583456 409435
13701 409435 402778 673411 467777 403134 252609 580604 460700 426437 463422 696112
13691 696112 428180 372981 199347 464468 500955 251614 498608 608462 508942 708841
13681 708841 195827 623151 421107 535107 555482 679712 519474 427590 473921 229490
13670 251307 612105 430601 553392 461014 368392 450000 152433 259102 452032 406611
13660 406611 443814 617894 496630 406123 654834 378330 743986 408459 193350 595818
13650 595818 373462 592317 460019 222020 419144 509028 477110 49236 168275 524490
13640 524490 190155 272182 241985 397320 491548 325794 291652 129217 487114 241466
13629 514994 351568 247564 119931 241449 257316 502905 281702 430272 227279 162276
13619 162276 333416 316655 105648 -35217 437443 196037 115650 419316 175098 494358
13609 494358 -23237 61998 244327 494063 374355 435218 442304 372932 321060 438945 558776
13598 558776 521057 236583 -6938 552371 511548 520479 278812 444314 75525 305203 191634
13587 191634 457363 519555 656606 441815 433704 340459 181661 68781 412293 127381
13576 261486 364854 233416 448165 411878 315726 258883 619878 128477 345802 271128
13566 271128 421831 237233 429442 475909 663723 56072 572375 72335 203019 250007
13556 250007 117805 40177 99798 346457 -26815 -156634 98993 337820 -160272 -85452
13546 -85452 212403 35057 486722 77355 444959 528010 234528 283335 302452 161508 363347
13535 363347 359442 231657 136779 133241 564374 476571 140565 322079 88324 484665 378503
13524 378503 360815 269557 525162 32979 232695 284925 240609 162559 358924 436421 183923
13512 -103499 324831 233719 363327 239615 32388 -136485 175996 479137 556902 234573
13501 313906 52340 225234 337735 418929 320065 44453 367600 215604 33341 266538
13491 266538 155896 369136 193610 170218 22983 69042 561903 174928 257625 232591
13481 232591 146795 475830 67296 159666 -32271 -135354 297387 218095 415819 287710
13471 287710 197103 197097 114073 373501 105262 -332246 231061 544709 437985 9408 295483
13460 295483 316374 339088 173066 234078 198383 180677 146207 432433 379183 162524 -133123
13448 240989 422502 -45443 60030 46006 576132 198423 58503 37834 102462 237964 200948
13437 200948 301254 -28060 435191 393897 55027 80498 -135969 175993 424730 535635
13427 535635 421980 30699 106624 -40242 240918 178740 206633 192644 160407 191198 378976
13416 378976 417200 302692 -132448 -70528 54137 198973 388064 563430 440727 118782
13405 499843 164550 165309 276428 40333 102075 87984 172744 214557 274473 -225465 -212382
13394 -212382 224762 119206 147943 241660 273926 55255 236852 100898 456424 -177078
13383 27968 279470 242675 70793 55047 156928 -18870 247167 50126 637638 241381 66372
13371 489339 51800 82694 233494 359380 296942 190216 -70026 120727 394323 219912
13361 219912 251378 198650 258278 150647 -231975 291675 397014 481827 375399 168645
13350 270454 36001 40899 63859 -184333 363939 103875 269291 441635 590872 537890
13340 537890 161790 255060 407278 575606 170331 -224431 280465 -798 394709 478311
13330 478311 8466 526115 331714 300183 -9394 123298 -66626 124785 377373 106375 211388
13319 211388 316495 -129447 302825 39703 201055 159723 291726 -107519 50965 634526
13309 634526 159959 194178 85949 -16472 55442 183109 53190 110708 87924 189870 201551
13298 201551 85115 -49735 53720 62322 -60850 149607 -157898 113251 216289 323957 192565
13287 192565 -102424 -132111 -364716 331940 -65152 -257175 234622 485142 148450 77613
13277 77613 -217947 383015 -157353 128718 515392 11255 223564 20037 65325 77797
13267 77797 168626 -125265 184644 -61616 389027 203284 337586 248648 -143606 -113932
13257 -113932 131598 116780 -101957 262479 -83030 207789 -53091 1742 -40909 -80605 159145
13245 33401 243802 -122898 -53661 -145324 68504 67435 216837 282495 27867 -18460 -41633
13234 -41633 202099 179503 171394 40794 33268 -57733 221461 224196 136679 -37902 -83096 307729
13221 -66977 244615 168083 86458 126768 -52804 106927 238485 191254 42724 108115 287386
13210 287386 194954 100289 20186 241929 -748 285215 22109 266592 262966 26295 -22826
13198 -181280 305133 -189063 165840 230067 224509 -102133 193307 31129 -311801 -45459
13187 162087 60608 145418 24207 -360429 115931 309447 193864 132815 108825 -96704 -2464
13175 139308 91173 302476 -149367 44876 -1553 223658 202194 65654 369440 -145463 37920
13163 -435569 186889 168804 65572 310207 112617 137159 317159 81586 -222494 307741
13152 -64116 -159287 423064 345004 226240 92725 -10089 -419175 245092 -53361 60185 66043
13141 66043 158430 212939 47976 -34211 -179527 58528 20414 15187 156721 -206553 39719
13129 95292 18195 387386 346964 -49211 -87584 108653 104009 135148 -29127 230507 215818
13118 215818 -197662 59362 144790 -48756 267171 317956 68259 162439 52878 243560 160689
13107 160689 96496 17140 29568 326450 -120361 95433 41256 205318 198936 -19758 364219
13095 111367 148469 84076 -34962 70702 256039 35057 -63556 -80970 102193 212494 42153
13083 -303019 75469 177053 -926 215237 -12075 -281460 130031 477126 88005 -44633 139057
13071 241072 258817 -16330 495703 116501 -56203 137345 119826 28749 61708 419844 469201
13060 469201 -86354 318093 314618 173698 -7332 263465 -184669 2899 146920 -132118 123257
13048 -325532 -69309 -79116 216741 13070 28460 329053 86728 233831 348876 -126474 -272349
13037 -272349 343128 101317 -33854 -16811 -73107 -8348 -6818 -6582 157462 54439 -42215 157528
13024 -36473 -2670 54082 64974 32520 -86078 433804 9911 -21126 145308 55432 317548
13013 317548 115470 35383 209443 -51935 -46298 -243934 -6410 49017 175544 100512 -61377
13001 -70717 17809 276823 288958 -61825 216120 303131 120644 94691 -39038 130393 -22588
12989 -142533 189549 86503 255132 251441 43728 145155 -53437 -11921 314322 25382 48668
12978 48668 24345 -39390 -232743 46337 -44000 56829 201071 -110951 173299 -117061 41578
12966 232315 124603 -165678 47067 232578 -72349 112224 90163 72428 137420 379985
12956 379985 140106 17547 -155407 111205 37491 -1122 -81447 130750 -97102 -73457 -209755
12945 -209755 116840 151822 -211134 212786 121393 344771 -77324 102489 268736 98525
12934 338968 157188 422910 -114782 -42447 330250 -21913 320299 262225 60863 64579 -334887
12922 83757 277005 144325 15160 197175 1872 -92345 -8105 523223 -108992 -41452 -55648
12911 -55648 -92241 -26657 -62874 -18590 266045 355004 -166249 -209445 -129905 -48032 -113734
12900 -113734 -7330 99250 -341784 -162051 -123006 78840 218501 65335 230992 149540 -79715
12888 382703 205861 269381 14273 -137082 217939 -30003 50638 -28359 -82926 6176 -224402
12876 -89141 54254 -46094 157725 -52701 143721 11981 102000 434970 323089 -76109 63101
12864 -185318 -97932 275700 18756 7327 19475 318863 102207 172838 -194008 -100207 56668
12852 188763 77532 -20321 -301785 -371016 -115518 184596 367950 441605 316603 -100569
12841 176774 150534 81606 196244 230075 -9914 -95343 -201158 161589 505475 148441 266477
12830 266477 -316870 211732 264657 15340 212130 -548849 -230215 -113802 212468 42265
12819 287924 63854 -135510 -201452 84140 -125860 128821 -114514 62373 93716 -99575 28427
12807 186115 100826 104867 91793 -160823 -270749 95178 15974 -60409 326626 52121 -197289
12795 -91017 220316 146083 -234238 -201953 6750 167101 117564 -79511 -157021 -284998 -23782
12783 1228 -234286 -298292 -131041 -66823 56618 330551 -352370 320650 137083 6290 -22501
12771 -103793 171630 168079 -97311 -197535 -216300 -76057 -11268 19557 -12221 -148996 -93845
12760 -93845 405723 151211 -56335 58457 187605 106299 159756 98655 88804 6650 -149595
12748 66357 -123556 458 220664 302829 -167413 186181 -84374 58355 210350 167380 125983
12737 125983 298971 79660 166 31681 173525 -15925 -287395 -44105 55764 160000 7936
12725 111079 -82174 -56653 -35380 -12318 -337200 159720 88797 73653 -42635 -288131 -146657
12714 -146657 82534 -95723 179825 -30070 247004 355426 448047 -167129 131126 18901
12703 237144 -25618 167123 218177 117898 118553 163101 -19931 68047 45796 -187059 -134546
12692 -134546 329455 247292 257652 129148 172992 123448 19307 -114155 -23558 30542 339559
12681 339559 123954 75435 -7074 151128 -92032 -26385 1237 -41640 -4987 41883 -54094 -87460
12669 -87460 110936 114811 -30622 248542 66170 123835 262906 145836 10973 -36527 42918
12657 215881 -130110 126630 61916 -215796 219528 226674 -21210 -92377 210220 18918 -70324
12645 -58040 365125 -160103 -95137 -8351 -147822 247625 332312 -15715 -28318 13549 205549
12634 205549 -51727 289102 189410 236692 -24383 163236 326793 251637 341274 151561 422425
12623 422425 151387 115210 357031 254135 104253 286829 -50358 196669 -136137 253968
12612 84511 210101 -151087 -364849 289197 -119681 84613 15042 114117 -383971 126136
12601 280700 206690 191429 414829 3177 440755 -103101 85063 -66562 -21098 -8876 43979
12589 -91928 10741 443394 -72518 -188331 23352 -174554 161048 244489 -105240 267327
12578 12352 -153785 -181390 -285241 -378794 -148351 -15502 69237 138355 -51504 -164408 8385
12566 12269 121150 238851 202528 4128 144428 -23773 -305285 18116 -120374 30831 -276857
12554 -118789 46070 -177957 67037 5252 488069 -19302 269056 47273 -177364 101240 205406
12543 205406 -78250 37177 126465 278818 -31121 213381 -386522 -159317 32227 -115740
12532 208115 8979 -546 -92636 79840 -273776 -119325 171693 195724 -72613 76961 -59760
12520 -123881 -95422 124173 -128427 -27173 -176 -53219 150211 66510 78054 55796 -240867
12508 218506 72829 -86278 91837 176121 -222525 -112511 318783 -16178 305103 155844
12498 155844 -37867 147868 132268 67324 -122589 121206 55296 -43640 66208 79933 235511
12487 235511 254419 217230 28525 24580 42496 46912 -178265 8006 127322 691 -231527 -256328
12475 -256328 93754 5326 108596 -217343 381540 -67017 8994 27436 175241 -286266 -201676
12464 -201676 -39913 -221817 298269 26364 -101824 10401 88085 71618 92437 -40196 -242107
12453 -242107 -82453 21400 -209409 12336 325593 93763 207419 277484 -174876 162906
12442 -283828 182257 398218 410035 102397 -22718 -84953 31476 26385 185062 283633 113157
12430 -97292 6514 159356 173932 289842 39892 -196708 339446 -51029 56251 -363099 -47011
12418 -94565 32784 71072 187317 -71754 -102057 303477 -183853 183121 -377486 314056
12407 26564 -80321 -117121 183982 333304 121373 92736 81275 -110156 -190873 52923 258899
12396 258899 -157595 83598 108020 -299925 -136037 163374 83392 -28341 12465 -57833 -51562
12385 -51562 -142179 -139917 133841 -326362 12682 -53803 77210 -91216 -73111 209557 132010
12374 132010 43530 121791 152091 86084 -177081 241158 -43403 171644 -196177 226743
12363 -210626 48300 -39741 57536 148181 -267589 -234921 12046 -448216 -303745 -223712 -228686
12352 -228686 163324 -167389 -69056 -3598 -20587 -86680 -20616 196653 -131634 -75271 50352
12340 24548 164291 -186710 -57999 -182436 1345 233702 -122774 -111924 -44004 -240190 248143
12328 3487 297149 -6513 106660 -114792 145784 45618 170109 34904 184514 91359 232583
12317 232583 49053 -316978 63392 -190652 298972 84621 120264 264090 -182727 -179979 139923
12305 52425 -18033 -248705 -25126 120629 140399 -97819 13317 255170 35203 -75726 -473721
12294 -473721 -132579 41952 87151 75212 323829 -15380 -117068 -18964 225665 70351 87867
12283 87867 204484 -32554 34302 57752 -156939 -149627 -218596 9914 460995 -5864 200393
12271 375574 341998 -247326 -88956 261142 -36739 -67530 102404 -74338 -48474 308372 -24613
12259 -82463 -303177 191951 268582 282022 -23204 255531 -136299 26933 -77483 -179318 106763
12247 105063 395881 132981 30666 92229 123037 141537 194482 -148624 283635 343920 43068
12235 468064 108410 -12226 -94474 -11376 -34534 115825 434090 155927 120197 219215 233177
12224 233177 81407 296675 487812 -21910 159673 280897 161117 181918 98170 352744
12214 352744 222302 115442 411480 166321 56028 131576 110162 -152572 8119 202621
12204 202621 500446 312648 197354 130350 158973 78186 117699 526723 336081 162840
12193 160297 167971 67934 217297 78005 135582 -262044 282878 11329 170306 136919 58239
12181 59428 88712 -95957 -103866 122800 112804 10114 71815 -180952 60504 304359 -409068
12169 216021 111339 90428 69148 51264 -110907 441364 227742 -261363 79850 97597
12159 97597 250290 169034 222885 -99251 7328 370804 45330 -155601 28843 361719 36000
12147 168395 -161029 289091 307913 213517 -198389 -85068 92847 -125203 -41449 152056
12136 -252602 63363 -48394 377908 59334 -606555 -153200 -3820 -250646 -355311 10549 318085
12125 318085 -47207 -141404 -92436 -8354 151454 161347 -261212 194048 -190461 -66363 72826
12113 -31333 211886 -183170 -38310 107113 -118541 96234 250029 96806 -173078 31687
12102 145480 340730 -19468 126343 163675 38595 -47817 -193461 -11419 -193288 -38046 -116009
12091 -116009 -157942 13922 43027 62683 366585 184460 216841 -260380 -8115 251536 -241222
12079 218586 182941 154426 -75809 13693 267257 -171118 -386325 168922 19567 169265
12069 169265 167721 361731 433437 -18760 112305 87726 52871 158306 169243 406217 1877163
12058 1877163 1106914 358376 -310749 17142 -121513 -112723 -9910 34133 -225820 99136 -2849
12046 -129820 121631 171390 -223626 -180875 26254 -165477 -212604 255445 171851 105448 -223160
12034 -66267 31701 -165524 -260406 -55480 -144505 178731 19434 -37700 221112 -146773 -38993
12022 -28897 115237 40547 -26787 -68132 73090 -140789 -34249 -223930 234830 115911 46942
12010 -272214 -157241 -237911 185414 63981 -160528 -29785 -649991 -98340 -299617 -163745
12000 -163745 -62406 -182306 -172780 -163299 79069 -81453 -73422 -212411 -148517 147738 99640
11989 99640 160477 -28576 219165 -149753 -71260 -150259 12171 -274813 125039 -431005 -48377
11977 84554 19388 -15687 -39639 165979 27973 -24239 148498 -138885 -173657 79518 -18954
11965 -32021 135793 -23631 26920 74908 -135356 211154 -109332 -118670 57759 -13134 200554
11953 -76128 141156 340560 199065 67471 -64928 -134303 78452 193796 149475 -52483 189807
11941 -157053 -267994 -139288 79596 -68630 -137222 101053 -145331 304318 6335 275193
11931 275193 -70256 133612 -27502 103378 100089 -186349 148541 113612 -116182 153401
11920 185208 71653 -175402 -157592 375409 216078 185680 -136783 125877 -221241 -68227
11909 -173204 -4048 -167887 -225398 72584 -23241 -182289 146107 37326 -83592 -252852 160973
11897 3535 -131067 -233947 -75319 -157482 52386 -60840 -26523 -279157 -168351 141080 139532
11886 139532 -196418 84585 -146644 72146 -89208 82568 -220131 79276 -184436 -277838 121201
11874 139167 -65477 162552 -36994 -94691 84475 -136611 -23444 -43229 -51184 -72342 166082
11862 95668 188757 -272367 -48169 -158415 -110910 -125624 3855 135031 131892 -122044 -358445
11851 -358445 38005 277966 193679 -128838 83362 47982 -104568 77870 47980 87642 -350761
11839 48572 51119 -90106 -129926 302121 -223127 245465 40895 -56792 -48987 -51077 25231 186904
11827 186904 238351 -210229 93136 96825 180090 -367598 81013 -32925 63997 18895 -212703
11815 152034 38296 51750 187836 -2966 -161195 -140120 241319 -84691 -153274 -40361 -26750
11804 -26750 319013 -140306 -251923 -102627 -447945 -92106 54207 79332 -389429 -249613
11794 -249613 -151522 226700 -123220 37212 137881 -54508 -252330 244037 870 -220530 164985
11782 216560 -379049 -120869 -63401 63537 -34348 251781 -138762 168093 -95018 -246004
11772 -246004 175496 -26224 5262 -27218 384593 -39671 -1321 -93904 -253102 53176 -58255
11760 -115168 -218530 163796 -190922 38577 -177381 159874 -156469 69525 50577 -113774
11749 235875 -5210 381009 152635 -21846 38666 169362 -154289 45789 -66938 97876 13986
11737 -343673 156281 -39573 -348546 -27359 294119 -47737 -49601 42242 395526 239042 16678
11725 173382 54958 43324 285522 190986 4335 69573 462853 -310227 -264777 -139123 118009
11713 -59003 328559 -71482 -85776 -155257 263985 62661 118063 -148108 408401 36194 173058
11702 173058 222936 207668 9901 -60754 225761 -50076 -57521 -270427 14177 103961 143843
11691 143843 6933 281236 -162673 -166458 -257657 -267734 -66947 37357 -166066 -137887 -15219
11679 27488 -77390 124787 115765 125812 -117111 -36370 56222 -56266 -65913 111237 32195
11667 -185212 157619 43298 2183 -12175 66509 154268 -208957 -15466 -140411 -48547 -126110
11656 -126110 -246600 203820 195262 267619 29297 -168663 -106515 90915 -172807 182187 -6193
11644 -139059 108659 18295 -11161 -273040 141164 -109559 226962 -161571 183150 167708
11634 167708 295837 85531 -18707 -116325 48699 -194601 56769 -106857 -120135 267140 187512
11623 187512 -44157 -44204 159761 353460 -194196 184013 -99307 68215 -447626 -196212 59562
11611 216411 224210 -191261 -126643 208693 170534 98576 162709 -164820 -20346 -324326 11016
11599 291320 107350 70352 -198490 195984 -83309 34361 62963 196846 -65523 -10275 -18843
11588 -18843 -64115 96331 392194 57444 65384 58302 -43628 128889 33769 236208 -179897
11576 -41876 -197275 -229092 305467 -81597 84294 288697 -11026 -14331 -120623 224814 -241090
11564 102187 317222 46007 110591 -81618 78723 288398 199082 375967 -15177 -280917 72108
11552 -24875 95097 -182851 -111786 262554 55984 115444 -138955 268320 -18838 -24233 121718
11540 360341 -120510 -326551 -100998 -91337 228388 232627 116630 157864 254021 209815 177532
11529 177532 -23400 186954 283697 -31307 -54818 105435 73826 121693 214096 79165 217351
11518 217351 -162874 -51220 -78570 -77214 -69324 156755 -198922 250618 -24408 266351 231787
11507 231787 90234 310239 253072 74815 -182342 525216 -153699 168537 246011 -119952
11496 27969 326219 331694 588526 116678 191662 128420 -23085 527780 258766 -155735 29242
11484 104763 47370 -49242 167512 142291 179115 262908 262864 84961 71905 376218 43762 97754
11472 97754 187723 195045 -72041 159952 212349 46919 205751 -122871 16606 162610 53912
11460 80798 120016 43943 144261 -245471 47652 223871 11809 271070 103927 505506
11450 505506 102315 55997 142916 73210 124706 199167 202580 18702 206968 351802 -109619
11438 -113352 -92283 81230 -21908 100689 231839 379646 247525 -38201 284406 34159
11427 -285235 155104 65799 85139 31563 106536 -277599 186067 236172 112721 92873 117961
11416 117961 43302 108554 -221975 35195 -123231 192161 104249 -126770 68621 41418 -66320
11404 205792 122618 -123846 31567 -92682 6890 -6336 191544 329425 -87846 112476 26440
11392 -408140 10479 -137446 -130267 146992 -274779 -13963 -135548 -77365 -101184 177196 196632
11381 196632 156484 -42612 -96512 247297 91402 73640 -174177 227938 -29969 229819 125433
11370 125433 -230847 195502 233950 -112206 85231 138764 -209715 39450 -5514 -95768 -178826
11359 -178826 6440 -123583 134498 -174811 -430 -46316 46373 229486 69693 303530 53528
11347 -171945 -189481 223474 -266210 -103186 -117328 -382302 138128 284144 -325931 -110341
11336 -231229 -139142 25538 -117887 191091 -126370 236171 70665 278012 -176722 -174127
11326 -174127 -46675 -157251 -48844 -206234 -220041 -441241 136123 230847 303832 -154861
11315 111325 -108508 127978 813 -62103 -26030 -87334 215793 -48004 -1019 268232 -32309
11303 -207846 -126784 327096 39100 109499 -264291 -16060 35649 -32149 270235 -12526 149449
11291 -219158 -221952 -186604 301346 -159583 -90881 29994 -101773 -283986 -364480 169350 -196264
11279 61403 21508 -27830 -64378 108268 -56081 -193736 11536 -229911 246612 229521 -204517
11267 287810 44131 -83307 -21180 311374 11794 -149299 -391808 114716 -101072 416508
11256 194546 -256608 -198896 -172173 107645 -212899 -10704 159030 -146930 -2581 139923
11245 -132975 -76535 10544 -224425 185170 -9197 -184966 -22998 23816 -33260 -126368 134783
11233 72222 -34808 137588 -125021 -9822 -186905 133684 355775 153605 -252385 -404102
11223 -404102 31616 176820 83487 -60446 -244846 -10094 -40594 -6211 258885 293426 -271843
11211 141603 91408 -57586 -97586 -58760 16604 91863 -197873 -460600 60011 216849 158960
11200 158960 11185 -204968 -14566 239983 -197331 -66629 -272721 -143921 -100481 -169151
11190 -169151 -81644 98977 49918 -236725 25252 -69714 -373143 165385 4873 -178384 -126799
11179 -126799 -639774 -75160 -77682 286139 177410 -45955 -87633 -93610 316014 55999 -179399
11167 -17981 -191543 62228 -131689 10720 -132382 58106 111840 -103183 -161921 33743 -135508
11155 -291292 209454 320401 84802 -119000 -143446 -362622 53991 -30950 181412 138735
11145 138735 -188519 104888 57617 -135852 -30782 -124526 -15349 -103506 428921 18814 144148
11134 144148 15376 -46655 -63082 272039 26404 -33854 73993 122666 39363 131773 129372
11123 129372 -209880 46363 183377 101029 277611 303200 141466 12037 -171041 88981
11112 -94550 112327 179700 1526 102705 51382 58673 202082 -167389 56335 84475 125873
11101 125873 103834 23538 181177 436860 104360 102130 631065 22701 320900 67152 172236
11090 172236 640656 313748 322487 407410 285736 189654 383384 218123 281267 224612 372116
11079 372116 347246 254361 111782 354838 446311 339397 373186 284104 286409 255625 355615
11068 355615 611265 178894 395472 427223 441240 395936 353234 469072 544299 416959
11058 416959 753655 229666 763875 761681 844070 691920 701846 1307160 779224 1076869
11048 1076869 887488 759919 845672 864322 809853 1195762 703130 782778 476570 856906
11038 856906 704889 895302 627874 442157 895505 745523 802803 311461 569177 357580
11028 357580 732682 511897 618929 636395 755275 910641 569932 966482 651685 634139
11018 634139 684075 474608 649332 782561 887547 469077 592230 568199 557826 903385
11008 903385 835791 707854 442792 856560 436783 692338 448206 533322 626692 684277
10998 684277 760933 673630 379950 636231 430953 849518 799249 560989 1034345 745335
10988 745335 522973 1010356 877709 832214 1060966 1042063 1364938 1456016 1185142 1570598
10978 1570598 1520911 1905120 2200052 2422888 2541164 3140078 2969425 3025978 3307495 3612498
10968 3612498 3430064 2872842 2560062 2001699 2068228 1606720 1724563 1447253 1525156 1704436
10958 1704436 1374010 1875391 1675451 1565278 1548219 1344742 1187584 773321 632105 465083
10948 465083 704872 608905 490412 424361 129194 268579 358463 275719 -1865 414481 141089
10936 -126921 -292926 -35563 125951 -81859 208859 -140365 63795 45121 343702 7223 97400
10925 97400 -142914 205373 317377 295034 111819 -169636 -65238 -251770 -175603 125170
10914 447486 231521 108355 -16511 -336971 246943 243872 -168627 152826 1097 168577
10904 168577 147469 308994 -32207 -36319 93676 -323097 -89877 -56481 309049 -240572 -332545
10893 -332545 -131053 -112564 112090 -161912 -302775 144603 -29157 65359 166838 84947
10883 84947 -40609 -93318 -2437 -249086 -272819 -166019 172577 -31301 249302 -99077 34986
10871 -448477 145829 168303 -84412 53005 -349875 -137466 -63645 128722 58690 -155558
10860 76610 -168670 -201041 -249160 -189984 -153698 -117094 270734 247144 52213 -64334 -20249
10848 201384 -124060 188118 -60952 -1780 -439648 -282588 -218880 98345 -126807 -192960 -105557
10837 -105557 -47287 -104507 251159 -176950 -83958 47808 -146074 -107481 234055 -49075 316789
10825 -85352 -152288 -123788 3177 -100405 -197055 -149730 -122089 7803 -152612 23800 56815 -119943
10812 -45379 297975 -65004 -141011 -210211 11786 154024 -115725 -66184 -116804 -106761 -130423
10801 -130423 -39037 360382 -203574 39136 -203528 326339 -73511 384483 176124 202091
10791 202091 -234333 -331768 -47742 117397 179803 237524 -245754 -70991 -141313 -279020 133737
10779 -79049 80696 284545 -188021 -63878 -63022 -204272 -298033 46087 13309 -101977 15575
10767 180763 -139086 94998 -105215 177204 -232367 -136130 -252128 -88234 -251442 178064
10756 431667 -361824 4008 -428968 128836 142071 -290722 -19921 -91049 -226118 -91682 -220200
10745 -220200 -8657 -94722 6904 -93736 -73022 -163958 5276 197940 74237 184656 -435649
10733 -138501 -283897 150123 42203 -188924 82333 105707 87054 354481 -120180 -109013
10723 -109013 -28230 172195 18468 -124590 -241722 -59643 -62199 -66332 7119 -212975 97224
10711 236375 -35762 -77467 193235 156153 -238886 -176249 -165957 26706 144059 145553 280230
10700 280230 -217774 197603 -44042 12175 218486 -122365 -84202 -2136 204652 111298 -143027
10688 -241826 -120670 19377 116491 -135872 224804 133643 -16303 227324 56602 42728 37732
10677 37732 32164 -205613 -34652 6031 74656 -250969 -10448 -173690 -41199 -72067 121723
10665 132496 -176029 99588 -231356 -35424 -50059 -1936 -80255 -25063 -124277 67297 18732
10653 -354496 -72958 142604 8214 229202 -138206 -54780 -14293 -24971 -11963 -122558 -220887
10642 -220887 18089 8583 108013 77323 5066 -109200 75555 -19243 -98580 223473 23327
10630 169677 -313017 -99425 -233727 -170823 -112165 -11358 -271515 -378007 -115185 11844
10619 81045 -167455 -126044 59947 -152835 -169618 -339481 -244614 105994 -6159 -284967 -66754
10607 22258 -22280 1294 15282 90118 -24661 94626 -2007 -97443 -237412 -188851 193893 -288920
10594 -194981 -167130 327289 65376 240232 -115469 -66812 187351 376167 34267 138939
10584 138939 6368 -298209 80129 -149580 -74687 -8825 -34581 -98514 37748 -92371 -3858 -2751
10572 -2751 -282888 -55082 -80358 -172964 8155 -53138 42502 -37242 -283117 136929 208412
10561 208412 -4728 -91748 -22941 -16381 -37404 -169836 166112 -335885 -187925 -201399 -35340
10549 -209055 -90216 -152974 172311 -238710 -204230 130063 -105455 -90278 12416 252170
10539 252170 -45748 27380 232911 -169728 -218784 198429 158782 116142 -14363 -166079 -376406
10528 -376406 -225950 -42309 425 -21234 -107877 140643 429915 -282085 -133570 71199 180881
10517 180881 -209952 -3222 110579 -65280 59241 -86510 121885 -284235 185804 -355683
10506 -6842 -78766 -90798 115029 -9383 -102634 42366 -87124 -21022 223471 -306777 -211831
10495 -211831 -236945 -133178 3669 11578 81332 63596 -90432 -13059 4082 -29000 84644 -133510
10482 17287 435884 481288 334978 330074 349847 219992 189031 146218 -203274 48710 83618
10471 83618 -307505 -128105 -310685 -285307 -286115 256643 85158 -371706 63888 -49859 79109
10459 64462 6066 265617 -67506 -190295 73644 5135 -200266 -512956 -316071 -135195 83839
10447 -200331 291711 91674 13248 -64790 -52776 -97179 36476 -165425 179514 31078 -33519
10435 214498 -271793 -110479 69931 -169504 -87453 -110870 183167 -229557 33564 -323089
10424 115424 -124005 -75048 -148206 120151 66473 302250 34942 226169 -197212 110938
10413 -55005 34631 27257 -214962 88300 231181 10952 144846 -129005 -75918 -33737 140988
10401 143622 79295 158295 75975 -239621 -310233 164072 117377 268630 285466 -17602 37235
10389 37864 86225 -85753 207303 68787 158583 -139082 61602 222753 208658 323379 -8169
10377 16733 333888 113369 -29475 253779 53673 -3690 215485 251976 239593 487542 519904
10366 519904 451898 459403 437459 464773 340193 234113 138024 148597 406029 48008 25328
10355 25328 275010 353943 402809 195591 609278 383939 586250 509490 274490 -41599
10344 374027 312777 115430 128848 328664 288297 -149923 392659 245207 307408 -176503
10333 195069 232593 162727 21157 76846 270678 102536 35822 -72196 167130 192053 87525
10321 503031 243168 44240 133981 101196 -54126 269940 -87930 179159 98500 155088 264414
10310 264414 181145 11328 -160216 200560 82403 81474 -58018 97716 295207 -131854 -280831
10299 -280831 -200875 -66293 135471 141921 -40914 550559 -107594 111912 -203079 -270452 48165
10287 82449 112349 212199 124677 333322 -9150 35620 -86046 76652 80929 177954 -270463 11667
10274 -212450 41847 -1687 -98969 -76027 -49043 149405 146509 -75961 372848 -85447 -274890
10263 -274890 211133 33885 138246 228791 -115734 2110 121753 279857 286014 114949 -398745
10251 -149604 -467943 79978 -100885 -223927 -212707 -269559 14979 34337 19726 18653 -83379
10239 -88164 31654 292949 -67574 119447 -173973 237009 471929 -328102 -98523 255338
10228 -130471 -198431 -1021 193077 184993 -89085 219296 -100229 -96712 -48634 95578 6509 142908
10216 142908 -20421 -174211 -228981 45429 -162405 -200889 29403 105761 -94430 -384093 39935
10204 25050 -81341 -119481 -157498 121016 -148453 39116 348788 106804 148423 13312 -168507
10192 -127411 -105743 58345 18749 -21757 -101485 -4658 -33867 162251 -206845 -298422 42933
10180 60117 -588219 369403 -128813 -195341 261355 138093 -237555 -56572 -588841 -33380
10169 -342765 -260111 120172 -137202 40089 -233974 -54458 -34356 90961 325222 23382 -324319
10157 16794 160946 169878 -221353 -44269 42632 464766 19978 -195493 -151225 -170679 -394253
10146 -394253 -114746 -135932 83137 -286832 -149167 210789 -67404 -230298 40833 -109866
10135 127678 -293775 -249306 -206800 -229982 38074 -184966 -291436 -58962 34604 41262 -217808
10123 92979 -101535 -49629 28575 136535 -78745 -112579 -168950 112603 -274083 -508809 10479
10111 13647 -194441 20161 75609 -254568 -188245 110499 -34668 132199 -197578 100787
10100 200518 -189447 -202865 205356 40727 -176406 -159488 -151829 -122084 17609 30209 577
10088 -91439 -95467 -271913 -232246 -140617 -176379 -44032 18471 -28363 173543 -141947 -468011
10077 -468011 73608 109997 -609931 -115741 -71899 -23444 1721 -391612 -134478 -33140 -99565
10066 -99565 -119242 83296 -32733 191326 117324 118901 142055 187356 -113104 -150968 -287379
10055 -287379 -161070 -241069 27816 -434358 -179036 228653 -141029 -20454 -61002 -125585
10045 -125585 23945 51149 5420 29155 -70579 139398 20091 -260544 148588 205049 -160333
10033 91220 -279621 7937 -236446 131703 180376 215650 22329 -333870 11930 139903 -312535
10021 -30368 115545 -167016 -30522 69443 30810 186919 -47073 -227947 102636 231739
10011 231739 54997 -100260 17764 -32308 5623 -111821 -226428 -305562 30513 -254323 -30878
9999 -24381 23876 -82111 -161488 -80534 -233464 -138958 -56861 122780 11058 8031 75812 136862
9987 136862 -325122 77441 59413 -102664 -344395 -67873 168629 -219690 23618 -515475
9976 815 -334484 250918 -33973 60810 -41040 35819 -105328 127306 -243785 -321058 -508513
9965 -508513 46810 -22360 -114090 -521173 -128706 185072 -140784 100672 -24664 -263182
9955 -263182 -297423 -210903 56771 -144282 -24720 -7380 -8365 315448 13850 -56717 -202161 -148339
9943 -148339 -147389 66952 -168586 -33549 -36712 91252 -19985 -336360 -9682 -155682 -115237 8958
9930 -26946 31494 -238000 31811 -107203 -128287 92563 -130851 -23472 174846 -78820 -231913
9919 -231913 -44966 -286389 15817 -107782 -187118 239546 65582 -124777 -78193 188988 79207
9907 -43512 83653 137703 -116387 -159562 -313505 -146925 -409152 7329 149401 -200647 -157558
9896 -157558 21279 -55243 -224840 -307472 -330519 316682 -213308 81812 225926 -230168 20890
9884 -155515 -120395 23869 -104225 121071 290928 -129069 -89990 -73030 -1493 139426 -274399
9872 -162817 -137411 -76602 75551 -244356 -183116 -230602 -77428 -81650 -112183 -92800 42553 -54973
9859 -352940 128261 -488990 -139310 -55690 -152620 -70299 -461220 -263897 -339411 -74258 129995
9847 -1386 -175791 26497 198682 -260537 -3773 163279 -351733 35128 -128722 -238626 -83300
9835 -137397 63823 -146249 8102 187769 -115723 -124344 -144764 -221521 351748 -190449 -54827
9823 103614 85092 61716 -287498 -25404 -119436 -87956 -37763 -17098 -37791 -31068 -128036 391722
9810 -100036 -694 -290195 -231814 -74739 -18456 -3324 147402 282895 -51198 -235907 -357295
9799 -357295 -150322 -332190 -217902 -198345 -225346 -75464 142975 48763 -202662 63314 -520800
9787 -232661 -204786 28187 52808 -45055 -311673 -302826 38112 175993 175394 -155828 185994
9775 157617 -303157 147660 -21967 -120155 -46828 -38363 15772 -231230 -276784 -386532 140817
9763 -203462 31816 1588 26615 -99152 -31084 -115336 -302366 -13814 32276 -129696 93499
9751 -205954 89227 -102008 -42910 -162283 -350123 -256823 15956 -77020 -356327 -23550 -72070
9740 -72070 -98095 -111690 42169 -412471 -134474 119168 -13162 -6086 -329908 3125 -36672
9728 -374231 -12473 -77005 -3074 30330 -273616 -197006 -107272 36900 91893 123661 -85808 -69319
9716 -69319 -83425 -151209 239761 111059 98998 -302621 -221768 -301179 -280133 130890 255080
9705 255080 63890 -154190 61476 104375 77289 -50074 -140318 223455 -155289 -343294 5826
9693 -503393 -50123 -199932 -263927 -176714 260577 -51071 -19536 -267858 -440280 -102262 -171077
9682 -171077 -155431 141483 -206295 -224588 55160 -232801 -103603 -90055 -202015 -311892
9672 -311892 -4382 241900 -90681 48186 53907 -9513 -196003 42286 8865 -164533 -258677 -186595
9660 -186595 -248454 86327 212570 -128948 54356 -32467 190599 71387 -195543 10264 44470
9649 44470 -45613 4897 -46872 -3514 -99660 -15400 -59546 -118608 -235059 -66887 -84363 13595
9636 -288775 -365575 -11383 -93056 -68324 54584 -256454 -273668 124474 65561 869 -234453
9624 -73383 135741 -85500 161284 -175268 -61810 106566 -95831 114994 -177553 -74203 -116234
9613 -116234 -127582 -38358 -118525 -49623 -177268 103186 124268 -13892 -221128 290313 281527
9602 281527 56397 -66263 -166113 190922 273573 -506935 -195103 -297519 18850 221300 10778
9590 -85901 -189251 -139417 92675 78992 -271009 50140 286113 40767 104225 -105925 -157782
9579 -157782 -48359 331475 -8617 187476 -161258 -11563 -241227 56975 -305156 -131372 -452209
9568 -452209 96139 -88942 106612 -207710 -213636 -77379 427281 26598 10065 -63489 76220
9556 -209079 -197582 -125456 -79061 39913 -135908 -108337 -347412 -322542 75114 -404389 -94841
9544 99688 -216910 166056 305527 -198454 -76383 -32292 131012 64711 -188790 -282430 -109971
9532 64134 149135 -242073 -106567 -19448 18513 -65452 -193461 -84137 -30600 46426 -128637
9520 277534 225627 136404 -146780 127600 -63111 145952 359974 86069 262313 -48646 -92805
9509 -92805 -218556 101159 -1482 -143580 84355 -73458 105078 -133557 147603 -49759 -197812
9498 -197812 -121554 -181768 -306458 -158195 -584596 96477 -41956 -182020 -140314 -24394 -133578
9487 -133578 -199006 3262 -24577 -134254 -110065 89944 -218233 8270 -369897 -96899 -312966
9476 -312966 -236918 -77678 -130305 -365808 75200 -405588 -496941 17207 -186752 16481 -194206
9464 -171135 -116667 23356 190392 -152103 -36375 59421 -265650 -81979 183340 -10933 14100
9452 -231962 -25241 -111794 -302670 -63963 58509 35213 -59571 -398698 -70327 -9689 64738
9440 -189240 199188 80874 -150640 -140895 77302 -62864 -69504 74505 -33420 -408588 -186526
9428 -350741 -201166 -52299 105291 -43079 -154848 -57410 -17684 -377944 46735 -305656 -90279
9416 43916 -116562 -335177 4076 -206223 73327 -273854 -185310 -35575 -312367 -151275 341216
9404 -288169 110718 2834 -277615 -226050 121191 -47904 155916 -443984 -204941 -138047 -133593
9393 -133593 -393 184826 -168758 -113918 111020 -46400 51243 -34949 45250 261555 -84325
9381 -165576 -84105 -11415 108969 -39517 1205 -336409 -43896 -194635 -210129 158715 -143638
9369 439663 -130959 135813 -8949 13398 138230 54252 59679 -140707 54693 231548 114758
9357 81997 60624 -35867 96677 18779 -77510 75629 -105325 45571 357816 -127614 2787
9345 -144462 170180 -71228 5251 -29097 -73560 -23141 -339956 -209618 -482349 200595 -248073
9333 81605 -270248 -22287 -172836 -95691 -226281 -282210 -155444 124244 31930 -161272 -137575
9322 -137575 200938 154873 92636 -73534 -48776 -159923 -132009 -329562 109311 -161405 -316548
9311 -316548 -248284 -189774 25299 62019 -15766 230743 177996 -28486 157330 122896 -45073
9299 36270 -274020 -97056 -149351 122772 228007 -75244 -126180 302796 50191 52760 -64205
9287 -4795 65163 76490 105000 8596 89241 -45694 -226401 -337967 -195357 -88553 -230072
9276 -230072 -349678 -16700 -210275 -139050 -175998 33065 -87692 178707 -156486 -253938 -194592
9265 -194592 -51604 -376973 -215396 -135664 -159385 -5106 5487 -136510 2939 43626 -13221 130455
9252 104946 75567 32929 -8706 204620 31969 -90941 -153408 195713 75767 26791 -209761
9240 -347416 -235573 464527 -168178 183686 118665 -118098 197319 -194107 182763 -519812
9229 -196593 -247725 121650 -11607 105765 -168540 -140523 -144144 -130792 -480759 -130908 -11229
9217 -76588 -97968 -195901 17882 -60226 129016 -79168 -180934 -216239 268208 -13270 -334378
9206 -334378 43406 -83799 -29864 -46979 -12752 -39579 -184192 -39701 -102801 -17876 -82022
9195 -82022 -50646 49157 -231353 -201821 -337365 92882 -368660 43102 -52032 -189545 -205520
9184 -205520 -164572 -78008 -78505 -117811 -8333 -487100 -184631 -19006 110805 -135989 -216877
9173 -216877 -135650 -55908 -175933 -375837 120399 -2605 -161825 205061 -150712 -36892 84793
9161 -6510 -208858 -135547 -563430 -317576 -38329 104706 -115710 -382986 200675 -35262 229025
9149 -134168 232201 -177498 151638 71172 -31226 47197 -49338 211415 112370 -275590 -231184
9138 -231184 -9143 -40474 -67088 -97597 -290492 -463144 -40182 124130 85222 11385 -66520
9126 339698 336300 -11170 -195528 63731 -200628 -207561 -145253 -120238 -91904 -134486 203746
9114 -130011 55321 984 -12112 177778 -112390 -20617 -157895 30644 130317 125063 273795
9103 273795 -59872 -217577 -146482 -167212 -202668 -310791 -55215 1673 31215 -471666 58840
9091 -235525 215263 -299676 -302162 -149227 100669 57176 164060 203721 41885 291559 -441004
9079 -12253 -68993 -58006 -155999 -283295 172228 -137590 -181859 -132370 -103913 -160591 -132564
9068 -132564 -102824 257192 -30726 -208823 149838 123901 -171575 -4766 -190488 -140345 159658
9056 235992 -15128 -174658 82382 -323697 209896 125971 138001 -277348 -23104 -358252 -117262
9044 -149599 121739 -84046 -27555 -63439 -202540 -40428 125588 -232778 261060 -160301
9033 -285706 127833 -49799 100640 -166279 -58453 19929 123838 -70828 -223220 -108221
9022 -114842 -139927 -136514 -510509 -47773 -323094 47625 205728 70709 -12403 336777 -106981
9010 -129851 -239774 -27636 211138 137106 149390 28808 -159455 -3757 -113123 -163276 -82735
8999 -82735 230587 -122446 -147016 120768 -212226 -133519 -148607 -253647 194327 -178056
8988 -37134 -55943 -58187 81587 -26411 44492 -110378 -56600 -24434 55078 -370085 -97139 -44899
8975 -259001 -449343 149671 -93693 -91687 182397 225226 -160278 64367 -236517 -95649 -349975
8964 -349975 111876 34297 -106309 -112711 -305811 168950 160610 -58275 -250460 -97157 -219458
8953 -219458 -23966 -227626 -142739 53647 77050 -25279 -227488 -170436 -224928 -170509 -180313
8942 -180313 -143430 156462 93332 179231 -511228 141937 175765 263807 307405 50027 95792
8931 95792 -304911 -48421 -133418 130410 240227 693330 388004 1000298 2893697 13066759
8921 13066759 11449191 2820365 644738 573435 449727 254369 260097 30891 -169889 528
8910 255974 102635 74150 8171 -227379 111699 -235893 -42598 6152 109443 640 -415115
8898 74469 -79742 -120003 -129375 162254 14670 25955 -206487 -298978 11218 159330 -56601
8886 -264225 -193738 -72911 131495 -70224 -294936 -231239 243281 -172552 69255 165195 -14099
8874 153550 76012 -370902 21653 -80448 -35004 -143368 -46334 71439 -73294 151450 -42655
8862 122878 -237270 159536 -214956 -241868 395043 165556 130510 -198864 -105219 273157
8851 -114917 9424 -258599 -212009 -199405 -13005 -80043 -51877 -118664 -47484 108838 -359401
8839 122456 -117598 115126 29356 272150 -215384 -91223 -54132 121648 -183260 134297
8828 -12844 129261 44042 -442326 -99875 -344705 -55187 36609 -3547 -57561 -414717 3255
8816 77839 183599 -183398 85048 -214349 -170694 136940 -110145 -106412 -171786 -466635 -95467
8804 -202034 -149179 -275137 -170672 132309 181806 235208 -168523 29032 -195013 -137180 -8071
8792 -13350 -105922 24368 -243869 -106000 -154573 80007 171230 -21605 77434 -70769 -94629
8781 -94629 190215 72819 139421 -43958 -174914 -268093 120520 -268006 87866 245074 142651
8770 142651 -230594 -90027 8013 235644 -262315 16230 197755 -30429 12540 -17891 60764
8758 -36149 -16635 67763 279614 -460024 -138164 196506 33798 105642 -29586 -248408 -422140
8747 -422140 -127517 -147619 38756 153779 83132 -27007 -94589 -172975 -224508 293237 55662
8735 220578 -205184 453362 -199551 -125717 -30373 -48579 -356248 -132050 -215049 -137730 -101992
8724 -101992 11419 -238086 -320979 -188082 -183240 -386661 -51249 -143393 78132 -177658 214660
8712 241600 5128 342967 -108291 224063 -221967 -94604 32898 176505 -305445 89698 -292158
8700 -135831 -216268 -113909 124727 -240453 130381 192365 -17435 54726 -111073 -303697
8690 -303697 334263 -116859 201208 -310872 34544 198654 -55591 94002 -52168 -202139
8680 -202139 -326179 174271 242722 -214315 209729 1542 40076 132726 -147269 -353123 56405
8668 192769 -99785 -49524 -21099 -3205 82343 -144555 -60518 154873 -229431 95773 -6506
8656 -314813 -118338 -109915 67773 204192 231520 -42170 -380112 239503 143799 16385 -126593
8644 -184449 -287104 227309 116873 181074 14059 195151 -134926 -161658 -345459 266061
8633 -33303 -36057 80937 187482 64855 68353 213643 -55 -34312 173262 32387 -381725 -288677
8621 -288677 -249674 -257330 -56619 233485 -177257 -405171 -299520 515835 40334 -28872 -233414
8610 -233414 -32337 22487 -458974 130313 94368 -96896 -59743 131827 -121709 45123 79734
8599 79734 -8964 68913 -371820 -133087 13504 13381 -140423 13087 33579 -18627 -76163 -86921
8587 -86921 -31209 -90621 -157372 42119 -117577 -90875 -267386 66437 -131993 31590 -22776
8575 49967 -149145 180621 -60332 -87360 235874 28853 9908 -152726 53725 119540 274223
8564 274223 244304 129667 29272 89805 -170176 311276 124407 -86653 -351120 -126521
8553 -208987 -317230 33054 -13303 -49825 67243 -343275 -260508 92659 -211216 -294263 -71649
8541 110295 -50868 213728 7130 -195790 -144055 70286 75777 52737 -310705 -234969 -206560
8530 -206560 66241 -249236 -154263 -218761 -59673 -84109 92163 110880 228321 -97326 118519
8518 -83369 10585 71060 93151 94595 -215991 161532 79947 95793 88915 -143436 186447
8506 -217009 -256429 -25185 14614 -4928 50889 -80126 53914 -54929 -55109 9864 139289 59710
8493 -40579 -156991 188313 -307403 25489 62735 -15491 -231683 -284514 -15670 28194 169268
8482 169268 356727 31212 -118723 25564 127859 -171464 26414 -82596 53159 -194756 78157
8470 219184 -67561 241007 517317 -178222 -335898 -71152 -144967 -173486 -7573 20612 -43173
8458 67043 -83553 -330925 -10198 152988 -54719 -35225 -50248 -195776 -257590 139147 -32362
8446 -6013 -8979 9580 -145098 -57134 39349 -164133 -126316 -100064 329081 -193013 -380466
8435 -380466 -58004 -264208 65501 -121232 -140019 -54709 -176317 -45080 -417523 -301257 32682
8423 -135843 -40546 -194016 -319938 -151203 159204 56436 17070 -87943 8984 -23220 63600
8411 -45377 -253617 1007 -24800 -447162 -49512 -155472 102774 -24478 -155149 20851 188900
8400 188900 77439 -7823 -118233 -50070 154689 -92907 112696 -235811 -60333 -30674 158530
8388 -362276 125083 -221888 364971 -197509 102174 -145506 -52487 -83293 -120760 -121994 141200
8376 87740 6202 -128520 -161522 -168332 236385 100091 -262568 325172 -146264 67919 -25305
8364 85873 -49606 67940 -256164 170159 -6010 94805 -359883 44631 249122 -181538 114213
8352 27783 120379 -79075 -254383 418021 160413 -143743 160269 31678 201724 -443965
8341 -74676 215374 -133343 -106923 -125766 -159174 -188013 -174057 -142744 28816 -2511 345393
8329 301365 160679 -44363 347516 56204 -106698 50883 12533 -159561 405437 -374954
8318 -25653 -72477 -210253 -34508 68634 20952 14093 -61029 -183534 -42141 205218 47540
8306 -231727 -162695 -337110 -179852 -12895 -6989 -333558 -65433 173261 -40721 43465 35005
8295 35005 -200969 -234319 -32471 -130357 -292200 -227846 -35394 11758 -63622 153635 70912
8283 -130541 251942 -506963 -124267 36807 230381 148402 -283120 46877 -88471 25621 186571
8272 186571 -133571 -130051 -112863 -326502 -40513 104770 -150282 64903 -78496 168801 39408
8260 82926 145255 -72014 -390349 -44657 167068 -281670 -8771 130511 85428 -75832 -116464
8249 -116464 101383 91884 196910 -26558 -311307 162095 -31922 -464309 -89460 -28792 255217
8237 -171673 -252346 -4960 31589 -39281 -29785 48524 -8962 90453 -51505 -156794 -12120 -323680
8225 -323680 -217058 -173679 -104309 -14427 -706 -126388 -268893 -272044 -14808 112786 -267916
8213 -70799 -26766 108775 -261094 -446774 68199 -133467 -123545 158702 3296 -63734 -18872
8201 -89618 123129 146779 182612 -119251 -338317 57493 -38921 -232652 -214942 -26431 -192381
8190 -192381 -278383 -201544 -233150 255003 -24001 172864 179443 -241740 -162100 -96619 -96793 -112126
8178 -112126 -95142 140017 -22625 -236711 -186120 -50146 -191173 -188950 12928 99583 -132666
8166 42510 253608 43205 412285 4121 -138784 26297 125516 -288531 193427 -303751 -22244
8154 -221274 -82522 4149 -113829 -138749 93556 211966 181786 -232879 193741 -68964 -159863
8143 -159863 67345 -39831 -212859 129178 -40005 147142 57033 -285693 5020 22175 107443
8132 107443 24577 -109369 119796 -113259 -315991 -156365 157682 -271227 -278471 88530
8121 -56524 247195 156552 243700 282306 218323 -76538 166521 -76432 -133144 -28611 -205973
8110 -205973 -254293 180551 154991 172683 -38922 184454 -192613 183289 7104 -141226 -111311
8099 -111311 497047 -59755 114497 -22540 -376363 153209 5093 -296254 13590 36188 -150966
8087 14506 -144281 102958 -93882 -108351 51575 159073 137894 -188757 196496 25804 -120601
8075 -295886 -176040 63280 -250200 -160539 40708 185356 -22869 -81375 -65259 -25775 181967
8063 -37830 173169 -92317 -113571 76768 407754 158926 -22952 16367 -219691 -57673 71039
8051 2720 -134287 120960 241099 -16541 169175 -275230 -127600 18180 -89546 -77181 51065
8039 -7081 -83038 117760 -177795 46810 317792 22916 -140018 -67264 -212846 -306601 -464067
8028 -464067 146924 -49867 102333 17210 -93879 71172 -45467 -147734 5207 -223407 781
8016 121537 24800 202940 -263690 139501 153163 -227912 -142513 -131632 -91078 -28513 -132608
8005 -132608 -164442 -27547 11792 163064 42887 142101 174637 147718 -32334 -302472 -84557
7993 66683 -37842 34698 131099 159431 228018 -68830 -233861 -236386 -155994 42235 -447495 -147063
7980 -232038 94485 122329 14431 52601 120749 215324 169889 -192613 220852 35733 51812
7969 51812 47088 -355728 -11436 -234880 -115126 -206973 198816 -113544 -259399 -192526 -149474
7958 -149474 214655 60311 -300538 -97935 56378 -79996 -89792 -332547 -72980 -74968 -68377 -97502
7946 -97502 -236596 -86411 -101495 141541 -46925 286241 -78818 88749 -262366 -59996 458809
7934 -18290 23429 -42470 -75113 -71964 -126834 -122482 -316477 -124105 -334179 -211388 -113691
7923 -113691 -100721 56064 -23540 -247859 265836 -86205 124059 -41945 68726 -91574 -126227
7912 -126227 -45701 84185 -31555 236040 18644 58924 -279227 117453 117863 -173333 4300
7900 -162273 66823 -34102 285617 -383839 -67605 -53523 18436 -272509 80225 165710 77766
7888 121698 181404 53991 171056 -108419 -227566 -168068 -66152 -64622 -8368 -26344 42356
7876 254991 -106133 266900 54787 -72379 11506 73098 68054 39466 -2536 -12033 -58977 114417
7863 -70013 185827 -32552 -2465 -23806 129947 -47843 -78748 -99091 -205151 -253368 -184237
7852 -184237 38916 -347923 -176689 -75489 -78553 -220466 -74638 160835 21300 31804 -59313
7840 222351 167907 -171833 -347297 -222799 -36475 -43583 375024 -162193 -199999 -119011 164785
7828 -106224 -245714 45021 34662 132977 -256733 222099 -64649 -240929 -72299 69319 18252
7816 -159777 -146197 -59380 -410159 21050 -68803 40573 -37754 52027 50551 -19241 212199
7804 117175 1097 -104431 -191309 169630 -121300 -85572 -222426 -258462 168524 -242727 -6065
7792 104815 -70725 215041 -243257 -182289 -220329 -459638 -56636 88720 -4552 4371 -125987
7780 79607 -266483 236759 -80862 30451 82852 45851 -120356 151246 146160 55490 -253655
7768 -144521 -58459 -118153 -114504 -242295 -77128 -241393 -51542 -97380 163775 26680 -111801
7756 -211771 75782 101067 -160205 -16151 61139 57436 -253061 149436 16060 -22156 105416
7744 349851 -142147 -154306 -88745 60451 137171 211827 17104 86886 2915 -163157 -12210
7732 -297148 213132 -103102 86702 -123137 256979 -228945 -70867 -376396 -107957 93016
7721 201520 -33070 -61309 -92582 192644 48439 231223 -3167 -109430 -112335 199185 15574
7709 -168940 35262 224631 -45402 125748 -93240 -45868 -27043 -108681 101050 -125320 -29990
7697 -16092 -72280 -160321 173918 125394 -59911 -32366 -17292 -179723 3845 -39791 -162132
7686 -162132 -21629 376148 56861 65898 32309 202168 8603 75823 -203632 -291992 -134758
7674 -85344 176340 18056 -6080 35048 389862 -13920 -63987 34217 -75103 192297 -95553
7662 -138818 44604 -24160 59769 -8388 -188284 -356028 -37265 -105903 -9132 -23033 -99406 -226900
7650 -226900 -171576 -244605 -11133 145429 -3433 77749 200473 35634 -6832 237488 -42013
7638 -296781 3712 -469043 -37708 180512 157567 129189 216816 -285931 -387538 19926 -168277
7626 -384222 129568 130380 -130595 113076 -8554 -373965 -137607 -49478 -96076 -159751 81870
7614 166638 -292221 -21777 -81301 -130824 -2553 3000 32869 -387152 73862 -59480 -93556 16908
7601 179827 -393874 214456 -13399 179601 -194714 136735 -42542 -384503 -183272 -417688
7591 -417688 -82204 7486 -152609 54160 -14630 70210 -207456 154100 -171904 -156680 -383128
7580 -383128 -186490 -113041 -99351 -35504 -180313 -145537 -85922 137685 135679 -94306 -21362
7568 -351360 -67387 -59555 145320 -87626 145339 -183819 -270015 -394390 -126523 448 -74744
7556 -215658 261163 -150913 -50085 253645 -76527 -24941 51064 51003 -224107 -64554 -17621
7544 157294 -41566 25978 -131054 188759 -330351 93172 -69391 -96214 -334842 18133 25806
7533 25806 -88113 -324161 -192326 -92957 5486 339394 228471 -53201 179736 214455 145941
7522 145941 135868 56861 41098 -20681 -36549 7269 -127689 192311 -12980 139282 -44658
7510 -315628 385687 -74279 -83252 -248851 -190484 -377141 -1664 -64750 -427602 -202095 50217
7498 22873 128812 91107 -219199 -136258 -68321 -314497 -248564 113343 -73275 -363614 -134615
7486 74232 -70163 161363 -370292 -291355 -76257 67179 118200 240802 -121793 -262490 44104
7474 267574 -106984 25020 48168 55670 119240 -366432 287708 -2229 -255779 70091 -104223
7462 249360 -141365 -246249 -17337 329170 147045 -38705 -8237 122449 -42874 14860 16765
7451 16765 -107865 108564 -139095 152247 -155095 22619 43267 102121 -9862 -217261 -55362
7439 -159869 206734 -378261 -26878 134081 184547 3214 -175259 -117193 -237067 28445 -236986
7427 -291117 -27572 -175796 267127 -331351 91076 -26211 -49700 -79862 -134480 -208052 107165
7415 -274978 -65288 -76764 77683 -21732 145943 324799 -185263 118840 78882 1305 -112197
7403 49006 288069 -12101 208117 -110190 -59786 -14584 -49172 193736 -47681 26369 -185923
7391 -88480 2769 -207298 -17332 26890 10939 88537 -16956 -47427 -274076 -117610 -36362
7379 -312154 -396993 -283995 -114576 -110474 -250417 -66454 -133932 -17142 397509 -142539 463866
7367 26492 99796 -321338 -226744 -62148 -120917 -158985 189220 -61535 28380 -35988 -227546
7356 -227546 199910 -100249 272575 154787 -11905 54559 -137353 -36477 -196088 159107
7345 147790 43079 -243175 -284626 13438 -74706 244760 -11709 41358 -73561 230462 -198325
7333 -121307 218595 -335954 103675 -98500 -155234 92349 38692 -151868 59921 115691 -28572
7321 9420 119458 -111829 174874 113933 -170087 -100986 -61759 -72979 -481967 -245149 -165401
7310 -165401 43342 168798 186432 -59681 -120067 -125801 -193915 -134419 -164879 114583 18541
7298 23249 187059 -59079 -146792 94584 130841 41879 -76191 -114945 110285 -345424 362596
7286 63558 -19104 55791 -198245 -197204 -456641 273196 -21911 148017 -193901 47214 -81979
7274 -179912 85154 -208292 -130373 -178332 296537 191345 85042 150051 120312 81636 86434
7263 86434 190772 135954 -60863 124142 290809 132408 -106059 -223593 59435 -324954
7252 -30735 57432 -139357 -25099 -26361 -184284 -30566 209351 -250322 -200706 38706 30598
7241 30598 -69790 -243433 279709 -36448 -291515 -247612 -33964 -81482 12361 -15030 -101065
7230 -101065 -245178 59765 251436 -26711 -166578 66853 95465 -90621 -90917 -85468 136233
7218 264532 110224 -78347 -114689 -181787 67594 209649 -114463 -254521 74049 61877 -186805
7206 81617 -247991 -170968 264333 88798 95354 167255 -252252 -167329 -240784 -93702 124703
7194 -53556 -65993 -1364 -373698 8295 -403777 -36139 36832 -191749 -11612 -223099 -37733
7182 -9057 16913 -338067 -367034 -118789 319908 -102606 142204 133845 49255 -48563 186207
7170 -9047 -216889 16724 -40888 -159038 193992 117731 40848 178662 -217270 -507305 -33940
7158 -99619 86110 -6811 88146 6737 -92977 110460 157564 67103 -23335 -63346 -233076 57151
7145 -3746 -10773 419562 297694 -153232 53756 -7986 54126 -36520 -133578 136900 -213921
7133 -148421 -155009 -244477 -183886 -157870 28162 -223111 59706 106832 147816 23153 -99987 175384
7120 -11352 -5180 222824 -247947 404 -52635 12291 -126177 -114410 97791 -36971 -211588 -130699
7108 -130699 146734 -8844 -22578 119032 2237 -302849 -290747 305461 -110879 -163415 -123998
7097 -123998 -137617 117986 -234575 15077 250209 -61250 -357513 55376 20367 69055 -152619
7085 70975 212325 -314315 -20082 -103742 -6641 188285 -192857 227962 -21525 -175116 109239
7073 43120 -331645 -312749 18525 -175072 -18725 26498 6073 -107566 27113 -301646 22010
7061 -264333 93568 -18133 68623 283426 37814 -16275 -92679 -98222 170308 52914 31435
7050 31435 187741 308351 27461 -38839 38684 156333 33445 31487 -104188 225312 -97340
7038 -189879 -128426 18300 -7761 -172300 99378 -135238 233315 72248 -115501 -14233 153487
7026 180280 -239325 81301 79806 249956 215979 -423722 205023 -66070 98511 -239999 114692
7014 -119378 -370702 -57163 -477272 75710 199233 -38842 41949 -215708 164696 280296
7004 280296 -31925 15837 152881 80050 -73827 -335159 -120809 -179865 -26003 22812 277942
6993 277942 101052 229258 -85120 57541 148824 -282245 -276222 44486 -2833 209739 96712
6981 -60202 -202655 -71581 105194 -242675 -188040 136849 60953 141837 -185691 -251033 35870
6969 -20678 -292366 -239097 -128031 71095 -164820 -64784 17227 -600356 -132741 -166712 16889
6957 4007 -98925 96863 72481 -168357 78636 267469 -108267 -24689 -309621 50135 174789
6946 174789 -125386 113271 152895 145453 5726 97273 -111415 498071 52783 -227379 -65584
6934 -111167 42594 -177724 -138189 90422 48781 -248422 290976 195757 98654 -250709 -374571
6923 -374571 -194845 -172034 39655 334859 -99423 93128 -171550 -50462 -1080 114877 159315
6912 159315 146903 79666 -78568 23342 -240709 152006 47059 -266315 -33743 -105592 -2293
6900 -39190 -270316 -146742 -104845 -139124 -16971 -257667 -37058 -191551 91194 45374 50230
6889 50230 170171 -200651 -108327 63806 232125 -1333 110667 -77902 -118454 28616 37729
6878 37729 -108199 98353 -107612 142302 -35217 -36730 -155603 -17677 -84068 53700 -176621
6866 -79325 -285548 -960 -200651 -78278 208335 -115489 4833 -38213 152380 -12048 119978
6854 373325 361962 -130069 70488 229238 -35151 -193197 -160840 -423720 -122708 233292
6843 173359 -164459 -307917 -205000 -93524 -111704 -328270 109682 75120 -232809 -34149
6832 130981 170959 -39624 288872 7507 298689 370705 11748 -128520 68142 -89367 91866
6820 -227205 77867 25671 -187887 -409671 173128 94994 -151430 -3585 73357 -96858 -349572
6809 -349572 -20368 45164 -89525 -97374 -5179 157057 71276 -193183 251768 -43778 -136125
6798 -136125 23344 -36821 -192921 -275577 123596 -33635 -1165 96560 -139105 -25518 -488263
6787 -488263 63329 -190587 -226857 200357 -171701 95967 304417 -109542 -352371 -121899
6776 -126576 126514 61666 -132828 -216207 -158787 13819 -45277 110334 -243752 111588 63571
6765 63571 -243284 -201587 -83481 -164449 -70812 -162517 -36324 -314446 -5119 -26339 -130944
6754 -130944 121115 178905 -290118 -192325 -198807 -324890 -308042 -123802 -91256 -215104 286236
6742 217714 -225963 306697 -13793 156646 131944 -319924 -290483 -9793 163118 269603 -186793
6730 51027 -166437 126374 -270007 138102 -76069 298901 -167750 -107670 72477 -29306 39854
6718 255104 -19033 -108917 -278734 -244795 455020 -159087 73270 -51699 -77494 -267958 12820
6706 190123 -130195 274851 -284372 240411 174278 -158560 128910 -283313 -140836 -87626
6696 -87626 39720 80784 111968 -189395 254763 51662 258732 -20769 -190001 1876 -110475
6684 14392 -170914 -41907 -322065 79668 153995 12375 -102934 -54965 -102998 -96315 -291923
6673 -291923 -49632 -87092 9599 -37613 -22108 434601 130414 108331 -80935 12599 -301692
6661 -169327 -233551 -83237 -98167 -85039 24164 -108589 17228 44970 -279752 -155687 -71725
6649 5157 33415 -304067 182301 -105309 64433 -158475 -281271 68520 -31246 173697 -61492
6637 -234403 148176 143302 114258 -72779 -284123 212280 -118996 -159301 53465 108842 -181311
6625 -216133 -198583 124048 144036 452825 -54114 -96526 -212067 95314 -188425 -48661 119133
6613 199877 -38107 97279 63332 -273409 2290 -205878 82279 200331 -130411 241600 52023
6601 199811 -15927 -121937 -75452 67219 -13832 76126 373127 -251604 110334 4996 -262897
6589 -107308 6612 -345815 -40507 30174 -36798 -288181 -236070 68472 76684 -108422 592 -26460
6576 -262476 77705 91314 80773 -250546 -151741 -506053 10082 54555 -99797 55696 -10071
6564 233158 -180016 -81505 104095 120791 120191 -109375 -27670 48309 -236940 -37406 113025
6552 -233894 -143685 -151644 -206512 -390121 -118643 43470 112680 -56877 -141020 -109332 -100387 -295925
6540 -295925 127123 53253 -205325 189687 70097 169473 350589 -279370 -17620 -212053
6530 -212053 502280 27777 56919 84977 -238122 39816 -141272 -16127 -227471 -165 225375
6518 86954 -153088 -350002 -115926 3955 129828 283552 -243501 -111006 53810 99921 13562
6506 -80009 -527027 -187708 15061 96895 71289 77944 22635 1102 -31390 -89062 -104743 -84224
6494 -84224 16395 -109791 -93872 174809 -287979 127407 13908 -127812 131588 -335113
6483 -187965 83190 -41080 -31139 165116 451636 -297221 222844 23056 191904 -258260 44775
6471 -256311 590679 37420 -253941 178129 -150324 263472 117317 -3685 -62035 -211321
6461 -211321 262120 223968 -378217 -53926 -47704 131864 144407 224890 -126358 74046 12388
6449 -92272 155635 7269 -91199 -205954 -49761 106330 138765 -66409 -79137 -98722 -411682
6438 -411682 41024 161310 -109248 77686 310382 299315 -101753 -206493 138019 39942
6427 -116555 -88704 203904 35239 -308311 191309 -307389 144107 -53923 1700 449450 -133018
6415 187548 126735 -83640 -27085 -124599 -128145 -311948 14285 -362418 236658 65195 -44793
6403 -42814 113530 -291293 -147990 81962 -169273 -5454 -256973 99385 -54243 -45632 21982
6391 -231484 -203692 2133 110906 -134549 -73272 190509 -32145 59121 -143682 118951 46143
6379 -484621 -61913 -39922 17039 -212433 -95022 -438124 -300504 253853 91479 6114 21027
6368 21027 11305 43740 -495273 19969 -84290 302811 99910 233565 -123471 -329038 -97500
6356 122451 -17614 -15763 -28404 -102584 249764 -255364 232463 -214852 -30480 -175492 -457994
6345 -457994 -35379 362921 -77265 181452 -40551 104034 83124 366118 -184416 80209 -418002
6333 -127362 -322084 228923 280229 128827 1492 -62337 -68995 -162689 118441 48937 94462
6322 94462 -170448 214252 -95208 -127883 408853 245562 -83976 -11918 58260 -9533 181363
6310 -161732 71087 28567 92721 -13434 -292711 -244258 -11069 -212598 -90737 -270726 -155850
6299 -155850 207984 -171888 -51078 87249 -26187 -52865 -92848 65200 320180 170367 78344
6287 -221349 -262702 119130 48538 -253090 303089 -344602 -329939 -137689 -68181 -47684 208976
6275 -63063 28820 53354 75744 111041 44578 -104748 137092 415679 -70303 113437 184164
6264 184164 184915 -354233 89632 51262 83608 38938 -155142 -64286 23670 154238 138358
6253 138358 9762 63707 -46671 -56054 -315646 46185 -68303 -37833 -347813 111232 40703
6241 166999 -64199 171381 57243 46420 47512 -161609 136111 -110964 36783 -239258 153426
6229 -176279 -361667 12163 -22606 134634 -24959 114684 -60535 66875 15959 205547 233959
6218 233959 11373 -59266 57187 -190442 -193349 191859 -6567 129282 -61500 -83096 -25895
6206 -135255 156409 -282947 -264929 -176150 155764 34375 -82222 92926 104138 -19045 -290305
6195 -290305 -70732 -152882 -86907 44014 89093 -33108 -321752 175282 -73005 247834 121180
6183 -16106 -12 83608 -25398 -76190 51883 9284 -28432 54298 226408 -211493 23950 34222
6171 34222 -51200 82078 53656 -70811 77896 -168119 -45797 55042 -107798 176521 -67351
6159 96470 -317081 -149866 -114241 -277681 226396 94810 313788 -225678 -115777 -34493
6148 155234 -54209 57473 83054 -12973 -74387 -148200 -101475 216076 -18196 164658 -18892
6136 -268844 -197085 -75546 -14902 -177581 110504 -178051 -166834 -144046 25731 -7015 145309
6124 -21258 -320719 -355827 27826 79654 277506 -125081 79298 241981 79436 -139973 -58376
6112 70184 131621 44356 17791 113112 24120 111294 -317890 -80500 229490 455 102026 126272
6100 126272 276149 -22500 -47388 88089 327529 24808 -38376 -191143 247053 158606 188083
6089 188083 586287 169365 -30348 -290460 -2487 110703 124075 -248246 130790 70913 -143400
6077 -190284 -59615 -157467 -207018 110563 283942 -18291 203238 53226 -17651 94035 521
6065 23474 -9680 29605 -13148 203845 114227 -113786 61332 163000 -123767 -268916 489954
6053 189717 66576 204306 -149127 -169600 -152953 334334 -87310 -22297 258036 -120967 27568
6041 125774 93975 -104490 79841 -122292 31443 210856 178995 -148747 -18098 143746 -1808
6029 -12969 42219 -148018 37603 238374 -34171 -107953 -206841 -90220 204582 165365 135546
6018 135546 58033 39664 -64314 -196320 -395709 34584 -256791 -109014 -161063 -43547 -291246
6007 -291246 -342415 -285285 -168713 121628 34547 -70562 189219 331872 -340221 19520 -74714
5995 294850 -65385 -151294 -120722 10524 131268 -252017 53782 -57527 -150842 -37711 145515
5983 -215371 -434990 17033 5731 203248 -129139 -77756 -305071 239041 -27949 139030 -150150
5971 -9690 -51339 -55061 -76351 -128450 160331 130107 85483 -59010 386098 -91510 -58234 140156
5958 -241723 -140268 -47170 -119734 -172843 -10706 -32309 -3994 75223 77644 -98947 163179 -284471
5945 -57174 -36332 21197 19054 -172501 68125 210070 -91265 -188060 44426 97392 32476 -207444
5932 107418 -319171 158509 -64381 -64645 -93137 301345 -147490 12228 65073 -159099 -160486
5921 -160486 156157 133253 -231460 107862 361902 -91092 152710 -229952 -32799 -127893
5911 -127893 -155040 220514 -80306 -28533 -146030 -100080 -391686 -194153 133456 90389 73549
5900 73549 64021 71510 -49885 -82236 69681 169250 -2817 -89601 209546 -351005 37477 51042
5888 51042 -12908 -48037 -156788 -116225 196714 -251415 -540556 -55733 130327 46049 156696
5877 156696 43001 315104 142622 292302 -41172 278760 12630 57502 52630 -138916 -227616
5866 -227616 26169 40274 100222 -144670 53016 -32213 181102 -139040 -70535 -66513 -104996
5855 -104996 -339687 -63145 90631 -293714 -155949 -89467 21563 338313 -269417 -133978
5844 -17503 107915 65126 -144763 174238 126558 -106708 -82799 33569 -126729 229635 304528
5833 304528 56957 138868 171501 166810 -32562 -270187 -53399 337069 -149321 -28795 -106791
5822 -106791 79685 209549 -73677 150204 55696 292517 -26008 -63618 65862 -285774 -43887
5810 148313 125168 -65727 -356143 -75423 -28345 -58966 1448 51050 2387 68061 -19716 -214188
5798 -214188 -5204 -14551 -71985 -75990 80211 -36028 -65332 111304 -223744 -410155 120764
5786 -120899 -140720 -197811 -148762 -24327 48850 152305 -104409 -70199 387453 74254 47677
5775 47677 -14070 35836 -131676 132354 76097 449 -73445 64693 -45070 271621 223413 151360
5763 151360 21498 51055 81854 10241 -80453 451745 140017 136155 967 -39769 -385681 -217670
5751 -217670 -295775 204089 -45250 -6922 -130538 16503 -120109 -62279 -583220 8263 183711
5740 183711 33014 12037 -100738 -123291 74907 -56238 203387 -27723 -45745 -38580 -9042 37004
5727 -200160 10541 197858 117806 7995 37332 136098 -603 -63619 -225776 -107988 -103059 -19210
5714 -44439 -185909 77807 -73013 34635 -115091 190711 25346 -69763 141282 -140055 18314
5702 -200457 38184 -39167 -144007 -56607 -451656 -503416 -102111 14914 132291 -3108 -220216
5691 -220216 201848 95901 -529 -44025 27232 -51736 -222855 -251538 4034 -15412 -398806 190876
5678 -196219 -125241 42006 -92669 -234279 -277053 93285 -194708 -21839 149660 285708 205968
5667 205968 -49625 162095 108377 91277 -169323 102196 -138665 13593 23664 -109027 128052
5655 -126155 125890 97189 -6365 163372 146434 24909 216744 134880 -100790 113893 26956
5643 162278 -113258 31910 188574 9188 50102 -233003 -248484 -127771 368120 178150 -9616
5631 46923 121692 101786 95588 86382 22718 -31076 183748 -192178 144267 -62846 -274221
5620 -274221 2519 -126642 -91223 -83809 101739 180662 -57098 -211121 123876 -123190 50204
5608 -393537 -27935 212516 56100 125841 155630 130249 43824 260799 -1580 204053 -144892
5596 -25969 142004 148365 -121263 -68492 5379 193435 -93069 131241 -182046 272976 45728
5584 -155220 114780 -446636 86982 193695 -205489 184427 71572 125027 -147687 -239361
5574 -239361 -85472 52582 241559 23263 109040 351301 -34343 -172563 -9573 -245214 -117071
5562 -197124 97458 -3017 132587 32637 339120 56827 7826 -410006 -78066 -115571 -121627 -435420
5550 -435420 -315000 -26821 -103410 -223938 176276 -158112 215251 24322 11464 -43372 90509
5538 299183 -81907 114533 -104284 -28163 303274 -80146 -143969 -151648 199873 152102 -237492
5526 95628 -178503 193943 -40259 104927 -114729 -44860 -216297 112943 17463 125559
5516 125559 -124963 81648 66195 -154773 -79622 -132676 -92186 23499 52044 124736 121018
5505 121018 152473 28159 49278 -380428 48512 16665 188380 -228211 453876 333683 -85137
5493 108276 -70927 261363 -312610 -155457 230592 -166030 -145403 -206768 -97221 -28225 -321869
5482 -321869 43499 -184030 197555 266857 228488 200475 71371 63814 -65937 -64930 -5980 284762
5469 -214812 115170 -85868 -120130 60054 -33945 -85713 69160 57143 91113 -77489 136142
5457 94851 -25243 -301024 -220875 -218170 -23609 -130629 -115437 -13969 160850 97409 119978
5446 119978 -510 -171909 -190901 172608 -14595 -61907 -19757 254287 306689 49531 -13148
5434 154213 111760 202281 -294123 -246212 240073 153420 281509 -28914 132589 100747 263167
5423 263167 -32964 -315645 18246 48352 -149226 -65582 -112584 132912 -15041 -253088 11723
5411 -145181 46005 287182 -225580 132576 -230717 -125311 -10985 387663 41825 -334516
5400 161737 -181998 412439 182052 6635 -16926 868 223015 109573 97476 -355024 -49504
5388 -294157 -54955 25393 18272 78549 8191 -173849 -101319 120986 -23066 -165310 191175
5376 -78091 -100400 8881 -219452 -44356 265270 -77709 -64595 -194654 35848 66125 324860
5365 324860 -99841 50202 121310 -220903 244308 193242 -152589 -292320 -9924 120566 -99893
5353 40820 251489 -203551 -344738 -60307 11869 -30355 -253589 -32467 192690 31981 -26425
5341 58007 352014 -286030 153469 -161773 -386849 195827 105648 62015 -2703 10668 -5177
5329 225031 -23407 -162195 -212661 332126 29734 -326984 104117 247835 39594 -49725 191804
5317 -130798 92093 -116491 212129 110235 8217 125778 241875 77851 -74252 16627 -125161
5305 -170414 -149054 76446 63343 89063 -82573 -111357 -264178 -48153 158100 -25977 -67272
5294 -67272 -35944 53450 -46885 200779 -166772 223751 105000 -221791 302050 -120610
5283 -279562 253764 7188 -92579 67055 -145192 220839 123074 9757 73528 27470 247235
5272 247235 111301 189818 -134109 132826 23190 -148393 -212411 352 -180657 -97722 241697
5260 187319 -124822 368300 -372278 -162002 -142889 146287 -110954 -9259 262849 -111144
5249 -75443 93385 394434 -17478 213691 96562 68286 273763 -8099 -170006 -180443 -294309
5238 -294309 -127920 -54556 107472 138207 -5756 -70282 -226215 45188 257940 117648 11718
5226 -205276 97421 166919 7795 -101926 -46662 94642 -121639 -114983 81330 133078 248471
5215 248471 98980 149421 -101804 236286 402979 -22931 -149333 -33832 134459 -89269 -98176
5204 -98176 -101562 -286353 21426 75640 240730 -217098 244216 110256 -273224 -62043 206002
5192 -48656 51050 -142869 47279 -171134 302320 162619 62158 -12487 108565 223091 205255
5181 205255 -91688 -150576 241736 109461 128520 40579 114747 141310 224551 67405 39599
5170 39599 -60666 -117313 -380556 238369 95307 -59818 203959 58337 -282254 -59229 -80221
5159 -80221 214035 -61849 -78319 227953 186002 -131875 168428 31405 44629 241799 -264493
5147 -37262 -186303 -25465 -3833 -86255 1742 -177935 -227961 55669 352969 245018 -123279
5135 -26457 -276273 71194 -28116 109753 -136658 -208074 429319 -244951 227501 -219217
5124 -42090 44543 -122740 -7211 219209 28297 -227852 -174537 -258207 45477 60206 -148862
5112 61211 144613 339545 -117028 -263123 -16738 207939 43303 -63014 -193845 195782 203349
5101 203349 -118386 78087 -10362 -51887 -26094 -78666 -122873 78430 -34796 135401 -71035
5089 13183 -37437 197512 109481 15252 -228363 186161 330594 354662 -215472 -276726 429746
5077 21566 -133252 162617 117412 21251 120593 -260465 -125527 276327 -111818 54623 -190932
5065 -173555 -175677 -70692 36572 119874 177121 96480 95380 339098 235379 154426 -105771
5053 -83185 17003 -60025 -90256 40279 -329306 -55756 -26664 146746 -124305 -79569 130216
5041 216422 -46531 90689 -34171 43569 34397 180508 -169638 -168284 189313 132049 131522 211035
5029 211035 -62282 38627 233434 327805 -435186 174326 44813 -88769 4344 -241057 -72464
5017 125319 69460 -388518 -4942 -186409 169079 212565 30113 87960 29146 1900 253033
5006 253033 95570 226988 -130316 65511 66309 -104867 -330430 131685 330348 156601 -10313
4994 28330 142050 56954 42798 225366 -257345 -223055 242147 -153905 163889 189324 -6205
4982 151662 -211624 42930 -156697 211177 -124204 223481 -29642 -29106 54566 56945 166462
4971 166462 -204231 -58048 107732 -126737 -1296 69096 -60551 -28284 -315316 176982 -8405
4959 46272 -124616 -24703 729 10905 -143062 -50063 -282279 -170711 114848 72164 -188275
4947 -172723 -180164 227531 245030 142990 42150 9691 28504 -298420 -257646 -359559 -185760
4936 -185760 -450934 -101290 47532 -28328 -72324 170078 -90110 -29803 -220162 -33803 45951
4924 -143378 -3531 77510 -285290 20330 274472 -11495 65193 -58397 -111247 48590 -182891
4912 -56938 -114694 -132129 -322115 -253065 -92213 35669 179413 -28554 34374 -222855 -42241
4900 57342 -116187 217946 73328 222033 69159 -26174 29329 -57104 -36721 41904 -258355
4888 135609 117504 242657 284588 70784 66887 43241 57097 -122080 -10152 70881 116144
4877 116144 134496 357848 -366277 -7840 184595 15215 55055 -178240 102720 -156924 -287565
4866 -287565 -77727 360626 -96568 18821 132923 290866 -66064 -36706 -153751 77705 163428
4855 163428 76437 -275881 204565 -36338 -164789 -234998 -430287 58737 -44536 31890 -215378
4843 131416 155773 227413 1879 -87450 -123082 8731 133284 -120440 -5144 -85921 86131 -10861
4830 -233253 128457 322877 -43725 4624 -138269 -20966 -110233 27266 -197128 355191 100338
4818 -68158 -120940 154445 -329910 -102677 170454 -91859 113453 116091 162927 -243537 -279872
4807 -279872 200527 265763 -50728 49641 276103 185818 98450 -158655 -168406 -110833 161215
4795 -65021 130967 206458 -175684 -106185 -442241 -66481 339642 -178074 51610 213563 -41995
4783 71874 -243145 -68640 -93569 86086 83980 222805 325539 278547 -202066 129635 156436
4772 156436 -218108 -94423 86640 -67249 140256 163133 99658 -59778 114935 343 -203402
4760 -44313 74779 -182865 74673 106866 203108 23274 1347 188249 -58647 177329 -31986
4748 63227 -65205 -273107 -143315 -53711 -134759 162207 367053 185572 138914 -116602 -86165
4737 -86165 140974 -150555 298377 -153909 276658 -199852 119699 -2996 59745 -3386 126510
4725 -186962 218510 46498 -129590 80291 109303 3258 -303810 232711 239456 -117540 -171403
4714 -171403 54176 190650 154294 -167532 -61931 -179997 15318 119682 15577 165262 105436
4703 105436 119985 109337 124354 -121771 -44812 322135 90776 170490 -258783 -321408 -73779
4691 163603 50453 192 120249 139702 21690 49480 163244 -3509 -92984 182416 152907 -157657
4678 -2657 -120162 47552 129383 89627 -235770 -175448 59464 -101156 -33515 -203012 -119810
4667 -119810 -244741 -185110 -26490 33126 -17982 246338 11216 164998 -177588 -182454 156381
4655 -322923 -90893 -60720 192372 -217135 -79414 98589 -158860 -4147 -13780 266542 89125
4643 136137 -32135 -158222 79880 -124196 -207574 -79706 -137670 11791 -47562 47985 -74565
4631 21723 133843 118943 -33417 30479 -47628 313756 -90366 -101667 -112814 -166453 92072
4619 9188 -237035 -329359 80783 114597 144403 -188142 -152239 -116798 -39029 37769 130681 71310
4607 71310 89996 -93248 275743 148663 135970 -141975 -56211 -140374 209220 -142732 40837
4595 -51572 204331 -133145 -157997 322503 -78749 -64255 -235224 86113 188507 -32118 -4603
4583 120957 290000 288487 238724 66956 84583 -8772 14906 -175107 -168902 209891 -147973
4571 9010 -111798 -5151 -25532 173864 -51203 59823 254557 14196 42993 -34000 232839
4559 -8866 118901 -262980 -108784 169124 129301 14064 145400 -67508 17800 -302712 95397
4547 -95305 35953 -108566 -169070 89954 58443 234049 -214775 -45471 -259941 211345 -11266
4535 182138 -153743 -243432 115427 31207 9237 -228638 -5516 -21379 41016 -74754 -255153
4524 -255153 -328585 273624 147215 -66756 -24895 -299787 91223 310824 90898 141024 -74670
4512 -67862 78792 -429278 -140210 -197469 16344 -253940 289006 -97167 -38984 390270 26539
4500 69845 -104374 -207334 -15436 85700 -7487 -166536 45654 130665 338072 57640 -254835
4488 94719 -188736 226921 286249 12241 -153030 14706 248973 -885 46612 -208847 102730
4476 -87676 612057 17292 104714 -163934 129392 -102965 -6915 -41947 -8544 114489 -135028
$$ [...]
##END NTUPLES=NMR SPECTRUM
##END=
