
##TITLE=AC1400_DOM12184_7525329_u6JawmxKED
##JCAMPDX= 6.0         $$ Bruker NMR JCAMP-DX V2.0
##DATA TYPE= NMR SPECTRUM
##DATA CLASS= NTUPLES
##ORIGIN= BRUKER
##OWNER= Administrator
$$ 1.72 TOPSPIN		Version 2.1
$$ 2013-02-20 00:18:47.043 -0500  Administrator@X
$$ Compression mode = diff/dup
##.OBSERVE FREQUENCY= 400.02188249412
##.OBSERVE NUCLEUS= ^1H
##.ACQUISITION MODE= SIMULTANEOUS (DQD)
##.ACQUISITION SCHEME= undefined
##.AVERAGES= 64
##.DIGITISER RES= 22
##SPECTROMETER/DATA SYSTEM= spect
##.PULSE SEQUENCE= noesygpps1d.comp
##.SOLVENT NAME= COFFEE_meoh
##.SHIFT REFERENCE= INTERNAL, COFFEE_meoh, 1, 14.96086
##AUDIT TRAIL= $$ (NUMBER, WHEN, WHO, WHERE, PROCESS, VERSION, WHAT)
$$ ##TITLE= Audit trail, TOPSPIN		Version 2.1
$$ ##JCAMPDX= 5.01
$$ ##ORIGIN= Bruker BioSpin GmbH
$$ ##OWNER= Administrator
$$ $$ E:\/data/COFFEE/nmr/AC1400_DOM12184_7525329_u6JawmxKED/12/pdata/1/auditp.txt
$$ ##AUDIT TRAIL=  $$ (NUMBER, WHEN, WHO, WHERE, PROCESS, VERSION, WHAT)
(   1,<2013-02-20 00:18:41.168 -0500>,<Administrator>,<X>,<go>,<TOPSPIN 2.1>,
      <created by zg
	started at 2013-02-20 00:07:11.306 -0500,
	POWCHK enabled, PULCHK disabled,
       configuration hash MD5:
       86 BA 57 50 F2 9D 5C 9B 26 00 A9 28 5F 66 2E 89
       data hash MD5: 64K
       0E 07 47 49 FE 12 CE 00 2E C6 97 E3 E3 DF DF 25>)
(   2,<2013-02-20 00:18:44.246 -0500>,<Administrator>,<X>,<proc1d>,<TOPSPIN 2.1>,
      <Start of raw data processing
       efp LB = 0.3 FT_mod = 6 PKNL = 1 PHC0 = 0 PHC1 = 0 SI = 128K 
       data hash MD5: 128K
       36 C6 7D B5 8E 83 5F 6B CC DA BE E5 B7 4F 92 EB>)
(   3,<2013-02-20 00:18:45.308 -0500>,<Administrator>,<X>,<proc1d>,<TOPSPIN 2.1>,
      <pk PHC0 = 253.8007 PHC1 = 0 
       data hash MD5: 128K
       42 4C 1C F8 B2 C7 7B 4E 10 9C E5 C9 46 3D 7A 36>)
(   4,<2013-02-20 00:18:45.964 -0500>,<Administrator>,<X>,<proc1d>,<TOPSPIN 2.1>,
      <abs ABSG = 1 
       data hash MD5: 128K
       AE 5F 8C EF 6C AC C3 CF A2 6A 09 43 CB 5F F5 3A>)
(   5,<2013-02-20 00:18:46.152 -0500>,<Administrator>,<X>,<proc1d>,<TOPSPIN 2.1>,
      <abs ABSG = 2 
       data hash MD5: 128K
       29 3A FF 70 36 AB FB C8 74 7D 52 6E E7 04 43 9D>)
(   6,<2013-02-20 00:18:46.308 -0500>,<Administrator>,<X>,<proc1d>,<TOPSPIN 2.1>,
      <abs ABSG = 3 
       data hash MD5: 128K
       95 B4 41 0C 29 21 58 5A 47 B7 A3 D8 D7 F4 6F 2F>)
(   7,<2013-02-20 00:18:46.480 -0500>,<Administrator>,<X>,<proc1d>,<TOPSPIN 2.1>,
      <abs ABSG = 4 
       data hash MD5: 128K
       D2 37 77 F0 50 85 C0 4A 82 5D 1E D1 81 5B E7 F2>)
(   8,<2013-02-20 00:18:46.668 -0500>,<Administrator>,<X>,<proc1d>,<TOPSPIN 2.1>,
      <abs ABSG = 5 
       data hash MD5: 128K
       1F 8F B9 D2 A8 93 FB 6C B6 C0 9A 76 14 D0 D1 E5>)
$$ ##END=
$$ 
$$ $$ hash MD5
$$ $$ E6 26 45 BD 09 8B 7F 2F 79 44 35 B4 6C F9 3B DC
##$RELAX= 
##$RELAX= 
##$RELAX= 
##$RELAX= 
##$RELAX= 
##$RELAX= 
##$RELAX= 
##$RELAX= 
$$ Bruker specific parameters
$$ --------------------------
##$DU= <E:\>
##$EXPNO= 12
$$ [...]
150 150 150 150 150 150 150 150
##$TP07= 0
##$TPNAME0= <>
##$TPNAME1= <>
##$TPNAME2= <>
##$TPNAME3= <>
##$TPNAME4= <>
##$TPNAME5= <>
##$TPNAME6= <>
##$TPNAME7= <>
##$TPOAL= (0..7)
0.5 0.5 0.5 0.5 0.5 0.5 0.5 0.5
##$TPOFFS= (0..7)
0 0 0 0 0 0 0 0
##$TUNHIN= 0
##$TUNHOUT= 0
##$TUNXOUT= 0
##$USERA1= <user>
##$USERA2= <user>
##$USERA3= <user>
##$USERA4= <user>
##$USERA5= <user>
##$V9= 5
##$VALIST= <valist>
##$VCLIST= <CCCCCCCCCCCCCCC>
##$VD= 0
##$VDLIST= <DDDDDDDDDDDDDDD>
##$VPLIST= <PPPPPPPPPPPPPPP>
##$VTLIST= <TTTTTTTTTTTTTTT>
##$WBST= 1024
##$WBSW= 4
##$XGAIN= (0..3)
0 0 0 0
##$XL= 0
##$YL= 0
##$YMAX_a= 6001118
##$YMIN_a= -10177265
##$ZGOPTNS= <>
##$ZL1= 120
##$ZL2= 120
##$ZL3= 120
##$ZL4= 120
##$ABSF1= 14.96086
##$ABSF2= -5.597322
##$ABSG= 5
##$ABSL= 3
##$ALPHA= 0
##$AQORDER= 0
##$ASSFAC= 0
##$ASSFACI= 0
##$ASSFACX= 0
##$ASSWID= 0
##$AUNMP= <proc_prof1d_extract.lims>
##$AXLEFT= 0
##$AXNAME= <>
##$AXNUC= <1H>
##$AXRIGHT= 0
##$AXTYPE= 0
##$AXUNIT= <>
##$AZFE= 0.1
##$AZFW= 0.1
##$BCFW= 0
##$BC_mod= 0
##$BYTORDP= 0
##$COROFFS= 0
##$CY= 15
##$DATMOD= 1
##$DC= 0
##$DFILT= <>
##$DTYPP= 0
##$F1P= 0
##$F2P= 0
##$FCOR= 0.5
##$FTSIZE= 131072
##$FT_mod= 6
##$GAMMA= 0
##$GB= 0
##$INTBC= 1
##$INTSCL= 1
##$ISEN= 128
##$LB= 0.3
##$LEV0= 0
##$LPBIN= 0
##$MAXI= 10000
##$MC2= 0
##$MEAN= 0
##$ME_mod= 0
##$MI= 0
##$NCOEF= 0
##$NC_proc= -2
##$NLEV= 6
##$NOISF1= 0
##$NOISF2= 0
##$NSP= 0
##$NTH_PI= 0
##$NZP= 0
##$OFFSET= 14.96086
##$PC= 1
##$PHC0= 253.8007
##$PHC1= 0
##$PH_mod= 1
##$PKNL= yes
##$PPARMOD= 0
##$PPDIAG= 0
##$PPIPTYP= 0
##$PPMPNUM= 2147483647
##$PPRESOL= 1
##$PSCAL= 4
##$PSIGN= 0
##$PYNMP= <proc.py>
##$REVERSE= no
##$SF= 400.020009693594
##$SI= 131072
##$SIGF1= 0
##$SIGF2= 0
##$SINO= 400
##$SIOLD= 131072
##$SPECTYP= <>
##$SREGLST= <1H.CDCl3>
##$SSB= 0
##$STSI= 131072
##$STSR= 0
##$SW_p= 8223.68421052631
##$SYMM= 0
##$S_DEV= 0
##$TDeff= 65536
##$TDoff= 0
##$TI= <>
##$TILT= no
##$TM1= 0
##$TM2= 0
##$TOPLEV= 0
##$USERP1= <user>
##$USERP2= <user>
##$USERP3= <user>
##$USERP4= <user>
##$USERP5= <user>
##$WDW= 1
##$XDIM= 131072
##$YMAX_p= 388468023
##$YMIN_p= -11889
##$CURPLOT= <Network HP LaserJet P1505>
##$CURPRIN= <$Network HP LaserJet P1505>
##$DFORMAT= <normdp>
##$LAYOUT= <+/1D_H.xwp>
##$LFORMAT= <normlp>
##$PFORMAT= <normpl>
##$SURQMSG= 1
$$ End of Bruker specific parameters
$$ ---------------------------------
##NTUPLES= NMR SPECTRUM
##VAR_NAME=  FREQUENCY,     SPECTRUM/REAL,   SPECTRUM/IMAG
##SYMBOL=    X,             R,               I
##VAR_TYPE=  INDEPENDENT,   DEPENDENT,       DEPENDENT
##VAR_FORM=  AFFN,          ASDF,            ASDF
##VAR_DIM=   131072,        131072,          131072
##UNITS=     HZ,            ARBITRARY UNITS, ARBITRARY UNITS
##FACTOR=    0.0627417313425164, 1,          1
##FIRST=     8223.62146879497, 1815,         -59756
##LAST=      0,             3403,            -59946
##MIN=       0,             -11889,          0
##MAX=       8223.62146879497, 388468023,    0
$$ Real data points
##PAGE= N=1
##DATA TABLE= (X++(R..R)), XYDATA
$$ [...]
67869 80354 78851 77567 77178 77573 78586 80147 81708 82321 81596 80171 78981 78374 78075 77694 77051 76230 75450
67852 75450 74782 73958 72700 71232 70176 69852 70015 70375 70958 71673 71878 70885 68832 66670 65274 64798 64919
67835 64919 65347 65972 66689 67336 67820 68271 69081 70721 73338 76510 79555 82189 84753 87647 90689 93270
67819 93270 95103 96508 97870 99080 99810 100134 100457 100857 100877 100148 98877 97470 95958 94090 91752 88896
67803 88896 85262 80762 76166 72813 71357 71144 71093 70829 70595 70401 69847 68757 67463 66292 65150 63851
67787 63851 62575 61688 61227 60886 60563 60547 61027 61612 61672 61104 60443 60154 60140 60176 60488 61510 63128 64595 65282
67768 65282 65248 65015 65082 65730 67017 68757 70657 72522 74168 75222 75436 75215 75375 76157 76989 77458 77933 78752
67750 78752 79327 78839 77548 76605 76575 76851 76647 75909 75034 74218 73387 72423 71247 69971 69066 69000 69597 70136 70235
67731 70235 70187 70272 70186 69484 68188 66649 65115 63730 62635 61780 60909 59976 59196 58448 57176 55330 53910
67714 53910 53901 55049 56239 56799 56745 56139 55126 54516 55231 57018 58520 58954 58882 58949 58748 57640 56064 55143
67696 55143 55233 55623 55609 55176 54584 53846 52876 51783 50825 50205 49989 50091 50334 50647 51151 51915 52731 53327 53688
67677 53688 53908 53834 53207 52164 51287 51013 51199 51380 51241 50785 50271 50110 50644 51791 53025 53887 54425 54971
67659 54971 55567 55869 55666 55246 55088 55358 55875 56475 57162 57848 58199 57942 57242 56633 56585 57215 58321 59460 60060
67640 60060 59730 58636 57522 57176 57868 59250 60717 61868 62676 63300 63721 63694 63124 62373 61971 62103 62591 63290
67622 63290 64142 64864 65034 64673 64378 64609 65107 65283 64971 64500 64242 64340 64743 65197 65366 65247 65295 65810 66340 66117
67602 66117 65014 63665 62660 62003 61464 60999 60651 60277 59670 58829 57982 57353 56908 56293 55205 53909 53178
67585 53178 53410 54002 54038 53460 53054 53275 53652 53491 52744 51963 51785 52601 54287 56005 56681 56032 54852 54096
67567 54096 54030 54441 55149 55888 56148 55726 55187 55238 55789 56100 55734 54912 54098 53686 53938 54697 55181 54616 53120
67548 53120 51533 50411 49714 49429 49769 50536 50913 50373 49345 48601 48305 48126 47988 48144 48631 49147 49528 49976
67530 49976 50697 51642 52666 53722 54699 55238 54925 53722 52121 50858 50426 50804 51591 52397 53109 53760 54162
67513 54162 53831 52467 50513 49021 48734 49398 50170 50623 51022 51622 52159 52297 52226 52355 52595 52354 51293 49809
67495 49809 48686 48471 49146 50222 51144 51744 52236 52676 52659 51829 50475 49276 48598 48426 48824 49879 51217
67478 51217 52139 52396 52345 52198 51673 50663 49734 49543 50055 50727 51198 51489 51677 51738 51596 51142 50353 49494 48996
67459 48996 48984 49182 49416 49857 50596 51369 51954 52441 52813 52706 52019 51385 51511 52332 53269 54013 54557 54745 54473
67440 54473 54135 54180 54338 53946 53041 52420 52546 53066 53537 54025 54696 55385 55863 56102 56066 55633 54977 54636 54938 55671
67420 55671 56483 57222 57669 57434 56408 55006 53680 52552 51702 51378 51549 51643 51181 50414 50013 50335 51319 52770
67402 52770 54349 55534 56008 55981 55848 55801 55956 56434 56922 56599 55082 53152 51870 51261 50599 49773 49422 49692
67384 49692 49822 49341 48882 49312 50558 51831 52601 52887 52874 52727 52630 52639 52621 52564 52775 53464 54406 55298 56179 57147
67364 57147 57886 58000 57709 57697 58222 58799 58870 58431 57861 57467 57322 57293 57035 56192 54817 53437 52571 52329 52554
67345 52554 53102 53778 54238 54318 54417 55190 56750 58368 59093 58582 57304 56034 55256 54961 54907 54989 55324 55953 56586
67326 56586 56830 56710 56730 57269 58047 58363 57855 56787 55671 54831 54439 54644 55350 55945 55653 54339 52746 51751
67308 51751 51534 51721 52172 53177 54728 56061 56368 55844 55563 56267 57676 59152 60585 62168 63612 64217
67292 64217 63823 63164 62994 63265 63468 63522 63809 64419 64819 64459 63428 62278 61378 60614 59747 58864 58362 58478 58893
67273 58893 58970 58438 57740 57579 58230 59441 60864 62286 63467 64162 64468 64878 65753 66853 67567 67454 66499 65064
67255 65064 63741 63072 63111 63420 63661 63951 64396 64604 64181 63522 63500 64373 65556 66530 67315 67886 67806 66883 65588
67236 65588 64324 62801 60820 59205 59098 60517 62443 64286 66356 68764 70776 71729 71878 71816 71605 71027
67220 71027 70239 69530 68710 67466 66224 65966 67027 68544 69332 69029 68214 67567 67100 66227 64583 62727 61851
67203 61851 62657 64696 66890 68469 69240 69282 68770 68023 67359 66908 66749 67072 67953 69154 70394 71639 72833
67186 72833 73580 73542 73003 72597 72601 72896 73481 74425 75382 75814 75771 75881 76430 77035 77361 77581 77850 77905 77541 77048 76794
67165 76794 76755 76762 76819 76838 76489 75751 75247 75523 76278 76773 76750 76479 76119 75611 75152 75246 76151 77556 78847 79571 79764
67144 79764 79960 80711 81893 82746 82799 82492 82585 83315 84461 85863 87324 88339 88547 88318 88344 88763 89236 89708
67126 89708 90467 91529 92564 93389 93949 93887 92880 91448 90638 90738 91017 90958 90968 91543 92475 93426 94606 96243
67108 96243 97888 98992 99786 100842 102000 102485 102141 101831 102399 103662 104687 104801 104124 103330 103048 103408 104068
67091 104068 104632 105053 105603 106530 107754 108834 109304 109178 109014 109238 109520 109279 108776 109121 110933 113524 115765
67074 115765 117296 118439 119364 119974 120369 120756 121039 121120 121517 123020 125588 128201 130018 131197 132305 133429
67058 133429 134214 134485 134381 134053 133567 133094 132979 133598 135216 137834 141045 144187 146802 148855 150423 151384
67042 151384 151654 151604 151901 152883 154312 155785 157200 158711 160401 162229 164241 166602 169337 172127 174501
67027 174501 176189 177227 177808 178216 178885 180300 182652 185609 188574 191192 193580 196058 198701 201181 203116
67012 203116 204541 205962 207862 210233 212714 215079 217388 219691 221891 223950 226006 228186 230554 233399
66998 233399 237243 242232 247656 252410 255946 258621 261183 264143 267578 271284 275040 278854 282962 287494
66984 287494 292199 296602 300455 303921 307405 311324 315897 321022 326401 331918 337734 343863 349834 355118
66970 355118 359810 364597 370044 376190 382847 389950 397446 405047 412301 418952 425256 431927 439559 447982
66956 447982 456403 464413 472549 481477 490871 499719 507681 515508 524001 533206 542876 553102 564066 575603
66942 575603 587500 599861 612749 625762 638474 651129 664455 678853 694126 709812 725470
66931 725470 740852 756252 772464 789902 807901 825474 842647 860380 879162 898475 917883
66920 917883 937931 959462 982509 1006399 1030648 1055286 1080463 1106213 1132567 1159587 1187280
66909 1187280 1215635 1244630 1274113 1303844 1333794 1364158 1394907 1425690 1456395 1487450 1519239
66898 1519239 1551633 1584537 1618390 1653454 1688901 1723514 1757228 1791128 1825814 1860623 1894730
66887 1894730 1928167 1961224 1993560 2024586 2054301 2083015 2110499 2136064 2159443 2181114 2201783
66876 2201783 2221838 2241146 2258938 2274037 2285693 2294187 2300388 2304798 2307327 2307713 2305647 2300661 2292553
66863 2292553 2282018 2270292 2257972 2244481 2228792 2210338 2189201 2165801 2140615 2113932 2085861
66852 2085861 2056667 2026912 1996839 1965857 1933232 1899259 1865113 1831519 1798252 1765047 1732124
66841 1732124 1699465 1666315 1632024 1596874 1561578 1526486 1491820 1458109 1425638 1393847 1362058
66830 1362058 1330569 1300263 1271312 1243079 1215198 1187934 1161338 1134937 1108577 1082885 1058437
66819 1058437 1034929 1011625 988293 965266 942830 921036 899958 879726 860215 841092 822256
66808 822256 804039 786774 770280 754009 737705 721713 706447 691750 677085 662351 648127
66797 648127 634964 622747 611002 599591 588769 578716 569285 560114 550698 540502 529354 517764
66785 517764 506594 496366 486965 477904 468694 459142 449534 440408 431971 423947 416225 409286 403556 398545
66771 398545 393245 387292 381155 375163 368953 362184 355311 349293 344612 340794 336777 331722 325596 319060
66757 319060 312761 306880 301442 296696 292830 289592 286684 284249 282435 280645 277984 274427 270785 267395
66743 267395 263624 259043 254336 250499 247647 245159 242646 240129 237510 234460 230926 227413 224665 223128
66729 223128 222592 222252 221298 219572 217438 214980 211727 207402 202610 198417 195403 193370 191747 190050 188105
66714 188105 186131 184485 183216 181992 180565 179035 177483 175662 173353 170823 168630 167021 165732 164318
66700 164318 162555 160629 158970 157808 156862 155610 153804 151497 148789 146010 143989 143427 143872 143988 143050
66685 143050 141583 140292 139080 137561 135871 134422 133340 132644 132498 132714 132508 131334 129596 128007 126709
66670 126709 125616 125052 125204 125378 124678 123220 121899 121191 120977 121214 121754 121641 119718 116135 112373 109634
66654 109634 107975 107128 107184 108059 109065 109516 109282 108520 107413 106339 105685 105241 104422 103298 102699 102950 103231
66637 103231 102631 101231 99713 98528 97976 98429 99742 100854 100735 99531 98196 97216 96265 94964 93408 91946
66621 91946 90854 90246 90011 89925 89943 90178 90403 90002 88813 87634 87377 87895 88201 87721 86792 85988 85460 85059 84705
66602 84705 84471 84490 84833 85337 85646 85567 85261 84912 84433 83730 83006 82486 82068 81590 81222 81172 81256 81251 81444 82143 82830
66581 82830 82567 81376 80423 80519 81140 81355 81120 80978 80922 80339 79026 77597 76714 76408 76332 76316 76363 76304 75786 74662
66561 74662 73319 72532 72850 73990 74905 74694 73465 72121 71305 70881 70539 70475 71025 71892 72322 72130 71970 72355
66543 72355 72845 72673 71858 71126 70881 70812 70623 70553 70835 71053 70582 69540 68775 68833 69272 69225 68378 67126 65888
66524 65888 64696 63523 62640 62297 62266 62104 61847 61980 62637 63259 63363 63263 63600 64390 65002 65042 64832 64994 65848
66505 65848 67235 68577 69065 68141 65991 63456 61412 60313 60124 60388 60443 59928 59119 58529 58232 57898 57355
66488 57355 56692 55940 55163 54794 55283 56400 57531 58722 60622 63136 64994 65213 64270 63194 62140 60676
66472 60676 58999 57885 57563 57521 57475 57770 58675 59867 60840 61357 61405 61170 61162 61892 63178 64139 64115 63308 62352 61554
66452 61554 60801 59988 59248 58851 59000 59612 60253 60442 60130 59723 59603 59757 59958 60100 60189 60195 60105 60053 60198 60493 60686
66431 60686 60632 60471 60477 60733 61090 61422 61769 62191 62600 62900 63149 63384 63422 63074 62489 61926 61296 60380 59513 59455 60347
66410 60347 61305 61399 60660 59781 59218 59009 59102 59355 59383 58910 58149 57523 57211 57278 57915 59038 59942 59968 59359 58897
66390 58897 58840 58820 58674 58667 58876 59032 59100 59408 60002 60408 60225 59550 58691 57960 57778 58398 59354 59727 59264 58716 58847
66369 58847 59540 60176 60385 60123 59472 58775 58596 59181 60182 61161 62005 62594 62529 61599 60217 59022 58312 58096
66351 58096 58320 58699 58739 58372 58210 58706 59421 59604 59185 58621 58092 57498 57090 57364 58338 59532 60709 62019
66333 62019 63334 64076 63922 63152 62057 60473 58276 56055 54827 55140 56675 58589 60115 60897 61051 60931
66317 60931 60847 60919 61111 61246 61079 60548 59934 59606 59599 59613 59472 59352 59544 60143 61020 61919 62559 62768 62608 62279 61942
66296 61942 61699 61655 61756 61638 60909 59687 58575 57976 57661 57206 56699 56728 57635 58992 59921 59962 59528 59465 60142
66277 60142 61098 61664 61821 62205 63291 64724 65638 65536 64798 64297 64517 65057 65028 63985 62438 61376 61362 62099
66259 62099 62785 62786 62074 61135 60452 60039 59579 59015 58721 58917 59219 59138 58806 58724 58907 58846 58436 58333 59042 60066
66239 60066 60444 59894 59015 58470 58420 58738 59372 60314 61451 62560 63347 63499 62926 61999 61392 61565 62486 63791
66221 63791 65007 65649 65435 64603 63791 63451 63522 63778 64214 64816 65241 65147 64729 64510 64615 64712 64692 64906 65479 65924
66201 65924 65821 65548 65831 66710 67474 67591 67261 66970 66866 66728 66298 65538 64783 64679 65675 67442 69030 69737
66183 69737 69656 69293 68952 68658 68406 68185 67924 67715 67960 69029 70694 72134 72559 71816 70483 69476 69497 70598
66165 70598 72198 73594 74479 74949 75066 74588 73241 71249 69470 68854 69653 71221 72661 73546 73951 73975 73588
66148 73588 72891 72189 71708 71468 71462 71700 72064 72439 73024 74089 75264 75605 74737 73539 73182 73717 74143 73784 73040
66129 73040 72740 73226 74266 75524 76850 78196 79415 80206 80320 79942 79655 79857 80289 80430 80250 80238 80669 81198
66111 81198 81291 80857 80267 79878 79653 79229 78374 77398 77007 77649 79082 80747 82411 84180 85952 87218 87497
66094 87497 86799 85605 84528 83994 84053 84415 84770 85067 85420 85855 86280 86627 86845 86876 86827 87015 87555 88046 87991 87508
66074 87508 87268 87689 88512 89189 89402 89180 88826 88749 89038 89166 88481 87127 86080 86115 87052 88206 89253 90297
66056 90297 91330 92018 92031 91369 90330 89251 88315 87585 87210 87397 88069 88707 88812 88434 87986 87698 87615 87970 88947
66037 88947 90056 90366 89613 88593 88221 88634 89449 90365 91146 91531 91666 92257 93771 95722 97272 98285 99287
66020 99287 100573 101896 102932 103522 103518 102928 102229 102132 102953 104557 106827 109697 112704 115038 116251 116590 116504
66003 116504 116202 115809 115563 115570 115637 115620 115791 116707 118785 122036 125945 129526 131851 132835 133399 134625 136755 139115
65985 139115 140885 141812 142269 142806 143664 144588 145100 144923 144083 142678 140760 138524 136386 134629 133005 130935
65969 130935 128159 125093 122403 120331 118612 117068 115998 115760 116071 116142 115526 114516 113546 112586 111442 110337
65953 110337 109765 109872 110366 111021 111895 113048 114376 115769 117159 118438 119630 121097 123233 125869 128398
65938 128398 130556 132706 135166 137660 139670 141037 141976 142753 143583 144620 145787 146821 147720 148891 150602
65923 150602 152543 154229 155606 156861 157911 158616 159406 161128 164051 167465 170481 172939 175303 177915 180658
65908 180658 183242 185570 187758 189953 192156 194121 195391 195534 194471 192646 190850 189717 189316 189260 189257 189460
65892 189460 190122 190966 191165 190058 187773 184977 182059 178784 174863 170656 166965 164083 161401 158217 154638
65877 154638 151290 148326 145299 142053 139122 136973 135400 134055 133119 132802 132558 131572 130013 129051 129399 130448
65861 130448 131148 131243 131207 131338 131439 131247 130718 129895 128867 127953 127618 128008 128649 128783 128055 126918 126300 126827 128327
65842 128327 130114 131661 132895 133939 134853 135638 136254 136507 136163 135300 134378 133813 133667 133852 134372 135181 136039
65825 136039 136846 137955 139825 142431 145353 148405 151885 156167 161259 166818 172343 177263 181088 183683
65811 183683 185323 186415 187100 187127 186122 184052 181474 179115 177175 175250 173059 170906 169113 167375 165252
65796 165252 163048 161497 160498 158945 156124 152773 150282 149254 149281 149800 150609 151697 153109 155105 158098
65781 158098 162289 167467 173151 178850 184282 189571 195177 201582 209163 218303 229138 240851 251599
65768 251599 259691 264752 267371 267823 265713 260845 253762 245256 235792 225663 215355 205473 196557 189132
65754 189132 183673 180318 178856 179136 181227 185013 189997 195841 202833 211500 221840 233260 245119 257143
65740 257143 269399 282194 295849 310231 324393 336954 346905 353924 357952 358744 356019 349908 341113
65727 341113 330571 318943 306434 293069 279069 264810 250508 236250 222450 209940 199239
65716 199239 189945 181216 172790 165131 158547 152641 146891 141437 136920 133678 131446 129857 128938 128909 129634
65701 129634 130504 130906 130720 130291 130011 130007 130121 130029 129442 128401 127447 127245 127919 128932 129769 130514 131494 132614 133406
65682 133406 133731 133989 134619 135725 137343 139672 142760 146272 149897 153894 158864 165004 171951 179461 187986
65667 187986 198364 210997 225500 241150 257504 274523 292182 310131 327757 344454 359696
65656 359696 372977 383955 392728 399725 405164 408766 410259 410012 408898 407537 406002 404357 403115 402899
65642 402899 403818 405483 407463 409386 410626 410303 407809 403085 396178 386791 374566 359688 342917 324996
65628 324996 306315 287160 268076 249834 233162 218537 206032 195264 185645 176847 168946 162068
65616 162068 156094 150804 146111 141912 137836 133425 128671 124199 120848 119080 118702 119037 119389 119557 119888
65601 119888 120727 121843 122584 122632 122359 122320 122588 122853 122998 123252 123685 123853 123243 122025 121087 121214 122347 123819
65583 123819 125166 126510 128188 130298 132814 135901 139871 144884 150949 158219 166985 177309 188856 201278
65569 201278 214612 229096 244724 261166 278078 295150 311849 327326 340798 351837 360165 365337
65557 365337 366892 364778 359420 351365 340990 328506 314025 297704 280162 262739 246844 232766
65545 232766 219459 205899 192430 180425 170833 163502 157789 153279 149809 147263 145539 144454 143615
65532 143615 142749 142189 142565 143847 145141 145643 145367 144664 143558 141970 140153 138335 136245 133586 130774 128556
65516 128556 126979 125391 123452 121582 120324 119793 119893 120517 121342 121844 121817 121542 121333 121295 121634 122676 124280
65499 124280 125690 126386 126720 127310 128144 128736 128885 128774 128521 128147 127922 128217 129003 129935 130957 132427 134591
65482 134591 137318 140432 143873 147382 150465 152847 154666 156024 156729 156708 156282 155663 154499 152351 149453
65467 149453 146487 143722 140904 137935 135137 132676 130265 127706 125347 123620 122386 121132 119623 118048
65453 118048 116661 115620 115128 115332 116016 116643 116771 116301 115420 114487 113906 113872 114328 115336 117241 120067 122936
65436 122936 124709 125234 125445 126168 127424 128995 130876 132786 133978 134227 134542 136120 138761 141007 141704 140891
65420 140891 139215 137177 135078 133173 131640 130577 130094 130211 130820 131961 133893 136455 138634 139407 138943
65405 138943 138383 138438 138766 138751 138280 137616 137036 136790 136905 136972 136666 136519 137525 139812 142437 144706 146897 149248
65387 149248 151073 151661 151432 151377 151666 151611 150815 149639 148541 147565 146595 145674 144982 144683 144718 144567 143539 141606
65369 141606 139724 138926 139302 140224 141267 142415 143669 145112 147227 150517 154774 159231 163463 167666 172087
65354 172087 176705 181553 186833 192581 198604 204826 211233 217369 222316 225457 226989 227508 227301 226194 223939
65339 223939 220688 217125 213981 211241 208117 204113 199859 196363 193633 190635 186614 181805 176837 172036
65325 172036 167494 163255 159215 155312 151970 149907 149304 149601 150195 150821 151155 150818 150073 149783 150135 150028 148326
65308 148326 145274 142035 139207 136528 133784 131246 129212 127695 126702 126340 126569 127168 128025 129255 131049
65293 131049 133541 136651 139884 142510 144283 145715 147325 148866 149736 149909 149890 149842 149320 147955 145943 143850
65277 143850 142317 141853 142381 142951 142505 141116 140000 140169 141511 143304 144970 146007 145835 144371 142457 141135
65261 141135 140614 140355 139988 139608 139325 139106 139141 139883 141527 143773 146233 148720 151026 152792 153874 154513 154862
65244 154862 154576 153197 150765 147674 144113 140148 136344 133716 132718 132643 132350 131410 130294 129704 130074 131531
65228 131531 133756 135835 136733 136242 135230 134736 134987 135412 135409 134778 133599 132061 130533 129525 129368 129906 130525
65211 130525 130535 129628 128068 126453 125273 124692 124666 125114 125883 126697 127292 127613 127805 128045 128390 128750 128917 128685
65193 128685 128032 127184 126469 126148 126349 127041 127993 128874 129554 130245 131233 132454 133382 133433 132486 131069 130040 130032 131112
65174 131112 132878 134744 136177 136869 136894 136668 136587 136721 136904 136985 136793 136132 135142 134550 135036 136332 137460 137998
65156 137998 138603 139904 141433 142202 142085 141970 142556 143495 143951 143670 143261 143536 144771 146663 148919 151719 155404
65139 155404 159850 164478 168967 173585 178634 183879 188815 193192 196975 200127 202821 205664 209225 213359
65125 213359 217368 220753 223500 225749 227566 229031 230238 231236 232181 233318 234505 235034 234394 232985 231460
65110 231460 229592 226547 222234 217507 212839 207604 201130 193823 186775 180739 175899 172120 168929 165628
65096 165628 161990 158570 155888 153612 151103 148484 146520 145519 144943 144168 143178 142398 142175 142521 143138 143660
65080 143660 144025 144526 145342 146182 146622 146586 146164 145218 143608 141698 140141 139208 138728 138645 139088 139896 140585 140959
65062 140959 141278 141680 141907 141839 141886 142527 143739 145168 146525 147553 147938 147693 147412 147681 148280 148389 147563 146215
65044 146215 145040 144278 143581 142476 140860 139203 138244 138324 138939 139128 138364 137012 135922 135628 135947 136216 135901
65027 135901 135069 134298 134032 134065 133737 132676 131168 129819 128977 128572 128401 128467 128991 130130 131615 132779 133120
65010 133120 132878 132894 133789 135435 137314 139220 141408 144185 147570 151342 155151 158595 161465 164023 166755
64995 166755 169665 172041 173235 173527 173818 174470 174815 174032 172202 170176 168622 167579 166910 166732 167271 168613
64979 168613 170846 174129 178291 182519 185860 187960 189003 188970 187512 184675 181204 177782 174371 170724 167114
64964 167114 163974 161128 158179 155515 153982 153411 152457 150512 148899 149288 151382 153154 153203 151974 150648
64949 150648 149800 149446 149625 150320 151189 151801 151927 151374 149930 147769 145613 144111 143273 142799 142703 143260 144499
64932 144499 146077 147556 148566 148959 149066 149574 150764 151970 152171 151080 149374 147940 147154 146774 146220 145087
64916 145087 143696 143002 143621 145042 146167 146528 146537 146670 146937 147129 147118 146834 146494 146834 148526 151197 153659 155421
64898 155421 157365 160471 164442 168234 171621 175536 180885 187568 194745 201639 207992 214038 220220 226797
64884 226797 233653 240487 247082 253319 259127 264535 269495 273463 275444 274860 272187 268364 263777 258298
64870 258298 252163 246185 240965 236401 232232 228630 225910 223916 222063 219928 217579 215348 213401 211561
64856 211561 209464 206890 203869 200464 196652 192581 188722 185395 182246 178575 174212 169668 165467 161824
64842 161824 159051 157609 157340 157154 156076 154363 153081 152757 152945 153046 152955 152809 152567 152058 151193 150015 148742
64825 148742 147806 147619 148204 149253 150577 152253 154310 156601 159072 161846 164866 167754 170198 172290 174341
64810 174341 176562 179141 182334 186172 190250 194138 197921 202043 206684 211532 216108 220035 223022 224887
64796 224887 225693 225589 224463 221966 218014 213107 208035 203378 199323 195811 192737 190150 188318 187513 187648
64781 187648 188272 188976 189693 190490 191297 192010 192741 193717 194939 196195 197441 199013 201299 204298 207639 211005
64765 211005 214443 218202 222369 226775 231208 235616 240068 244637 249367 254234 259040 263503 267637 271957
64751 271957 277068 283070 289520 295919 302046 307843 313310 318499 323232 326740 327939 326348 322471 317108
64737 317108 310601 302984 294494 285538 276421 267581 259843 253855 249355 245549 242176 239648 238080 236886
64723 236886 235612 234599 234387 234903 235626 236294 237033 238060 239645 242124 245488 249159 252624 256217 260752
64708 260752 266420 272481 278023 282532 285571 286484 284868 281162 276352 271065 265111 257978 249702 241115
64694 241115 233195 226220 219791 213711 208444 204402 201122 197675 193847 190348 187841 186287 185427 185288 185849
64679 185849 186705 187540 188652 190540 193146 195973 198747 201505 204220 206956 210352 215297 221864 229053 235789
64664 235789 241740 246967 251302 254489 256481 257061 255546 251566 246021 240521 235785 231239 226418 222022
64650 222022 219075 217519 216352 214959 213647 212956 213065 214014 215867 218404 221120 223868 227030 230726 234311
64635 234311 237277 240308 244730 251033 258614 266986 276373 286830 297458 307062 315121 321573 326040 327974
64621 327974 327434 325014 320917 314740 306362 296514 286110 275423 264401 253534 243833 235873 229305
64608 229305 223523 218552 214912 212703 211204 209591 207825 206488 205744 204802 202680 199310 195669 192869 191387
64593 191387 191096 191685 192857 194376 196180 198420 201181 204197 206990 209422 211998 215521 220404 226409 233100
64578 233100 240448 248824 258384 268740 279374 290182 301370 312933 324518 335725 346162 355111
64566 355111 361579 364996 365696 364422 361453 356460 349199 340045 329746 318826 307478 296031 285272
64553 285272 276024 268409 261811 255744 250434 246194 242476 238258 233460 229298 226774 225386 223976 222497
64539 222497 222102 223484 225910 228160 229792 231054 232014 232289 231463 229400 226245 222449 218632 215094 211542
64524 211542 207654 203773 200645 198505 196918 195611 194994 195539 196969 198408 199164 199099 198427 197494 196686 196224
64508 196224 196027 196015 196447 197645 199387 201022 202321 203788 205922 208592 211548 215201 220268 226735 233722
64493 233722 240490 247032 253441 259216 263613 266440 268071 268859 268913 268368 267476 266338 264932 263485 262623 262957
64477 262957 264584 266969 269182 270320 270012 268585 266604 264196 261079 257261 253375 250143 247797 246277
64463 246277 245703 246293 247895 249977 252107 254199 256286 258330 260280 262062 263445 264156 264215 263963 263685 263375
64447 263375 263009 262774 262877 263355 264339 266283 269547 273768 278063 282033 286296 291796 298752 306482 314240
64432 314240 322066 330879 341939 356152 373663 394003 416769 442328 471850 506623 547426 594656
64420 594656 648978 711657 784205 867694 962207 1066545 1178138 1293413 1408668 1520951
64410 1520951 1628231 1728865 1821057 1902805 1972050 2026702 2064698 2084475 2085593 2068908 2036125
64399 2036125 1989151 1929587 1858396 1775855 1682108 1578123 1466298 1350182 1233713 1120577
64389 1120577 1013873 915822 827608 749544 681359 622312 571249 526954 488603 455780 428109
64378 428109 405080 386193 370912 358377 347508 337700 329182 322412 317261 313081 309350 305808 301999
64365 301999 297184 290990 283816 276400 269156 262088 255157 248474 242209 236489 231363 226797 222789 219560
64351 219560 217422 216385 216124 216517 217906 220546 223995 227503 230826 234161 237345 239662 240604 240336 239187
64336 239187 237094 233892 229783 225217 220605 216428 213249 211147 209402 207311 205136 203738 203384 203555 203909
64321 203909 204719 206152 207763 209106 210339 211807 213376 214648 215578 216486 217669 219351 221770 224822 227725
64306 227725 229465 229562 228138 225396 221469 216690 211573 206512 201797 197788 194613 191749 188456 184727 181379
64291 181379 179079 177739 176951 176457 175956 174986 173433 171826 170785 170455 170775 171931 174102 177024 180270 183826
64275 183826 187924 192426 196830 200940 205133 209863 215115 220396 225042 228551 230851 232316 233418 234390
64261 234390 235305 236330 237601 238929 239943 240574 241231 242364 243904 245125 245047 243119 239626 235332 230710
64246 230710 225730 220426 215244 210590 206339 202198 198319 195183 193023 191747 191232 191274 191431 191329 191036 190764
64230 190764 190420 189928 189754 190419 191621 192582 193245 194389 196458 199052 201771 204703 207761 210391 212525 215037
64214 215037 218533 222201 224687 225759 226319 226969 227361 226900 225407 222960 219733 216209 213167 211199 210349
64199 210349 210191 210053 209276 207594 205335 203121 201454 200658 200917 202032 203448 204950 207171 210984 216531
64184 216531 223264 230749 238883 247429 255940 264151 271869 278361 282450 283475 281774 278059 272775 266267
64170 266267 259110 251870 244830 238174 232143 226699 221323 215552 209632 204340 200186 196993 194199 191409
64156 191409 188639 186158 184102 182295 180556 179135 178632 179403 181189 183337 185261 186750 188117 190120 193417
64141 193417 197936 202894 207476 211277 214133 215886 216528 216308 215552 214505 213316 211905 209849 206934 203911
64126 203911 202109 201869 201883 200645 198283 196323 195853 196605 197883 199654 202336 205935 209866 213591 217139
64111 217139 220976 225545 230965 237102 243748 250566 256921 261969 265155 266589 266928 266940 267181 267882 268969
64096 268969 270307 271988 274245 277052 280086 283199 286572 290073 292747 293451 291892 288638 284174 278505
64082 278505 271771 264740 258288 252647 247436 242303 237280 232589 228374 224660 221492 219034 217533 217134
64068 217134 217699 218789 219891 220695 221300 222181 223829 226284 229026 231423 233206 234478 235491 236573 238058
64053 238058 239943 241746 243081 244317 246238 249026 252056 254827 257609 260866 264465 267896 271006 274023
64039 274023 277029 279900 282710 285691 288641 290841 291734 291427 290281 288362 285601 282260 278868 275748 272929
64024 272929 270551 269019 268679 269561 271557 274628 278664 283342 288289 293213 297635 300651 301394 299772 296542
64009 296542 292571 288316 284078 280363 277581 275504 273417 270851 267966 265217 262890 261041 259680 258834
63995 258834 258468 258419 258410 258203 257860 257851 258709 260485 262739 265178 268174 272448 278270 285139 292203 298840 304803
63978 304803 310091 314886 319625 324900 331153 338350 345945 353193 359636 365436 371277 377856 385396 393650
63964 393650 402296 411272 420784 431170 442846 456204 471443 488563 507682 529231 553694 581234
63952 581234 611874 646028 684621 728777 779780 839383 909582 991514 1084848 1188656 1302844
63941 1302844 1428263 1565405 1713428 1870602 2035288 2206065 2380964 2556858 2729717
63932 2729717 2895404 3050254 3191011 3314402 3417093 3496315 3550524 3579272 3582503 3560171
63922 3560171 3512469 3440076 3344135 3226404 3089775 2938383 2776785 2608916 2437918 2266707
63912 2266707 2098271 1935278 1779662 1632731 1495570 1369247 1254717 1152585 1062801 984533
63902 984533 916466 857382 806405 762728 725378 693471 666513 644144 625574 609629 595484
63891 595484 583080 572679 564186 557162 551294 546529 542787 539919 538054 537728 539456 543231 548568 555055
63877 555055 562805 572444 584612 599481 616799 636470 658831 684118 711941 741768 773849 808975
63865 808975 847170 887306 928422 970796 1015020 1060403 1105088 1147585 1187439 1224386 1257769
63854 1257769 1287030 1312092 1332765 1348304 1357989 1361733 1359594 1351122 1335899 1314602 1288836 1259751
63842 1259751 1227306 1191069 1151352 1109219 1065687 1021321 976602 932340 889597 849280 811817
63831 811817 777060 744360 712948 682457 653075 624994 597802 570790 543947 518243 494648
63820 494648 473122 452916 433558 415134 397844 381903 367780 355879 345835 336712 328069 320346
63808 320346 313911 308351 303056 297980 293328 288930 284482 280110 276137 272543 269215 266488 264731 263481
63794 263481 261681 258861 255576 252586 250141 248124 246258 244013 240976 237620 235155 234147 233724 232688
63780 232688 231052 229833 229496 229262 228126 226072 224010 222813 222654 223106 223554 223446 222406 220365 217669 214956
63764 214956 212795 211446 210952 211308 212362 213667 214737 215439 215961 216378 216562 216536 216517 216474 216003 214977 214069 214240
63746 214240 215765 217964 219806 220588 220257 219428 219040 219658 221051 222649 224283 226180 228364 230551 232758
63731 232758 235508 239107 243051 246545 249480 252503 256150 260218 264141 267824 271887 277075 283421 290058
63717 290058 295947 300749 304853 308558 311548 313354 314072 314207 313865 312537 309779 305837 301400 297022 292964
63702 292964 289379 286319 283644 281174 278966 277261 276248 276007 276603 277933 279571 281096 282610 284588 287130
63687 287130 289762 292166 294751 298067 301855 305098 306974 307533 307509 307784 308917 310765 312460 313197 313211 313662
63671 313662 315357 317853 320136 321872 323632 325991 328886 331923 334962 338114 341323 344164 346088 346685
63657 346685 345756 343261 339355 334469 329194 323957 318799 313563 308290 303350 299143 295764 293091 291126
63643 291126 290082 290075 290841 291903 293020 294382 296333 299000 302222 305779 309553 313534 317866 322873 328787
63628 328787 335297 341602 347177 352412 358202 364949 372245 379609 387271 395989 406223 417740 430098
63615 430098 443356 458117 474844 493344 513101 534037 556670 581499 608629 638093 670059
63604 670059 704230 739378 773994 807193 838372 866089 888146 903086 911079 913121 910086 902989
63592 902989 893557 883637 874073 864590 854587 843605 831182 816844 800351 781621 760521 737065
63580 737065 711844 685921 660313 635790 613017 592501 574426 558865 546087 536263 528975 523499
63568 523499 519642 517881 518578 521389 525519 530203 534920 539582 544653 550779 558177 566588 575837 586057
63554 586057 597387 609876 623731 639198 656217 674796 695883 721252 752189 788834 831010
63543 831010 878813 931598 986725 1039969 1086962 1123930 1147868 1157365 1153598 1139942 1120383 1098488
63531 1098488 1077369 1059424 1045522 1034901 1026183 1018215 1009847 999483 985395 966402 942093 912707
63519 912707 879111 842675 804841 766792 729590 694357 662031 632932 606755 583003 561339
63508 561339 541570 523543 507219 492826 480648 470474 461369 452377 443574 436051 430589 426657 423020
63495 423020 419057 414996 411128 407410 403817 400426 396970 392890 388136 383544 380109 378178 377545 377919 379038
63480 379038 380703 383097 386761 391830 397470 402512 406568 410142 413786 417555 421249 424701 427646 429565
63466 429565 429905 428348 424923 420050 414528 409250 404701 400751 396968 393101 389301 385978 383455 381686
63452 381686 380315 379069 378004 377352 377298 378109 380287 384184 389416 395085 400869 407617 416533 427822 440575
63437 440575 454071 468884 486569 508555 535641 568254 606530 649750 695793 741220 781935
63426 781935 814107 835328 845534 846923 842752 836172 829923 826434 827599 834590 848222 869220 897599
63413 897599 931960 969993 1009662 1049393 1087191 1120387 1146615 1164641 1174148 1175386 1169465 1158456
63401 1158456 1144685 1129979 1115602 1102256 1089648 1076505 1061492 1043822 1022716 996924 965653
63390 965653 929763 891405 852545 814381 777875 743970 713116 685180 659980 637509 617614
63379 617614 600061 585030 573014 564041 557438 552589 549531 548606 549896 553237 558459 565315 573449 582719
63365 582719 593439 606141 621205 638717 658512 680284 703929 729849 758684 790665 825451
63354 825451 862635 902063 943494 986172 1028831 1069892 1107559 1139972 1165455 1182708 1191057 1191001
63342 1191001 1184446 1173835 1160785 1145897 1129877 1114167 1099977 1087045 1073718 1058095 1038833
63331 1038833 1015250 987265 955445 920931 885201 849716 815488 782929 752359 724739 701635
63320 701635 684367 673450 668798 669826 674951 681318 685415 683980 674597 656345 630541 600549 570178
63307 570178 542050 517274 495985 477707 461689 447576 435608 425798 417349 409418 402087 395845
63295 395845 390384 384797 378950 373744 369786 366498 362868 358595 354114 349860 345916 342154 338457 334892
63281 334892 331741 329209 327090 324910 322414 319740 317192 315154 314103 314258 315161 316025 316489 316679 316515 315590
63265 315590 313918 312288 311567 311969 313222 315019 317003 318691 319886 320978 322513 324658 327287 330336 333729
63250 333729 337210 340620 344199 348243 352597 356844 360982 365584 371223 377979 385516 393535 402142 411878
63236 411878 423300 436390 450522 465133 480273 496254 513011 530150 547530 565392 583850
63225 583850 602586 621138 639296 657217 675387 694463 714822 736134 757626 778879 800159
63214 800159 821803 843568 864783 884847 903114 918379 928926 933349 931202 922853 908934 890093
63202 890093 867039 840485 811124 779865 748078 717293 688560 662232 638437 617522 599859
63191 599859 585448 573988 565310 559487 556539 556240 558276 562436 568549 576388 585788 596732 609198
63178 609198 622881 637197 651654 666177 680969 696020 710927 725349 739488 753772 768053
63167 768053 781490 793377 803692 812493 819050 822053 820594 814648 804703 791391 775423 757363 737266
63154 737266 714828 690052 663601 636506 609799 584349 560587 538303 517154 497500 480317
63143 480317 466079 454214 443933 435162 428237 423057 419040 415678 412674 409710 406554 403355 400485
63130 400485 398175 396581 395963 396326 397052 397419 397438 397747 398713 400199 402189 404969 408516 412261 415757 419136
63114 419136 422596 425883 428701 431236 433829 436401 438715 441025 443915 447508 451291 454732 457674 460134
63100 460134 462168 464118 466548 469650 472974 475989 478749 481771 485424 489686 494281 498782 502661 505570
63086 505570 507562 508828 509265 508634 507155 505538 504269 503166 501906 500702 500099 500245 500784 501468 502471 503993
63070 503993 505931 508205 511153 515233 520386 526041 531812 538009 545402 554658 566081 579717 595491
63057 595491 613348 633356 655666 680292 707110 736253 768351 804020 843068 884509 927483
63046 927483 971810 1017555 1064452 1112086 1160290 1208845 1257091 1304492 1351564 1399534 1448935
63035 1448935 1499171 1549643 1600584 1652241 1703770 1753480 1799821 1841563 1877358 1905728 1925318
63024 1925318 1934684 1932201 1916921 1889453 1851289 1803440 1746507 1682102 1613180 1542652 1472348 1403629
63012 1403629 1338149 1277358 1221822 1171726 1127725 1090719 1060982 1038047 1021332 1010512 1005375
63001 1005375 1005630 1010771 1019984 1032442 1047793 1065947 1086183 1107080 1127867 1149320 1172642 1197771
62989 1197771 1223499 1249047 1274668 1300679 1326648 1351626 1374515 1393980 1408667 1417885 1421671 1419954
62977 1419954 1412084 1397479 1376253 1348768 1314922 1274522 1228402 1178739 1128104 1078340 1030311
62966 1030311 984388 940873 899992 861711 825815 792275 761417 733632 708921 686828 666771
62955 666771 648344 631336 615549 600653 586247 572091 558261 544962 532207 519857 507942
62944 507942 496665 486005 475673 465653 456440 448411 441236 434253 427275 420636 414597 409115 404115
62931 404115 399553 395228 390886 386541 382378 378429 374686 371425 368991 367217 365494 363502 361463 359620
62917 359620 357879 356136 354633 353766 353755 354556 355809 356836 357061 356560 355943 355577 355249 354659 353872 353140 352594
62900 352594 352358 352640 353485 354669 356063 357910 360574 364160 368497 373247 377915 382017 385319 387756 389121
62885 389121 389259 388607 388037 387889 387609 386661 385321 384185 383298 382371 381530 381210 381347 381283 380577 379493 378538 377894
62867 377894 377438 376997 376354 375182 373207 370400 366966 363205 359497 356323 354109 352918 352378 352107 352253 353340
62851 353340 355361 357236 357660 356481 354851 353922 353851 354221 354932 356177 357816 359274 360063 360129 359736 359258 359069
62834 359069 359411 360303 361600 363065 364350 365099 365186 364762 364123 363794 364647 367384 371670 376232 380148 383602
62818 383602 387058 390190 392328 393582 394786 396382 398076 399636 401336 403411 405672 408047 411078 415389
62804 415389 420881 426814 432661 438615 445246 452878 461374 470448 479985 489968 500272 510853 522190
62791 522190 535098 549821 565684 582144 599985 620901 645842 674311 705485 739556 777663
62780 777663 820792 869195 922769 981639 1046179 1116574 1192424 1272700 1355927 1440304 1523811
62769 1523811 1604463 1680548 1750413 1811942 1862540 1899926 1922863 1931047 1924519 1903533 1868805 1821626
62757 1821626 1763760 1697409 1625063 1549015 1471034 1392669 1315549 1240999 1169552 1101325 1036817
62746 1036817 976878 921903 871550 825287 782787 743790 708119 675987 647724 623007 600786
62735 600786 580290 561681 545377 531141 518274 506539 496423 488442 482482 477851 473822 470105
62723 470105 466916 464637 463432 463113 463307 463715 464496 466466 470506 476361 482365 487081 491158 496865 505699
62708 505699 517189 530228 544714 561318 580386 601905 626191 653723 684355 717416 752686
62697 752686 790761 832310 877399 925655 976634 1029785 1084373 1139701 1195211 1250020 1302389
62686 1302389 1349875 1390230 1422187 1445339 1459236 1462792 1454857 1435379 1405760 1367943 1323405 1273161
62674 1273161 1218420 1160825 1102125 1043860 987319 933465 882801 835440 791427 750961 714285
62663 714285 681337 651548 624103 598603 575383 554956 537140 521077 506195 492816 481556
62652 481556 472359 464383 456739 449145 441948 435610 430125 424935 419595 414389 409970 406409 403154 399992
62638 399992 397429 395833 394806 393881 393315 393586 394528 395578 396544 397469 398019 397766 396875 395803 394430 392340
62622 392340 389932 388330 388017 388360 388722 389245 390141 390980 391280 391330 391836 393142 395309 398601 403263 408999 415225
62605 415225 421826 429246 437803 447300 457363 467997 479715 493240 509051 527176 547483 570131
62593 570131 595543 623950 655236 689203 725680 764304 804508 845695 886864 925926 960105
62582 960105 987537 1008043 1021935 1028585 1026838 1016537 998812 975004 946058 913023 877414 840656
62570 840656 803511 766298 729406 693417 658955 626643 597080 570707 547630 527481 509409
62559 509409 492512 476546 462073 449656 439101 429849 421804 415197 409710 404382 398608 392719 387388
62546 387388 382915 379328 376768 375356 374875 374857 374875 374672 374263 374124 374971 377091 379993 382914 385500 387857
62530 387857 390180 392512 394755 396752 398534 400608 403813 408732 415398 423594 433151 443865 455505 468196
62516 468196 482470 498710 516818 536721 558837 583582 610706 639575 669867 701463 733770
62505 733770 765697 796339 825128 851288 873684 891435 904239 911867 913752 909450 899372 884804
62493 884804 867260 847905 827465 806515 785914 766940 750872 738432 729751 724796 723534 725678
62481 725678 730654 737991 747563 759422 773600 790125 808810 828748 848237 865486 879349 889330
62469 889330 895126 896372 892639 883467 868541 848069 822962 794463 763615 731075 697328 663023
62457 663023 629196 597099 567539 540374 514954 491126 469464 450486 434127 420218 408944
62446 408944 400368 393923 388895 385144 382724 381018 378936 376091 373195 371146 370148 369832 369787 369757 369671 369729 370125
62429 370125 370510 370069 368395 366020 363800 362039 360525 359171 358086 357069 355541 353228 350616 348476 347110
62414 347110 346260 345574 344841 343820 342317 340628 339487 339187 338980 337871 335897 334069 333059 332570 332152 331893
62398 331893 331874 331687 331245 331541 333665 337304 341143 344677 348633 353432 358237 362047 364963 367808 371042
62383 371042 374632 378576 382946 387712 392996 399232 406547 414313 421905 429730 438838 449536 460962 472122
62369 472122 482900 493945 505996 519466 534374 550556 568183 588147 611580 638856 669362
62358 669362 702501 738731 779428 825816 878186 936002 998430 1064530 1132968 1201681 1268054
62347 1268054 1329495 1383795 1429075 1463802 1487223 1499658 1502101 1495512 1480572 1457918 1428250 1392143
62335 1392143 1350031 1302563 1250902 1196662 1141581 1087205 1034830 985581 940393 899541 862250
62324 862250 827205 793827 762797 735014 710298 687535 665838 645019 624970 605245 585500
62313 585500 565966 547276 530072 514838 501728 490387 480183 470755 462145 454387 447434 441533
62301 441533 437202 434523 432828 431379 430027 428896 427802 426491 425255 424777 425346 426606 428045 429406 430625
62286 430625 431722 432857 434281 436141 438486 441450 445204 449723 454713 459751 464418 468408 471832 475361
62272 475361 479789 485392 491869 498872 506348 514430 523415 533985 547065 563152 581999 603234 627169
62259 627169 654705 686540 722805 763480 808847 859401 915471 976981 1043321 1113140 1184315
62248 1184315 1254275 1320381 1379981 1430408 1469411 1495835 1509774 1511978 1503339 1485015 1458590 1425468
62236 1425468 1386024 1339817 1286890 1228667 1167458 1105375 1043941 984341 927545 874191 824726
62225 824726 779662 739449 704032 672868 645431 621440 600541 582082 565436 550320 536638
62214 536638 524238 513062 503291 495017 487829 481020 474181 467406 460991 455165 450044 445579 441565 437993
62200 437993 435367 434327 434840 436096 437379 438713 440505 442905 445940 449946 455342 462010 469418 477452
62186 477452 486714 497788 510499 524092 537863 551377 564301 576366 587513 597797 607129 615257
62174 615257 622062 627859 633413 639696 647522 657363 669568 684722 703650 727065 755453 789290 828974
62161 828974 874239 923863 976245 1029963 1083354 1133852 1178491 1215276 1243611 1263330 1273996
62150 1273996 1275598 1269377 1257200 1240081 1217814 1190107 1157702 1122246 1085333 1047907 1010432 973451
62138 973451 937953 905241 876409 851961 831916 816171 804574 796738 792073 790085 790505 793033 797133
62125 797133 802289 808335 815355 823266 831637 839954 847915 855521 863066 871058 879912 889446 898717 906479
62111 906479 911736 913747 911809 905610 895999 884940 874248 864422 854934 845419 836100 827119 818089 808589
62097 808589 798800 789408 781182 774882 771197 770335 771877 775502 781611 790663 801838 813095 822879 831382
62083 831382 839834 849000 858860 869384 880912 893813 908313 924803 943792 965340 988887 1013825
62071 1013825 1039828 1066374 1092436 1117169 1140732 1163930 1187170 1210274 1233255 1256718 1281366
62060 1281366 1307569 1335515 1365214 1395895 1425740 1452656 1475239 1492806 1504851 1510935 1511002 1505410
62048 1505410 1494637 1479181 1459533 1435772 1407236 1373032 1332973 1287811 1238693 1186853 1133794
62037 1133794 1081092 1029746 980120 932700 888426 847939 810975 776983 746032 718606 694714
62026 694714 673766 655315 639418 626176 615255 605925 597355 588856 580177 571575 563343 555269 546790
62013 546790 537635 528038 518375 508985 500368 493060 487205 482598 479350 478063 479100 482087 486459 492156
61999 492156 499371 507851 516844 525547 533235 539202 543091 545193 545931 545118 542225 537319 531088 523826 515077
61984 515077 504602 493164 481860 471068 460519 450106 440093 430725 422161 414731 408793 404302
61972 404302 400847 398051 395623 393188 390620 388535 387877 388814 390477 391975 393252 394747 396672 398943 401449
61957 401449 404027 406495 409069 412456 417072 422366 427378 431867 436526 442174 449128 457315 466553 476637
61943 476637 487501 499395 512807 528251 546266 567340 591439 617748 645327 673929 703668
61932 703668 733993 763527 791081 816352 839543 860876 880592 898841 915156 928430 937734 942842
61920 942842 943740 940149 932057 920367 906514 891612 876371 861639 848538 838138 831313 828783 830956
61907 830956 837827 849288 865289 885338 908177 932371 956906 980597 1001312 1016736 1026002 1029750
61895 1029750 1028482 1021683 1008902 990902 969130 944678 918361 891290 864482 838097 811818 785953
61883 785953 761487 738951 717964 698138 679849 663595 649017 635208 621886 609681 599102
61872 599102 589730 580776 572145 564527 558515 554079 551022 549543 550053 552609 556858 562482 569451 577901
61858 577901 588014 600033 614176 630499 648997 669895 693697 720948 752029 787031 825581
61847 825581 866863 910196 955628 1003530 1053356 1103098 1150162 1192608 1229325 1259351 1281573
61836 1281573 1295150 1299972 1296596 1286027 1269653 1249237 1226766 1204308 1184020 1168059 1158149 1155071
61824 1155071 1158660 1168380 1183789 1204267 1228432 1254155 1279234 1301718 1319476 1329984 1331118 1322114
61812 1322114 1303400 1275678 1239649 1196506 1148058 1096221 1042824 989858 939160 891493 846538
61801 846538 804195 765377 731012 700810 673717 649232 627530 608489 591465 576109 562656
61790 562656 551172 541120 531949 523581 515985 508750 501555 494784 489152 484765 480918 476895 472720 469002
61776 469002 466158 463962 461919 459978 458604 458051 457831 457179 455901 454412 453004 451524 449874 448421 447699
61761 447699 447869 448636 449511 450125 450451 450768 451219 451531 451529 451813 453368 456328 459664 462331 464243 465806 467044
61744 467044 467746 468089 468520 469212 470156 471607 473886 476772 479613 481998 483934 485504 486862 488508 490886
61729 490886 493662 496030 497928 500353 504185 509179 514481 519599 524386 528489 531546 533916 536652 540542
61715 540542 545341 549986 553392 555111 555514 555397 555277 554931 553614 550657 545839 539430 532046 524388 516866
61700 516866 509444 501976 494690 488244 483245 479671 476742 473391 469117 464457 460491 457787 455948 454209
61686 454209 452198 449939 447492 444981 442847 441607 441267 441263 441134 441026 441357 442074 442460 441839 440457 439508 440056
61669 440056 441977 444216 446112 448045 450519 453074 454682 455038 454876 454943 455232 455418 455538 455845 456240 456291 455759
61652 455759 454828 453834 453008 452509 452526 453218 454600 456578 459173 462607 466989 471835 476180 479426 481946 484462
61636 484462 486934 488473 488460 487200 485233 482415 478195 472586 466398 460576 455626 451611 448260 445073 441755
61621 441755 438717 436784 436196 436225 436034 435618 435557 436105 437020 438218 439946 442052 443530 443251 440947 437147 432316
61604 432316 426512 419860 412846 405916 399091 392194 385305 378816 373206 368801 365464 362321 358178 352641
61590 352641 346669 341625 337894 334774 331591 328415 325672 323561 322080 321175 320540 319525 317617 314944 312071
61575 312071 309356 306715 304000 301396 299262 297619 296009 294059 292136 291125 291401 292339 293076 293481 293947
61560 293947 294464 294533 294011 293465 293490 294054 294708 295059 294889 294227 293484 293170 293264 293229 292766 292188 291907 292040 292752 294397
61540 294397 296907 299559 301786 303794 305943 308055 309952 312146 315153 318436 320912 322357 323431 324379
61526 324379 324632 323848 322455 320822 318646 315595 312037 308641 305688 303099 300831 298908 297327 296196 295614
61511 295614 295268 294577 293500 292755 292863 293337 293239 292262 290854 289521 288373 287214 285703 283606 281203 279272
61495 279272 278315 277940 277326 276163 274817 273763 273236 273339 274009 274856 275409 275577 275610 275623 275453 274984 274315 273575
61477 273575 272850 272380 272549 273573 275357 277637 280084 282224 283584 284069 284101 284313 285160 286703 288560 290081
61461 290081 290826 290966 291022 291250 291477 291481 291163 290383 289123 287991 287990 289355 291025 291838 291978 292586 294028 295382
61443 295382 295866 295948 296507 297481 298155 298533 299518 301673 304594 307790 311425 315698 320062 323830 327197 330882
61427 330882 334792 337867 339432 340055 340775 341986 343487 345179 347160 349347 351517 353687 356088 358752 361360
61412 361360 363442 364601 364692 364089 363567 363538 363446 362300 359704 356079 351942 347511 343042 338988 335572 332635
61396 332635 330173 328624 328229 328415 328209 327123 325350 323315 321423 320052 319287 318728 317973 317233 317003 317155
61380 317155 317000 316351 315920 316297 317127 317857 318861 321037 324337 327457 329274 330122 331231 333090 334844 335413
61364 335413 334966 334961 336630 339677 342782 345297 347888 351359 355467 359467 363395 367965 373322 378787 384107
61349 384107 390217 398292 408523 420235 432734 445516 457972 469495 479816 488839 496313 502139
61337 502139 506947 511927 517906 524765 531676 537618 541825 544122 544901 544543 542863 539378 534020 527343 520030
61322 520030 512490 504929 497563 490736 484927 480525 477409 474928 472577 470482 468921 467655 466287 465154
61308 465154 465181 466797 469516 472741 476481 481110 486874 493840 501863 510240 517666 522905 525452 525502 523500
61293 523500 519811 514635 508177 501047 494307 488720 484095 479861 476143 473558 471943 470217 467884 465847
61279 465847 465129 465505 466130 466998 468903 472240 476703 482061 488410 495559 502846 509832 516684 523705 530845
61264 530845 537878 544753 551602 558611 565995 573956 582692 592617 604413 618473 634218 650314 665706
61251 665706 680100 693321 704573 712823 717880 720694 722358 722975 721758 718200 712726 706035 698221 689120
61237 689120 679342 670205 662399 655243 647603 639136 630272 621377 612530 603962 596245 589959 585404 582486
61223 582486 580678 579239 577729 576217 574864 573568 572273 571291 570899 570885 570827 570648 570500 570357 570176 570236 570749
61206 570749 571234 570838 569346 567437 565877 564892 564376 564379 565258 567650 572340 579925 590545 604025 620112
61191 620112 638392 658259 679268 701210 723427 744412 762787 778517 792553 805396 816801
61180 816801 826866 836525 846616 857049 867208 876640 884996 891770 896527 899260 900368 900477 900222 899723
61166 899723 898209 894581 888495 880436 870823 859689 847347 834480 821097 806129 788757 769748
61154 769748 750873 733386 717622 703701 691862 682140 674282 668111 663666 660989 659924 659906 659727 657874
61140 657874 653544 647125 639354 630361 620056 609125 598863 590098 582903 577359 573803 572124 571533 571507
61126 571507 572513 575376 580273 586763 594576 603913 615076 628163 643094 659638 677456 696397 716710
61113 716710 738651 761937 785980 810702 836647 864040 892154 919994 947315 974453 1001263
61102 1001263 1026835 1050337 1071618 1090762 1107424 1120896 1130466 1135390 1134868 1128537 1116938 1101185
61090 1101185 1082292 1061066 1038390 1015093 991500 967454 942816 917726 892494 867565 843490
61079 843490 820577 798633 777414 757253 738811 722290 707409 694128 682776 673221 664557 655991
61067 655991 647722 640555 634946 630773 627801 625945 625120 625130 625751 626862 628606 631457 635908 641966 649131
61052 649131 656964 665474 674795 684793 695283 706524 719157 733602 749644 766720 784602 803818
61040 803818 825299 849595 876491 905437 936138 968560 1002546 1037753 1073952 1111192 1149834
61029 1149834 1190625 1234534 1282033 1332554 1384891 1437988 1491090 1543500 1594894 1645915 1698028
61018 1698028 1752909 1812401 1878746 1953991 2039108 2134291 2240215 2358490 2491316 2642038
61008 2642038 2816705 3024572 3276827 3585197 3961434 4417366 4966279 5626682 6426082
60999 6426082 7400998 8594541 10055346 11832149 13949520 16363771 18927621 21401097
60991 21401097 23515873 25059859 25940341 26207705 26042292 25706253 25461423 25473775 25747804
60982 25747804 26127007 26358323 26184484 25425667 24029420 22080591 19768573 17322421 14943260
60973 14943260 12765554 10855715 9230929 7877916 6765804 5856598 5113751 4506079
60965 4506079 4007563 3596537 3255441 2969990 2728075 2519695 2337348 2175518 2030013
60956 2030013 1898379 1780035 1674679 1580725 1496300 1421159 1356104 1300532 1251877 1207565 1166263
60945 1166263 1127077 1088907 1051222 1014412 978843 944300 910835 879296 850389 823808 798759
60934 798759 774841 751936 729774 708155 687294 667555 649071 631822 615766 600733 586525
60923 586525 573233 561072 549853 539131 528934 519806 511952 504892 498172 491899 486369 481614 477549
60910 477549 474145 471340 469205 468272 469069 471226 473687 476028 478838 482561 486678 490462 493848 497040 499806
60895 499806 501721 502639 502461 500973 498457 495959 494216 492594 489737 485046 478980 472181 465031 458003 451698
60880 451698 446271 441149 435556 429212 422573 416483 411507 407469 403778 400182 396928 394085 391233 388177
60866 388177 385609 384541 385181 386741 388347 389947 392405 396839 403608 411764 419724 426624 432785 438766
60852 438766 444478 449556 454124 458671 463432 468402 473736 479532 485253 489921 492959 494531 495064 494812 493917
60837 493917 492467 490342 487265 483218 478616 473978 469523 465183 460917 456901 453395 450496 448050 445824
60823 445824 443619 441119 437852 433657 429125 425127 421713 417832 412472 405843 399148 393330 388341 383577
60809 383577 378694 373885 369519 365677 362099 358569 355243 352582 351014 350730 351590 353075 354545 355795 357193
60794 357193 358968 360632 361558 362010 363029 365289 368565 372312 376182 379881 383175 386336 390177 395293 401561
60779 401561 408501 415711 422822 429438 435390 440805 445877 450916 456548 463269 470741 478140 485296 492800
60765 492800 500870 508969 516826 524940 533498 541693 548862 555567 562723 570179 577105 583444 590070 597596
60751 597596 605769 614001 621956 629715 637838 647150 658030 670128 683056 696933 711764 726758 740975
60738 740975 754329 767233 779562 790793 801005 810888 820734 830045 838142 844491 848449 849419 847410
60725 847410 842972 836440 827686 816597 803376 788373 772007 754816 737243 719521 702047 685547
60713 685547 670344 655823 641279 627018 613917 602129 591002 580086 569424 559016 548907
60702 548907 539655 531585 523623 514079 502863 491722 481835 472407 462349 452207 443294 435664 428165
60689 428165 420195 412297 405047 398309 391790 385677 380443 376425 373699 372001 370625 368756 366157 363362
60675 363362 361094 359603 358629 357834 357075 356336 355621 355036 354815 355061 355508 355765 355726 355407 354380 351941 348170
60658 348170 344416 342200 341849 342613 343822 345357 347177 349075 351023 353285 356101 359542 363691 368564 373887
60643 373887 379271 384471 389097 392340 393657 393697 393930 395227 397318 399592 401803 403875 405651 407082 408258
60628 408258 409170 409884 410872 412456 413884 413722 411399 407674 403426 398812 393984 389718 386580 384080 381346
60613 381346 378276 375373 372812 370332 367850 365541 363398 361202 358951 356970 355574 354795 354424 354195 354076
60598 354076 354344 355090 355649 355023 353077 350868 349504 349123 349210 349439 349794 350305 351059 352129 353209 353684 353440
60581 353440 353099 353113 353191 353142 353636 355325 357637 359445 360763 362805 366241 370344 374291 378561 384429 392382
60565 392382 401667 411416 421729 433325 446328 459760 472367 483587 493329 501019 505446 505756 502232
60552 502232 496033 488508 480778 473457 466561 460119 454951 452272 452384 454516 458219 464027 472198 481727
60538 481727 491560 502130 514591 528882 543625 557674 570574 581535 589226 593050 593779 592477 589460
60525 589460 584724 578759 572438 566497 561448 557552 554520 551665 548718 546213 544735 544162 544000 544158 544896
60510 544896 546252 547966 549913 552166 554603 556879 558962 561458 565262 571021 579073 589767 603599 621079
60496 621079 642665 668871 700174 736601 777553 822206 869844 919467 969139 1016140 1057786
60485 1057786 1091755 1115718 1127331 1125070 1108922 1080221 1041139 994382 942746 888549 833800
60474 833800 780920 732526 689921 652411 618790 589042 563870 543039 525187 509204 494849
60463 494849 481975 470042 458736 448394 439418 431663 424679 418259 412489 407479 403134 399090 395029
60450 395029 391293 388882 388308 388626 388234 386571 384389 382442 380702 378974 377410 376024 374379 372264 370164
60435 370164 368624 367587 366763 366263 366383 367027 367754 368175 367983 366850 364681 361850 358955 356494 354851 354233
60419 354233 354377 354681 354904 355400 356383 357413 358079 358810 360384 362765 365083 366779 368216 369965 371910 373397
60403 373397 374050 374129 374047 373837 373301 372644 372572 373523 375092 376635 378241 380518 383443 386146 388049 389546 391138
60386 391138 392550 393292 393627 394252 395266 396221 397041 398155 399640 400976 401854 402689 404018 405801 407637 409385
60370 409385 411204 413161 415081 416752 418075 419056 419820 420655 421867 423453 424886 425424 424891 424100 424179 425408
60354 425408 427041 428493 430174 432757 436041 439297 442554 446747 452381 458810 465191 471580 478548 486144
60340 486144 493797 501051 507787 513744 518284 520743 520754 518283 513693 507793 501440 494972 488319 481675 475659
60325 475659 470621 466172 461778 457515 453888 451023 448569 446354 444700 443845 443418 442832 442052 441713 442526 444749
60309 444749 448224 452662 457855 463804 470861 479693 490973 504978 521452 539854 559667 580416 601386
60296 601386 621448 639273 653606 663272 667108 664376 655490 642225 626976 611802 598019 586274
60284 586274 576541 568083 559770 550698 540600 529803 518931 508525 498751 489460 480623 472573 465617
60271 465617 459524 453681 447792 442169 437294 433387 430449 428467 427321 426608 425752 424292 422075 419311 416500
60256 416500 414209 412764 412159 412201 412589 412876 412592 411635 410442 409628 409420 409467 409206 408391 407359 406713 406699 406978
60238 406978 407139 407348 408193 409865 411844 413592 415240 417278 419700 421837 423174 424123 425804 429010 433415
60223 433415 437835 441261 443547 445104 446200 446950 447818 449546 452320 455441 458174 460664 463612 467259 471204
60208 471204 475136 479190 483476 487732 491765 495883 500520 505587 510475 514605 517713 519736 520803 521367
60194 521367 522005 522868 523506 523438 522800 522245 522235 522599 522852 522762 522467 522015 520985 518804 515495 511925 509088 507177
60176 507177 505519 503382 500569 497283 493814 490568 488043 486323 484816 482969 481165 480441 481246 482912 484465
60161 484465 485458 485824 485488 484622 483951 484222 485424 486881 488076 489067 490205 491789 493978 496641 499327 501660
60145 501660 503788 506105 508582 510760 512520 514400 516967 520223 523957 528416 534247 541727 550325 559069
60131 559069 567242 574626 581153 586465 589965 591290 590596 588313 584777 580242 575036 569545 564166 559451
60117 559451 556064 554307 553804 553979 554659 555807 556924 557350 557170 557147 557569 557810 557327 556475 555785 554930 553101
60100 553101 550221 547083 544260 541443 538017 533903 529618 525780 522753 520648 519489 519383 520524 522960
60086 522960 526417 530506 535116 540415 546455 552896 559201 565004 570181 574626 578055 580163 580905 580537 579281
60071 579281 577084 573860 569892 565711 561500 556865 551394 545296 539260 533751 528637 523500 518138 512662
60057 512662 507149 501362 494956 488074 481556 476313 472432 469123 465639 462059 459081 457295 456833 457541 459184
60042 459184 461498 464283 467500 471203 475397 480005 484869 489701 494105 497807 500815 503245 505082 506223
60028 506223 506690 506604 505940 504418 501679 497534 492098 485794 479156 472492 465718 458590 451097 443552 436371
60013 436371 429895 424335 419677 415579 411613 407805 404767 403036 402305 401607 400392 399158 398815 399680 401481
59998 401481 404174 408126 413288 418729 423434 427242 430604 433687 436330 438757 441607 445074 448574 451617
59984 451617 454595 458257 462544 466386 468707 469518 469934 471096 472930 474065 473191 470450 467177 464299 461480
59969 461480 458029 454061 450298 447070 444163 441592 439946 439733 440724 442173 443466 444438 445191 445856 446484 447065
59953 447065 447577 448055 448522 448850 448790 448276 447717 447795 448828 450400 451782 452631 453095 453329 453293 453074 452879 452432 450838
59934 450838 447560 443290 439324 436239 433688 431301 429094 427071 425156 423634 422980 423014 422876 422195 421640 421915
59918 421915 422754 423390 423621 423863 424458 425445 426837 428682 431006 433884 437300 440676 443017 443985 444491 445704
59902 445704 447780 450066 452224 454544 457311 460485 463903 467272 470117 472361 474835 478495 483141 487586
59888 487586 491197 494579 498482 502717 506514 509525 512018 514427 517054 520002 523116 526106 528935 531955
59874 531955 535471 539309 542898 545623 547070 547163 546129 544110 540791 535728 529139 522080 515682 510434 506267
59859 506267 502977 500371 498324 496983 496689 497471 498900 500721 503302 507092 511893 517246 523455 531595 542217
59844 542217 554446 566600 577360 586074 592305 595763 596767 596318 595512 595082 595524 597203 599946 602724
59830 602724 604135 603215 599690 593668 585473 575707 565103 554255 543655 533836 525100 517162 509508 502080
59816 502080 495180 488740 482284 475753 469738 464663 460299 456413 453312 451209 449556 447617 445407 443528
59802 443528 442274 441425 440690 439846 438649 437147 435899 435325 434983 434064 432446 430626 428754 426515 424037 422080
59786 422080 421022 420277 419157 417790 416727 416020 415187 413940 412525 411340 410524 409920 409304 408587 407919 407587
59770 407587 407809 408633 409980 411745 413827 416036 417967 419082 419253 419261 420355 423054 426628 430015 432968 435980
59754 435980 439403 443078 446652 449813 452322 454255 456128 458445 461176 463994 466842 469893 473112 476274
59740 476274 479286 482099 484473 486294 487906 489603 490982 491379 490840 490054 489435 488966 488837 489410 490446 491132
59724 491132 491036 490426 489495 488074 486334 484991 484409 484174 484023 484518 486154 488295 489737 490146 490385 491457 493574
59707 493574 496261 499036 501820 504733 507568 509750 510994 511812 512981 514713 516770 519119 521841 524506
59693 524506 526459 527758 528998 530113 530245 529094 527476 526124 524784 523052 521266 519845 518460 516730
59679 516730 515239 514888 515505 515915 515297 513797 511924 509973 507989 505732 502669 498461 493491 488584 484270
59664 484270 480526 477043 473486 469740 466266 463924 463100 463256 463664 464193 464964 465686 465992 466123 466640 467607 468664
59647 468664 469745 471069 472485 473455 473768 473725 473558 473126 472247 470858 468832 466114 463172 460893 459767 459430
59631 459430 459135 458549 457964 457858 458242 458491 458000 457044 456565 456928 457365 457077 456423 456375 457039 457437 456696 454813 452290
59612 452290 449641 447389 445958 445283 444901 444635 444860 445926 447602 449300 450666 451781 452894 454010 454754
59597 454754 454676 453810 452796 452301 452486 453141 454057 455003 455665 456016 456573 457855 459721 461587 463064 463964 463859
59580 463859 462313 459546 456352 453266 450154 446641 442540 437925 433214 429191 426450 424692 422929 420489
59566 420489 417568 414801 412648 411177 410091 408988 407901 407487 408263 409732 410755 410790 410312 410053 410458 411902
59550 411902 414710 418605 422638 426031 428817 431484 434379 437685 441553 445983 450882 456533 463697 473032
59536 473032 484724 498900 515916 535670 556682 576172 591107 599330 600335 595592 588046 580747
59524 580747 575564 573075 573405 576747 583009 591234 599723 606893 612129 615816 618543 620261 620156 617256 611196
59509 611196 602516 592327 581551 570425 558810 546919 535462 524945 515279 506307 498346 491780
59497 491780 486346 481357 476538 472228 468802 466343 464850 464317 464452 464657 464474 463985 463741 464417 466267 468774
59481 468774 471077 473072 475771 480179 486123 492758 499917 508213 517881 528211 538168 546932 553794 558304
59467 558304 560797 562176 562910 562645 560969 558022 554339 550758 548702 549729 554254 561186 569295 578540 589625
59452 589625 602705 617165 632497 648883 666784 686208 706432 726369 745162 762240 776640
59441 776640 786584 790318 787299 778120 763573 744615 723187 701881 682237 664044 646712 630492
59429 630492 615858 602566 590211 579138 569970 562677 556965 553238 552329 554494 559460 567270 578209
59416 578209 591961 607695 625094 644620 666660 691127 717953 746931 776386 802485 820615
59405 820615 827693 823280 809086 787958 763188 738196 716322 700490 692551 692467 697898 704700 708228
59392 708228 704886 693125 673487 647961 619258 590189 563028 539105 519079 503444 492297 484608
59380 484608 478464 472577 467226 463344 461167 460270 460493 461974 464366 466786 468653 469998 470862 470985 470355
59365 470355 469570 469355 470021 471603 474083 477215 480474 483585 486917 491018 495933 501394 507579 515240 524878
59350 524878 536123 548231 561055 575239 591439 609643 629345 650068 671398 692705 713291
59339 713291 732928 751846 770044 786853 801310 812676 820330 823533 821751 815255 805142 792730
59327 792730 778933 764007 747707 729869 711069 692608 675586 660121 645711 632140 619695
59316 619695 608599 598674 589654 581509 574340 568171 562954 558651 555222 552635 550869 549845 549445 549744
59302 549744 551188 554375 559712 567437 577853 591282 607748 626763 647295 667650 685428 698007
59290 698007 703503 701502 693042 679957 664112 647030 630071 614704 602238 593159 586985 583005 580982
59277 580982 580993 582917 586436 591363 597576 604821 612997 622602 634330 648114 662956 677837 692426
59264 692426 706633 719797 730672 738173 741932 742146 739069 732815 723668 712396 699910 686494 671691
59251 671691 655321 638389 622505 608469 595905 584342 574073 565683 559209 554263 550758 549079
59239 549079 549630 552514 557592 564421 572105 579609 586446 592929 599581 606415 612932 618689 623563 627385
59225 627385 629565 629300 626172 620360 612283 602311 590943 579044 567515 556750 546667 537288 528945
59212 528945 521779 515422 509459 504037 499596 496101 492950 489719 486592 483933 481778 480012 478736 478091
59198 478091 477928 478027 478540 479790 481721 483964 486450 489497 493225 497404 502028 507402 513357 518930 523422
59183 523422 527370 531891 537288 542908 548112 552682 556385 558968 560798 562874 565916 569867 574387 579328
59169 579328 584560 589950 595891 603337 612793 623569 634450 644868 655058 665269 675230 684265 691609
59156 691609 696729 699630 700763 700435 698387 694122 687479 678686 668103 656171 643492 630705 618333
59143 618333 606837 596573 587520 579336 571953 565853 561366 557930 554509 550696 547019 544117 542034 540480
59129 540480 539539 539830 541937 545739 550348 554789 558808 562959 567971 574153 581392 589492 598412 608333 619480
59114 619480 631653 643998 655551 666100 676153 686087 695733 704900 713644 721812 728902 734928 740890
59101 740890 747712 754942 761132 765363 767902 769472 770519 771222 771633 771548 770524 768228 764710 760420 756122
59086 756122 752603 750064 747844 745007 741206 736694 731610 725622 718281 709413 699137 687768 675760
59073 675760 663550 651423 639666 628686 618767 609785 601445 593713 586727 580389 574421 568789 563726
59060 563726 559311 555380 551947 549335 547648 546329 544456 541468 537530 533302 529457 526341 523900 521818
59046 521818 519738 517545 515546 514248 513808 513842 514003 514619 516327 519106 522097 524525 526400 528225 530446
59031 530446 533370 537147 541491 545830 550102 555076 561547 569525 578528 588380 599355 611799 625972
59018 625972 641932 659170 676532 692855 707460 719859 729398 735610 738624 738803 736336 731607 725649
59005 725649 719731 714675 710881 708666 708112 708949 711091 714983 720907 728282 736154 743948 751195 757005 760693
58990 760693 762613 763518 763294 761161 756994 751542 745280 737884 729027 718977 708205 697032 685877 675398
58976 675398 666150 658395 652265 647827 645054 643991 644746 647107 650584 655218 661744 670301 679609 688315
58962 688315 696676 705888 716208 726893 737640 748512 758514 765743 769284 769635 766995 760606 750494
58949 750494 738420 726129 713639 700241 686386 673500 662420 653029 645185 639232 635664 634741 636194
58936 636194 638950 641491 642812 642737 641168 637709 632404 626170 619797 613012 605130 596301 587493 579479 572402
58921 572402 566162 560769 556291 552713 549754 546841 543563 540278 537811 536486 535971 536155 537490 540193 543815
58906 543815 548073 553457 560457 568696 577401 586397 596173 607334 620375 635421 651618 667154 680541
58893 680541 691766 701896 711940 722510 734102 747061 761452 777465 795687 816477 839175
58882 839175 862305 884403 904365 921316 934567 943663 948298 948438 944560 937273 926482 911507 892382
58869 892382 870528 847716 824914 802582 781404 761990 744264 727947 713367 701089 690903
58858 690903 681841 673109 664421 655570 646249 636375 626168 615951 606149 597286 589579 582692 576221 570268
58844 570268 565174 560886 556946 552969 548793 544379 539870 535568 531596 527818 524299 521435 519293 517283
58830 517283 514946 512617 510764 509104 507039 504669 502642 501163 499855 498537 497493 496954 496876 497309 498438
58815 498438 500130 501848 503185 504220 505315 506841 509009 511648 514104 515655 516136 515986 515688 515270 514391
58800 514391 512803 510758 508898 507658 506846 506073 505467 505475 505992 506241 505697 504620 503474 502455 501826 502201 504015
58783 504015 507151 511387 516702 522798 528889 534405 539445 544158 548225 551388 553926 555990 556987 556224 553780
58768 553780 550264 546167 541978 538375 535566 532829 529391 525470 521913 519163 517177 515874 515004 513966
58754 513966 512579 511825 513132 517021 522847 529497 535887 541263 545741 550158 554874 559267 563000 567043
58740 567043 572504 579034 585439 591409 597545 604036 610557 617304 624918 633411 642170 651014 660194 669378
58726 669378 677667 684746 691080 696896 701862 705803 708778 710411 710203 708674 707253 706844 707442 709270 713054
58711 713054 718737 724945 730380 734963 739098 742589 744900 745820 745204 742510 737231 729460 719586 707686
58697 707686 693582 677319 659376 640669 622429 605634 590370 576110 562753 550957 541257 533310
58685 533310 526322 519857 513963 508751 504128 499852 495705 491662 487855 484343 481116 478397 476583 475634
58671 475634 475012 474625 475318 477813 481706 486298 492023 499985 510245 521593 532977 544108 554488 562957
58657 562957 568787 572488 575024 576642 576846 575206 571920 567820 563837 560218 556368 551802 547008 542854
58643 542854 539372 535782 531565 526841 521930 517312 513873 512298 512163 512446 512937 514311 516788 519598 521933
58628 521933 523629 524738 525206 525210 525060 524639 523534 521844 520190 518975 518396 519139 522091 527225 533699 541234
58612 541234 550407 561289 572692 583157 591976 599013 604367 608516 611963 614375 614805 613078 610177 607006
58598 607006 603530 599456 594963 590427 586159 582684 580477 579126 577528 575286 573170 572037 572150 573796
58584 573796 577508 583251 590307 598407 607997 618992 630276 640961 651062 660394 668003 673634 678659
58571 678659 684404 690362 695293 699529 704981 713073 723697 736063 749684 764499 780781 798995 819318
58558 819318 841178 863438 884930 904762 922554 938527 952929 965150 973916 978570 979577 977544
58546 977544 972532 964733 955091 944576 933285 920745 906734 891438 875265 858850 842736 826630
58534 826630 809518 790927 771649 752922 735466 719686 706128 695185 686685 680201 675466 672271
58522 672271 670430 669975 670904 672648 674539 676818 680308 684815 688871 691456 693067 694637 696353 698134 700332
58507 700332 703154 706100 708647 710859 712695 713449 712638 710809 708772 706547 703676 700043 695747 690737 685200
58492 685200 679863 675316 671473 668170 665800 664925 665704 668019 671548 675484 679038 682665 688003 696126 706606
58477 706606 718667 732226 747155 762477 777116 790639 802601 811968 817977 820758 820359 816022 807404
58464 807404 795859 783605 772050 761595 752387 744502 737935 733102 730721 730660 731711 733178 735812 740440
58450 740440 746530 753004 759507 765836 770868 773234 772593 769391 764013 757059 749768 743105 736953 731124
58436 731124 726538 724300 724108 724669 725460 727154 730562 735865 742628 749946 757000 764014 772281 782800 795399
58421 795399 809439 824463 839679 853854 866392 877499 886642 892048 892684 889704 884939 878984 871782
58408 871782 863979 856397 849011 841608 834674 828592 822814 816900 811447 806952 802821 798668 795574 794682
58394 794682 795533 797102 799421 802730 806084 808523 810771 814051 817871 820614 821682 821473 819899 816698 812716
58379 812716 809129 805699 801310 795910 790481 785557 781220 778173 777225 778032 779688 782305 786708 793026 800845
58364 800845 810291 821568 833949 846544 859590 873690 888316 902407 915859 929107 941800 953185
58352 953185 963117 971424 977180 980031 981350 982566 983338 983024 982829 984528 987978 992008 996971 1004297 1014126
58337 1014126 1025556 1038615 1053819 1070236 1086235 1101792 1117960 1134429 1149827 1164129 1178502
58326 1178502 1192830 1205572 1216081 1225162 1233343 1240388 1246426 1251879 1256422 1259689 1262599 1266337 1270576
58313 1270576 1274485 1278749 1284622 1291638 1298500 1305683 1314888 1326326 1338745 1351773 1366073 1381566 1397563
58300 1397563 1414245 1432005 1449954 1467100 1484143 1501913 1519107 1534177 1548436 1564447 1582122
58289 1582122 1599420 1616186 1634164 1653739 1673800 1694484 1716943 1740654 1764001 1787287 1812157
58278 1812157 1838406 1864448 1890658 1919108 1950208 1982631 2016235 2052011 2089612 2128066 2168323
58267 2168323 2211833 2257417 2303076 2350101 2401545 2457374 2515173 2574946 2638845 2706593 2775619
58256 2775619 2845336 2916754 2988230 3056416 3121353 3185968 3250786 3314182 3377670 3445589 3519261
58245 3519261 3596594 3677604 3764940 3858815 3957073 4060678 4173385 4295583 4424339 4559951
58235 4559951 4706247 4863824 5029451 5203030 5388662 5587872 5798455 6021048 6260001
58226 6260001 6516736 6789336 7079820 7394445 7735617 8101153 8492714 8916997 9377547
58217 9377547 9874153 10411838 11001350 11649344 12357801 13134828 13995908 14953080 16014599
58208 16014599 17197933 18531766 20043727 21760377 23723485 25994137 28640549 31740892
58200 31740892 35404550 39773918 44999709 51232882 58648645 67464945 77945838 90429791
58192 90429791 105375639 123350708 144942290 170658215 200796498 235131559 272408788
58185 272408788 309991671 344080726 370538522 385944081 388468023 378339778 357756206
58178 357756206 330165325 299172333 267618496 237247609 208895170 182848877 159145805
58171 159145805 137771735 118754343 102128524 87841370 75719666 65522922 56997341
58164 56997341 49885808 43935325 38926394 34688081 31081211 27985150 25306775 22982851
58156 22982851 20961637 19191600 17631177 16253975 15036076 13948515 12967459 12080577
58148 12080577 11277450 10543311 9867349 9247643 8682444 8164628 7689042 7256744 6867104
58139 6867104 6513216 6189397 5895773 5631000 5387340 5157328 4939079 4731295 4529591
58130 4529591 4332004 4142291 3963659 3794420 3633166 3482526 3343942 3213990 3089732
58121 3089732 2973004 2865795 2765878 2670556 2580460 2496356 2416244 2338783 2265720 2198061 2133709
58110 2133709 2071593 2014068 1962343 1913475 1864768 1817341 1772490 1728449 1683937 1641229 1602359
58099 1602359 1565474 1528134 1491232 1456571 1423374 1390325 1358472 1329194 1301553 1274349 1248595
58088 1248595 1225493 1204162 1183637 1164893 1148715 1133747 1118689 1104156 1090491 1076146 1060225
58077 1060225 1044095 1028465 1011473 991823 971256 951614 931956 911067 890431 872049 855353
58066 855353 838828 822867 808551 795421 782885 772150 764301 757944 751025 743610 736725 729871 721884
58053 721884 713008 704024 694471 683678 672475 662090 652395 642886 634246 627387 621996 617390 613550
58040 613550 610086 605618 599622 593490 588383 583533 578067 572844 568863 565290 560692 554897 548164 540004
58026 540004 530393 520817 512528 505027 497551 490585 484526 478510 472141 466749 463239 460224 456104 451521
58012 451521 447985 445424 442946 440663 438885 436792 433838 431305 430573 430966 431038 430880 431295 431900 432004 432273
57996 432273 433470 434451 433474 430811 428142 425988 423581 420755 418221 416371 415254 415191 416067 416713 416294 415541
57980 415541 415372 415290 414558 413811 413860 413905 412714 410710 409125 407950 406550 405493 405818 407088 408029 408660 410018
57963 410018 412230 414491 416570 418677 420313 420799 420573 420421 419906 418055 415076 411821 408146 403482 398582
57948 398582 394922 392628 390566 388215 385969 383967 382184 381295 381943 383525 385197 387567 391724 397104 402254
57933 402254 407392 414192 423043 432422 441154 449478 457627 465033 471305 476496 480002 480622 478228 474199
57919 474199 469777 464953 459187 452196 443828 434163 424035 414670 406621 399683 393655 388472 383874 379843
57905 379843 376989 375523 374152 371075 365859 359402 352525 345749 339849 335169 330672 325145 319182 314596
57891 314596 311989 310329 308866 307973 307928 308280 308696 309275 309878 310259 310910 312648 315163 317047 317359 316238 314053
57874 314053 310982 307402 303606 299250 294125 289230 285834 283685 281529 279234 277817 277346 276526 274782 273267
57859 273267 273245 274777 277544 281755 287534 294293 301302 308245 314940 321264 327482 333866 339976 345175 349745
57844 349745 354393 358707 361411 362294 362583 363067 363059 361636 358832 355218 351330 347853 345321 343301 340842 337994
57828 337994 335810 334627 333603 332337 331645 332133 333212 334285 335789 338123 340483 341761 342007 342121 342492
57813 342492 342686 342204 341040 339647 338543 337667 336034 332481 326782 319631 311680 303277 294994 287463 280688
57798 280688 274426 269248 266162 265120 265000 265231 266271 268201 270073 271139 271653 271986 272041 272121 273224 275752
57782 275752 278834 281674 284645 288280 292073 295218 297921 301057 304975 309304 313514 317065 319494 320930
57768 320930 322111 323336 323836 322622 319484 314758 308748 301906 294961 288222 281254 273806 266584 260428
57754 260428 255135 249779 243950 238105 232873 228553 225159 222518 220304 218225 216175 214205 212490 211234
57740 211234 210311 209182 207628 206292 205849 205803 205059 203628 202706 202873 203327 203268 202985 202981 203035 202918 203202 204437 206073
57721 206073 207112 207434 207714 208276 208784 208961 209005 209253 209713 209913 209180 207346 205201 203775 203091 202186 200481
57704 200481 198485 196904 195750 194711 193757 192935 192098 191261 190754 190699 190801 190927 191348 192095 192727 193059 193434 193861
57686 193861 193610 192271 190679 190154 191237 193581 196632 199957 203472 207917 214693 224734 237885 253847
57672 253847 273202 296993 325757 359672 399460 446495 501667 563794 628431 687996 733892
57661 733892 759518 761902 741395 701077 646667 585645 524989 469317 420783 379779 345449 316526
57649 316526 292507 273627 259441 248286 238673 230422 223791 218277 213102 208323 204567 202022 200361
57636 200361 199300 198589 197796 196667 195421 194292 193213 192262 191793 191701 191248 190154 189117 188646 188159 187046
57620 187046 185839 185337 185161 184268 182522 180762 179476 178356 177047 175627 174413 173808 174014 174429 173838 171905
57604 171905 169986 169631 170664 171584 171480 170690 169865 169338 169238 169351 168945 167483 165417 163656 162419 161199
57588 161199 159560 157323 154397 151206 148865 147998 147719 146712 144956 143372 142083 140320 138007 136128 135260
57573 135260 134789 133968 132852 131849 131104 130644 130463 130192 129316 127947 126803 126218 125760 125051 124344 124094 124418
57556 124418 125215 126352 127608 128815 130128 131748 133448 134841 136044 137439 138856 139659 139659 139236 138530 137276
57540 137276 135629 134339 133830 133702 133507 133379 133514 133585 133196 132547 132179 132194 132083 131213 129337 126809 124407 122788
57522 122788 122002 121662 121512 121622 122098 122879 123787 124567 125006 125286 126020 127580 129560 131341 133002 135161 137995
57505 137995 140914 143214 144567 144906 144315 143119 141727 140362 139171 138388 137971 137289 135722 133467 131310
57490 131310 129716 128637 127993 127693 127282 126257 124774 123501 122824 122717 123302 124788 126814 128561 129656 130400
57474 130400 131077 131634 132083 132558 132809 132246 130677 128460 125916 123234 121068 120417 121518 123380 124773 125306
57458 125306 125398 125666 126488 127691 128453 127998 126599 125484 125618 126927 128726 130309 131099 130908 130291 130113 130522
57441 130522 130861 130736 130636 131272 132766 134664 136228 136657 135655 133966 132727 132169 131622 130875 130653 131421 132646
57424 132646 133771 135061 136868 138738 140037 140932 141979 143135 143868 143923 143370 142230 140700 139447 139021 139182
57408 139182 139369 139587 140188 140962 141099 140072 138027 135447 132967 131407 131262 132041 132635 132591 132567 133360 134843
57391 134843 136170 136797 136965 137244 137885 138778 139910 141613 144154 147255 150326 153165 156051 158989 161274
57376 161274 162103 161456 160110 158910 158222 157929 157654 157035 155998 154787 153667 152701 151825 151003 150204 149389 148648
57359 148648 148268 148530 149523 151153 153153 155044 156282 156636 156420 156343 157140 159159 162090 165118 167571 169372
57343 169372 170719 171547 171709 171527 171654 172323 173152 173715 173858 173419 172243 170720 169803 170117 171322 172596 173429
57326 173429 173715 173472 172836 172169 171819 171846 172143 172651 173315 174006 174680 175458 176411 177381 178045 178075 177351 176259 175657
57307 175657 176084 177059 177669 177862 178545 180214 182147 183367 183884 184439 185370 186277 186711 186684 186476 186270 186096 186002
57289 186002 186177 186836 187931 189075 189947 190691 191654 192862 194038 195037 195833 196175 195762 194817 193987 193602 193513 193705
57271 193705 194495 195967 197756 199537 201181 202314 202438 201814 201590 202607 204549 206699 208931 211494 214309
57256 214309 217043 219538 221699 223298 224311 225148 226095 226863 227099 227037 227185 227710 228587 230010 232150 234704
57240 234704 237171 239413 241572 243710 245879 248317 251110 253926 256478 259022 261915 264886 267199 268486
57226 268486 269101 269848 271603 274867 279239 283535 286874 289503 292310 295798 299878 304234 308406 311838 314404
57211 314404 316691 319315 322179 324928 327775 331229 335230 339331 343663 348865 354874 360497 364614 367456
57197 367456 370369 374539 380147 386583 393182 399738 406436 413512 421152 429620 439121 449469 460215 471174
57183 471174 482498 494183 506014 518072 530623 543248 554871 565233 575664 587633 601079
57172 601079 614982 629179 644618 661936 680713 700188 720009 740168 760737 781733 802808
57161 802808 823286 843010 862888 883864 905512 926528 946589 966783 988033 1009932 1031505
57150 1031505 1052385 1072786 1092919 1112981 1133384 1154505 1176349 1198733 1221641 1245309 1270145
57139 1270145 1296639 1325083 1355269 1386701 1419110 1452526 1486989 1522654 1560193 1600548 1644063
57128 1644063 1690210 1738334 1788364 1840744 1896069 1954938 2017763 2084481 2154729 2228502 2306439
57117 2306439 2389353 2477867 2572624 2674548 2784659 2903931 3033546 3175083 3330258 3500760
57107 3500760 3688671 3896980 4129594 4391035 4686574 5022982 5409464 5858371 6385622
57098 6385622 7011054 7758875 8657965 9741307 11044174 12601757 14447301 16610796 19117073
57089 19117073 21982090 25207378 28774215 32639940 36738434 40985040 45284342 49537967
57081 49537967 53648885 57519184 61042028 64094134 66537114 68230752 69053501 68922811
57073 68922811 67810360 65749446 62832357 59198353 55017394 50475102 45759674 41048278
57065 41048278 36493211 32211760 28282697 24748599 21621664 18891146 16530660 14503951
57057 14503951 12769375 11284164 10008256 8906492 7949357 7113442 6381443 5740541 5179752
57048 5179752 4688556 4257399 3878296 3544459 3249981 2990169 2761593 2561221 2385640
57039 2385640 2231200 2094425 1972180 1861980 1762445 1673130 1593798 1524208 1464542 1415365
57029 1415365 1377027 1349813 1335015 1335169 1352846 1389820 1447586 1527071 1625369 1731577 1826381
57018 1826381 1887399 1897357 1850196 1752107 1617846 1465075 1309604 1162964 1031927 919141
57008 919141 824184 744795 678049 621404 573319 532934 499174 470450 445378 423336 403912
56997 403912 386234 369380 353134 337786 323458 310282 298894 289950 283280 278352 275463 275631 279292
56984 279292 285947 295036 306059 317585 327085 332267 332015 325975 314313 298339 280415 262553 245601
56971 245601 230116 217060 206912 198880 191963 186431 183490 183783 186897 192238 199841 210387 224745
56958 224745 243255 265100 288481 311369 331761 347224 355146 354117 344834 329411 310267 289772
56946 289772 269999 252003 235742 221229 209341 201038 196382 194920 196468 200867 207569 216398 228444
56933 228444 245342 267673 294551 324309 354691 382492 403962 415960 416640 405546 383943 355089
56921 355089 323320 292247 263714 238173 215563 195838 179057 165158 153673 143976 135911 129740
56909 129740 125237 121334 117104 112641 108492 104777 101478 99053 97946 97873 98426 100079 103635 108843 114554
56894 114554 120316 126897 135125 145088 156752 170543 186889 205750 226873 249864 273527 295535
56882 295535 313202 324502 328440 325146 316012 303308 289136 274862 261524 250222 241684 235834
56870 235834 232377 231643 234483 241451 252612 268220 289144 316397 350440 391074 437647 488729
56858 488729 541356 590857 631776 659230 669953 663055 640579 607036 567593 526354 486402 450796
56846 450796 422308 401997 389022 382438 382537 390038 404903 426880 456717 495944 545671 606241
56834 606241 677496 758018 843587 926803 998452 1049441 1072670 1065059 1028811 970491 898345 820133
56822 820133 742445 670465 607453 554699 512335 480156 457728 444308 439127 441755 452237 471065
56810 471065 498996 536527 583266 637593 696475 755173 807337 846124 865914 863625 839338 796402
56798 796402 740693 678824 616350 557188 503932 458009 419656 388432 364009 346326 335204
56787 335204 330254 331074 337248 348355 364406 385884 412645 442720 472697 499111 518989 529468
56775 529468 528085 514028 488796 455540 418060 380032 344185 311698 282684 257250 235644 217527
56763 217527 201950 188277 176517 166617 158134 150826 144864 140141 136006 132045 128496 125462 122358
56750 122358 118726 115149 112686 111582 111012 109974 108094 105685 103362 101477 99763 97701 95322 93333
56736 93333 92295 92001 91853 91483 90789 89808 88867 88502 88860 89450 89804 90046 90503 91059 91400 91649 92271 93448
56718 93448 94926 96401 97747 98883 99786 100545 101237 101808 102297 103045 104370 106155 108025 109779 111370 112619
56702 112619 113383 113930 114656 115349 115222 113919 112119 110829 110318 110109 109803 109459 109195 108933 108693 108713 108966 108943
56684 108943 108294 107436 107054 107160 107244 107229 107559 108163 108086 106568 103994 101340 99151 97513 96571 96418 96722 97020
56666 97020 97232 97412 97282 96597 95764 95452 95677 95887 95885 96056 96730 97969 99956 102852 106131 108743 110249 111283
56648 111283 112611 114216 115574 116372 116621 116492 116423 117097 118873 121211 123002 123556 123248 123143 123932 125321 126629
56631 126629 127806 129332 131043 131880 131353 130535 130740 131669 131905 130972 129841 129369 129367 129455 129805 130542 131200 131272 130827
56612 130827 130234 129712 129375 129223 128908 128053 126991 126574 127058 127752 127964 127674 127070 126118 124863 123518 121977
56595 121977 119899 117582 116040 115848 116554 117548 118693 119735 119997 119366 118840 119285 120221 120592 120292 120149 120730
56578 120730 121890 123263 124555 125561 126446 127797 129876 132062 133523 134246 134985 136445 138894 142203 145870
56563 145870 149321 152663 156843 162698 170225 179119 189370 200605 211368 220011 226215 230943 234986
56550 234986 238175 239984 240264 239316 237718 236116 234786 233342 231174 228181 224845 221726 219071 216784 214562
56535 214562 212179 209704 207247 204532 201231 197730 194888 192787 190459 187214 183533 180151 177119 174422
56521 174422 172708 172406 172713 172445 171501 170518 169484 167854 165794 164148 163060 161716 159644 157389 155615
56506 155615 154341 153395 152951 153209 153989 154939 155790 156277 156195 155701 155232 154992 154831 154624 154401 154097 153493 152533 151435
56487 151435 150539 150179 150592 151635 152751 153527 154126 154811 155327 155229 154675 154367 154711 155406 155890 155890 155620 155618 156218 157014
56467 157014 157202 156697 156409 157073 158353 159605 160864 162261 163056 162353 160613 159423 159681 160845 162015 162910
56451 162910 163621 164173 164685 165432 166445 167396 168008 168277 168326 168370 168736 169521 170336 170777 170961 171225 171624 172189 173246
56432 173246 174775 175845 175556 174375 173595 173557 173384 172546 171733 171819 172713 173641 174110 174316 174895 176293 178147 179478
56414 179478 179864 180089 181057 182520 183596 184088 184376 184406 183932 183532 184103 185381 186244 186510 187130 188413 189510
56397 189510 190087 191073 193015 194962 195911 196351 197363 198962 200270 200789 200685 200304 200127 200723 202055 203233
56381 203233 203535 203176 202553 201395 199463 197546 196809 197371 198304 198957 199620 200919 203054 205557 207458 207900
56365 207900 206998 205912 205744 206614 208093 210121 212946 216418 219915 222938 225417 227508 229372 231015 232099
56350 232099 232096 230856 228844 226651 224588 222966 222270 222641 223459 223932 223931 223921 224254 224938 225923 227227 228770 230379
56332 230379 231917 233285 234401 235356 236427 237797 239356 240903 242395 243906 245510 247264 249106 250673
56318 250673 251454 251276 250526 249888 249892 250636 251696 252417 252526 252326 252152 251997 252059 253148 255767 259019 261344 262391
56300 262391 263354 265383 268467 272032 275677 278919 281043 281792 281709 281437 281167 281150 282050 284212 286968 289203
56284 289203 290394 290811 291045 291649 292849 294284 295280 295686 296171 297519 299929 303157 306931 311054 315393 319934
56268 319934 324562 328818 332274 335107 337866 340848 344282 348981 355882 364838 374662 384589 394923 406128
56254 406128 418118 430756 444266 458850 474638 492283 512688 535787 560454 586065 613287
56243 613287 642769 673890 705415 736655 767352 797091 825449 852169 876593 897417 913576
56232 913576 924873 931386 932901 929382 921334 909136 892731 872584 850280 827496 804844 782242
56220 782242 759839 737891 716272 694831 673889 653926 635110 617504 601234 586087 571482
56209 571482 557238 543795 531375 519518 507897 496953 487326 479270 472854 468025 464205 460696 457738
56196 457738 456163 455689 454742 452568 450355 449535 450026 450964 452027 453168 454012 454576 455691 457803 460162 462044
56180 462044 463847 466075 468241 469835 471424 473620 475856 477395 478771 480979 483971 487116 490475 494420
56166 494420 498673 502972 508030 514541 521825 528725 535376 542860 551543 560912 570668 580960 592001 604358
56152 604358 619002 636106 654505 673394 693725 716864 742927 771821 804911 843952 889115
56141 889115 939869 997269 1063626 1140210 1226855 1323385 1429550 1543438 1661276 1778652 1890837
56130 1890837 1992656 2080123 2152728 2213207 2265213 2311853 2355284 2395627 2430189 2455215 2468585
56119 2468585 2470231 2460962 2442498 2417838 2389437 2356761 2316684 2265864 2201671 2122074 2027046 1920107
56107 1920107 1806833 1692006 1579427 1473392 1377828 1294058 1221345 1159448 1108709 1068010
56097 1068010 1035003 1008486 988491 973948 962466 952718 945085 939625 935322 931694 929336 928449 928458 929284
56083 929284 931364 934259 936904 939319 942457 946372 950355 954818 961034 968925 977050 984959 993591 1003229
56069 1003229 1013073 1023079 1034212 1046620 1059478 1072812 1087476 1103199 1118706 1133935 1150063
56058 1150063 1167266 1184652 1202443 1221726 1241791 1260303 1276631 1292556 1309158 1325490 1340952
56047 1340952 1356456 1372416 1387981 1403175 1419604 1438128 1457864 1478170 1499559 1522102 1545024
56036 1545024 1568468 1593550 1620352 1648003 1676927 1708501 1742380 1776936 1812515 1851216 1893046
56025 1893046 1935541 1977759 2021349 2066897 2112744 2158484 2206203 2256926 2309140 2362157 2417723
56014 2417723 2476886 2538473 2602023 2668958 2739522 2811919 2885923 2963916 3046867 3132860 3221181
56003 3221181 3314124 3413019 3516248 3623252 3736729 3858658 3987729 4122868 4265772 4417860
55993 4417860 4578282 4747019 4926265 5116817 5317058 5527555 5752565 5994967 6254014
55984 6254014 6530124 6827262 7148349 7493257 7863665 8264772 8699867 9168929 9675397
55975 9675397 10228551 10836444 11502786 12233916 13042311 13940207 14937448 16049678 17301469
55966 17301469 18718412 20325982 22161867 24281756 26751117 29645865 33070179 37162711
55958 37162711 42077220 47968985 55009369 63404673 73403168 85317293 99564526 116669194
55950 116669194 137195019 161654557 190391286 223301442 259344419 296119277 329950643
55943 329950643 356629785 372487499 375326055 364932087 343082100 313024570 278573075
55936 278573075 243179677 209380258 178708547 151876642 129003947 109829023 93903229
55929 93903229 80731923 69840887 60802957 53260094 46930281 41588383 37046562 33154186
55921 33154186 29799075 26893320 24360170 22137258 20180923 18456964 16931243 15573887
55913 15573887 14365083 13289505 12329558 11468953 10697354 10005951 9382658 8816171 8300404
55904 8300404 7830659 7399550 7000649 6632043 6292463 5977648 5683829 5410751 5157779
55895 5157779 4920903 4696992 4487223 4292863 4111418 3940379 3781057 3635042 3500258
55886 3500258 3374229 3258093 3153641 3059301 2972912 2895967 2831218 2777946 2732842 2693585 2658225
55875 2658225 2622764 2582717 2536103 2482618 2421506 2352697 2278430 2201268 2121837 2040568 1959892
55864 1959892 1882459 1808760 1738661 1673569 1614796 1561294 1511243 1464577 1421885 1382337 1344819
55853 1344819 1309802 1278026 1248483 1219595 1191170 1163480 1135785 1107616 1080178 1054653 1030365
55842 1030365 1006288 983040 961608 941479 921811 903101 885866 868993 851375 834007 818539
55831 818539 804804 791655 779145 767981 757759 747687 738280 730502 723811 716611 708071 698184 686919
55818 686919 674678 662759 651947 641438 630382 619488 609806 601032 592484 584685 578465 573371 568475
55805 568475 563941 560465 558107 556902 557510 559886 562498 564383 566791 571189 576754 581542 584949 587230
55791 587230 587713 585650 582043 578564 575246 571124 566528 562708 559637 556099 551613 546384 539641 530010
55777 530010 517593 504085 490848 478277 466957 457909 451654 448216 447954 451167 457048 464058 470948
55764 470948 476389 478380 475611 469106 461084 452580 443545 434632 426955 420205 412769 403898 394287 384443
55750 384443 373970 362690 351179 339958 329269 319681 311726 304886 298154 291670 286651 283559 281539
55737 281539 279811 278544 278075 278273 278960 280088 281240 281698 281180 279954 278237 276017 273290 269845 265136
55722 265136 259041 252471 246501 241336 236846 233494 231639 230450 228842 227279 227387 229893 234021 238803
55708 238803 243855 248885 253540 257800 261661 264519 265731 265514 264288 261470 256172 248980 241789 235701
55694 235701 230199 224487 218615 213040 208073 203993 201005 198891 197286 196236 195893 195958 196196 197187 199644
55679 199644 203230 206973 210588 214378 218047 220733 222110 222430 221643 219576 216873 214634 213090 211579 209831
55664 209831 208264 207080 206089 205363 205139 205177 205147 205444 206609 208219 209523 210910 213414 216883 219983 222025
55648 222025 223519 224900 225996 226837 227679 228176 227690 226473 225242 223712 221004 217392 213955 210433 205356
55633 205356 198738 192658 188390 184711 180121 175150 171272 168775 166996 165668 164816 164062 163082 162165 161472
55618 161472 160411 158589 156676 155466 154636 153311 151345 149284 147414 145573 143616 141534 139379 137412
55604 137412 135985 135026 134147 133399 133260 133647 133740 133145 132442 132174 132093 131849 131641 131560 131019 129550 127609 126006
55586 126006 124925 124009 123035 122086 121440 121472 122223 122926 122643 121514 120704 120951 121933 123194 124722 126357 127656
55569 127656 128824 130736 133502 135944 137161 137757 138846 140676 142837 145010 146783 147552 147357 147159 147561
55554 147561 147928 147413 146154 144734 143241 141650 140419 139833 139315 138291 137193 136810 137146 137695 138305 138940
55538 138940 139166 138820 138723 139758 141597 143232 144470 145939 147794 149358 150007 149683 148532 146660 144316 141892
55522 141892 139722 138084 137095 136337 135047 133033 130935 129209 127455 125284 123218 121981 121372 120558 119139
55507 119139 117237 114937 112325 109823 107847 106330 105047 104069 103449 102882 102208 101786 101857 102051 102021 102064 102495
55490 102495 103051 103527 104337 105632 106548 106209 104989 103828 102902 101914 101167 101180 101611 101723 101673 102171 103038 103313
55472 103313 102780 102252 102247 102373 102183 101706 100943 99689 98078 96637 95676 95231 95550 96858 98671 100098 100838
55455 100838 101183 101125 100350 99092 98082 97526 96980 96396 96380 97167 98145 98718 98917 98921 98696 98400 98463 98906 99181 98990
55435 98990 98713 98769 99091 99518 100063 100528 100456 99895 99708 100620 102260 103528 103734 103143 102629 102914 103914 104761 104753
55416 104753 104246 104240 105139 106449 107669 108836 109992 110758 110831 110453 110008 109489 108660 107525 106356 105415 104799 104397
55398 104397 103943 103394 103159 103624 104397 104480 103344 101470 99727 98595 98126 98235 98763 99459 100131 100682 101017 101130
55380 101130 101272 101691 102209 102380 102046 101402 100541 99436 98416 98124 98728 99586 100006 100015 100056 100176 99916 99033 97999
55361 97999 97625 98231 99323 100225 100795 101289 101568 101069 99740 98444 97952 97976 97751 97228 96988 97206 97405 97225
55343 97225 96806 96376 96050 96120 96951 98385 99685 100226 100016 99529 99328 99757 100632 101280 101247 100920 101061 101871 102863
55324 102863 103484 103397 102431 100815 99358 98769 98848 98783 98150 97076 95746 94445 93885 94617 96168 97495 98277
55307 98277 98962 99705 100178 100475 101119 101989 102251 101672 101010 100739 100349 99418 98459 98012 97700 96930 95982 95688 96413
55288 96413 97941 99927 101894 103139 103248 102550 101684 100973 100463 100225 100268 100507 101041 102053 103186 103554 102754
55271 102754 101384 100204 99283 98363 97548 97113 97002 96999 97140 97507 97888 98009 97885 97702 97606 97810 98497 99449 100195
55252 100195 100703 101416 102408 103142 103304 103195 103010 102504 101807 101709 102470 103140 102848 102119 102040 102677 103248 103420 103476 103518
55232 103518 103450 103524 104021 104542 104480 104059 104056 104595 105048 105055 104824 104459 103867 103372 103509 104084 104246 103733 103248 103325 103616
55211 103616 103667 103683 104011 104477 104793 105216 106194 107543 108506 108589 108019 107408 107173 107235 107203 106909 106748 107260 108313 109012
55191 109012 108623 107349 105990 104995 104173 103311 102725 102892 103684 104337 104371 104273 104863 106131 107211 107538 107445 107347 106967
55172 106967 105936 104722 104237 104589 104902 104442 103484 102870 103114 104103 105381 106486 107122 107205 106871 106506 106672 107748
55154 107748 109504 111267 112635 113778 114864 115525 115274 114258 113234 112857 113213 113916 114431 114402 113868 113076 112110
55137 112110 111017 110248 110363 111060 111142 109964 108317 107292 106846 106261 105556 105424 105975 106525 106701 106836 107132 107200
55119 107200 106757 106132 105803 105914 106416 107236 108169 109047 110061 111383 112526 112719 112038 111440 111454 111603 111473 111625
55101 111625 112885 115158 117543 119314 120334 120717 120544 119876 118848 117810 117319 117624 118132 117861 116583 115075
55085 115075 114090 113652 113564 113937 114770 115565 115950 116237 116787 117213 116832 115652 114252 112930 111611 110442 109737
55068 109737 109331 108676 107765 107371 108080 109476 110541 110668 110108 109599 109657 110122 110363 110046 109562 109488 109805 110002 109850
55049 109850 109614 109526 109603 110031 111181 112886 114201 114277 113251 111915 110783 109905 109360 109386 109966 110715 111309 111741
55031 111741 112109 112464 112922 113638 114467 114944 114779 114174 113482 112795 112135 111788 112030 112567 112691 112098 111257 110784 110705
55012 110705 110535 109944 109112 108471 108286 108541 109076 109699 110136 110073 109467 108835 108924 109916 111168 111983 112446 113166 114402
54993 114402 115924 117629 119696 121952 123697 124418 124314 123840 123181 122505 122307 122966 124154 125129 125494 125405 125208
54976 125208 125259 125877 127019 128077 128370 127830 126959 126256 125987 126285 127043 127787 128060 127882 127538 127135 126760 126817 127646
54957 127646 128933 130076 131030 132133 133169 133362 132479 131226 130309 129702 129174 128904 129172 129903 130912 132163
54941 132163 133409 134034 133676 132692 131612 130531 129422 128558 128064 127467 126386 125399 125485 126723 128299 129750
54925 129750 131435 133641 136029 138344 141027 144610 148955 153577 158389 163618 169250 175082 181142 187405
54911 187405 193115 197039 198580 198150 196189 192404 186525 179431 172755 167355 162737 158124 153498 149301
54897 149301 145667 142464 139914 138561 138578 139403 140144 140172 139371 138084 136862 136087 135765 135753 136119 137099 138764
54880 138764 140938 143411 146084 148950 152158 156020 160742 166129 171752 177345 182789 187821 192102 195570
54866 195570 198347 200193 200411 198479 194543 189167 182910 176348 170128 164650 159737 154941 150130 145635
54852 145635 141867 138944 136637 134557 132430 130307 128518 127309 126549 125842 124905 123748 122527 121314 120115
54837 120115 119049 118431 118518 119248 120311 121466 122598 123506 123919 123842 123600 123423 123233 123031 123152 123848 124903 126021
54819 126021 127265 128674 129735 129915 129598 129811 130880 131959 132080 131214 130131 129580 129815 130490 130853 130360 129274
54802 129274 128385 128118 128292 128724 129489 130476 131269 131733 132137 132467 132225 131284 130351 130049 130115 130126 130493 131882 133851
54783 133851 134998 134553 133212 132192 132023 132505 133416 134872 137042 139716 142246 144033 145117 146171 147794
54768 147794 150025 152678 155856 159817 164525 169713 175313 181456 188063 194692 200866 206293 210802 214149
54754 214149 215917 215592 212960 208547 203392 198138 192602 186492 180221 174497 169358 164215 158953 154435
54740 154435 151665 150712 150634 150300 149214 147700 146478 145986 146055 146215 146168 145966 145884 146360 147831 150362 153485 156636
54722 156636 159698 162919 166430 170167 174189 178762 183993 189530 194673 198686 201059 201617 200424 197618
54708 197618 193503 188790 184348 180436 176413 171577 166102 160860 156489 153006 150203 147932 145984 144092
54694 144092 142243 140693 139581 138703 137767 136684 135610 134800 134433 134436 134507 134412 134164 133854 133462 132972 132470 131993
54676 131993 131542 131420 132162 133763 135339 135995 135791 135419 135248 135286 135749 136843 138055 138429 137716 136595 135654
54659 135654 134825 133945 133212 132760 132389 132005 131814 131835 131755 131553 131662 132157 132407 132015 131536 131705 132406 133037 133482
54640 133482 134009 134506 134571 134260 134077 134257 134663 135356 136609 138229 139474 139820 139415 138657 137825 137283 137484 138344
54622 138344 139009 138695 137638 136850 137045 138097 139418 140502 141007 140658 139394 137596 136003 135212 135275 135794 136368
54605 136368 136833 137082 136966 136581 136464 137142 138432 139512 139801 139560 139476 139861 140474 140980 141265 141281 140879 139995 138884
54586 138884 137964 137402 137036 136750 136847 137882 140113 143188 146358 148887 150322 150683 150551 150754 151609 152472 152400
54569 152400 151322 150195 149836 149942 149687 149028 148831 149607 150748 151331 151319 151426 152002 152554 152448 151641 150637 150071
54551 150071 150439 151819 153569 154606 154368 153444 152937 153299 154055 154570 154767 155029 155712 156880 158322 159690 160736
54534 160736 161570 162578 164040 165859 167703 169369 170900 172421 173895 175032 175454 174956 173637 171822 169965
54519 169965 168591 168138 168628 169559 170253 170345 169903 169157 168293 167433 166636 165879 165137 164507 164183 164295 164818 165523 165952
54500 165952 165588 164323 162711 161558 161222 161432 161750 161945 161941 161704 161379 161363 162034 163378 164907 165985 166330 166327
54482 166327 166787 168151 169920 171085 171152 170565 170109 170190 170843 172162 174364 177458 181035 184376 186739 187696
54466 187696 187448 186736 186240 186029 185766 185401 185383 186050 187098 187938 188450 189055 190014 190975 191410 191290 191104 191328 192024
54447 192024 192856 193240 192663 191208 189735 189140 189341 189299 188128 185856 183149 180748 179341 179329 180191 180476 179070
54430 179070 176420 174028 172915 172989 173758 174990 176525 178004 179087 179668 179735 179296 178613 178256 178728 180074 181868
54413 181868 183420 184072 183614 182474 181316 180438 179778 179387 179507 180112 180748 180989 180867 180751 181066 182120 183868
54396 183868 185750 187042 187521 187576 187670 187988 188599 189508 190419 190863 190741 190387 189922 189011 187515 185936 184825 184074
54378 184074 183231 182228 181363 180758 180286 179964 179977 180320 180729 180979 181012 180855 180640 180648 181054 181703 182349 183002 183735 184260
54358 184260 184114 183322 182567 182583 183558 185111 186635 187602 187816 187522 187087 186492 185320 183361 181082 179325 178605
54341 178605 178784 179312 179625 179372 178530 177462 176686 176408 176272 175734 174702 173628 172864 172184 171182 170009 169354
54324 169354 169663 170663 171767 172658 173326 173721 173706 173340 173047 173339 174302 175350 175632 174861 173677 173098 173625 174995
54306 174995 176596 177874 178454 178295 177749 177199 176609 175714 174591 173660 173112 172786 172668 172950 173373 173098 171660
54289 171660 169651 168036 167055 166289 165574 165263 165550 166035 166152 165812 165430 165363 165469 165352 165048 165223 166396 168175
54271 168175 169639 170392 170697 170645 169946 168759 167939 167941 168104 167643 166908 166908 167932 169307 170331 170707 170255 168965
54253 168965 167420 166480 166420 166838 167455 168412 169628 170471 170405 169656 168958 168816 169117 169261 168627 167127 165341 163986
54235 163986 163334 163279 163708 164420 164938 164970 164998 165875 167760 169882 171369 171854 171302 169904 168260 167092 166477 165839
54217 165839 164910 164180 164086 164263 164065 163476 163012 162933 162992 162851 162470 162148 162380 163483 165118 166345 166453 165667 164856
54198 164856 164648 164981 165332 165144 164205 162888 161985 162032 162791 163553 163901 164054 164450 165199 165967 166316 166069 165331 164247
54179 164247 162917 161583 160663 160404 160608 160985 161596 162613 163731 164278 163979 163212 162396 161529 160515 159569 158992
54162 158992 158803 158797 158714 158226 157055 155400 154012 153573 154085 154997 155712 155873 155457 154831 154481 154474 154503 154576 155204 156591
54142 156591 158059 158793 158846 158881 159194 159630 160294 161659 163835 166277 168376 169898 170779 170924 170443 169754 169296
54125 169296 169335 170060 171412 172754 173185 172452 171158 169911 168719 167519 166762 166904 167652 168366 169024 170137 171710
54108 171710 172973 173327 172958 172229 171028 169183 167134 165591 164721 164209 163998 164326 164999 165291 164874 164365 164530
54091 164530 165269 165880 166068 166190 166566 167010 167183 167034 166749 166536 166553 166836 167169 167296 167340 167779 168759 169677 169768 169060
54071 169060 168481 168945 170475 172318 173794 174894 176004 177204 178015 177922 176997 175898 175337 175639 176625 177654
54055 177654 177920 177099 175797 175028 175167 175702 176126 176680 177906 179770 181649 183111 184353 185813 187673 189802
54039 189802 192006 194184 196363 198683 201362 204618 208551 212988 217451 221446 224913 228266 231823 235318
54025 235318 238200 240377 242377 244690 247119 248953 249750 249765 249612 249619 249679 249654 249656 249761 249629 248779 247197 245321
54007 245321 243331 240867 237749 234655 232586 231717 231225 230311 228994 227784 226992 226651 226885 227905 229626 231626
53991 231626 233610 235855 239082 243954 250686 259066 268824 279849 291886 303909 313999 320168 321382
53978 321382 317745 309937 298878 285891 272573 260080 248809 239009 231260 225813 221807 217938 213969
53965 213969 210845 209181 208352 207393 206095 204696 203057 200941 198818 197679 198037 199586 201672 203593 204670
53950 204670 204693 204330 204498 205354 206442 207750 209782 212467 214875 216469 217983 220550 224488 229393 234881
53935 234881 240567 245713 249725 252935 256274 260169 264210 267872 271013 273615 275531 276723 277431 277940 278354
53920 278354 278692 279044 279561 280419 281811 283845 286463 289600 293336 297744 302665 307868 313303 318873 323977
53905 323977 327730 329822 330873 331638 332058 331398 329288 326337 323621 321733 320475 319293 317745 315546 312492
53890 312492 308584 304143 299532 294822 289945 285092 280612 276501 272340 267908 263538 259604 255912 251942
53876 251942 247636 243630 240648 238868 237892 237168 236357 235408 234380 233264 231960 230394 228623 226843 225278
53861 225278 223910 222257 219762 216621 213948 212670 212464 212261 211693 211341 211562 211894 211868 211652 211398 210677 209197
53844 209197 207583 206701 206545 206487 206361 206511 206949 207260 207390 207798 208702 209778 210773 211798 212849 213584 213880 214199
53826 214199 215152 216980 219703 223449 228425 234747 242418 251294 261070 271643 283411 296691 310654
53813 310654 323205 332170 336344 335481 329995 321048 310363 299370 288722 278903 270828 265308 262221
53800 262221 260787 260483 261173 262566 264274 266426 269533 273505 277379 280397 282877 285570 288513 291065 292958
53785 292958 294726 296954 299554 302066 304364 306737 309414 312351 315464 318705 321749 323807 323993 321886
53771 321886 317719 312083 305560 298523 291256 284153 277703 272080 266799 261122 254974 249166 244510 240949
53757 240949 237879 235077 232877 231453 230413 229278 228028 226925 226037 225220 224479 224004 223786 223443 222598 221376
53741 221376 220327 219823 219781 220088 220993 222674 224557 225650 225737 225764 226721 228510 230283 231552 232437 233051 233285
53724 233285 233232 233314 233803 234488 234959 235038 234993 235474 237088 239706 242370 244299 245775 247550 249576 251094 252021
53707 252021 253357 255876 259086 261979 264320 266592 269085 271638 274121 276605 279085 281429 283663 286035
53693 286035 288814 292114 295776 299295 302078 304027 305616 307203 308564 309412 309989 310635 311063 310658 309408
53678 309408 307948 306702 305600 304765 304789 305952 307594 308694 308859 308444 307924 307490 307121 306707 306141 305512 305127
53661 305127 305105 305062 304510 303495 302490 301648 300576 298996 297263 295933 295100 294501 294061 293852 293607 292858 291651
53644 291651 290646 290249 290106 289835 289851 290893 292909 295002 296468 297362 297953 298207 298146 298287 299271 301182 303514
53627 303514 305693 307434 308780 310130 312131 315200 319078 323056 326658 329943 333162 336396 339595 342709
53613 342709 345612 348100 350264 352795 356629 362095 368513 374690 379758 383539 386374 388774 391144 393552
53599 393552 395782 397795 400037 402970 406276 408921 410175 410294 410019 409713 409242 408452 407376 406118 404771
53584 404771 403362 401674 399333 396334 393243 390604 388384 386341 384596 383345 382287 380941 379412 378211
53570 378211 377401 376557 375530 374521 373367 371585 369322 367458 366350 365226 363398 361484 360747 361590 363344
53555 363344 365264 367103 368801 370227 371370 372452 373759 375409 377267 379080 380948 383598 387735 393045
53541 393045 398478 403784 410003 417931 426834 435529 444189 453940 464880 475588 484804 492707 500235 507885
53527 507885 515602 523275 530900 538656 547168 557375 569683 583491 597803 612132 626632 641649
53515 641649 657542 674783 693858 715025 738297 763610 790775 819319 848516 877665 906299
53504 906299 934191 961296 987761 1013940 1040279 1067016 1093912 1120382 1145967 1170632 1194580
53493 1194580 1217988 1241065 1264189 1287635 1311240 1334592 1357554 1380318 1402880 1424690 1445026
53482 1445026 1463630 1480930 1497738 1514787 1532378 1550271 1567858 1584453 1599516 1612641 1623442
53471 1623442 1631506 1636553 1638642 1638120 1635203 1629732 1621470 1610539 1597304 1581934 1564492 1545465 1525747
53458 1525747 1505922 1485884 1465256 1443711 1420723 1395646 1368479 1340135 1311560 1283035 1254808
53447 1254808 1227772 1202705 1179228 1156398 1134156 1113195 1093527 1074300 1055347 1037976 1023672
53436 1023672 1012656 1004163 997528 992454 988756 986515 986199 988103 991804 996602 1002305 1009184 1017395 1026932
53422 1026932 1038071 1051362 1067089 1085017 1104711 1125856 1148300 1172050 1197252 1223987 1252061
53411 1252061 1281160 1311224 1342531 1375420 1410032 1446323 1484218 1523745 1565158 1608920 1655516
53400 1655516 1705188 1757881 1813410 1871687 1932759 1996577 2062665 2130086 2197811 2265173 2331952
53389 2331952 2398167 2463862 2528959 2593107 2655729 2716382 2774932 2831169 2884379 2933634 2978515
53378 2978515 3019235 3056025 3088735 3117137 3141332 3161684 3178425 3191321 3199573 3202161 3198509 3188666
53366 3188666 3172467 3148709 3115738 3072977 3021415 2962611 2897835 2828369 2755867 2681792 2606886
53355 2606886 2531711 2457399 2385337 2316276 2250224 2187013 2126486 2068210 2011491 1955748 1900623
53344 1900623 1845806 1791156 1737036 1684249 1633524 1585197 1539266 1495536 1453812 1414267 1377611
53333 1377611 1344642 1315617 1290235 1268098 1248897 1232211 1217417 1203899 1191208 1179091 1167513
53322 1167513 1156614 1146472 1137018 1128261 1120396 1113468 1107249 1101796 1097825 1095960 1095746 1096053 1096515 1097965
53308 1097965 1101290 1106472 1113083 1121126 1130871 1142176 1154603 1168173 1183525 1201228 1221254 1243208
53296 1243208 1266822 1292031 1318773 1346935 1376542 1407772 1440659 1474745 1509162 1543073 1575952
53285 1575952 1607444 1637176 1664886 1690538 1714077 1735164 1753443 1768980 1782066 1792583 1799943
53274 1799943 1803782 1804362 1802135 1797218 1789541 1779176 1766202 1750454 1731691 1709868 1684989 1656921
53262 1656921 1625738 1592120 1557013 1520997 1484260 1447031 1409453 1371070 1331147 1289815 1248456
53251 1248456 1208537 1170417 1133668 1098233 1064699 1033478 1004162 975716 947019 917349 886861
53240 886861 856683 828124 801541 776267 751659 727856 705307 684066 664038 645656 629716
53229 629716 616495 605438 595788 587184 579487 572334 565178 557673 549789 541514 532654 522993 512599
53216 512599 501865 491236 480966 471110 461645 452474 443389 434285 425439 417415 410569 404716 399342
53203 399342 393979 388321 382231 375831 369505 363595 358176 353205 348680 344500 340346 336031 331799 327956
53189 327956 324299 320325 316050 312159 309142 306588 303625 299912 295965 292600 290220 288632 287393 286229
53175 286229 285107 284021 282885 281764 281010 280928 281352 281764 281812 281532 281126 280749 280468 280259 280083 280105 280619 281475
53157 281475 281842 281033 279462 278210 277669 277291 276761 276630 277308 278081 277760 276036 273626 271354 269563 268295
53141 268295 267467 266908 266557 266642 267307 268247 269037 269688 270396 270859 270440 269094 267617 266743 266382 266000 265423 264899
53123 264899 264595 264352 263904 263070 261810 260298 259000 258446 258721 259215 259036 257788 255906 254106 252571 250869
53107 250869 248689 246413 244764 244053 244045 244427 245115 246018 246810 247128 246938 246559 246311 246206 246001 245532 244898 244329
53089 244329 243953 243750 243612 243278 242407 241011 239774 239562 240525 242022 243458 244701 245549 245401 244074 242519
53073 242519 242027 242781 243776 244146 243969 243645 243116 242080 240612 239152 238039 237317 236896 236667 236515 236392 236390 236660
53055 236660 237294 238294 239595 241065 242577 244109 245703 247313 248839 250348 252038 253904 255559 256502 256508
53040 256508 255654 254142 252271 250491 249185 248268 247234 245776 244292 243514 243653 244097 244037 243117 241384 238922
53024 238922 235942 233081 231104 230186 229851 229692 229806 230354 231117 231794 232452 233336 234376 235239 235750 235980 235995 235790
53006 235790 235432 235063 234815 234872 235497 236756 238343 239854 241099 241920 241985 241062 239407 237575 235958 234820 234565
52989 234565 235507 237386 239521 241480 243271 244891 246061 246547 246447 246079 245768 245695 245702 245347 244503 243860 244382 246160
52971 246160 248199 249470 249796 249609 249291 249117 249539 251076 253897 257652 261698 265393 268278 270100 270694 269965
52955 269965 268106 265730 263530 261776 260306 258943 257691 256597 255680 254955 254274 253216 251511 249566 248217
52940 248217 247898 248305 248834 249000 248536 247524 246451 245649 244697 242962 240797 239489 239732 240731 241206 240778 239965
52923 239965 239303 238999 239106 239456 239614 239332 238896 238693 238739 238946 239509 240523 241524 241944 241845 241687 241560 241252 240899
52904 240899 240875 241023 240689 239709 238797 238673 239334 240428 241842 243477 244786 245119 244493 243687 243534 244268 245523
52887 245523 246724 247432 247503 247044 246237 245146 243622 241379 238264 234601 231252 229142 228574 229023 229624 229839
52871 229839 229691 229488 229451 229632 230073 230903 232157 233571 234712 235417 235985 236896 238426 240562 243132 245801 248035
52854 248035 249273 249304 248453 247308 246192 244884 242953 240428 238045 236595 236078 235695 234708 233083 231216 229325
52838 229325 227373 225416 223702 222410 221442 220548 219566 218464 217215 215754 214179 212982 212850 214064 216165
52823 216165 218351 220103 221280 221837 221793 221393 220936 220492 220113 220190 221122 222638 223973 224831 225616 226606 227560 228413
52805 228413 229774 232203 235366 238318 240322 241062 240478 238803 236467 233570 229865 225605 221900 219645 218511
52790 218511 217634 216847 216437 216109 215199 213877 213130 213333 213671 213262 212233 211384 211300 212069 213379 214625 215344 215766
52772 215766 216585 218060 219682 220845 221413 221537 221355 221057 220781 220341 219472 218460 218005 218300 218826 219304 220152
52755 220152 221629 223049 223448 222730 221693 221112 221158 221458 221453 220930 220449 220927 222518 224236 224986 224665 223968 223518
52737 223518 223557 224066 224771 225321 225863 227056 229051 230972 232003 232590 233759 235536 236882 237120 236528 235538 234244
52720 234244 232953 232326 232501 232672 232006 230589 229048 227712 226599 225911 225920 226446 226873 226699 225841 224516 223182
52703 223182 222467 222757 223685 224305 224024 223275 223090 224029 225656 227115 228071 228887 229935 231042 231739 231817 231413 230759
52685 230759 230176 230111 230780 231811 232617 233135 233797 234799 235861 236843 238030 239496 240645 240877 240482 240367 240923
52668 240923 241564 241471 240528 239417 238943 239370 240356 241474 242668 244047 245375 246140 246286 246441 247173 248376 249700
52651 249700 251244 253262 255432 257092 258157 259131 260064 260166 258840 256558 254233 252090 249655 246664 243512
52636 243512 240890 239396 239399 240815 242961 245067 246976 249041 251343 253500 255407 257631 260607 263744 265812
52621 265812 266165 265174 263484 261312 258643 255796 253375 251694 250449 249009 246973 244473 242072 240399 239750
52606 239750 239924 240389 240647 240510 240101 239632 239225 238947 238915 239333 240362 242010 244095 246269 248106 249235 249493
52589 249493 249051 248382 248055 248330 248908 249187 248939 248613 248805 249514 250222 250677 251225 252268 253744 255366 257066
52572 257066 258811 260234 260881 260777 260380 259985 259575 259228 259127 259054 258369 256868 255270 254460 254503 254839 255224 255874
52554 255874 256723 257189 256913 256311 256066 256341 256820 257270 257683 257968 257958 257768 257763 257993 257968 257247 256105 255284 255151 255365
52534 255365 255392 255019 254283 253232 252111 251584 252266 253927 255425 255721 254841 253750 253351 253804 254628 255253 255456
52517 255456 255466 255741 256487 257389 257962 258216 258783 260239 262474 264897 267141 269310 271580 273815 275705 277043
52501 277043 277724 277590 276512 274584 272111 269386 266602 263954 261624 259615 257745 255986 254670 254144 254211
52486 254211 254187 253714 253339 253964 255702 257591 258653 258956 259322 260181 261206 262105 263195 264818 266608 267881
52470 267881 268581 269307 270436 271762 273135 274862 277147 279506 281274 282485 283795 285563 287405 288701 289167
52455 289167 288853 287861 286315 284371 282023 279002 275132 270778 266793 263912 262238 261306 260565 259778 259063 258674
52439 258674 258721 258973 258884 257994 256439 254985 254386 254710 255448 256199 256972 257831 258608 259125 259408 259446 259005 257987 256801
52420 256801 256056 255914 256026 256025 255814 255505 255379 255880 257332 259573 262128 264683 267215 269795 272785 277149 283925
52403 283925 293123 303542 313904 323701 332656 339939 344563 346272 345413 342105 336258 328424 319944 311973
52389 311973 304857 298700 293977 291057 289482 288372 287528 287581 288889 290692 291696 291359 290317 289640 289890 290987
52373 290987 292690 294990 297978 301587 305575 309732 313922 317905 321312 323924 325838 327197 327857 327597 326683
52358 326683 325836 325418 324907 323576 321596 319977 319397 319506 319627 319725 320263 321369 322673 323899 325181 326732
52342 326732 328616 330988 334159 338166 342536 346776 350923 355333 360083 364873 369481 374085 379186 385391
52328 385391 393119 402233 412085 422267 433297 446136 460949 476776 492544 507949 523041 537506
52316 537506 551039 564173 577972 592748 607738 622260 636617 651443 666673 681769 696652
52305 696652 711754 727181 742476 757256 771555 785386 798500 810866 822937 835014 846627
52294 846627 856854 865016 870739 873716 873955 872119 869098 865197 860206 854201 847785 841367 834698 827427
52280 827427 819824 812645 806451 801393 797529 795036 794025 794379 795873 798337 801597 805362 809431 814100
52266 814100 820143 828128 837786 848341 859418 871266 883996 897077 909926 922601 935409 948137
52254 948137 960292 971991 983972 996585 1009266 1021132 1031625 1040403 1047133 1051746 1054553 1055797
52242 1055797 1055293 1052783 1048416 1042658 1035902 1028385 1020307 1011851 1003240 994822 986809 978812 970005 960102
52228 960102 949854 940308 931820 924091 916864 910124 903794 897740 892045 886911 882270 877918 874048 871371
52214 871371 870507 871446 873632 876424 879422 882552 885975 889922 894516 899679 905063 910142 914510 918139 921170
52199 921170 923493 924920 925841 927250 929792 933106 936407 939450 942562 946015 949768 953649 957361 960474
52185 960474 962758 964373 965426 965596 964682 963182 961693 959842 956462 950850 943267 934307 924483 914523 905331
52170 905331 897341 890438 884613 880112 876762 873937 871543 870332 870782 872362 874480 877519 882153 888067
52156 888067 894159 899670 904280 907395 908410 907849 907282 907700 908579 908952 908882 909365 911109 913906 917059 920006
52140 920006 922481 924347 925446 925640 924990 923818 922501 921311 920683 921423 924174 928624 933716 938909 944941
52125 944941 953100 964054 977707 993873 1012513 1033362 1055793 1079212 1103328 1127923 1152650 1177210
52113 1177210 1201515 1225446 1248550 1270160 1289829 1307540 1323526 1337969 1350900 1362302 1372249
52102 1372249 1380951 1388640 1395476 1401618 1407382 1413235 1419486 1425968 1432024 1436836 1439764 1440469 1438813 1434737
52088 1434737 1428154 1418884 1406677 1391524 1374125 1355905 1338291 1321874 1306492 1292189 1279724 1269888
52076 1269888 1262608 1257135 1252990 1250310 1249298 1249871 1251989 1255872 1261676 1269205 1278157 1288256 1298989 1309707
52062 1309707 1320418 1332098 1345599 1360410 1375025 1388366 1400330 1411099 1420618 1428922 1436295 1442866
52050 1442866 1448428 1452859 1456333 1458882 1460149 1459723 1457342 1452648 1445269 1435428 1423946 1411271 1397025
52037 1397025 1381050 1364482 1349055 1335541 1323438 1312036 1301147 1290792 1280863 1271265 1261963 1252736
52025 1252736 1243254 1233504 1223836 1214489 1205432 1196780 1188957 1182175 1175997 1169696 1162962 1156125 1149759 1144204
52011 1144204 1139393 1135027 1130811 1126409 1121189 1114369 1105683 1095702 1085102 1073710 1060612 1045121 1027211
51998 1027211 1007106 985001 961380 937157 913275 890452 869350 850520 833939 819045 805521
51987 805521 793626 783348 773720 763624 753118 743235 734388 725611 715678 704543 693155 681983
51975 681983 670258 656914 642006 626878 612934 600595 589613 580085 572713 568007 565686 565106 566017
51962 566017 568594 572841 578345 584704 591901 599976 608408 616033 621686 624878 625780 624658 621465 616039
51948 616039 608591 599908 591166 583480 577502 573285 570644 569688 570875 574520 580451 588288 597814 608830
51934 608830 620833 633161 645303 656748 666601 673782 677635 678136 675457 669606 660556 648490 633867
51921 633867 617380 599846 581938 564118 546960 531254 517412 504950 493135 482111 472807 465675
51909 465675 460088 455258 451235 448612 447670 448211 450042 453206 457805 463846 471231 479759 489202 499329
51895 499329 509643 519092 526337 530385 530757 527201 519813 509521 497872 486143 475010 465088 457033
51882 457033 450866 446002 442481 441438 443698 448593 455021 463158 474030 487602 502365 516954 531288
51869 531288 545928 561051 576316 591094 604476 615608 624397 631560 637740 642867 646401 647674 645849
51856 645849 640128 630504 618025 604065 589624 575522 562687 551661 542051 533056 524463 516673 509795
51843 509795 503269 496601 490072 484311 479306 474236 468395 462043 456092 451118 447011 443570 440958 439309
51829 439309 438312 437705 437991 440006 443637 447494 450093 451029 450758 449598 447383 443978 439787 435682 432576
51814 432576 430992 430870 431744 433219 435305 438281 442221 446678 450867 454252 456970 459467 461588 462269 460497
51799 460497 456447 451299 446030 440903 436196 432704 431022 430699 430613 430000 428733 426795 424067 420715 417314
51784 417314 414439 412415 411526 412039 413731 415644 416662 416245 414482 411626 407973 404165 401215 399958 400576
51769 400576 402759 406155 410532 415655 421324 427633 434993 443709 453533 463634 472918 480377 485338 487580
51755 487580 487279 484761 480278 473965 465971 456648 446710 437219 429201 423122 418711 415323 412452 410014
51741 410014 408385 408266 410256 414317 419813 426245 433834 443146 454259 466572 479298 491762 503174
51728 503174 512552 519208 523315 525866 528126 531039 534872 539146 542862 544860 544173 540380 533940 526127
51714 526127 518329 511330 505400 500869 498083 496610 494963 491642 486404 480343 474899 471134 469739 471099
51700 471099 475111 481203 488623 496417 503043 506633 506289 503069 499274 496801 496504 498770 503696 510245 516021
51685 516021 518729 517810 514122 508335 500352 490321 479375 469012 460210 453442 449072 447298 447930 450560
51671 450560 454799 460215 466290 472675 479258 485932 492731 500346 509859 521414 533472 543829 551056
51658 551056 554539 553640 547743 537146 523335 508341 494218 482777 475050 470924 469841 471778 476860
51645 476860 484094 491376 496954 500155 500540 497330 490214 479987 467712 453811 438696 423753 410772
51632 410772 400443 392124 385114 379532 375792 373731 372561 371467 370132 368846 368234 368732 370203 371976
51618 371976 373243 373475 372675 371319 369934 368710 367693 367251 367901 369473 370875 371078 370170 369100 368592 368637
51602 368637 368871 368995 368874 368659 368950 370565 373954 378946 385099 392175 400270 409619 420302 432060 444301
51587 444301 456174 466545 474057 477707 477671 475403 472660 470501 469320 469549 471845 476621 483808 493278
51573 493278 505327 520528 539123 560635 584152 609026 635187 662615 690601 717881 743638
51562 743638 768087 791972 815921 840677 867722 899072 936332 980004 1029415 1082716 1136712
51551 1136712 1187087 1229345 1259996 1277186 1280487 1270151 1246669 1211127 1165762 1113608 1057292
51540 1057292 998420 938324 878910 822283 769821 722155 679854 643463 612840 587086 565333
51529 565333 547178 532248 519818 509108 499587 490857 482642 475233 469476 465823 463508 461043 457499
51516 457499 453058 448447 444264 440815 438205 436262 434508 432418 429773 426730 423575 420440 417270 413987
51502 413987 410633 407359 404341 401728 399600 397919 396578 395519 394740 394164 393677 393406 393797 395233 397670
51487 397670 400819 404473 408376 411929 414424 415600 415597 414390 411787 408170 404695 402239 400382 397934 394414
51472 394414 390553 387276 384617 381908 378767 375579 373059 371591 371021 370908 370859 370784 370976 371933 373907 376575
51456 376575 379219 381317 382942 384537 386384 388353 390139 391615 392940 394415 396322 398906 402526 407732
51442 407732 415116 425072 437761 453189 470999 489953 507828 522207 531624 536105 536852 535614 534091
51429 534091 533268 532890 531592 527775 520525 509895 496670 482151 467984 455713 446106 438845 433003
51416 433003 427913 423577 420309 418208 417140 417033 417880 419427 421197 422971 425028 427666 430666 433444 435645
51401 435645 437293 438457 439113 439428 439957 441318 443706 446734 449765 452432 455010 458277 462950 469202 476781
51386 476781 485506 495641 507883 523169 542450 566463 595723 630773 672291 720743 775990 837425
51374 837425 904345 975875 1050411 1125352 1197310 1262418 1316653 1356563 1380205 1387370 1378855 1355764
51362 1355764 1319612 1272612 1217283 1155731 1089649 1021023 952486 886671 825282 768852 717354
51351 717354 670886 629798 594313 564232 539039 518134 500802 486088 472969 460801 449509
51340 449509 439277 430155 422023 414776 408334 402500 397004 391751 386936 382857 379661 377294 375598 374379
51326 374379 373428 372591 371888 371498 371561 372091 373068 374489 376143 377450 377823 377234 376163 374927 373369 371416 369636
51309 369636 368859 369402 370976 373212 375865 378552 380767 382333 383479 384300 384486 383850 382780 381856 381098 379955
51293 379955 377921 374942 371290 367370 363688 360681 358396 356472 354574 352831 351774 351904 353338 355771
51279 355771 358716 361862 365266 369170 373607 378247 382583 386188 388765 390220 390940 391912 394229 398345 403848
51264 403848 409924 415789 420748 424235 426079 426498 425596 423125 419034 414005 408928 403971 398696 393058 387717
51249 387717 383164 379168 375408 372138 369763 368106 366601 365045 363721 362912 362695 363082 363917 364708 364991 364845
51233 364845 364679 364542 364028 362943 361699 360922 360937 361666 362808 364028 365201 366488 368025 369615 370968 372099
51217 372099 373153 373945 374192 374199 374760 376148 377673 378515 378633 378570 378718 379184 380194 382213 385585 390195 395484
51200 395484 400738 405493 409737 413609 416962 419431 420943 421803 422199 421933 420850 419156 417090 414638 411911
51185 411911 409567 408363 408321 408762 409127 409421 409758 409883 409462 408698 408285 408634 409349 409673 409370 408878 408602 408440
51167 408440 408258 408450 409505 411162 412478 412832 412447 411829 411102 410061 408522 406384 403651 400615 397795 395455
51151 395455 393402 391397 389565 388198 387288 386406 384965 382644 379845 377675 377046 377671 378358 378440 378367 378727 379320
51134 379320 379716 380225 381542 383671 385838 387443 388561 389500 390336 391067 391836 392834 394104 395495 396795 398037
51118 398037 399682 402190 405272 407947 409666 411020 412989 415834 419245 423170 427805 432810 437276 440584
51104 440584 442853 444485 445657 446289 446138 444953 442933 440940 439784 439313 438754 437869 437167 436897 436546 435627
51088 435627 434378 433392 433053 433618 435306 437846 440343 441998 442725 442798 442349 441625 441319 442008 443467 445027 446425
51071 446425 447834 449246 450413 451394 452656 454568 457190 460544 464652 469249 473934 478821 484680 492216
51057 492216 501419 511706 522310 532274 540410 545812 548533 549605 550482 552528 556807 563875 573549 585027
51043 585027 597360 609818 621864 633014 642919 651564 659191 665965 671786 676509 680195 682868 683884
51030 683884 681743 674913 663001 647062 628808 609638 590429 571805 554292 538294 524256 512828
51018 512828 504558 499362 496551 495479 495988 498147 501815 506607 512097 517912 523807 529809 536091 542588
51004 542588 549063 555700 563170 571681 580302 587815 594091 600058 606452 613267 620427 628203 636678 645494
50990 645494 654580 664612 676276 689422 703407 718017 733607 750555 768948 788598 809006 829560
50978 829560 850196 871614 894365 917787 940232 960174 976733 989443 998415 1004965 1011517 1020440
50966 1020440 1033013 1049537 1070102 1095040 1124797 1159596 1199260 1243381 1291619 1343611 1398488
50955 1398488 1454774 1510986 1566110 1619202 1668845 1713469 1752133 1784611 1810868 1830861 1844809
50944 1844809 1853263 1857016 1857328 1856028 1854800 1854282 1854181 1853941 1852579 1848043 1837902 1821240 1799393 1774525
50930 1774525 1748063 1720753 1693350 1666329 1639207 1610882 1580689 1548703 1515093 1479614 1441855
50919 1441855 1401733 1359702 1316545 1272962 1229419 1186568 1145648 1107943 1073675 1041885 1011708
50908 1011708 983435 957960 935635 916106 898937 883828 870286 857653 845588 834278 824086
50897 824086 815172 807444 800675 794683 789516 785373 782275 779937 778086 776613 775268 773547 771291 769144
50883 769144 768010 768123 769075 770676 773266 777073 781698 786508 791302 796338 801841 807772 814133 821253 829567
50868 829567 839100 849402 860151 871682 884678 899468 915984 934392 955231 978729 1004425 1031917
50856 1031917 1061725 1095054 1132922 1175916 1224653 1279960 1342475 1412360 1489528 1573991 1665989
50845 1665989 1765870 1873791 1989369 2111708 2239875 2373209 2510863 2651074 2790988 2927069
50835 2927069 3055471 3172267 3273771 3357019 3420115 3462463 3484760 3488403 3474652 3444668 3400750
50824 3400750 3347151 3289023 3230528 3174344 3122685 3077977 3042222 3016112 2998882 2988502 2981833
50813 2981833 2975142 2965077 2949235 2925825 2893230 2850198 2796199 2731297 2655921 2571048 2478469
50802 2478469 2380497 2279457 2177726 2078105 1983587 1896446 1817644 1747282 1685499 1632659 1588797
50791 1588797 1553329 1525648 1505720 1493611 1488429 1488326 1491847 1498824 1509485 1522965 1537217 1550254
50779 1550254 1560977 1568932 1573947 1576148 1575747 1572584 1566346 1557454 1547084 1535864 1522981 1507104 1487847
50766 1487847 1465692 1440778 1412665 1381366 1347850 1313138 1277480 1240974 1204567 1169786 1137530
50755 1137530 1107712 1080162 1055338 1033876 1015885 1001095 989402 980791 974893 971123 969382 970169
50743 970169 973911 980576 990048 1002464 1017924 1036308 1057763 1083030 1112789 1146907 1184793 1226417
50731 1226417 1272461 1323560 1379908 1441572 1508534 1580190 1655277 1732607 1811567 1891645 1971816
50720 1971816 2050731 2127181 2199823 2266442 2323918 2369193 2400274 2416278 2416757 2401375 2370654 2327157
50708 2327157 2275545 2221027 2167614 2117825 2073536 2036325 2006947 1985220 1970774 1963393 1962210 1965036
50696 1965036 1969141 1972530 1973944 1971807 1963858 1948070 1923629 1890986 1851439 1806882 1759596 1711767
50684 1711767 1665102 1620947 1580646 1545557 1516773 1494944 1480378 1473113 1472881 1479285 1492329 1512743
50672 1512743 1541504 1578874 1624065 1675847 1733120 1794643 1858533 1922527 1984714 2043610 2097679
50661 2097679 2145388 2186003 2219968 2248322 2272080 2292242 2309768 2325073 2337889 2348024 2355983
50650 2355983 2362349 2366895 2368921 2368465 2366651 2364894 2364306 2365940 2370999 2380468 2394806 2414255 2439161 2469766
50636 2469766 2505847 2546718 2591365 2638381 2686024 2732704 2777504 2820114 2860391 2898256 2934115
50625 2934115 2968918 3003036 3034346 3057235 3063993 3047971 3006214 2940021 2854131 2755894 2654395
50614 2654395 2558674 2475467 2408118 2357211 2321787 2300078 2289978 2289533 2297009 2310255 2326183 2341035
50602 2341035 2351151 2353499 2345884 2327045 2296512 2254318 2201038 2138191 2068231 1993835 1917331 1840752
50590 1840752 1765864 1693671 1624343 1558226 1496638 1441028 1391567 1347348 1307894 1273595 1244514
50579 1244514 1219732 1198390 1180674 1167083 1157315 1150662 1147128 1147248 1150850 1156833 1164280 1172995 1182655
50566 1182655 1192169 1200468 1207569 1214325 1221397 1229039 1237791 1248766 1263046 1281153 1303329 1330059 1362029
50553 1362029 1399607 1442616 1490613 1543242 1600196 1660882 1724180 1788431 1851558 1911275 1965622
50542 1965622 2013829 2056820 2096695 2135534 2174758 2215574 2259630 2308746 2363945 2425029 2491251
50531 2491251 2562295 2638601 2720998 2810292 2907097 3011823 3124630 3245345 3373456 3508151
50521 3508151 3648383 3792780 3939358 4085258 4226900 4360522 4482632 4590002 4679495 4748209
50511 4748209 4793834 4814716 4809616 4777781 4719549 4636811 4532666 4410681 4274657 4128970 3978673
50500 3978673 3829077 3685376 3552681 3435864 3338797 3263709 3211505 3182541 3176708 3192780 3228036
50489 3228036 3278524 3339149 3403315 3463054 3510271 3538188 3541860 3518052 3465497 3385508 3281937
50478 3281937 3160180 3025988 2884737 2741022 2598423 2459570 2326485 2200772 2083467
50469 2083467 1974926 1874993 1783218 1698970 1621604 1550717 1486122 1427498 1374243 1325847 1282272
50458 1282272 1243725 1210087 1180727 1154869 1131986 1111819 1094240 1079204 1066750 1056893 1049438 1043902
50446 1043902 1039535 1035495 1031194 1026687 1022723 1020291 1019965 1021629 1024769 1028920 1033813 1039274 1045264 1052087
50432 1052087 1060408 1070903 1083939 1099588 1117815 1138455 1161098 1185304 1211014 1238570 1268157
50421 1268157 1299381 1331606 1364728 1399449 1436813 1477641 1522493 1571944 1626615 1686903 1752872
50410 1752872 1824433 1901405 1983194 2068550 2155886 2243892 2331681 2418375 2502779 2583541 2659404
50399 2659404 2729130 2791339 2844661 2887953 2920087 2939493 2944144 2932203 2902735 2855914 2792861
50388 2792861 2715590 2627101 2531202 2431900 2332824 2237174 2147993 2068074 1999424 1943024 1899338
50377 1899338 1868810 1851528 1846583 1852215 1866590 1887859 1913325 1939142 1961325 1976816 1983298 1978459
50365 1978459 1960258 1928029 1883007 1827774 1765410 1698913 1630733 1562513 1495408 1430623 1369427
50354 1369427 1312636 1260344 1212115 1167263 1125148 1085631 1049175 1016105 985924 957854 931963
50343 931963 909052 889343 872002 856218 842079 829917 819383 809727 800594 791981 783756 775811
50331 775811 768510 762394 757508 753449 749996 747191 744884 742657 740252 737747 735392 733611 732971 733705 735317
50316 735317 737158 739305 742440 746906 752527 759348 767852 778169 789660 801595 813723 825855 837467
50303 837467 848258 858644 869116 879382 888810 897545 906538 916542 927734 940392 955190 972358
50291 972358 990973 1009527 1026888 1042256 1054368 1061426 1062151 1056778 1046928 1034658 1021771 1009869
50279 1009869 1000630 995649 995792 1000597 1008244 1016061 1021220 1021454 1015791 1005014 991366 977451 965138
50266 965138 955197 947544 941479 935874 929658 922519 915030 907997 901812 896564 892501 889993 889073 889359 890448
50251 890448 892076 893797 894898 895033 894811 895391 897428 900526 903747 906487 908844 911333 914342 917829 921442
50236 921442 924915 928236 931360 933835 934975 934543 933076 931335 929463 926888 923134 918553 914120 910629
50222 910629 908255 906796 905990 905564 905368 905758 907666 911901 918455 926821 937079 950351 968034 990848
50208 990848 1018823 1052083 1091364 1137684 1191455 1251823 1316838 1384324 1452514 1519757 1583958
50197 1583958 1642888 1695275 1741346 1782324 1819842 1855844 1892214 1929679 1967009 2001385 2029210
50186 2029210 2046362 2048573 2032752 1998154 1945906 1877692 1795862 1704732 1610482 1518801 1432845
50175 1432845 1353728 1282356 1220048 1167767 1125534 1092617 1067641 1048439 1032353 1017091 1001159
50164 1001159 983495 963181 939929 914743 889722 867006 847852 832486 820570 811686 805565 802119
50152 802119 801401 803404 807709 813337 819105 824264 828682 832396 835039 835785 833788 828651 820665 810804 800440
50137 800440 790843 782748 776296 771389 768099 766815 768007 771782 777530 784034 790015 794728 798213 801063
50123 801063 803878 806835 809758 812647 815979 820264 825325 830329 834731 838973 844039 850461 858018 866354
50109 866354 875543 885964 897918 911495 926617 942931 959806 976780 994103 1012633 1033167 1056075
50097 1056075 1081688 1110724 1144014 1182002 1224941 1273596 1329385 1393718 1467577 1551849 1647520
50086 1647520 1754877 1872525 1997442 2125863 2253850 2377492 2493683 2601448 2702330
50077 2702330 2799113 2894111 2988520 3082722 3176281 3267200 3351234 3422123 3472875 3497476 3492145
50066 3492145 3455629 3388868 3294747 3177954 3044273 2899263 2747381 2592282 2437590 2286973
50056 2286973 2143541 2009443 1886065 1774337 1674810 1587612 1512360 1448024 1392951 1345311
50046 1345311 1303705 1267387 1236011 1209312 1186933 1168278 1152519 1138969 1127552 1118751 1112958 1109915
50034 1109915 1108798 1108683 1108933 1109350 1110132 1111546 1113490 1115382 1116528 1116496 1115059 1112014 1107365 1101685 1095899
50019 1095899 1090448 1084809 1078174 1070490 1062461 1054363 1045341 1034312 1021374 1007743 994302 980770 966485
50006 966485 951415 935953 920266 904565 889775 877114 866994 859081 853648 852066 855445 863283
49994 863283 874061 886780 901257 917075 932988 947598 960227 971011 980528 989482 998393 1007290
49982 1007290 1015731 1023252 1029678 1035121 1039879 1044419 1049244 1054780 1061689 1071345 1085698 1106455 1134522
49969 1134522 1170222 1213707 1264987 1323773 1389404 1460598 1535084 1609860 1682245 1750547 1813649
49958 1813649 1870573 1921178 1967156 2011573 2057174 2105209 2155490 2206583 2255481 2297565 2327424
49947 2327424 2339951 2331162 2298975 2243958 2169237 2079443 1979712 1875325 1771270 1671371 1577912
49936 1577912 1492313 1415592 1347614 1286389 1229096 1173988 1120883 1069926 1020829 973565 929146
49925 929146 889009 853857 823442 797240 774943 756366 741280 729420 720448 713848 708981 705273
49913 705273 702313 699790 697477 695297 693362 691945 691464 692463 695457 700625 707582 715582 724153 733575 744610
49898 744610 757746 772839 789460 807175 825209 842095 856158 866406 872745 875470 874899 871534
49886 871534 866070 858941 850022 838957 825689 810541 793936 776101 757021 736707 715633 694795
49874 694795 675122 656896 640046 624937 612364 602660 595237 589228 584260 580326 577342 575229 574233
49861 574233 574708 576671 579871 584189 589630 596042 603246 611487 621460 633796 648734 666184 685734
49848 685734 706424 726728 745000 759965 770936 777905 781605 783306 784184 784626 783979 780969 774572 764736
49834 764736 752366 738565 723938 708706 693356 678897 666402 656410 648780 643056 638882 636185
49822 636185 635073 635636 637872 641765 647361 654748 664053 675414 688817 703897 720054 736791 753730
49809 753730 770279 785595 799156 811131 821876 831186 838381 843051 845395 845772 844217 840563 834800
49796 834800 827201 818176 808049 796941 784818 771711 757835 743514 729117 715135 702107 690292
49784 690292 679645 670345 663028 658051 654687 651610 648182 644763 641721 638762 635566 632588 630721 630490
49770 630490 631945 635135 640167 646888 654914 664026 674161 685011 695924 706316 715924 724550 731836
49757 731836 737494 741664 744788 747091 748257 747553 744199 737624 727578 714279 698552 681761 665378
49744 665378 650510 637721 627181 618783 612155 606799 602403 598959 596499 594830 593627 592717 592136 591935
49730 591935 592094 592647 593768 595566 597841 600174 602413 605047 608948 614653 622017 630643 640475 651722
49716 651722 664335 677888 691991 706406 720595 733425 743618 750407 753664 753624 750831 746198 740733
49703 740733 734962 728705 721435 712829 703115 693022 683396 674715 666924 659743 652996 646595 640405 634372
49689 634372 628687 623669 619584 616774 615785 616965 619925 623796 628127 633231 639511 646870 655073 664447
49675 664447 675694 688992 703647 718786 734162 749957 765780 780116 791015 797478 800133 800567
49663 800567 800079 799155 797915 796729 796272 797146 799467 802533 804710 803861 798282 787403 771694 752095 729715
49648 729715 705936 682431 660854 642384 627433 615698 606567 599565 594431 590868 588484 587080 586694
49635 586694 587106 587612 587619 587294 587194 587353 587208 586390 585027 583138 580260 576006 570613 564679 558743 553392 549280
49618 549280 546506 544248 541603 538639 536142 534514 533500 532872 532654 532595 532152 531323 530943 531735 533462 535344
49602 535344 536964 538364 539637 540870 542276 543935 545549 546869 548161 549766 551317 551982 551529 550662 550163
49587 550163 550119 550161 550080 549977 550077 550638 551773 553196 554427 555447 556870 559164 561987 564699 567348 570610
49571 570610 574772 579323 583820 588779 595295 603908 614084 624779 635262 645446 655663 666114 676301
49558 676301 684888 690396 692252 691109 688017 683488 677575 670632 663537 657030 651204 645914 641433 638369
49544 638369 637000 636993 637785 638972 640274 641363 641925 641827 641107 639904 638532 637573 637748 639514 642747 646854 651323
49527 651323 656267 662409 670511 680806 692964 706463 720891 735932 751180 765980 779484 791018
49515 791018 800536 808598 815788 822272 828084 833681 839911 847509 856870 868135 880870 893495 903491
49502 903491 908631 907913 901284 888974 871599 850658 828347 806699 787031 769969 755568 743398
49490 743398 732984 724246 717294 711823 707118 702774 699037 696266 694409 693166 692389 692018 691884 691855 691993
49475 691993 692336 692685 692843 692928 693193 693648 694099 694502 695122 696463 699119 703420 708988 714923 720741 726803 733413
49458 733413 739817 744762 747887 749885 751236 751476 749930 746498 741441 734897 727031 718283 709127 699887
49444 699887 691022 683155 676484 670507 664689 659085 654065 649926 647140 646414 647862 650551 653550 657118
49430 657118 662154 668724 675992 683597 692377 703649 718358 736973 759703 786856 819376 858639
49418 858639 904579 953684 999443 1035022 1055338 1057488 1041282 1010338 971528 931956 896195 866315
49406 866315 843357 827793 819178 816439 818566 824559 833112 843028 853775 865150 876716 888142 899671
49393 899671 911532 923189 933887 943697 953168 962043 969137 973558 975240 974207 970130 962985 953516
49380 953516 942623 930674 917776 904443 891674 880506 871693 865674 862721 863088 866840 873347 881202
49367 881202 888983 896117 902734 908786 913614 916274 916028 912722 907067 900353 893461 886287 878465 870298
49353 870298 862359 854522 846174 837394 829105 822076 816463 812388 810083 809214 808841 808469 808581 809810 812075
49338 812075 814834 817566 819670 820444 819651 817753 815257 812213 808667 805125 802249 800465 800100 801357 803787
49323 803787 806294 808133 809533 811016 812645 814421 816833 820302 824455 828544 832355 836146 839937 843504
49309 843504 846838 850003 852711 854608 855892 857080 858265 859184 859926 860944 862332 863674 864769 865992 867760
49294 867760 870020 872474 875045 877933 881394 885485 889829 893620 896165 897529 898488 899760 901379 902792
49280 902792 903511 903647 903897 904954 907060 910372 915605 923703 934619 946960 959236 971065 982788 994467
49266 994467 1005925 1017372 1029184 1041160 1052675 1063520 1073863 1083374 1091097 1096501 1100330 1104415
49254 1104415 1111109 1122735 1140771 1165128 1194477 1227211 1261526 1294541 1322264 1341132 1349367 1346679
49242 1346679 1333319 1310093 1279067 1243516 1206834 1171408 1138281 1107636 1079648 1055015 1034636
49231 1034636 1018863 1007387 999874 996356 996751 1000359 1006186 1013536 1021981 1030983 1039960 1048636 1056879 1064130
49217 1064130 1069410 1072168 1072900 1072757 1072679 1073135 1074518 1077339 1081861 1087834 1094831 1102705 1111511 1121195 1131731
49202 1131731 1143490 1157031 1172393 1188872 1205507 1221382 1235475 1246833 1255312 1261720 1266833 1270602
49190 1270602 1272712 1273521 1273881 1274238 1274424 1274213 1273709 1273359 1274028 1276820 1282269 1289861 1298916 1309774 1323511
49175 1323511 1340658 1360968 1384519 1412437 1446377 1487851 1537898 1596379 1660939 1726965 1788754
49164 1788754 1840514 1876855 1894024 1891879 1874374 1847460 1816510 1785615 1758071 1736180 1720483
49153 1720483 1709962 1703262 1699607 1698718 1700276 1703543 1707324 1710504 1712883 1715323 1718755 1723172 1727881 1732613
49139 1732613 1738015 1745055 1754127 1764690 1775593 1785890 1795570 1805488 1816450 1828465 1840899 1853071
49127 1853071 1864519 1875001 1884686 1894271 1904597 1916053 1928463 1941471 1954898 1968810 1983416 1998912
49115 1998912 2015388 2032918 2051668 2071777 2093303 2116708 2143540 2176259 2217209 2267891 2328949
49104 2328949 2399883 2478142 2559087 2637986 2712670 2784171 2854601 2923915 2987794 3038052 3065835
49093 3065835 3066056 3040044 2994296 2936546 2872350 2804179 2732462 2657217 2579439 2501802 2428218 2362486
49081 2362486 2306972 2262218 2227450 2201319 2182312 2168851 2159421 2152893 2148631 2146084 2144303 2141995
49069 2141995 2138048 2131915 2123716 2114340 2105238 2097528 2091202 2085565 2080430 2076261 2073148 2070497 2068082 2066608
49055 2066608 2066578 2067208 2067211 2066269 2065043 2064058 2063403 2063295 2064051 2065407 2066588 2067134 2067122 2066664 2065970 2066010 2068238 2073224
49037 2073224 2080133 2088027 2097207 2108847 2123732 2141840 2162888 2186653 2212721 2240201 2267655 2293118
49025 2293118 2314472 2330316 2340652 2346561 2349253 2349630 2348657 2347556 2347268 2347866 2348819 2349907 2351626 2354694
49011 2354694 2359421 2365703 2373339 2382037 2391290 2400684 2410396 2420976 2432519 2444378 2455888 2466993 2477859
48998 2477859 2488192 2497440 2505555 2513047 2520129 2526116 2529906 2530984 2529885 2527699 2525224 2522581 2519554 2516033
48984 2516033 2511984 2507222 2501595 2495305 2488671 2481597 2473794 2465574 2457845 2451129 2445160 2439728 2435208 2431752
48970 2431752 2428629 2425086 2421405 2418320 2415724 2412842 2409497 2406270 2403418 2400565 2397702 2395718 2395573 2397479
48956 2397479 2401121 2406103 2411981 2418467 2426003 2435655 2448040 2462726 2479061 2497199 2517866 2541373
48944 2541373 2567237 2594693 2623226 2652674 2683063 2714336 2746264 2778781 2812413 2848091 2886444
48933 2886444 2927542 2971318 3017785 3066614 3116969 3168243 3220729 3275145 3331574 3389245 3447427
48922 3447427 3506256 3566567 3629008 3693443 3759172 3825638 3892643 3959831 4026168 4090267 4151166
48911 4151166 4208616 4262787 4314086 4363233 4411020 4457822 4503515 4547859 4590676 4631651 4670392
48900 4670392 4706774 4740985 4773204 4803559 4832322 4859647 4885026 4907487 4926466 4942068 4954470
48889 4954470 4963647 4969784 4973242 4973802 4970659 4963631 4953684 4941635 4926858 4908019 4884717 4857636 4827336
48876 4827336 4793723 4756622 4716085 4671960 4623828 4571520 4515209 4454874 4390218 4321372 4249331
48865 4249331 4175554 4101526 4028757 3958582 3891539 3827292 3765607 3707120 3652704 3602327 3555129
48854 3555129 3510640 3469336 3431731 3397456 3365720 3336387 3309979 3286616 3265602 3246321 3229022
48843 3229022 3214338 3202514 3193765 3188991 3189176 3193967 3201675 3211005 3222131 3235726 3251645 3269258 3288509
48830 3288509 3309823 3333060 3357378 3382178 3407556 3433659 3460078 3486233 3512095 3538284 3565561
48819 3565561 3594271 3624105 3654326 3684389 3714451 3745146 3776844 3809230 3841607 3873569 3905354
48808 3905354 3937619 3970878 4005108 4039872 4074756 4109594 4144354 4179087 4214054 4249657 4286121
48797 4286121 4323421 4361586 4400712 4440494 4480052 4518489 4555317 4590131 4622284 4651351 4677654
48786 4677654 4701798 4723768 4742848 4758275 4769488 4775829 4776552 4771227 4759774 4742146 4718379 4688953
48774 4688953 4654675 4616100 4573501 4527423 4478803 4428319 4375963 4321415 4264554 4205518 4144581
48763 4144581 4082109 4018320 3953036 3886051 3817898 3749831 3682836 3617078 3552601 3490179 3431062
48752 3431062 3376143 3325738 3279902 3238380 3200351 3164730 3130942 3099127 3069578 3042211 3016706
48741 3016706 2992934 2971104 2951637 2935038 2921792 2912217 2906233 2903215 2902073 2901673 2901314 2900822 2900152 2899021
48727 2899021 2897024 2894049 2890446 2886823 2883714 2881381 2879802 2878815 2878334 2878387 2878948 2879757 2880389 2880472 2879880 2878881 2878202
48710 2878202 2878791 2881280 2885639 2891408 2898219 2905887 2914084 2922252 2930112 2938118 2947063 2957086 2967277 2976518
48696 2976518 2984721 2993041 3002847 3014589 3027770 3041806 3056652 3072496 3089001 3104987 3118952 3129980
$$ [...]
##END NTUPLES=NMR SPECTRUM
##END=
