
##TITLE=AC1402_HONAH12211_7653193_SUyz3jfani
##JCAMPDX= 6.0         $$ Bruker NMR JCAMP-DX V2.0
##DATA TYPE= NMR SPECTRUM
##DATA CLASS= NTUPLES
##ORIGIN= BRUKER
##OWNER= Administrator
$$ 1.72 TOPSPIN		Version 2.1
$$ 2013-03-19 19:39:15.055 -0500  Administrator@X
$$ Compression mode = diff/dup
##.OBSERVE FREQUENCY= 400.02188249412
##.OBSERVE NUCLEUS= ^1H
##.ACQUISITION MODE= SIMULTANEOUS (DQD)
##.ACQUISITION SCHEME= undefined
##.AVERAGES= 8
##.DIGITISER RES= 22
##SPECTROMETER/DATA SYSTEM= spect
##.PULSE SEQUENCE= zg30
##.SOLVENT NAME= COFFEE_meoh
##.SHIFT REFERENCE= INTERNAL, COFFEE_meoh, 1, 14.98509
##AUDIT TRAIL= $$ (NUMBER, WHEN, WHO, WHERE, PROCESS, VERSION, WHAT)
$$ ##TITLE= Audit trail, TOPSPIN		Version 2.1
$$ ##JCAMPDX= 5.01
$$ ##ORIGIN= Bruker BioSpin GmbH
$$ ##OWNER= Administrator
$$ $$ E:\/data/COFFEE/nmr/AC1402_HONAH12211_7653193_SUyz3jfani/10/pdata/1/auditp.txt
$$ ##AUDIT TRAIL=  $$ (NUMBER, WHEN, WHO, WHERE, PROCESS, VERSION, WHAT)
(   1,<2013-03-19 19:39:06.758 -0500>,<Administrator>,<X>,<go>,<TOPSPIN 2.1>,
      <created by zg
	started at 2013-03-19 19:38:00.680 -0500,
	POWCHK enabled, PULCHK disabled,
       configuration hash MD5:
       86 BA 57 50 F2 9D 5C 9B 26 00 A9 28 5F 66 2E 89
       data hash MD5: 64K
       E4 63 53 79 75 80 96 F3 42 C8 9E C9 29 10 F6 C8>)
(   2,<2013-03-19 19:39:09.836 -0500>,<Administrator>,<X>,<proc1d>,<TOPSPIN 2.1>,
      <Start of raw data processing
       efp LB = 0 FT_mod = 6 PKNL = 1 PHC0 = 0 PHC1 = 0 SI = 32K 
       data hash MD5: 32K
       1A 47 EB 00 47 47 AD C5 69 08 29 F6 04 39 80 FB>)
(   3,<2013-03-19 19:39:10.305 -0500>,<Administrator>,<X>,<proc1d>,<TOPSPIN 2.1>,
      <pk PHC0 = 101.5466 PHC1 = 0 
       data hash MD5: 32K
       A0 FA 17 E7 15 BB 90 CF CF A4 52 7E F2 EE B8 46>)
(   4,<2013-03-19 19:39:10.539 -0500>,<Administrator>,<X>,<proc1d>,<TOPSPIN 2.1>,
      <abs ABSG = 1 
       data hash MD5: 32K
       9A AD A6 F3 FD 01 13 EB A7 CC FF 63 54 6A 51 22>)
(   5,<2013-03-19 19:39:10.696 -0500>,<Administrator>,<X>,<proc1d>,<TOPSPIN 2.1>,
      <abs ABSG = 2 
       data hash MD5: 32K
       43 E5 8B C0 9B C0 94 E4 28 9E E2 09 2A 1D F7 9D>)
(   6,<2013-03-19 19:39:10.836 -0500>,<Administrator>,<X>,<proc1d>,<TOPSPIN 2.1>,
      <abs ABSG = 3 
       data hash MD5: 32K
       3B 38 F4 94 20 A1 CE 60 06 8D 5C 32 DB DC 47 8A>)
(   7,<2013-03-19 19:39:10.977 -0500>,<Administrator>,<X>,<proc1d>,<TOPSPIN 2.1>,
      <abs ABSG = 4 
       data hash MD5: 32K
       C9 E7 45 F4 BB A9 9D A0 40 E5 2A F8 22 1F 50 43>)
(   8,<2013-03-19 19:39:11.149 -0500>,<Administrator>,<X>,<proc1d>,<TOPSPIN 2.1>,
      <abs ABSG = 5 
       data hash MD5: 32K
       5B EE 2E D6 0E CA A6 08 FB 59 42 C4 D3 4B 41 10>)
$$ ##END=
$$ 
$$ $$ hash MD5
$$ $$ FB 67 E2 77 0C 94 FF 2C FB 00 AC 81 B4 AC 53 4C
##$RELAX= 
##$RELAX= 
##$RELAX= 
##$RELAX= 
##$RELAX= 
##$RELAX= 
##$RELAX= 
$$ Bruker specific parameters
$$ --------------------------
##$DU= <E:\>
##$EXPNO= 10
##$NAME= <AC1402_HONAH12211_7653193_SUyz3jfani>
$$ [...]
150 150 150 150 150 150 150 150
##$TP07= 0
##$TPNAME0= <>
##$TPNAME1= <>
##$TPNAME2= <>
##$TPNAME3= <>
##$TPNAME4= <>
##$TPNAME5= <>
##$TPNAME6= <>
##$TPNAME7= <>
##$TPOAL= (0..7)
0.5 0.5 0.5 0.5 0.5 0.5 0.5 0.5
##$TPOFFS= (0..7)
0 0 0 0 0 0 0 0
##$TUNHIN= 0
##$TUNHOUT= 0
##$TUNXOUT= 0
##$USERA1= <user>
##$USERA2= <user>
##$USERA3= <user>
##$USERA4= <user>
##$USERA5= <user>
##$V9= 5
##$VALIST= <valist>
##$VCLIST= <CCCCCCCCCCCCCCC>
##$VD= 0
##$VDLIST= <DDDDDDDDDDDDDDD>
##$VPLIST= <PPPPPPPPPPPPPPP>
##$VTLIST= <TTTTTTTTTTTTTTT>
##$WBST= 2048
##$WBSW= 25
##$XGAIN= (0..3)
0 0 0 0
##$XL= 0
##$YL= 0
##$YMAX_a= 651894
##$YMIN_a= -556876
##$ZGOPTNS= <>
##$ZL1= 120
##$ZL2= 120
##$ZL3= 120
##$ZL4= 120
##$ABSF1= 14.98509
##$ABSF2= -5.573092
##$ABSG= 5
##$ABSL= 3
##$ALPHA= 0
##$AQORDER= 0
##$ASSFAC= 0
##$ASSFACI= 0
##$ASSFACX= 0
##$ASSWID= 0
##$AUNMP= <proc_prof1d_extract_pilot.lims>
##$AXLEFT= 0
##$AXNAME= <>
##$AXNUC= <1H>
##$AXRIGHT= 0
##$AXTYPE= 0
##$AXUNIT= <>
##$AZFE= 0.1
##$AZFW= 0.1
##$BCFW= 0
##$BC_mod= 0
##$BYTORDP= 0
##$COROFFS= 0
##$CY= 15
##$DATMOD= 1
##$DC= 0
##$DFILT= <>
##$DTYPP= 0
##$F1P= 0
##$F2P= 0
##$FCOR= 0.5
##$FTSIZE= 32768
##$FT_mod= 6
##$GAMMA= 0
##$GB= 0
##$INTBC= 1
##$INTSCL= 1
##$ISEN= 128
##$LB= 0
##$LEV0= 0
##$LPBIN= 0
##$MAXI= 10000
##$MC2= 0
##$MEAN= 0
##$ME_mod= 0
##$MI= 0
##$NCOEF= 0
##$NC_proc= -8
##$NLEV= 6
##$NOISF1= 0
##$NOISF2= 0
##$NSP= 0
##$NTH_PI= 0
##$NZP= 0
##$OFFSET= 14.98509
##$PC= 1
##$PHC0= 101.5466
##$PHC1= 0
##$PH_mod= 1
##$PKNL= yes
##$PPARMOD= 0
##$PPDIAG= 0
##$PPIPTYP= 0
##$PPMPNUM= 2147483647
##$PPRESOL= 1
##$PSCAL= 4
##$PSIGN= 0
##$PYNMP= <proc.py>
##$REVERSE= no
##$SF= 400.02
##$SI= 32768
##$SIGF1= 0
##$SIGF2= 0
##$SINO= 400
##$SIOLD= 32768
##$SPECTYP= <>
##$SREGLST= <1H.CDCl3>
##$SSB= 0
##$STSI= 32768
##$STSR= 0
##$SW_p= 8223.68421052631
##$SYMM= 0
##$S_DEV= 0
##$TDeff= 65536
##$TDoff= 0
##$TI= <>
##$TILT= no
##$TM1= 0
##$TM2= 0
##$TOPLEV= 0
##$USERP1= <user>
##$USERP2= <user>
##$USERP3= <user>
##$USERP4= <user>
##$USERP5= <user>
##$WDW= 1
##$XDIM= 32768
##$YMAX_p= 459096051
##$YMIN_p= -655474
##$CURPLOT= <Network HP LaserJet P1505>
##$CURPRIN= <$Network HP LaserJet P1505>
##$DFORMAT= <normdp>
##$LAYOUT= <+/1D_H.xwp>
##$LFORMAT= <normlp>
##$PFORMAT= <normpl>
##$SURQMSG= 1
$$ End of Bruker specific parameters
$$ ---------------------------------
##NTUPLES= NMR SPECTRUM
##VAR_NAME=  FREQUENCY,     SPECTRUM/REAL,   SPECTRUM/IMAG
##SYMBOL=    X,             R,               I
##VAR_TYPE=  INDEPENDENT,   DEPENDENT,       DEPENDENT
##VAR_FORM=  AFFN,          ASDF,            ASDF
##VAR_DIM=   32768,         32768,           32768
##UNITS=     HZ,            ARBITRARY UNITS, ARBITRARY UNITS
##FACTOR=    0.250966925370066, 1,           1
##FIRST=     8223.43324360094, -10822,       -289589
##LAST=      0,             186328,          95199
##MIN=       0,             -655474,         0
##MAX=       8223.43324360094, 459096051,    0
$$ Real data points
##PAGE= N=1
##DATA TABLE= (X++(R..R)), XYDATA
$$ [...]
$$ plain form
19569 95415 -21648 -198403 61480 -192570 -203854 -20650 8105 -301644 -100326 -250400 -387445
19558 -387445 -100833 -511497 -390677 -4201 -279109 142850 -18302 -298205 -29720 109950
19547 -180053 -296156 -81935 333031 2038 31118 -113668 70033 -135944 -210232 234274 -116908
19535 -343642 -64163 118029 34272 24226 147690 -4944 -243627 -241299 327709 -243081 293491
19523 -48677 26559 -198474 194812 -381051 -80666 -129694 167537 -291395 13894 -122940
19512 69178 89775 231558 -179730 119850 -24912 -68945 -205821 22047 -118192 -121048 175663
19500 15843 -50743 24839 -3259 -132538 96495 165605 -154153 78027 -205226 4550 172244
19489 172244 161678 -76672 -250689 -127180 -5512 -90325 -220915 75852 -59345 -291421 456215
$$ packed form
19569I5415b1648j76755F1480a92570j1284b0650H105c01644a00326j50074j37045
19558c87445a00833m10664J20820d201k74908A42850a8302k79903b9720A09950
19547a80053j16103h1935C33031B038K9080a13668G0033a35944p4288B34274a16908
19535c43642f4163A18029C4272j0046J23464d944k38683K328C27709b43081B93491
19523d8677B6559a98474A94812c81051h0666m9028A67537b91395A3894a22940
19512F9178K0597J41783a79730A19850b4912m4033j36876B2047a18192k856A75663
19500A5843e0743B4839c259j29279I6495O9110a54153G8027b05226D550J67694
19489A72244j0566g6672j74017J23509e512q4813j30590G5852e9345k32076D56215
$$ plain form
19477 -164385 33065 49168 -117524 -40068 -132054 -108162 128377 -122489 -219737 -301533 -101067
19465 176577 -170854 -90376 330 178277 149618 -434939 -96117 -86394 -3473 91549 155157 71559
19452 55933 -33299 -32904 73723 -90823 58743 -49378 -109380 257574 32799 162196 -286191
19440 -341004 -78585 -88870 152618 -71302 -210417 -111447 11704 -191277 -160502 143986 326189
19429 326189 363428 138929 -79067 -41048 -177748 -247916 -332020 -65370 133999 -163014 201224
19417 -154872 324830 -171510 -93620 -81572 -140402 -250673 11261 -68873 62527 27095 -100402
19405 -167700 -282325 321105 28531 123604 -256395 117784 94586 -374036 -267352 -6837
19394 146604 -279412 -408714 -143215 190656 -25213 -239240 -31011 99935 -65222 -312626
$$ packed form
19477a64385C3065J6103a17524d0068r1986K3892A28377a22489r7248q1796a01067
19465A76577a70854Q0478C30J77947k8659d34939i6117R723c473I1549O3608G1559
19452E5933c3299L95G3723i0823E8743d9378o0002B57574C2799J29397b86191
19440c41004g8585j0285A52618g1302j39115R8970A1704a91277L0775A43986J82203
19429C26189L7239A38929g9067L8019j36700p0168q4104f5370A33999a63014B01224
19417a54872C24830a71510P7890J2048n8830j10271A1261f8873F2527B7095a00402
19405a67700j14625C21105B8531R5073b56395A17784k3198c74036J06684f837
19394A46604b79412j29302a43215A90656b5213k14027c1011I9935f5222k47404
$$ plain form
19384 -312626 82209 -315106 27648 -1182 -35742 116781 254700 -132598 -189265 -387170 -189422
19372 4890 118038 -128878 -137661 -178761 -337928 51068 7740 -79166 60466 -206191 -108609
19361 -108609 6647 169267 1798 -9143 266476 -109129 -390415 -114999 -95910 -10794 -156701
19350 -156701 -96475 -67607 126856 123564 -254116 -326016 -236788 -126715 -33965 -124984 -127
19338 -115372 77902 -301242 -240341 -196904 -55114 167696 -2476 -35512 -193113 -170198 34870
19326 -12919 -166477 -217129 342069 -89690 112530 -88701 -173085 -97178 206021 294722 1607
19314 -267665 -24029 51946 -205970 32144 -278506 -86891 25076 -30975 101911 -301308 -12561
19302 114675 304161 156356 -34924 -159432 -93047 -125483 576 -344567 -294593 54740 -165970
$$ packed form
19384c12626H2209c15106B7648a182l4560A16781J37919a32598n6667j97905a89422
19372D890J13148a28878q783m1100j59167E1068G740g9166F0466b06191R7582
19361a08609F647J62620A798i143B66476a09129k81286a14999J9089a0794j45907
19350a56701O0226K8868A26856l292b54116p1900Q9228J10073c3965r1019a27
19338a15372G7902c01242O0901M3437e5114A67696b476l3036j57601K2915C4870
19326a2919j53558n0652C42069h9690A12530h8701q4384P5907B06021Q8701A607
19314b67665b4029E1946b05970C2144b78506h6891B5076c0975A01911c01308a2561
19302A14675J89486j47805c4924j24508O6385l2436E76c44567M9974E4740a65970
$$ plain form
19290 -252005 -327349 57995 -221648 104747 116237 -21781 -154232 -458112 -31043 -129630 -214461
19279 -214461 -185358 -162492 -161516 -35230 -83135 -136444 54656 -5809 -294708 -96941 266989 -210154
19266 -233143 -165878 -305096 -55170 36995 -32012 -785 -413145 -313149 69457 -23753 193647
19254 87852 -203947 33420 -31081 26897 -18939 74928 299433 30743 262519 85669 -126777
19242 -128188 -27664 -162308 -189414 67404 122241 -232742 -43041 141280 147082 -35842 -221506
19231 -221506 -98530 -54061 -45000 138010 -31463 -295945 -153700 13701 153993 -118340 -63278
19220 -63278 -32031 110278 -109973 24400 -42729 -344502 485338 -220530 -48916 -86657 -103714
19209 -103714 194316 -157805 187180 -105448 -97338 -26230 5197 -248001 -189074 -380833 -96693
$$ packed form
19290b52005p5344E7995b21648A04747J1490b1781j32451l03880c1043r8587q4831
19279b14461K9103K2866R76c5230m7905n3309E4656e809k88899i6941B66989b10154
19266b33143O7265j39218e5170C6995c2012g85m12360R9996F9457b3753A93647
19254H7852b03947C3420c1081B6897a8939G4928K24505C0743K31776H5669a26777
19242a28188b7664j34644k7106F7404N4837b32742d3041A41280N802c5842j85664
19231b21506i8530M4469R061A38010c1463k64482J42245A3701J40292a18340N5062
19220f3278L1247A10278a09973B4400d2729l01773D85338b20530d8916l7741j7057
19209a03714A94316a57805A87180a05448Q110b6230E197b48001N8927j91759i6693
$$ plain form
19197 -132686 18248 52918 -348037 54605 95377 -110446 -35309 50305 81373 -223629 -262609
19186 -262609 5437 4239 86701 -258611 -88693 56279 245050 -16003 85793 -154681 15468
19174 16122 -220745 54557 -197897 -371163 -181662 -165216 -344858 26286 116256 163936 -201793
19162 -297905 17730 -489707 -81733 -24237 -116700 211661 -146305 -209827 -77431 -194668 187981
19150 30982 238829 79484 195452 -235284 -138598 -82359 1534 -3487 50628 -85438 -15088
19138 195918 31671 123275 -142630 -8304 -54443 149553 -82970 9926 -11065 -6527 -237677
19127 -237677 -81991 198905 -112280 -277041 137078 -371568 27876 -55407 183566 -33785
19116 236023 45523 -302795 -8025 -83968 -97292 -34469 -199626 24798 166050 -12202 295153
$$ packed form
19197a32686A8248L4670c48037E4605M0772a10446c5309E0305L1068b23629l8980
19186b62609E437j198Q2462b58611h8693E6279J88771a6003H5793a54681A5468
19174A6122b20745E4557a97897j73266a81662J6446j79642B6286Q9970M7680b01793
19162b97905A7730d89707h1733b4237r2463B11661a46305o3522g7431j17237A87981
19150C0982K07847G9484J15968b35284R6686N6239A534c487E0628h5438a5088
19138A95918C1671R1604a42630h304m6139A49553h2970I926a1065M538k31150
19127b37677h1991A98905a12280j64761A37078c71568B7876e5407A83566c3785
19116B36023D5523c02795h025p5943j3324c4469j65157B4798J41252a2202B95153
$$ plain form
19104 -39752 -198562 506051 -72251 -412851 -91057 -413421 -72118 -45115 176511 131996 -224907
19092 161169 -153444 -289384 14221 217414 -160461 -536909 -141460 138802 71148 -46 204738
19080 -141682 -47938 -131944 135653 155028 34241 122003 104360 -157688 -155684 -116102 -233111
19069 -233111 -232322 27831 -1716 93596 -245012 -198545 -209235 -81381 -142644 277592 93618 -263153
19056 -108596 -196255 -65330 -95845 119601 -301158 223681 -39922 -47598 298744 -143559 77188
19044 104491 195668 -240863 -246743 48005 -195820 -44382 63170 -343443 -228310 -364352 -49413
19032 -143917 199696 -227143 -187004 294909 87763 7221 -50407 42595 159563 -40928 -146023
19021 -146023 294205 -160610 11021 -244950 -186416 178069 10236 -213688 71936 -186192
$$ packed form
19104c9752j58810E06051g2251l40600i1057l22364g2118K7003A76511m4515b24907
19092A61169a53444j35940A4221K03193a60461l76448a41460A38802o7654d6B04738
19080a41682d7938q4006A35653J9375C4241Q7762j7643a57688K004L9582j17009
19069b33111P89B7831a716I3596b45012M6467j0690h1381o1263B77592I3618b63153
19056a08596q7659f5330l0515A19601c01158B23681c9922p676B98744a43559G7188
19044A04491R1177b40863n880D8005a95820d4382F3170c43443J15133j36042d9413
19032a43917A99696b27143M0139B94909H7763G221e0407D2595J16968d0928j05095
19021a46023B94205a60610A1021b44950N8534A78069A0236b13688G1936a86192
$$ plain form
19010 24259 98063 -151578 -90950 22309 65099 -104276 8455 -212468 -54582 -172809 -265792
18999 -265792 -34163 75454 54455 235617 -91643 -119196 167103 -149314 36235 -132531 -61926
18987 120539 -251267 43649 39727 -198658 178126 -98344 -246976 -204675 -288814 -132161 -104698
18976 -104698 -153947 87942 -36373 14924 154574 92468 -21116 147724 69885 -161543 226228
18964 -150684 -296765 327852 -137288 2230 -341151 -9218 25313 147632 -47487 -68081 -77951
18953 -77951 -33824 137160 -49072 21414 297536 119158 197606 165002 -547143 138444 109819
18942 109819 65910 81171 -69144 -104143 245465 37394 -8381 120568 -277514 -316467 420642
18930 -39619 109401 -258180 -71587 -335955 -59721 -130165 -154454 75525 -210860 -306549 -204585
$$ packed form
19010B4259P3804a51578O0628B2309M2790a04276H455b12468e4582j18227r2983
18999b65792c4163G5454k0999J81162i1643k7553A67103a49314C6235a32531f1926
18987A20539b51267D3649l922a98658A78126i8344j48632M2301q4139a32161K7463
18976a04698m9249H7942c6373A4924J39650o2106b1116A47724F9885a61543B26228
18964a50684j46081C27852a37288B230c41151i218B5313J22319d7487k0594r870
18953g7951c3824A37160d9072B1414K76122A19158P8448l2604e47143A38444k8625
18942A09819m3909J5261f9144l4999B45465C7394h381A20568b77514l8953D20642
18930c9619A09401b58180g1587k64368e9721p0444k4289G5525b10860r5689J01964
$$ plain form
18919 -204585 -6064 -377291 -404670 -73155 -102173 193172 -103029 -3747 -18523 -8603 131318
18907 -197352 89561 -132284 111155 52497 -117255 -41488 27555 -126114 -148843 -377969
18897 -377969 162518 22433 -131484 -61493 90318 -79275 -9145 -93111 -80002 -138021 -40785
18885 1724 -156604 -416579 -1944 245671 297771 45641 -234012 -245254 102910 70039 -97164
18873 -29705 103143 -148860 -15209 171375 -1070 -329793 -95722 -363438 242114 -147163
18862 29359 15507 110435 62255 -179408 -34940 -81396 112573 -241278 -81296 -59713 -276670
18851 -276670 87689 -240700 98398 176239 -70513 -153126 -221584 125827 -172963 -483106 -13537
18839 -209435 178313 -159238 -146774 -110070 -165154 70224 -25016 408616 -284630 -26744 -22565
$$ packed form
18919b04585f064l71227k7379g3155k9018A93172a03029c747j4776h603A31318
18907a97352H9561a32284A11155E2497a17255d1488B7555a26114k2729k29126
18897c77969A62518B2433a31484f1493I0318g9275i145q3966J3109n8019d0785
18885A724a56604k59975a944B45671N2100D5641b34012j1242A02910l2871i7164
18873b9705A03143a48860a5209A71375a070l28723i5722k67716B42114a47163
18862B9359j3852R4928m8180a79408c4940m6456A12573b41278h1296K1583k16957
18851b76670H7689b40700I8398P7841g0513q2613o8458A25827a72963l10143a3537
18839b09435A78313a59238J2464L6704n5084G0224b5016D08616b84630b6744M179
$$ plain form
18828 -22565 97659 -105921 -38481 35586 -38264 -22156 -122664 -201069 545091 -119260 -188137
18817 -188137 -79123 40525 118331 -183963 44264 -162723 533159 120205 150914 7652 -263776
18805 168466 108049 229898 49015 20773 -196627 441955 -104776 22058 136278 -108109
18794 -71756 124332 -119176 -250382 -188840 4389 -79556 239572 116766 204025 -338060 212684
18782 -156 -60482 -305468 -224024 -85378 137697 -123590 -224959 -3375 -42849 -121745 -8904 150658
18769 61381 -263518 -150342 -58255 28735 -283792 81007 -101734 -1124 34848 242080 22323
18757 -228798 79699 -108869 -21964 -217671 -63755 -35381 -179514 224313 13920 -380205
18746 -186999 4427 -221033 -104714 55200 30626 -21676 -138768 44677 22428 -252612 -137750
$$ packed form
18828b2565I7659a05921c8481C5586c8264J6108j00508p8405E45091a19260o8877
18817a88137g9123D0525P7806a83963D4264a62723E33159A20205L0709G652b63776
18805A68466o0417J21849D9015B0773a96627D41955a04776B2058J14220a08109
18794g1756A24332a19176j31206O1542D389g9556B39572A16766Q7259c38060B12684
18782a56o0326k44986Q1444h5378A37697a23590j01369c375l9474p8896h904A50658
18769F1381b63518J13176e8255B8735b83792H1007a01734a124C4848K07232B2323
18757b28798G9699a08869b1964j95707f3755K8374j44133B24313A3920c80205
18746a86999D427b21033a04714E5200k4574b1676j17092D4677k2249b52612J14862
$$ plain form
18735 -137750 139074 263139 -105029 219126 -3305 -193301 -320917 -90787 -243622 -79632
18724 -36992 105262 -107381 19800 109581 143529 295896 -7135 -219654 -180592 -125696 -118561
18713 -118561 -177053 -126407 -213067 -24278 -19370 10628 -115553 58684 -123604 -24052 -6459
18701 -174208 -166185 -4536 -205966 187387 250358 293950 -165364 92974 42547 49892 -27416
18689 52533 109742 312555 -13283 -212780 -77472 -103238 -60227 19516 -105754 157629 86309
18678 86309 -65690 -276755 111797 122964 304567 -12496 -85162 -266372 -294946 -32533 -6393
18666 -139537 -2008 -207211 105141 67870 92651 -107074 34704 -43834 234115 -109138 -284869
18655 -284869 -166182 34109 -124536 5679 -106600 -158491 -123623 3796 85432 -44623 -168029
$$ packed form
18735a37750A39074J24065a05029B19126c305j89996j27616i0787j52835g9632
18724c6992A05262a07381A9800Q9781L3948J52367g135k12519L9062N4896P135
18713a18561n8492N0646q6660b4278M908A0628a15553E8684a23604b4052f459
18701a74208Q023d536k01430A87387O2971M3592a65364I2974D2547P345b7416
18689E2533N7209K02813a3283j99497g7472k5766M3011A9516a05754A57629p1320
18678H6309f5690k11065A11797J1167J81603a2496p2666j81210k8574c2533f393
18666a39537b008k05203A05141l7271K4781a07074C4704d3834B34115a09138j75731
18655b84869J18687C4109a24536E679a06600n1891L4868C796Q1636d4623j23406
$$ plain form
18644 -168029 238474 -25581 -102658 126320 -76177 -103042 -162572 119879 591660 282318
18633 -140297 -140454 -60302 86301 -314340 -272309 -188963 -408940 -139540 -216940 68912 -222724
18621 -389480 89312 396159 -26430 -184068 83999 -253687 -96595 -305659 1560 -347626 58019
18609 -80631 -285365 97436 -4508 -122912 270177 -220759 310666 -149666 -26304 173580
18598 -48385 -267664 -118 -166831 -315520 -114214 162176 -93195 59859 -164477 149359 -180973
18586 -334598 -97710 -173647 187498 208454 -252327 93624 -425736 -118298 -230752 98644
18575 -127202 -87334 -32164 164268 -305814 46863 -91368 -162099 49601 55755 -127083 396078
18563 -22761 30809 -59854 -249489 -370285 -217835 -303494 7509 226785 20632 -310500 152824
$$ packed form
18644a68029B38474b5581p7077A26320g6177k6865n9530A19879M71781B82318
18633a40297j57f0302H6301c14340M2031Q3346k19977a39540p7400F8912b22724
18621c89480H9312L06847b6430j57638H3999b53687i6595k09064A560c47626E8019
18609h0631k04734I7436d508j18404B70177b20759C10666a49666b6304A73580
18598d8385k19279a18j66713j48689a14214A62176i3195E9859a64477A49359a80973
18586c34598i7710p5937A87498K0956b52327I3624d25736a18298j12454I8644
18575a27202L9868c2164A64268c05814D6863i1368p0731D9601O154a27083C96078
18563b2761C0809e9854j89635j20796J52450q5659G509K19276B0632c10500A52824
$$ plain form
18551 170150 -79337 -64093 69455 -460036 13816 -97506 -299007 2504 -285198 -9503 -233996
18540 -233996 133137 111608 -248233 -202673 -95439 -166276 -18680 -270224 165829 73897 174404
18529 174404 138695 -45216 185502 -130913 -32762 -295998 -263126 97305 -67007 -34323 -190171
18518 -190171 141672 -2792 -4113 -147557 -216735 13143 35284 -26229 110023 83753 296912
18507 296912 -30556 151962 -66891 -143505 -243317 -192473 238175 -76119 -290378 74619 -158679
18495 -65746 224076 102415 180295 57794 -407360 -164006 -59995 -148948 286541 -355442
18484 -54944 -9428 -85748 -77819 -137605 -317 433271 218013 -5928 -28053 -150143 -196434 -17477
18471 -198807 -132265 -53028 -163637 -220055 -44248 118173 -65084 -297479 -165974 -87657 38392
$$ packed form
18551A70150g9337J5244F9455d60036A3816i7506k01501B504b85198i503k24493
18540b33996A33137k1529b48233M5560i5439p0837a8680k51544A65829G3897J00507
18529A74404l5709d5216A85502a30913c2762k63236L2872I7305f7007L2684j55848
18518a90171A41672b792j321j43444o9178A3143K2141b6229A10023k6270K13159
18507B96912c0556A51962f6891p6614r9812N0844B38175g6119k14259G4619a58679
18495f5746B24076A02415P7880E7794d07360a64006e9995q8953B86541c55442
18484e4944i428p6320P929n9786c17D33271k15258e928k2125j22090m6291a7477
18471a98807O6542e3028j10609n6418d4248A18173f5084k32395J31505P8317C8392
$$ plain form
18459 -179626 -307239 148888 334450 281493 -282515 47255 -103070 -13650 -6024 -198256
18449 -198256 -204218 56417 -244862 -181853 71292 -41722 -156654 -75696 -119168 -154486 -63879
18437 -137388 133671 26451 45900 -144963 4056 -203429 -13401 -19029 -53486 66495 -117865
18425 -159391 -93559 115474 222846 -118321 -166427 -57490 -52940 19672 -39274 -132477 -206660
18414 -206660 -346223 219758 200520 -97585 -50540 158436 -30397 292221 -149650 -186760
18404 -186760 123648 -117739 100491 -17145 -164648 -89864 95890 230042 -162043 113021
18393 -195492 -81648 -89506 85876 -14258 -139533 -182695 162688 236484 -215160 -72483 244908
18381 66010 22829 189153 206 71210 -354809 -233004 13051 -11139 65463 -102311 -277650
$$ packed form
18459a79626j27613A48888J85562n2957b82515D7255a03070a3650f024j92232
18449a98256n962E6417b44862O3009G1292d1722j14932g5696m3472l5318f3879
18437a37388A33671B6451J9449a44963D056b03429a3401n628l4457F6495a17865
18425a59391O5832A15474J07372a18321m8106e7490M550A9672c9274r3203p4183
18414b06660j39563B19758j9238i7585M7045A58436c0397B92221a49650l7110
18404a86760A23648a17739A00491a7145j47503P4784I5890J34152a62043A13021
18393a95492h1648p858H5876a4258j25275m3162A62688P3796b15160g2483B44908
18381F6010B2829J66324B06P1004c54809J21805A3051a1139F5463a02311j75339
$$ plain form
18370 -277650 291270 -72376 -95051 -67636 -313574 -51012 -217840 -73538 -85129 9732 65257
18359 65257 265222 -42586 -229526 -35543 -152718 -100390 -62119 101467 228909 47966 -14191
18347 -287549 -65174 -284714 -6219 -14045 -404847 -252551 -197334 20566 -6423 102082 233696
18336 233696 -10681 59794 -32334 321049 71841 -71996 167166 127506 -108600 -23594 -83265
18325 -83265 45414 121176 -5261 153518 -255945 55861 -103069 48121 -29111 -78783 10195
18313 -305296 -183275 149567 -352379 32341 24460 168528 -135183 105130 154861 -108906
18302 -40671 -193709 -39856 -280283 99916 -228385 48101 -179624 140516 -236624 140635
18291 104685 117644 144023 146488 149081 -1934 52581 139548 177501 -70475 -36409 -339332 -45045
$$ packed form
18370b77650B91270g2376k2675K7415k45938e1012j66828g3538j1591I732N5525
18359F5257J99965d2586j86940c5543j17175N2328L8271A01467J27442D7966a4191
18347b87549f5174k19540f219p826l90802J52296N5217B0566f423A02082J31614
18336B33696a0681E9794c2334C21049G1841g1996A67166l9660a08600b3594n9671
18325h3265D5414P5762e261A53518b55945E5861a03069D8121b9111m9672A0195
18313c05296J22021A49567c52379C2341p881J44068a35183A05130M9731a08906
18302d0671j53038c9856k40427I9916b28385D8101a79624A40516b36624A40635
18291A04685J2959K6379K465K593a934E2581Q6967L7953g0475L4066l02923d5045
$$ plain form
18278 152797 -56949 -285897 56404 -224893 -77320 -77686 -14762 -139774 -53489 -207120 -180750
18267 -180750 -62595 -95016 116695 137830 -9102 -251272 -106403 -112513 -108122 166761 86172
18256 86172 -77506 227740 -223374 58643 -340627 -18294 -58219 -106070 -61067 29566 -92318
18244 220020 -115962 -90321 -26939 -436655 -239119 77851 -361515 307852 -130678 237505
18233 -132231 -7426 -290897 -138864 -344778 -209674 6697 -126772 -15901 -77304 297034 -192138
18221 72891 -575564 41991 165924 -106760 -59241 -277721 -3472 -240690 -78730 55926 -392620
18209 -218989 -7235 -335520 -65307 34084 19929 -179083 165675 200774 282316 175883 -8329
18197 -32167 -3996 59881 -108158 -110041 -142845 189839 -27377 348142 159755 -31219 72238
$$ packed form
18278A52797e6949k28948E6404b24893g7320l66a4762j25012e3489j53631K6370
18267a80750f2595l2421A16695K1135i102k42170a06403o110M391A66761q0589
18256H6172g7506B27740b23374E8643c40627a8294l9925m7851M5003B9566i2318
18244B20020a15962K5641b6939m09716J97536G7851c61515C07852a30678B37505
18233a32231g426k83471a38864k05914J35104F697a26772a5901o1403B97034a92138
18221G2891e75564D1991J23933a06760M7519k18480c472k37218g8730E5926c92620
18209b18989g235l28285f5307C4084j4155a79083A65675L5099Q1542j06433h329
18197c2167c996E9881a08158j883l2804A89839b7377C48142A59755c1219G2238
$$ plain form
18185 -406549 85233 142683 106916 -12761 -118730 -94334 -296652 25600 -80008 -114164 -129572
18174 -129572 -15391 -114821 -117455 -317102 82243 -115708 23150 -177129 63503 194559 -256820
18162 -57861 -321573 -245227 94881 -53621 -77830 43360 -12095 -125837 162342 124141 -97225
18150 -109397 -266481 -198760 -254403 174829 -62699 -364421 14082 -165102 -149915 -47036 -27753
18139 -27753 29005 -119372 -110772 -215985 73184 -258853 103087 -319001 -32881 -10519 -78471
18128 -78471 96963 -148362 -85264 -81291 -262435 259767 90603 54917 -345069 132363 27096
18116 384399 244021 -51364 -39606 -176629 -76359 -199330 -32911 124275 -124136 -83747
18106 -83747 -10317 152626 -99454 -34455 -27607 148486 -270941 113115 -27726 -245010 -126223
$$ packed form
18185d06549H5233N7450l5767a2761j05969K4396k02318B5600h0008l4156j5408
18174a29572a5391r9430k634j99647H2243a15708B3150a77129F3503J31056b56820
18162e7861k63712P6346I4881e3621k4209D3360a2095j13742A62342l8201i7225
18150a09397j57084O7721n5643A74829f2699l01722A4082a65102J5187d7036J9283
18139b7753B9005a19372Q600j05213G3184b58853A03087c19001c2881a0519o7952
18128g8471I6963a48362O3098L973j81144B59767I0603l5686c45069A32363B7096
18116C84399j40378e1364J1758j37023g6359j22971c2911A24275a24136M0389
18106h3747a0317A52626i9454c4455O848A48486b70941A13115b7726k17284J18787
$$ plain form
18095 -126223 63248 281677 106287 -250228 -99531 -56682 -19389 21971 21444 -16402 -273809
18084 -273809 224476 -91925 339831 -140651 -172331 -244134 46641 259230 -261256 281806
18073 223369 4134 54142 32315 -323399 -376424 -23038 103270 -241772 10324 -258576 -72478
18061 -5029 70109 206773 -44533 -184562 78665 -44715 -29470 -167950 -201173 -196983 30554
18049 238657 -67587 -44246 35221 -118932 240083 205148 109671 -434161 188535 -88464 31030
18037 -116382 234810 180541 -179096 -131944 -95134 262854 -17622 -98575 174353 99471 -88782
18025 326770 208230 -175448 -65254 161271 -57516 -298012 -257988 15178 -23089 -106317 -106952
18014 -106952 -246598 -145906 -88272 -276013 -110266 -156330 -307455 -88337 -26416 165800
$$ packed form
18095a26223F3248K18429A06287b50228i9531M2849a9389B1971n27a6402k57407
18084b73809B24476i1925C39831a40651l1680p1803D6641K12589b61256B81806
18073B23369D134N0008k1827c23399n3025b3038A03270b41772A0324b58576g2478
18061e029G0109J36664d4533j40029G8665d4715J5245j38480l3223M190C0554
18049B38657f7587K3341C5221a18932B40083l4935r5477d34161A88535h8464C1030
18037a16382B34810n4269a79096M7152L6810B62854a7622q0953A74353p4882h8782
18025C26770j18540a75448f5254A61271e7516k40496M0024A5178b3089q3228o35
18014a06952j39646J00692N7634j87741a10266m6064j51125h8337b6416A65800
$$ plain form
18003 122868 239989 204393 44598 32572 45341 304643 -317494 -395773 -94365 -237516 49413
17991 20435 22028 -492528 142246 132596 52582 -407035 318798 -119450 46038 -4749 43984
17979 206149 89772 -113100 -179932 -203664 33511 -170028 292 -169073 59274 -333869 -267676
17968 -267676 -236780 -37584 19889 -283585 54471 -258760 -80437 21056 251918 111673 167186
17957 167186 -170373 99240 30170 -119811 -103940 257761 221447 71778 -380939 67394 84095
17946 84095 50227 -327010 59435 40417 126240 -29265 162782 100092 -68558 -186473 -218239
17935 -218239 -196036 -113539 205744 437116 52615 282779 132016 -97766 66451 -97447 228424
17923 -107717 226675 -252951 184849 -108391 -119301 298538 173543 -168333 -41230 202387
$$ packed form
18003A22868J17121l5596D4598j2026J2769K59302c17494p8279i4365j43151D9413
17991B0435J593d92528A42246r650E2582d07035C18798a19450D6038d749D3984
17979B06149H9772a13100o6832k3732C3511a70028B92a69073E9274c33869O6193
17968b67676L0896c7584A9889b83585E4471b58760h0437B1056K30862A11673N5513
17957A67186a70373I9240C0170a19811J5871B57761l6314G1778c80939F7394J6701
17946H4095l3868c27010E9435j9018Q5823b9265A62782o2690f8558j17915l1766
17935b18239K2203Q2497B05744K31372E2615K30164A32016i7766F6451i7447B28424
17923a07717B26675b52951A84849a08391j0910B98538j24995a68333d1230B02387
$$ plain form
17912 -168980 -246406 109911 67506 114822 -201440 197328 -292385 276051 -136082 -29651
17901 -140434 -252929 -34089 150018 -103499 -182141 100848 145593 -291697 -127854 -80105
17891 -80105 -5964 -195200 21928 -108110 30490 185985 47875 -353754 -74381 222795 -179810
17879 -249207 -223522 54921 195913 -189184 -127320 39430 202281 -85831 64110 -221223 -120394
17868 -120394 48646 50042 -145689 212044 229336 65596 -71457 266268 499118 -109360 -231614
17857 -231614 109448 36903 -143221 32593 227365 235584 -403530 -60460 25244 -91100 45933
17845 -213301 -107083 -139960 129829 -186675 -96740 115960 -182380 -3938 28264 -120720
17834 -126009 -19142 -47524 -148562 -204999 3460 58848 146405 174082 -252133 12363 -63866
$$ packed form
17912a68980p7426A09911m2405M7316b01440A97328b92385B76051a36082b9651
17901a40434j12495c4089A50018a03499p8642A00848M4745b91697a27854M7749
17891h0105e964j89236B1928a08110C0490J55495D7875c53754g4381B22795a79810
17879b49207K5685E4921J40992a89184O1864C9430J62851h5831F4110b21223J00829
17868a20394D8646J396a45689B12044J7292F5596g1457B66268K32850a09360j22254
17857b31614A09448C6903a43221C2593J94772Q219d03530f0460B5244i1100D5933
17845b13301J06218l2877A29829a86675Q9935A15960a82380c938B8264a20720
17834a26009a9142k8382j01038n6437C460N5388Q7557K7677b52133A2363f3866
$$ plain form
17822 25425 67693 114119 -105121 -288824 24812 -46618 245059 9677 -135671 -42141 -66991
17811 -66991 -282714 -232576 120968 -59488 59519 22080 -159777 199697 326534 -177556
17800 -171870 146996 42504 207458 -132520 -296200 104651 242859 -82127 69704 -287679
17789 -179553 -98161 89446 -125354 104116 -132864 342473 -158723 -391948 -255823 52850
17778 189381 -65370 -129577 -320757 126956 256715 61914 -43333 102986 -4170 248847 144581
17767 144581 71472 43174 193990 -114527 233039 25284 168461 426423 -4914 -136389
17757 -136389 154849 234062 -85231 180244 348620 -196006 -63064 -119840 172908 82526
17746 190465 -133807 -104683 -39303 186729 -331561 35224 -49876 283354 24969 85430 347625
$$ packed form
17822B5425M2268M6426a05121j83703B4812d6618B45059I677a35671d2141k4850
17811f6991k15723N0138A20968e9488E9519B2080a59777A99697J26837a77556
17800a71870A46996D2504J64954a32520j63680A04651J38208h2127F9704b87679
17789a79553Q1392H9446a25354A04116a32864C42473a58723k33225J36125E2850
17778A89381f5370o4207j91180A26956J29759F1914d3333A02986d170B48847j04266
17767A44581G1472k8298J50816a14527B33039B5284J43177K57962d914j31475
17757a36389A54849P9213h5231A80244J68376a96006f3064n6776A72908H2526
17746A90465a33807K9124c9303A86729c31561C5224d9876B83354B4969O0461K62195
$$ plain form
17735 347625 -257109 33144 -56818 -96528 -57329 -183776 126210 -47491 -78515 -196574 -31128
17723 -12548 795 235693 98937 12842 41345 19670 3977 13053 -722 17740 -156613 33603
17710 -96809 38637 -109914 113675 103408 95875 -52414 -24312 -215754 -280338 -389471 118570
17698 -92519 616543 -151807 184766 258461 -95060 84579 347845 7344 116366 20988 -312491
17686 -751 237409 -47032 -299459 189099 141873 151785 107521 -85793 21749 205206 -26332
17674 -231019 221309 192787 85678 217123 -380905 -55855 6606 -88895 192504 -197673 95091
17662 -151070 38659 -111735 -291545 -31868 -722 81571 19860 74677 81310 77914 -98593 208628
17649 -159467 9190 412548 69851 -84173 26336 77385 -227332 228675 238533 -6348 -25195
$$ packed form
17735C47625b57109C3144e6818l9710L9199j26447A26210d7491l1024j18059c1128
17723a2548G95K34898I8937A2842K8503A9670C977R076g22A7740a56613C3603
17710i6809C8637a09914A13675j0267p533e2414b4312j91442o4584j09133A18570
17698i2519F16543a51807A84766P3695i5060H4579K63266G344J09022B0988c12491
17686g51B37409d7032k52427A89099m7226R912m4264h5793B1749J83457b6332
17674b31019B21309k8522H5678J31445c80905e5855F606h8895A92504a97673I5091
17662a51070C8659a11735j79810c1868g22H1571A9860N4817O633l396i8593B08628
17649a59467I190M03358F9851h4173B6336N1049b27332B28675R858f348j8847
$$ plain form
17638 -25195 -167664 -48634 -46963 -39570 -251975 116685 -147002 29821 -54268 -214260 -244921
17627 -244921 4398 -184646 -8469 177652 -17647 284273 -68035 237507 34133 227037 214171
17616 214171 77246 99331 86330 -87961 54550 135058 55484 -367996 113283 -174570 -65447
17604 120796 -51386 102147 -33499 49773 22387 375740 -70150 -178392 131697 -320546
17593 123643 395775 319058 274092 171119 36648 14276 -87425 188072 48305 11696 -38028
17581 70948 -179397 -13798 83926 85980 117756 -107867 206558 117957 -10824 163994 297483
17570 297483 34335 -40627 51022 28692 -82538 95741 278311 -44929 -63090 -98595 19898
17558 44511 130348 -19482 240921 242456 -374116 222283 71828 166037 254207 204968 103492
$$ packed form
17638b5195j42469d8634J671P393k12405A16685a47002B9821e4268j59992l0661
17627b44921D398a84646h469A77652a7647B84273f8035B37507C4133J92904j2866
17616B14171G7246K2085j3001h7961E4550Q0508E5484c67996A13283a74570f5447
17604A20796e1386A02147c3499D9773B2387L53353g0150j08242A31697c20546
17593A23643K72132p6717m4966j02973C6648A4276h7425A88072D8305A1696c8028
17581G0948a79397a3798H3926K054L1776a07867B06558q8601a0824A63994J33489
17570B97483C4335d0627E1022k2330h2538I5741J82570d4929j8161l5505A9898
17558D4511Q5837a9482B40921J535c74116B22283G1828R4209Q8170m9239j01476
$$ plain form
17547 103492 131274 92650 74360 231762 7061 -172314 -185603 81555 54369 -93116 261697
17535 -199898 164599 -169059 105593 -25171 181153 81690 -192240 286413 -54838 170624
17524 -262141 194814 222180 169343 281112 439556 83140 391225 73120 106213 178827 -445627
17512 161149 93574 -128288 -313202 -110739 392996 -92344 13230 99393 -137046 59886
17501 6921 283941 -130047 -42488 265854 14031 59803 298562 251431 128463 110098 8857
17489 305852 117368 253133 153109 -66673 249959 -106510 -30306 106743 164973 283900
17479 283900 186692 45394 172820 324777 -79654 234447 358932 179655 175936 -86408 131982
17467 -34442 -31972 131482 251813 363869 135215 -68528 88410 41421 -109147 264565 -47024
$$ packed form
17547A03492K7782l8624j8290J57402G061a72314j3289H1555k7186i3116B61697
17535a99898A64599a69059A05593b5171A81153H1690a92240B86413e4838A70624
17524b62141A94814K7366n2837J11769J58444H3140L08085G3120L3093P2614d45627
17512A61149o7575a28288j84914a10739C92996i2344A3230Q6163a37046E9886
17501F921K77020a30047d2488B65854A4031M5772K38759m7131j22968j8365H857
17489C05852A17368J35765j00024f6673B49959a06510c0306A06743N8230J18927
17479B83900r7208D5394J27426J51957g9654B34447J24485j79277l719h6408A31982
17467c4442K470A31482J20331J12056A35215f8528H8410D1421a09147B64565d7024
$$ plain form
17455 345405 -72013 196167 312136 442490 248817 41413 101585 161084 302108 272772
17445 272772 215771 293834 444453 240329 278677 290386 139109 148465 118148 79135 -39527
17433 254776 149684 -25671 125534 -12179 358650 241260 85576 -12967 63670 285707
17423 285707 394651 209217 200113 324447 149022 239831 329593 14530 213454 80766 107910
17412 107910 209457 379598 69043 438228 378558 102745 209859 1538 283677 -50359
17401 381765 195883 82418 -97361 392797 294985 91623 84715 147773 174779 192606 219192
17390 219192 135919 368845 493125 103994 48839 31858 -75681 114953 373025 101583
17379 66991 208517 29437 289106 77104 282612 150429 175135 191901 241509 13985 246139
$$ packed form
17455C45405g2013A96167J15969J30354j93673D1413O0172N9499J41024k9336
17445B72772n7001P8063J50619k04124L8348J1709A39109R356l0317l9013c9527
17433B54776j05092b5671A25534a2179C58650j17390H5576a2967F3670K22037
17423B85707J08944j85434r104J24334A49022R0809Q9762A4530J98924H0766K7144
17412A07910J01547J70141F9043L69185n9670A02745J07114A538K82139e0359
17401C81765j85882H2418i7361C92797r7812I1623o908O3058K7006J7827K6586
17390B19192q3273K32926J24280A03994D8839j6981g5681A14953K58072A01583
17379F6991J41526B9437K59669G7104K05508j32183K4706J6766M9608A3985K32154
$$ plain form
17368 246139 136110 20401 -109532 147742 -42669 487667 -44919 249565 -104044 118486
17357 495715 394829 5552 88759 60491 487459 471530 218119 -86930 205652 174996 187426
17346 187426 180048 255718 450422 -34514 103871 15758 43937 270392 334407 95754 119651
17335 119651 307187 -59840 170783 264381 82685 135956 330664 122923 271792 67577
17324 214911 115093 252284 241816 501764 335798 157938 82331 -115638 -12387 147112
17313 27615 301384 246691 4139 101222 30274 -253998 -16907 236089 286103 89458 -39720
17301 422570 105544 363378 -158537 -143383 160301 20647 -251236 262275 64860 306835
17291 306835 78322 191167 356627 298436 -87578 176176 295656 -128898 24764 251410
$$ packed form
17368B46139j10029B0401a09532A47742d2669D87667d4919B49565a04044A18486
17357D95715j00886E552Q3207k8268M26968j5929B18119h6930B05652l0656J2430
17346A87426p378P5670J94704c4514A03871A5758K8179K26455O4015I5754K3897
17335A19651J87536e9840A70783R3598H2685N3271J94708A22923J48869F7577
17324B14911r9818J37191j0468K59948j65966A57938p5607a15638a2387A47112
17313B7615K73769n4693D139R7083C0274b53998a6907B36089N0014H9458c9720
17301D22570A05544K57834a58537J5154A60301B0647b51236B62275F4860K41975
17291C06835G8322J12845J65460n8191h7578A76176J19480a28898B4764K26646
$$ plain form
17281 251410 108529 133377 405304 72163 137077 192766 26421 205039 142727 226560 61122
17269 547059 286990 78200 152194 -60659 153966 -149619 133936 191269 361471 429615
17259 429615 137027 -54944 112541 -12012 129171 -41893 278743 149085 139788 41819 190507
17248 190507 -16094 157042 463955 80645 -184114 -234208 -89041 24712 -50766 155140 227667
17237 227667 366676 -17953 439156 -65943 263561 -58537 45612 64324 58761 546294 246594
17225 277641 286149 400512 57610 -16654 484949 211821 219052 186482 131699 273179 123444
17213 -70077 300854 35221 303040 198313 134556 336193 86308 -87526 208755 177701 94164
17202 94164 276780 190026 -103809 414824 376650 388716 230001 161468 261122 384010 238886
$$ packed form
17281B51410A08529K4848K71927G2163O4914N5689B6421J78618o2312Q3833F1122
17269E47059k60069G8200P3994f0659A53966a49619A33936N7333J70202O8144
17259D29615A37027e4944A12541a2012A29171d1893B78743j29658r297D1819J48688
17248A90507a6094A57042L06913H0645a84114n0094h9041B4712e0766A55140P2527
17237B27667J39009a7953D39156f5943B63561e8537D5612J8712n563M87533B46594
17225B77641Q508J14363E7610a6654D84949B11821P231l2570n4783J41480A23444
17213g0077C00854C5221K67819j04727o3757K01637H6308h7526B08755l1054q3537
17202I4164J82616q6754a03809D14824l8174J2066j58715o8533R9654J22888j45124
$$ plain form
17191 238886 366999 176917 244730 222055 613923 263429 343584 141847 101453 25674
17180 281661 148913 104440 359889 41785 123086 585226 -97070 260924 165418 398168
17170 398168 262728 429728 411102 386263 169689 401099 234431 157456 90197 411569
17160 411569 78487 503671 416726 381192 238969 443454 214035 -98546 527769 219546
17149 283641 66575 353167 416550 231610 295762 308014 372191 439897 -9997 213508 202707
17138 202707 117318 140985 150879 125340 552196 135463 304047 452891 309705 -88225 113935
17126 399018 334542 736585 569456 826652 619252 78556 386844 41056 164859 309518
17116 309518 131793 -63041 339958 272159 687596 245929 363390 515202 291069 302261
$$ packed form
17191B38886J28113A76917O7813k2675L91868B63429Q0155A41847m0394B5674
17180B81661j32748m4473K55449D1785Q1301M62140i7070B60924r5506K32750
17170C98168j35440J67000j8626k4839A69689K31410j66668p6975o7259L21372
17160D11569G8487M25184q6945l5534j42223K04485B14035i8546E27769B19546
17149B83641F6575K86592O3383j84940O4152J2252O4177O7706i997B13508j0801
17138B02707q5389K3667R894k5539M26856A35463J68584J48844j43186h8225A13935
17126C99018o4476M02043j67129K57196k07400G8556L08288D1056J23803J44659
17116C09518A31793f3041C39958o7799M15437B45929J17461J51812k24133J1192
$$ plain form
17106 302261 290073 64100 -1759 602333 514293 413586 372095 116898 135170 517706 248080
17094 604261 402605 147271 199137 472255 362655 626675 115418 368307 487706 502679
17084 502679 275462 208902 518961 307774 410311 182120 589832 249165 402849 428094
17074 428094 510557 311640 414098 123788 324215 192404 387440 352668 377872 464149
17064 464149 350236 215408 242814 403501 364023 233744 497139 542752 533011 596085 423022
17053 423022 319322 539546 686363 483528 276129 424632 607453 330608 715812 645447
17043 645447 257560 534316 772676 336248 676837 167825 426338 278205 646015 664328
17033 664328 370995 702871 502295 618715 505270 485433 641311 454518 395846 603172
$$ packed form
17106C02261j2188F4100a759F02333q8040j00707m1491A16898J8272L82536B48080
17094F04261k01656A47271N1866K73118j09600K64020A15418K52889J19399J4973
17084E02679k27217o6560L10059k11187J02537A82120M07712B49165J53684K5245
17074D28094Q2463j98917J02458A23788K00427j31811J95036l4772K5204Q6277
17064D64149j13913j34828K7406J60687l9478j30279K63395M5613r741O3074j73063
17053D23022j03700K20224J46817k02835k07399J48503J82821k76845L85204p0365
17043F45447B57560K76756K38360C36248L40589A67825K58513j48133L67810J8313
17033F64328k93333L31876k00576J16420j13445j9837J55878j86793n8672K07326
$$ plain form
17023 603172 634233 605800 428999 955256 525463 746235 641455 690632 471368 335779
17013 335779 791368 699048 876799 570923 669016 696121 401672 659096 437092 494740
17003 494740 277315 777697 727202 345919 609517 530629 615501 623602 757463 444766
16993 444766 742126 809181 585392 115560 778667 1034373 1140929 718936 823577 791316
16983 791316 1071909 1122643 798903 964712 1256862 836999 754187 946446 860896 937892
16973 937892 930318 814031 787300 1093651 1156865 812151 823781 951161 1046378 1093333 914398
16962 914398 735821 937143 723988 1074264 1069839 773342 903664 977758 720776 1135418
16952 1135418 1017507 647974 1046237 1015299 1047225 930158 1099064 1246843 961164 1029210
$$ packed form
17023F03172L1061k8433j76801N26257m29793K20772j04780M9177k19264j35589
17013C35779M55589r2320J77751l05876R8093K7105k94449K57424k22004N7648
17003D94740k17425N00382n0495C45919K63598p8888Q4872Q101J33861l12697
16993D44766K97360O7055k23789A15560O63107K55706J06556m21993J04641l2261
16983G91316K80593N0734l23740J65809K92150m19863q2812J92259q5550P6996
16973I37892p574j16287k6731L06351O3214l44714J1630J27380R5217M6955j78935
16962I14398j78577K01322k13155L50276m425k96497J30322P4094k56982M14642
16952A135418j17911l69533L98263l0938L1926j17067J68906J47779k85679O8046
$$ plain form
16942 1029210 998736 1098007 1079327 1313904 1081709 1292515 795342 811839 1277249 1550453
16932 1550453 1407505 1186091 1169823 1022327 1097057 1132819 1126372 890679 1280008 1189916
16922 1189916 1312090 1275968 1166989 1181577 1343573 1454844 1316012 1249687 1357628 1241464
16912 1241464 1486744 1385548 1652437 1466329 1547771 1467700 1271716 1395288 1456628 1557235
16902 1557235 1641777 1601699 1566553 1725586 1529073 1415973 1531937 1773915 1480257 2024122
16892 2024122 2250978 1731864 1864570 1956366 1806721 1784499 2086091 1962677 1897984 1879283
16882 1879283 1983531 1925606 1791553 2117816 2569305 1810521 2077398 2141846 2153149 2287279
16872 2287279 2261816 2149761 2432573 2551657 2388567 2286618 2370371 2676226 2239229 2527668
$$ packed form
16942A029210l0474R9271j8680K34577k32195K10806m97173J6497M65410K73204
16932A550453j42948k21414j6268j47496P4730L5762o447k35693L89329r0092
16922A189916J22174l6122j08979J4588J61996J11271j38832o6325J07941j16164
16912A241464K45280j01196K66889j86108Q1442q0071j95984J23572O1340J00607
16902A557235Q4542m0078l5146J59033j96513j13100J15964K41978k93658N43865
16892B024122K26856n19114J32706R1796j49645k2222L01592j23414o4693j8701
16882A879283J04248n7925j34053L26263M51489p58784K66877O4448J1303J34130
16872B287279k5463j12055K82812J19084j63090j01949Q3753L05855m36997K88439
$$ plain form
16862 2527668 2647969 2466857 2565609 2771048 2655476 2974334 2731570 3337439 3230095 3214016
16852 3214016 2824811 3144965 3051408 2996019 3205259 3191792 3134801 3143223 3491663 3643776
16842 3643776 3602173 3493527 3819240 3516676 3764065 3670345 4117730 4002276 4152508 4222602
16832 4222602 3910164 3890702 4442286 4158130 4338578 4508821 4383872 4580584 4728548 4753929
16822 4753929 4824353 4918215 5040270 5151175 5237595 5486692 5552049 5361780 5472534 5877495
16812 5877495 5687311 6159108 6022224 6260900 6249432 6584692 6901993 6630064 6791194 7253656
16802 7253656 7605052 7558536 7573839 8068326 8151956 7824535 8678009 8750802 8966638 8824403
16792 8824403 9431443 9450153 9982395 9826867 10235846 10560204 10693556 11295098 11730641 12082646
$$ packed form
16862B527668J20301j81112R8752K05439j15572L18858k42764O05869j07344j6079
16852C214016l89205L20154r3557n5389K09240j3467n6991Q422L48440J52113
16842C643776m1603j08646L25713l02564K47389r3720M47385j15454J50232P0094
16832D222602l12438j9462N51584k84156J80448J70243j24949J96712J47964K5381
16822D753929P0424R3862J22055J10905Q6420K49097O5357j90269J10754M04961
16812E877495j90184M71797j36884K38676j1468L35260L17301k71929J61130M62462
16802G253656L51396m6516J5303M94487Q3630l27421Q53474P2793K15836j42235
16792H824403O07040J8710N32242j55528M08979L24358J33352O01542M35543L52005
$$ plain form
16782 12082646 12124487 12867766 13102912 13471757 13818814 14188088 14796843 15240704 15561426
16773 15561426 15983261 16514600 17129102 17644151 18410151 19061767 19955898 20448271 21382297
16764 21382297 22433883 23055448 24063893 24690049 26140600 27034346 28095398 29225655
16756 29225655 30719766 31846318 33659711 35109449 36877304 38416477 40242579 42317981
16748 42317981 44651048 46762034 49316499 51837299 54762446 57685019 60947034 64727058
16740 64727058 68456305 72600675 76735789 81246199 86122755 91850381 97270834 103416500
16732 103416500 109817728 116624172 123485298 130915415 138280754 145963528 153829481 161206984
16724 161206984 168557532 175504010 181832367 187249041 191526675 194750047 196875574 197648861
$$ packed form
16782A2082646M1841P43279K35146L68845L47057L69274O08755M43861L20722
16773A5561426M21835N31339O14502N15049P66000O51616Q94131M92373R34026
16764B1382297J051586O21565J008445O26156J450551Q93746J061052J130257
16756B9225655J494111J126552J813393J449738J767855J539173J826102K075402
16748D2317981K333067K110986K554465K520800K925147K922573L262015L780024
16740F4727058L729247M144370M135114M510410M876556N727626N420453O145666
16732A03416500O401228O806444O861126P430117P365339P682774P865953P377503
16724A61206984P350548O946478O328357N416674M277634L223372K125527P73287
$$ plain form
16716 197648861 197052011 194670062 191633681 187285917 181505548 175088418 167778507 160667072
16708 160667072 152854489 145116689 137120187 129219535 122178392 115032447 107773467 101558795
16700 101558795 95123730 89461475 84616302 79431497 74531306 70222961 66042111 62498895
16692 62498895 58945142 55808701 52770818 49655348 46948323 44873262 42667764 40394751
16684 40394751 38417156 36760189 34742947 33071880 31975071 29908005 29290541 27617915
16676 27617915 26495538 25268983 24614200 23775803 22590382 21938076 20705523 19754622 19481157
16667 19481157 18358642 17932650 17464070 16515368 16035398 15529981 15065704 14601481 14175777
16658 14175777 13819834 13027355 12872074 12544362 11831245 11486695 11652416 11337883 10791334
$$ packed form
16716A97648861n96850k381949l036381m347764n780369o417130p309911p111435
16708A60667072p812583p737800p996502p900652p041143p145945p258980o214672
16700A01558795o435065n662255m845173n184805m900191m308345m180850l543216
16692F2498895l553753l136441l037883l115470k707025k075061k205498k273013
16684D0394751j977595j656967k017242j671067j096809k067066o17464j672626
16676B7617915j122377j226555o54783q38397j185421o52306j232553r50901k73465
16667A9481157j122515m25992m68580r48702m79970n05417m64277m64223m25704
16658A4175777l55943p92479j55281l27712p13117l44550J65721l14533n46549
$$ plain form
16649 10791334 10341881 10164502 9856308 9295427 9270394 9141209 8508776 8572205 8055393 8160852
16639 8160852 7845863 7557374 7217620 7465011 6923608 6969278 6652437 6497640 6561083 6319360
16629 6319360 6344159 5894200 6193592 5587930 5598051 5495579 5439930 5048401 5136791 5410981
16619 5410981 4768237 4908356 4798510 4728328 4842607 4730242 4583858 4343689 4169544 4123661
16609 4123661 3950429 3742148 4038973 3946363 3661015 3695696 3466766 3841387 3416981 3550410
16599 3550410 3234933 3577762 3089828 3135172 3410234 3243831 3051954 3271983 2877323 2701207
16589 2701207 2880937 2514589 2684152 2846302 2750303 2550744 2486640 2335323 2386063 2439923
16579 2439923 2253969 2199499 2613622 2318664 1968660 2238759 1842241 2436970 2077678 2359187
$$ packed form
16649A0791334m49453j77379l08194n60881k5033j29185o32433O3429n16812J05459
16639H160852l14989k88489l39754K47391n41403M5670l16841j54797O3443k41723
16629F319360K4799m49959K99392o05662J0121j02472n5649l91529Q8390K74190
16619E410981o42744J40119j09846p0182J14279j12365j46384k40169j74145m5883
16609D123661j73232k08281K96825r2610k85348L4681k28930L74621m24406J33429
16599C550410l15477L42829m87934M5344K75062j66403j91877K20029l94660j76116
16589B701207J79730l66348J69563J62150r5999j99559o4104j51317N0740N3860
16579B439923j85954n4470M14123k94958l50004K70099l96518N94729l59292K81509
$$ plain form
16569 2359187 2249952 2111846 1867722 1969028 1976545 1982157 2145958 1810401 1934987 1608357
16559 1608357 1990963 1403351 2011796 1773611 1820771 1621009 1677324 1830175 1668469 1697882
16549 1697882 1843495 1404296 1581121 1698658 1454045 1202636 1416473 1568011 1271260
16540 1271260 1390321 1269063 1585360 1288167 1259369 1578761 1463048 1289522 1166770 1210096
16530 1210096 1126400 1092707 984851 1048778 1081949 1327791 1248985 1018629 1105642 1088289 1438744
16519 1438744 853239 767120 1205468 1004305 1404324 1253810 818553 1200273 1125752 1110111
16509 1110111 925643 1051436 803326 911872 822241 791882 796865 780698 798573 912915
16499 912915 1064630 755523 825859 826300 774787 811892 855026 933957 904119 747799 1089398
$$ packed form
16569B359187j09235j38106k44124J01306P517N612J63801l35557J24586l26630
16559A608357L82606n87612O08445k38185M7160j99762N6315J52851j61706K9413
16549A697882J45613m39199J76825J17537k44613k51409K13837J51538k96751
16540A271260J19061j21258L16297k97193k8798L19392j15713j73526j22752M3326
16530A210096q3696l3693j07856O3927L3171K45842p8806k30356Q7013j7353L50455
16519A438744n85505q6119M38348k01163M00019j50514m35257L81720p4521j5641
16509A110111j84468J25793k48110J08546q9631l0359M983j6167J7875J14342
16499I12915J51715l09107P0336M41n1513L7105M3134P8931k9838j56320L41599
$$ plain form
16488 1089398 1046089 750998 1022301 731892 833637 939285 790656 894263 704735 979948
16478 979948 587215 692710 820456 647661 368515 861788 383026 558129 1092361 871064
16468 871064 930834 778201 723316 750150 731359 454350 876694 691939 771649 642376
16458 642376 927653 648127 740301 405489 538012 284895 600789 580087 825114 776072
16448 776072 822005 260271 575402 603956 773705 348337 720937 603671 704763 597021
16438 597021 814305 422294 749819 380036 234580 551084 766496 647381 349428 433129
16428 433129 486662 436942 389303 394807 476658 251374 349894 114146 597532 340423 119952
16416 541473 185394 924481 724831 346328 455164 250534 415546 176475 368518 294376
$$ packed form
16488A089398m3309k95091K71303k90409J01745J05648j48629J03607j89528K75213
16478I79948l92733J05495J27746j72795k79146M93273C83026J75103N34232k21297
16468H71064N9770j52633n4885K6834j8791k77009M22344j84755P9710j29273
16458F42376K85277k79526R2174l34812J32523k53117L15894k0702K45027m9042
16448G76072M5933B60271L15131K8554J69749C48337L72600j17266J01092j07742
16438E97021K17284l92011L27525l69783j45456L16504K15412j19115k97953Q3701
16428D33129N3533m9720m7639N504Q1851k25284R8520A14146M83386k57109A19952
16416E41473A85394P39087j99650C46328J08836k04630J65012A76475J92043p4142
$$ plain form
16406 294376 119355 374351 316564 414141 280052 472038 185702 384558 497113 410109
16396 410109 138000 471838 379714 520658 572826 540269 126013 353144 388055 -353 365744
16384 367046 475284 392225 327899 -38880 367299 483029 437593 388800 89004 165212 140440
16373 140440 400870 562882 355567 352186 366480 467399 578892 276140 350552 128110
16362 393967 386021 101400 168662 216033 283610 267265 569270 452588 149904 610322 183019
16350 353414 237433 313310 227105 220990 595618 62160 503009 94924 449963 206784 206453
16339 206453 412823 431018 201003 211304 273236 336367 339816 -1080 244918 127106 238196
16328 238196 -139924 104777 349329 95247 6901 270990 94908 -77393 227418 200938 178051
$$ packed form
16406B94376A19355K54996n7787R7577j34089J91986A85702J98856J12555q7004
16396D10109A38000L33838r2124J40944N2168l2557A26013K27131L4911c53C65744
16384C67046J08238q3059o4326c8880C67299J15730m5436m8793H9004P6208k4772
16373A40440K60430J62012k07315l381J4294J00919J11493B76140P4412A28110
16362C93967p946A01400O7262M7371O7577j6345L02005j16682A49904M60418A83019
16350C53414j15981P5877q6205o115L74628F2160M40849I4924L55039B06784l31
16339B06453K06370J8195B01003J0301O1932O3131L449a080B44918j17812J11090
16328B38196a39924A04777K44552I5247F901K64089I4908g7393B27418k6480k2887
$$ plain form
16317 178051 71105 271893 130452 94307 366112 180494 -29537 209628 165689 238255
16307 238255 313825 139412 270606 54335 -55256 529619 319065 236321 170749 -5737 -143014
16296 -143014 -88904 36404 542698 382483 179088 -15601 -1514 14733 98943 296077 471584
16285 471584 3375 164011 372521 137088 175322 499732 362101 262394 144957 -301820
16274 57647 311851 167931 121556 361706 231680 84909 40947 215497 257596 136859
16264 136859 139194 339881 217010 449221 96800 254125 58351 292142 55805 368955
16254 368955 -5151 -205796 -246755 466981 439307 7646 188672 178352 -188244 360223 50413
16242 126828 -2097 102266 -70509 195086 -11401 316413 104680 18254 -147420 82289 -91542
$$ packed form
16317A78051G1105K00788A30452l6145K71805A80494b9537B09628m3939P2566
16307B38255P5570A39412J31194E4335e5256E29619k10554q2744o5572e737j37277
16296a43014N4110C6404N06294j60215A79088a5601a514A4733Q4210J97134J75507
16285D71584C375J60636K08510A37088L8234L24410j37631r9707j17437c01820
16274E7647K54204j43920m6375K40150j30026H4909D0947J74550M2099j20737
16264A36859K335K00687j22871K32211I6800J57325E8351K33791E5805L13150
16254C68955e151k00645m0959D66981k7674G646J81026j0320a88244C60223E0413
16242A26828b097A02266g0509A95086a1401C16413A04680A8254a47420H2289i1542
$$ plain form
16230 23911 11129 -25924 337862 187356 136148 237936 98624 207783 401049 -81886 -191713
16219 -191713 349282 229200 53008 -57186 184272 32422 -159688 -200363 -47732 -54832 452132
16207 -150657 191180 99915 180500 191290 174980 -106382 433786 -116271 -222 26700 -227014
16195 321228 239435 -183222 -35703 106323 -53269 -216068 43053 64349 -184845 296313
16184 -93431 -118329 45020 28390 252763 187988 -256995 -153101 -346124 247321 54208 -160987
16172 430949 21542 29993 -98645 -121088 -21179 -64769 97554 314382 -229984 249280 4311
16160 -300472 247633 72134 158651 54182 5187 -100692 234445 41504 -9459 25373 310789
16149 310789 -164904 -3771 -380624 -125235 175586 358831 148247 233429 -41898 104870
$$ packed form
16230B3911A1129b5924C37862j50506n1208J01788I8624J09159J93266h1886j09827
16219a91713C49282j20082E3008e7186A84272C2422a59688m0675d7732p100D52132
16207a50657A91180r1265Q0585J0790j6310a06382D33786a16271b22B6700b27014
16195C21228q1793a83222c5703A06323e3269j62799D3053K1296a84845B96313
16184i3431k4898D5020j6630K24373o4775b56995J03894j93023B47321E4208a60987
16172D30949B1542Q451i8645k2443b1179m3590I7554K16828b29984B49280D311
16160c00472B47633G2134Q6517E4182E187a00692B34445D1504i459B5373K85416
16149C10789a64904c771l76853a25235A75586J83245A48247Q5182d1898A04870
$$ plain form
16138 -54141 422903 71408 -168024 29028 -81706 150545 35575 76628 365296 48269 23681
16126 -34035 101676 -121866 223388 -300998 223020 154776 180020 -22210 -44841 433219
16115 274473 -6119 150558 -101797 -269649 16287 157618 213883 17059 227468 69702 -256188
16103 -280004 189442 280372 -40560 125433 68229 179342 95511 79160 -206643 20149 -37210
16091 183854 -50698 140950 -99769 137712 -180904 147421 -15001 -177202 118480 -174628
16080 221474 221487 182629 268246 -363757 -6972 194358 27570 -228138 164001 -503468 162813
16068 -28095 -52010 117563 20860 -219415 -167592 -31597 -171396 -58696 221384 -164288 -12413
16056 -139179 -39010 -281300 -103698 -155339 -107196 141614 56133 -22704 52164 -1493 138734
$$ packed form
16138e4141D22903G1408a68024B9028h1706A50545C5575M1053K88668D8269B3681
16126c4035A01676a21866B23388c00998B23020o8244K5244b2210k2631D33219
16115B74473f119A50558a01797j67852A6287J41331N6265A7059K10409F9702b56188
16103b80004A89442R0930d0560A25433n7204J11113q3831j6351b06643B0149c7210
16091A83854e0698A40950i9769A37712a80904A47421a5001j62201A18480a74628
16080B21474J3l8858Q5617c63757f972A94358B7570b28138A64001e03468A62813
16068b8095k3915A17563B0860b19415N1823c1597j39799e8696B21384a64288a2413
16056a39179c9010k42290a03698n1641M8143A41614E6133b2704E2164a493A38734
$$ plain form
16044 182564 45220 165623 234582 -142554 -233117 118356 99858 76554 -242653 -148651 -428906
16033 -428906 349875 105868 148742 -113085 118687 -113569 -57564 -371910 99855 -365889
16022 -110108 101172 -163200 -85685 -285771 -99204 -73037 -26605 473112 -217624 195838
16011 -36894 -146187 -103471 86689 153346 -60120 -36819 -172523 -289973 -252266 -70564 -197839
16000 -197839 -308762 107533 267615 -59078 399869 120558 -30498 -134340 -220871 -105989
15989 -179826 76485 49895 -124673 -224227 -91022 82734 252172 554392 398387 136535
15978 233775 137028 224902 115685 238576 17635 149022 -226229 -99619 9689 69604 26274
15966 87665 56984 321412 32400 -160086 269033 -5116 -3143 -57754 101805 33612 81544
$$ packed form
16044A82564D5220J20403O8959a42554r0563A18356j8498k3304b42653R4002k80255
16033d28906C49875A05868M2874a13085A18687a13569N6005l14346I9855c65889
16022a10108A01172a63200P7515k00086i9204K6167b6605D73112b17624A95838
16011c6894j09293M2716H6689O6657f0120K3301j35704j17450L7707g0564j27275
16000a97839j10923A07533J60082e9078C99869A20558c0498j03842q6531a05989
15989a79826G6485k6590a24673r9554i1022H2734J69438L02220j56005A36535
15978B33775r6747Q7874j09217J22891A7635J31387b26229i9619I689N9915B6274
15966H7665l0681K64428C2400a60086B69033e116J973n4611A01805C3612M7932
$$ plain form
15955 81544 -112079 -99507 138532 -63292 108659 -105877 -23251 41241 20640 -135474 187845
15943 140493 -122533 161839 -314426 366824 68487 163388 -7505 -194891 -13874 -261417
15933 -261417 -1088 105364 -246170 15223 -59527 -32991 103765 36038 -170911 -190680 72134
15921 -58776 -42474 74042 110501 42049 -214207 -262421 -87617 -436357 -333521 -57851 -107403
15910 -107403 -254869 -249986 -13263 60538 68630 -177732 -151519 -267390 -225787 229033 -81755
15898 9390 39363 -154844 -276125 -87072 224560 35312 -164083 -156210 -27650 118553 179400
15887 179400 63009 -36378 -25855 191849 -229818 -54190 222738 -67875 -229271 47695 -80357
15875 -186570 -482369 -148089 -234510 138498 202374 -50643 -590632 -62055 -177992 180896
$$ packed form
15955H1544a12079J2572A38532f3292A08659a05877b3251D1241k0601a35474A87845
15943A40493a22533A61839c14426C66824F8487R4901g505j87386a3874k47543
15933b61417a088A05364b46170A5223e9527K6536A03765C6038a70911j9769G2134
15921e8776J6302G4042L6459D2049b14207m8214h7617l48740J02836e7851m9552
15910a07403j47466M883a3263F0538Q092a77732K6213j15871M1603B29033h1755
15898I390K9973a54844j21281h7072B24560C5312a64083P873b7650A18553O0847
15887A79400F3009c6378J0523A91849b29818e4190B22738f7875j61396D7695h0357
15875a86570k95799a48089q6421A38498O3876e0643n39989f2055j15937A80896
$$ plain form
15864 304706 -71525 7524 100923 -369229 193232 -31309 -23474 -200668 -196695 -269010 -234672
15853 -234672 8051 -103690 260550 3831 -328695 130646 3926 -185155 -26067 -16253 96557
15841 81153 59973 163573 14909 191067 115069 48080 49878 -8950 17744 -139673 -389586
15830 -389586 29147 -180831 -263281 -316182 -154151 -105751 -198391 -90825 -141195 -229672 -148931
15819 -148931 168719 22158 87337 -120227 -228202 -361519 -69570 -76278 -63927 -136987 -187718
15808 -187718 -36147 2555 -139768 -81951 -206038 208983 -162226 41238 -51495 -18166 288084
15796 -62647 110818 367063 -35595 -270845 298450 -161292 -71296 -133742 282397 -132079
15785 -300273 324553 -394521 99406 -206349 54641 -156481 353136 -152002 -85829 74869
$$ packed form
15864C04706g1525G524R3399c69229A93232c1309P835j77194L973p2315L4338
15853b34672H051a03690B60550C831c28695A30646C926a85155b6067R814I6557
15841H1153k1180J03600A4909J76158p5998D8080J798h950A7744a39673k49913
15830c89586B9147a80831q2450n2901a54151M8400r2640i0825n0370q8477Q0741
15819a48931A68719B2158O5179a20227j07975j33317f9570o708J2351p3060n0731
15808a87718c6147B555a39768N7817j24087B08983a62226D1238e1495a8166B88084
15796f2647A10818K56245c5595k35250B98450a61292g1296o2446B82397a32079
15785c00273C24553c94521I9406b06349E4641a56481C53136a52002O6173G4869
$$ plain form
15774 -158340 -165094 -148740 116328 72928 -237109 -53396 -303381 98269 -90931 -306120 -1778
15762 -87247 179265 -155532 -325090 7476 -350121 145405 -16423 188217 -16162 -76038 31382
15750 345865 252775 39294 2208 -31264 56222 -55915 76568 -38985 -256400 -196063 -68017
15738 125069 -64704 242632 48648 -46883 -54227 78111 -125082 -209189 -196434 10538 -60692
15726 -264819 -274699 -88293 8507 -62885 125058 132045 -72844 -176152 -250193 33929 -107573
15714 155310 -375341 158765 -11146 -150640 -11681 58861 39693 -203802 231646 -68159
15703 -40945 31840 42786 -77387 98331 -110492 -123617 -83816 -56691 18565 56998 86412
15692 86412 416595 46591 -226002 -53924 395071 64309 -44639 115387 169343 219937 -240291
$$ packed form
15774a58340o754J6354A16328m3400b37109e3396k49985I8269i0931k15189a778
15762h7247A79265a55532j69558G476c50121A45405a6423A88217a6162n9876C1382
15750C45865r3090C9294B208c1264E6222e5915G6568c8985k17415O0337f8017
15738A25069f4704B42632D8648d6883p344G8111a25082q4107J2755A0538f0692
15726b64819r880h8293H507f2885A25058O987g2844j03308p4041C3929a07573
15714A55310c75341A58765a1146j39494a1681E8861j9168b03802B31646f8159
15703d0945C1840J0946g7387I8331a10492j3125L9801K7125A8565L8433K9414
15692H6412L30183D6591b26002e3924C95071F4309d4639A15387N3956N0594b40291
$$ plain form
15680 -158087 -236571 177436 267516 141428 -31575 -152143 -234902 57972 38034 -100568 77417
15668 224558 -216947 -80476 -268615 -9087 76652 194328 -529483 205897 22321 -90126 20833
15656 -129672 -323340 -258942 28986 23006 27167 272120 -272098 96808 162606 171149 56841
15644 -80868 -52215 -121616 -16444 38887 179677 71673 -56011 158556 -355481 157880 -168473
15632 38010 -147152 -155 125105 -68654 -5159 74202 -33827 106128 270382 70990 -41433
15620 -248596 -68004 -124300 -25563 -21721 21499 -29737 178854 -289102 39390 71084 -42978
15608 -295165 -80116 -924 44970 354603 -159092 60859 199211 -16530 -219421 -190194 -87522
15596 -325771 -208502 112657 -226221 339611 -53310 136467 -139812 229046 42387 -354414
$$ packed form
15680a58087p8484A77436R0080j26088c1575j20568q2759E7972j9938a00568G7417
15668B24558b16947h0476j88139i087G6652J17676e29483B05897B2321i0126B0833
15656a29672j93668O4398B8986n980M161K44953b72098I6808O5798Q543E6841
15644h0868K8653o9401a6444C8887J40790G1673e6011A58556c55481A57880a68473
15632C8010a47152a55A25105f8654e159G4202c3827A06128J64254G0990d1433
15620b48596f8004n6296b5563L842B1499b9737A78854b89102C9390L1694d2978
15608b95165h0116i24D4970L09633a59092F0859J38352a6530k02891K9227h7522
15596c25771J17269A12657b26221C39611e3310A36467a39812B29046D2387c54414
$$ plain form
15585 -82391 -390249 100940 81662 107005 -143764 -219904 -45843 -307566 -76545 87189 -100037
15573 28733 -23386 290566 184459 -139075 -165654 179869 -68652 -200855 74675 -18353 214259
15561 56413 335941 368873 -70560 -197719 189819 125832 172652 -100816 73533 -11333 -21873
15550 -21873 235503 -132465 -199775 -300760 169250 -214023 -368885 116651 -68358 -72904
15540 -72904 143285 -50367 -76743 230 73065 -24041 213938 252533 97677 192021 8514 -192684
15527 -93852 46276 40409 288146 -244315 -114287 -182943 209855 168787 -75078 19012 -202346
15515 -218738 -255382 -35934 -362557 -132703 92246 186191 -106998 46716 -72808 29431 360400
15504 360400 1215 -95792 -140092 92681 -107914 -137488 -28465 49170 -27375 -62908 30384
$$ packed form
15585h2391l07858A00940j9278K5343a43764p6140d5843k61723g6545H7189a00037
15573B8733b3386B90566j06107a39075k6579A79869f8652j32203G4675a8353B14259
15561E6413K79528L2932g0560j27159A89819o3987M6820a00816G3533a1333j0540
15550b1873B35503a32465o7310j00985A69250b14023j54862A16651f8358m546
15540g2904A43285e0367k6376B30P2835b4041B13938L8595I7677R4344H514a92684
15527i3852D6276n867K47737b44315a14287o8656B09855m1068g5078A9012b02346
15515b18738l6644c5934l26623a32703I2246R3945a06998D6716g2808B9431L30969
15504C60400A215i5792m4300I2681a07914k9574b8465D9170b7375l5533C0384
$$ plain form
15492 -77831 114581 -108756 19620 -218776 46801 -64455 -28607 -47378 -145204 142712 -146029
15480 69524 113722 216382 -217693 279716 -178504 88016 -43034 253304 152317 -37196
15469 179440 18694 40446 73766 251547 -155486 217295 -385048 128463 84979 -14154
15458 162211 -45697 126592 -177697 -84671 168716 94966 -17215 55005 104012 5567 26150
15447 26150 36301 -237203 -183951 -213202 75489 63571 -4899 -73354 37388 13180 -182571
15435 88391 -282397 204223 -329802 97537 -161519 145767 -14249 -236020 180950 60899
15424 29367 -69785 96237 -52641 328232 124442 -54263 45078 -40731 117263 -70889 -349406
15413 -349406 -295625 -60358 -268597 70623 126074 153353 -185335 -12138 -412495 320789 34644
$$ packed form
15492g7831A14581a08756A9620b18776D6801f4455b8607j8771r7826A42712a46029
15480F9524M4198J02660b17693B79716a78504H8016d3034B53304j00987c7196
15469A79440A8694K1752L3320J77781a55486B17295c85048A28463m3484a4154
15458A62211d5697A26592a77697h4671A68716p3750a7215E5005M9007E567K0583
15447B6150J0151b37203N3252k9251G5489j1918d899o8455C7388A3180a82571
15435H8391b82397B04223c29802I7537a61519A45767a4249k21771A80950F0899
15424B9367f9785I6237e2641C28232A24442e4263D5078d0731A17263g0889k78517
15413c49406N3781f0358k08239G0623N5451K7279a85335a2138m00357C20789C4644
$$ plain form
15401 31794 -118860 -7228 206167 -246282 60808 -157130 -42983 -153473 -44367 -164234 89047
15389 176090 -213789 -123242 2510 193795 -37238 -126670 -56174 -276527 392971 66434 140046
15378 140046 253493 55967 -173607 -31103 -289395 103833 -27096 -329687 203819 169393
15368 169393 -18963 252808 -13459 103560 95879 207341 -129513 347785 -103502 -149435
15358 -149435 95935 -80998 397498 -183441 -258501 -93441 -105111 25727 17894 100569 52727
15347 52727 -34392 34099 206087 -25836 -175980 -896 4830 20077 158099 245060 -7326 24205
15334 192773 -27058 124421 105911 10810 150239 -219115 525634 202568 128008 -284836
15323 -108380 218655 -7864 386651 -64167 217641 498309 -305631 -148938 -168816 -93584
$$ packed form
15401C1794a18860g228B06167b46282F0808a57130d2983j10490d4367j19867H9047
15389A76090b13789R0547B510J91285c7238q9432e6174k20353C92971F6434P3612
15378A40046J13447E5967a73607c1103k58292A03833b7096l02591B03819l4426
15368A69393a8963B52808a3459A03560p681J11462a29513C47785a03502m5933
15358a49435I5935h0998C97498a83441p5060i3441j1670B5727p833Q2675m7842
15347E2727c4392C4099J71988b5836j50144h96D830J5247J38022Q6961g326B4205
15334A92773b7058A24421j8510A0810J39429b19115E25634B02568p4560b84836
15323a08380B18655g864C86651f4167B17641K80668c05631a48938j9878P5232
$$ plain form
15313 -93584 -36201 -136199 118751 102338 -162549 225153 -46962 -171316 264569 269118 -79679
15301 174977 78299 58811 -225680 107411 136406 136514 -76430 293470 52392 -217137 43784
15289 48174 149215 193787 190688 -4302 235455 354272 34274 118505 -12190 262100 -98497
15277 207243 248759 -60260 558472 -115494 42784 65306 83893 -162487 332044 19339 -316150
15265 -28091 -349046 70538 171732 63715 143047 395726 -49879 -125488 -216436 146088 112340
15254 112340 146916 265409 366619 356515 575209 823003 1407165 1353989 1244331 1489800
15244 1489800 730522 56235 120193 13545 77726 237945 220378 383370 85278 490 272234
15233 272234 94649 269691 92248 62588 -18337 521387 72996 242471 179205 230059 73593
$$ packed form
15313i3584c6201r9998A18751j6413a62549B25153d6962j24354B64569M549g9679
15301A74977G8299j9488b25680A07411K8995J08g6430B93470E2392b17137D3784
15289D8174J01041M4572l099d302B35455J18817C4274Q4231a2190B62100i8497
15277B07243M1516f0260E58472a15494D2784K2522J8587a62487C32044A9339c16150
15265b8091l20955G0538J01194F3715P9332K52679d9879p5609r0948A46088l3748
15254A12340L4576J18493J01210j0104K18694K47794N84162n3176j09658K45469
15244A489800G30522E6235O3958A3545O4181J60219j7567J62992H5278D90K71744
15233B72234I4649J75042I2248k9660a8337E21387G2996J69475o3266N0854G3593
$$ plain form
15221 -98897 243226 -93832 -116004 170917 -361651 -79903 220092 169030 -105733 -146899 -33094
15209 179488 153621 -42481 -100140 9144 -140255 302423 410696 168001 185420 87765 68798
15198 68798 66119 -63058 -81089 109224 110060 -12726 -120671 108256 11790 12230 -124805 -303097
15186 -303097 -19337 264383 -234960 208377 34597 418772 -216775 22441 -278333 502 382467
15175 382467 140071 152088 92370 193377 194268 56779 220606 157852 282661 58345 224745
15164 224745 -161492 -232795 157881 -74475 302588 326457 380300 209777 -219163 240503
15153 269589 111652 125792 4121 164916 104931 361789 165382 150285 -172509 81422 11945
15141 133237 136840 -32573 336638 -203633 -86803 -61249 -14094 -120856 40228 -124883 186961
$$ packed form
15221i8897B43226i3832k2172A70917c61651g9903B20092n1062a05733m1166c3094
15209A79488k5867d2481n7659I144a40255C02423J08273A68001J7419H7765j8967
15198F8798k679f3058j8031A09224Q36a2726j07945A08256A1790M40a24805j78292
15186c03097a9337B64383b34960B08377C4597L84175b16775B2441b78333E02L81965
15175C82467A40071J2017n9718J01007Q91E6779J63827o2754J24809E8345J66400
15164B24745a61492p1303A57881g4475C02588K3869N3843j70523b19163B40503
15153B69589A11652J4140D121J60795n9985K56858A65382j5097a72509H1422A1945
15141A33237L603c2573C36638b03633h6803K5554a4094j06762D0228a24883A86961
$$ plain form
15129 160366 -96157 -77286 -205701 -80317 240807 -165459 237894 230181 -6592 180882 76319
15117 323612 -43363 351111 203520 40450 -237245 -248093 -299352 103765 244216 125734
15107 125734 -52215 229064 373479 138737 233234 -225792 -124896 55557 207917 -547 -81410
15096 -81410 177282 -50454 45910 -27532 105285 -79839 -44079 -9578 393726 226344 -222584
15084 412291 -248573 116163 257159 281144 -76893 99156 391153 119913 80776 268615
15074 268615 11880 323492 107363 -43843 304622 266382 65105 183936 87131 -71350 81467
15062 91757 25932 -159247 276215 167491 131001 151991 334123 312007 279307 92723 122666
15051 122666 19001 196101 394919 654405 342980 260373 71431 127694 360535 -100324
$$ packed form
15129A60366i6157J8871j28415h0317B40807a65459B37894p713f592A80882G6319
15117C23612d3363C51111j47591D0450b37245j0848n1259A03765J40451j18482
15107A25734e2215B29064J44415A38737R4497b25792J00896E5557J52360e47q0863
15096h1410A77282e0454D5910b7532A05285g9839L5760i578C93726j67382b22584
15084D12291b48573A16163J40996K3985g6893I9156K91997A19913l9137J87839
15074B68615A1880L11612A07363d3843C04622l8240F5105J18831H7131g1350H1467
15062I1757B5932a59247B76215j08724l6490K0990J82132k2116l2700I2723K9943
15051A22666A9001J77100J98818K59486l11425q2607G1431N6263K32841a00324
$$ plain form
15040 311300 -2296 -345750 642310 108730 140178 -17548 227502 313921 178876 29511 108874
15029 108874 279056 191469 -73564 147070 22428 74287 170347 -48860 101150 224495 155163
15018 155163 405773 101732 70917 53467 124030 175622 255326 335912 366385 288438 -240004
15006 286799 256827 229794 37336 321375 287394 263509 310976 157975 151608 91281 186578
14995 186578 412159 -82519 205874 150430 380958 294020 180676 112384 158803 550581
14985 550581 247880 436236 289375 299051 144439 257346 392363 449277 204561 378885
14975 378885 361602 189021 127659 451853 194505 648341 383216 344723 152777 381771
14965 381771 16586 149434 147250 417637 374290 119116 -146818 -77801 423349 289686
$$ packed form
15040C11300b296l43454F42310A08730L1448a7548B27502Q6419j35045B9511P9363
15029A08874J70182q7587g3564A47070B2428N1859R6060d8860A01150J23345o9332
15018A55163K50610A01732l0815j7450P0563N1592P9704Q0586L0473p7947b40004
15006B86799k9972k7033C7336K84039l3981k3885M7467j53001o367o0327R5297
14995A86578K25581h2519B05874n5444K30528q6938j13344o8292M6419L91778
14985E50581B47880J88356j46861R676A44439J12907J35017N6914B04561J74324
14975C78885j7283j72581o1362L24194A94505M53836k65125l8493A52777K28994
14965C81771A6586J32848k184K70387m3347A19116a46818O9017D23349j33663
$$ plain form
14955 289686 -73308 333097 664685 339498 203295 385195 387874 314137 304999 56421 -102712
14943 97656 85872 358976 200226 92328 173517 579042 343536 369962 214307 154939 364674
14932 364674 135386 432671 70979 381024 357234 49713 139440 489874 319145 370829
14922 370829 665143 398758 261876 141317 12020 488508 51715 375245 -10838 252926
14911 168774 327547 672945 357244 272523 221270 416748 266054 383017 338563 85318
14900 166653 43531 607887 261543 210555 285982 313018 298221 557542 589440 284547 345220
14889 345220 82648 178071 -24752 -37363 330711 469177 316867 333040 282112 572271 537058
14878 537058 471543 245938 -88045 324772 173044 134055 364260 96926 230341 299812
$$ packed form
14955B89686g3308C33097L31588l25187j36203J81900K679p3737r138E6421a02712
14943I7656j1784K73104j58750I2328Q1189M05525k35506K6426j55655n9368K09735
14932C64674A35386K97285G0979L10045k3790D9713Q9727L50434j70729N1684
14922C70829K94314k66385j36882j20559A2020M76488E1715L23530a0838B52926
14911A68774J58773L45398l15701q4721n1253J95478j50694J16963m4454H5318
14900A66653D3531N64356B61543n0988P5427K7036j4797K59321L1898B84547O0673
14889C45220H2648R5423b4752j2611C30711J38466j52310J6173n0928K90159l5213
14878E37058o5515k25605h8045C24772j51728l8989K30205I6926J33415O9471
$$ plain form
14868 299812 297091 -44397 341924 217060 301916 416314 375210 206007 585765 372898
14858 372898 145453 205074 252538 22037 175587 545803 473627 580860 551338 185560
14847 729041 387790 229248 646326 279790 196606 437675 388431 282802 302859 653294
14837 653294 181737 578581 304116 476408 490413 365184 763420 516842 291307 489797
14827 489797 469876 377972 334095 797596 223460 343753 430739 662166 391527 267855
14817 267855 530779 351569 548776 525084 286804 348235 449831 610622 370645 503531
14807 503531 273117 648003 310179 525907 297040 618935 588855 407694 604748 646262
14797 646262 429700 603387 453332 459833 497944 483304 783860 581239 960429 662614
$$ packed form
14868B99812k721d4397C41924j24864Q4856J14398m1104j69203L79758k12867
14858C72898A45453N9621M7464B2037J53550L70216p2176J07233k9522A85560
14847G29041l41251j58542M17078B79790q3184K41069m9244j05629K0057L50435
14837F53294A81737L96844k74465J72292J4005j25229L98236k46578k25535J98490
14827D89797j9921r1904m3877M63501B23460J20293Q6986K31427k70639j23672
14817B67855K62924j79210J97207k3692k38280O1431J01596J60791k39977J32886
14807E03531k30414L74886C10179K15728k28867L21895l0080j81161J97054M1514
14797F46262k16562J73687j50055O501L8111j4640L00556k02621L79190k97815
$$ plain form
14787 662614 631155 261947 106122 904338 386346 724783 377810 563814 413515 289972
14777 289972 813647 400808 743575 375276 292930 725710 413861 575340 646161 251136
14766 502589 1024038 284651 419584 903329 295299 433185 741070 841546 375702 400117
14756 400117 993568 615113 613459 825275 860936 548758 872191 307067 588990 638439
14746 638439 984622 667945 802921 816778 720780 823382 260351 817148 847325 409492
14735 546207 773031 843816 827193 613599 692915 522601 678772 944213 590938 523363
14725 523363 861285 837614 964611 1032506 993783 743000 944652 457402 495874 878399
14715 878399 712075 672565 933084 888062 803717 716987 472565 784905 1082570 864649
$$ packed form
14787F62614l1459B61947A06122P98216C86346L38437l46973J86004j50299j23543
14777B89972N23675D00808L42767l68299q2346M32780l11849J61479P0821B51136
14766E02589N21449B84651J34933M83745B95299J37886L07885J00476C75702K4415
14756D00117N93451l78455j654K11816L5661l12178L23433C07067K81923M9449
14746F38439L46183l16677J34976J3857r5998J02602B60351N56797L0177D09492
14735E46207K26824P0785j6623k13594P9316j70314J56171K65441l53275o7575
14725E23363L37922k3671J26997O7895l8723k50783K01652D57402L8472L82525
14715H78399j66324l9510K60519m5022q4345q6730k44422L12340K97665k17921
$$ plain form
14705 864649 945443 638479 967591 780766 870024 827744 1108019 783607 980300 905444
14695 905444 842256 943106 856741 1215651 863224 858242 802960 1135159 950226 1253065
14685 1253065 1098163 858311 1076746 987823 991384 799495 933782 1034825 1026771 1152224
14675 1152224 740222 1221815 957980 1092925 1000099 1367863 1302930 748536 765142 1064869
14665 1064869 1101481 1182400 704043 1219022 1502040 973531 938323 989726 1136765 954086
14655 954086 1417404 1042110 1018831 1109998 1254959 1186469 960081 1359406 1141933 1095260
14645 1095260 961939 1122074 1115417 1220657 1189900 1332397 1240398 1346549 1130530 1190743
14635 1190743 1108976 1362488 1072338 1284977 1109986 1278073 1338903 1412109 1123655 1718539
$$ packed form
14705H64649Q0794l06964L29112j86825Q9258m2280K80275l24412J96693p4856
14695I05444o3188J00850q6365L58910l52427m982n5282L32199j84933L02839
14685A253065j54902k39852K18435q8923L561j91889J34287J01043q054J25453
14675A152224m12002M81593k63835J34945r2826L67764o4933n54394J6606K99727
14665A064869L6612Q0919m78357N14979K83018n28509l5208N1403J47039j82679
14655I54086M63318l75294k3279R1167J44961o8490k26388L99325k17473m6673
14645A095260j33321J60135o657J05240l0757J42497r1999J06151k16019O0213
14635A190743q1767K53512k90150K12639j74991J68087O0830P3206k88454N94884
$$ plain form
14625 1718539 1350035 1400361 1669228 1651026 1377208 1071980 1205303 1697554 1849678 1790402
14615 1790402 1199322 1303135 1537449 1283957 1489770 1462341 1515958 1481764 1953011 1442137
14605 1442137 1752832 1500108 1668718 1585752 1605218 1356097 1628749 1511334 1521956 1489956
14595 1489956 1549205 1709325 1566670 1804867 1785994 1810415 1763455 1776958 1807964 2094686
14585 2094686 1869896 1924449 2053436 1983416 1736221 1947290 2017090 2020037 2051709 1340631
14575 1340631 2083304 1879741 2186526 2121247 1920145 1847032 2265193 2111901 2393635 2253752
14565 2253752 2462365 2200782 2390654 2341933 2638853 2522183 2974470 2858642 2951629 3214813
14555 3214813 3020177 3414766 3717249 4251761 4886918 5707072 7980247 11727308 20294566
$$ packed form
14625A718539l68504N0326K68867j8202k73818l05228J33323M92251J52124n9276
14615A790402n91080J03813K34314k53492K05813k7429N3617l4194M71247n10874
14605A442137L10695k52724J68610q2966J9466k49121K72652j17415J0622l2000
14595A489956N9249J60120j42655K38197j8873K4421m6960J3503L1006K86722
14585B094686k24790N4553J28987p0020k47195K11069O9800K947L1672p11078
14575A340631P42673k03563L06785o5279k01102p3113M18161j53292K81734j39883
14565B253752K08613k61583J89872m8721K96920j16670M52287j15828R2987K63184
14555C214813j94636L94589L02483N34512O35157Q20154K273175L747061Q567258
$$ plain form
14546 20294566 38021684 44052913 23856743 10033102 4760571 2805806 2389396 2063535
14538 2063535 1894861 1902625 2116607 1891813 1758264 1811518 1979040 2293972 2275897 2096265
14528 2096265 2208189 1909586 2498377 2537699 2112027 2704235 2400510 2534246 2345593 2499436
14518 2499436 2293135 2522160 2435355 2543226 2808444 2552838 2714294 2925907 3041789 2789194
14508 2789194 2857224 2901327 2743902 2954924 3152034 3154185 3048203 2929860 3242129 3433541
14498 3433541 3352219 3139692 3064195 3180369 3229632 3205661 3379099 3186081 3482268 3422178
14488 3422178 3482411 3682066 3573671 3538963 3692668 3744529 3583642 3842999 3813335 3872170
14478 3872170 3971832 3719881 3789710 3843267 3970232 3839758 4072981 3708402 4871067 4276782
$$ packed form
14546B0294566J7727118O031229k0196170A0033102D760571j954765m16410l25861
14538B063535j68674P764K13982k24794j33549N3254J67522L14932j8075j79632
14528B096265J11924k98603N88791L9322m25672N92208l03725J33736j88653J53843
14518B499436k06301K29025q6805J07871K65218k55606J61456K11613J15882k52595
14508B789194O8030M4103j57425K11022J97110K151j05982j18343L12269J91412
14498C433541q1322k12527p5497J16174M9263k3971J73438j93018K96187o0090
14488C422178O0233J99655j08395l4708J53705N1861j60887K59357k9664N8835
14478C872170R9662k51951O9829N3557J26965j30474K33223l64579J162665n94285
$$ plain form
14468 4276782 4627643 4438032 4428605 4323104 4749503 4959817 4491567 4849279 4900163 4448772
14458 4448772 4866789 4882433 4984343 5063005 5236230 5392644 4860711 5301739 5140404 5380155
14448 5380155 5183487 5792775 5812060 5541731 5935752 5745826 5779410 6137672 6351302 6084543
14438 6084543 6100179 6456526 6234872 6497656 6316965 6534677 6914026 6921651 6783999 6674172
14428 6674172 7081232 7171992 7048307 7116279 7822433 7494877 7809348 8019493 8012844 8135096
14418 8135096 8309462 8455099 8490177 8314591 8667851 8855246 9241880 9086028 8993059 9468577
14408 9468577 9461439 9799866 9803211 9610998 9829889 9958397 10176869 10486323 10488778 10867937
14398 10867937 10873759 11071457 11290233 11293694 11604145 12054825 11915804 12223620 12111456 12779439
$$ packed form
14468D276782L50861j89611r427j05501M26399K10314m68250L57712N0884m51391
14458D448772M18017J5644J01910P8662J73225J56414n31933M41028j61335K39751
14448E380155j96668O09288J9285k70329L94021j89926L3584L58262K13630k66759
14438F084543J5636L56347k21654K62784j80691K17712L79349P625j37652j09827
14428F674172M07060R0760j23685O7972P06154l27556L14471K10145o649J22252
14418H135096J74366J45637L5078j75586L53260J87395L86634j55852r2969M75518
14408I468577p138L38427L345j92213K18891J28508K18472L09454K455L79159
14398A0867937N822J97698K18776L461L10451M50680j39021L07816j12164O67983
$$ plain form
14388 12779439 12896176 13031521 13193880 13401206 13435509 13768628 14379986 14349649 14779714 15038718
14378 15038718 15508144 15272755 15692601 15791840 16830799 16626408 16838351 17267665 17636152
14369 17636152 18060142 18572649 18926930 19394006 19811263 19966600 20280802 20661372 21198749
14360 21198749 21666386 22227344 22958114 23066196 23752782 24188385 24995066 25739842 26107376
14351 26107376 26506715 27439029 27830810 28488239 29912185 30344726 30865195 31437887 32517542
14342 32517542 33284731 34165820 35384746 36365228 37158033 38079210 39119456 40354863 41601706
14333 41601706 42557523 43933718 45161276 46728554 47975497 49734195 51163508 52756393
14325 52756393 54393552 56186723 58369645 60116421 62143322 64428183 66780921 69400796
$$ packed form
14388A2779439J16737J35345J62359K07326L4303L33119O11358l0337M30065K59004
14378A5038718M69426k35389M19846R9239J038959k04391K11943M29314L68487
14369A7636152M23990N12507L54281M67076M17257J55337L14202L80570N37377
14360B1198749M67637N60958P30770J08082O86586M35603Q06681P44776L67534
14351B6107376L99339R32314L91781O57429J423946M32541N20469N72692J079655
14342C2517542P67189Q81089J218926R80482P92805R21177J040246J235407J246843
14333D1601706R55817J376195J227558J567278J246943J758698J429313J592885
14325E2756393J637159J793171K182922J746776K026901K284861K352738K619875
$$ plain form
14317 69400796 71735177 74586800 77156828 80165124 83273995 86471394 89949288 93803916
14309 93803916 97915627 101766860 106103732 111113446 115362992 121112523 126253607 131767197
14301 131767197 138182142 144638612 151546736 158565529 166564039 174585991 183412638 192593147
14293 192593147 202147125 212419308 223396137 234607384 246505418 259122508 272245801
14286 272245801 285975245 300270670 314574021 329424026 344350055 359516741 374498839
14279 374498839 388999446 402906260 416376195 428263277 439340857 447860342 453993579
14272 453993579 456823672 458362713 458221231 459096051 457728382 454767852 450150839 442941119
14264 442941119 432898061 421276880 408109086 393557269 378838973 363478366 347830144
$$ packed form
14317F9400796K334381K851623K570028L008296L108871L197399L477894L854628
14309I3803916M111711L851233M336872N009714M249546N749531N141084N513590
14301A31767197O414945O456470O908124P018793P998510Q021952Q826647R180509
14293A92593147R553978J0272183J0976829J1211247J1898034J2617090J3123293
14286B72245801J3729444J4295425J4303351J4850005J4926029J5166686J4982098
14279C74498839J4500607J3906814J3469935J1887082J1077580Q519485O133237
14272D53993579K830093J539041j41482Q74820j367669k960530m617013p209720
14264D42941119j0043058j1621181j3167794j4551817j4718296j5360607j5648222
$$ plain form
14257 347830144 332448870 317021193 302606684 288669285 274702984 260986207 248167104
14250 248167104 235678915 224323075 213125496 202741910 192827592 183464949 175271184
14243 175271184 166518504 158633206 151145328 144333099 138067817 132142867 126618076 120690907
14235 120690907 115443107 110387716 105804013 101745451 98213762 93578880 90052264 86508378
14227 86508378 83050622 80024360 77114842 74405977 71702973 68989984 66418238 64290979
14219 64290979 62401989 59970009 58281919 56167667 54148011 53060357 51280592 50001962
14211 50001962 47853112 46761952 44787112 44175346 43206384 42040282 40581635 39536286
14203 39536286 38374879 37236966 36380681 35987016 34687485 33366618 32753000 31556422
$$ packed form
14257C47830144j5381274j5427677j4414509j3937399j3966301j3716777j2819103
14250B48167104j2488189j1355840j1197579j0383586r914318r362643q193765
14243A75271184q752680p885298p487878o812229o265282n924950n524791n927169
14235A20690907n247800n055391m583703m058562l531689m634882l526616l543886
14227H6508378l457756l026262k909518k708865k703004k712989k571746k127259
14219F4290979j888990k431980j688090k114252k019656j087654j779765j278630
14211E0001962k148850j091160j974840o11766r68962j166102j458647j045349
14203C9536286j161407j137913q56285l93665j299531j320867o13618j196578
$$ plain form
14195 31556422 30948339 30179496 29895657 28743963 28276233 27472714 27092833 26465388 25472073
14186 25472073 24914831 24251142 23810677 23318473 22629200 22087538 21978653 21523020 21053053
14177 21053053 20491113 19702916 19727895 18907468 18644958 18304591 17831986 18019848 17031914
14168 17031914 16992141 16531700 16601668 16143880 15666151 15402213 15485405 15033704 14557095 14298838
14158 14298838 14200833 13980636 13695777 13419111 13295496 13059642 12771940 12332285 12493883
14149 12493883 12318339 12002856 11864833 11863184 11711586 10831971 10929229 11002558 10679691 10505023
14139 10505023 10580730 10291877 10076684 9609668 9693762 9615981 9677026 9429786 9052840 8870483
14129 8870483 8928322 8737594 8928697 8418994 8588727 8314125 8089364 8104992 7974346 7850557
$$ packed form
14195C1556422o08083p68843k83839j151694m67730q03519l79881o27445r93315
14186B5472073n57242o63689m40465m92204o89273n41662j08885m55633m69967
14177B1053053n61940p88197K4979q20427k62510l40367m72605J87862r87934
14168A7031914l9773m60441O9968m57788m77729k63938Q3192m51701m76609k58257
14158A4298838r8005k20197k84859k76666j23615k35854k87702m39655J61598
14149A2493883j75544l15483j38023j649j51598q79615R7258P3329l22867j74668
14139A0505023P5707k88853k15193m67016Q4094p7781O1045k47240l76946j82357
14129H870483N7839j90728J91103n09703J69733k74602k24761J5628j30646j23789
$$ plain form
14119 7850557 7665346 7842279 7593547 7547143 7711607 7234129 7234814 6996098 7029504 6884377
14109 6884377 6696564 6792425 6737558 6690467 6755279 6345332 6751266 6491138 5947533 6259393
14099 6259393 6218520 6259688 5920243 5872422 5919951 5866452 5612224 5571777 5462148 5653036
14089 5653036 5486338 5188189 5212243 5068139 5352244 5482912 5011041 5086714 5198054 4605355
14079 4605355 5101007 4874852 4563172 4759693 4661846 4754840 4622967 4700229 4538301 4769320
14069 4769320 4348301 4167295 4257318 4671864 4455230 4193587 4085818 4280665 4084440 4056678
14059 4056678 4205555 4318632 3972061 3995262 3846675 3968606 3830385 3416069 3925814 3676876
14049 3676876 3376576 3697787 3541271 3796207 3391585 3264387 3672975 3425853 3174220
$$ packed form
14119G850557j85211J76933k48732m6404J64464m77478O85k38716L3406j45127
14109F884377j87813R5861n4867m7091O4812m09947M05934k60128n43605L11860
14099F259393m0873M1168l39445m7821M7529n3499k54228m0447j09629J90888
14089E653036j66698k98149K4054j44104K84105J30668m71871P5673J11340n92699
14079D605355M95652k26155l11680J96521r7847R2994j31873P7262j61928K31019
14069D769320m21019j81006R0023M14546k16634k61643j07769J94847j96225k7762
14059D056678J48877J13077l46571K3201j48587J21931j38221m14316N09745k48938
14049C676876l00300L21211j56516K54936m04622j27198M08588k47122k51633
$$ plain form
14040 3174220 3389604 3273693 3275244 3022570 3216790 2958233 3117263 3076957 3356193 3235426
14030 3235426 3203158 2813666 3038006 3165147 2831154 3016101 2841248 2830578 2563322 2952602
14020 2952602 2746699 2906275 2654469 2746432 2744992 2585253 2427501 2661572 2333878 2554371
14010 2554371 2508467 2660506 2108266 2589176 2288428 2499058 2316744 2462702 2010229 2177967
14000 2177967 1966539 1993576 2346304 2057024 2066551 2281899 1936870 2367938 2330918 2333529
13990 2333529 2580138 4061756 6716950 14024646 31508159 44709752 27409739 14319416
13982 14319416 8926188 5867145 5064927 4245280 3500007 3344675 2966038 3437643 2842589
13973 2842589 2882401 2486531 2440592 2645163 2526180 2467061 2348700 2206214 2319377 2186675
$$ packed form
14040C174220K15384j15911J551k52674J94220k58557J59030m0306K79236j20767
14030C235426l2268l89492K24340J27141l33993J84947j74853j0670k67256L89280
14020B952602k05903J59576k51806R1963j440j59739j57752K34071l27694K20493
14010B554371m5904J52039n52240M80910l00748K10630j82314J45958m52473J67738
14000B177967k11428K7037L52728k89280R527K15348l45029M31068l7020K611
13990B333529K46609J481618K655194P307696J7483513J3201593j7300013j3090323
13982A4319416n393228l059043q02218q19647p45273j55332l78637M71605n95054
13973B842589L9812l95870m5939K04571j18983n9119j18361j42486J13163j32702
$$ plain form
13963 2186675 2313699 2218185 2005506 2188781 2213576 2206113 2133776 1909653 1889483 2079406
13953 2079406 1803231 2171478 2131803 2016977 2172035 1863999 1955684 1742091 1869481 1704335
13943 1704335 1957410 1527284 1643560 2018762 1991612 1425505 1672899 1297557 1825108 1708016
13933 1708016 1795174 1479820 1621699 1620572 1719463 1442763 1748717 1825610 1254764 1715741
13923 1715741 1493659 1334580 1639867 1481058 1659131 1574823 1473910 1565716 1174352 1855582
13913 1855582 1859136 1375225 1359737 1674900 1446076 1358910 1350928 1261170 1444589 1463548 1411667
13902 1411667 1744276 1480918 1227312 1591382 1455244 1163205 1731988 1389531 1353304 1245945
13892 1245945 1207412 1514696 1060055 1310606 1207726 1297937 1156585 991635 1123309 1531858
$$ packed form
13963B186675J27024r5514k12679J83275K4795p463p2337k24123k0170J89923
13953B079406k76175L68247l9675j14826J55058l08036R1685k13593J27390j65146
13943A704335K53075m30126J16276L75202k7150n66107K47394l75342N27551j17092
13933A708016Q7158l15354J41879j127R8891k76700L05954P6893n70846M60977
13923A715741k22082j59079L05287j58809J78073q4308j00913R1806l91364O81230
13913A855582L554m83911j5488L15163k28824q7166p982q9758J83419J8959n1881
13902A411667L32609k63358k53606L64070j36138k92039N68783l42457l6227j07359
13892A245945l8533L07284m54641K50551j02880R0211j41352j64950J31674M08549
$$ plain form
13882 1531858 1386236 1173226 1239417 953940 1171490 1044239 1363780 1354615 1541669 1124691
13872 1124691 1087104 1171779 1044997 1044026 1215018 1040988 1250913 1140833 1141643 1210843 941413
13861 941413 765544 1103658 889751 1063477 1077915 1181609 1083205 856782 1037651 901216
13851 901216 859992 1093066 1054048 1051391 1232978 980996 1449465 1075675 1192389 1071787
13841 1071787 1091801 1042171 964956 781554 1281048 1333149 1026399 1199369 971201 805527
13831 805527 757049 1141746 878964 1205573 872637 887790 751563 968161 733918 674994
13821 674994 936090 1237032 955946 1037383 967632 637515 929160 706833 1023364 1162792
13811 1162792 547493 903416 969465 733268 935280 1002362 1117580 958574 797697 672024
$$ packed form
13882A531858j45622k13010O6191k85477K17550j27251L19541r165J87054m16978
13872A124691l7587Q4675j26782r71J70992j74030K09925j10080Q10O9200k69430
13861I41413j75869L38114k13907J73726J4438J03694r8404k26423J80869j36435
13851I01216m1224K33074l9018k657J81587k51982M68469l73790J16714j20602
13841A071787K0014m9630p7215j83402M99494N2101l06750J72970k28168j65674
13831H05527m8478L84697k62782L26609l32936J5153j36227K16598k34243n8924
13821F74994K61096L00942k81086Q1437o9751l30117K91645k22327L16531J39428
13811A162792E47493L55923O6049k36197K02012O7082J15218j59006j60877j25673
$$ plain form
13801 672024 902784 1011292 671435 696171 598117 781231 1025661 584713 956278 844793
13791 844793 709783 542520 706055 740892 758498 757518 710717 648861 765937 486756 806322
13780 806322 782562 616899 951210 520320 1030819 511185 836899 667900 645327 565947
13770 565947 627701 578567 876707 553075 887909 581028 784225 803969 936516 584337
13760 584337 921666 648691 862690 484536 510607 739672 472155 489049 965501 843475
13750 843475 866409 713869 509252 784270 672419 518268 485842 408886 418495 537968
13740 537968 679498 908442 567417 564401 838510 779327 463021 533681 373680 833420
13730 833420 603471 305564 716710 686946 590102 722958 157185 348139 461847 71523
$$ packed form
13801F72024K30760J08508l39857K4736r8054J83114K44430m40948L71565j11485
13791H44793j35010j67263J63535L4837J7606r80m6801o1856J17076k79181L19566
13780H06322k3760j65663L34311m30890N10499E11185L25714j68999k2573p9380
13770E65947O1754m9134K98140l23632L34834l06881K03197J9744J32547l52179
13760E84337L37329k72975K13999l78154K6071K29065k67517J6894M76452j22026
13750H43475K2934j52540k04617K75018j11851j54151l2426p6956R609J19473
13740E37968J41530K28944l41025l016K74109n9183l16306P0660j60001M59740
13730H33420k29949k97907M11146k9764r6844J32856A57185J90954J13708G1523
$$ plain form
13719 651090 685038 493636 747748 792821 436080 633900 512404 905853 670133 681120
13709 681120 354714 595879 512742 896142 417898 630034 251841 564502 514123 581646
13699 581646 556903 514593 606526 523649 590211 648683 340989 647263 604179 501170 475622
13688 475622 605543 314487 529436 684082 827858 555006 646780 393074 583834 398437
13678 398437 647672 408765 287388 421490 323481 245896 469277 675076 467466 380152
13668 380152 668252 360051 595645 716634 549069 403243 286833 467557 462861 530350
13658 530350 400703 609747 353222 221054 593270 264101 560631 468478 669365 671315
13648 671315 369016 547469 272899 497800 457316 130337 278901 502924 211150 322374
$$ packed form
13719F51090L3948j91402K54112M5073l56741J97820j21496L93449k35720J0987
13709F81120l26406K41165q3137L83400D17898K12136B51841L12661n0379O7523
13699E81646k4743m2310R1933q2877O6562N8472l07694L06274m3084j03009k5548
13688D75622J29921k91056K14949J54646J43776k72852R1774k53706J90760j85397
13678C98437K49235k38907j21377J34102r8009p7585K23381K05799k07610q7314
13668C80152K88100l08201K35594J20989j67565j45826j16410J80724m696O7489
13658E30350j29647K09044k56525j32168L72216B64101K96530r2153K00887J950
13648F71315l02299J78453B72899K24901m0484A30337J48564K24023B11150J11224
$$ plain form
13638 322374 690295 482708 419369 558065 427183 435574 330798 866617 495525 475227
13628 475227 785917 241987 553694 579784 400853 607491 419499 313614 595027 540246
13618 540246 276526 210603 626286 251943 243073 670599 406949 172314 320301 347666
13608 347666 411712 467008 496362 284061 569151 484735 428787 428729 107125 2191 56946 280340
13596 280340 719830 145439 384173 374607 637732 392460 469206 201353 392177 252542
13586 252542 326856 226855 370986 561326 468616 158300 461956 393461 175485 461877
13576 461877 355234 180163 248460 358840 11125 15694 555986 237191 404141 289435
13566 289435 482515 179895 602635 388274 40716 384442 210453 494780 76832 145271
$$ packed form
13638C22374L67921k07587o3339J38696j30882Q391j04776N35819l71092k0298
13628D75227L10690B41987L11707K6090j78931K06638j87992j05885K81413n4781
13618E40246k63720o5923M15683B51943q870M27526k63650A72314J47987K7365
13608C47666O4046N5296K9354k12301K85090q4416n5948n8A07125B191N4755K23394
13596B80340M39490A45439K38734r566K63125k45272P6746B01353J90824j39635
13586B52542P4314j00001J44131J90340r2710A58300L03656o8495A75485K86392
13576D61877j06643j75071O8297J10380A1125M569N40292B37191J66950j14706
13566B89435J93080A79895M22740k14361D0716L43726j73989K84327G6832O8439
$$ plain form
13556 145271 149348 450389 355437 161048 435685 550303 262808 562474 195299 518352
13546 518352 223023 227027 320674 200675 268361 179922 399681 102752 336997 87920 415443
13535 415443 385779 429369 190921 184391 441270 83758 473380 87021 191294 251593 93175
13523 251184 328749 258037 -140911 110125 135299 341383 219825 328846 312723 118031
13512 105558 111652 107791 295780 143202 -67008 128111 216203 42982 321259 89390 378404
13501 378404 72097 319129 232509 291800 167629 652836 390776 14174 474529 328332
13491 328332 535977 283426 74927 309850 287061 401084 293049 520547 370200 240708
13481 240708 446646 155712 114745 82500 126918 494377 176535 276319 19556 366496
$$ packed form
13556A45271M077L01041r4952A61048K74637J14618B62808K99666A95299L23053
13546E18352B23023M004R3647j19999O7686q8439K19759A02752K34245H7920L27523
13535D15443k9664M3590A90921o530K56879H3758L89622H7021J04273O0299I3175
13523B51184P7565p0712a40911A10125K5174K06084j21558J09021j6123A18031
13512A05558O094l861J87989A43202f7008A28111Q8092D2982K78277H9390K89014
13501C78404G2097K47032q6620N9291j24171M85207k62060A4174M60355j46197
13491C28332K07645k52551G4927K34923k2789J14023j08035K27498j50347j29492
13481B40708K05938A55712m0967l2245M4418L67459A76535R9784A9556L46940
$$ plain form
13471 366496 45308 200313 169472 144485 115872 103862 230261 292003 -91170 273635 35638
13459 384909 306976 159339 401823 97385 116543 160157 60916 395023 291267 182067
13449 182067 268657 114707 507288 -36200 53333 181342 365945 300649 292851 365536 347199
13438 347199 -127848 234154 54146 -91383 -222713 210618 250574 -60692 74194 422145
13428 422145 143852 511115 -40846 88957 153662 513632 212758 339293 -200152 318487
13417 149823 237748 -143624 -12451 153902 363584 170102 117050 -192345 341711 137373
13406 -131040 91071 279562 34277 -48369 -60470 490929 339635 -44073 203565 440193
13396 440193 259462 213343 -37395 251474 165400 176613 222885 25518 118500 211074 107350
$$ packed form
13471C66496D5308J55005l0841k4987k8613j2010J26399O1742i1170B73635C5638
13459C84909p7933j47637K42484I7385J9158M3614F0916L34107j03756j09200
13449A82067Q6590A14707L92581c6200E3333J28009J84603o5296p798P2685j8337
13438C47199a27848B34154E4146i1383j31330B10618L9956f0692G4194L47951
13428D22145A43852L67263d0846H8957O4705L59970B12758J26535b00152C18487
13417A49823Q7925a43624a2451A53902K09682A70102n3052a92345C41711A37373
13406a31040I1071J88491C4277d8369j2101D90929j51294d4073B03565K36628
13396D40193j80731m6119c7395B51474q6074J1213M6272B5518R2982R2574j03724
$$ plain form
13385 107350 418188 273865 -98506 341408 292039 386563 271015 -45599 345815 200632
13375 200632 251284 20471 142434 -1480 337984 341447 399483 258207 41863 463479 -47767
13363 230193 324180 182060 179336 185258 783568 364656 -9529 120786 380275 113744 272662
13352 272662 209921 404967 176934 183344 513877 -40826 342600 -29428 129965 410965
13342 410965 463008 285040 285829 200440 440827 323225 54271 95009 155794 87047 162021
13331 162021 -20374 142012 28839 66692 524978 242805 449614 -124119 459730 166400
13320 68877 341357 244886 74744 28257 -9334 155245 162390 377653 19198 149373 52860
13308 291916 441853 238816 -77978 445904 -76571 232353 -46608 293643 463948 354575
$$ packed form
13385A07350L10838j44323i8506C41408m9369R4524j15548d5599C45815j45183
13375B00632N0652B0471J21963a480C37984L463N8036j41276D1863M21616d7767
13363B30193R3987j42120k724N922N98310C64656i529A20786K59489A13744J58918
13352B72662o2741J95046A76934O410L30533d0826C42600b9428A29965K81000
13342D10965N2043j77968P89q5389K40387j17602E4271M0738O0785o8747P4974
13331A62021b0374A42012B8839L7853M58286B42805K06809a24119D59730A66400
13320F8877K72480r6471G4744B8257i334A55245P145K15263A9198J30175E2860
13308B91916J49937k03037g7978D45904g6571B32353d6608B93643J70305j09373
$$ plain form
13298 354575 157478 219318 511770 171115 42622 274874 241686 160752 141344 307223
13288 307223 90688 272682 164242 43113 477504 169996 -148732 12517 156374 6653
13277 85145 -154061 90709 -85766 379865 28862 -32509 256411 -29538 297257 -81530 -41112
13266 -41112 -184950 -72318 134483 46900 102757 336521 23364 50274 163866 -254982 -86134
13254 228883 -52162 226879 183485 -249325 504666 182608 220251 182003 101464 473930
13244 473930 272967 153165 202334 -41113 216310 -45662 35820 333478 -73335 10237 -27758
13232 206698 100015 209692 -125179 248397 275645 97616 293515 307863 61589 -6351 100947
13220 191461 82204 57264 122344 -95751 62906 337749 207113 421897 55891 119847 26457
$$ packed form
13298C54575A57478O1840K92452A71115D2622K32252l3188q0934j9408J65879
13288C07223I0688J81994j08440D3113M34391A69996a48732A2517J43857F653
13277H5145a54061I0709h5766C79865B8862c2509B56411b9538B97257h1530M0418
13266d1112j43838g2318A34483D6900N5857K33764B3364K6910J13592b54982h6134
13254B28883e2162B26879m3394b49325E04666A82608L7643l8248q0539L72466
13244D73930k00963j19802M9169d1113B16310d5662C5820K97658g3335A0237b7758
13232B06698A00015J09677a25179B48397K7248I7616J95899J4348F1589f351A00947
13220A91461H2204k4940O5080i5751F2906K74843j30636K14784E5891O3956B6457
$$ plain form
13208 -256838 -319299 259258 353296 59284 336088 89351 -314872 182514 -51002 242181
13197 134566 191316 -93017 -121997 177234 241907 96913 308662 -118078 171197 -121116
13186 -84204 -88104 -14799 194080 278853 233777 170804 -89616 105716 7559 113855 -100189
13174 84366 -159662 168131 -161667 165817 25643 194029 22580 165504 -75499 -106265
13164 -106265 176240 25297 437578 52898 176188 405429 -744 250026 204431 -60663 193312
13152 -20906 295189 27756 56694 388746 -24534 133528 -30100 22197 358555 -102805 506140
13140 263564 317141 7974 88398 61016 -158020 29420 133555 197318 253573 -125827 116660
13128 272871 38828 90267 30817 223445 162532 -237485 120552 100335 -179420 104911
$$ packed form
13208b56838o2461B59258R4038E9284K76804H9351c14872A82514e1002B42181
13197A34566N6750i3017k8980A77234O4673I6913K11749a18078A71197a21116
13186h4204l900a4799A94080Q4773m5076o2973h9616A05716G559J06296a00189
13174H4366a59662A68131a61667A65817B5643J68386B2580J42924g5499l0766
13164a06265A76240B5297M12281E2898J23290K29241g44B50026m5595f0663A93312
13152b0906B95189B7756K8938L32052b4534A33528c0100B2197L36358a02805E06140
13140B63564N3577G974Q0424k7382a58020B9420J04135O3763N6255a25827A16660
13128B72871C8828N1439C0817J92628o0913b37485A20552k0217a79420A04911
$$ plain form
13117 546713 64883 -89173 295204 121065 185325 3602 165274 27874 466564 23540 118053
13106 118053 355871 -22219 29837 -302840 -233205 35005 117921 177625 -30577 -20724 183039
13094 358538 104492 158355 75821 -150045 167049 371665 162652 49561 90676 -298377
13083 49881 -24305 -135997 -4150 -124956 358190 -89166 163159 86258 269444 96222 50277
13072 50277 164928 -17382 212803 -2638 -98371 -121971 -146060 -57975 -10500 -159613 329749
13060 194874 149698 -198544 188064 90903 -84113 298693 350539 154281 208620 512386
13050 512386 148447 139615 146618 -4944 -56363 -149240 176324 340333 -214043 -41294 -78364
13039 -78364 22337 148943 151539 79339 -117352 79369 226607 182435 -84758 288227 116941
$$ packed form
13117E46713F4883h9173B95204A21065O4260C602J61672B7874M38690B3540R4513
13106A18053K37818b2219B9837c02840O9635C5005Q2916N9704c0577R853A83039
13094C58538A04492N3863G5821a50045A67049K04616A62652D9561M1115b98377
13083D9881b4305j11692d150j20806C58190h9166A63159p6901J83186I6222m5945
13072E0277J14651a7382B12803b638r5733k3600k4089e7975a0500j49113C29749
13060A94874m5176a98544A88064I0903h4113B98693N1846A54281N4339L03766
13050E12386A48447q832P003d944n1419r2877A76324J64009b14043d1294l7070
13039g8364B2337J26606K596p2200a17352G9369J47238m4172h4758B88227A16941
$$ plain form
13027 -1545 317369 -351639 12919 35919 -27796 178606 -38978 -139292 188132 21339 12292
13016 12292 188944 -42519 -37903 -27946 276635 257103 316272 391762 337560 68592 -65211 237406
13003 232562 506079 348876 221689 49273 256812 121839 -122379 67194 234863 84983
12992 -160772 -194324 131801 -203234 -12800 103807 -173648 248829 -56585 -111147 312134
12981 48211 95748 150178 243519 -86377 -175281 139090 88755 48485 93047 68189 -21519
12969 195078 -145242 42280 266980 71083 105776 72184 -191345 16029 96423 348213 555456
12958 555456 204686 -68222 116960 31149 -39616 46880 75639 10713 206588 -80092 -216419
12947 -216419 373614 124095 -71068 58432 -11224 -72936 108553 -2172 -89436 92464 -114483
$$ packed form
13027a545C17369c51639A2919K3000b7796A78606c8978j00314A88132B1339r047
13016A2292J76652d2519M616R957B76635j9532N9169P5490n4202F8592f5211B37406
13003B32562K73517j57203j27187D9273K07539A21839a22379F7194J67669H4983
12992a60772l3552A31801b03234a2800A03807a73648B48829e6585n4562C12134
12981D8211M7537N4430R3341h6377q8904A39090n0335m0270M4562k4858b1519
12969A95078a45242D2280K24700G1083L4693l3592a91345A6029Q0394K51790K07243
12958E55456B04686f8222A16960C1149c9616D6880K8759A0713J95875h0092j36327
12947b16419C73614A24095g1068E8432a1224o1712A08553b172q7264I2464a14483
$$ plain form
12935 -284310 288332 -244013 -37940 283688 176398 25763 -42032 -269670 101668 309620
12925 309620 256720 210130 -378109 -145905 -71983 27522 206715 168629 16171 191426 -52530
12913 167583 186145 -234561 252291 20818 -283152 174753 139176 -125170 190346 236864
12903 236864 -69190 218610 -110727 -29080 146961 105249 -149101 121085 279241 -168019
12892 114991 -81545 -150153 177590 -75319 293873 -196089 -196392 -51624 257349 506996 168399
12880 -107973 -53252 123301 -175214 -200145 -90638 -96878 -10314 17426 -147257 38143 233295
12869 233295 -85276 88651 -35830 -103557 -128646 -195365 246815 194647 -53294 97979 -46887
12857 94291 -263818 38030 18318 -205838 -171695 -51882 178837 230683 110467 -18008 72990
$$ packed form
12935b84310B88332b44013c7940B83688j07290B5763d2032k27638A01668K07952
12925C09620n2900m6590c78109a45905g1983B7522J79193l8086A6171J75255e2530
12913A67583J8562b34561B52291B0818b83152A74753l5577a25170A90346M6518
12903B36864f9190B18610a10727b9080A46961m1712a49101A21085J58156a68019
12892A14991h1545o8608A77590g5319B93873a96089l03e1624B57349K49647A68399
12880a07973e3252A23301a75214k4931i0638o240a0314A7426a47257C8143J95152
12869B33295h5276H8651c5830o7727k5089o6719B46815n2168e3294I7979d6887
12857I4291b63818C8030A8318b05838L4143e1882A78837N1846A10467a8008G2990
$$ plain form
12845 93852 -377475 166827 8656 -280787 -33434 -28837 100889 -259042 104201 173420 -217985
12833 218535 -1924 -54278 279313 21726 -155684 123079 -214580 90064 -37353 76874 -172452
12821 67374 -130354 -92073 97421 290470 209877 58880 274814 148751 -53328 90378 164701
12810 164701 -243070 136626 -130421 -65052 -41490 -248291 26589 -56925 104798 105727 -23380
12798 51458 1384 -141217 -71048 -83538 -22131 131694 43076 -7433 -272283 226718 110499
12786 73076 322721 -235118 -119300 -179527 -436308 -14421 370651 7940 120925 -51482 -243376
12775 -243376 53875 224775 -129663 113293 -280516 -419885 197300 6954 252765 -22720
12764 13841 69790 81922 188957 23299 -347971 -66742 132506 -247052 532680 -135693
$$ packed form
12845I3852c77475A66827H656b80787c3434M597A00889b59042A04201O9219b17985
12833B18535a924n2354B79313B1726a55684A23079b14580I0064c7353G6874a72452
12821F7374a30354L8281I7421J93049q0593E8880K15934j26063e3328I0378P4323
12810A64701b43070A36626a30421f5052K3562k06801B6589e6925A04798R29b3380
12798E1458A384a41217P0169j2490b2131A31694D3076g433k64850B26718A10499
12786G3076K49645b35118J15818o0227k56781a4421C70651G940J12985e1482j91894
12775b43376E3875J70900a29663A13293b80516j39369A97300F954K45811b2720
12764A3841N5949J2132J07035B3299c47971f6742A32506b47052E32680a35693
$$ plain form
12753 89924 -285505 -107861 165058 440996 -108469 -46221 159337 -238648 173475 -14138
12742 317490 -19587 -30538 300479 -47011 72284 151582 147534 14430 -125961 16164 161198
12731 161198 110815 217814 -244006 -162488 37537 21987 144216 -10637 -23629 150044 -94205
12719 -137557 -266632 144128 -223504 -207163 141382 101137 46172 -32763 204478 259865
12709 259865 -56829 240329 109275 289866 230969 151629 98210 -16588 129817 34480 -43303
12697 562485 155224 -121457 -180896 -442110 128438 -16320 201509 -83884 294574 66634
12686 62438 169405 149119 -101857 337256 86252 231008 -3294 -82546 298676 195251 -39670
12674 154683 201709 306630 308651 20019 305342 -164107 -120538 -11791 135394 53313 235358
$$ packed form
12753H9924b85505a07861A65058K75938a08469d6221A59337b38648A73475a4138
12742C17490a9587j0951C00479d7011G2284P9298m048A4430a25961A6164J45034
12731A61198n0383J06999b44006Q1518C7537j5550J22229a0637j2992A50044i4205
12719a37557j29075A44128b23504J6341A41382m0245D6172c2763B04478N5387
12709B59865e6829B40329A09275J80591n8897p9340n3419a6588A29817C4480d3303
12697E62485A55224a21457n9439k61214A28438a6320B01509h3884B94574F6634
12686F2438J06967k0286a01857C37256H6252J44756c294p9252B98676j03425c9670
12674A54683M7026J04921K021B0019K85323a64107M3569a1791A35394E3313J82045
$$ plain form
12663 235358 257499 395517 198993 331082 -6727 -834 275148 112189 561977 410029 136268
12651 -130393 38885 -95166 -19317 201311 -100797 -99698 -147376 -88250 15766 74833 33991
12639 20954 484533 -191055 144470 17293 354561 49889 160987 212442 33152 136989
12629 136989 -126561 230825 67930 -173027 104371 68189 119470 83346 8746 378008 221816
12618 221816 303753 25193 -194157 -64423 96487 100976 272533 -42254 356806 114427 68276
12607 68276 174 -264543 284682 -101699 -199037 288281 -32198 -77657 74931 -74921 238941
12595 184314 413028 121350 130716 -95269 383714 66214 32451 315335 322117 134040 62795
12583 -116351 -79317 900 -63371 -51252 28186 -17780 50322 -68920 -179612 187531 146700
$$ packed form
12663B35358K2141J38018j96524J32089f727h34B75148A12189M49788j51948A36268
12651a30393C8885i5166a9317B01311a00797J099m7678N9126A5766N9067C3991
12639B0954M63579a91055A44470A7293L37268D9889J11098N1455C3152J03837
12629A36989a26561B30825F7930a73027A04371l6182N1281l6124H746L69262j56192
12618B21816Q1937B5193a94157f4423I6487M489J71557d2254C56806A14427m6151
12607F8276A74b64543B84682a01699r7338B88281c2198m5459G4931g4921B38941
12595A84314K28714A21350R366i5269C83714F6214C2451K82884O782A34040F2795
12583a16351L7034I00f3371J2119B8186a7780E0322f8920j10692A87531m0831
$$ plain form
12572 146700 49537 -168535 145841 7321 -142195 -240259 100370 194470 -144854 80467 -366041
12560 244883 26306 105576 435369 9887 119132 154354 197912 196731 -172322 -62811 43729
12548 201880 51014 -24859 -119274 126796 -205078 -17276 19068 -159813 64232 -39446 280980
12536 -120901 -119021 98157 125591 -80459 235244 59026 91591 -90466 -70350 -20813 229771
12524 -87774 -46576 45760 64054 228250 138777 144684 -7882 -98158 17750 -200723 -244728 26332
12511 -10842 -21405 -80572 84774 67066 -97570 52552 66562 88222 -46087 195614 -59860
12499 348620 -35616 264619 224332 153302 -114910 33600 150856 -277010 153215 -93734
12488 -29706 146378 -155802 -33472 -139222 -320574 306463 90420 257877 -33059 51470
$$ packed form
12572A46700D9537a68535A45841G321a42195r8064A00370R4100a44854H0467c66041
12560B44883B6306P9270L29793I887J09245L5222M3558j181a72322f2811D3729
12548B01880E1014b4859r4415A26796b05078a7276A9068a59813F4232c9446B80980
12536a20901J880I8157K7434h0459B35244E9026L2565i0466K0116b0813B29771
12524h7774M1198D5760J8294J64196q9473N907g882r0276A7750b00723m4005B6332
12511a0842j0563n9167H4774j7708i7570E2552J4010K1660d6087A95614e9860
12499C48620c5616B64619m0287p1030a14910C3600J17256b77010A53215i3734
12488b9706A46378a55802c3472j05750j81352C06463I0420J67457c3059E1470
$$ plain form
12477 -103255 392863 107195 153778 60115 170937 -54851 354578 -239400 -5117 -100835 -134766
12466 -134766 -12169 73580 -148879 -129148 -127024 -193526 151730 137824 120355 -67289 -156880
12455 -156880 43393 -58328 -228451 63709 235243 -33596 -141180 -486477 -170589 86707
12444 -74076 96203 -63772 -16884 86161 -13129 20408 -69919 106057 175264 352272 209289
12433 209289 190091 -323533 -205144 69874 -131359 137434 -76280 120753 -255531 -188679
12423 -188679 51705 -68771 -116355 -66684 245044 -17840 -29817 -228410 10636 -176649 -9751
12411 -134727 199984 -290281 130704 82269 -276097 284619 -211092 66081 10898 -72215
12400 10452 244986 -118227 123176 65751 -153056 -97601 -213989 -78167 -249572 -86589
$$ packed form
12477a03255C92863A07195M6583F0115J10822e4851C54578b39400e117r5718l3931
12466a34766a2169G3580a48879J9731K124o6502A51730j3906j7469f7289q9591
12455a56880D3393e8328j70123F3709J71534c3596j07584l45297a70589H6707
12444g4076I6203f3772a6884H6161a3129B0408f9919A06057O9207J77008j42983
12433B09289j9198c23533J18389F9874a31359A37434g6280A20753b55531O6852
12423a88679E1705f8771m7584M9671B45044a7840j1977j98593A0636a76649i751
12411a34727A99984b90281A30704m8435b76097B84619b11092F6081A0898g2215
12400A0452K34534a18227A23176n7425a53056N5455j16388g8167j71405h6589
$$ plain form
12389 -111417 103018 -124255 97804 -52629 -111932 -193621 182632 55669 58485 305817 241884
12378 241884 37942 59607 -215862 75863 -331501 243778 -240221 91263 44380 -40511 195378
12366 -68166 26391 -154785 -136026 145895 -74289 9404 -179980 76300 -114437 -216246 184937
12354 -111345 60281 -132184 79285 -45830 38201 107329 192463 -138077 213398 -130885 180201
12342 139909 -10307 243258 32771 14183 117320 101051 239263 -140881 164396 104185
12332 104185 -273529 -111143 -168265 123433 -168371 -330556 -61190 21271 300541 -37628
12321 76421 253199 29752 -170716 -244571 -159266 78511 257373 -202872 -213530 -3735 93090
12309 -77666 78327 -241188 -383897 73523 -139766 53514 -42704 18196 -179617 2616 13317
$$ packed form
12389a11417A03018a24255I7804e2629n9303q1689A82632E5669K816K47332o3933
12378B41884C7942K1665b15862G5863c31501B43778b40221I1263D4380d0511A95378
12366f8166B6391a54785J8759A45895g4289I404a79980G6300a14437j01809A84937
12354a11345F0281a32184G9285d5830C8201O9128Q5134a38077B13398a30885A80201
12342A39909a0307B43258C2771A4183J03137j6269J38212a40881A64396o0211
12332A04185b73529a11143n7122A23433a68371j62185f1190B1271K79270c7628
12321G6421J76778B9752a70716p3855Q5305G8511J78862b02872j0658c735I3090
12309g7666G8327b41188j42709G3523a39766E3514d2704A8196a79617B616J0701
$$ plain form
12298 13317 -7376 -23930 -121907 175816 166185 163746 63604 -150465 1924 52049 -212649 236112
12285 -306652 -95824 -84126 -29579 29730 49740 320049 405020 49425 69080 38035 486625
12274 486625 324468 86375 399560 82602 110060 37788 -22618 -219651 141116 2804 196716
12263 196716 -133089 -36683 193531 480313 34199 160284 190682 255619 -47609 -214792
12253 -214792 96035 132553 65724 88879 48697 -82516 196973 310190 208970 657540 245805
12241 299448 15986 138884 26524 -250770 -76656 112413 -209524 393832 69711 -45617
12230 313246 75221 151508 156841 174306 206358 454974 254011 -7887 182284 185642 145139
12219 145139 127486 449866 178339 203508 -43925 211786 64904 218508 134325 326215
$$ packed form
12298A3317g376j6554r7977A75816r631k439F3604a50465A924N0125b12649B36112
12285c06652i5824J1698b9579B9730K0010K70309Q4971D9425J9655l1045M48590
12274D86625j62157H6375L13185H2602K7458C7788b2618j97033A41116B804J93912
12263A96716a33089c6683A93531K86782C4199J26085L0398O4937d7609j67183
12253b14792I6035L6518F5724K3155m0182h2516A96973J13217j01220M48570B45805
12241B99448A5986J22898B6524b50770g6656A12413b09524C93832F9711d5617
12230C13246G5221P6287N333J7465L2052K48616k00963g887A82284L358m0503
12219A45139j7653L22380A78339K5169d3925B11786F4904J53604q4183J91890
$$ plain form
12209 326215 -102867 154136 467854 150678 13706 138831 45811 -99878 15214 247580
12199 247580 268494 279099 234562 -315836 147747 -12706 164116 115396 172018 182709 15248
12187 51287 66981 402641 209679 43049 -57958 327752 -341242 246572 152778 -101622
12176 24029 252284 -25655 149965 165310 161167 150621 165726 -17702 -271825 -111911 -97832
12165 -97832 365585 -215737 -99224 40848 148737 154025 94215 127225 785 152710 -3371 24265
12152 43253 70164 469840 -245686 -19825 -103867 556734 56393 255157 8059 914 -48952
12140 377361 -128935 -83803 -77257 -184719 277814 29039 220110 289066 -69795 236279 -165152
12128 -65664 -243099 45352 161283 88845 -185175 -20395 153219 -2155 270845 73637 -299273
$$ packed form
12209C26215a02867A54136L13718A50678A3706J25125D5811i9878A5214K32366
12199B47580K0914J0605m4537c15836A47747a2706A64116m8720N6622J0691A5248
12187E1287J5694L35660j92962D3049e7958C27752c41242B46572r3794a01622
12176B4029K28255b5655A49965J5345m143j0546J5105a7702k54123a11911J4079
12165i7832C65585b15737i9224D0848J07889N288n9810L3010G85J51925c371B4265
12152D3253K6911L99676b45686a9825q4042E56734E6393J98764H059I14d8952
12140C77361a28935M5132O546j07462B77814B9039J91071O8956f9795B36279a65152
12128f5664j77435D5352J15931p2438a85175b0395A53219b155B70845G3637b99273
$$ plain form
12116 -350077 556 361245 -132865 65472 195548 -6910 66107 -110853 -129666 92218 -59057
12104 -194265 506144 -25814 161879 -35186 29726 -14248 81870 -36814 76490 199398 -96812
12092 86887 166927 -180836 234179 -130079 110794 159617 71323 112580 -415102 93688 294589
12081 294589 111984 50741 2300 115664 -118169 -43462 17856 26406 277977 276097 574490
12070 574490 693695 1355894 721001 311297 -54854 247009 149247 -105116 218095 19624
12059 184289 -117468 -44053 33099 129703 -102602 -102342 23871 55959 -230693 -137675 -63069
12047 28451 -16051 -41839 -101631 4028 -137235 -85540 145977 -367727 118346 254116 -34673
12035 290531 -107483 -191143 -175356 -203820 -150850 103848 -202081 -144801 91833 35067 -117661
$$ packed form
12116c50077E56L60689a32865F5472J30076f910F6107a10853j8813I2218e9057
12104a94265E06144b5814A61879c5186B9726a4248H1870c6814G6490J22908i6812
12092H6887Q0040a80836B34179a30079A10794M8823G1323M1257d15102I3688K00901
12081B94589A11984E0741B300J13364a18169d3462A7856Q550K51571j880K98393
12070E74490J19205O62199o34893C11297e4854B47009r7762a05116B18095A9624
12059A84289a17468d4053C3099R6604a02602K60B3871L2088b30693R3018f3069
12047B8451a6051k5788n9792D028a37235N1695A45977c67727A18346J35770c4673
12035B90531a07483q3660J5787k8464N2970A03848b02081N7280I1833C5067a17661
$$ plain form
12023 -24961 140470 -113950 -220580 190299 104612 -9826 69038 164846 -122504 -251951 -64947
12011 -186517 -26784 -147932 20972 -89073 74369 -196556 -127345 -152368 -137836 -93041 -124461
12000 -124461 24145 135422 2941 -23081 -414695 -188504 152747 -53239 90883 58817 17490
11988 -163980 -131880 -311108 -211891 1668 -285658 -131310 -71829 -86218 -189993 -172818 -27741
11976 -71017 -227045 -7995 110264 54334 191838 37777 -99654 -129220 355105 -7336 -195070
11965 -195070 232704 -296541 32647 -278736 -97760 99846 246233 288514 -30612 -240597
11955 -240597 -145662 400946 -294150 -23218 237033 72145 3022 209559 -365681 102730
11944 157031 90455 178701 -256975 -96675 301654 58962 337162 -360179 191469 -79756
$$ packed form
12023b4961A40470a13950j06630A90299q5687i826F9038R5808a22504j29447f4947
12011a86517b6784j21148B0972h9073G4369a96556O9211k5023J4532M4795l1420
12000a24461B4145J11277B941b3081l91614a88504A52747e3239I0883l2066A7490
11988a63980L2100j79228R9217A668b85658a31310N9481j4389j03775J7175b7741
11976g1017j56028g995A10264E4334J37504C7777i9654k9566C55105g336j87734
11965a95070B32704b96541C2647b78736i7760I9846J46387M2281c0612k09985
11955b40597R4935D00946b94150b3218B37033G2145C022K06537c65681A02730
11944A57031o6576Q8246b56975i6675C01654E8962K78200c60179A91469g9756
$$ plain form
11933 -230875 -161804 235241 -96139 46824 -189451 92387 -239026 175809 86937 -73320 -33266
11921 179081 68922 -117465 -323390 -284311 -42978 154961 -148464 3425 39877 -32091 -146450
11910 -146450 32257 179603 -92432 -75956 -80516 -241724 143225 -204355 -112353 10111 163583
11899 163583 194360 -195482 397169 -122282 161128 -28940 134842 263134 181690 10157
11888 -154060 -82932 291788 142340 -283808 -375543 -14043 78216 -17619 -273348 24914 84699
11877 84699 12599 -31739 -16397 78888 326130 96812 -37993 106663 7444 -202144 217896
11865 -156583 -27588 -47555 51401 59229 87107 162615 -159214 -165184 21210 -112962 -82727
11854 -82727 108321 -9612 -109109 -128641 -6222 304008 59578 -214129 158526 -373305 -184966
$$ packed form
11933b30875O9071B35241i6139D6824a89451I2387b39026A75809H6937g3320c3266
11921A79081F8922a17465k05925L9079d2978A54961a48464C425L6452c2091j14359
11910a46450C2257J47346i2432J6476m560j61208A43225b04355R2002A0111J53472
11899A63583L0777a95482C97169a22282A61128b8940A34842J28292q1444A0157
11888a54060P1128B91788A42340b83808r1735a4043G8216a7619k55729B4914N9785
11877H4699A2599c1739J5342G8888K47242I6812c7993A06663G444b02144B17896
11865a56583b7588j9967E1401P828K7878P5508a59214n970B1210a12962L0235
11854h2727A08321i612r9497j9532f222C04008E9578b14129A58526c73305a84966
$$ plain form
11842 93372 -217905 -38767 -118994 93447 287114 -42078 113931 219108 154835 50677 -145342
11830 -145565 -103698 -208883 -209333 -97477 -278593 -74307 -35081 57948 87102 -108545 17717
11818 -129878 -5077 -233102 -26561 -285951 248830 -5883 -36915 -12069 -152239 87102 -113731
11806 111851 -161909 178780 227078 55350 -107406 -210652 385731 42028 146303 -82660
11795 -13461 -202521 93281 -69728 303063 201295 117034 268732 170803 46028 -36501 -177038
11784 -177038 250942 91475 202592 -235213 220718 -242159 43718 26449 169114 -186628
11773 291592 -191729 -84958 69726 -251022 -56169 -245227 -318960 108291 17815 -106174
11762 59393 -95463 140996 -183898 -11648 123971 32501 24078 -68308 -4445 194535 164332
$$ packed form
11842I3372b17905c8767q0227I3447J93667d2078A13931J05177o4273E0677a45342
11830a45565M1867j05185m50i7477j81116g4307c5081E7948K9154a08545A7717
11818a29878e077k28025b6561k59390B48830e883l1032a2069j40170H7102a13731
11806A11851a61909A78780M8298E5350a07406j03246C85731D2028J04275h2660
11795a3461j89060I3281f9728C03063j01768q4261J51698r7929D6028c6501j40537
11784a77038B50942I1475J11117b35213B20718b42159D3718j7269J42665a86628
11773B91592a91729h4958F9726b51022e6169j89058p3733A08291A7815a06174
11762E9393i5463A40996a83898a1648A23971C2501q423f8308d445A94535l0203
$$ plain form
11751 164332 157270 -230236 39691 -163223 -63253 -363285 446048 10732 576817 -81616 148709
11739 95740 -211891 -319951 -62697 -28878 157476 -93340 26380 -189517 47141 220674 388251
11728 388251 133401 -55492 210748 -34189 174006 20884 -159957 -46318 131457 -33413
11717 -152070 100355 -114605 247717 -100930 86284 78751 -292979 242319 -194762 -110036
11707 -110036 158223 137133 15845 600524 123105 102082 21840 -95927 319290 140893
11696 -71733 -137344 -148773 118046 169175 -106056 20243 -287054 -185805 -112288 230798 26822
11684 -164821 33551 -49253 73104 291051 361935 167836 13542 39470 121438 -211439 6293
11672 182306 211675 167018 -314569 -61003 77068 -50161 126799 -1153 10715 -23943 -140497
$$ packed form
11751A64332p062b30236C9691a63223f3253l00032D46048A0732N66085h1616A48709
11739I5740b11891j08060f2697b8878A57476i3340B6380a89517D7141J73533J67577
11728C88251A33401e5492B10748c4189A74006B0884a59957d6318A31457c3413
11717a52070A00355a14605B47717a00930H6284p533b92979B42319a94762Q4726
11707a10036A58223k1090A5845N84679A23105k1023B1840i5927C19290A40893
11696g1733o5611j1429A18046N1129a06056B0243b87054J01249P3517B30798B6822
11684a64821C3551d9253G3104K17947P0884A67836A3542K5928Q1968b11439F293
11672A82306K9369m4657c14569f1003G7068e0161A26799a153A0715b3943j16554
$$ plain form
11661 -140497 21368 -119510 89861 85033 332860 216566 157567 288909 -130037 -24098 -246826
11650 -246826 158677 219215 -40504 -145636 15536 326665 58893 -9184 45531 218020 -168082
11638 -60457 46245 -120533 623925 -37682 257049 9333 -23395 -49416 312014 -84436 145672
11626 -262934 -5103 -55245 -378720 72105 -65693 -50773 58587 258237 -270303 141173 228727
11615 228727 51349 -111415 -23703 172733 110852 73391 42293 91143 50533 89262 -91845
11603 -83944 -25260 364977 149348 -234758 247382 -143115 -458069 -44220 241132 -187016
11592 -10269 -242375 269512 -282091 115671 330873 -78982 -19026 376722 -336638 139989
11581 531388 273397 -133266 246055 -128221 37733 69666 -31952 411766 262870 231569
$$ packed form
11661a40497B1368a19510H9861m828K47827j16294n8999J31342a30037b4098k22728
11650b46826A58677O0538d0504j05132A5536L11129E8893i184D5531J72489a68082
11638f0457D6245a20533F23925c7682B57049I333b3395k6021C12014h4436A45672
11626b62934e103n0142l23475G2105f5693J4920E8587J99650b70303A41173Q7554
11615B28727E1349a11415b3703A72733o1881l7461l1098M8850m0610L8729i1845
11603h3944b5260C64977A49348b34758B47382a43115l14954d4220B41132a87016
11592a0269k32106B69512b82091A15671K15202g8982a9026C76722c36638A39989
11581E31388k57991a33266B46055a28221C7733L1933c1952D11766j48896l1301
$$ plain form
11571 231569 -167777 163051 90547 297883 155436 139682 -47058 463453 -35310 -11333
11560 -157769 11808 -129040 379175 -63545 112912 -121240 188995 -180160 185173 -79509
11549 164189 225527 122203 196810 -71682 159270 53704 -216552 202032 -87517 569147
11538 -6095 331869 222131 195116 11116 -143787 68280 -339852 361600 159766 7211 -95495
11526 87871 -66759 170729 61197 541241 42987 -81152 195359 278595 20865 -10380 228901
11514 -1801 -246366 74214 -22786 -124494 417046 279962 483813 232626 483064 431158
11504 431158 -99439 58290 176469 98530 132087 131126 70222 24371 -51490 101039 330824
11493 330824 51718 -68699 -58774 -24948 -149834 407997 189405 369424 144552 240513 59835
$$ packed form
11571B31569a67777A63051p2504K07336j42447j5754d7058D63453c5310a1333
11560a57769A1808a29040C79175f3545A12912a21240A88995a80160A85173g9509
11549A64189O1338j03324P4607g1682A59270E3704b16552B02032h7517E69147
11538f095C31869j09738k7015A1116a43787F8280c39852C61600A59766G211i5495
11526H7871f6759A70729F1197M80044D2987h1152A95359Q3236B0865a0380B28901
11514a801k44565G4214b2786j01708D17046j37084K03851B32626K50438n1906
11504D31158i9439E8290J18179p7939L3557r61o0904B4371e1490A01039K29785
11493C30824E1718f8699R925b4948j24886D07997A89405J80019A44552R5961E9835
$$ plain form
11481 -14188 260427 92918 478880 544939 55193 207340 -1914 292431 157539 211784 149973
11470 149973 261817 -165320 8744 382040 -97972 -161875 -67663 387394 71621 37027 159555
11459 159555 300598 129873 -290386 -19230 227900 205396 -67018 165834 178284 187262 229053
11448 229053 -131367 -106610 137129 344423 417065 -64445 214607 -111584 84035 229480
11438 229480 13715 22136 -69427 -47397 53394 290033 19677 -40473 -77460 32253 -128875
11426 53051 -38186 -119188 -75766 246474 224096 197753 293197 263463 -51520 -204664 200097
11414 154930 286 -274849 320183 66309 -10593 257887 30283 -229400 -4886 -452619 -276983
11403 -276983 138157 295368 157133 112765 234332 216772 210792 150367 -19252 -428 -235378
$$ packed form
11481a4188B60427I2918L85962O6059E5193J52147a914B92431j34892N4245o1811
11470A49973J11844a65320H744L73296i7972o3903f7663C87394G1621l4594J22528
11459A59555J41043A29873b90386a9230B27900k2504f7018A65834J2450Q978M1791
11448B29053a31367K4757A37129K07294P2642f4445B14607a11584H4035J45445
11438B29480A3715Q421f9427K2030E3394K36639A9677d0473l6987C2253a28875
11426E3051c8186q1002M3422B46474k2378k6343R5444k9734e1520j53144B00097
11414A54930B86b74849C20183F6309a0593B57887C0283b29400d886m47733J75636
11403b76983A38157J57211j38235m4368J21567j7560n980o0425a9252d28k34950
$$ plain form
11392 -235378 -103545 -155405 22273 181757 32905 33580 167257 -177815 -224384 65308 66554
11381 66554 -90462 114054 60316 104532 106895 220860 349312 258330 17162 188465 164757
11370 164757 343677 -276294 -92204 -24909 55400 26026 -16373 134357 190211 210921 159014
11359 159014 -55248 -49359 -150856 27219 -216710 -89174 -32264 275752 264682 -31793 -209105
11348 -209105 21547 154383 204237 290388 126533 -30357 126150 -11657 -38797 194778 110556
11337 110556 -40038 -230530 190353 -74963 115577 84131 -38513 77836 -147875 114648
11326 -183058 -245152 -133824 105984 -24554 91822 -102712 281999 -5741 96377 -44236 32402
11314 47303 -55579 -161809 -292143 -33971 7243 108057 144594 -50015 4469 292111 -201715
$$ packed form
11392b35378a03545n1860B2273J59484C2905O75J33677a77815m6569F5308J246
11381F6554i0462A14054n3738M4216K363J13965J28452r0982A7162J71303k3708
11370A64757J78920b76294i2204b4909E5400B6026a6373A34357N5854K0710n1907
11359A59014e5248N889j01497B7219b16710h9174c2264B75752j1070c1793j77312
11348b09105B1547J32836M9854Q6151A26533c0357A26150a1657k7140A94778q4222
11337A10556d0038j90492A90353g4963A15577l1446c8513G7836a47875A14648
11326a83058o2094J11328A05984b4554I1822a02712B81999e741I6377d4236C2402
11314D7303e5579j06230j30334c3971G243J00814L6537e0015D469K87642b01715
$$ plain form
11302 79690 -63706 -120177 -26873 77829 -106322 174402 -112795 -436803 -197967 -41018 265021
11290 259032 -93243 119802 92489 -78813 80451 -43697 -147320 334719 148848 -336293
11279 -8402 -68023 270959 -48713 -221550 146432 -407685 -81455 -163935 -102666 102270 -147079
11267 -51757 -230962 144147 -107369 -331146 -195297 -128054 1455 15742 -285931 -88502 7830
11255 84960 44087 324929 182160 94013 -42637 -37611 -389739 -24467 -196852 242772 269990
11244 269990 -384961 184897 24444 46891 -66679 39555 -137057 -482532 -10137 -6451 134522
11232 -357362 42834 -63030 158423 -144425 -92884 -264558 52442 -61032 -183746 -170961 -83547
11220 -199738 218964 83649 -137884 -18469 -140876 -280696 41749 156951 -291419 -87666
$$ packed form
11302G9690f3706n6471b6873G7829a06322A74402a12795l24008a97967d1018B65021
11290B59032i3243A19802k7313g8813H0451d3697j03623C34719A48848c36293
11279h402n9621B70959d8713j72837A46432d07685h1455q2480O1269A02270a47079
11267e1757j79205A44147a07369k23777J35849O7243A455J4287b85931h8502G830
11255H4960m0873K80842j42769q8147d2637N026l52128b4467j72385B42772K7218
11244B69990c84961A84897B4444K2447f6679C9555a37057l45475a0137L686A34522
11232c57362D2834f3030A58423a44425N1541j71674E2442f1032j22714J2785h3547
11220a99738B18964H3649a37884a8469j22407j39820D1749J15202b91419h7666
$$ plain form
11209 -356931 197884 -5335 124206 -180601 -52436 12745 -319844 -264711 263227 -8136 26105
11197 -121024 39641 7732 -460131 -206499 -205241 -177882 -13877 -18812 22863 -164092 -114832
11186 -114832 176374 166548 272541 -37490 217773 151086 -467546 -26836 52233 48449 -86690
11174 17462 -71238 9905 158428 -39293 148524 -133859 308336 -130487 -618135 -32370 126143
11162 -53901 -77840 -106412 297905 -184661 -21919 -103583 -225511 152593 -301272 29568 -146552
11150 -339074 38573 -241505 100495 -183045 -388698 -372898 159887 121470 140636 17870
11139 -510878 232884 -38882 -254037 -211694 157282 -133711 203493 -35184 215421 -77849
11128 79775 189849 164804 -9067 23515 110299 -165154 -182366 -52503 5783 42864 103135 -234284
$$ packed form
11209c56931A97884e335A24206a80601e2436A2745c19844N5133B63227h136B6105
11197a21024C9641G732d60131b06499J258K7359a3877m935B2863a64092M9260
11186a14832A76374r826J05993c7490B17773o6687d67546b6836E2233l784h6690
11174A7462g1238I905J48523c9293A48524a33859C08336a30487m87648c2370A26143
11162e3901k3939k8572B97905a84661b1919q1664j21928A52593c01272B9568a46552
11150c39074C8573b41505A00495a83045k05653J5800A59887l8417J9166A7870
11139e10878B32884c8882k15155M2343A57282a33711B03493c5184B15421g7849
11128G9775J10074k5045i067B3515Q6784a65154j7212e2503E783L7081O0271b34284
$$ plain form
11115 -79341 55459 -87204 29842 166353 -155713 341540 141183 484206 177082 349011
11105 349011 416301 305140 279003 -72039 112783 229764 60511 404934 258472 196948
11095 196948 167894 -3414 402053 -54616 226320 212823 103614 258938 177833 341519 228516
11084 228516 104068 94200 136965 -80326 513156 285867 256123 468604 436402 172110 52376
11072 341579 206369 166847 46278 517394 397569 161870 445012 454911 417199 533712
11062 533712 480090 613054 294810 317044 778447 831781 732780 725913 650679 592703 621590
11051 621590 872029 740852 623449 586578 628804 1178910 1027846 546233 496526 848655
11041 848655 911984 934869 819210 801318 553686 844778 521409 728038 672858 438801
$$ packed form
11115g9341E5459h7204B9842J36511a55713C41540A41183L43023A77082J71929
11105C49011O7290j11161k6137g2039A12783J16981F0511L44423j46462o1524
11095A96948k9054c414D02053e4616B26320j3497A03614J55324q1105J63686j13003
11084B28516A04068r868M2765h0326E13156k27289k9744K12481l2202A72110E2376
11072C41579j35210l9522D6278M71116j19825A61870K83142R899l7712J16513
11062E33712n3622J32964B94810K2234M61403N3334r9001o867p5234n7976K8887
11051F21590K50439j31177j17403l6871M2226N50106j51064m81613m9707L52129
11041H48655O3329K2885j15659j7892k47632K91092l23369K06629n5180k34057
$$ plain form
11031 438801 799676 450955 723645 698871 803145 896989 734601 840258 742530 648026
11021 648026 537545 531850 831308 794591 582648 707431 961680 701897 628085 710826
11011 710826 543860 650435 353775 443259 596717 707041 551639 769998 750699 772054
11001 772054 737691 851371 636423 806252 815052 471812 934645 895587 977486 998442 824128
10990 824128 989220 1001447 1113347 823603 961193 858863 1007041 1129377 1026799 1315317
10980 1315317 1657410 1099869 1722210 2160177 2062408 2658860 2950198 2758868 2724745 2866933
10970 2866933 3313888 2978194 2396394 2357945 2219751 2047576 2088994 1743823 1922458 1934242
10960 1934242 1901540 1876545 2073687 1955148 1692924 1652144 1691007 1562066 1197173 912378
$$ packed form
11031D38801L60875l48721K72690k4774J04274R3844j62388J05657r7728r4504
11021F48026j10481n695K99458l6717k11943J24783K54249k59783p3812Q2741
11011G10826j66966J06575k96660Q9484J53458J10324j55402K18359j9299K1355
11001G72054l4363J13680k14948J69829Q800l43240M62833l9058Q1899K0956j74314
10990H24128J65092J2227J11900k89744J37590j02330J48178J22336j02578K88518
10980A315317L42093n57541O22341M37967r7769N96452K91338j91330l4123J42188
10970B866933M46955l35694n81800l8449j38194j72175M1418l45171J78635J1784
10960A934242l2702k4995J97142j18539k62224m0780L8863j28941l64893k84795
$$ plain form
10950 912378 1202133 527396 454242 503115 138728 222810 131991 135069 347414 498213 324057
10939 324057 152387 404794 177128 128564 152685 214979 322401 103699 -69569 9432 94209
10928 94209 164297 144677 -16736 268138 304011 357810 -66056 141437 -72508 181963 -189424
10916 -27961 -147557 135740 -359971 65132 129541 240789 284659 33338 235453 267381 -170104
10904 35279 -67152 -145293 175442 -44901 -197405 -128847 -202817 -40254 360770 -210108 34621
10892 -65802 -141607 -97435 62741 -165891 -35207 165864 -153672 -22112 21676 17601 78013
10881 78013 176674 187145 225000 111497 -336672 -312309 417878 98788 -377439 -46651 -92829
10870 -92829 -256191 129644 -151929 169740 -68855 -25707 -281537 -98567 -51560 -46973 -18314
$$ packed form
10950I12378K89755E27396p3154M8873A38728Q4082r0819L078K12345J50799j74156
10939C24057A52387K52407A77128m8564K4121O2294J07422A03699f9569I432Q4777
10928I4209P0088j9620a6736B68138L5873N3799f6056A41437g2508A81963a89424
10916b7961j19596A35740c59971F5132O4409J11248M3870C3338K02115L1928a70104
10904C5279f7152p8141A75442d4901j52504O8558p3970d0254C60770b10108C4621
10892f5802p5805M4172F2741a65891c5207A65864a53672b2112B1676m075O0412
10881G8013R8661J0471L7855A11497c36672K4363D17878I8788c77439d6651m6178
10870i2829j63362A29644a51929A69740f8855b5707k55830i8567M7007M587a8314
$$ plain form
10858 174798 -11531 -137790 11740 275341 45046 141771 217350 -236924 84034 -204025 194352
10846 146158 125533 -102846 -324720 -347755 -191700 39045 63207 -19127 214911 31494 -358427
10834 -187381 10570 -16240 -91605 -23159 199680 195283 -192617 -53515 26908 -202697 -194986
10823 -194986 -143105 37530 -175737 115879 267730 -55909 -80409 -118264 2700 77557 -26473
10811 309948 -278672 266384 -152040 149405 61161 -170088 -36666 35177 -20410 -48989
10801 -48989 -197436 129291 166060 -44168 -145884 137644 17368 -137045 93239 55370 118583
10790 118583 17423 99248 -234213 56387 181179 -110400 -87563 -157647 -154202 -21151 -35034
10779 -35034 -22724 182804 -300303 -34449 -102935 -172072 -115993 322687 27695 -35339 231489
$$ packed form
10858A74798a1531j26259A1740K63601D5046R6725P5579b36924H4034b04025A94352
10846A46158k0625a02846k21874k3035J56055C9045K4162a9127B14911C1494c58427
10834a87381A0570a6240p5365b3159A99680m397a92617e3515B6908b02697P711
10823a94986N1881C7530a75737A15879J51851e5909k4500l7855B700P4857b6473
10811C09948b78672B66384a52040A49405F1161a70088c6666C5177b0410k8579
10801d8989j48447A29291L6769d4168j01716A37644A7368a37045I3239l7869O3213
10790A18583A7423Q1825b34213E6387J24792a10400K2837p0084L445b1151j3883
10779c5034J2310A82804c00303c4449o8486o9137N6079C22687B7695c5339B31489
$$ plain form
10767 203868 -57274 -17139 269149 17044 -238257 -180349 218488 33712 443771 39933 -169157
10755 18087 -522304 116309 267828 -184124 157748 26073 -98595 -7372 -289971 33524 -130352
10743 -2620 55314 332594 45836 -176718 -67198 9258 -51354 -274307 134572 -266717 -9130
10731 76240 -34009 121444 -207758 -217544 91281 -118504 -105390 -184672 266512 -186171 -298425
10720 -298425 471353 122500 110256 -171170 300209 73921 165267 194106 -194840 122428
10709 -28203 -289550 147577 -170157 22730 -123787 63178 -165387 -216030 368912 -92760
10698 50591 -204229 316173 183977 33778 298349 10373 64581 -40488 -54494 -204678 -140932
10687 -140932 -5651 -172902 -307539 -133630 16799 -76579 19630 -112904 -33878 -230082 48736
$$ packed form
10767B03868e7274a7139B69149A7044b38257N7908B18488C3712M10059C9933a69157
10755A8087e22304A16309J51519a84124A57748B6073i8595g372k82599C3524a30352
10743b620E5314K77280D5836a76718f7198I258e1354k22953A34572b66717i130
10731G6240c4009A21444b07758r786I1281a18504J3114p9282B66512a86171j12254
10720b98425D71353A22500j2244a71170C00209G3921R1346K8839a94840A22428
10709b8203k61347A47577a70157B2730a23787F3178a65387n0643C68912i2760
10698E0591b04229C16173j32196C3778K64571A0373N4208d0488j4006j50184O3746
10687a40932e651j67251j34637a33630A6799g6579A9630a12904c3878j96204D8736
$$ plain form
10675 -202906 -133212 -91841 -62457 -58431 -141332 -100593 -271519 159878 -130142 51333 50581
10664 50581 -202840 148136 72008 143971 -114662 67198 -87862 -21053 282368 -316092 128999
10652 157799 -92501 -62176 -97495 13028 -78061 60802 62097 -315358 -62005 14517 233079
10641 233079 -60444 -374432 4132 61525 -168389 180420 -220247 -102887 142195 -35003
10630 54762 -181930 -51797 -138546 9799 -246759 72055 194029 338550 -7205 -154595 75033
10618 -181347 -267526 52113 -94801 -402989 -45310 40483 -266435 -290 33075 -4620 -415902
10607 -415902 28790 -145145 -98402 -180865 -403727 368975 23654 8340 218140 -203790 9809
10595 -107387 -265619 98431 -6318 271227 -120302 49293 100948 37175 -62203 189708 -21128
$$ packed form
10675b02906O9694M1371K9384M026q2901M0739j70926A59878a30142E1333p52
10664E0581b02840A48136G2008P1963a14662F7198h7862b1053B82368c16092A28999
10652A57799i2501L0325l5319A3028g8061F0802J295c15358f2005A4517K18562
10641B33079f0444l13988D132N7393a68389A80420b20247a02887A42195c5003
10630E4762a81930e1797q6749I799b46759G2055J21974J44521g205j47390G5033
10618a81347q6179E2113i4801l08188d5310D0483b66435b90C3075d620m11282
10607d15902B8790a45145M6743q2463k22862C68975B3654H340K09800b03790I809
10595a07387j58232I8431f318B71227a20302D9293N1655C7175f2203A89708b1128
$$ plain form
10583 -265306 -102083 -41956 -336900 -117988 -25120 65178 -85818 13591 -264027 -339715 -72148
10571 -195836 -40989 -148826 156124 -311139 470188 -114153 107462 -331089 86664 -316032
10560 8842 928 -210098 -7695 -22303 138129 -305753 -176501 -165382 -793 16434 -193823 -60121
10547 -25740 -271405 189294 81331 -25728 -203913 161705 -75514 49379 86350 -25940 -95749
10536 -95749 234362 -241563 -203212 -47957 -283199 -212816 74658 79798 -104900 -104072 108379
10524 -176957 -131456 -589 -30816 -43341 31811 8754 -153424 120715 126108 -9679 -221394 40979
10511 -151775 167342 -286515 -235239 -20247 232704 -265079 194778 71265 374627 -3952
10500 -190557 -361293 26988 11912 -96708 -69230 35987 116488 -354251 16640 -83410 103827
$$ packed form
10583b65306a02083d1956k94944a17988b5120F5178h5818A3591b64027p5688g2148
10571a95836d0989j07837A56124c11139D70188a14153A07462c31089H6664c16032
10560H842I28b10098g695j4608A38129c05753J29252J1119g93A6434a93823f0121
10547b5740k45665A89294H1331b5728j78185A61705g5514D9379L6971b5940o9809
10536i5749B34362b41563L8351d7957k35242P0383G4658N140a04900Q28A08379
10524a76957M5501e89l0227j2525C1811H754a53424A20715N393i679k11715D0979
10511a51775A67342b86515N1276b0247B32704b65079A94778G1265L03362c952
10500a90557j70736B6988A1912i6708K7478C5987Q0501c54251A6640h3410A03827
$$ plain form
10488 -123352 44564 76479 147698 -231386 292214 -52375 93488 464210 257835 356656 526942
10477 526942 116281 -498332 3040 -44766 -87573 141995 -187727 -359274 182635 -22071
10466 -18181 226611 120107 -51178 145845 -268153 -425292 -245253 101129 -87044 -92467
10456 -92467 339083 -387125 -131280 161562 16135 306359 257809 -70925 153473 -76563
10445 296901 89818 -63696 -80152 264152 -292229 95468 -377561 -6285 87936 19688 -212850
10433 188076 -211197 118742 -44278 -57483 178756 -183309 -124729 104240 -166976 -104013
10423 -104013 241335 185902 85518 99630 62262 54646 -144083 143916 15472 -31252 -82736
10412 -82736 47851 -76407 -64719 -246205 -98984 111395 -133336 -270416 12646 -275081 311447
$$ packed form
10488a23352D4564L1915P1219b31386B92214e2375I3488L70722k06375R8821J70286
10477E26942A16281d98332C040d4766m2807A41995a87727j71547A82635b2071
10466a8181B26611j06504e1178A45845b68153j57139J80039A01129h7044n423
10456i2467C39083c87125a31280A61562A6135K90224m8550g0925A53473g6563
10445B96901H9818f3696j6456B64152b92229I5468c77561f285H7936A9688b12850
10433A88076b11197A18742d4278j3205A78756a83309N8580A04240a66976O2963
10423a04013B41335n5433H5518J4112l7368p616a44083A43916A5472c1252n1484
10412h2736D7851g6407J1688j81486i8984A11395a33336j37080A2646b75081C11447
$$ plain form
10400 -308838 148998 84411 -154038 -184753 -143550 -1026 288039 117716 427382 -93719 111807
10388 353379 -98540 5374 -24180 155405 236508 52245 91226 290382 98172 131940 227269
10377 227269 528302 70215 -88768 378552 326298 366253 445403 409247 359830 194742 473510
10366 473510 525510 479273 455475 503116 181029 552700 114302 529923 621759 326752
10356 326752 240682 36085 325467 316967 333691 529220 1079317 607653 359834 451037 139787
10344 319226 277974 312386 405972 223761 -168054 350071 60429 320741 -86353 100184
10333 -325516 45134 75889 422223 367955 40536 -112588 74802 9237 57679 -103731 130885
10321 101235 450523 194478 217213 174332 229571 -89512 -158957 63125 175121 226295 -251708
$$ packed form
10400c08838A48998o4587a54038l0715M1203a026B88039A17716L09666i3719A11807
10388C53379i8540E374b4180A55405Q1103E2245L8981J99156I8172L3768R5329
10377B27269L01033G0215h8768C78552n2254L9955P9150l6156m9417j65088K78768
10366D73510N2000m6237k3798M7641A81029L71671A14302M15621R1836k95007
10356C26752q6070C6085K89382q500J6724J95529N50097m71664k47819R1203A39787
10344C19226m1252L4412R3586j82211a68054C50071F0429K60312h6353A00184
10333c25516D5134L0755L46334n4268D0536a12588G4802I237M8442a03731A30885
10321A01235L49288A94478K2735m2881N5239h9512o9445F3125J11996N1174b51708
$$ plain form
10309 28133 57747 19194 -160669 101508 -175846 -452395 -145942 149118 -179019 57262
10298 100256 127018 22594 64889 97804 -118291 20856 131533 -304721 -310079 11326 447858
10287 447858 143860 246101 30601 58321 -158715 -89202 186012 20543 -121241 33764
10276 89649 -277956 -237981 89225 181540 -259702 250917 242857 167484 -140606 -30589 41381
10264 91204 -132511 60751 163473 295337 351348 557809 377879 217669 500199 161400
10253 438875 -229539 46066 18988 -45724 -75004 10707 -137927 82543 -80604 -100182 396712
10241 -25441 59458 -103487 119193 -294672 -348515 98800 -150883 -76496 -278444 -83160 -175405
10230 -175405 -145553 -2560 62014 100580 -30132 82391 -222716 144394 140678 319795 306170
$$ packed form
10309B8133K9614A9194a60669A01508a75846k76549a45942A49118a79019E7262
10298A00256K6762B2594M2295L2915a18291B0856J10677c04721n358A1326M36532
10287D47858A43860J02241C0601K7720a58715O9513A86012B0543a21241C3764
10276H9649b77956L9975H9225R2315b59702B50917q060p5373a40606c0589D1381
10264I1204a32511F0751J02722J31864N6011K06461j79930j60210K82530A61400
10253D38875b29539D6066A8988d5724k9280A0707a37927H2543h0604j9578C96712
10241b5441E9458a03487A19193b94672n3843I8800a50883P4387k01948h3160r2245
10230a75405K9852b560F2014L8566c0132H2391b22716A44394l716J79117j3625
$$ plain form
10219 306170 209065 -115018 54549 -188248 -25423 -142799 163084 -104340 133103 -103233
10208 29009 -6102 -62022 231994 203133 -91825 -192609 -63169 27019 58642 -65212 -218110
10197 -218110 8636 -31934 117153 21382 -233442 1219 -85191 51078 41951 -25956 258329
10185 -12515 53068 382841 117849 -24547 -189100 131228 -131148 80872 -129430 -52719
10174 -325258 -90039 -153089 -117639 -127574 -180959 38730 -252829 -316427 -79962 199104 -45353
10162 -66657 -231143 -65825 -536928 312332 -295802 -167850 -87207 -141354 263373 -250071
10151 -119686 63520 -78140 -379636 -285659 -13825 -284817 115337 141344 -36372 191960 -381861
10139 -53237 -137373 -359870 2944 283517 61929 -79423 149271 2080 380837 -228363 -58812
$$ packed form
10219C06170r7105a15018E4549a88248b5423j17376A63084a04340A33103a03233
10208B9009f102n5920B31994k8861i1825j00784f3169B7019L1623f5212j52898
10197b18110H636c1934A17153B1382b33442A219h5191E1078r127b5956B58329
10185a2515E3068L29773A17849b4547j64553A31228a31148H0872a29430e2719
10174c25258i0039o3050L5450r935n3385C8730b52829o3598g9962A99104d5353
10162f6657j64486f5825m71103C12332b95802J27952Q0643n4147B63373b50071
10151a19686F3520g8140l01496R3977a3825k70992A15337K6007c6372A91960c81861
10139e3237q4136k22497B944K80573F1929g9423A49271B080L78757b28363e8812
$$ plain form
10127 327047 -34004 -240488 100544 102294 365479 -281883 -58486 -406292 -131591 -275988
10117 -275988 -79957 234069 38373 -32634 100089 -28289 274989 43181 -151656 -90437 205875
10105 -229430 -37266 -241662 231625 177242 -118373 -27181 141306 185143 -109155 45537
10094 155075 -125507 -105497 100206 -88343 -220611 -184338 -114398 -205427 -218150 -23771 -158723
10083 -158723 -8248 -46252 -123423 -176000 440789 126636 -328157 -73441 -369283 104308 -216691
10071 -316834 -27188 -90646 -84643 59303 52600 73995 -61785 201555 -225740 15491 45081
10060 45081 121574 -312708 -86979 -97703 -103322 19215 -291240 -89983 -222039 -44218 -283303
10049 -283303 -173467 -71638 -115891 -65764 178938 -112378 -164119 -328974 117063 -64799
$$ packed form
10127C27047c4004k06484A00544J750K63185b81883e8486l47806a31591j44397
10117b75988g9957B34069C8373c2634A00089b8289B74989D3181a51656O1219B05875
10105b29430c7266k04396B31625n4383a18373b7181A41306M3837a09155D5537
10094A55075a25507K0010A00206h8343j32268L6273O9940r1029j2723b3771j34952
10083a58723h248l8004p7171n2577D40789A26636c28157g3441k95842A04308b16691
10071c16834b7188o3458O003E9303o703K1395f1785B01555b25740A5491K9590
10060D5081P6493c12708h6979j0724n619A9215b91240h9983j32056d4218k39085
10049b83303J09836g1638m4253N0127A78938a12378n1741j64855A17063f4799
$$ plain form
10038 -256443 166252 -329571 -181128 -141800 -307929 -11550 -535 46531 -147994 -30377 -358515
10027 -358515 347680 9360 -152518 -303494 -131309 16728 64035 105715 -96421 88881 -24167
10015 -307868 -248544 -82423 -53900 -135789 -437125 119983 -294726 -120684 -12986 -152182
10005 -152182 -66510 -134270 7461 56129 -162151 -143918 197081 10367 -73848 76624 132200
9994 132200 -91075 5336 177293 45668 100828 -130240 1600 27787 59089 214554 -104278
9982 -55316 -116081 40853 -342609 -15113 102542 86785 -268479 -144065 -93502 -177052 59650
9970 25607 -273025 -122277 41526 -262193 177406 -56709 -10463 -408167 -126221 42716 -93795
9958 -141565 10050 129906 -69841 -91318 118234 -410840 -28257 -60307 64907 -255647 67205
$$ packed form
10038b56443A66252c29571J48443L9328j66129a1550e35D6531a47994c0377l28138
10027c58515C47680I360a52518j50976a31309A6728M7307M1680i6421H8881b4167
10015c07868N9324h2423K8523q1889l01336A19983b94726a20684a2986j39196
10005a52182f6510o7760G461M8668a62151J8233A97081A0367g3848G6624N5576
9994A32200i1075E336J71957D5668N5160a30240A600K6187L1302J55465a04278
9982e5316o0765D0853c42609a5113A02542j5757b68479J24414N0563q3550E9650
9970B5607b73025a22277D1526b62193A77406e6709a0463l97704a26221D2716i3795
9958a41565A0050J19856f9841k1477A18234d10840b8257l2050F4907b55647F7205
$$ plain form
9946 52546 -189112 -118985 -133048 48830 -42792 -341343 142067 -29608 150986 -184750 -69247
9934 -314017 29726 -117521 -199454 -197809 45167 233915 -136551 -132094 -237353 -267054 81138
9922 109024 -166064 -1969 -81893 -162589 111190 -249099 234049 -101666 -234184 135796
9911 50017 244454 -58977 115984 64785 -270240 -182148 49904 70260 89005 74182 -261496
9899 -9876 -113607 -344048 -330063 -478706 265297 -57361 -336461 -217246 -7121 66268 67083
9888 67083 -311719 176277 10359 -49824 -94619 -105826 -28227 -9780 -500211 116333 68736
9877 68736 144225 77577 69130 198910 -135171 -45314 96552 -73586 -253028 -271739 -88028
9865 31605 -186983 401269 -200259 241250 75604 -1937 -59947 182696 -66463 30127 -401200
$$ packed form
9946E2546a89112P0127j4063D8830d2792k98551A42067b9608A50986a84750f9247
9934c14017B9726a17521q1933J645D5167J88748a36551M457j05259k9701H1138
9922A09024a66064a969p9924q0696A11190b49099B34049a01666j32518A35796
9911E0017J94437e8977A15984n1199b70240Q8092D9904K0356J8745j4823b61496
9899i876j03731k30441J3985j48643B65297e7361k79100J19215g121F6268Q15
9888F7083c11719A76277A0359d9824m4795j1207b8227i780m90431A16333m7597
9877F8736P5489o6648q447J29780a35171d5314I6552g3586j79442j8711h8028
9865C1605a86983D01269b00259B41250G5604a937n8010A82696f6463C0127d01200
$$ plain form
9853 -531207 -110757 -160744 -167738 -13134 309026 -93070 17582 41314 -172834 -357984 -180301
9842 -180301 -160759 158965 -210155 208797 20035 -167141 57488 -73509 498530 -1513 174313
9830 -13149 12728 -107798 -48054 65081 -157900 266570 69708 -7333 -305296 101376 -32801
9818 220728 175325 -218584 -415796 -110248 -289236 -123417 252646 -8811 -106685 77669 -118281
9806 -12759 -211842 158342 71597 112822 147397 125282 -379598 -29517 -160249 -174135 -62024
9794 -16091 -95276 24989 -119541 -158615 242139 -45434 -120360 -68501 134230 64293 -65509
9782 -341784 -407532 102350 33078 -49207 -27896 -36687 -51036 210028 35265 -5033 -25714 -436876
9770 -436876 -114932 203609 14904 73288 -57694 -231313 165550 -9223 159433 66583 -64021
$$ packed form
9853e31207a10757m9987o994a3134C09026i3070A7582K3732a72834j85150J77683
9842a80301J9542A58965b10155B08797B0035a67141E7488g3509D98530a513A74313
9830a3149A2728a07798d8054F5081a57900B66570F9708g333k97963A01376c2801
9818B20728m5403b18584j97212a10248j78988a23417B52646h811r7874G7669a18281
9806a2759j99083A58342G1597M1225L4575k2115c79598b9517j30732j3886f2024
9794a6091p9185B4989a19541l9074B42139d5434p4926N1859A34230F4293f5509
9782c41784o5748A02350C3078d9207K1311q791j4349B10028C5265e033k0681m11162
9770d36876a14932B03609A4904N8384e7694j73619A65550i223A59433F6583f4021
$$ plain form
9758 87971 3454 56833 13679 -90761 -237199 88526 -182038 221846 -262099 208938 -82909
9746 162486 171692 -314148 -217762 161084 -96302 -142 42548 -314613 87320 184553 -3179 -170830
9734 -170830 42190 -183889 -483634 -41708 116188 183093 -270823 -313930 -139381 -92199 -159692
9723 -159692 -435942 132555 -309767 194034 -333326 72149 -15624 126098 188957 68295
9712 42181 -70716 -243843 -118200 199389 84097 -149620 55054 238496 113239 21677 322433
9701 322433 -220865 29875 130550 149558 -392773 182322 -57113 -98528 -276016 -17595 -219521
9690 -219521 68496 -378809 -83197 -242839 9614 -158015 -267789 -111651 37190 -56125 -48563
9679 -48563 -15476 40955 -120627 45910 -138459 43522 -238971 -199381 67749 -147487 260533
$$ packed form
9758H7971C454N3379A3679i0761j46438H8526a82038B21846b62099B08938h2909
9746A62486R206c14148R6386A61084i6302a42D2548c14613H7320R7233c179j67651
9734a70830D2190a83889k99745d1708A16188O6905b70823m3107a39381M7182o7493
9723a59692k76250A32555c09767A94034c33326G2149a5624A26098O2859F8295
9712D2181g0716j73127a18200A99389H4097a49620E5054J83442A13239B1677L00756
9701C22433b20865B9875J00675J9008c92773A82322e7113m1415j77488a7595k01926
9690b19521F8496c78809h3197j59642I614a58015j09774a11651C7190e6125P562
9679d8563a5476D0955a20627D5910a38459D3522b38971L9590F7749a47487B60533
$$ plain form
9667 -126563 -168488 -44101 -481899 -62242 11234 -179152 132790 589956 -5272 -87996 27371
9655 -69177 -93688 -110466 159750 -388209 -290419 146889 1788 -1296 181784 -62499 39782
9643 -184375 23030 36210 -361789 96074 -174647 -223134 105043 -76775 -135475 56025 107810
9632 107810 -62059 117393 -111737 68356 -355584 61506 -147453 -230715 12076 -224469 43204
9620 -118483 -260928 -192357 236531 -232282 -113843 -1149 -57284 189982 -86214 162326 71136
9608 -33186 -169891 -99293 -47253 -98575 -125024 -83246 -222761 -171554 -202597 74600 -45292
9596 -14946 88828 101043 130606 206627 309321 -228463 -313400 266603 -67363 72699 428550
9585 428550 -36413 -137292 -141195 -85442 -143084 -334098 -22646 20199 28568 -108976 -161763
$$ packed form
9667a26563m1925d4101m37798f2242A1234a79152A32790M57166e272q2724B7371
9655f9177k4511j6778A59750c88209R7790A46889A788a296A81784f2499C9782
9643a84375B3030J3180c61789I6074a74647m8487A05043g6775n8700E6025N1785
9632A07810f2059A17393a11737F8356c55584F1506a47453q3262A2076b24469D3204
9620a18483j42445O8571B36531b32282a13843a149n6135A89982h6214A62326G1136
9608c3186j36705P0598d7253n1322k6449M1778j39515N1207l1043G4600d5292
9596a4946H8828J2215K9563P6021J02694b28463q4937B66603f7363G2699L55851
9585D28550c6413j00879l903N5753n7642j91014b2646B0199Q369a08976n2787
$$ plain form
9574 -161763 113745 114332 -417686 56491 234456 -241015 -19015 60577 -279040 -456217 69748
9562 -283022 -196753 270386 -149288 145544 10573 162906 -174659 163753 18846 -250164
9551 26549 179176 72110 -146182 -73276 163698 123156 -9953 44516 -243806 168709 -135269
9539 -167336 -178921 -229959 17471 115762 -493445 -287144 195188 125966 -89338 13810 36412
9528 36412 121428 198661 -196526 -99032 -410337 -93438 6746 -114596 -34021 128024 257 15860
9516 15860 -8170 -62885 -309609 -33920 -120623 -178389 -222757 148103 -111307 -251149 -305688
9505 -305688 -205478 -147637 34470 -63696 15624 -33495 -140978 -24945 -265675 -97791 -3256
9493 -238712 -265414 166044 -42324 -84838 171673 289624 -90939 -116157 -573356 -62454 -121533
$$ packed form
9574a61763A13745N87d17686E6491J77965b41015a9015F0577b79040j77177F9748
9562b83022Q6269B70386a49288A45544A0573J52333a74659A63753A8846b50164
9551B6549J52627G2110a46182P2906A63698m0542i953D4516b43806A68709a35269
9539a67336j1585n1038A7471R8291d93445K06301A95188o9222h9338A3810K2602
9528C6412Q5016P7233a96526R7494l11305i3438F746a14596c4021A28024B57J5603
9516A5860h170n4715k46724c3920q6703n7766m4368A48103a11307j39842n4539
9505c05688J00210N7841C4470f3696A5624c3495j07483b4945k40730i7791c256
9493b38712k6702A66044d2324m2514A71673J17951i0939k5218m57199f2454n9079
$$ plain form
9482 -121533 -60242 107957 39083 -26966 52698 203740 -210660 -79523 99737 -197471 34791
9470 -194359 -186925 219371 -161970 -89067 -91138 203493 -82898 128907 -416051 -173893 -349045
9459 -349045 58619 -209076 -353740 -399789 77028 -74265 -32166 -233841 196717 -216210 -380611
9448 -380611 -392700 19324 -60694 91718 95308 -264575 -110510 -136261 -373156 64337 -153332
9436 -155336 -223420 -14856 6903 -107685 -63149 -142156 -51061 -9828 21161 -76744 -202326 29866
9423 69783 161475 -223025 -64187 -4266 -25697 -68665 -42734 -21397 -29520 100021 -34401 -148387
9411 -148387 137497 269433 -59881 31401 286223 340038 -6003 200377 -139374 36548 67700
9400 67700 -36302 -108141 -15372 -419443 170505 -86820 78945 -36758 151293 -39391 -166930
$$ packed form
9482a21533f0242A07957C9083b6966E2698J51042b10660g9523I9737a97471C4791
9470a94359P434B19371a61970P2903k071B03493h2898A28907d16051a73893j75152
9459c49045E8619b09076j44664m6049G7028g4265c2166k01675A96717b16210j64401
9448c80611j2089A9324f0694I1718L590b64575a10510k5751k36895F4337a53332
9436a55336o8084a4856F903a07685M4536p9007e1061i828B1161g6744j25582B9866
9423F9783R1692b23025f4187d266k1431m2968K5931K1337q123A00021c4401j13986
9411a48387A37497J31936e9881C1401K54822N3815f003B00377a39374C6548L1152
9400F7700c6302p1839a5372m04071A70505h6820G8945c6758A51293c9391j27539
$$ plain form
9389 -166930 -90720 18168 -327729 69119 -103905 237316 2190 -149808 -91898 -6674 370083
9377 -38818 -162382 -268669 44873 163563 63289 -263445 121335 -211902 -209958 -56213 -78242
9366 -78242 214043 29555 -195070 -103749 -319321 113168 -85851 135310 259481 -339567
9355 45567 -160512 -317245 137063 -162401 -92820 -319799 -209627 -251612 -199513 -141489 138042
9343 46859 -30800 -116108 -28510 -106120 -58623 72788 -98202 -263282 12968 35921 -299839
9331 156201 -145004 20939 -74469 18510 194838 -102189 -261353 74665 54924 -60758 -276614
9320 -276614 38692 123102 -257541 -31198 71081 -36164 -39245 69301 20703 11408 -41489 -102692
9308 -102692 29303 -129541 405369 171812 100368 -96875 -72895 -142955 -101826 -119910 -12748
$$ packed form
9389a66930P6210A8168c27729F9119a03905B37316B190a49808N7910f674C70083
9377c8818j23564j06287D4873J18690F3289b63445A21335b11902J944e6213k2029
9366g8242B14043B9555a95070R1321k15572A13168h5851A35310J24171c39567
9355D5567a60512j56733A37063a62401O9581k26979J10172m1985N2099N8024A38042
9343D6859c0800q5308b8510p7610M7497G2788i8202j65080A2968K2953b99839
9331A56201a45004B0939g4469A8510J76328a02189j59164G4665j9741f0758k15856
9320b76614C8692Q4410b57541c1198G1081c6164l081F9301B0703r295d1489o1203
9308a02692B9303a29541D05369A71812p1444i6875K3980p0060M1129j8084a2748
$$ plain form
9296 -305668 4918 -76539 -49093 -40521 -56540 65940 -239863 26549 140122 -165155 31904
9284 -142125 -202765 227832 44135 -88437 232938 24287 -239554 339 -209145 -79606 -247959
9273 -247959 -421206 -256821 105860 -254418 61797 -88324 16601 224472 -116270 144194
9262 138052 205368 -239312 49827 -312648 -80589 -82981 -179612 71684 17190 134975 -144636
9250 -38245 41609 -358930 -356021 -174034 -91703 171521 -478973 -338452 121053 -118450 103288
9238 -187504 -145946 -222474 -300147 -130919 -208960 28435 186342 229849 -221275 -108334 -206384
9227 -206384 -319808 68010 -63267 -194805 -72479 -224832 -118262 92504 -111699 -156347 34441
9215 -13109 305430 90559 218847 277888 -282347 -85765 133839 76809 -246680 -3194 -182984
$$ packed form
9296c05668D918g6539K7446Q572j6019F5940b39863B6549J13573a65155C1904
9284a42125o0640B27832D4135h8437B32938B4287b39554C39b09145g9606j68353
9273b47959j73247J64385A05860b54418F1797h8324A6601K07871a16270A44194
9262A38052O7316b39312D9827c12648h0589k392r6631G1684A7190J17785a44636
9250c8245D1609c58930K909a74034Q2331A71521d78973J40521A21053a18450A03288
9238a87504M1558p6528p7673a30919p8041B8435J57907M3507b21275a08334r8050
9227b06384j13424F8010f3267j31538g2479j52353J06570I2504a11699m4648C4441
9215a3109C05430I0559J28288N9041b82347h5765A33839n7030b46680c194j79790
$$ plain form
9204 -182984 -127943 34752 -115188 431797 10061 -150530 -114324 -33984 -6399 88288 152846
9193 152846 48468 185874 -456403 -117973 -106393 -34530 137082 -189404 -171923 -268361 174903
9181 -474380 -46749 38783 -76483 185590 54068 -139305 91025 283913 -276827 -281615 -126192
9169 -199320 -204898 -114148 101996 -279569 -206862 -109496 -166943 288242 -241252 -32168 57707
9157 -191770 -100856 342761 77203 -122152 -34103 -270373 -123996 14078 -133489 26600 260848
9146 260848 -193976 -132586 -275369 -168826 -39888 212094 248790 -131449 -124924 65125 -13342
9134 106898 -95505 103807 202652 -98088 -18791 -33416 -62212 -55418 -203049 -47744 -16918
9122 157048 10371 40361 1273 -202538 39258 -45459 -62880 -37574 139265 -275792 -51292
$$ packed form
9204a82984N5041C4752a15188D31797A0061a50530L6206c3984f399H8288O4558
9193A52846D8468J37406d56403a17973J1580c4530A37082a89404J7481r6438A74903
9181d74380d6749C8783g6483A85590E4068a39305I1025J92888b76827m788a26192
9169a99320n578R0750A01996b79569P2707R7366n7447B88242b41252c2168E7707
9157a91770R0914C42761G7203a22152c4103k36270a23996A4078a33489B6600K34248
9146B60848a93976O1390j42783J06543c9888B12094L6696a31449O525F5125a3342
9134A06898i5505A03807R8845i8088a8791j4625k8796O794j47631d7744a6918
9122A57048A0371K9990A273b02538C9258d5459j7421K5306A39265b75792e1292
$$ plain form
9110 93061 -51335 -88963 -35775 101771 -309821 -308804 -144969 -208953 138806 -187390 96777
9098 -331152 -93108 194224 -429955 1819 -187188 17860 -322020 -90024 129845 161757 86254
9087 86254 -148772 386587 -287922 -162946 -64024 -15295 81555 105054 -5528 122160 4927
9075 -38560 28079 199449 -134528 65781 246755 -21911 -132931 -243833 -248220 215411 133317
9064 133317 150667 63120 42906 -28185 -616188 56704 -53466 237750 -183258 -50424 -834
9052 3541 -288859 112336 323762 -212210 -212316 107556 -19739 -21423 -133065 35512 -91519
9040 -26151 -147110 165530 -34852 143267 -153846 174143 -263593 -74856 38253 -135735
9029 -203848 -2401 41846 -257369 -51228 167087 36648 -166844 -3333 -89457 26947 -73937
$$ packed form
9110I3061e1335l7628c5775A01771c09821J017a44969o3984A38806a87390I6777
9098c31152i3108A94224d29955A819a87188A7860c22020i0024A29845L1912p5503
9087H6254a48772C86587b87922J24976f4024a5295H1555K3499e528A22160D927
9075c8560B8079J71370a34528F5781J80974b1911j11020j10902m387B15411q2094
9064A33317J7350F3120k0214b8185n88003E6704e3466B37750a83258e0424h34
9052C541b88859A12336K11426b12210j06A07556a9739j684j11642C5512i1519
9040b6151j20959A65530c4852A43267a53846A74143b63593g4856C8253a35735
9029b03848b401D1846b57369e1228A67087C6648a66844c333q6124B6947g3937
$$ plain form
9017 23864 -144553 40058 -387926 -43731 -74754 -177912 -131412 -360816 -93072 69657 184000
9006 184000 -228515 -259536 -280855 -11083 -74563 -72268 105410 166401 103786 32252 92251
8995 92251 136044 84966 -85660 44393 -306780 13097 71749 60345 2274 40346 122949 -157492
8982 -247815 -28960 -41664 106416 -308035 -249926 -177154 -88508 84034 -51444 11393 -10780
8970 -269871 44775 -29217 -61392 18425 118410 -163691 -165609 -330839 130671 -65694 327275
8958 208545 40839 347098 22905 -65780 180267 -229515 -455251 -151706 -319657 -216741
8948 -216741 -7213 -71197 115089 -263989 66706 164114 -95754 -38251 -420372 -56808 -58691
8937 -58691 112498 77776 41051 109196 -236838 -186044 127396 128696 -91479 -362236 -152939
$$ packed form
9017B3864a44553D0058c87926d3731l1023j03158M6500k29404i3072F9657J14343
9006A84000b28515l1021k1319a1083o3480K295A05410O0991o2615C2252N9999
8995I2251M3793n1078h5660D4393c06780A3097N8652j1404B274L8072Q2603a57492
8982b47815b8960j2704A06416c08035N8109P2772h8508H4034e1444A1393a0780
8970b69871D4775b9217l2175A8425R9985a63691j918j65230A30671f5694C27275
8958B08545D0839L06259B2905f5780A80267b29515k25736a51706j67951J02916
8948b16741g213o3984A15089b63989F6706R7408i5754c8251l82121e6808j883
8937e8691A12498l4722l6725O8145b36838N0794A27396J300i1479k70757a52939
$$ plain form
8925 18913 480757 797042 2677528 8574575 8534986 1928216 622128 369533 184692 33320
8914 324155 74504 22992 45251 -195872 -86785 -30514 194131 93250 -225001 247254 234121
8903 234121 -147710 136446 215203 129224 113997 -238755 -148868 -251787 -62373 -469639 -171488
8891 -102944 -5257 -187694 -86587 -235971 73798 -67309 15728 87794 -156832 -100077 -105656
8880 -105656 -290803 180874 -397977 -185491 -235709 348174 97878 -132031 188120 -32234
$$ packed form
8925A8913M61844L16285J880486N897047l9589A928216F22128k52595A84692C3320
8914C24155G4504B2992K2259a95872h6785c0514A94131I3250b25001B47254j3133
8903B34121a47710A36446P8757q5979j5227b38755Q9887j02919f2373m07266a71488
8891a02944e257j82437h6587j49384G3798f7309A5728P2066a56832N6755n579
8880a05656j85147A80874c97977a85491n0218C48174I7878a32031A88120c2234
$$ [...]
##END NTUPLES=NMR SPECTRUM
##END=
