
##TITLE=AC1403_PERAH12212_7653237_G05gJBbeM3
##JCAMPDX= 6.0         $$ Bruker NMR JCAMP-DX V2.0
##DATA TYPE= NMR SPECTRUM
##DATA CLASS= NTUPLES
##ORIGIN= BRUKER
##OWNER= Administrator
$$ 1.72 TOPSPIN		Version 2.1
$$ 2013-03-20 01:17:28.531 -0500  Administrator@X
$$ Compression mode = diff/dup
##.OBSERVE FREQUENCY= 400.02188249412
##.OBSERVE NUCLEUS= ^1H
##.ACQUISITION MODE= SIMULTANEOUS (DQD)
##.ACQUISITION SCHEME= undefined
##.AVERAGES= 64
##.DIGITISER RES= 22
##SPECTROMETER/DATA SYSTEM= spect
##.PULSE SEQUENCE= noesygpps1d.comp
##.SOLVENT NAME= COFFEE_meoh
##.SHIFT REFERENCE= INTERNAL, COFFEE_meoh, 1, 14.96128
##AUDIT TRAIL= $$ (NUMBER, WHEN, WHO, WHERE, PROCESS, VERSION, WHAT)
$$ ##TITLE= Audit trail, TOPSPIN		Version 2.1
$$ ##JCAMPDX= 5.01
$$ ##ORIGIN= Bruker BioSpin GmbH
$$ ##OWNER= Administrator
$$ $$ E:\/data/COFFEE/nmr/AC1403_PERAH12212_7653237_G05gJBbeM3/12/pdata/1/auditp.txt
$$ ##AUDIT TRAIL=  $$ (NUMBER, WHEN, WHO, WHERE, PROCESS, VERSION, WHAT)
(   1,<2013-03-20 01:17:22.546 -0500>,<Administrator>,<X>,<go>,<TOPSPIN 2.1>,
      <created by zg
	started at 2013-03-20 01:05:52.560 -0500,
	POWCHK enabled, PULCHK disabled,
       configuration hash MD5:
       86 BA 57 50 F2 9D 5C 9B 26 00 A9 28 5F 66 2E 89
       data hash MD5: 64K
       B8 FE CF 05 99 87 C5 78 3D 81 62 1B 7E 45 83 7C>)
(   2,<2013-03-20 01:17:25.640 -0500>,<Administrator>,<X>,<proc1d>,<TOPSPIN 2.1>,
      <Start of raw data processing
       efp LB = 0.3 FT_mod = 6 PKNL = 1 PHC0 = 0 PHC1 = 0 SI = 128K 
       data hash MD5: 128K
       CB E0 5D 3D FB C4 F5 E9 57 2D 93 5F D0 B6 6F 49>)
(   3,<2013-03-20 01:17:26.703 -0500>,<Administrator>,<X>,<proc1d>,<TOPSPIN 2.1>,
      <pk PHC0 = -77.91504 PHC1 = 0 
       data hash MD5: 128K
       85 CA 8F E5 B8 41 C0 67 1E 22 C7 AA 4D B6 1E 5F>)
(   4,<2013-03-20 01:17:27.406 -0500>,<Administrator>,<X>,<proc1d>,<TOPSPIN 2.1>,
      <abs ABSG = 1 
       data hash MD5: 128K
       28 9D 95 29 77 3E 76 DB A2 D4 1B 17 E1 A7 D7 0D>)
(   5,<2013-03-20 01:17:27.593 -0500>,<Administrator>,<X>,<proc1d>,<TOPSPIN 2.1>,
      <abs ABSG = 2 
       data hash MD5: 128K
       1C 86 87 E0 38 38 11 34 27 B6 AE A0 87 60 A4 78>)
(   6,<2013-03-20 01:17:27.781 -0500>,<Administrator>,<X>,<proc1d>,<TOPSPIN 2.1>,
      <abs ABSG = 3 
       data hash MD5: 128K
       1B F7 E6 2B 79 7D 11 F3 67 1D DB 81 6B 91 22 DC>)
(   7,<2013-03-20 01:17:27.953 -0500>,<Administrator>,<X>,<proc1d>,<TOPSPIN 2.1>,
      <abs ABSG = 4 
       data hash MD5: 128K
       D8 5A B6 7B CD A2 EF A7 E8 49 81 20 2E 28 00 8E>)
(   8,<2013-03-20 01:17:28.171 -0500>,<Administrator>,<X>,<proc1d>,<TOPSPIN 2.1>,
      <abs ABSG = 5 
       data hash MD5: 128K
       09 5E A6 32 85 40 33 C7 77 CC 02 D3 00 90 63 F4>)
$$ ##END=
$$ 
$$ $$ hash MD5
$$ $$ 3A 18 2D 5A FA EA 15 41 AA CA 31 8E 43 23 6E 1B
##$RELAX= 
##$RELAX= 
##$RELAX= 
##$RELAX= 
##$RELAX= 
##$RELAX= 
##$RELAX= 
##$RELAX= 
$$ Bruker specific parameters
$$ --------------------------
##$DU= <E:\>
##$EXPNO= 12
$$ [...]
##$TP07= 0
##$TPNAME0= <>
##$TPNAME1= <>
##$TPNAME2= <>
##$TPNAME3= <>
##$TPNAME4= <>
##$TPNAME5= <>
##$TPNAME6= <>
##$TPNAME7= <>
##$TPOAL= (0..7)
0.5 0.5 0.5 0.5 0.5 0.5 0.5 0.5
##$TPOFFS= (0..7)
0 0 0 0 0 0 0 0
##$TUNHIN= 0
##$TUNHOUT= 0
##$TUNXOUT= 0
##$USERA1= <user>
##$USERA2= <user>
##$USERA3= <user>
##$USERA4= <user>
##$USERA5= <user>
##$V9= 5
##$VALIST= <valist>
##$VCLIST= <CCCCCCCCCCCCCCC>
##$VD= 0
##$VDLIST= <DDDDDDDDDDDDDDD>
##$VPLIST= <PPPPPPPPPPPPPPP>
##$VTLIST= <TTTTTTTTTTTTTTT>
##$WBST= 2048
##$WBSW= 25
##$XGAIN= (0..3)
0 0 0 0
##$XL= 0
##$YL= 0
##$YMAX_a= 5569850
##$YMIN_a= -11715320
##$ZGOPTNS= <>
##$ZL1= 120
##$ZL2= 120
##$ZL3= 120
##$ZL4= 120
##$ABSF1= 14.96128
##$ABSF2= -5.596902
##$ABSG= 5
##$ABSL= 3
##$ALPHA= 0
##$AQORDER= 0
##$ASSFAC= 0
##$ASSFACI= 0
##$ASSFACX= 0
##$ASSWID= 0
##$AUNMP= <proc_prof1d_extract.lims>
##$AXLEFT= 0
##$AXNAME= <>
##$AXNUC= <1H>
##$AXRIGHT= 0
##$AXTYPE= 0
##$AXUNIT= <>
##$AZFE= 0.1
##$AZFW= 0.1
##$BCFW= 0
##$BC_mod= 0
##$BYTORDP= 0
##$COROFFS= 0
##$CY= 15
##$DATMOD= 1
##$DC= 0
##$DFILT= <>
##$DTYPP= 0
##$F1P= 0
##$F2P= 0
##$FCOR= 0.5
##$FTSIZE= 131072
##$FT_mod= 6
##$GAMMA= 0
##$GB= 0
##$INTBC= 1
##$INTSCL= 1
##$ISEN= 128
##$LB= 0.3
##$LEV0= 0
##$LPBIN= 0
##$MAXI= 10000
##$MC2= 0
##$MEAN= 0
##$ME_mod= 0
##$MI= 0
##$NCOEF= 0
##$NC_proc= -2
##$NLEV= 6
##$NOISF1= 0
##$NOISF2= 0
##$NSP= 0
##$NTH_PI= 0
##$NZP= 0
##$OFFSET= 14.96128
##$PC= 1
##$PHC0= -77.91504
##$PHC1= 0
##$PH_mod= 1
##$PKNL= yes
##$PPARMOD= 0
##$PPDIAG= 0
##$PPIPTYP= 0
##$PPMPNUM= 2147483647
##$PPRESOL= 1
##$PSCAL= 4
##$PSIGN= 0
##$PYNMP= <proc.py>
##$REVERSE= no
##$SF= 400.020009523505
##$SI= 131072
##$SIGF1= 0
##$SIGF2= 0
##$SINO= 400
##$SIOLD= 131072
##$SPECTYP= <>
##$SREGLST= <1H.CDCl3>
##$SSB= 0
##$STSI= 131072
##$STSR= 0
##$SW_p= 8223.68421052631
##$SYMM= 0
##$S_DEV= 0
##$TDeff= 65536
##$TDoff= 0
##$TI= <>
##$TILT= no
##$TM1= 0
##$TM2= 0
##$TOPLEV= 0
##$USERP1= <user>
##$USERP2= <user>
##$USERP3= <user>
##$USERP4= <user>
##$USERP5= <user>
##$WDW= 1
##$XDIM= 131072
##$YMAX_p= 382540814
##$YMIN_p= -10867
##$CURPLOT= <Network HP LaserJet P1505>
##$CURPRIN= <$Network HP LaserJet P1505>
##$DFORMAT= <normdp>
##$LAYOUT= <+/1D_H.xwp>
##$LFORMAT= <normlp>
##$PFORMAT= <normpl>
##$SURQMSG= 1
$$ End of Bruker specific parameters
$$ ---------------------------------
##NTUPLES= NMR SPECTRUM
##VAR_NAME=  FREQUENCY,     SPECTRUM/REAL,   SPECTRUM/IMAG
##SYMBOL=    X,             R,               I
##VAR_TYPE=  INDEPENDENT,   DEPENDENT,       DEPENDENT
##VAR_FORM=  AFFN,          ASDF,            ASDF
##VAR_DIM=   131072,        131072,          131072
##UNITS=     HZ,            ARBITRARY UNITS, ARBITRARY UNITS
##FACTOR=    0.0627417313425164, 1,          1
##FIRST=     8223.62146879497, 2622,         -47756
##LAST=      0,             3822,            -47166
##MIN=       0,             -10867,          0
##MAX=       8223.62146879497, 382540814,    0
$$ Real data points
##PAGE= N=1
##DATA TABLE= (X++(R..R)), XYDATA
$$ [...]
$$ plain form
63900 1454872 1327570 1214064 1114056 1026271 949481 882896 825549 775792 731836 692767 658659
63889 658659 629647 605087 583767 564691 547404 531639 516954 502905 489468 477117 466410
63878 466410 457569 450414 444536 439423 434557 429678 425090 421550 419693 419593 420935 423506 427304 432320
63864 432320 438489 445956 455161 466495 480078 495922 514081 534444 556623 580392 606128 634467
63852 634467 665512 698652 733185 768801 805459 843091 881543 920453 958998 995969 1030286
63841 1030286 1061394 1089130 1113417 1134058 1150483 1161621 1166511 1165267 1159068 1148893 1134618 1115699
63829 1115699 1092264 1064998 1034341 1000545 964362 926901 888694 849550 809492 769304 729966
63818 729966 692035 655837 621802 590274 561311 534892 510996 489265 468993 449829 432255
$$ packed form
63900A454872j27302j13506j00008q7785p6790o6585n7347m9757m3956l9069l4108
63889F58659k9012k4560k1320j9076j7287j5765j4685j4049j3437j2351j0707
63878D66410q841p155n878n113m866m879m588l540j857j00J342K571L798N016
63864D32320O169P467R205J1334J3583J5844J8159K0363K2179K3769K5736K8339
63852F34467L1045L3140L4533L5616L6658L7632L8452L8910L8545L6971L4317
63841A030286L1108K7736K4287K0641J6425J1138M890j244o199j0175j4275j8919
63829A115699k3435k7266l0657l3796l6183l7461l8207l9144m0058m0188l9338
63818G29966l7931l6198l4035l1528k8963k6419k3896k1731k0272j9164j7574
$$ plain form
63807 432255 417038 404366 393761 384679 376894 370344 364775 359609 354229 348504 342850 337492 331846
63794 331846 325156 317646 310357 303757 297280 290504 284023 278613 274163 270074 266160 262472 258724 254729
63780 254729 251129 248786 247566 246485 245056 243720 242896 242311 241475 240303 239055 238075 237603 237414 236694 234816
63764 234816 232238 230064 228689 227474 225861 224113 222799 222151 222196 222882 223752 224030 223475 222690 222285 222167 221958
63747 221958 221651 221471 221484 221708 222176 222569 222295 221382 220801 221346 222663 223979 225389 227623 230744 233884 236292
63730 236292 238010 239429 240862 242714 245481 249214 253268 256924 260155 263649 268090 273457 279015 284103
63716 284103 288886 294066 299738 305026 309179 312565 315987 319301 321426 321667 320338 318077 315228 312060
63702 312060 308957 306075 303215 300308 297504 294658 291305 287576 284546 283107 282885 282940 283276 284818 287898
$$ packed form
63807D32255j5217j2672j0605r082p785o550n569n166n380n725n654n358n646
63794C31846o690p510p289o600o477o776o481n410m450m089l914l688l748l995
63780B54729l600k343j220j081j429j336q24n85q36j172j248r80m72j89p20j878
63764B34816k578k174j375j215j613j748j314o48M5O86Q70K78n55p85m05j18k09
63747B21958l07j80J3K24M68L93k74r13n81N45J317J316J410K234L121L140K408
63730B36292J718J419J433J852K767L733M054L656L231L494M441N367N558N088
63716B84103M783N180N672N288M153L386L422L314K125K41j329k261k849l168
63702C12060l103k882k860k907k804k846l353l729l030j439k22N5L36J542L080
$$ plain form
63687 287898 291532 294579 297043 299673 302547 304731 305472 305296 305529 306861 308712 310038 310513 310719 311408 312830
63671 312830 314763 316904 319134 321566 324415 327746 331305 334697 337761 340688 343757 347014 350224 353041
63657 353041 355196 356563 357011 356188 353665 349493 344492 339641 335166 330462 324957 318819 312769 307529 303532
63642 303532 300872 299255 298171 297349 296967 297349 298627 300795 303867 307727 311958 316042 319735 323174 326733
63627 326733 330843 335700 340963 345951 350416 355060 360966 368600 377519 387003 396731 406875 417863 430147
63613 430147 444043 459688 477180 496681 518283 541919 567627 595786 626825 660747 697218
63602 697218 735994 776735 818272 858478 895158 926862 952725 971953 983972 988964 987885 981995
63590 981995 972622 961181 948856 936004 922140 906673 889506 870790 850339 827567 802113 774441
$$ packed form
63687B87898L634L047K464K630K874K184P41j76K33J332J851J326M75K06O89J422
63671C12830J933K141K230K432K849L331L559L392L064K927L069L257L210K817
63657C53041K155J367M48q23k523m172n001m851m475m704n505o138o050n240l997
63642C03532k660j617j084q22l82L82J278K168L072L860M231M084L693L439L559
63627C26733M110M857N263M988M465M644N906P634Q919R484R728J0144J0988J2284
63613D30147J3896J5645J7492J9501K1602K3636K5708K8159L1039L3922L6471
63602F97218L8776M0741M1537M0206L6680L1704K5863J9228J2019M992j079n890
63590I81995r373j1441j2325j2852j3864j5467j7167j8716k0451k2772k5454k7672
$$ plain form
63578 774441 745843 717768 691026 665556 641054 617795 596689 578523 563378 550871 540726
63567 540726 532948 527652 525009 525150 527724 531655 535758 539756 544341 550095 556692 563371 569899 576740
63553 576740 584520 593733 604831 618141 633560 650736 669722 691297 716574 746523 781891 823170
63541 823170 870241 921994 976284 1030093 1079719 1121378 1152243 1171097 1178105 1174339 1161891 1144012
63529 1144012 1124247 1105031 1087219 1070848 1055760 1041296 1025989 1008195 987028 962433 934526
63518 934526 903227 868588 831222 792378 753695 716688 682131 649888 619557 591294 565851
63507 565851 543815 525080 509051 495092 482717 471627 461733 452953 444897 436977 428988 421322 414362
63494 414362 407866 401300 394697 388778 384116 380517 377383 374461 371949 370035 368631 367603 366985 366842 367120
$$ packed form
63578G74441k8598k8075k6742k5470k4502k3259k1106j8166j5145j2507j0145
63567E40726p778n296k643J41K574L931M103L998M585N754O597O679O528O841
63553E76740P780R213J1098J3310J5419J7176J8986K1575K5277K9949L5368M1279
63541H23170M7071N1753N4290N3809M9626M1659L0865J8854P008l766j2448j7879
63529A144012j9765j9216j7812j6371j5088j4464j5307j7794k1167k4595k7907
63518I34526l1299l4639l7366l8844l8683l7007l4557l2243l0331k8263k5443
63507E65851k2036j8735j6029j3959j2375j1090r894q780q056p920p989p666o960
63494D14362o496o566o603n919m662l599l134k922k512j914j404j028o18j43K78
$$ plain form
63479 367120 367804 369091 371215 374147 377679 381750 386382 391299 396012 400497 405331 410755 415839 419146
63465 419146 420153 419550 418125 415969 412938 409285 405379 401214 396690 392166 388236 385031 382203 379551
63451 379551 377289 375669 374694 374275 374380 374982 376132 378143 381389 385780 390677 395553 400636 406784 414784
63436 414784 424851 436758 450419 466336 485434 508484 535792 567450 603456 643104 684358
63425 684358 724240 759988 789753 812479 827859 836771 841442 844818 849667 858082 871283 889601
63413 889601 912905 941341 975433 1015149 1058924 1103829 1146589 1184377 1214972 1236902 1249819
63402 1249819 1254664 1253092 1246502 1235608 1220944 1203615 1185094 1166100 1145986 1123565 1098258 1070005
63390 1070005 1038367 1002683 963320 922097 880989 840827 801665 763950 728730 696889 668643
$$ packed form
63479C67120O84J287K124K932L532M071M632M917M713M485M834N424N084L307
63465D19146J007o03j425k156l031l653l906m165m524m524l930l205k828k652
63451C79551k262j620r75m19J05O02J150K011L246M391M897M876N083O148Q000
63436D14784J0067J1907J3661J5917J9098K3050K7308L1658L6006L9648M1254
63425F84358L9882L5748K9765K2726J5380Q912M671L376M849Q415J3201J8318
63413H89601K3304K8436L4092L9716M3775M4905M2760L7788L0595K1930J2917
63402A249819M845j572o590j0894j4664j7329j8521j8994k0114k2421k5307k8253
63390A070005l1638l5684l9363m1223m1108m0162l9162l7715l5220l1841k8246
$$ plain form
63379 668643 643721 621632 601900 584438 569714 558270 550079 544570 541183 539676 540055 542508 547243
63366 547243 554112 562475 571791 582248 594551 609192 626257 645846 668270 693748 722200 753353
63354 753353 786893 822660 860964 902532 947625 995134 1042874 1088750 1131306 1169121 1200269
63343 1200269 1222831 1236001 1240603 1238556 1231710 1221013 1206750 1189480 1170347 1150244 1129032 1106030
63331 1106030 1080917 1053627 1023656 990339 953876 915448 876212 836824 798031 760995 726672
63320 726672 695536 668290 646231 630335 620273 614743 612355 611729 611112 608572 602588 592235 577128
63307 577128 557714 535474 512316 489681 468352 448845 431537 416537 403768 393148 384395 376848
63295 376848 369811 363033 356641 350766 345497 340936 336878 332716 328183 323969 320943 318807 316220 312431
$$ packed form
63379F68643k4922k2089j9732j7462j4724j1444q191n509l387j507L79K453M735
63366E47243O869Q363R316J0457J2303J4641J7065J9589K2424K5478K8452L1153
63354G53353L3540L5767L8304M1568M5093M7509M7740M5876M2556L7815L1148
63343A200269K2562J3170M602k047o846j0697j4263j7270j9133k0103k1212k3002
63331A106030k5113k7290k9971l3317l6463l8428l9236l9388l8793l7036l4323
63320G26672l1136k7246k2059j5896j0062n530k388o26o17k540n984j0353j5107
63307E77128j9414k2240k3158k2635k1329j9507j7308j5000j2769j0620q753p547
63295C76848p037o778o392n875n269m561m058m162m533m214l026k136k587l789
$$ plain form
63281 312431 308171 304687 302371 300712 299167 297615 296115 294665 293252 291997 291180 291049 291425 291565 290799
63266 290799 289422 288633 289319 291106 292827 293721 293921 293959 294184 294656 295298 295997 296650 297145 297294 296859 295787 294425
63248 294425 293417 293318 294292 296047 298012 299659 300799 301561 302052 302164 301803 301245 301083 301804 303470 305770 308246
63231 308246 310529 312510 314384 316420 318669 320942 323081 325153 327272 329370 331274 333037 335005 337445
63217 337445 340168 342660 344693 346675 349282 352763 356734 360691 364536 368447 372398 376067 379223 381897
63203 381897 384035 385247 385224 384250 383047 382063 381205 380269 379360 378753 378594 378975 380148 382436 385933 390421 395531
63186 395531 400974 406801 413577 422118 432820 445282 458728 472669 486948 501328 515468 529296
63174 529296 543119 557201 571406 585285 598372 610405 621425 631653 641186 649926 657944 665620
$$ packed form
63281C12431m260l484k316j659j545j552j500j450j413j255q17j31L76J40p66
63266B90799j377p89O86J787J721Q94K00L8K25M72O42O99O53M95J49m35j072j362
63248B94425j008r9R74J755J965J647J140P62M91J12l61n58j62P21J666K300K476
63231C08246K283J981J874K036K249K273K139K072K119K098J904J763J968K440
63217C37445K723K492K033J982K607L481L971L957L845L911L951L669L156K674
63203C81897K138J212k3r74j203r84q58r36r09o07j59L81J173K288L497M488N110
63186C95531N443N827O776Q541J0702J2462J3446J3941J4279J4380J4140J3828
63174E29296J3823J4082J4205J3879J3087J2033J1020J0228R533Q740Q018P676
$$ plain form
63162 665620 673054 679488 683781 685384 684379 680674 673924 664362 652989 640477 626439 610274 592327
63149 592327 573710 555301 537414 520184 503725 488049 473329 460087 448704 438879 430100 422507
63137 422507 416713 412741 409710 406709 403574 400710 398567 397414 397232 397601 397979 398334 399288 401510 405108
63122 405108 409659 414587 419469 424239 429247 434966 441484 448369 455070 461371 467503 473954 481063 488610
63108 488610 495914 502547 508815 515294 522060 528760 535248 541639 547806 553414 558552 563808 569571 575733
63094 575733 582227 589347 597323 606077 615605 626060 637118 647797 657390 666188 674810 683138 690354
63081 690354 695699 698663 698741 695692 689994 682512 673717 663647 652558 641069 629602 618094 606356
63068 606356 594408 582460 570907 560410 551570 544353 538084 532158 526616 522008 518870 517315 516918
$$ packed form
63162F65620P434O434M293J603j005l705o750r562j1373j2512j4038j6165j7947
63149E92327j8617j8409j7887j7230j6459j5676j4720j3242j1383r825q779p593
63137D22507n794l972l031l001l135k864k143j153j82L69L78L55R54K222L598
63122D05108M551M928M882M770N008N719O518O885O701O301O132O451P109P547
63108D88610P304O633O268O479O766O700O488O391O167N608N138N256N763O162
63094E75733O494P120P976Q754R528J0455J1058J0679R593Q798Q622Q328P216
63081F90354N345K964P8l049n698p482q795j0070j1089j1489j1467j1508j1738
63068F06356j1948j1948j1553j0497q840p217o269n926n542m608l138j555l97
$$ plain form
63055 516918 517012 517318 518286 520590 524332 528971 534001 539377 545327 552048 559674 568259 577714 587937 598891
63040 598891 610285 621372 631610 641489 652084 663624 675119 685718 695822 706334 717240 727600
63028 727600 736718 744644 751555 757275 761596 764596 766403 766890 765836 763185 758955 753047 745352 736054
63014 736054 725718 715108 704871 695288 686319 678060 671180 666715 665201 666098 668286 671229 675589 682602
63000 682602 692926 706106 721062 736942 753514 771008 789757 809832 830763 851647 871774
62989 871774 891187 910446 929877 949328 968659 987992 1007232 1025743 1042906 1058698 1073197
62978 1073197 1085610 1094348 1098203 1097043 1091382 1081724 1068512 1052139 1032587 1009402 982523 953031
62966 953031 922715 892960 864307 836829 810432 784821 759716 735313 712196 690715 670810
$$ packed form
63055E16918R4L06R68K304L742M639N030N376N950O721P626Q585R455J0223J0954
63040E98891J1394J1087J0238R879J0595J1540J1495J0599J0104J0512J0906J0360
63028G27600R118P926O911N720M321L000J807M87j054k651m230n908p695r298
63014G36054j0336j0610j0237r583q969q259o880m465j514Q97K188K943M360P013
63000F82602J0324J3180J4956J5880J6572J7494J8749K0075K0931K0884K0127
62989H71774J9413J9259J9431J9451J9331J9333J9240J8511J7163J5792J4499
62978A073197J2413Q738L855j160n661r658j3212j6373j9552k3185k6879k9492
62966I53031l0316k9755k8653k7478k6397k5611k5105k4403k3117k1481j9905
$$ plain form
62955 670810 652611 636654 623072 610907 598747 585992 573074 560565 548534 536834 525472
62944 525472 514446 503589 492794 482157 471703 461288 451095 441829 433975 426992 419865 412437
62932 412437 405733 400757 397394 394710 391981 389119 386331 383714 381182 378539 375707 372974 370853 369531
62918 369531 368657 367886 367383 367417 367642 367333 366350 365393 365093 365306 365543 365732 366162 366927 367858 368962 370507 372599
62900 372599 374939 377164 379264 381626 384733 388836 393815 399338 405254 411805 419387 428133 437823 448011
62886 448011 458083 467286 475112 481760 487940 494074 499795 504285 506854 507119 504995 500821 495334 489122
62872 489122 482174 474220 465380 456146 446778 437186 427527 418432 410375 403153 396304 389779 383777 378164
62858 378164 372595 367191 362539 358874 355685 352345 348770 345267 342138 339689 338186 337330 336200 334320
$$ packed form
62955F70810j8199j5957j3582j2165j2160j2755j2918j2509j2031j1700j1362
62944E25472j1026j0857j0795j0637j0454j0415j0193r266p854o983p127p428
62932D12437o704m976l363k684k729k862k788k617k532k643k832k733k121j322
62918C69531q74p71n03L4K25l09r83r57l00K13K37J89M30P65R31J104J545K092
62900C72599K340K225K100K362L107M103M979N523N916O551P582Q746R690J0188
62886D48011J0072R203P826O648O180O134N721M490K569K65k124m174n487o212
62872D89122o948p954q840r234r368r592r659r095q057p222o849o525o002n613
62858C78164n569n404m652l665l189l340l575l503l129k449j503q56j130j880
$$ plain form
62844 334320 332534 332055 332756 333196 332492 331306 330677 330693 330933 331511 332771 334299 335139 334992 334479 334215 334281 334646
62826 334646 335389 336215 336422 335744 334791 334299 334346 334613 335069 335914 337125 338448 339681 340656 341126 341062 340913 341193
62808 341193 341869 342455 342634 342497 342246 342010 341934 342165 342701 343390 344074 344615 344915 345085 345417 346014 346641 347198 347994
62789 347994 349127 349934 349781 349289 349928 352207 355046 357354 359562 362924 367763 373229 378671 384465 391343
62774 391343 399538 408895 419344 430797 442776 454634 466138 477556 489007 499974 509616 517467
62762 517467 523633 528303 531310 532308 531274 528656 525017 520588 515139 508277 499939 490707 481450 472452
62748 472452 462994 452166 440164 428470 418526 410459 403306 396249 389281 382726 376560 370428 364195
62735 364195 358219 353094 349156 346265 343972 341937 340158 338846 338092 337724 337495 337337 337325 337392 337193 336453 335492
$$ packed form
62844C34320j786m79P01M40p04j186o29J6K40N78J260J528Q40j47n13k64O6L65
62826C34646P43Q26K07o78r53m92M7K67M56Q45J211J323J233R75M70o4j49K80
62808C41193O76N86J79j37k51k36p6K31N36O89O84N41L00J70L32N97O27N57P96
62789C47994J133Q07j53m92O39K279K839K308K208L362M839N466N442N794O878
62774C91343Q195R357J0449J1453J1979J1858J1504J1418J1451J0967R642P851
62762E17467O166M670L007R98j034k618l639m429n449o862q338r232r257q998
62748D72452r458j0828j2002j1694r944q067p153p057o968o555o166o132o233
62735C64195n976n125l938k891k293k035j779j312p54l68k29j58j2O7j99p40r61
$$ plain form
62718 335492 335294 336814 340133 344383 348592 352565 356825 361732 366904 371698 376184 381350 388256 397153
62704 397153 407607 419214 431918 445763 460763 477102 495164 515202 537262 561541 588464
62693 588464 618135 649983 683289 717851 753787 790905 828683 866775 905041 942998 979613
62682 979613 1013664 1043933 1068938 1086952 1096660 1097831 1091264 1078182 1059610 1036019 1007477 974288
62670 974288 937494 898577 858768 818923 779898 742424 706509 671623 637851 606422 578664
62659 578664 554730 533729 514752 497260 480768 464930 450055 437021 426343 417584 409797 402363
62647 402363 395278 388799 382975 377457 371739 365635 359511 353939 349192 345204 341920 339422 337753 336841
62633 336841 336640 337075 337765 338082 337730 337132 336970 337339 337479 336413 333807 330230 326720 324108 322592 321743 320950
$$ packed form
62718C35492j98J520L319M250M209L973M260M907N172M794M486N166O906Q897
62704C97153J0454J1607J2704J3845J5000J6339J8062K0038K2060K4279K6923
62693E88464K9671L1848L3306L4562L5936L7118L7778L8092L8266L7957L6615
62682I79613L4051L0269K5005J8014R708J171o567j3082j8572k3591k8542l3189
62670I74288l6794l8917l9809l9845l9025l7474l5915l4886l3772l1429k7758
62659E78664k3934k1001j8977j7492j6492j5838j4875j3034j0678q759p787p434
62647D02363p085o479n824n518n718o104o124n572m747l988l284k498j669r12
62633C36841k01M35O90L17l52n98j62L69J40j066k606l577l510k612j516q49p93
$$ plain form
62616 320950 320004 319280 319177 319379 318989 317557 315727 314531 314226 314192 313919 313565 313490 313720 314094 314581 315160 315670
62598 315670 316039 316434 316956 317463 317976 318976 320947 323823 327221 330966 334940 338614 341362 343343 345643
62583 345643 349258 354165 359476 364256 368041 370782 372554 373402 373426 372884 371944 370262 367198 362740 357946
62568 357946 353971 350794 347379 343074 338293 333766 329704 326000 322747 320122 318002 316126 314448 313029
62554 313029 311717 310403 309466 309495 310427 311361 311469 310829 310107 309637 309211 308701 308444 308795 309597 310397 311013 311660
62536 311660 312646 314203 316461 319216 321795 323624 324942 326510 328495 330193 331115 331796 333142 335406 338301
62521 338301 341777 346016 350909 356165 361915 368652 376533 385265 394686 405029 416621 429870 445535
62508 445535 464340 486033 509276 532754 556032 579223 602343 625314 648129 670493 691479
$$ packed form
62616C20950r46p24j03K02l90j432j830j196l05l4k73l54p5K30L74M87N79N10
62598C15670L69L95N22N07N13J000J971K876L398L745L974L674K748J981K300
62583C45643L615M907N311M780L785K741J772Q48K4n42r40j682l064m458m794
62568C57946l975l177l415m305m781m527m062l704l253k625k120j876j678j419
62554C13029j312j314r37K9R32R34J08o40p22m70m26n10k57L51Q02Q00O16O47
62536C11660R86J557K258K755K579J829J318J568J985J698R22O81J346K264K895
62521C38301L476M239M893N256N750O737P881Q732R421J0343J1592J3249J5665
62508D45535J8805K1693K3243K3478K3278K3191K3120K2971K2815K2364K0986
$$ plain form
62497 691479 709933 725106 736736 744697 748871 749287 746196 740112 731924 722794 713803 705703 699018 694115
62483 694115 691192 690449 692356 697388 705474 716081 728942 744160 761308 778975 795717 811043 824911
62470 824911 836567 844570 847890 846421 840415 829977 815251 796602 774421 749044 721073 691460
62458 691460 661071 630393 599863 570235 542307 516349 492095 469405 448777 431021 416488
62447 416488 404784 395296 387758 382080 377786 374027 370253 366583 363466 361253 360177 360283 361070 361600 361424
62432 361424 361257 362234 364505 366974 368461 368772 368450 367805 366455 363884 360245 356524 353813 352426 351796 351151
62416 351151 350110 348681 347046 345486 344162 342769 340754 338219 336225 335668 336076 336095 335101 333766 332965 332775
62400 332775 332847 333247 334413 336415 338640 340266 340911 340857 340794 341409 343119 346070 350128 354800 359370 363435
$$ packed form
62497F91479J8454J5173J1630P961M174M16l091o084q188r130q991q100o685m903
62483F94115k923p43J907N032Q086J0607J2861J5218J7148J7667J6742J5326J3868
62470H24911J1656Q003L320j469o006j0438j4726j8649k2181k5377k7971k9613
62458F91460l0389l0678l0530k9628k7928k5958k4254k2690k0628j7756j4533
62447D16488j1704r488p538n678m294l759l774l670l117k213j076J06P87N30j76
62432C61424j67R77K271K469J487L11l22o45j350k571l639l721k711j387o30o45
62416C51151j041j429j635j560j324j393k015k535j994n57M08J9r94j335q01j90
62400C32775P2M00J166K002K225J626O45n4o3O15J710K951M058M672M570M065
$$ plain form
62384 363435 367265 371419 376029 380733 385275 389926 395220 401508 408797 416810 425121 433448 441886 450738
62370 450738 460132 469991 480388 491640 503972 517338 531670 547097 563853 582175 602460 625367
62358 625367 651641 681937 716829 756816 802263 853450 910574 973378 1040705 1110715 1181607
62347 1181607 1251766 1319105 1380752 1433837 1476529 1508204 1528947 1539209 1539677 1531006 1513696 1488456
62335 1488456 1456501 1419064 1376758 1329875 1279360 1227036 1174735 1123549 1074075 1026998 983025
62324 983025 942468 905192 870931 839372 809983 782105 755441 730292 707163 686114 666560
62313 666560 647645 628761 609797 591126 573409 557297 543059 530437 518910 508145 498143
62302 498143 489001 480735 473443 467496 463279 460675 458928 457186 455167 453231 451896 451454 451974 453417 455544
$$ packed form
62384C63435L830M154M610M704M542M651N294O288P289Q013Q311Q327Q438Q852
62370D50738R394R859J0397J1252J2332J3366J4332J5427J6756J8322K0285K2907
62358F25367K6274L0296L4892L9987M5447N1187N7124O2804O7327P0010P0892
62347A181607P0159O7339O1647N3085M2692L1675K0743J0262M68q671j7310k5240
62335A488456l1955l7437m2306m6883n0515n2324n2301n1186m9474m7077m3973
62324I83025m0557l7276l4261l1559k9389k7878k6664k5149k3129k1049j9554
62313F66560j8915j8884j8964j8671j7717j6112j4238j2622j1527j0765j0002
62302D98143r142q266p292n947m217k604j747j742k019j936j335m42N20J443K127
$$ plain form
62287 455544 457895 460150 462520 465519 469270 473223 476686 479429 481683 483794 486097 488904 492162 495222
62273 495222 497402 498954 501049 504589 509261 514109 518828 524105 530811 539293 549626 562145 577344
62260 577344 595361 615983 639288 666061 697457 734388 777367 826669 882301 943767 1010082
62249 1010082 1080078 1152457 1225495 1296830 1363660 1423035 1472158 1509045 1533377 1546459 1549849
62238 1549849 1543919 1527965 1501520 1465202 1420405 1368730 1311862 1251487 1188944 1125218 1061591
62227 1061591 999999 942307 889256 840505 795747 755420 720177 689952 663873 640981 620729
62216 620729 602793 586738 572102 558604 546036 534108 522749 512484 504084 497658 492409 487411
62204 487411 482328 477317 472676 468889 466511 465488 464920 464106 463601 464578 467261 470735 474284 478145 482775
$$ packed form
62287D55544K351K255K370K999L751L953L463K743K254K111K303K807L258L060
62273D95222K180J552K095L540M672M848M719N277O706Q482J0333J2519J5199
62260E77344J8017K0622K3305K6773L1396L6931M2979M9302N5632O1466O6315
62249A010082O9996P2379P3038P1335O6830N9375M9123L6887K4332J3082L390
62238A549849n930j5954k6445l6318m4797n1675n6868o0375o2543o3726o3627
62227A061591o1592n7692n3051m8751m4758m0327l5243l0225k6079k2892k0252
62216F20729j7936j6055j4636j3498j2568j1928j1359j0265q400o426n249m998
62204D87411n083n011m641l787k378j023n68q14n05R77K683L474L549L861M630
$$ plain form
62189 482775 488214 494575 502422 511984 522498 533036 543671 555220 567940 581161 594173 606919
62177 606919 619676 632443 644858 656459 666927 676175 684285 691406 697936 704939 714014 726381 742261
62164 742261 761532 784832 813553 848731 890257 937027 987335 1039095 1090208 1139032 1184229
62153 1184229 1224131 1256690 1280373 1294800 1300350 1297503 1286900 1269671 1247045 1219494 1186601 1148009
62141 1148009 1104440 1057774 1010216 963393 918101 874741 833871 796262 762450 732386 705643
62130 705643 681959 661453 644336 630482 619326 610098 602074 594633 587317 580029 573155 567323 562991
62117 562991 560321 559404 560400 563385 568260 574938 583593 594671 608814 626715 648689 674085 701252
62104 701252 728255 753569 776082 794961 810023 822140 832807 843188 853706 864284 874501
$$ packed form
62189D82775N439O361P847R562J0514J0538J0635J1549J2720J3221J3012J2746
62177F06919J2757J2767J2415J1601J0468R248Q110P121O530P003R075J2367J5880
62164G42261J9271K3300K8721L5178M1526M6770N0308N1760N1113M8824M5197
62153A184229L9902L2559K3683J4427N550k847j0603j7229k2626k7551l2893l8592
62141A148009m3569m6666m7558m6823m5292m3360m0870l7609l3812l0064k6743
62130G05643k3684k0506j7117j3854j1156r228q024p441p316p288o874n832m332
62117E62991k670r17R96K985M875O678Q655J1078J4143J7901K1974K5396K7167
62104G01252K7003K5314K2513J8879J5062J2117J0667J0381J0518J0578J0217
$$ plain form
62093 874501 883474 890018 893126 892219 887113 878151 866422 853460 840565 828616 818345 810263 804258
62080 804258 799877 797330 797771 802230 810610 822062 835997 852337 871065 892009 914955 939607 965549
62067 965549 992571 1020881 1050631 1081441 1112896 1145356 1179726 1216325 1254502 1293422 1332632
62056 1332632 1371498 1408577 1442046 1470615 1493665 1510673 1520969 1524157 1520469 1510519 1494817 1473543
62044 1473543 1446716 1414487 1377355 1336098 1291487 1244159 1194889 1144946 1095925 1049042 1004662
62033 1004662 962643 923085 886604 853865 824982 799451 776557 755764 736826 719729 704568
62022 704568 691408 680162 670573 662258 654820 648020 641832 636194 630626 624394 617284 609996 603442 597748
62008 597748 592417 587383 583277 580452 578314 576146 574230 573634 575034 578247 582835 588538 594990 601480
$$ packed form
62093H74501Q973O544L108r07n106q962j1729j2962j2895j1949j0271q082o005
62080H04258m381k547M41M459Q380J1452J3935J6340J8728K0944K2946K4652K5942
62067I65549K7022K8310K9750L0810L1455L2460L4370L6599L8177L8920L9210
62056A332632L8866L7079L3469K8569K3050J7008J0296L188l688r950j5702k1274
62044A473543k6827l2229l7132m1257m4611m7328m9270m9943m9021m6883m4380
62033A004662m2019l9558l6481l2739k8883k5531k2894k0793j8938j7097j5161
62022G04568j3160j1246r589q315p438o800o188n638n568o232p110p288o554n694
62008E97748n331n034m106k825k138k168j916n96J400L213M588N703O452O490
$$ plain form
61994 601480 607344 612408 616909 621161 625374 629471 632869 634633 634152 631640 627874 623535 618845 613612
61980 613612 607397 599745 590503 580050 569146 558557 548735 539719 531248 523142 515695 509499 504722
61967 504722 500685 496414 491545 486471 481718 477530 474124 471894 471020 471054 471190 470990 470625 470397 470223 469739
61951 469739 468869 468156 468424 469995 472314 474563 476775 480089 485648 493366 502180 511484 521874 534268
61937 534268 548764 564815 582225 601403 622633 645586 669645 694241 718714 742257 764387
61926 764387 785226 805010 823495 840112 854493 866477 875758 881951 885032 885357 883124 878141 870323
61913 870323 860298 849355 838857 829686 822188 816593 813556 814216 819566 829730 843923 861007 879947
61900 879947 899895 920110 939771 957604 971776 980607 983579 981405 974999 964637 950286 932375
$$ packed form
61994F01480N864N064M501M252M213M097L398J764m81k512l766m339m690n233
61980F13612o215p652r242j0453j0904j0589r822r016q471q106p447o196m777
61967E04722m037m271m869n074m753m188l406k230q74L4J36k00l65k28j74m84
61951D69739q70p13K68J571K319K249K212L314N559P718Q814R304J0390J2394
61937E34268J4496J6051J7410J9178K1230K2953K4059K4596K4473K3543K2130
61926G64387K0839J9784J8485J6617J4381J1984R281O193L081L25k233m983p818
61913H70323j0025j0943j0498r171p498n595l037O60N350J0164J4193J7084J8940
61900H79947J9948K0215J9661J7833J4172Q831K972k174o406j0362j4351j7911
$$ plain form
61888 932375 911892 889852 866980 843848 821019 798929 777763 757524 738236 720089 703284
61877 703284 687653 672495 657040 641087 625040 609340 594165 579685 566210 553904 542735
61866 542735 532894 524890 518914 514424 510747 507854 506174 505931 507110 509908 514722 521760 531085 542958
61852 542958 557688 575224 595408 618561 645211 675213 707730 742268 779060 818159 858636
61841 858636 899101 938591 976494 1011990 1043975 1071338 1092976 1107872 1115660 1116995 1112964 1104285
61829 1104285 1091506 1075850 1059387 1044319 1032355 1024691 1022096 1024906 1033126 1046543 1064418 1085106
61817 1085106 1106382 1126343 1143768 1157609 1166543 1169240 1164899 1153382 1135016 1110417 1080348 1045614
61805 1045614 1007137 966165 924129 882194 841066 801361 763904 729449 698229 670055 644858
$$ packed form
61888I32375k0483k2040k2872k3132k2829k2090k1166k0239j9288j8147j6805
61877G03284j5631j5158j5455j5953j6047j5700j5175j4480j3475j2306j1169
61866E42735r841q004n976m490l677k893j680k43J179K798M814P038R325J1873
61852E42958J4730J7536K0184K3153K6650L0002L2517L4538L6792L9099M0477
61841H58636M0465L9490L7903L5496L1985K7363K1638J4896P788J335m031q679
61829A104285j2779j5656j6463j5068j1964p664k595K810Q220J3417J7875K0688
61817A085106K1276J9961J7425J3841Q934K697m341j1517j8366k4599l0069l4734
61805A045614l8477m0972m2036m1935m1128l9705l7457l4455l1220k8174k5197
$$ plain form
61794 644858 622852 604045 587810 573234 559972 548468 539153 531612 524945 518951 514371 511629 509817
61781 509817 507565 504723 502432 501474 501246 500682 499592 498569 497951 497478 496895 496365 496182 496394 496787 497102 497278
61764 497278 497628 498586 500040 501064 500761 499344 497961 497359 497177 496841 496649 497414 499178 500923 501784 502067 502677
61747 502677 503768 504490 504137 503047 502057 501339 500330 498723 496987 495673 494634 493372 491904 490798 490357
61732 490357 490204 489765 488893 487920 487381 487811 489553 492491 496034 499548 502735 505609 508293 511007 514014 517301
61716 517301 520446 523048 525274 527741 530859 534461 538075 541310 543904 545631 546362 546129 545079 543438 541535
61701 541535 539662 537745 535296 531936 527950 524187 521344 519415 517903 516536 515703 516110 517987 520661 523061
61686 523061 524626 525617 526661 528235 530614 533888 537663 541037 543395 545193 547495 550619 553643 555457
$$ packed form
61794F44858k2006j8807j6235j4576j3262j1504r315p541o667n994m580k742j812
61781E09817k252k842k291r58k28n64j090j023o18m73n83n30j83K12L93L15J76
61764D97278L50R58J454J024l03j417j383o02j82l36j92P65J764J745Q61K83O10
61747E02677J091P22l53j090r90p18j009j607j736j314j039j262j468j106m41
61732D90357j53m39q72r73n39M30J742K938L543L514L187K874K684K714L007L287
61716E17301L145K602K226K467L118L602L614L235K594J727P31k33j050j641j903
61701E41535j873j917k449l360l986l763k843j929j512j367q33M07J877K674K400
61686E23061J565R91J044J574K379L274L775L374K358J798K302L124L024J814
$$ plain form
61672 555457 555912 555662 555243 554746 554192 553687 553100 551976 549969 547213 544158 541198 538492 536017 533694 531597
61656 531597 530048 529351 529371 529498 529135 528190 527064 526288 526197 526771 527694 528637 529558 530662 532046 533582 535228
61639 535228 537298 540212 544042 548452 553003 557374 561223 564059 565357 564860 562788 559749 556375 552937
61625 552937 549275 545125 540507 535820 531571 528019 525006 522140 519205 516392 514097 512547 511720 511540 511899
61610 511899 512487 512858 512750 512081 510541 507543 502851 496970 490618 484033 477204 470480 464363 458715 452862
61595 452862 446667 440918 436389 432976 430199 428035 426634 425525 423879 421589 419432 417977 416885 415607
61581 415607 414244 413205 412288 410753 408327 405683 403687 402461 401387 399915 398138 396632 395833 395612 395381
61566 395381 394584 393112 391262 389411 387823 386717 386261 386314 386330 385756 384580 383336 382535 382215 382098 381946 381595
$$ packed form
61672E55457M55k50m19m97n54n05n87j124k007k756l055k960k706k475k323k097
61656E31597j549o97K0J27l63r45j126p76r1N74R23R43R21J104J384J536J646
61639E35228K070K914L830M410M551M371L849K836J298m97k072l039l374l438
61625E52937l662m150m618m687m249l552l013k866k935k813k295j550q27j80L59
61610E11899N88L71j08o69j540k998m692n881o352o585o829o724o117n648n853
61595D52862o195n749m529l413k777k164j401j109j646k290k157j455j092j278
61581D15607j363j039r17j535k426k644j996j226j074j472j777j506p99k21k31
61566C95381p97j472j850j851j588j106m56N3J6n74j176j244q01l20j17j52l51
$$ plain form
61549 381595 380806 379423 377700 376181 375141 374360 373618 373181 373490 374465 375453 375852 375510 374497 372883 370941
61533 370941 369333 368773 369598 371676 374473 377040 378336 377997 376677 375231 373755 371859 369719 368128 367316
61518 367316 366326 363971 360061 355361 350698 346528 343105 340596 339017 338304 338321 338599 338356 337169 335474 334039
61502 334039 333101 332368 331664 331045 330356 329295 327969 326869 326148 325462 324729 324481 325090 326053 326479 326068 325151 324038
61484 324038 322745 321395 320470 320524 321664 323325 324569 324840 324539 324641 325635 327063 328248 329148 330229 331766
61468 331766 333609 335469 337086 338263 339091 339976 341092 341907 341694 340506 339200 338409 337931 337248 336301 335457
61452 335457 334999 334920 335141 335621 336272 336962 337728 338922 340937 343598 345919 346757 345935 344539 343969 344797 346668
61435 346668 348990 351354 353473 355257 356957 358893 361016 363127 365485 368618 372321 375389 376788 376822 376787
$$ packed form
61549C81595p89j383j723j519j040p81p42m37L09R75R88L99l42j013j614j942
61533C70941j608n60Q25K078K797K567J296l39j320j446j476j896k140j591q12
61518C67316r90k355l910m700m663m170l423k509j579p13J7K78k43j187j695j435
61502C34039r38p33p04o19o89j061j326j100p21o86p33k48O09R63M26m11r17j113
61484C24038j293j350r25N4J140J661J244K71l01J02R94J428J185R00J081J537
61468C31766J843J860J617J177Q28Q85J116Q15k13j188j306p91m78o83r47q44
61452C35457m58p9K21M80O51O90P66J194K015K661K321Q38q22j396n70Q28J871
61435C46668K322K364K119J784J700J936K123K111K358L133L703L068J399L4l5
$$ plain form
61420 376787 377640 379381 381506 383622 385605 387581 389877 392741 395967 398932 401092 402356 402948 403058 402692
61405 402692 401798 400411 398728 397028 395461 393816 391545 388167 383804 379289 375571 372910 370732 368330
61391 368330 365625 363091 361092 359551 358246 357115 356172 355352 354659 354354 354764 355906 357371 358639 359506 360206
61375 360206 361090 362160 363020 363392 363568 364126 365280 366736 368193 369638 371086 372409 373646 375169 377254
61360 377254 379629 381786 383614 385396 387236 388867 390136 391416 393319 396140 399736 403906 408677 414195
61346 414195 420489 427547 435562 444890 455614 467337 479570 492157 504987 517401 528335 537172
61334 537172 544127 549622 553668 556088 557004 556724 555398 553198 550648 548222 545638 542066 537231 531885 526966
61319 526966 522621 518401 514190 510479 507680 505527 503416 501184 499312 498319 498209 498695 499750 501621 504289
$$ packed form
61420C76787Q53J741K125K116J983J976K296K864L226K965K160J264N92J10l66
61405D02692q94j387j683j700j567j645k271l378m363m515l718k661k178k402
61391C68330k705k534j999j541j305j131r43q20o93l05M10J142J465J268Q67P00
61375C60206Q84J070Q60L72J76N58J154J456J457J445J448J323J237J523K085
61360C77254K375K157J828J782J840J631J269J280J903K821L596M170M771N518
61346D14195O294P058Q015R328J0724J1723J2233J2587J2830J2414J0934Q837
61334E37172O955N495M046K420R16k80j326k200k550k426k584l572m835n346m919
61319E26966m345m220m211l711k799k153k111k232j872r93j10M86J055J871K668
$$ plain form
61304 504289 507271 510147 513076 516620 521268 527253 534598 543078 552296 561988 572044 581967 590556 596569
61290 596569 599567 599789 597416 592472 585406 577105 568221 558944 549615 541025 533784 527808 522746 518642
61276 518642 515791 514238 513777 514249 515513 517206 518946 520789 523288 527063 532386 539034 546465 554289 562580
61261 562580 571412 580078 587356 592981 598397 605475 614728 625349 636741 649261 663422 679064 695490
61248 695490 711819 726973 739838 749806 756823 760738 761079 757840 752058 745123 737661 729389 719882 709163
61234 709163 697787 686720 676994 669063 662531 656755 651697 647919 645771 644827 644110 642792 640883 639432
61220 639432 639843 642682 647215 652320 657622 663365 669381 674807 678908 681733 683784 685396 686657 687667
61206 687667 688645 689866 691520 693417 694767 694625 692802 690226 688213 687446 687732 688570 689793 691785 695234
$$ packed form
61304E04289K982K876K929L544M648N985P345Q480R218R692J0056R923Q589O013
61290E96569K998K22k373m944p066q301q884r277r329q590p241n976n062m104
61276E18642k851j553m61M72J264J693J740J843K499L775N323O648P431P824Q291
61261E62580Q832Q666P278N625N416P078R253J0621J1392J2520J4161J5642J6426
61248F95490J6329J5154J2865R968P017L915L41l239n782o935p462q272r507j0719
61234G09163j1376j1067r726p931o532n776n058l778k148r44p17j318j909j451
61220F39432M11K839M533N105N302N743O016N426M101K825K051J612J261J010
61206F87667R78J221J654J897J350j42j823k576k013p67K86Q38J223J992L449
$$ plain form
61191 695234 700661 708124 717401 728461 741621 757198 775135 795017 816238 838039 859438 879303
61179 879303 896649 911060 922941 933240 942754 951643 959631 966389 971549 974686 975821 975832 975766 975571
61165 975571 973960 969697 962640 953409 942517 930179 916560 901820 886041 869499 852840 836700
61153 836700 821177 805870 790382 774799 759864 746736 736268 728409 722502 718198 715737 715383 717135
61140 717135 721033 726996 734011 740150 743916 745069 743769 739724 732972 724825 716886 709447 701845 694234
61126 694234 687850 683496 680870 679647 680212 682893 687361 693397 701549 712408 725650 740444 756480
61113 756480 774128 793757 815354 838638 863217 888684 914739 941082 967208 992670 1017580
61102 1017580 1042390 1066941 1090243 1111505 1130942 1149170 1166180 1181349 1194115 1204099 1210753 1213409
$$ packed form
61191F95234N427P463R277J1060J3160J5577J7937J9882K1221K1801K1399J9865
61179H79303J7346J4411J1881J0299R514Q889P988O758N160L137J135J1o6j95
61165I75571j611m263p057r231j0892j2338j3619j4740j5779j6542j6659j6140
61153H36700j5523j5307j5488j5583j4935j3128j0468p859n907m304k461l54J752
61140G17135L898N963P015O139L766J153j300m045o752q147p939p439p602p611
61126F94234o384m354k626j223N65K681M468O036Q152J0859J3242J4794J6036
61113G56480J7648J9629K1597K3284K4579K5467K6055K6343K6126K5462K4910
61102A017580K4810K4551K3302K1262J9437J8228J7010J5169J2766R984O654K656
$$ plain form
61090 1213409 1211663 1205414 1194652 1179549 1160668 1138782 1114570 1088688 1061921 1034909 1007846 980826
61078 980826 954393 929363 906094 884301 863684 844455 827114 811926 798761 787341 777564 769582
61066 769582 763531 759140 755651 752244 748597 745059 742313 740796 740386 740661 741476 743137 745865 749426 753616
61051 753616 758940 766207 775445 785781 796530 807871 820234 833637 848059 864021 882208 902748
61039 902748 925278 949557 975540 1002984 1031467 1060800 1091072 1122219 1153850 1185615 1217602
61028 1217602 1250332 1284415 1320094 1357062 1394778 1433118 1472646 1514248 1558636 1606211 1657177
61017 1657177 1711552 1769086 1829116 1890565 1952477 2014995 2079760 2149063 2224843 2308888 2403543
61006 2403543 2511256 2633359 2770033 2921660 3089643 3276386 3486052 3726177 4007966
$$ packed form
61090A213409j746o249j0762j5103j8881k1886k4212k5882k6767k7012k7063k7020
61078I80826k6433k5030k3269k1793k0617j9229j7341j5188j3165j1420r777p982
61066G69582o051m391l489l407l647l538k746j517m10K75Q15J661K728L561M190
61051G53616N324P267R238J0336J0749J1341J2363J3403J4422J5962J8187K0540
61039I02748K2530K4279K5983K7444K8483K9333L0272L1147L1631L1765L1987
61028A217602L2730L4083L5679L6968L7716L8340L9528M1602M4388M7575N0966
61017A657177N4375N7534O0030O1449O1912O2518O4765O9303P5780Q4045R4655
61006B403543J07713J22103J36674J51627J67983J86743K09666K40125K81789
$$ plain form
60997 4007966 4345039 4753152 5251601 5863759 6616057 7539010 8672698 10073648 11817254
60988 11817254 13988943 16655185 19812201 23335111 26971404 30402276 33339450 35595395
60980 35595395 37101383 37904553 38173581 38185481 38242983 38535734 39039544 39536992 39738164
60971 39738164 39399722 38372136 36597378 34114176 31075622 27732247 24359229 21171724
60963 21171724 18287761 15747427 13549499 11673306 10087152 8755681 7646085 6727984
60955 6727984 5970600 5343951 4822561 4386093 4017260 3701296 3427040 3186554 2973598
60946 2973598 2783531 2613993 2463774 2330738 2211854 2104945 2008957 1922355 1842423 1766474
60936 1766474 1692876 1620686 1549140 1477987 1407751 1339283 1273263 1210238 1150767 1095363 1044386
$$ packed form
60997D007966L37073M08113M98449O12158P52298R22953J133688J400950J743606
60988A1817254K171689K666242L157016L522910L636293L430872K937174K255945
60980C5595395J505988Q03170K69028J1900N7502K92751N03810M97448K01172
60971C9738164l38442j027586j774758k483202l038554l343375l373018l187505
60963B1171724k883963k540334k197928j876193j586154j331471j109596r18101
60955F727984p57384o26649n21390m36468l68833l15964k74256k40486k12956
60946B973598j90067j69538j50219j33036j18884j06909r5988q6602p9932p5949
60936A766474p3598p2190p1546p1153p0236o8468o6020o3025n9471n5404n0977
$$ plain form
60925 1044386 997913 955614 917013 882068 851037 823521 798130 773658 750198 728588 709138
60914 709138 691597 675993 662677 651503 641617 632127 622606 613134 604309 597028 591646 587502 583789
60901 583789 580673 578889 578388 578130 577278 575904 574362 572652 570618 568280 565685 562803 559746 556770 553866
60886 553866 550618 546639 541985 537128 532730 529384 527230 525755 524223 522306 520120 517746 515038 511898
60872 511898 508509 505160 501958 498695 494989 490693 486135 481674 477079 471888 466451 461855 458444 455204
60858 455204 451277 447370 444750 443414 442324 441161 440702 441493 443213 445432 448018 450583 452494 453773 455236
60843 455236 457464 460325 463657 467561 471764 475571 478846 482183 485601 487912 488099 486650 484803 483068
60829 483068 481298 479760 479148 479628 480631 481607 482414 483072 483657 484468 485788 487428 488871 489925 490893 492072
$$ packed form
60925A044386m6473m2299l8601l4945l1031k7516k5391k4472k3460k1610j9450
60914G09138j7541j5604j3316j1174r886r490r521r472q825p281n382m144l713
60901E83789l116j784n01k58q52j374j542j710k034k338k595k882l057k976k904
60886E53866l248l979m654m857m398l346k154j475j532j917k186k374k708l140
60872E11898l389l349l202l263l706m296m558m461m595n191n437m596l411l240
60858D55204l927l907k620j336j090j163m59P91J720K219K586K565J911J279J463
60843D55236K228K861L332L904M203L807L275L337L418K311J87j449j847j735
60829D83068j770j538o12M80J003R76Q07O58N85Q11J320J640J443J054R68J179
$$ plain form
60813 492072 493368 494445 495004 494850 493870 492008 489206 485401 480625 474991 468502 461141 453283 445763 439197
60798 439197 433379 427611 421560 415553 410064 405227 400876 396887 393345 390405 388045 386029 384154 382440
60784 382440 380961 379587 378086 376379 374449 372160 369594 367470 366647 367043 367594 367523 367099 366826 366526 365913
60768 365913 365671 367094 370673 375655 381044 386467 391942 397450 403174 409745 417725 426836 436016 444333
60754 444333 451675 458506 465164 471583 477624 483332 488685 493320 496862 499508 501934 504563 507282 509976
60740 509976 512901 516148 519009 520362 519703 517476 514390 510711 506251 500729 493940 485810 476598 467047
60726 467047 458111 450347 443593 437342 431392 425930 420952 415955 410499 404926 400109 396459 393530 390679
60712 390679 387808 385263 383299 381892 380917 380278 379910 379789 379882 380098 380406 381015 382225 384083 386430 389315
$$ packed form
60813D92072J296J077N59j54r80j862k802l805m776n634o489p361p858p520o566
60798D39197n818n768o051o007n489m837m351l989l542k940k360k016j875j714
60784C82440j479j374j501j707j930k289k566k124q23L96N51p1m24k73l00o13
60768C65913k42J423L579M982N389N423N475N508N724O571P980R111R180Q317
60754D44333P342O831O658O419O041N708N353M635L542K646K426K629K719K694
60740E09976K925L247K861J353o59k227l086l679m460n522o789q130r212r551
60726D67047q936p764o754o251n950n462m978m997n456n573m817l650k929k851
60712C90679k871k545j964j407r75o39l68j21R3K16L08O09J210J858K347K885
$$ plain form
60696 389315 393139 398257 404669 412095 420073 427893 434832 440671 445723 450213 453935 456665 458533 459793
60682 459793 460590 461170 461860 462498 462347 461028 459175 457700 456768 456017 455429 455269 455374 455256 454895 454706 454749 454714
60664 454714 454843 456103 459044 463002 466829 470013 472760 475411 478175 481156 484300 487537 491268 496394
60650 496394 503528 512384 522232 532699 543787 555500 567975 581790 597459 614613 632244 649830
60638 649830 667641 685780 703629 720716 737593 755119 773082 790266 805914 820379 834061
60627 834061 846316 856008 862809 867304 869830 869824 866563 860195 851787 842494 832881 822898 812242 800691
60613 800691 788221 774929 760960 746551 732074 717893 704225 691259 679288 668449 658364
60602 658364 648372 638228 628269 618741 609242 599117 588252 577256 566983 558005 550291 543165 535780
$$ packed form
60696C89315L824N118O412P426P978P820O939N839N052M490L722K730J868J260
60682D59793P97N80O90O38j51j319j853j475r32p51n88j60J05j18l61j89M3l5
60664D54714J29J260K941L958L827L184K747K651K764K981L144L237L731N126
60650D96394P134Q856R848J0467J1088J1713J2475J3815J5669J7154J7631J7586
60638F49830J7811J8139J7849J7087J6877J7526J7963J7184J5648J4465J3682
60627H34061J2255R692O801M495K526ol261o368q408r293r613r983j0656j1551
60613H00691j2470j3292j3969j4409j4477j4181j3668j2966j1971j0839j0085
60602F58364r992j0144r959r528r499j0125j0865j0996j0273q978p714p126p385
$$ plain form
60589 535780 528008 520743 514942 510412 505964 500855 495653 491443 488496 486056 483300 480162 477235 475202
60575 475202 474485 475191 477131 479919 483245 487069 491456 496361 501801 508260 516566 527279 540493 556363
60561 556363 575375 597636 622198 647697 673521 699774 726034 750712 771756 787438 796426 797990
60549 797990 792789 782962 770764 757315 743118 729362 717869 709776 704983 703149 704764 710983 722744
60536 722744 740339 763596 792152 825425 862351 901187 939733 975807 1007461 1032750 1049707
60525 1049707 1057001 1054663 1044036 1027142 1006243 983766 962061 942950 927363 915258 905749 897602
60513 897602 889974 882736 876055 869960 864493 860016 856971 855487 855505 857146 860649 866112 873631 883518 896106
60498 896106 911628 930761 955028 986128 1025071 1072571 1130052 1199306 1280951 1373841 1476180
$$ packed form
60589E35780p772p265n801m530m448n109n202m210k947k440k756l138k927k033
60575D75202p17P06J940K788L326L824M387M905N440O459Q306J0713J3214J5870
60561E56363J9012K2261K4562K5499K5824K6253K6260K4678K1044J5682Q988J564
60549G97990n201r827j2198j3449j4197j3756j1493q093m793j834J615O219J1761
60536G22744J7595K3257K8556L3273L6926L8836L8546L6074L1654K5289J6957
60525A049707P294k338j0627j6894k0899k2477k1705j9111j5587j2105r509q147
60513H97602p628p238o681o095n467m477l045j484J8J641L503N463P519R887J2588
60498H96106J5522J9133K4267L1100L8943M7500N7481O9254Q1645R2890J02339
$$ plain form
60487 1476180 1586514 1703257 1823804 1944438 2060683 2167368 2258989 2330662 2378728 2400331
60477 2400331 2393032 2355714 2289965 2200207 2092350 1972314 1845428 1716478 1589786 1469030
60467 1469030 1356951 1255162 1164188 1083564 1011996 947948 890559 839910 796060 758117 724766
60456 724766 695486 670411 648983 629677 611440 594609 579931 567325 556183 546277 537673 530200
60444 530200 523719 518554 514887 511917 508417 504077 499704 496131 493549 491811 490707 489857 488914 488030 487656
60429 487656 487811 488017 487976 487717 487012 485234 482124 478173 473930 469350 464179 458650 453410 448958 445451 442856
60413 442856 441003 439588 438385 437369 436583 436052 435945 436491 437568 438608 439183 439468 439892 440500 441031 441503 442371
60396 442371 444008 446155 447942 448491 447663 446336 445737 446315 447349 447799 447381 446627 446102 445898 445863 445946 446267 447029
$$ packed form
60487A476180J10334J16743J20547J20634J16245J06685R1621P1673M8066K1603
60477B400331p299l7318o5749q9758j07857j20036j26886j28950j26692j20756
60467A469030j12079j01789r0974q0624p1568o4048n7389n0649m3850l7943l3351
60456G24766k9280k5075k1428j9306j8237j6831j4678j2606j1142r906q604p473
60444E30200o481n165l667k970l500m340m373l573k582j738j104q50r43q84l74
60429D87656J55K06m1k59p05j778l110l951m243m580n171n529n240m452l507k595
60413D42856j853j415j203j016p86n31j07N46J077J040N75K85M24O08N31M72Q68
60396D42371J637K147J787N49q28j327n99N78J034M50m18p54n25k04l5Q3L21P62
$$ plain form
60378 447029 448409 450295 452101 453145 453419 453752 454942 456792 458266 458663 458392 458469 459429 460976 462547 463839
60362 463839 464696 464919 464569 464224 464484 465258 465951 466374 466972 468035 469178 469925 470370 470833 471166 470999 470474 470170
60344 470170 470308 470588 470943 471849 473644 475984 478386 480976 484219 488045 491744 494809 497552 500652 504227
60329 504227 507477 509265 509038 507275 505081 503379 502448 502044 501732 501172 500338 499579 499266 499311 499277 499119 499486 501009
60311 501009 503499 506283 509243 513085 518511 525487 533542 542532 552910 565433 580835 599681 622358
60298 622358 649093 679921 714428 751374 788689 823914 854602 878314 892673 896014 888218 870786
60286 870786 845965 815876 782515 748165 715311 685905 660812 640026 623162 609605 598541
60275 598541 589289 581645 575548 570445 565388 559854 554007 548007 541623 534871 528498 523142 518346 513141
$$ packed form
60378D47029J380J886J806J044K74L33J190J850J474L97k71P7R60J547J571J292
60362D63839Q57K23l50l45K60P74O93M23N98J063J143P47M45M63L33j67n25l04
60344D70170J38K80L55R06J795K340K402K590L243L826L699L065K743L100L575
60329E04227L250J788k27j763k194j702r31m04l12n60q34p59l13M5l4j58L67J523
60311E01009K490K784K960L842N426O976Q055Q990J0378J2523J5402J8846K2677
60298F22358K6735L0828L4507L6946L7315L5225L0688K3712J4359L341p796j7432
60286H70786k4821l0089l3361l4350l2854k9406k5093k0786j6864j3557j1064
60275E98541r252p644o097n103n057n534n847o000o384o752o373n356m796n205
$$ plain form
60261 513141 507557 502753 499559 497517 495616 493412 491093 488983 487373 486480 486205 486181 486302 486867 487950 488997
60245 488997 489383 489058 488344 487481 486755 486640 487260 487978 488082 487662 487285 487024 486425 485346 484237 483612 483756 484901
60227 484901 487090 489824 492400 494696 497176 500094 503264 506661 510592 515061 519491 523339 526539 529155
60213 529155 531197 533026 535308 538155 540841 542788 544326 545998 547646 548896 550138 552215 555285 558756
60199 558756 562263 565937 569615 572590 574577 576369 578982 582393 585563 587598 588476 588577 587885 586019 583045
60184 583045 579902 577682 576485 575387 573637 571500 569602 567826 565434 562142 558490 555008 551665 548436
60170 548436 545978 545155 545979 547473 548674 549489 550431 551766 553187 554335 555353 556730 558673 560908 563179
60155 563179 565709 568875 572556 576078 578840 580723 581795 581897 580875 579135 577677 577358 578142 579149 579470
$$ packed form
60261E13141n584m804l194k042j901k204k319k110j610q93k75k4J21N65J083J047
60245D88997L86l25p14q63p26j15O20P18J04m20l77k61n99j079j109o25J44J145
60227D84901K189K734K576K296K480K918L170L397L931M469M430L848L200K616
60213E29155K042J829K282K847K686J947J538J672J648J250J242K077L070L471
60199E58756L507L674L678K975J987J792K613L411L170K035Q78J01o92j866k974
60184E83045l143k220j197j098j750k137j898j776k392l292l652l482l343l229
60170E48436k458q23Q24J494J201Q15R42J335J421J148J018J377J943K235K271
60155E63179K530L166L681L522K762J883J072J02j022j740j458l19P84J007L21
$$ plain form
60140 579470 578925 578123 577968 579142 581929 586254 591876 598643 606623 615770 625479 634706 642717 649487 655132
60125 655132 659231 661150 660923 659283 656753 653203 648519 643226 638045 633203 628679 624926 622738 622332 623051
60110 623051 624118 625333 626909 629053 631934 635691 640170 644872 649447 653920 658187 661681 664076 666032
60096 666032 668514 671373 673252 673073 671034 667970 664357 660347 656273 652494 649004 645742 643152 641950
60082 641950 642368 644002 646386 649348 652795 656461 659935 662797 664798 666098 667137 667976 667899 665978 661930
60067 661930 656132 649031 641030 632816 625203 618524 612561 607112 602229 597915 594090 590879 588402 586172
60053 586172 583290 579476 575400 571770 568608 565721 563262 561323 559396 556886 553926 551212 549211 547978
60039 547978 547524 547817 548503 549215 550176 552077 555183 558871 562187 564678 566619 568528 570553 572243 572928 572313
$$ packed form
60140E79470n45q02j55J174K787M325N622O767P980R147R709R227Q011O770N645
60125F55132M099J919k27j640k530l550m684n293n181m842m524l753k188m06P19
60110F23051J067J215J576K144K881L757M479M702M575M473M267L494K395J956
60096F66032K482K859J879j79k039l064l613m010m074l779l490l262k590j202
60082F41950M18J634K384K962L447L666L474K862K001J300J039Q39p7j921m048
60067F61930n798p101q001q214p613o679n963n449m883m314l825l211k477k230
60053E86172k882l814m076l630l162k887k459j939j927k510k960k714k001j233
60039E47978m54K93O86P12R61J901L106L688L316K491J941J909K025J690O85o15
$$ plain form
60023 572313 570650 568389 565908 563524 561329 558827 555195 550234 544769 539718 535110 530414 525552 520999
60009 520999 517054 513577 510453 507780 505555 503598 501856 500422 499227 498052 496925 496066 495424 494677 493761
59994 493761 493026 492696 492584 492495 492546 492831 493145 493354 493854 495307 497974 501468 505087 508306 511148 514261 518446
59977 518446 523841 529580 534420 537684 539545 540490 540760 540347 539351 538218 537528 537531 537881 537969 537540 536966 536841 537376
59959 537376 538268 539097 539781 540562 541662 543043 544528 545999 547399 548617 549482 549804 549326 547786 545222 542122
59943 542122 539058 536214 533571 531426 530298 530235 530615 530760 530365 529199 526904 523472 519564 515999 513140
59928 513140 510996 509560 508735 508291 508297 509297 511600 514707 517822 520645 523256 525595 527644 529807 532421
59913 532421 535086 537092 538352 539298 540118 540815 541779 543426 545337 546639 547239 547697 547873 546796 544244 541406
$$ packed form
60023E72313j663k261k481k384k195k502l632m961n465n051m608m696m862m553
60009E20999l945l477l124k673k225j957j742j434j195j175j127q59o42p47r16
59994D93761p35l30j12q9N1K85L14K09N00J453K667L494L619L219K842L113M185
59977E18446N395N739M840L264J861R45K70m13r96j133o90LL50Q8m29n74j25N35
59959E37376Q92Q29O84P81J100J381J485J471J400J218Q65L22m78j540k564l100
59943E42122l064k844k643k145j128o3L80J45l95j166k295l432l908l565k859
59928E13140k144j436q25m44OJ000K303L107L115K823K611K339K049K163K614
59913E32421K665K006J260R46Q20O97R64J647J911J302O00M58J76j077k552k838
$$ plain form
59897 541406 539449 538322 537520 537108 537244 537515 537668 538390 540367 543013 545135 546686 548851 552489 557331 562856
59881 562856 569087 576218 584063 592186 600258 608077 615549 622827 630164 637499 644305 649882 653637 655253
59867 655253 654940 653514 651780 649763 646825 642593 637439 631974 626494 621122 616114 611604 607243 602550
59853 602550 597674 593401 590207 587555 584530 581089 578247 576908 576945 577733 579133 581459 584753 588910 594505
59838 594505 602718 614090 627892 642972 658557 673793 687172 697280 703939 708086 710773 712865
59826 712865 715420 719431 724822 730073 733025 731935 725980 715326 700905 683836 664993 645231 625717
59813 625717 607509 590852 575450 561496 549861 541095 534716 529733 525476 521628 517891 514092 510466
59800 510466 507404 504920 502578 499973 497127 494390 492026 489885 487576 485015 482692 481135 480150 478918
$$ packed form
59897E41406j957j127q02m12J36K71J53P22J977K646K122J551K165L638M842N525
59881E62856O231P131P845Q123Q072P819P472P278P337P335O806N577L755J616
59867F55253l13j426j734k017k938m232n154n465n480n372n008m510m361m693
59853F02550m876m273l194k652l025l441k842j339L7P88J400K326L294M157N595
59838E94505Q213J1372J3802J5080J5585J5236J3379J0108O659M147K687K092
59826G12865K555M011N391N251K952j090n955j0654j4421j7069j8843j9762j9514
59813F25717j8208j6657j5402j3954j1635q766o379m983m257l848l737l799l626
59800E10466l062k484k342k605k846k737k364k141k309k561k323j557r85j232
$$ plain form
59786 478918 476913 474442 472117 470130 468319 466727 465640 465070 464540 463574 462222 460932 459998 459375 459034 459241
59770 459241 460210 461568 462452 462240 460987 459139 457114 455345 454403 454668 455895 457351 458323 458401 457552 456283
59754 456283 455612 456389 458558 461348 464179 467112 470461 474391 478948 484043 489216 493746 497295 500213 502996
59739 502996 505652 507815 509276 510128 510532 510607 510552 510685 511259 512265 513321 513790 513175 511559 509533 507586 505644
59722 505644 503302 500482 497715 495778 495009 494946 494723 493954 493147 493076 493858 494942 495939 496995 498277 499547 500574
59705 500574 501614 503095 505016 507037 509009 511059 513243 515510 518003 521000 524465 527981 531278 534594
59691 534594 538370 542770 547584 552385 556628 559818 561810 562863 563254 562920 561703 559859 558071 556895 556345
59676 556345 556083 555861 555649 555444 555131 554586 553839 553091 552492 551865 550674 548478 545492 542518 540149 538140 535746
$$ packed form
59786D78918k005k471k325j987j811j592j087n70n30r66j352j290r34o23l41K07
59770D59241R69J358Q84k12j253j848k025j769r42K65J227J456R72P8q49j269
59754D56283o71P77K169K790K831K933L349L930M557N095N173M530L549K918K783
59739E02996K656K163J461Q52M04P5n5J33N74J006J056M69o15j616k026j947j942
59722E05644k342k820k767j937p69o3k23p69q07p1P82J084R97J056J282J270J027
59705E00574J040J481J921K021J972K050K184K267K493K997L465L516L297L316
59691E34594L776M400M814M801M243L190J992J053L91l34j217j844j788j176n50
59676E56345k62k22k12k05l13n45p47p48n99o27j191k196k986k974k369k009k394
$$ plain form
59659 535746 532669 529405 526659 524666 523199 522037 521247 521113 521912 523747 526542 530209 534758 540022 545304
59644 545304 549600 552311 553517 553437 551966 549035 545144 541105 537308 533568 529666 525763 522288 519650 518002
59629 518002 517015 516021 514713 513618 513465 514123 514673 514564 514207 514220 514593 514965 515363 516241 517847 519846 521494
59612 521494 522081 521430 520095 518794 517486 515347 511901 507824 504243 501593 499631 498272 497712 497797 497971 498020
59596 498020 498316 499059 499787 499896 499306 498263 496870 495190 493540 492198 490996 489702 488669 488573 489362 490025
59580 490025 489675 488512 487381 486646 485896 484605 482604 479854 476249 471909 467491 463868 461501 460155 459195
59565 459195 458105 456865 455929 455722 456100 456429 456305 455996 456012 456432 456874 456982 456661 456016 455425 455535 456729 458568
59547 458568 460200 461385 462607 464131 465580 466805 468530 471596 476017 481450 488208 496952 507557 519322
$$ packed form
59659E35746l077l264k746j993j467j162p90j34P99J835K795L667M549N264N282
59644E45304M296K711J206q0j471k931l891m039l797l740l902l903l475k638j648
59629E18002r87r94j308j095j53O58N50j09l57J3L73L72L98Q78J606J999J648
59612E21494N87o51j335j301j308k139l446m077l581k650j962j359n60Q5J74M9
59596D98020K96P43P28J09n90j043j393j680j650j342j202j294j033r6P89O63
59580D90025l50j163j131p35p50j291k001k750l605m340m418l623k367j346r60
59565D59195j090j240r36k07L78L29j24l09J6M20M42J08l21o45n91J10J194J839
59547D58568J632J185J222J524J449J225J725L066M421N433O758Q744J0605J1765
$$ plain form
59533 519322 532448 548288 567411 587984 606729 621181 630485 634469 633052 626958 618365 610190 604523
59520 604523 601767 601110 601718 603512 606881 611802 617440 622735 627173 630751 633371 634604 634008 631385 626719
59505 626719 620191 612307 603709 594745 585475 576177 567501 559919 553290 547163 541260 535475 529812 524666
59491 524666 520817 518575 517086 515072 512271 509658 508205 507944 508373 509213 510458 512158 514518 517874 522208
59476 522208 527009 532008 537752 544947 553493 562738 572479 582944 593767 603692 611655 617567 621684 623678
59462 623678 622895 619380 614257 609202 605725 604619 605669 608063 611495 616682 624405 634336 645525 657963
59448 657963 672821 690838 711166 732295 753543 774961 796111 815603 831749 843131 848705 848043
59436 848043 841645 830526 815461 797106 776828 756604 737675 719832 702433 685640 670123 655996
$$ packed form
59533E19322J3126J5840J9123K0573J8745J4452R304L984j417o094q593q175n667
59520F04523k756o57O08J794L369M921N638N295M438L578K620J233n96k623m666
59505F26719o528p884q598q964r270r298q676p582o629o127n903n785n663n146
59491E24666l849k242j489k014k801k613j453k61M29Q40J245J700K360L356M334
59476E22208M801M999N744P195Q546R245R741J0465J0823R925P963N912M117J994
59462F23678p83l515n123n055l477j106J050K394L432N187P723R931J1189J2438
59448F57963J4858J8017K0328K1129K1248K1418K1150J9492J6146J1382N574o62
59436H48043o398j1119j5065j8355k0278k0224j8929j7843j7399j6793j5517j4127
$$ plain form
59424 655996 642780 630299 619014 609555 602475 598456 598106 601327 607307 615372 625552 638211 653495
59411 653495 671417 692253 716485 744119 773886 803029 828174 846832 858074 861721 857453 845481
59399 845481 827943 808760 791824 779611 773192 772279 774742 777050 776174 770861 760720 744993 723247
59386 723247 696897 668918 641950 617245 595271 576336 560368 546866 535445 526061 518522 512306
59374 512306 507145 503334 501152 500237 499838 499476 499164 499134 499524 500275 501304 502746 504860 507468 509793 511231
59358 511231 512103 513204 514745 516394 518243 521020 525150 530357 536455 543828 552722 562685 573262 584798
59344 584798 597940 612665 628426 645018 662722 681670 701608 722176 742904 762950 781378
59333 781378 797777 812140 824060 832518 836742 837005 834341 829656 823277 815172 805362 794113 781837
$$ packed form
59424F55996j3216j2481j1285r459p080m019l50L221N980Q065J0180J2659J5284
59411F53495J7922K0836K4232K7634K9767K9143K5145J8658J1242L647m268j1972
59399H45481j7538j9183j6936j2213o419r13K463K308q76n313j0141j5727k1746
59386G23247k6350k7979k6968k4705k1974j8935j5968j3502j1421r384p539o216
59374E12306n161l811k182r15l99l62l12l0L90P51J029J442K114K608K325J438
59358E11231Q72J101J541J649J849K777M130N207O098P373Q894R963J0577J1536
59344E84798J3142J4725J5761J6592J7704J8948J9938K0568K0728K0046J8428
59333G81378J6399J4363J1920Q458M224K63k664m685o379q105r810j1249j2276
$$ plain form
59320 781837 768878 755466 741941 728838 716557 704971 693680 682721 672815 664749 658626 653805
59308 653805 649440 645018 640581 636677 634062 633176 633742 634955 636204 637546 639403 641884 644690 647739 651546
59293 651546 656696 663085 670139 677821 687033 698846 713713 731721 753299 778923 807776 836930
59281 836930 862255 880378 889908 891031 884437 871033 852605 832102 812648 796219 783485 774749
59269 774749 770462 770676 774546 780841 788841 798456 809646 822025 834887 847307 858274 867061 873452
59256 873452 877375 878326 875600 869171 859989 849110 836833 823073 808454 794462 782307 771912 762343
59243 762343 753009 744064 735732 727771 719880 712318 705834 701126 698532 697950 698676 699564 699870 699975 700857 702846
59227 702846 705289 707420 709033 710131 710415 709433 706921 702734 696717 688938 679821 669817 659186 648311
$$ packed form
59320G81837j2959j3412j3525j3103j2281j1586j1291j0959r906q066o123m821
59308F53805m365m422m437l904k615q86N66J213J249J342J857K481K806L049L807
59293F51546N150O389P054P682R212J1813J4867J8008K1578K5624K8853K9154
59281H36930K5325J8123R530J123o594j3404j8428k0503j9454j6429j2734q736
59269G74749m287K14L870O295Q000R615J1190J2379J2862J2420J0967Q787O391
59256H73452L923R51k726o429r182j0879j2277j3760j4619j3992j2155j0395r569
59243G62343r334q945q332p961p891p562o484m708k594n82P26Q88L06J05Q82J989
59227G02846K443K131J613J098K84r82k512m187o017p779r117j0004j0631j0875
$$ plain form
59213 648311 637850 628200 619057 609923 600885 592493 585079 578591 572946 568062 563550 558884 554026 549545
59199 549545 545961 543237 541027 539179 537781 536825 536029 535092 534155 533920 535103 537667 540806 543807 546706
59184 546706 549917 553522 557260 560935 564438 567548 570256 573199 577209 582370 587990 593577 599297 605303
59170 605303 611265 616999 623117 630454 639044 648119 657020 665684 674280 682929 691970 702075 713656 726234
59156 726234 738621 749738 759130 766767 772663 776863 779575 780979 780883 778878 774948 769689 763725 757132
59142 757132 749741 741903 734521 728232 722820 717563 711932 705804 699292 692673 686477 681321 677511 674809
59128 674809 672640 670539 668433 666622 665569 665665 667123 669989 674269 680057 687470 696372 706253 716594
59114 716594 727430 739355 752876 767863 783750 800007 816271 832176 847391 861754 875089
$$ packed form
59213F48311j0461r650r143r134r038q392p414o488n645m884m512m666m858m481
59199E49545l584k724k210j848j398r56p96r37r37k35J183K564L139L001K899
59184E46706L211L605L738L675L503L110K708K943M010N161N620N587N720O006
59170F05303N962N734O118P337Q590R075Q901Q664Q596Q649R041J0105J1581J2578
59156G26234J2387J1117R392P637N896M200K712J404r6k005l930n259n964o593
59142G57132p391p838p382o289n412n257n631o128o512o619o196n156l810k702
59128F74809k169k101k106j811j053R6J458K866M280N788P413Q902R881J0341
59114G16594J0836J1925J3521J4987J5887J6257J6264J5905J5215J4363J3335
$$ plain form
59103 875089 886907 896642 904287 910572 916289 921523 925636 927959 928416 927476 925668 923308 920724 918447
59089 918447 916735 914953 911924 907228 901817 896940 892692 888026 881982 874389 865457 855333 844207 832296
59075 832296 819442 805139 789203 772212 755115 738739 723720 710414 698565 687502 676997
59064 676997 667537 659407 651998 644659 637793 632315 628151 624189 619840 615850 613189 611740 610533 608827
59050 608827 606489 603620 600380 597121 594295 592213 591014 590661 590750 590629 590068 589546 589430 589184 588011 586155
59034 586155 584841 584818 585693 586944 588847 591887 595779 599771 603699 608149 613635 620133 627446 635586 644647
59019 644647 654568 665195 676436 688339 700963 714028 726594 737378 745600 751341 754947 756495
59007 756495 756180 754738 752912 750761 748142 745648 744317 744498 745722 747689 750621 754527 758915 763505 768564
$$ packed form
59103H75089J1818R735P645O285N717N234M113K323M57r40j808k360k584k277
59089I18447j712j782l029m696n411m877m248m666o044p593q932j0124j1126j1911
59075H32296j2854j4303j5936j6991j7097j6376j5019j3306j1849j1063j0505
59064F76997r460q130p409p339o866n478m164l962m349l990k661j449j207j706
59050F08827k338k869l240l259k826k082j199l53Q9j21n61n22j16k46j173j856
59034E86155j314k3Q75J251J903L040L892L992L928M450N486O498P313Q140R061
59019F44647R921J0627J1241J1903J2624J3065J2566J0784Q222N741L606J548
59007G56495l15j442j826k151k619k494j331J81J224J967K932L906M388M590N059
$$ plain form
58992 768564 774244 780178 785997 791573 796418 799594 800632 799884 797479 792705 785124 775654 765712 755773
58978 755773 745537 735100 725043 715689 707226 700332 695709 693002 691133 689842 690131 693048 698752 706842
58964 706842 716793 727800 739009 750351 762600 776168 790252 803433 814751 823927 831020 836171
58952 836171 839279 839618 836142 828514 817592 804705 790737 776120 761290 746765 732968 720169
58940 720169 708454 697612 687400 678091 670403 664667 660411 656992 654238 652108 650142 647748 644803
58927 644803 641512 637832 633535 628824 624339 620392 616509 611987 606799 601771 597923 595663 594593 593947
58913 593947 593152 592051 590883 590214 590696 592613 595695 599572 604255 609880 616188 622799 630035 638896 649975
58898 649975 662830 676639 691091 706291 722108 738060 753673 768701 783117 797143 811146
$$ packed form
58992G68564N680N934N819N576M845L176J038p48k405m774p581r470r942r939
58978G55773j0236j0437j0057r354q463o894m623k707j869j291K89K917N704Q090
58964G06842R951J1007J1209J1342J2249J3568J4084J3181J1318R176P093N151
58952H36171L108L39l476p628j0922j2887j3968j4617j4830j4525j3797j2799
58940G20169j1715j0842j0212r309p688n736m256l419k754k130j966k394k945
58927F44803l291l680m297m711m485l947l883m522n188n028l848k260j070o46
58913E93947p95j101j168o69M82J917L082L877M683N625O308O611P236Q861J1079
58898F49975J2855J3809J4452J5200J5817J5952J5613J5028J4416J4026J4003
$$ plain form
58887 811146 825383 840011 855533 872872 892665 914595 937582 960417 981963 1001186 1017541
58876 1017541 1031257 1042704 1051410 1056084 1055739 1050483 1041143 1028482 1013078 995684 977292 958792
58864 958792 940759 923637 907877 893688 880692 868022 854908 841194 827304 813775 800785
58853 800785 787986 774759 760789 746445 732466 719242 706645 694555 683173 672608 662585
58842 662585 652947 644077 636302 629174 621958 614701 608111 602391 596946 591382 586089 581485 577360 573439
58828 573439 570073 567662 565654 562818 558579 553679 549433 546600 545041 544256 543954 544090 544506 544836 544938 545184
58812 545184 546084 547703 549761 552180 555176 558823 562895 567074 570974 574009 575689 576133 575913 575429 574770
58797 574770 574044 573268 571994 569754 566919 564470 562765 561293 559816 558950 559194 560127 561089 562049 563312 564963
$$ packed form
58887H11146J4237J4628J5522J7339J9793K1930K2987K2835K1546J9223J6355
58876A017541J3716J1447Q706M674l45n256r340j2661j5404j7394j8392j8500
58864I58792j8033j7122j5760j4189j2996j2670j3114j3714j3890j3529j2990
58853H00785j2799j3227j3970j4344j3979j3224j2597j2090j1382j0565j0023
58842F62585r638q870p775p128p216p257o590n720n445n564n293m604m125l921
58828E73439l366k411k008k836m239m900m246k833j559p85l02J36M16L30J02K46
58812E45184R00J619K058K419K996L647M072M179L900L035J680M44k20m84o59
58797E74770p26p76j274k240k835k449j705j472j477q66K44R33R62R60J263J651
$$ plain form
58781 564963 567141 570328 574759 580004 585670 592065 599613 608033 616560 624495 631038 635211 636764 636669 635952
58766 635952 634463 631568 627540 623233 618703 613280 606920 600424 594243 588041 581627 575486 570149 565791
58752 565791 562669 561254 561643 563433 566349 570389 575184 579905 584077 587928 591757 595644 600040 605854
58738 605854 613426 621981 630638 639475 649055 659282 669368 678712 687220 694974 702159 709365 717360 726270
58724 726270 735290 743489 750828 758094 765808 773459 780089 785625 791245 798310 807178 817253 827792 838302
58710 838302 848479 858297 868054 877767 886571 893183 896988 898198 896945 892774 885191 874206 860148
58697 860148 843329 824115 803024 780598 757419 734240 711749 690171 669531 650350 633497
58686 633497 619239 607007 596317 587253 579653 572542 565040 557467 550741 544930 539117 532789 526645
$$ packed form
58781E64963K178L187M431N245N666O395P548Q420Q527P935O543M173J553r5p17
58766F35952j489k895m028m307m530n423o360o496o181o202o414o141n337m358
58752E65791l122j415L89J790K916M040M795M721M172L851L829L887M396N814
58738F05854P572Q555Q657Q837R580J0227J0086R344Q508P754P185P206P995Q910
58724G26270R020Q199P339P266P714P651O630N536N620P065Q868J0075J0539J0510
58710H38302J0177R818R757R713Q804O612L805J210j253m171p583j0985j4058
58697H60148j6819j9214k1091k2426k3179k3179k2491k1578k0640j9181j6853
58686F33497j4258j2232j0690r064p600p111p502p573o726n811n813o328o144
$$ plain form
58673 526645 521754 518353 515869 513886 512715 513011 515050 518513 522959 528423 535430 544368 554918 566114
58659 566114 576888 586469 594431 600618 605146 608296 610188 610578 609174 606230 602560 598743 594550 589503
58645 589503 583894 578695 574396 570466 566256 561906 557921 554262 550476 546514 542823 539626 536645 533615
58631 533615 530716 528442 527277 527395 528321 528980 528503 527048 525498 524449 523854 523601 523926 525199 527649 531372
58615 531372 536288 542094 548603 556039 564626 574019 583645 593455 603657 613681 622203 628445 632803 635906
58601 635906 637706 637980 637160 636064 635076 634084 632933 631491 629467 626684 623480 620486 618040 616158 615018
58586 615018 615146 617037 620710 625704 631467 637854 645295 654379 665195 677093 689091 700413 710723
58573 710723 720099 728819 736987 744350 750638 756106 761515 767624 774950 783918 794833 807581 821735
$$ packed form
58673E26645m891l401k484j983j171K96K039L463M446N464P007Q938J0550J1196
58659E66114J0774R581P962O187M528L150J892L90j404k944l670l817m193n047
58645E89503n609n199m299l930m210m350l985l659l786l962l691l197k981l030
58631E33615k899k274j165J18R26O59m77j455j550j049n95k53L25J273K450L723
58615E31372M916N806O509P436Q587R393R626R810J0202J0024Q522O242M358L103
58601F35906J800K74q20j096r88r92j151j442k024k783l204k994k446j882j140
58586F15018J28J891L673M994N763O387P441R084J0816J1898J1998J1322J0310
58573G10723R376Q720Q168P363O288N468N409O109P326Q968J0915J2748J4154
$$ plain form
58560 821735 837129 854068 872806 893039 914009 934863 954685 972363 986659 996578 1001856 1003174
58548 1003174 1001646 997878 991682 982968 972512 961390 949929 937859 925313 912900 900788 888464
58536 888464 875517 861918 847397 831394 814026 796435 779670 763808 748626 734612 722682
58525 722682 713254 706099 700824 697066 694473 692904 692408 692720 693073 692930 692612 692823 693769 695123 696586 698062
58509 698062 699453 700675 701813 703004 704299 705826 707831 710278 712667 714557 716083 717654 719366 721027
58495 721027 722586 724165 725718 726946 727539 727359 726420 724803 722569 719819 716949 714691 713563 713399 713819
58480 713819 715065 717758 721917 726944 732753 740082 749240 759254 768820 777611 786105 794468 802133 808201
58466 808201 811813 812430 810127 805446 798847 790702 781913 773785 766907 760879 755592 752015 750983 751967 753968
$$ packed form
58560H21735J5394J6939J8738K0233K0970K0854J9822J7678J4296R919N278J318
58548A003174j528l768o196q714j0456j1122j1461j2070j2546j2413j2112j2324
58536H88464j2947j3599j4521j6003j7368j7591j6765j5862j5182j4014j1930
58525G22682r428p155n275l758k593j569m96L12L53j43l18K11R46J354J463J476
58509F98062J391J222J138J191J295J527K005K447K389J890J526J571J712J661
58495G21027J559J579J553J228N93j80r39j617k234k750k870k258j128j64M20
58480G13819J246K693M159N027N809P329R158J0014R566Q791Q494Q363P665O068
58466H08201L612O17k303m681o599q145q789q128o878o028n287l577j032R84K001
$$ plain form
58451 753968 757068 762036 768700 775839 782560 788773 794250 798282 800491 801166 800458 798006 793787 788741 784022
58436 784022 780029 776621 773999 772792 773216 774519 775594 776162 777166 779810 784317 789918 795919 802307 809282
58421 809282 816816 825001 834277 844799 855855 866345 875592 883364 889489 893892 896743 898161 898047 896578
58407 896578 894481 892369 890075 887070 883186 878504 873030 867149 862037 858794 857286 856473 855734 855289 855489
58392 855489 856389 857956 860067 862308 864307 866214 868309 870245 871349 871654 872042 873271 875408 878265 881838
58377 881838 886121 890876 895802 900672 905257 909394 913120 916593 919912 923203 926704 930622 935116 940515
58363 940515 947157 954806 962757 970885 980031 990910 1003161 1016017 1029227 1042529 1054811 1064938
58351 1064938 1073247 1081169 1089311 1096714 1102120 1105385 1107575 1110110 1113801 1118310 1122708 1126895 1132063 1139383
$$ packed form
58451G53968L100M968O664P139O721O213N477M032K209O75p08k452m219n046m719
58436G84022l993l408k622j207M24J303J075N68J004K644M507N601O001O388O975
58421H09282P534Q185R276J0522J1056J0490R247P772O125M403K851J418j14j469
58407H96578k097k112k294l005l884m682n474n881n112l243j508q13p39m45K00
58392H55489R00J567K111K241J999J907K095J936J104L05L88J229K137K857L573
58377H81838M283M755M926M870M585M137L726L473L319L291L501L918M494N399
58363I40515O642P649P951Q128R146J0879J2251J2856J3210J3302J2282J0127
58351A064938Q309P922Q142P403N406L265K190K535L691M509M398M187N168P320
$$ plain form
58337 1139383 1148782 1159558 1171456 1184231 1196894 1208672 1220407 1233744 1248994 1264906 1280440
58326 1280440 1295612 1310635 1325401 1339944 1354302 1367757 1379243 1388692 1397023 1404694 1411365 1417193
58314 1417193 1423326 1430645 1438891 1447427 1456067 1464860 1473885 1483640 1494905 1507882 1522067 1537139 1553283
58301 1553283 1570484 1588306 1606534 1625356 1644772 1664471 1684290 1704095 1723380 1741880 1760429
58290 1760429 1780124 1800763 1821350 1842037 1864106 1887846 1912046 1936022 1960675 1986881 2014204
58279 2014204 2042011 2070660 2100709 2131998 2164343 2198244 2234115 2271617 2310417 2350806 2392929
58268 2392929 2436294 2480672 2526645 2574642 2624342 2675676 2729504 2786621 2846975 2910494 2977681
58257 2977681 3048571 3121951 3196458 3271691 3347563 3423424 3498731 3573953 3650131 3728098 3808640
$$ packed form
58337A139383R399J0776J1898J2775J2663J1778J1735J3337J5250J5912J5534
58326A280440J5172J5023J4766J4543J4358J3455J1486R449Q331P671O671N828
58314A417193O133P319Q246Q536Q640Q793R025R755J1265J2977J4185J5072J6144
58301A553283J7201J7822J8228J8822J9416J9699J9819J9805J9285J8500J8549
58290A760429J9695K0639K0587K0687K2069K3740K4200K3976K4653K6206K7323
58279B014204K7807K8649L0049L1289L2345L3901L5871L7502L8800M0389M2123
58268B392929M3365M4378M5973M7997M9700N1334N3828N7117O0354O3519O7187
58257B977681P0890P3380P4507P5233P5872P5861P5307P5222P6178P7967Q0542
$$ plain form
58246 3808640 3892666 3980713 4073019 4170461 4274455 4385566 4503288 4627681 4760004 4901128
58236 4901128 5050616 5208094 5374299 5550089 5735735 5932051 6140876 6363577 6600334
58227 6600334 6851795 7120035 7406970 7713282 8039972 8389656 8765344 9169454 9604941
58218 9604941 10075713 10584960 11135135 11731035 12381005 13093725 13875899 14734747 15680655
58209 15680655 16725781 17882905 19168445 20605021 22219614 24042697 26112949 28481658
58201 28481658 31211499 34376649 38071273 42419337 47576937 53733153 61118434 70014068
58193 70014068 80754043 93730044 109412032 128359654 151162214 178251662 209586376
58186 209586376 244291551 280441082 315186608 345279953 367768688 380535401 382540814
$$ packed form
58246C808640Q4026Q8047R2306R7442J03994J11111J17722J24393J32323J41124
58236D901128J49488J57478J66205J75790J85646J96316K08825K22701K36757
58227F600334K51461K68240K86935L06312L26690L49684L75688M04110M35487
58218I604941M70772N09247N50175N95900O49970P12720P82174Q58848R45908
58209A5680655J045126J157124J285540J436576J614593J823083K070252K368709
58201B8481658K729841L165150L694624M348064N157600O156216P385281Q895634
58193G0014068J0739975J2976001J5681988J8947622K2802560K7089448L1334714
58186B09586376L4705175L6149531L4745526L0093345K2488735J2766713K005413
$$ plain form
58179 382540814 373891949 355858601 330741689 301430558 270737428 240855748 213203354
58172 213203354 188583572 167415612 149882182 135989842 125558654 118149822 113013169
58165 113013169 109177157 105681386 101789985 97050553 91248518 84391895 76740224 68763439
58157 68763439 60977438 53761249 47290554 41594783 36639520 32365772 28699410 25562456
58149 25562456 22884540 20602525 18655911 16989751 15559484 14328288 13261954 12329904
58141 12329904 11508386 10778155 10120299 9517869 8960271 8442358 7959696 7507694 7084596
58132 7084596 6691747 6330246 5999432 5698466 5426877 5183041 4963870 4766177 4586665
58123 4586665 4420648 4262703 4109013 3957800 3807738 3657910 3509528 3365716 3228834
$$ packed form
58179C82540814q648865j8033348k5116912k9311131l0693130k9881680k7652394
58172B13203354k4619782k1167960j7533430j3892340j0431188p408832n136653
58165A13013169l836012l495771l891401m739432n802035o856623p651671p976785
58157F8763439p786001p216189o470695n695771m955263m273748l666362l136954
58149B5562456k677916k282015j946614j666160j430267j231196j066334r32050
58141A2329904q21518p30231o57856o02430n57598n17913m82662m52002m23098
58132G084596l92849l61501l30814l00966k71589k43836k19171j97693j79512
58123D586665j66017j57945j53690j51213j50062j49828j48382j43812j36882
$$ plain form
58114 3228834 3099227 2976806 2862229 2755923 2657295 2565569 2480306 2400659 2325331 2253812
58104 2253812 2186536 2123343 2062869 2004085 1947364 1893349 1841732 1791831 1743444 1696444 1650355
58093 1650355 1605163 1561939 1521858 1485083 1451166 1419929 1391240 1364436 1338770 1314205 1291127
58082 1291127 1269376 1248035 1226120 1203215 1179623 1156162 1133628 1112262 1091754 1071628 1051386
58071 1051386 1030508 1008986 987791 968110 950027 932564 915071 897871 881419 865804 851420
58060 851420 839204 829537 821502 813785 805798 797475 788589 778973 768921 758733 748253 737456 727095
58047 727095 718026 710103 702417 694469 686445 678458 670202 661510 652730 644325 636425 628914 621731 614899
58033 614899 608351 601875 595246 588403 581351 573791 565063 554835 543834 533419 524300 516052 507962
$$ packed form
58114C228834j29607j22421j14577j06306r8628r1726q5263p9647p5328p1519
58104B253812o7276o3193o0474n8784n6721n4015n1617m9901m8387m7000m6089
58093A650355m5192m3224m0081l6775l3917l1237k8689k6804k5666k4565k3078
58082A291127k1751k1341k1915k2905k3592k3461k2534k1366k0508k0126k0242
58071A051386k0878k1522k1195j9681j8083j7463j7493j7200j6452j5615j4384
58060H51420j2216r667q035p717p987q323q886r616j0052j0188j0480j0797j0361
58047G27095r069p923p686p948q024p987q256q692q780q405p900p511p183o832
58033F14899o548o476o629o843p052p560q728j0228j1001j0415r119q248q090
$$ plain form
58020 507962 499917 492230 485056 478351 472100 466221 460490 454814 449412 444540 440296 436823 434309 432524
58006 432524 430769 428612 426371 424544 423078 421557 419757 417612 415001 412026 409295 407405 406355 405912
57992 405912 406319 408138 411530 416197 421867 428309 434995 441323 447141 452535 457162 460392 462152 463077 463709
57977 463709 464081 464171 464055 463364 461224 457264 452273 447422 443154 439245 435573 432161 428639 424346 419157
57962 419157 413754 408962 405138 402339 400611 399776 399129 397747 395157 391598 387752 384355 381857 380141 378574
57947 378574 376623 374460 372705 371610 370866 370385 370813 372840 376266 380197 384054 387924 391985 396146 400426
57932 400426 405137 410403 415863 421199 426632 432524 438696 444574 449850 454587 458766 462177 464789 466808
57918 466808 468239 468698 467826 465617 462192 457491 451435 444253 436372 428009 419037 409337 399225 389427
$$ packed form
58020E07962q045p687p174o705o251n879n731n676n402m872m244l473k514j785
58006D32524j755k157k241j827j466j521j800k145k611k975k731j890j050m43
57992D05912M07J819L392M667N670O442O686O328N818N394M627L230J760R25O32
57977D63709L72R0j16o91k140l960m991m851m268l909l672l412l522m293n189
57962D19157n403m792l824k799j728q35o47j382k590l559l846l397k498j716j567
57947C78574j951k163j755j095p44m81M28K027L426L931L857L870M061M161M280
57932D00426M711N266N460N336N433N892O172N878N276M737M179L411K612K019
57918D66808J431M59q72k209l425m701o056p182p881q363q972r700j0112r798
$$ plain form
57904 389427 380538 372463 364439 355748 346367 336861 327738 319161 311207 304055 297723 291908 286363 281319
57890 281319 277278 274427 272465 270993 269883 269317 269650 271245 274117 277691 281186 284400 287876 292078 296643
57875 296643 300779 304293 307777 311708 315779 319339 322219 324720 326910 328328 328535 327712 326486 325268 323973
57860 323973 322462 321030 320201 320060 320054 319634 318904 318379 318305 318611 319465 321296 324093 327142 329937 332995 337243
57843 337243 342792 348820 354613 360114 365324 369776 372974 374974 376133 376500 375879 374371 372366 369941 366605
57828 366605 361870 355975 349847 344416 339992 336235 332595 328835 325305 322750 321679 321827 322403 323071 324540
57813 324540 327831 332911 338470 343199 346900 350090 352958 355298 357201 359055 360730 361328 360045 356858
57799 356858 352103 345775 337678 328098 317921 307989 298532 289184 279514 269616 260194 252011 245251 239584
$$ packed form
57904C89427q889q075q024q691r381r506r123q577p954p152o332n815n545n044
57890B81319m041k851j962j472j110n66L33J595K872L574L495L214L476M202M565
57875B96643M136L514L484L931M071L560K880K501K190J418K07q23j226j218j295
57860C23973j511j432q29j41om20p30n25p4L06Q54J831K797L049K795L058M248
57843C37243N549O028N793N501N210M452L198K000J159L67o21j508k005k425l336
57828C66605m735n895o128n431m424l757l640l760l530k555j071J48N76O68J469
57813C24540L291N080N559M729L701L190K868K340J903J854J675N98j283l187
57799C56858m755o328q097r580j0177r932r457r348r670r898r422q183o760n667
$$ plain form
57785 239584 234719 230548 226785 223050 219510 216914 215636 215126 214739 214707 215677 217601 219770 221879 224346
57770 224346 227586 231589 236420 242445 249699 257462 264822 271395 277173 282044 285862 288739 290798 291724
57756 291724 291006 288703 285632 282568 279438 275451 270024 263461 256661 250224 244082 238098 232766 228896
57742 228896 226637 225254 223937 222398 220526 218021 214844 211637 209105 207137 205102 202854 200822 199137
57728 199137 197347 195206 193137 191637 190725 190405 191193 193594 197259 201090 204112 205954 206693 206648 206229 205628
57712 205628 204731 203614 202891 203040 203542 203320 202105 200799 200300 200479 200597 200263 199577 198708 197762 196945 196524 196706
57694 196706 197663 199389 201356 202679 203039 203143 203861 205103 205979 205949 205410 205191 205889 207618 209961 212165 213844
57677 213844 215652 218969 224877 233715 245607 260974 280361 304220 333225 368776 413105 468840
$$ packed form
57785B39584m865m171l763l735l540k596j278n10l87l2R70J924K169K109K467
57770B24346L240M003M831O025P254P763P360O573N778M871L818K877K059R26
57756B91724p18k303l071l064l130l987n427o563o800o437o142n984n332l870
57742B28896k259j383j317j539j872k505l177l207k532j968k035k248k032j685
57728A99137j790k141k069j500r12l20P88K401L665L831L022J842P39m5m19o01
57712B05628q97j117p23J49N02k22j215j306m99J79J18l34o86q69r46q17m21J82
57694A96706R57J726J967J323L60J04P18J242Q76l0n39k19O98J729K343K204J679
57677B13844J808L317N908Q838J1892J5367J9387K3859K9005L5551M4329N5735
$$ plain form
57665 468840 537943 619967 710572 801776 884100 949014 990283 1004355 990559 951211 891388
57654 891388 818286 739989 663530 593131 530107 474398 425981 384863 350558 322234 299178
57643 299178 280735 266058 254352 245188 238183 232590 227643 223154 219334 216168 213481 211429 210354
57630 210354 210130 210172 210148 210175 210260 210099 209594 209022 208451 207456 205722 203582 201631 200113 198905 197823 196653 195136
57612 195136 193172 190809 187891 184097 179595 175186 171405 167905 164226 160832 158609 157581 156867 155972 155334
57597 155334 155409 155890 156257 156490 156726 156637 155800 154529 153694 153641 153739 153162 151794 150143 148601 147092 145428 143766
57579 143766 142564 142096 142154 142298 142279 142054 141484 140323 138653 137068 136114 135595 134650 132574 129511 126368 124118
57562 124118 123055 122596 121846 120469 118942 117969 117821 118401 119589 121171 122616 123450 123839 124371 125210 125947 126437
$$ packed form
57665D68840O9103Q2024R0605R1204Q2324O4914M1269J4072j3796l9348n9823
57654H91388p3102p8297p6459p0399o3024n5709m8417m1118l4305k8324k3056
57643B99178j8443j4677j1706r164p005n593m947m489l820l166k687k052j075
57630B10354k24M2k4K7Q5j61n05n72n71r95j734k140j951j518j208j082j170j517
57612A95136j964k363k918l794m502m409l781l500l679l394k223j028p14q95o38
57597A55334P5M81L67K33K36q9q37j271q35n3R8n77j368j651j542j509j664j662
57579A43766j202m68N8J44j9k25n70j161j670j585r54n19r45k076l063l143k250
57562A24118j063m59p50j377j527r73j48N80J188J582J445Q34L89N32Q39P37M90
$$ plain form
57545 126437 127174 128508 129965 130842 131163 131464 131833 131777 131103 130309 129977 130156 130578 131062 131437 131391 130714 129560
57527 129560 128189 126555 124425 121786 118853 115719 112286 108683 105536 103612 103139 103556 103996 104082 104295 105553
57511 105553 108375 112412 116720 120506 123671 126755 130345 134560 139053 143428 147485 151051 153849 155715
57497 155715 156764 157114 156629 155225 153352 151776 150822 150144 149293 148192 146996 145843 144878 144195 143525 142311
57481 142311 140391 138373 137017 136397 135935 135105 133847 132435 131245 130573 130377 130244 129837 129316 129121 129397 129941
57464 129941 130542 131101 131508 131720 131950 132405 132852 132855 132505 132479 133169 134089 134451 134113 133682 133821 134701 136047 137459
57445 137459 138632 139438 139873 139948 139613 138808 137581 136195 135154 134986 135866 137442 139140 140567 141507 141723 141159
57428 141159 140325 140091 140907 142361 143636 144178 143926 143232 142765 143153 144362 145535 145736 144809 143368 142105 141345
$$ packed form
57545A26437P37J334J457Q77L21L01L69n6o74p94l32J79M22M84L75m6o77j154
57527A29560j371j634k130k639k933l134l433l603l147j924m73M17M40Q6K13J258
57511A05553K822M037M308L786L165L084L590M215M493M375M057L566K798J866
57497A55715J049L50m85j404j873j576r54o78q51j101j196j153r65o83o70j214
57481A42311j920k018j356o20m62q30j258j412j190o72j96j33m07n21j95K76N44
57464A29941O01N59M07K12K30M55M47Ll50k6O90R20L62l38m31J39Q80J346J412
57445A37459J173Q06M35P5l35q05j227j386j041j68Q80J576J698J427R40K16n64
57428A41159q34k34Q16J454J275N42k52o94m67L88J209J173K01r27j441j263p60
$$ plain form
57411 141345 141158 141477 142055 142506 142548 142159 141494 140740 140038 139462 139065 138966 139281 139931 140647 141260 141868 142582 143277
57392 143277 143792 144220 144785 145519 146303 147138 148044 148803 149206 149654 151083 153961 157557 160490 161993 162447 162768
57375 162768 163470 164392 165110 165403 165283 164802 164032 163211 162632 162249 161631 160570 159544 159228 159571 159732 159051 157785
57357 157785 156700 156240 156295 156511 156478 155792 154394 152923 152363 153099 154516 155761 156786 158351 161008 164360
57341 164360 167483 169808 171344 172239 172566 172633 173085 174379 176297 178202 179621 180406 180634 180659 181072 182108 183197
57324 183197 183536 183110 182651 182573 182499 182002 181285 180758 180467 180335 180544 181169 181782 181974 182094 182867 184357 185854 186780
57305 186780 187156 187170 186843 186329 186061 186323 186988 187873 189018 190381 191596 192323 192634 192890 193451 194628 196562
57288 196562 198887 200787 201743 202009 202125 202249 202324 202599 203439 204697 205807 206570 207413 208809 210839 213454 216704
$$ packed form
57411A41345j87L19N78M51M2l89o65p54p02n76l97r9L15O50P16O13O08P14O95
57392A43277N15M28N65P34P84Q35R06P59M03M48J429K878L596K933J503M54L21
57375A62768P02R22P18K93j20m81p70q21n79l83o18j061j026l16L43J61o81j266
57357A57785j085m60N5K16l3o86j398j471n60P36J417J245J025J565K657L352
57341A64360L123K325J536Q95L27O7M52J294J918J905J419P85K28K5M13J036J089
57324A83197L39m26m59p8p4m97p17n27k91j32K09O25O13J92J20P73J490J497R26
57305A86780L76J4l27n14k68K62O65Q85J145J363J215P27L11K56N61J177J934
57288A96562K325J900R56K66J16J24P5K75Q40J258J110P63Q43J396K030K615L250
$$ plain form
57271 216704 220456 224216 227599 230765 234125 237738 241316 244680 247868 250833 253390 255571 257718 260054
57257 260054 262326 264068 265131 265802 266514 267542 268894 270295 271370 272087 273053 275078 278339 282157 285701
57242 285701 288725 291503 294315 297226 300215 303216 306134 309105 312582 316772 321059 324488 326970 329563
57228 329563 333362 338464 344286 350489 357129 364092 370929 377332 383532 390174 397909 406961 416818 426400
57214 426400 434841 442160 449059 456139 463528 471096 478735 486444 494470 503305 513240 523941 534836 545901
57200 545901 557595 569907 581982 592985 602975 612619 622398 632498 643221 654932 667590 680731
57188 680731 693956 707142 720190 732960 745659 758965 773425 788760 803933 817980 830794
57177 830794 843135 855834 868953 881758 893622 904823 916292 928653 941828 955551 969808
$$ packed form
57271B16704L752L760L383L166L360L613L578L364L188K965K557K181K147K336
57257B60054K272J742J063O71P12J028J352J401J075P17R66K025L261L818L544
57242B85701L024K778K812K911K989L001K918K971L477M190M287L429K482K593
57228C29563L799N102N822O203O640O963O837O403O200O642P735R052R857R582
57214D26400Q441P319O899P080P389P568P639P709Q026Q835R935J0701J0895J1065
57200E45901J1694J2312J2075J1003R990R644R779J0100J0723J1711J2658J3141
57188F80731J3225J3186J3048J2770J2699J3306J4460J5335J5173J4047J2814
57177H30794J2341J2699J3119J2805J1864J1201J1469J2361J3175J3723J4257
$$ plain form
57166 969808 984506 999059 1012826 1025926 1039263 1053626 1069010 1084914 1101017 1117376 1134157
57155 1134157 1151411 1169057 1186908 1204796 1222797 1241223 1260216 1279450 1298486 1317380 1336701
57144 1336701 1356976 1378328 1400623 1423639 1447062 1470695 1494871 1520334 1547439 1575665 1604139
57133 1604139 1632516 1661160 1690767 1722068 1755598 1791286 1828374 1866256 1905443 1947294 1992728
57122 1992728 2041594 2093422 2148368 2207174 2270501 2338646 2411790 2490324 2575032 2667167 2768297
57111 2768297 2879975 3003613 3140766 3293423 3463978 3655002 3869159 4109385 4379488
57102 4379488 4685174 5034895 5439817 5913312 6471184 7132757 7921611 8865189 9993988
57093 9993988 11340719 12938382 14816606 16997819 19495029 22310671 25434528 28840484
$$ packed form
57166I69808J4698J4553J3767J3100J3337J4363J5384J5904J6103J6359J6781
57155A134157J7254J7646J7851J7888J8001J8426J8993J9234J9036J8894J9321
57144A336701K0275K1352K2295K3016K3423K3633K4176K5463K7105K8226K8474
57133A604139K8377K8644K9607L1301L3530L5688L7088L7882L9187M1851M5434
57122A992728M8866N1828N4946N8806O3327O8145P3144P8534Q4708R2135J01130
57111B768297J11678J23638J37153J52657J70555J91024K14157K40226K70103
57102D379488L05686L49721M04922M73495N57872O61573P88854R43578J128799
57093I993988J346731J597663J878224K181213K497210K815642L123857L405956
$$ plain form
57085 28840484 32483968 36301754 40214857 44134649 47970359 51632652 55028758 58053076
57077 58053076 60585310 62504788 63715525 64166529 63856293 62823202 61131461 58860039
57069 58860039 56096295 52932906 49466486 45796544 42023485 38244923 34550660 31017435
57061 31017435 27704829 24653490 21885931 19409034 17217105 15294953 13620899 12169435
57053 12169435 10913151 9824190 8875889 8044569 7310637 6658507 6075963 5553676 5084726
57044 5084726 4663706 4285760 3946299 3641407 3368054 3123602 2905208 2709774 2534388
57035 2534388 2376651 2234663 2106809 1991566 1887411 1792913 1707018 1629252 1559599 1498095
57025 1498095 1444468 1398020 1357866 1323545 1295669 1275963 1266560 1269309 1285996 1319192 1372750 1451655
$$ packed form
57085B8840484L643484L817786L913103L919792L835710L662293L396106L024318
57077E8053076K532234J919478J210737M51004l10236j033091j691741k271422
57069E8860039k763744l163389l466420l669942l773059l778562l694263l533225
57061C1017435l312606l051339k767559k476897k191929j922152j674054j451464
57053A2169435j256284j088961r48301q31320p33932o52130n82544n22287m68950
57044E084726m21020l77946l39461l04892k73353k44452k18394j95434j75386
57035B534388j57737j41988j27854j15243j04155r4498q5895p7766o9653o1504
57025A498095n3627m6448m0154l4321k7876j9706r403K749J6687L3196N3558P8905
$$ plain form
57013 1451655 1561389 1706179 1885162 2087926 2293679 2476524 2613392 2688610 2693731 2627001
57003 2627001 2495485 2316478 2113379 1907399 1711817 1532467 1371485 1229637 1106522
56994 1106522 1000705 910458 834165 770149 716765 672823 637558 610072 589104 573355 561735
56983 561735 553191 546579 540877 535328 529208 521528 511115 497144 479704 459888 439203 418796 399316
56970 399316 381323 365364 351515 339404 329069 321297 316621 314442 313869 315170 319537 327501 338461
56957 338461 351836 367602 385117 402189 416096 425214 429156 427798 420949 408901 392696 373802
56945 373802 353806 334273 316420 300853 287818 277667 270791 267301 267112 270248 276707 286177 298326
56932 298326 313351 331748 353327 376683 399604 419708 434779 443073 443758 437049 423873 405578
$$ packed form
57013A451655J09734J44790J78983K02764K05753J82845J36868P5218N121o6730
57003B627001j31516j79007k03099k05980j95582j79350j60982j41848j23115
56994A106522j05817r0247p6293o4016n3384m3942l5265k7486k0968j5749j1620
56983E61735q544o612n702n549o120p680j0413j3971j7440j9816k0685k0407j9480
56970C99316j7993j5959j3849j2111j0335p772m676k179n73J301M367P964J0960
56957C38461J3375J5766J7515J7072J3907R118L942j358o849j2048j6205j8894
56945C73802j9996j9533j7853j5567j3035j0151o876l490j89L136O459R470J2149
56932B98326J5025J8397K1579K3356K2921K0104J5071Q294O85o709j3176j8295
$$ plain form
56920 405578 383840 360385 336453 312696 289673 268179 248856 231832 217085 204909 195504 188184
56908 188184 181578 174834 168275 162623 157984 153952 150431 147771 146169 145401 145243 145675 146547 147541 148786
56893 148786 151090 155144 160788 167578 175871 186775 200994 218183 237361 257435 277124 294862
56881 294862 309104 318648 322795 321651 316366 308650 299813 290487 281232 272894 266192 261403 258704 258454
56867 258454 260979 266575 275935 290032 309237 333070 361199 394101 432019 473512 515542 554679
56855 554679 587742 611818 624781 626124 616920 599004 574596 546454 517575 490405 466574 447244
56843 447244 433219 424760 421899 425071 435065 452465 477675 511509 555035 608528 670804 739304
56831 739304 809955 876766 932683 971894 991511 991127 971654 935292 886089 829365 770089 711855
$$ packed form
56920D05578k1738k3455k3932k3757k3023k1494j9323j7024j4747j2176r405p320
56908A88184o606o744o559n652m639m032l521k660j602p68j58M32Q72R94J245
56893A48786K304M054N644O790Q293J0904J4219J7189J9178K0074J9689J7738
56881B94862J4242R544M147j144n285p716q837r326r255q338o702m789k699k50
56867B58454K525N596R360J4097J9205K3833K8129L2902L7918M1493M2030L9137
56855E54679L3063K4076J2963J343r204j7916k4408k8142k8879k7170k3831j9330
56843D47244j4025q459k861L172R994J7400K5210L3834M3526N3493O2276O8500
56831G39304P0651O6811N5917L9211J9617l84j9473l6362m9203n6724n9276n8234
$$ plain form
56819 711855 657088 607579 564578 528741 500369 479721 467140 463004 467704 481650 505186 538263
56807 538263 579870 627571 677515 724951 765012 793570 807968 807176 791396 761876 721315 673981
56795 673981 624567 576524 531607 490728 454610 423583 397540 376603 361456 352668 350029 352913
56783 352913 360973 374065 391674 412730 435676 458374 478213 492902 501071 501863 494311 477882
56771 477882 453715 424667 393821 363159 333641 305942 280645 257968 237764 219814 203991
56760 203991 190212 178396 168426 160004 152653 146046 140286 135654 132057 128951 125899 123023 120728 119061
56746 119061 117551 115685 113367 110945 108935 107736 107367 107373 107214 106841 106695 106980 107270 107083 106576 106223 106022
56729 106022 105532 104668 103923 103665 103738 103906 104235 104717 104946 104554 103720 102884 102199 101671 101641 102598 104555 106997 109458
$$ packed form
56819G11855n4767m9509m3001l5837k8372k0648j2581m136M700J3946K3536L3077
56807E38263M1607M7701M9944M7436M0061K8558J4398p92j5780k9520m0561m7334
56795F73981m9414m8043m4917m0879l6118l1027k6043k0937j5147q788k639K884
56783C52913Q060J3092J7609K1056K2946K2698J9839J4689Q169P92p552j6429
56771D77882k4167k9048l0846l0662k9518k7699k5297k2677k0204j7950j5823
56760B03991j3779j1816r970q422p351o607n760m632l597l106l052k876k295j667
56746A19061j510j866k318k422k010j199l69Oj59l73j46K85K90j87n07l53k01
56729A06022m90q64p45k58P3J68L29M82K29l92q34q36o85n28l0R57J957K442K461
$$ plain form
56710 109458 111788 113823 115255 116020 116508 117161 118052 118971 119674 119891 119366 118260 117382 117573 118799 120133 120739
56693 120739 120631 120284 119819 118915 117525 116284 115978 116657 117477 117513 116699 115863 115742 116137 116231 115674 114920 114407 113912
56674 113912 113121 112449 112624 113627 114720 115525 116413 117687 119134 120699 122856 125806 128901 131491 133842
56659 133842 136494 139077 140580 140699 140172 139810 139788 139923 140063 140135 140209 140484 140838 140631 139549 138365 138106 138574
56641 138574 138582 137701 136806 136640 136748 136268 135020 133313 131388 129580 128461 128207 128299 128347 128713 129785 131093 131814
56623 131814 131815 131612 131652 132205 133641 136019 138571 140280 140979 141354 141922 142593 143199 143848 144611 145283 145615 145514
56605 145514 145000 144225 143553 143322 143503 143802 143991 143998 143861 143888 144619 146215 148060 149356 149985 150308 150320 149585 147977
56586 147977 145949 143954 142137 140689 140040 140455 141800 143828 146280 148616 150107 150569 150664 151140 152017 152782
$$ packed form
56710A09458K330K035J432P65M88O53Q91R19P03K17n25j106q78J91J226J334O06
56693A20739j08l47m65r04j390j241l06O79Q20L6q14q36j21L95R4n57p54n13m95
56674A13912p91o72J75J003J093Q05Q88J274J447J565K157K950L095K590K351
56659A33842K652K583J503J19n27l62k2J35J40P2P4K75L54k07j082j184k59M68
56641A38574Qq81q95j66J08m80j248j707j925j808j119k54R2M8L66J072J308P21
56623A31814Jk03M0N53J436K378K552J709O99L75N68O71O06O49P63O72L32j01
56605A45514n14p75o72k31J81K99J89Pj37K7P31J596J845J296O29L23J2p35j608
56586A47977k028j995j817j448o49M15J345K028K452K336J491M62R5M76Q77P65
$$ plain form
56570 152782 153266 153927 155353 157687 160576 163530 166353 169299 172850 177276 182507 188391 194969 202387 210612
56555 210612 219308 227970 236143 243517 249879 255071 259087 262224 264967 267611 270102 272277 274085 275399
56541 275399 275842 275115 273440 271399 269354 267265 265104 263063 261198 259099 256209 252474 248501 245020 242242
56526 242242 239774 237136 234310 231706 229610 227769 225608 222795 219466 215845 211760 206755 200831 194908
56512 194908 190211 187058 184577 181897 179258 177489 176577 175429 173127 169927 166859 164828 164239 164883 165783
56497 165783 165660 164091 161929 160240 159195 158395 157806 157635 157545 156791 155238 153677 152935 153138 153975 155268 156992
56480 156992 158950 160650 161519 161287 160267 159208 158722 158901 159556 160579 161828 162942 163627 163990 164282 164497
56464 164497 164563 164787 165654 167309 169561 172282 175353 178332 180767 182806 184962 187231 188999 190020 190909
$$ packed form
56570A52782M84O61J426K334K889K954K823K946L551M426N231N884O578P418Q225
56555B10612Q696Q662Q173P374O362N192M016L137K743K644K491K175J808J314
56541B75399M43p27j675k041k045k089k161k041j865k099k890l735l973l481k778
56526B42242k468k638k826k604k096j841k161k813l329l621m085n005n924n923
56512A94908m697l153k481k680k639j769r12j148k302l200l068k031n89O44R00
56497A65783j23j569k162j689j045q00n89j71r0p54j553j561p42K03Q37J293J724
56480A56992J958J700Q69k32j020j059m86J79O55J023J249J114O85L63K92K15
56464A64497O6K24Q67J655K252K721L071K979K435K039K156K269J768J021Q89
$$ plain form
56449 190909 192376 194363 196290 197838 199172 200613 202389 204546 206847 208818 210079 210590 210532 210088 209433
56434 209433 208747 208141 207710 207716 208434 209685 210742 210980 210507 209904 209456 208907 207978 206838 205893 205302 204956 204793
56416 204793 204812 204708 203935 202426 201003 200625 201333 202310 202871 202905 202452 201543 200612 200355 200818 201231 201189 201339 202286
56397 202286 203373 203396 202223 200834 199863 198981 197783 196573 195988 196338 197445 198706 199290 198783 197791 197469 198388
56380 198388 200225 202526 205235 208379 211841 215566 219516 223260 226217 228519 231003 234004 236740 238311
56366 238311 238818 238949 238911 238450 237704 237324 237707 238638 239769 240987 242166 242996 243365 243594 243989 244293 244017 243297
56348 243297 243029 243938 245788 247803 249660 251598 253631 255182 255735 255522 255296 255592 256394 257258 257628 257308 256849
56331 256849 257194 258764 261143 263836 266884 270396 273901 276711 278736 280569 282892 285991 289527 292543
$$ packed form
56449A90909J467J987J927J548J334J441J776K157K301J971J261N11n8m44o55
56434B09433o86o06m31OP18J251J057K38m73o03m48n49r29j140r45n91l46j63
56416B04793J9j04p73j509j423l78P08R77N61L4m53r09r31k57M63M13m2J50R47
56397B02286J087K3j173j389r71q82j198j210n85L50J107J261N84n07r92l22R19
56380A98388J837K301K709L144L462L725L950L744K957K302K484L001K736J571
56366B38311N07J31l8m61p46l80L83R31J131J218J179Q30L69K29L95L04k76p20
56348B43297k68R09J850K015J857J938K033J551N53k13k26K96Q02Q64L70l20m59
56331B56849L45J570K379K693L048L512L505K810K025J833K323L099L536L016
$$ plain form
56317 292543 294146 294563 295043 296289 297558 297993 298107 298977 300355 300802 299689 298007 297042 297192 298291 300191
56301 300191 302577 304891 306866 308764 310882 313269 315960 318917 321663 323599 324759 325671 326385 326394 325653 324915
56285 324915 324817 325324 326379 328312 331216 334547 337785 340941 344079 347035 350058 354012 359251 364737 368951
56270 368951 371522 373484 376197 380359 385797 391795 397731 403603 409808 416396 422985 429507 436465 444177
56256 444177 452337 460718 469823 480432 492858 507090 523301 541807 562782 586366 612825 642301
56244 642301 674667 709894 748253 789837 834151 880389 927879 976094 1024548 1072797 1120107
56233 1120107 1164939 1205280 1239806 1268308 1290743 1306418 1314497 1314836 1307834 1293876 1273480 1247768
56221 1247768 1218256 1186199 1152367 1117301 1081550 1045784 1010770 976977 944196 911918 880166
$$ packed form
56317B92543J603M17M80J246J269M35J14Q70J378M47j113j682r65J50J099J900
56301C00191K386K314J975J898K118K387K691K957K746J936J160R12P14Rp41p38
56285C24915r8N07J055J933K904L331L238L156L138K956L023L954N239N486M214
56270C68951K571J962K713M162N438N998N936N872O205O588O589O522O958P712
56256D44177Q160Q381R105J0609J2426J4232J6211J8506K0975K3584K6459K9476
56244F42301L2366L5227L8359M1584M4314M6238M7490M8215M8454M8249M7310
56233A120107M4832M0341L4526K8502K2435J5675Q079L39p002j3958k0396k5712
56221A247768k9512l2057l3832l5066l5751l5766l5014l3793l2781l2278l1752
$$ plain form
56210 880166 849520 820336 792552 766433 742796 722072 703702 686868 671245 656655 642557
56199 642557 628560 615076 602857 592064 582222 572935 564293 556770 550939 546999 544360 542053 539794
56186 539794 538229 537839 538075 537995 537371 536712 536450 536553 536778 537041 537571 538843 541091 543877 546431 548492 550416
56169 550416 552439 554331 555836 556982 557953 559185 561482 565285 569811 573780 577160 581213 586638 592685
56155 592685 598545 604534 611220 618343 625397 632663 640890 650469 661528 674300 688761 704402 720893
56142 720893 738591 758061 779688 804005 831630 862455 895728 931438 970849 1015348 1065872
56131 1065872 1124017 1192490 1273547 1367792 1475003 1594525 1723490 1855840 1984787 2105877
56121 2105877 2216812 2315684 2401471 2475735 2541690 2601206 2653810 2698344 2734016 2759725 2774065
$$ packed form
56210H80166l0646k9184k7784k6119k3637k0724j8370j6834j5623j4590j4098
56199F42557j3997j3484j2219j0793r842r287q642p523n831l940k639k307k259
56186E39794j565l90K36q0o24o59k62J03K25K63N30J272K248K786K554K061J924
56169E50416K023J892J505J146R71J232K297L803M526L969L380M053N425O047
56155E92685N860N989O686P123P054P266Q227R579J1059J2772J4461J5641J6491
56142G20893J7698J9470K1627K4317K7625L0825L3273L5710L9411M4499N0524
56131A065872N8145O8473Q1057R4245J07211J19522J28965J32350J28947J21090
56121B105877J10935R8872Q5787P4264O5955N9516N2604M4534L5672K5709J4340
$$ plain form
56110 2774065 2776870 2770043 2756311 2737452 2713572 2683210 2643769 2592364 2526694 2445453 2348745 2238860
56098 2238860 2120355 1998692 1878738 1764573 1659762 1566772 1486262 1417570 1359667 1311369
56088 1311369 1271302 1238420 1212169 1191684 1175492 1162600 1153156 1147284 1144007 1142163 1141682 1143024 1146007
56075 1146007 1150109 1155340 1161836 1169120 1176701 1184959 1194583 1205650 1217966 1231646 1246568 1262026 1277741
56062 1277741 1294334 1311936 1329376 1345860 1362451 1380607 1400221 1420431 1441317 1463203 1485106
56051 1485106 1505578 1524493 1542540 1559718 1575982 1592664 1611334 1631646 1651974 1671782 1691793
56040 1691793 1712364 1733462 1755887 1780642 1807300 1834620 1862599 1892358 1924306 1958023 1993574
56029 1993574 2031280 2070462 2110131 2150694 2193409 2238386 2284753 2332490 2382430 2434669 2488563
$$ packed form
56110B774065K805o827j3732j8859k3880l0362l9441n1405o5670q1241r6708j09885
56098B238860j18505j21663j19954j14165j04811r2990q0510o8692n7903m8298
56088A311369m0067l2882k6251k0485j6192j2892r444n872l277j844m81J342K983
56075A146007M102N231O496P284P581Q258R624J1067J2316J3680J4922J5458J5715
56062A277741J6593J7602J7440J6484J6591J8156J9614K0210K0886K1886K1903
56051A485106K0472J8915J8047J7178J6264J6682J8670K0312K0328J9808K0011
56040A691793K0571K1098K2425K4755K6658K7320K7979K9759L1948L3717L5551
56029A993574L7706L9182L9669M0563M2715M4977M6367M7737M9940N2239N3894
$$ plain form
56018 2488563 2544108 2601899 2662016 2724292 2789123 2856689 2926137 2997010 3070534 3147893 3228367
56007 3228367 3311063 3397305 3489128 3586575 3688764 3796372 3910486 4030203 4154325 4284414
55997 4284414 4423115 4570354 4724360 4885708 5056966 5239034 5431265 5634755 5851926
55988 5851926 6083186 6327492 6585945 6861389 7154867 7466218 7797843 8154077 8537164
55979 8537164 8947796 9389400 9867850 10387322 10950819 11564640 12237880 12977698 13789808
55970 13789808 14683680 15672691 16769919 17989524 19352689 20887408 22623620 24595655
55962 24595655 26850696 29450361 32466986 35988857 40132864 45048785 50916445 57952807
55954 57952807 66427104 76665147 89047769 104028760 122159935 144054459 170220414
$$ packed form
56018B488563N5545N7791O0117O2276O4831O7566O9448P0873P3524P7359Q0474
56007C228367Q2696Q6242R1823R7447J02189J07608J14114J19717J24122J30089
55997D284414J38701J47239J54006J61348J71258J82068J92231K03490K17171
55988E851926K31260K44306K58453K75444K93478L11351L31625L56234L83087
55979H537164M10632M41604M78450N19472N63497O13821O73240P39818Q12110
55970A3789808Q93872R89011J097228J219605J363165J534719J736212J972035
55962B4595655K255041K599665L016625L521871M144007M915921N867660P036362
55954E7952807Q474297J0238043J2382622J4980991J8131175K1894524K6165955
$$ plain form
55947 170220414 200755761 234975287 271134669 306475893 337705480 361724222 376232562
55940 376232562 379997663 372903465 355975252 331313752 301723184 270054676 238607216
55933 238607216 208893425 181744616 157520588 136273402 117865476 102063726 88595076
55926 88595076 77167057 67486819 59286871 52335271 46427647 41384239 37057000 33328577
55918 33328577 30100431 27287668 24823570 22658160 20748333 19054304 17544925 16198121
55910 16198121 14993761 13911534 12936267 12058716 11269201 10555384 9907178 9318527 8782904
55901 8782904 8291810 7839059 7422194 7038329 6682535 6351463 6044700 5761299 5498351
55892 5498351 5253922 5028058 4819946 4627225 4448886 4285747 4137389 4001770 3878627
$$ packed form
55947A70220414L0535347L4219526L6159382L5341224L1229587K4018742J4508340
55940C76232562L765101p094198j6928213k4661500k9590568l1668508l1447460
55933B38607216k9713791k7148809k4224028k1247186j8407926j5801750j3468650
55926H8595076j1428019r680238q199948o951600n907624n043408m327239l728423
55918C3328577l228146k812763k464098k165410j909827j694029j509379j346804
55910A6198121j204360j082227r75267q77551p89515p13817o48206n88651n35623
55901H782904m91094m52751m16865l83865l55794l31072l06763k83401k62948
55892E498351k44429k25864k08112j92721j78339j63139j48358j35619j23143
$$ plain form
55883 3878627 3770189 3677715 3600352 3538303 3494257 3470625 3467938 3486617 3527218 3587379 3660530
55872 3660530 3738535 3813571 3876950 3918995 3931789 3910841 3853941 3760850 3634973 3483121 3312492
55861 3312492 3129406 2941049 2755630 2579317 2414709 2263134 2126467 2005646 1899376
55852 1899376 1805671 1723299 1650812 1585786 1526276 1471838 1422214 1376225 1332761 1291670 1252886
55841 1252886 1215850 1180488 1147546 1117276 1088905 1061973 1036915 1013705 991254 968920 947452
55830 947452 927658 909209 891518 874808 859486 845374 832167 819908 808399 796947 785101
55819 785101 772924 760250 746635 732364 718511 705617 693259 681209 669927 659484 649153
55808 649153 638722 629267 621993 617027 613790 611796 610672 610148 610431 611947 614533 617648 621443 626589
$$ packed form
55883C878627j08438r2474p7363o2049m4046k3632k687J8679M0601O0161P3151
55872C660530P8005P5036O3379M2045J2794k0948n6900r3091j25877j51852j70629
55861C312492j83086j88357j85419j76313j64608j51575j36667j20821j06270
55852A899376r3705q2372p2487o5026n9510n4438m9624m5989m3464m1091l8784
55841A252886l7036l5362l2942l0270k8371k6932k5058k3210k2451k2334k1468
55830I47452j9794j8449j7691j6710j5322j4112j3207j2259j1509j1452j1846
55819G85101j2177j2674j3615j4271j3853j2894j2358j2050j1282j0443j0331
55808F49153j0431r455p274m966l237j994j124n24K83J516K586L115L795N146
$$ plain form
55794 626589 632867 638934 643806 647588 650472 652067 652021 650250 646242 639288 629933 620150 611467 603763 596265
55779 596265 588638 580474 570793 558919 545302 530909 516364 502044 488334 475510 464019 455008
55767 455008 449647 447708 447719 448713 450635 452777 453243 450732 445747 439309 431534 422254 411995 401367 390326
55752 390326 378988 368474 359984 353531 348315 343770 339541 335112 330290 325559 321241 316823 311806 306659
55738 306659 302161 298298 294655 291460 289392 288565 288407 288309 287862 286723 284865 282686 280432 277799 274550
55723 274550 271081 267746 263999 258936 252582 246081 240576 236258 232514 228800 225422 223432 223461 224756 225901
55708 225901 226534 227689 230359 234432 239200 244011 247991 250098 250158 249180 247962 245968 242299 237150 231493
55693 231493 225787 219888 213964 208659 204403 201102 198388 195768 192807 189648 187025 185307 183937 182360
$$ packed form
55794F26589O278O067M872L782K884J595m6j771m008o954r355r783q683p704p498
55779E96265p627q164r681j1874j3617j4393j4545j4320j3710j2824j1491r011
55767D55008n361j939J1R94J922K142M66k511m985o438p775r280j0259j0628j1041
55752C90326j1338j0514q490o453n216m545m229m429m822m731m318m418n017n147
55738C06659m498l863l643l195k068q27j58r8m47j139j858k179k254k633l249
55723B74550l469l335l747n063o354o501n505m318l744l714l378j990K9J295J145
55708B25901O33J155K670M073M768M811L980K107O0r78j218j994l669n149n657
55693B31493n706n899n924n305m256l301k714k620k961l159k623j718j370j577
$$ plain form
55679 182360 181075 181080 182551 184789 187155 189324 190794 191031 190166 188822 187115 184474 180671 176512 173180
55664 173180 171203 170277 169793 169284 168553 167680 166999 166970 167946 169953 172684 175792 179187 182956 187146 191824
55648 191824 197187 203276 209594 215359 220124 223845 226478 227985 228674 228940 228595 227033 224148 220516 216479
55633 216479 211717 205918 199295 192183 184793 177697 171833 167499 163860 159969 155854 152159 149158 146648
55619 146648 144387 142190 139900 137701 136099 135230 134621 134000 133785 134240 134639 133988 132204 129973 127736 125529
55603 125529 123618 122553 122524 123076 123502 123254 122201 120833 119991 120016 120352 120272 119701 119002 118382 117905 117687 117539
55585 117539 116813 115224 113533 112699 112621 112404 111768 111375 111726 112494 113232 114120 115587 117499 119096 119712 119431
55568 119431 119053 119406 120700 122558 124589 126641 128507 129865 130759 131748 133211 134765 135653 135469 134250 132155
$$ packed form
55679A82360j285NJ471K238K366K169J470K37q65j344j707k641l803m159l332
55664A73180j977r26m84n09p31q73o81k9R76K007K731L108L395L769M190M678
55648A91824N363O089O318N765M765L721K633J507O89K66l45j562k885l632m037
55633B16479m762n799o623p112p390p096n864m334l639l891m115l695l001k510
55619A46648k261k197k290k199j602q69o09o21k15M55L99o51j784k231k237k207
55603A25529j911j065k9N52M26k48j053j368q42K5L36q0n71o99o20m77k18j48
55585A17539p26j589j691q34p8k17o36l93L51P68P38Q88J467J912J597O16k81
55568A19431l78L53J294J858K031K052J866J358Q94R89J463J554Q88j84j219k095
$$ plain form
55552 132155 129398 126198 122545 118318 113925 110354 108147 106729 105257 103728 102645 101976 101213 100360 100022
55537 100022 100350 100538 99734 98094 96604 95968 95887 95515 94617 94037 94694 96302 97603 97929 97849 98031 98182 97629
55519 97629 96334 94698 92850 90867 89375 89162 90287 92110 94029 95678 96686 96934 96900 97184 97829 98613
55503 98613 99767 101662 103926 105579 106120 105900 105402 104654 103441 101624 99264 96707 94427 92477 90382
55488 90382 87981 86001 85191 85279 85519 85905 86927 88312 89093 88984 88721 88796 88776 88215 87456 87095 87242 87681 88252
55469 88252 88752 88885 88590 88015 87087 85619 83932 82748 82259 81937 81475 81269 81647 82297 82846 83429 84180 84730
55451 84730 84712 84366 84137 84025 83795 83476 83262 83205 83419 84194 85442 86403 86450 85963 85858 86459 87337 88085 88662 89025
55431 89025 88959 88374 87430 86386 85605 85585 86561 88067 89289 89887 90082 89973 89276 87946 86642 86213 86874 88165
$$ packed form
55552A32155k757l200l653m227m393l571k207j418j472j529j083o69p63q53l38
55537A00022L28J88q04j640j490o36q1l72q98n80O57J608J301L26q0J82J51n53
55519I7629j295j636j848j983j492k13J125J823J919J649J008K48l4K84O45P84
55503I8613J154J895K264J653N41k20m98p48j213j817k360k557k280j950k095
55488I0382k401j980q10Q8K40L86J022J385P81j09k63P5k0n61p59l61J47M39N71
55469H8252N00J33k95n75r28j468j687j184m89l22m62k06L78O50N49N83P51N50
55451H4730j8l46k29j12k30l19k14n7K14P75J248R61M7m87j05O01Q78P48N77L63
55431H9025o6n85r44j044p81k0R76J506J222N98J95j09o97j330j304m29O61J291
$$ plain form
55413 88165 89567 90922 92267 93557 94666 95586 96492 97566 98734 99644 99984 99819 99475 99033 98135 96486
55397 96486 94495 93117 92922 93432 93586 92790 91426 90369 90179 90676 91178 91160 90797 90754 91298 91800 91445 90304
55379 90304 89247 88798 88627 88338 88194 88595 89264 89468 88853 87621 85931 83643 80732 77671 75240 73978
55363 73978 73727 73693 73171 72307 71837 71993 72145 71809 71465 71837 72786 73594 74044 74469 74892 74978 74864 75197 76078 76676
55343 76676 76313 75383 74799 74921 75461 76125 76890 77709 78311 78316 77517 76187 75146 75200 76310 77525 77930 77544 77112
55324 77112 77226 77839 78517 78903 78926 78705 78361 77934 77466 77129 77196 77910 79266 80835 81846 81761 80918 80376 80900
55305 80900 82259 83616 84342 84277 83583 82691 82092 81787 81210 80052 78846 78252 78123 77858 77443 77349 77591 77683 77537
55286 77537 77622 78115 78649 79119 80010 81613 83534 85273 86763 87993 88655 88647 88485 88812 89731 90868 91788 92155
$$ packed form
55413H8165J402J355J345J290J109R20R06J074J168R10L40j65l44m42q98j649
55397I6486j991j378j95N10J54p96j364j057j90M97N02j8l63m3N44N02l55j141
55379I0304j057m49j71k89j44M01O69K04o15j232j690k288k911l061k431j262
55363G3978k51l4n22q64m70J56J52l36l44L72R49Q08M50M25M23Q6j14L33Q81N98
55343G6676l63r30n84J22N40O64P65Q19O02Np99j330j041N4J110J215M05l86m32
55324G7112J14O13O78L86K3k21l44m27m68l37O7P14J356J569J011q5q43n42N24
55305H0900J359J357P26o5o94q92n99l05n77j158j206n94j29k65m15r4K42R2j46
55286G7537Q5M93N34M70Q91J603J921J739J490J230O62qj62L27R19J137R20L67
$$ plain form
55268 92155 91875 91286 90887 90751 90626 90719 91669 93442 95016 95711 96174 97317 98758 99216 98246 96756 95771 95436
55250 95436 95363 95361 95432 95510 95561 95750 96226 96789 96997 96663 96127 95918 96163 96495 96553 96314 95807 94779 93107 91327
55230 91327 90236 89940 89766 89150 88160 87113 86246 85891 86322 87219 87819 87938 88230 89110 90021 90278 90070 90029 90220
55211 90220 90218 89893 89542 89449 89803 90735 91922 92475 91891 90873 90555 91081 91639 91776 91933 92621 93721 94762 95377
55192 95377 95440 95172 95096 95390 95398 94395 92775 91725 91638 91671 91129 90463 90453 91092 91936 92976 94474 96240 97784
55173 97784 99022 100248 101448 102190 102230 101786 101193 100637 100270 100193 100255 100249 100418 101381 103304 105477 107011 107740 108165
55154 108165 108656 109122 109410 109596 109687 109375 108434 107217 106371 106022 105545 104329 102580 101097 100351 100050 99721 99427
55136 99427 99630 100401 101114 101074 100256 99217 98390 97803 97411 97252 97111 96482 95253 94172 94105 94910 95536 95290 94574
$$ packed form
55268I2155k80n89l99j36j25R3R50J773J574O95M63J143J441M58r70j490r85l35
55250I5436p3kP1P8N1J89M76N63K08l34n36k09K45L32N8k39n07j028j672j780
55230I1327j091k96j74o16r90j047q67l55M31Q97O00J19K92Q80R11K57k08m1J91
55211I0220kl25l51r3L54R32J187N53n84j018l18N26N58J37J57O88J100J041O15
55192I5377O3k68p6K94Qj003j620j050q7L3n42o66j0O39Q44J040J498J766J544
55173I7784J238J226J200P42M0m44n93n56l67p7O2oJ69R63J923K173J534P29M25
55154A08165M91M66K88J86R1l12r41j217q46l49m77j216j749j483p46l01l29k94
55136I9427K03P71P13m0q18j039q27n87l92j59j41o29j229j081o7Q05O26k46p16
$$ plain form
55117 94574 94175 94296 94591 94845 95177 95670 96176 96533 96717 96672 96210 95316 94487 94486 95561 97058 98110 98712 99678
55098 99678 101390 103029 103516 102902 102248 102310 102981 104012 105478 107273 108786 109553 109825 110089 110409 110599 110723
55081 110723 111003 111456 112001 112658 113278 113344 112473 110887 109067 107232 105636 104993 105838 107521 108584 108287 107269
55064 107269 106547 106482 106880 107536 108242 108614 108358 107527 106231 104314 101665 98767 96598 95929 96830 98739 100840
55047 100840 102414 103110 103057 102675 102315 102012 101495 100480 99045 97795 97528 98563 100435 102340 103827 104940
55031 104940 105759 106094 105807 105221 104898 105020 105277 105468 105910 106989 108523 109870 110585 110630 110047 108902 107631
55014 107631 106960 107176 107693 107674 106936 106008 105445 105381 105715 106420 107547 109000 110367 111063 110769 109823 109008 108842
54996 108842 109179 109550 109758 109999 110522 111331 112193 112853 113267 113690 114414 115435 116454 117239 117816 118333 118901 119541
$$ packed form
55117I4574l99J21K95K54L32M93N06L57J84m5m62q94q29jJ075J497J052O02R66
55098I9678J712J639M87o14o54O2O71J031J466J795J513P67K72K64L20J90J24
55081A10723K80M53N45O57O20O6q71j586j820j835j596o43Q45J683J063k97j018
55064A07269p22o5L98O56P06L72k56q31j296j917k649k898k169o69R01J909K101
55047A00840J574O96n3l82l60l03n17j015j435j250k67J035J872J905J487J113
55031A04940Q19L35k87n86l23J22K57J91M42J079J534J347P15M5n83j145j271
55014A07631o71K16N17j9p38r28n63o4L34P05J127J453J367O96k94r46q15j66
54996A08842L37L71K08K41N23Q09Q62O60M14M23P24J021J019P85N77N17N68O40
$$ plain form
54978 119541 120087 120161 119627 119043 119251 120308 121265 121279 120588 120069 120130 120454 120640 120700 120966 121749 123044 124368 125051
54959 125051 124835 124057 123162 122361 121921 122313 123581 124955 125597 125578 125653 126221 126979 127456 127374 126607 125368 124402 124379
54940 124379 125050 125551 125603 125791 126431 126857 126262 124808 123412 122660 122459 122638 123392 125024 127478 130299 133006
54923 133006 135466 137973 140959 144574 148563 152590 156718 161572 167933 176007 185130 194318 203106 211514
54909 211514 219200 225065 228088 228223 226085 222000 215913 208175 199792 191687 184082 176765 169672 162993
54895 162993 156978 151902 148071 145615 144256 143377 142398 141119 139761 138679 137961 137443 137071 137040 137443 138096
54879 138096 138980 140609 143567 147788 152662 157778 163188 169016 175234 181925 189318 197389 205578 212953
54865 212953 218527 221621 222297 221339 219332 215806 209838 201553 192440 183981 176493 169565 163014 156940 151368
$$ packed form
54978A19541N46P4n34n84K08J057R57J4o91n19O1L24J86O0K66P83J295J324O83
54959A25051k16p78q95q01m40L92J268J374O42j9P5N68P58M77q2p67j239r66k3
54940A24379O71N01N2J88O40M26n95j454j396p52k01J79P54J632K454K821K707
54923A33006K460K507K986L615L989M027M128M854O361Q074R123R188Q788Q408
54909B11514P686N865L023J35k138m085o087p738q383q105p605p317p093o679
54895A62993o015n076l831k456j359q79r79j279j358j082p18n18l72l1M03O53
54879A38096Q84J629K958M221M874N116N410N828O218O691P393Q071Q189P375
54865B12953N574L094O76r58k007l526n968q285r113q459p488o928o551o074n572
$$ plain form
54850 151368 146538 143251 142116 142383 142122 139892 135932 131511 127500 123909 120607 117918 116328 115866 116103
54835 116103 116606 117082 117113 116280 114807 113685 113678 114329 114435 113491 112199 111498 111546 111853 112012 111976 111841 111727 111839
54816 111839 112347 113183 114040 114622 114860 114958 115246 115863 116594 117134 117509 118091 119121 120395 121449 121947 121823 121254
54798 121254 120628 120441 121024 122285 123699 124595 124598 123946 123301 123086 123049 122613 121556 120201 119026 118347 118334 119026
54780 119026 120254 121716 123175 124473 125444 126047 126613 127669 129482 131884 134510 136945 138790 140002 141313
54765 141313 143930 148528 154697 161540 168666 176406 185141 194603 203891 212086 218789 223941 227208 227885
54751 227885 225633 221071 215286 208871 201808 194198 186669 179971 174501 170252 166879 163733 160245 156482
54737 156482 153126 150752 149367 148711 148685 149284 150304 151395 152314 153015 153538 153867 153883 153559 153296 153919 156101
$$ packed form
54850A51368m830l287j135K67k61k230l960m421m011l591l302k689j590m62K37
54835A16103N03M76L1q33j473j122pO51J06r44j292p01M8L07J59l6j35j14J12
54816A11839N08Q36Q57N82K38R8K88O17P31N40L75N82J030J274J054M98j24n69
54798A21254o26j87N83J261J414Q96Lo52o45k15l7m36j057j355j175o79j3O92
54780A19026J228J462J459J298R71O03N66J056J813K402K626K435J845J212J311
54765A41313K617M598O169O843P126P740Q735R462R288Q195O703N152L267O77
54751B27885k252m562n785o415p063p610p529o698n470m249l373l146l488l763
54737A56482l356k374j385o56k6N99J020J091R19P01N23L29J6l24k63O23K182
$$ plain form
54720 156101 159880 164932 171130 178460 186565 194829 202836 210295 216553 220796 222868 223328 222501 219990 215424
54705 215424 209174 201956 194141 185943 177983 171072 165436 160597 156121 152221 149447 147871 146754 145123
54691 145123 142696 140082 138033 136696 135705 134765 133843 133001 132378 132195 132442 132719 132740 132762 133071 133397 133427 133583
54673 133583 134413 135349 135136 133597 132009 131362 131171 130516 129396 128398 127659 126871 125915 124884 123845 123060 123035
54656 123035 123835 124749 125121 125140 125314 125580 125525 125134 124707 124278 123733 123277 123221 123434 123510 123369 123290 123478 123955 124689
54636 124689 125447 125790 125545 125064 124670 124245 123735 123666 124560 126110 127484 128211 128319 127959 127439 127235 127314 126785 124988
54617 124988 122704 121444 121648 122417 122955 123394 124037 124634 124825 124750 124815 125164 125615 125956 126186 126565 127359 128358 128959
54598 128959 128990 129107 129888 130917 131382 131310 131456 132115 132806 133091 132953 132359 131192 129723 128475 127499 126427 125326
$$ packed form
54720A56101L779N052O198P330Q105Q264Q007P459O258M243K072M60q27k511m566
54705B15424o250p218p815q198p960o911n636m839m476l900k774j576j117j631
54691A45123k427k614k049j337r91r40r22q42o23j83K47K77K1K2L09L26L0J56
54673A33583Q30R36k13j539j588o47j91o55j120r98p39p88r56j031j039p85k5
54656A23035Q00R14L72J9J74K66n5l91m27m29n45m56n6K13P6j41p9J88M77P34
54636A24689P58L43k45m81l94m25n10o9Q94J550J374P27J08l60n20k04P9n29j797
54617A24988k284j260K04P69N38M39O43N97J91p5O5L49M51L41K30L79P94R99O01
54598A28959L1J17P81J029M65p2J46O59O91K85j38n94j167j469j248r76j072j101
$$ plain form
54580 125326 124755 124859 125136 125288 125560 125983 126023 125399 124591 124084 123665 122943 122134 121856 122435 123730 125277 126342
54562 126342 126333 125496 124801 124808 125103 125183 125333 126070 127201 128101 128618 129001 129130 128597 127637 127229 127917 128947 129022 127826
54542 127826 126435 126181 127322 129006 130385 131439 132630 134147 135764 137224 138412 139280 139976 140919 142374
54527 142374 143955 144942 145060 144615 143980 143383 143065 143131 143252 143029 142603 142358 142172 141658 141115 141364 142477 143546
54509 143546 143977 144109 144177 143666 142397 141369 141560 142481 142843 142295 141575 141213 140986 140555 139816 138626 136937 135295
54491 135295 134498 134630 134939 134820 134427 134257 134591 135473 136748 137971 138712 139086 139653 140614 141483 141669 141102 140129
54473 140129 139098 138244 137760 137791 138425 139748 141757 144185 146604 148690 150280 151244 151589 151658 151909 152420 152910
54456 152910 153289 153837 154692 155493 155827 155834 156026 156557 156987 156828 156108 155214 154354 153361 152060 150603 149342 148510
$$ packed form
54580A25326n71J04K77J52K72M23M0o24q08n07m19p22q09k78N79J295J547J065
54562A26342rq37o95PK95Q0J50P37J131R00N17L83J29n33r60m08O88J030P5j196
54542A27826j391k54J141J684J379J054J191J517J617J460J188Q68O96R43J455
54527A42374J581R87J18m45o35n97l18O6J21k23m26k45j86n14n43K49J113J069
54509A43546M31J32O8n11j269j028J91R21L62n48p20l62k27m31p39j190j689j642
54491A35295p97J32L09j19l93j70L34Q82J275J223P41L74N67R61Q69J86n67r73
54473A40129j031q54m84L1O34J323K009K428K419K086J590R64L45O9K51N11M90
54456A52910L79N48Q55Q01L34PJ92N31M30j59p20q94q60r93j301j457j261q32
$$ plain form
54438 148510 148165 148333 148942 149678 150163 150279 150050 149223 147428 144927 142826 142111 142677 143628 144332 144825 145332 145899
54420 145899 146557 147442 148550 149618 150403 150970 151566 152316 153063 153389 152863 151469 149891 149137 149666 150953 152022
54403 152022 152346 152100 151650 151063 150236 149277 148487 148013 147804 147963 148823 150460 152363 153898 154997 156107 157599
54386 157599 159496 161599 163476 164459 164208 163321 162795 162798 162497 161360 159987 159246 159081 158702 157600 155880 153887
54369 153887 152099 151180 151567 152984 154761 156521 158123 159116 158915 157632 156229 155623 155924 156683 157539 158450
54353 158450 159497 160680 161795 162455 162315 161324 159704 157807 156072 154917 154379 154002 153317 152344 151386 150547
54337 150547 149778 149194 148915 148720 148327 147916 147824 147803 147212 146029 145034 144769 144905 144941 144907 145000 145017 144733 144433 144551
54317 144551 145002 145413 145759 146212 146554 146406 145988 145987 146542 146979 146765 146223 145983 146175 146512 146801 146943 146730 146190
$$ packed form
54438A48510l45J68O09P36M85J16k29q27j795k501k101p15N66R51P04M93N07N67
54420A45899O58Q85J108J068P85N67N96P50P47L26n26j394j578p54N29J287J069
54403A52022L24k46m50n87q27r59p90m74k09J59Q60J637J903J535J099J110J492
54386A57599J897K103J877R83k51q87n26Ll01j137j373p41j65l79j102j720j993
54369A53887j788r19L87J417J777J760J602R93k01j283j403o06L01P59Q56R11
54353A58450J047J183J115O60j40r91j620j897j735j155n38l77o85r73r58q39
54337A50547p69n84k79j95l93m11r2k1n91j183r95k65J36L6l4R3J7k84l00J18
54317A44551M51M11L46M53L42j48m18jN55M37k14n42k40J92L37K89J42k13n40
$$ plain form
54298 146190 145908 146456 147540 148320 148657 149431 151332 153887 156135 157848 159510 161297 162805 163830 164753 165844
54282 165844 166652 166503 165438 164292 163876 164265 164833 164792 163760 161982 160077 158541 157532 157020 156930 157069 157146
54265 157146 157010 156705 156246 155539 154665 154013 153875 154069 154132 153766 152951 151827 150719 150076 150145 150732 151484 152239 152930
54246 152930 153400 153621 153861 154220 154144 152928 150713 148512 147206 146888 147249 148026 148781 148768 147545 145622 144108
54229 144108 143729 144407 145631 146879 147669 147672 147027 146387 146352 146828 147119 146708 145780 144908 144368 143987 143604 143408 143699
54210 143699 144507 145576 146574 147164 146991 145868 144021 142038 140526 139783 139729 140098 140741 141771 143253 144792
54194 144792 145648 145450 144577 143680 143022 142558 142469 143181 144759 146579 147820 148206 148155 148211 148439 148463 148107 147758 147901
54175 147901 148435 148777 148588 147968 146918 145189 142949 141104 140464 140877 141543 141955 142121 142152 142149 142337 142804 143222
$$ packed form
54298A46190k82N48J084P80L37P74J901K555K248J713J662J787J508J025R23J091
54282A65844Q08j49j065j146m16L89N68m1j032j778j905j536j009n12r0J39P7
54265A57146j36l05m59p07q74o52j38J94O3l66q15j124j108o43O9N87P52P55O91
54246A52930M70K21K40L59p6j216k215k201j306l18L61P77P55j3j223j923j514
54229A44108l79O78J224J248P90Lo45o40l5M76K91m11r28q72n40l81l83j96K91
54210A43699Q08J069R98N90j73j123j847j983j512p43n4L69O43J030J482J539
54194A44792Q56j98q73q97o58m64q9P12J578J820J241L86n1N6K28K4l56l49J43
54175A47901N34L42j89o20j050j729k240j845o40M13O66M12J66L1lJ88M67M18
$$ plain form
54157 143222 143201 142848 142553 142440 142458 142796 143637 144629 145274 145734 146552 147557 147801 146801 145161 143693 142562 141690
54139 141690 141359 141818 142672 143256 143525 144130 145623 147793 149776 150787 150884 150966 151794 153061 153800 153600 152893 152059
54121 152059 151000 149864 149364 149853 150634 150857 150699 150984 151922 152903 153495 153962 154705 155675 156578 157348 158232 159416
54103 159416 160637 161231 160781 159698 158849 158534 158284 157856 157837 158769 160088 160596 159869 158638 157847 157772 158014 157892
54085 157892 156913 155271 153909 153696 154586 155838 156927 157768 158247 158177 157768 157581 157873 158452 159280 160652 162508
54068 162508 164070 164564 164058 163276 162819 162805 163037 163254 163353 163559 164209 165210 165931 165844 165126 164479 164457 165144 166221
54049 166221 167091 167104 166039 164422 163161 162793 163215 164048 165043 166127 167292 168614 170267 172313 174486 176338
54033 176338 177768 179314 181725 185135 188820 191957 194507 197169 200542 204658 209318 214462 219926 225093
$$ packed form
54157A43222k1l53k95j13J8L38Q41R92O45M60Q18J005K44j000j640j468j131q72
54139A41690l31M59Q54N84K69O05J493K170J983J011R7Q2Q28J267P39k00p07q34
54121A52059j059j136n00M89P81K23j58K85R38R81N92M67P43R70R03P70Q84J184
54103A59416J221N94m50j083q49l15k50m28j9R32J319N08p27j231p91p5K42j22
54085A57892r79j642j362k13Q90J252J089Q41M79p0m09j87K92N79Q28J372J856
54068A62508J562M94n06p82m57j4K32K17R9K06O50J001P21q7p18o47k2O87J077
54049A66221Q70J3j065j617j261l68M22Q33R95J084J165J322J653K046K173J852
54033A76338J430J546K411L410L685L137K550K662L373M116M660N144N464N167
$$ plain form
54019 225093 229247 232249 234612 236833 238910 240641 242153 243839 245825 247729 249044 249586 249433 248559 246783
54004 246783 244152 241153 238337 235771 233017 229751 226251 223150 220735 218663 216436 213968 211481 208957
53990 208957 206125 203068 200453 198849 198052 197477 196988 196860 196999 196832 196083 195048 193854 191981 189028 185600
53974 185600 182881 181501 181246 181668 182414 183029 183031 182481 182091 182540 183793 185217 186266 186940 187646 188583 189330 189250
53956 189250 188412 187806 188382 190088 192226 194367 196427 198114 199117 199892 201452 203957 206117 206532 205367
53941 205367 204296 204967 207746 211731 215653 218961 222289 226836 233101 240404 247717 254662 261568 269074
53927 269074 278082 289654 304167 320507 336593 350810 362673 372195 379135 383038 383578 380644 374419
53914 374419 365631 355578 345668 336918 329846 324595 320963 318521 316936 316198 316461 317759 319986 323013
$$ packed form
54019B25093M154L002K363K221K077J731J512J686J986J904J315N42j53q74j776
54004B46783k631k999k816k566k754l266l500l101k415k072k227k468k487k524
53990B08957k832l057k615j604p97n75m89j28J39j67p49j035j194j873k953l428
53974A85600k719j380k55M22P46O15Kn50l90M49J253J424J049O74P06R37P47q0
53956A89250q38o06N76J706K138K141K060J687J003P75J560K505K160M15j165
53941B05367j071O71K779L985L922L308L328M547O265P303P313O945O906P506
53927B69074R008J1572J4513J6340J6086J4217J1863R522O940L903N40k934o225
53914C74419q788j0053r910q750p072n251l632k442j585p38K63J298K227L027
$$ plain form
53900 323013 326709 330775 334621 337388 338230 336846 333858 330459 327564 325331 323512 321959 320543 318801
53886 318801 316114 312319 307896 303453 299240 295208 291261 287221 282728 277544 271963 266698 262191 258159
53872 258159 253953 249458 245482 243094 242461 242436 241490 239074 235932 233147 231138 229669 228413 227127 225520
53857 225520 223443 221201 219273 217683 216031 214206 212587 211421 210388 209125 207749 206533 205429 204386
53843 204386 203876 204437 205766 206818 206938 206454 206003 205715 205374 205061 205201 205939 206704 206563 205102 202917 201118
53826 201118 200298 200181 200274 200397 200323 199446 197457 195105 193553 193035 192873 192765 193152 194106 194845 194874 194757 195031 195099
53807 195099 194113 192503 191612 191977 192898 193678 194395 195372 196710 198648 201655 205775 210291 214364 217674 220347
53791 220347 222767 225607 229480 234239 239058 243475 247784 252076 255580 257670 259051 261109 264190 267241
$$ packed form
53900C23013L696M066L846K767Q42j384k988l399k895k233j819j553j416j742
53886C18801k687l795m423m443m213m032l947m040m493n184n581n265m507m032
53872B58159m206m495l976k388o33k5r46k416l142k785k009j469j256j286j607
53857B25520k077k242j928j590j652j825j619j166j033j263j376j216j104j043
53843B04386n10N61J329J052J20m84m51k88l41l13J40P38P65j41j461k185j799
53826B01118q20j17R3J23p4q77j989k352j552n18j62j08L87R54P39K9j17K74O8
53807A95099r86j610q91L65R21P80P17R77J338J938L007M120M516M073L310K673
53791B20347K420K840L873M759M819M417M309M292L504K090J381K058L081L051
$$ plain form
53777 267241 269172 269866 269693 268754 267039 264934 263030 261508 259987 258007 255467 252576 249575 246621 243879
53762 243879 241543 239639 237869 235853 233540 231182 228892 226484 223923 221643 220181 219653 219885 220893 222891
53747 222891 225869 229572 234007 239702 247287 256852 267623 278098 286610 292013 293976 292598 287998 280560
53733 280560 271383 261973 253399 245970 239699 234637 230684 227519 224942 222999 221627 220488 219334 218235
53719 218235 217279 216443 215953 216298 217483 218566 218519 217339 215953 215148 215095 215754 217142 219008 220721 221792 222364
53702 222364 223070 224482 226711 229359 231818 233781 235482 237383 239751 242647 246100 249943 253573 256290
53688 256290 257881 258651 258965 259106 259407 260010 260465 260167 259346 259061 259929 261318 262193 262352 262331 262406 262239 261424 259964
53669 259964 258188 256512 255264 254491 254000 253746 253952 254590 255027 254707 254004 253753 253854 253042 250442 246900 244239
$$ packed form
53777B67241J931O94j73r39j715k105j904j522j521j980k540k891l001k954k742
53762B43879k336j904j770k016k313k358k290k408k561k280j462n28K32J008J998
53747B22891K978L703M435N695P585R565J0771J0475Q512N403J963j378m600p438
53733B80560r177r410q574p429o271n062l953l165k577j943j372j139j154j099
53719B18235r56q36m90L45J185J083m7j180j386q05n3O59J388J866J713J071N72
53702B22364P06J412K229K648K459J963J701J901K368K896L453L843L630K717
53688B56290J591P70L14J41L01O03M55k98q21k85Q68J389Q75J59k1P5j67q15j460
53669B59964j776j676j248p73m91k54K06O38M37l20p03k51J01q12k600l542k661
$$ plain form
53652 244239 243353 243428 243051 241691 240032 239093 239283 240244 241433 242693 244240 246283 248870 252105 256206 261101
53636 261101 266113 270361 273526 275996 278192 279985 280984 281205 281048 280629 279578 277687 275425 273472 271947
53621 271947 270516 269150 268305 268304 269036 270433 272765 276116 279868 283140 285662 287939 290685 294300 298703
53606 298703 303336 307372 310310 312390 314277 316352 318513 320522 322260 323704 324948 326244 327732 329157
53592 329157 330128 330612 330903 331143 331227 331128 330852 330015 328008 324797 321170 317945 315311 313189 311722 310910 310089
53575 310089 308437 305955 303412 301269 299172 296698 294176 292399 291698 291584 291326 290724 290239 290413 291222 292082
53559 292082 292491 292525 292629 293025 293550 293999 294423 295071 296188 297902 300093 302273 303831 304587 305034 305853 307214
53542 307214 308769 310336 312322 315250 319002 322883 326509 330302 334858 340042 345172 350128 355711 362663
$$ packed form
53652B44239q86P5l77j360j659r39J90R61J189J260J547K043K587L235M101M895
53636B61101N012M248L165K470K196J793R99K21j57m19j051j891k262j953j525
53621B71947j431j366q45jP32J397K332L351L752L272K522K277K746L615M403
53606B98703M633M036K938K080J887K075K161K009J738J444J244J296J488J425
53592C29157R71M84K91K40Q4r9k76q37k007l211l627l225k634k122j467q12q21
53575C10089j652k482k543k143k097k474k522j777p01j14k58o02m85J74Q09Q60
53559B92082M09L4J04L96N25M49M24O48J117J714K191K180J558P56M47Q19J361
53542C07214J555J567J986K928L752L881L626L793M556N184N130M956N583O952
$$ plain form
53528 362663 370733 379127 387636 396709 406510 416575 426676 437434 449566 462855 476414 489831
53516 489831 503472 517690 532345 547386 563384 581039 600375 620821 641941 663754 686400
53505 686400 709889 734199 759259 784719 809956 834441 857975 880601 902512 924070 945597
53494 945597 967009 987898 1008104 1027955 1047820 1067730 1087694 1108100 1129382 1151377 1173274
53483 1173274 1194203 1213739 1231963 1249231 1265806 1281487 1295749 1308454 1320139 1331256 1341289
53472 1341289 1349091 1354063 1356586 1357280 1356344 1353699 1349275 1342919 1334332 1323410 1310466 1295903 1279913
53459 1279913 1262602 1244213 1225027 1205230 1185009 1164552 1143773 1122197 1099382 1075395 1050805
53448 1050805 1026296 1002324 979021 956385 934665 914408 895830 878268 860765 843283 826850
$$ packed form
53528C62663Q070Q394Q509R073R801J0065J0101J0758J2132J3289J3559J3417
53516D89831J3641J4218J4655J5041J5998J7655J9336K0446K1120K1813K2646
53505F86400K3489K4310K5060K5460K5237K4485K3534K2626K1911K1558K1527
53494I45597K1412K0889K0206J9851J9865J9910J9964K0406K1282K1995K1897
53483A173274K0929J9536J8224J7268J6575J5681J4262J2705J1685J1117J0033
53472A341289P802M972K523O94r36k645m424o356q587j0922j2944j4563j5990
53459A279913j7311j8389j9186j9797k0221k0457k0779k1576k2815k3987k4590
53448A050805k4509k3972k3303k2636k1720k0257j8578j7562j7503j7482j6433
$$ plain form
53437 826850 812312 799536 788139 778459 771152 766131 762505 759554 757307 756219 756658 758730 762353 767495
53423 767495 774463 783775 795537 809190 824129 840279 857737 876246 895525 915856 937719 960974
53411 960974 985083 1010090 1036738 1065519 1096169 1128189 1161396 1195832 1231703 1269575 1310115
53400 1310115 1353407 1398928 1446273 1495394 1546001 1597464 1649666 1703343 1759027 1816106 1873407
53389 1873407 1930329 1986887 2043087 2098949 2154823 2210921 2266469 2319942 2370259 2417328 2461422
53378 2461422 2502482 2540101 2573762 2602968 2627495 2647580 2663536 2675070 2681374 2682057 2677622 2668759
53366 2668759 2655387 2636736 2612183 2581713 2545591 2503896 2456598 2404051 2347257 2287548 2225965
53355 2225965 2162977 2098830 2034050 1969580 1906501 1845567 1786843 1729737 1673629 1618606 1565345
$$ packed form
53437H26850j4538j2776j1397r680p307n021l626k951k247j088M39K072L623N142
53423G67495O968R312J1762J3653J4939J6150J7458J8509J9279K0331K1863K3255
53411I60974K4109K5007K6648K8781L0650L2020L3207L4436L5871L7872M0540
53400A310115M3292M5521M7345M9121N0607N1463N2202N3677N5684N7079N7301
53389A873407N6922N6558N6200N5862N5874N6098N5548N3473N0317M7069M4094
53378B461422M1060L7619L3661K9206K4527K0085J5956J1534O304O83m435q863
53366B668759j3372j8651k4553l0470l6122m1695m7298n2547n6794n9709o1583
53355B225965o2988o4147o4780o4470o3079o0934n8724n7106n6108n5023n3261
$$ plain form
53344 1565345 1514104 1464196 1414818 1366130 1318964 1273619 1229619 1186745 1145666 1107171 1071237
53333 1071237 1037377 1005600 976511 950433 926900 905112 884632 865566 848306 833261 820670
53322 820670 810483 802374 795885 790554 785978 781914 778423 775877 774744 775307 777540 781216 786096 792042
53308 792042 799028 807080 816183 826261 837310 849664 863965 880640 899373 919357 940180 962126
53296 962126 985488 1009930 1035000 1060997 1088689 1118162 1148579 1179282 1210548 1242814 1275592
53285 1275592 1307706 1338334 1367241 1394055 1418047 1438875 1457080 1473435 1487995 1500074 1509021
53274 1509021 1514644 1516917 1515583 1510306 1501190 1489030 1474917 1459514 1442698 1423967 1403245 1381186
53262 1381186 1358581 1335520 1311305 1285244 1257378 1228271 1198228 1167081 1134794 1101950 1069272
$$ packed form
53344A565345n1241m9908m9378m8688m7166m5345m4000m2874m1079l8495l5934
53333A071237l3860l1777k9089k6078k3533k1788k0480j9066j7260j5045j2591
53322H20670j0187q109o489n331m576m064l491k546j133N63K233L676M880N946
53308G92042O986Q052R103J0078J1049J2354J4301J6675J8733J9984K0823K1946
53296I62126K3362K4442K5070K5997K7692K9473L0417L0703L1266L2266L2778
53285A275592L2114L0628K8907K6814K3992K0828J8205J6355J4560J2079Q947
53274A509021N623K273j334n277r116j2160j4113j5403j6816j8731k0722k2059
53262A381186k2605k3061k4215k6061k7866k9107l0043l1147l2287l2844l2678
$$ plain form
53251 1069272 1036796 1003841 969864 935094 900323 866343 833694 802607 772950 744407 716889
53240 716889 690631 665718 641742 618250 595358 573606 553262 534104 515898 498731 482834
53229 482834 468333 455276 443665 433391 424345 416580 410058 404193 398074 391414 384876 379134 373835
53216 373835 367992 361242 354199 347523 341135 334621 328019 321828 316355 311399 306603 301874 297330 293050
53202 293050 289043 285394 282219 279425 276682 273793 270977 268662 266919 265280 263185 260502 257569 254827
53188 254827 252530 250756 249491 248619 247904 247063 245952 244665 243511 242812 242671 242866 242971 242622 241758 240655
53172 240655 239636 238749 237812 236839 236214 236240 236644 236878 236858 237081 237896 238985 239774 240060 239990 239713 239386 239289 239510
53153 239510 239611 239004 237693 236283 235242 234489 233796 233247 233153 233680 234657 235535 235608 234618 233259 232656 233151 233944
$$ packed form
53251A069272l2476l2955l3977l4770l4771l3980l2649l1087k9657k8543k7518
53240G16889k6258k4913k3976k3492k2892k1752k0344j9158j8206j7167j5897
53229D82834j4501j3057j1611j0274r046p765o522n865o119o660o538n742n299
53216C73835n843o750p043o676o388o514o602o191n473m956m796m729m544m280
53202B93050m007l649l175k794k743k889k816k315j743j639k095k683k933k742
53188B54827k297j774j265q72p15q41j111j287j154o99j41J95J05l49q64j103
53172B40655j019q87r37r73o25K6M04K34k0K23Q15J089P89K86p0k77l27r7K21
53153B39510J01o07j311j410j041p53o93n49r4N27R77Q78P3r90j359o03M95P93
$$ plain form
53135 233944 234174 233942 233915 234289 234697 234994 235518 236487 237545 238105 237855 236858 235417 233957 232841 232117 231537 230827
53117 230827 229805 228371 226720 225549 225602 226769 227983 228243 227523 226439 225362 224260 223211 222522 222262 222042
53101 222042 221453 220506 219494 218547 217513 216207 214712 213336 212297 211472 210614 209804 209437 209597 209711 209164 208091
53084 208091 207167 206670 206223 205525 204844 204560 204577 204535 204262 203714 202729 201282 199812 198837 198303 197715 196928 196364 196358
53065 196358 196673 196862 196784 196556 196273 196005 195926 196201 196813 197574 198192 198231 197327 195672 194127 193552 194028 194912 195528
53046 195528 195643 195417 195231 195479 196233 197060 197443 197403 197512 198253 199558 200936 201746 201403 199801 197748 196535
53029 196535 196687 197379 197448 196774 196247 196571 197659 199129 200743 202111 202510 201500 199534 197608 196411 196063
53013 196063 196426 197249 198054 198275 197644 196288 194546 192841 191622 191087 190996 191013 191177 191691 192323 192531 192226 191916
$$ packed form
53135B33944K30k32k7L74M08K97N24R69J058N60k50r97j441j460j116p24n80p10
53117B30827j022j434j651j171N3J167J214K60p20j084j077j102j049o89k60k20
53101B22042n89r47j012r47j034j306j495j376j039q25q58q10l67J60J14n47j073
53084B08091r24m97m47o98o81k84J7m2k73n48r85j447j470r75n34n88p87n64o
53065A96358L15J89p8k28k83k68p9K75O12P61O18L9r04j655j545n75M76Q84O16
53046A95528J15k26j86K48P54Q27L83m0J09P41J305J378Q10l43j602k053j213
53029A96535J52O92O9o74n27L24J088J470J614J368L99j010j966j926j197l48
53013A96063L63Q23Q05K21o31j356j742j705j219n35r1J7J64N14O32K08l05l10
$$ plain form
52995 191916 191925 192000 191935 192000 192277 192129 190979 189370 188514 188923 190035 191104 191807 192016 191736 191403 191648 192486 193248
52976 193248 193526 193629 193904 194174 194176 194023 193851 193475 192869 192539 192919 193751 194570 195437 196630 197917 198856 199570 200542
52957 200542 201722 202538 202789 202801 202638 201910 200579 199332 198741 198610 198496 198395 198413 198130 196917 194826 192702
52940 192702 191352 190840 190649 190323 189837 189453 189299 189157 188673 187743 186610 185686 185362 185827 186828 187667 187745 187068
52922 187068 186002 184662 182977 181284 180269 180145 180370 180467 180705 181579 182973 184271 185137 185762 186426 187153 187784
52905 187784 188164 188216 188020 187786 187673 187664 187615 187281 186314 184590 182664 181522 181539 181947 181761 180999 180615 181234 182458
52886 182458 183501 184185 185012 186386 187977 189004 189082 188644 188366 188335 188095 187466 186894 186796 186950 186874 186531 186343 186652
52867 186652 187462 188510 189346 189554 189244 189119 189697 190655 191383 191937 192903 194379 195736 196522 197022 197722 198643 199510
$$ packed form
52995A91916RP5o5O5K77j48j150j609q56M09J112J069P03K09k80l33K45Q38P62
52976A93248K78J03K75K70Kj53j72l76o06l30L80Q32Q19Q67J193J287R39P14R72
52957B00542J180Q16K51J2j63p28j331j247n91j31j14j01J8k83j213k091k124
52940A92702j350n12j91l26m86l84j54j42m84r30j133r24l24M65J001Q39P8o77
52922A87068j066j340j685j693j015j24K25R7K38Q74J394J298Q66O25O64P27O31
52905A87784L80N2j96k34j13rm9l34r67j724j926j142J7M08j86p62l84O19J224
52886A82458J043O84Q27J374J591J027P8m38k78l1k40o29n72r8J54p6l43j88L09
52867A86652Q10J048Q36K08l10j25N78R58P28N54R66J476J357P86N00P00R21Q67
$$ plain form
52849 199510 200239 200909 201505 201996 202498 203059 203382 203076 202132 200930 199760 198536 197068 195415 193874 192633
52833 192633 191587 190464 189036 187161 184813 182256 180129 179112 179448 180905 183143 185837 188457 190387
52819 190387 191509 192351 193358 194248 194383 193594 192309 191029 190002 189271 188722 188235 188015 188618 190308 192653
52803 192653 195187 198113 201772 205581 208288 209329 209184 208297 206423 203394 199769 196169 192523 188607 184968
52788 184968 182525 181363 180547 179201 177327 175451 173904 172682 171742 171124 170818 170674 170516 170327 170277 170571 171276
52771 171276 172325 173631 175106 176631 178134 179658 181191 182499 183304 183616 183677 183608 183352 182940 182548 182255 181989
52754 181989 181774 181752 181899 181990 181899 181720 181573 181613 182179 183500 185162 186362 186892 187375 188212 188810 188391 187174 186161
52735 186161 185942 186251 186681 187218 187935 188605 188851 188550 188000 187808 188589 190544 193264 196047 198403 200161 201195
$$ packed form
52849A99510P29O70N96M91N02N61L23l06r44j202j170j224j468j653j541j241
52833A92633j046j123j428j875k348k557k127j017L36J457K238K694K620J930
52819A90387J122Q42J007Q90J35p89j285j280j027p31n49m87k20O03J690K345
52803A92653K534K926L659L809K707J041j45q87j874l029l625l600l646l916l639
52788A84968k443j162q16j346j874j876j547j222r40o18l06j44j58j89n0K94P05
52771A71276J049J306J475J525J503J524J533J308Q05L12O1o9k56m12l92k93k66
52754A81989k15k2J47R1r1j79j47M0N66J321J662J200N30M83Q37N98m19j217j013
52735A86161k19L09M30N37P17O70K46l01n50j92P81J955K720K783K356J758J034
$$ plain form
52718 201195 201333 200583 199269 197829 196456 194962 193024 190648 188350 186724 185831 185225 184585 183984 183437 182619
52702 182619 181368 180139 179514 179414 179246 178812 178632 179226 180433 181600 182285 182595 182860 183143 183158 182684 181909 181243
52684 181243 180912 180913 181191 181499 181226 179993 178492 178078 179198 180831 181894 182564 183587 184844 185457 184991 183735
52667 183735 182001 180091 178846 179195 180903 182658 183741 184828 186696 188873 190264 190650 190827 191433 192252
52652 192252 192704 192656 192651 193500 195611 198689 202184 205922 209970 213867 216553 217320 216447 214650 212296 209574
52636 209574 206985 204994 203352 201325 198733 196356 195119 195141 195720 196184 196694 198197 201502 206349 211544
52621 211544 215999 219430 221953 223370 223218 221376 218281 214613 210951 207621 204659 201989 199780 198464
52607 198464 198151 198217 197822 196812 195831 195545 196000 196725 197260 197509 197716 198072 198310 197883 196683 195369 194752 195046
$$ packed form
52718B01195J38p50j314j440j373j494j938k376k298j626q93o06o40o01n47q18
52702A82619j251j229o25j00j68m34j80N94J207J167O85L10K65K83J5m74p75o66
52684A81243l31JK78L08k73j233j501m14J120J633J063O70J023J257O13m66j256
52667A83735j734j910j245L49J708J755J083J087J868K177J391L86J77O06Q19
52652A92252M52m8nQ49K111L078L495L738M048L897K686P67q73j797k354k722
52636B09574k589j991j642k027k592k377j237K2N79M64N10J503L305M847N195
52621B11544M455L431K523J417j52j842l095l668l662l330k962k670k209j316
52607A98464l13O6l95j010r81k86M55P25N35K49K07L56K38m27j200j314o17K94
$$ plain form
52589 195046 195947 197220 198752 200171 200923 200802 200111 199323 198871 199196 200479 202268 203757 204576 204995 205373 205853
52572 205853 206626 207929 209514 210664 211121 211563 212705 214219 215075 214760 213690 212506 211439 210382 209214
52557 209214 207938 206739 205881 205393 204938 204225 203377 202584 201616 200194 198809 198471 199437 200717 201275 201310 201797
52540 201797 202967 203846 203438 201933 200464 199905 200185 200674 200937 200986 201010 201118 201393 201944 202751 203516 203928 204061
52522 204061 204367 205182 206389 207600 208478 208779 208303 207127 205873 205436 206250 207924 209715 211267 212719 214170
52506 214170 215415 216369 217574 219816 223193 226833 229675 231324 231934 231540 229943 227225 223955 220729 217761
52491 217761 215067 212778 211048 209843 209069 208787 209042 209539 209770 209535 209218 209438 210473 212018 213445 214309
52475 214309 214675 214991 215670 216855 218543 220736 223333 226002 228318 230032 231169 231939 232660 233648 235026 236610
$$ packed form
52589A95046R01J273J532J419P52j21o91p88m52L25J283J789J489Q19M19L78M80
52572B05853P73J303J585J150M57M42J142J514Q56l15j070j184j067j057j168
52557B09214j276j199q58m88m55p13q48p93r68j422j385l38R66J280N58L5M87
52540B01797J170Q79m08j505j469n59K80M89K63M9K4J08K75N51Q07P65M12J33
52522B04061L06Q15J207J211Q78L01m76j176j254m37Q14J674J791J552J452J451
52506B14170J245R54J205K242L377L640K842J649O10l94j597k718l270l226k968
52491B17761k694k289j730j205p74k82K55M97K31k35l17K20J035J545J427Q64
52475B14309L66L16O79J185J688K193K597K669K316J714J137P70P21R88J378J584
$$ plain form
52459 236610 238078 239171 239762 239903 239947 240438 241608 243015 243859 243608 242196 239803 236803 233930 232000 231134
52443 231134 230406 228604 225446 221922 219309 217936 217049 215866 214519 213686 213500 213278 212447 211331 210727 211011
52427 211011 211904 212854 213299 212782 211326 209599 208358 207775 207618 207859 208580 209412 209732 209528 209496 210079 210983 211829
52409 211829 212719 213792 214722 215185 215549 216616 218856 222235 226578 231675 237159 242739 248488 254560 260604
52394 260604 265768 269337 271162 271442 270325 267875 264276 259921 255291 250809 246897 244093 242778 242584 242367
52379 242367 241265 239676 238738 238908 239666 240565 241737 243089 243899 243787 243528 244183 245909 248201 250866 253932
52363 253932 256961 259327 261128 263011 265099 266748 267360 266812 265146 262559 259800 257796 256672 255708 254430
52348 254430 253169 252390 252145 252418 253346 254701 255714 255883 255509 255073 254552 253740 252874 252427 252571 253242 254477
$$ packed form
52459B36610J468J093N91J41M4M91J170J407Q44k51j412k393l000k873j930q66
52443B31134p28j802l158l524k613j373q87j183j347q33j86k22q31j116o04K84
52427B11011Q93R50M45n17j456j727j241n83j57K41P21Q32L20k04l2N83R04Q46
52409B11829Q90J073R30M63L64J067K240L379M343N097N484N580N749O072O044
52394B60604N164L569J825K80j117k450l599m355m630m482l912k804j315j94k17
52379B42367j102j589r38J70P58Q99J172J352Q10j12k59O55J726K292K665L066
52363B53932L029K366J801J883K088J649O12n48j666k587k759k004j124r64j278
52348B54430j261p79k45K73R28J355J013J69l74m36n21q12q66m47J44O71J235
$$ plain form
52331 254477 256335 258723 261620 265188 269388 273841 278486 283963 290800 298428 305575 311553 316708 321700
52317 321700 326864 332223 337656 342921 347856 352621 357455 362148 366077 368861 370773 372493 374652 377588
52303 377588 381286 385448 389772 394172 398652 403129 407586 412207 417016 421513 425101 427899 430714 434096
52289 434096 437699 440651 442266 442387 441454 440350 439793 439659 439282 438571 438317 439022 439916 439884 439151 439181 440780 443034
52271 443034 444551 445168 445878 447447 449804 452685 456112 460043 464114 468030 471873 475674 479047 481663 483925
52256 483925 486714 490483 494939 499638 504526 509780 515415 521250 527150 533117 539161 545082 550397 554549
52242 554549 557381 559323 561016 562785 564623 566576 568862 571608 574734 578099 581515 584610 586989 588739
52228 588739 590535 593054 596374 600041 603593 606893 610044 613149 616202 619216 622386 625943 629807 633614
$$ packed form
52331B54477J858K388K897L568M200M453M645N477O837P628P147N978N155M992
52317C21700N164N359N433N265M935M765M834M693L929K784J912J720K159K936
52303C77588L698M162M324M400M480M477M457M621M809M497L588K798K815L382
52289D34096L603K952J615J21r33j104n57j34l77p11k54P05Q94l2p33L0J599K254
52271D43034J517O17P10J569K357K881L427L931M071L916L843L801L373K616K262
52256D83925K789L769M456M699M888N254N635N835N900N967O044N921N315M152
52242E54549K832J942J693J769J838J953K286K746L126L365L416L095K379J750
52228E88739J796K519L320L667L552L300L151L105L053L014L170L557L864L807
$$ plain form
52214 633614 637233 641028 645320 649839 654085 657970 661609 664720 666986 669045 672305 677457 683752 690039
52200 690039 695893 701345 706174 710139 713569 717077 720879 724825 728863 732995 737038 740941 745102 749862
52186 749862 754851 759378 763308 766954 770236 772624 773964 774720 775229 775226 774273 772188 768856 764168 758482 752781
52170 752781 747927 743871 739859 735307 730352 725669 721882 719097 716940 715118 713864 713655 714504 715800 716857
52155 716857 717432 717756 718319 719544 721309 722820 723350 723119 722969 723118 722875 721896 721078 721641 723707 726386 728990
52138 728990 731415 733387 734201 733551 732062 730544 729028 727002 724356 721559 718987 716595 714469 713221 713515
52123 713515 715452 718775 723495 729889 737942 747195 757255 768078 779628 791523 803221 814307 824459
52110 824459 833373 840891 847028 851722 854862 856655 857559 857638 856402 853710 850432 847671 845695 844228 843566
$$ packed form
52214F33614L619L795M292M519M246L885L639L111K266K059L260N152O295O287
52200F90039N854N452M829L965L430L508L802L946M038M132M043L903M161M760
52186G49862M989M527L930L646L282K388J340P56N09lr53k085l332m688n686n701
52170G52781m854m056m012m552m955m683l787k785k157j822j254k09Q49J296J057
52155G16857N75L24N63J225J765J511N30k31j50J49k43r79q18N63K066K679K604
52138G28990K425J972Q14o50j489j518j516k026k646k797k572k392k126j248K94
52123G13515J937L323M720O394Q053R253J0060J0823J1550J1895J1698J1086J0152
52110H24459Q914P518O137M694L140J793R04P9j236k692l278k761j976j467o62
$$ plain form
52095 843566 844603 847802 852842 859342 867116 875519 883259 889339 893640 896280 897002 895702 893012 889662
52081 889662 885571 880219 873818 867449 862093 858062 855360 853958 853480 853181 852674 852524 853687 856365 859601
52066 859601 862065 863220 863697 864553 866199 868088 869438 870112 870639 871456 872348 872719 872313 871480 870674 869839 868537
52049 868537 866746 865198 864581 864590 864198 862837 860796 858321 854946 850146 844237 838048 831972 825963 820328
52034 820328 815770 812462 809758 807218 805472 805584 807798 811333 815278 819243 823202 827169 831145 835139
52020 835139 839132 843255 848047 854249 862071 870835 879542 887713 895521 903284 911103 918979 926887 934575
52006 934575 941475 947035 951059 953563 954290 952525 947462 938709 926485 911420 894233 875478 855363
51993 855363 833761 810549 786192 761946 739210 718490 699175 680444 662253 645260 630053
$$ packed form
52095H43566J037L199N040O500P774Q403P740O080M301K640P22j300k690l350
52081H89662m091n352o401o369n356m031k702j402m78k99n07j50J163K678L236
52066H59601K464J155M77Q56J646J889J350O74N27Q17Q92L71m06q33q06q35j302
52049H68537j791j548o17Rl92j361k041k475l375m800n909o189o076o009n635
52034H20328m558l308k704k540j746J12K214L535L945L965L959L967L976L994
52020H35139L993M123M792O202P822Q764Q707Q171P808P763P819P876P908P688
52006I34575O900N560M024K504P27j765n063q753j2224j5065j7187j8755k0115
51993H55363k1602k3212k4357k4246k2736k0720j9315j8731j8191j6993j5207
$$ plain form
51982 630053 616806 605462 595730 586837 577788 568105 557999 547713 537153 526359 515839 506024
51970 506024 496743 487679 479059 471443 465127 460274 457411 457060 458885 461779 465010 468835 473954 480814
$$ packed form
51982F30053j3247j1344r732q893r049r683j0106j0286j0560j0794j0520r815
51970E06024r281r064q620p616o316m853k863l51J825K894L231L825N119O860
$$ [...]
##END NTUPLES=NMR SPECTRUM
##END=
