
##TITLE=AC1404_GUAAH12213_7653413_rbBq1cP9aP
##JCAMPDX= 6.0         $$ Bruker NMR JCAMP-DX V2.0
##DATA TYPE= nD NMR SPECTRUM
##DATA CLASS= NTUPLES
##NUM DIM= 2
##ORIGIN= BRUKER
##OWNER= Administrator
$$ 1.72 TOPSPIN		Version 2.1
$$ 2013-03-20 00:20:07.574 -0500  Administrator@X
$$ Compression mode = diff/dup
##.OBSERVE FREQUENCY= 400.02188249412
##.OBSERVE NUCLEUS= ^1H
##.ACQUISITION MODE= SIMULTANEOUS (DQD)
##.ACQUISITION SCHEME= NOT PHASE SENSITIVE
##.AVERAGES= 4
##.DIGITISER RES= 22
##SPECTROMETER/DATA SYSTEM= spect
##.PULSE SEQUENCE= jresgppsqf.2
##.SOLVENT NAME= COFFEE_meoh
##.SHIFT REFERENCE= INTERNAL, COFFEE_meoh, 1, 14.96087
##AUDIT TRAIL= $$ (NUMBER, WHEN, WHO, WHERE, PROCESS, VERSION, WHAT)
$$ ##TITLE= Audit trail, TOPSPIN		Version 2.1
$$ ##JCAMPDX= 5.01
$$ ##ORIGIN= Bruker BioSpin GmbH
$$ ##OWNER= Administrator
$$ $$ E:\/data/COFFEE/nmr/AC1404_GUAAH12213_7653413_rbBq1cP9aP/13/pdata/1/auditp.txt
$$ ##AUDIT TRAIL=  $$ (NUMBER, WHEN, WHO, WHERE, PROCESS, VERSION, WHAT)
(   1,<2013-03-20 00:19:58.465 -0500>,<Administrator>,<X>,<go>,<TOPSPIN 2.1>,
      <created by zg
	started at 2013-03-20 00:05:35.246 -0500,
	POWCHK enabled, PULCHK disabled,
       configuration hash MD5:
       86 BA 57 50 F2 9D 5C 9B 26 00 A9 28 5F 66 2E 89
       data hash MD5: 8K * 40
       E9 6F 59 82 92 1F 45 6E C1 94 EE 53 F4 AB 80 5A>)
(   2,<2013-03-20 00:20:02.840 -0500>,<Administrator>,<X>,<proc2d>,<TOPSPIN 2.1>,
      <Start of raw data processing
       xfb same F2: SI = 16K WDW = 3 SSB = 0 FT_mod = 6 PKNL = 1 F1: SI = 512 WDW = 3 SSB = 0 FT_mod = 6 PH_mod = 2
       data hash MD5: 16K * 512
       D7 F5 53 85 D1 A5 CB E4 3D AE 3C 2C E9 E6 87 5E>)
(   3,<2013-03-20 00:20:03.855 -0500>,<Administrator>,<X>,<proc2d>,<TOPSPIN 2.1>,
      <abs2 F2: ABSG = 5 ABSF1 = 10.00076 ABSF2 = 0.0002249279
       data hash MD5: 16K * 512
       FE 07 07 DE CA 98 3C BF E0 3A 98 B4 BF 40 B2 FD>)
(   4,<2013-03-20 00:20:04.543 -0500>,<Administrator>,<X>,<proc2d>,<TOPSPIN 2.1>,
      <tilt
       data hash MD5: 16K * 512
       8E 57 A4 45 4D 96 9B 01 9D 68 1C 07 2B 8B 7F 59>)
(   5,<2013-03-20 00:20:05.980 -0500>,<Administrator>,<X>,<proc2d>,<TOPSPIN 2.1>,
      <abs1 F1: ABSG = 5 ABSF1 = 0.06497851 ABSF2 = -0.06497862
       data hash MD5: 16K * 512
       91 DC AE 58 AD FF 99 AB A8 54 2D 27 B4 DD BF A9>)
(   6,<2013-03-20 00:20:07.199 -0500>,<Administrator>,<X>,<proc2d>,<TOPSPIN 2.1>,
      <symj
       data hash MD5: 16K * 512
       39 39 64 F1 47 C9 A3 4A 9A F5 B0 C9 52 78 D7 4E>)
$$ ##END=
$$ 
$$ $$ hash MD5
$$ $$ 52 61 4D 16 41 E1 2E 8B C4 EB 8A 1D F3 38 03 BF
##$RELAX= 
##$RELAX= 
##$RELAX= 
##$RELAX= 
##$RELAX= 
##$RELAX= 
##$RELAX= 
$$ Bruker specific parameters
$$ --------------------------
##$DU= <E:\>
##$EXPNO= 13
##$NAME= <AC1404_GUAAH12213_7653413_rbBq1cP9aP>
##$PROCNO= 1
##$TYPE= <nmr>
##$USER= <COFFEE>
##$ACQT0= 1000000
##$AMP= (0..31)
100 100 100 100 100 100 100 100 100 100 100 100 100 100 100 100 100 100
$$ [...]
##$TD0= 1
##$TE= 300
##$TE2= 300
##$TE3= 300
##$TEG= 300
##$TL= (0..7)
0 120 120 120 120 120 120 120
##$TP= (0..7)
150 150 150 150 150 150 150 150
##$TP07= 0
##$TPNAME0= <>
##$TPNAME1= <>
##$TPNAME2= <>
##$TPNAME3= <>
##$TPNAME4= <>
##$TPNAME5= <>
##$TPNAME6= <>
##$TPNAME7= <>
##$TPOAL= (0..7)
0.5 0.5 0.5 0.5 0.5 0.5 0.5 0.5
##$TPOFFS= (0..7)
0 0 0 0 0 0 0 0
##$TUNHIN= 0
##$TUNHOUT= 0
##$TUNXOUT= 0
##$USERA1= <user>
##$USERA2= <user>
##$USERA3= <user>
##$USERA4= <user>
##$USERA5= <user>
##$V9= 5
##$VALIST= <valist>
##$VCLIST= <CCCCCCCCCCCCCCC>
##$VD= 0
##$VDLIST= <DDDDDDDDDDDDDDD>
##$VPLIST= <PPPPPPPPPPPPPPP>
##$VTLIST= <TTTTTTTTTTTTTTT>
##$WBST= 2048
##$WBSW= 25
##$XGAIN= (0..3)
0 0 0 0
##$XL= 0
##$YL= 0
##$YMAX_a= 66424
##$YMIN_a= -127163
##$ZGOPTNS= <>
##$ZL1= 120
##$ZL2= 120
##$ZL3= 120
##$ZL4= 120
##$ABSF1= 0.06497851
##$ABSF2= -0.06497862
##$ABSG= 5
##$ABSL= 0
##$ALPHA= 0
##$AQORDER= 0
##$ASSFAC= 0
##$ASSFACI= 0
##$ASSFACX= 0
##$ASSWID= 0
##$AUNMP= <>
##$AXLEFT= 0
##$AXNAME= <F1>
##$AXNUC= <1H>
##$AXRIGHT= 0
##$AXTYPE= 0
##$AXUNIT= <>
##$AZFE= 0.1
##$AZFW= 0.5
##$BCFW= 0
##$BC_mod= 0
##$BYTORDP= 0
##$COROFFS= 0
##$CY= 15
##$DATMOD= 1
##$DC= 0
##$DFILT= <>
##$DTYPP= 0
##$F1P= 0
##$F2P= 0
##$FCOR= 0.5
##$FTSIZE= 512
##$FT_mod= 6
##$GAMMA= 0
##$GB= 0
##$INTBC= 1
##$INTSCL= 1
##$ISEN= 128
##$LB= 0
##$LEV0= 0
##$LPBIN= 0
##$MAXI= 10000
##$MC2= 0
##$MEAN= 0
##$ME_mod= 0
##$MI= 1
##$NCOEF= 0
##$NC_proc= -5
##$NLEV= 6
##$NOISF1= 0
##$NOISF2= 0
##$NSP= 0
##$NTH_PI= 0
##$NZP= 0
##$OFFSET= 0.06497851
##$PC= 4
##$PHC0= 0
##$PHC1= 0
##$PH_mod= 2
##$PKNL= no
##$PPARMOD= 1
##$PPDIAG= 0
##$PPIPTYP= 0
##$PPMPNUM= 2147483647
##$PPRESOL= 1
##$PSCAL= 1
##$PSIGN= 0
##$PYNMP= <proc.py>
##$REVERSE= no
##$SF= 400.021882494141
##$SI= 512
##$SIGF1= 0.06497851
##$SIGF2= -0.06497862
##$SINO= 16
##$SIOLD= 512
##$SPECTYP= <>
##$SREGLST= <1H.MeOD>
##$SSB= 0
##$STSI= 512
##$STSR= 0
##$SW_p= 51.9856959427865
##$SYMM= 3
##$S_DEV= 2669
##$TDeff= 40
##$TDoff= 0
##$TI= <>
##$TILT= yes
##$TM1= 0
##$TM2= 0
##$TOPLEV= 0
##$USERP1= <user>
##$USERP2= <user>
##$USERP3= <user>
##$USERP4= <user>
##$USERP5= <user>
##$WDW= 3
##$XDIM= 16
##$YMAX_p= 303274427
##$YMIN_p= 0
$$ End of Bruker specific parameters
$$ ---------------------------------
##NTUPLES= nD NMR SPECTRUM
##VAR_NAME=  FREQUENCY1,    FREQUENCY2,      SPECTRUM
##SYMBOL=    F1,            F2,              Y
##.NUCLEUS=  1H,            1H
##VAR_TYPE=  INDEPENDENT,   INDEPENDENT,     DEPENDENT
##VAR_FORM=  AFFN,          AFFN,            ASDF
##VAR_DIM=   512,           16384,           16384
##UNITS=     HZ,            HZ,              ARBITRARY UNITS
##FACTOR=    0.101534562388255, 0.501933850740131, 1
##FIRST=     25.9928259484165, 8223.18227667557, 964
##LAST=      -25.8913354319817, 0,           -638
##MIN=       -25.8913354319817, 0,           0
##MAX=       25.9928259484165, 8223.18227667557, 303274427
##PAGE= F1=25.99282594842
##FIRST=     25.9928259484165, 8223.18227667557, 964
##DATA TABLE= (F2++(Y..Y)), PROFILE
$$ [...]
##PAGE= F1=-2.202297678447e-005
##FIRST=     25.9928259484165, 8223.18227667557, 3009
##DATA TABLE= (F2++(Y..Y)), PROFILE
15144a907j20L47h16K28m73r65j161m60L96J181R43a64I78R70N27j06p16B81a552
$$ -1907 -2027 -1680 -816 -588 -1061 -2026 -3187 -3647 -3251 -2070 -1127 -164 978 1948 2475 2369 1653 281 -1552
15124c588R87i13B11M08j74r7R6L36B09a470j728j4M49N41M46M1J77J8n5O00E15
$$ -3588 -2601 -913 211 619 445 348 444 780 209 -1470 -3198 -3212 -2763 -2222 -1776 -1735 -1558 -1540 -1595 -995 515
15102B316J570P09l54j203j218o95n9Q8O62R68J835J743R10P2n38o64r76k143
$$ 2316 3886 4595 4241 3038 1820 1125 1066 1154 1816 2784 4619 6362 7272 7344 6806 6142 5166 3023
15084C023A383A61i11j178o50k77M84O95L3J43N63b05C26a21n85j91b93E05K24
$$ 3023 1383 161 -911 -2089 -2739 -3016 -2532 -1837 -1804 -1661 -1098 -205 326 -121 -706 -897 -293 505 729
15065G29A93i36r15f56E68O13J7m68D9f12o94r85q45l18P73J315g9A448J170R15
$$ 729 193 -936 -1851 -656 568 1181 1198 730 49 -612 -1306 -2291 -3136 -3454 -2681 -1366 -79 1448 2618 3533
15045C533L06m36j211e3k460r95J575b79F82M79j02k83k51J86L18J02l17j52C02
$$ 3533 3839 3403 2192 -53 -2513 -3508 -1933 -279 682 1161 1059 776 525 711 1029 1131 814 662 302
15025F6c44n25c04A287K087K559K017R66M68k93q18j071j630j674j061n13k36
$$ 66 -344 -869 -304 1287 3374 5933 7950 8916 9384 9091 8273 7202 5572 3898 2837 2324 2088
15008B088Q2N26J48P7K69K05k80n98j151H3a394r21K71Q48a26H10L57j3E72a63
$$ 2088 2170 2696 2844 2921 3190 3395 3115 2517 1366 83 -1394 -2315 -2044 -1196 -126 810 1167 1154 572 -163
14987e14Q9a99N5B38m6a93r17j292q04a564A131K545J928R92k22j609j977A132
$$ -514 -425 -199 -144 238 192 -193 -1110 -2402 -3206 -1564 1131 3676 5604 6596 6374 4765 2788 1132
14968B64M39O43R4j36o42B49i56j352EJ612J043P13p24I81a733k695K167e84C41
$$ 264 703 1346 1440 1304 662 249 -956 -2308 5 1617 2660 3373 2649 981 -1733 -4428 -2261 -584 341
14948D98G8d22o13m35j5L22d02E11P47N05P76J186J373N30p94j647G80b304j683
$$ 498 78 -422 -1035 -1470 -1485 -1163 -402 511 1258 1763 2539 3725 5098 5628 4834 3187 780 -2304 -3987
14929c987a446H16J674J118J087J130M18j009k492c20k508k95g22G09J12l86R9
$$ -3987 -1446 816 2490 3608 4695 5825 6243 5234 2742 -320 -2828 -3123 -722 709 821 435 534
14912E34Q87J367J331J101j04r97B025c95k390k48P59K80M98d63E39N83K2D85
$$ 534 1421 2788 4119 5220 5116 4119 2025 -395 -2785 -3033 -2274 -1994 -1496 -463 539 1122 1144 485
14893e48n26K39K34n27q16o65o08n9q83p37O53J732g49A017J453k1A154f06j182
$$ -548 -1074 -835 -601 -1128 -1944 -2609 -3217 -3276 -4159 -4896 -4243 -2511 -749 1017 2470 2449 1154 -606 -1788
14874a788N18D00J285R9p54d89k185j707m19J325O99J44J89K17K49L19L06e19
$$ -1788 -1270 400 1685 1784 1030 -489 -2674 -4381 -4800 -3475 -2776 -2632 -2443 -2226 -1977 -1658 -1352 -519
14855a06m0m48r89r63j056J95J169a039G78J644J338J584J000L21o57o19q36j158
$$ -106 -146 -594 -1583 -2546 -3602 -3407 -2238 -1039 778 2422 3760 5344 6344 6665 6008 5389 4553 3395
14837C395j588A59a878j164o5R4l28l43J804b24A258Q66M16n88C05a559j728j519
$$ 3395 1807 159 -1878 -3042 -3107 -3013 -3341 -3684 -1880 -224 1258 2124 2540 1952 305 -1559 -3287 -4806
14819d806l57J255J757h89B25N12j48A94d16k9L4m64q99j817a416A72J706Q00
$$ -4806 -5163 -3908 -2151 -889 225 737 589 194 -416 -445 -411 -875 -1774 -3591 -1416 172 1878 2678
14801B678l7p52q44c46j183o66l26L42R25a22G06O36N1F82a92A02J329R54n02
$$ 2678 2641 1889 1045 -346 -1529 -2195 -2521 -2179 -1254 -122 706 1342 1393 682 -192 102 1431 2385 1883
14782A883B30b311l577K448f91B210J749N48o20p52j139o63k98J51M78K52K84
$$ 1883 230 -2311 -5888 -3440 -691 2210 3959 4507 3887 3135 1996 1333 1035 1186 1664 1916 2200
14765B200J4N7L60O10P33O45M25k70j044j809b55k193j928m51l82N36R04N40L80
$$ 2200 2214 2271 2631 3241 3974 4619 5044 4774 3730 1921 -255 -2448 -4376 -4827 -5209 -4673 -3769 -3229 -2849
14746b849J021d03H89P20L28M4l29k57o76B91b24C90O1M08P92J073P93l3r69A140
$$ -2849 -1828 -403 889 1609 1937 1981 1652 1395 719 291 -224 390 451 859 1651 2724 3517 3484 2515 1140
14725d67j177o42O9R1j81J13L35M46k38j201j223J025g97I59R20K89j95o65C42
$$ -467 -1644 -2286 -2217 -2126 -2307 -2194 -1859 -1413 -1651 -2852 -4075 -3050 -797 959 1879 2168 1973 1308 342
14705d29o38p69L05H19K561K337J882J258J24l53j008j656j890j696p99p36A57
$$ -429 -1067 -1836 -1531 819 3380 5717 7599 8857 8981 8628 7620 5964 4074 2378 1579 843 157
14687b05q20k22a99A777K329J377Q20k73j340j888G91a276j278p72m60N73a569
$$ -205 -1025 -1247 -199 1777 4106 5483 6303 6030 4690 2802 791 -1276 -2554 -3326 -3786 -3213 -1569
14669a2A033K49l33a13r73o91K1g85B88N57b7j224q94j041q83l18L90L08Q89O73
$$ -12 1033 1282 949 -113 -1086 -1777 -1756 -785 288 845 -27 -1251 -2145 -3186 -4069 -4387 -3997 -3689 -2800 -2127
14649b127M41M34J75M56a34C5f20p88Jg03A6N13OA59d09l41O3P3H2J552J395J068
$$ -2127 -1686 -1252 -1077 -621 -134 35 -620 -1408 -1407 -703 16 529 535 159 -409 -750 -687 -614 82 1634 3029 4097
14627D097K14n50p24j039G86h61j884j596a831A095J976O01o58j423c41k203j561
$$ 4097 4311 3761 3037 1998 786 -861 -2745 -4341 -1831 1095 3071 3672 3014 1591 -341 -2544 -4105
14610d105j01L83J309i47A026J758J487J187R96j17q37j826A280a133j819O37
$$ -4105 -4206 -3823 -2514 -947 1026 2784 4271 5458 6454 6337 5500 3674 1280 -1133 -2952 -2315
14594b315a006M59k54n66q25j155q47j17J189O86L65q6j53O42e32D32N3a5r57
$$ -2315 -1006 -547 -801 -1367 -2192 -3347 -4194 -4311 -3122 -2436 -2071 -2157 -2310 -1668 -532 432 485 -15 -972
14575i72j425l90a212D31P89o3C02i47j270k55i92A098J734J301O09J08l47q93
$$ -972 -2397 -2787 -1212 431 1220 1157 302 -947 -2217 -2472 -992 1098 2832 4133 4742 4850 4503 3610
14557C610j025q91j23J25j55m86B36e45j083j317j487j759P97b666A50J914J197
$$ 3610 2585 1694 1571 1696 1541 1055 236 -545 -1628 -2945 -4432 -6191 -5394 -2666 150 2064 3261
14540C261K30j107A79a502L07E42J050K65m08n13e5r86l7M78K8j038j700K11a509
$$ 3261 3491 2384 179 -1502 -1195 542 1592 1857 1449 936 -55 -1041 -1078 -600 -572 -1610 -3310 -3099 -1509
14520D67J402L43n12E60d37p13k12k8K96J73J65J74k7k12p95p84k85k96k99N5
$$ 467 1869 2212 1700 560 -437 -1150 -1362 -1390 -1094 -921 -756 -582 -609 -821 -1616 -2400 -2685 -2981 -3280 -3225
14500c225J213d07A017Q38K85L31j5p82F47d04m39b94C15M2j34J5J96P72J051
$$ -3225 -2012 -407 1017 1855 2140 2471 2456 1674 647 -404 -843 -294 315 357 223 238 434 1206 2257
14481B257M10m13j064c20j711j466J371h2A587J370O00p97G00a319M11A332J760
$$ 2257 2667 2254 1190 -320 -2031 -3497 -2126 -82 1587 2957 3557 2760 700 -1319 -908 1332 3092
14464C092N40j075D23a689j507R01i67b49K5l11J0om44l45o81m29j50L33O25e52
$$ 3092 3632 2557 423 -1689 -3196 -2295 -967 -249 -224 -535 -525 -531 -975 -1320 -2001 -2430 -2580 -2247 -1622 -552
14443E01N66k90A67d65J11C09J036J513J060J14p33j120H12d10j016o38p24m2
$$ 501 1067 777 167 -465 -354 309 1345 2858 3918 4032 3299 2179 812 -410 -1426 -2064 -2788 -2830
14425b830K64K76q00q30R88a226E0P77N43Q81O76L65j92o70n67l82J08l12r9k80
$$ -2830 -2566 -2290 -3090 -3920 -2932 -1226 50 827 1370 2251 2927 3292 3100 2430 1863 1481 1589 1277 1178 898
14405H98q3K39M78N27L48J80l67l12K77N14M91J18k35n45o94q76a85j174q13k26
$$ 898 815 1054 1532 2059 2407 2587 2220 1908 2185 2699 3190 3308 3073 2528 1834 958 -185 -1359 -2172 -2398
14385b398N30R18A20O05N62P38P09N47J47j011A085g84k165J009B06J408N91p0
$$ -2398 -1868 -950 120 725 1287 2025 2734 3281 3428 2417 1085 -784 -2949 -1940 206 1614 2205 2135
14367B135m60n13D53b54k7H04J540J261N98Rn08j167E30a643r27Q50d13H36L39
$$ 2135 1675 1162 453 -254 -281 804 2344 3605 4203 4212 3704 2537 530 -1643 -2570 -1720 -413 836 1175
14348A175o4a72j332j564j182p12J595a332d0C18J2A33a16F8L86M90M05J31n94
$$ 1175 1111 -172 -1504 -3068 -4250 -4962 -3367 -1332 -40 318 330 133 -116 68 454 944 1349 1480 886
14329H86e01j722j850N1J702E6J048K13n77e53j734j432J328f20A026O82K13k11
$$ 886 -501 -2223 -4073 -4022 -2320 56 1104 1317 740 -553 -2287 -3719 -2391 -620 1026 1708 1921 1710
14311A710n50G5h98r60l4O64c92a24k4o7p4k08Q9m95j135j707r46b319c00F33
$$ 1710 1160 75 -898 -1858 -1892 -1228 -392 -124 -148 -215 -289 -497 -408 -903 -2038 -3745 -4691 -2319 -300 633
14290I6a174j493p24c73A819R80L43m5l28m85o41o71B98j03M93Q15N14r08a214
$$ 96 -1174 -2667 -3391 -373 1819 2799 3142 3097 2769 2284 1643 972 298 195 688 1503 2017 1109 -1214
14270c680j197J492J262N73m1l25J27M02L12o5j02L19M11J03K6b6E17N44L13j20
$$ -3680 -4877 -3385 -2123 -1550 -1591 -1916 -1789 -1387 -1075 -1140 -1242 -923 -512 -409 -383 -26 517 1061 1374 1254
14250A254l96C53b02n62m55o41p79n32K57N48Q72L60d93C7Q42J236J293Q81M73
$$ 1254 858 353 -202 -764 -1219 -1860 -2639 -3171 -2914 -2366 -1494 -1134 -493 37 879 2115 3408 4289 4762
14231D762o68j536H02h45j240O38b68A234J219L82A357a153j884a6C181K408J483
$$ 4762 4094 2558 802 -845 -2085 -1447 -268 1234 2453 2835 1357 -1153 -3037 -16 3181 5589 7072
14214G072M58q0m53p29j311j880F28a887l69a41A709L03j17m55C00a352k127P58
$$ 7072 7530 7450 6997 6268 4957 3077 628 -1887 -2256 -141 1709 2012 1895 1440 300 -1352 -3479 -2721
14196b721a206A56Q52N73P9N4n70g00k328J47a392b48B51k2a09l04k92k67L96
$$ -2721 -1206 156 1008 1581 1660 1714 1144 -700 -3028 -2881 -1392 -248 251 229 -109 -413 -705 -972 -576
14177e76C18M72k89j62f43j144m79b79H95J065J102J036J112J247J85q21j630
$$ -576 318 790 501 339 -643 -1787 -2266 -279 895 1960 3062 4098 5210 6457 6642 5821 4191
14160D191j717I68b16o17k79c88F80Q15O49L09L73Q7K67J17o5r45F37f43b57I68
$$ 4191 2474 968 -216 -833 -1112 -388 680 1495 2144 2453 2826 2913 3180 3297 3232 2287 637 -643 -257 968
14139A750j49C79b003r59C81L271K508J713K13j195k333B267A022a04j066o29
$$ 1750 1601 379 -2003 -2962 381 3652 6160 7873 8086 6891 4558 2267 1022 -104 -1170 -1799
14123a799n73K94L72K67ln17j137j804l00K067c31B064J060p5p69F59a444j991
$$ -1799 -2372 -2078 -1706 -1439 -1442 -1959 -3096 -4900 -5200 -3133 -331 2064 3124 3049 2280 659 -1444 -3435
14105c435n71J542a102c47g2J6K5H4K97K57N7j15j81ap67q87l81Q76b76a07n59
$$ -3435 -4006 -2464 -1102 -347 -72 -56 -31 84 381 638 695 580 399 -1 -768 -1655 -2036 -1160 -276 -107 -666
14084f66j154j964o82K181b61G67L16l48a31j211j415j99J116O83q8n90r70o44
$$ -666 -1820 -3784 -4466 -2285 -261 767 1083 735 -131 -1342 -2757 -2956 -1840 -1157 -1245 -1835 -2805 -3449
14066c449r20o47k63Q72J155P21J195a79I22M52k27ik046k329Q87a312D1O21N67
$$ -3449 -4369 -5016 -5279 -4407 -3252 -2531 -1336 -179 922 1374 1147 -9 -2055 -4384 -3497 -1312 41 662 1229
14047A229J231J760J561Q61m84k006A612g99k452J061f12D30J87A27h71j152p21
$$ 1229 2460 4220 5781 6642 6158 4152 1612 -799 -3251 -2190 -612 430 617 127 -871 -2023 -2744
14030b744k16L61P43Q35L19J08K04J75k80n63j016p75J04a271A20M93k85b05m18
$$ -2744 -2960 -2599 -1856 -1021 -702 -594 -390 -215 -495 -1058 -2074 -2849 -2745 -1271 120 613 328 -205 -623
14011f23n48l73K1J13R6l87m47J80M68L44m29q25n84L92L47j87q86j116O53R67
$$ -623 -1171 -1544 -1523 -1410 -1314 -1701 -2148 -1968 -1500 -1156 -1585 -2410 -2994 -2602 -2255 -2442 -3328 -4444 -3791 -2824
13991b824O80O3m30p11k34N40N40N57Q58a25A70oa23M6A19P50R58J087N31J57
$$ -2824 -2144 -2081 -2511 -3222 -3456 -2916 -2376 -1819 -961 -125 170 164 -123 -77 119 869 1827 2914 3445 3602
13971C602p80G87c20r08l69m8j92N02O58A25N70r8m8e58j261m84Q37d37A50J05
$$ 3602 2822 787 -320 -1228 -1597 -1645 -1837 -1335 -677 125 695 597 549 -558 -1819 -2303 -1466 -437 150 255
13951B55c92q57k58l7L42e01D76P54P96Q8q30b5j407j224j807J017Q92O24e94
$$ 255 -392 -1249 -1507 -1544 -1202 -501 476 1230 2026 2114 1284 -25 -1432 -2656 -4463 -3446 -2554 -1930 -594
13931D31N90k88f02r85o36m96K23N57M23L71j5k44j39J66L65a53l76n00j27d46
$$ 431 1021 733 -602 -1587 -2223 -2719 -2496 -1939 -1516 -1145 -1160 -1404 -1543 -1377 -1012 -153 -529 -1029 -1156 -446
13910D56L81k61h2j9G77J174Q00J032J007M92m23j293j707B51R91L102K364J052
$$ 456 837 576 -82 -101 777 1951 2751 3783 4790 5282 4859 3566 1859 251 1242 4344 6708 7760
13892G760N57j30n70q01r46j597A940d11k515q77a805e64I5c65j130n51L9J1n34
$$ 7760 8317 8187 7617 6816 5870 4273 1940 -411 -2926 -3803 -1805 -564 95 -365 -1495 -2046 -2007 -1996 -2530
13873b530Q22f61E08Q18K38p05a24j236r50N73C78K149J407L26o69j086A159e03
$$ -2530 -1708 -661 508 1326 1564 859 -124 -1360 -2310 -1737 378 2527 3934 4260 3591 2505 1159 -503
13854a479j06L09K24m03l01jl29n10k65J99R28g83b1B6a287j688j848o80O63J86
$$ -1479 -1585 -1276 -1052 -1455 -1756 -1757 -2086 -2596 -2861 -2662 -1734 -783 -21 26 -1287 -2975 -4823 -5503 -4840 -4654
13834d654J830h2B415J545J58j251A300b58MH14J410O52m72G39a011C11J878J064
$$ -4654 -2824 -82 2415 3960 4118 2867 1300 -258 -254 814 2224 2876 2404 739 -1011 311 2189 3253
13816C253l9j007c1k786r85J283O42p52O3N92g23B17N34K7l46L9N19P44L04m18
$$ 3253 3214 2207 -31 -2817 -3802 -2519 -1877 -2629 -2566 -1974 -723 217 751 778 432 471 990 1734 2038 1620
13796A620p23B13Q8L24L96L66M1j54E52e41j227k29Q85C5R40K63n28d69j352f67
$$ 1620 897 213 301 625 1021 1387 1428 1274 552 -541 -1768 -1997 -1112 35 975 1238 710 -469 -1821 -667
13775G33P14j5o54c74r51q74q2J2o55p36R92a279a43G25N43M55R6m68n77k25N81
$$ 733 1447 1432 778 -374 -1325 -2199 -2281 -2269 -2924 -3660 -2668 -1279 -143 725 1268 1723 1819 1351 774 549 1130
13754A130M15l78c4j627j482n67O39O59N60M54M56d37C95J759J150K75n81j281
$$ 1130 1545 1167 -34 -1661 -3143 -3710 -3071 -2412 -1852 -1398 -942 -437 395 2154 3304 3579 2998 1717
13736A717h7j516P9e92K32m65p99j21L38M37Q6j012j586a405F12J871J727J229
$$ 1717 -87 -1603 -1524 -592 -360 -825 -1624 -1745 -1407 -970 -884 -1896 -3482 -1405 612 2483 4210 5439
13718E439K84k64j015k009H2b035j64i93D0O01J79m7ol4q3B99i2o55r46k82J46
$$ 5439 5723 5459 4444 2435 82 -2035 -2199 -993 40 641 820 773 767 733 650 299 -92 -747 -1693 -1975 -1829
13697a829O5o1L39N09K56L16j75j30l93o61p62o77n59L85J042M89l9n43j223m05
$$ -1829 -1764 -1825 -1486 -977 -721 -405 -580 -710 -1103 -1764 -2526 -3203 -3762 -3377 -2335 -1846 -1885 -2428 -3651 -4056
13677d056J315J345d55b15r9o44p20k65L53K2K14o95n80N63O32N55j6r6M04A86
$$ -4056 -2741 -1396 -455 -215 -314 -958 -1678 -1943 -1590 -1568 -1354 -2049 -2629 -2066 -1434 -879 -895 -991 -587 186
13656E36J34h3j504j646p16L81N10J98R80R01K94j60O1D78J289P79k44r56B48
$$ 536 670 -83 -1587 -3233 -3949 -3568 -3058 -2860 -1880 -979 -685 -845 -784 478 1767 2546 2302 1346 248
13636d35p4B82J015J006Q15O07L86J83J86L96L38l25j174j775A21i31k29J32d28
$$ -435 -509 282 1297 2303 3118 3725 4111 4294 4480 4876 5214 4889 3715 1940 121 -931 -1160 -1028 -428
13616F18R46j19m43e2j697K2c05D53k2D7c70l06J37K5K54D98J037J196Q48L51
$$ 618 1564 1445 1002 -52 -1749 -1727 -305 453 431 47 -370 -676 -539 -514 -260 498 1535 2731 3579 3930
13596C930l9l5O39P82J197O49k63j041j259j152r95j81L70J075J586J300k6j905
$$ 3930 3891 3856 4495 5277 6474 7123 6860 5819 4560 3408 2413 2232 2602 3677 5263 6563 6537 4632
13578D632k266a070l451m05K391i29J58j371j804a756A364K203J156r6j082j323
$$ 4632 2366 -1070 -4521 -4926 -2535 -929 -771 -2142 -3946 -1756 1364 3567 4723 4627 3545 2222
13562B222j037C14f50n6a10I04N97n6E45f13o53c51A418J703J338O09l71j171
$$ 2222 1185 314 -650 -706 -110 904 1501 1445 545 -613 -1266 -351 1418 3121 4459 5068 4697 3526
13544C526j524f5j611j070o98o18J216h67E29N45r8B99b39k21C57M9d31p46m77
$$ 3526 2002 -65 -1676 -2746 -3444 -4062 -2846 -867 529 1074 976 299 -239 -460 357 406 -431 -1177 -1654
13525a654m82K78J37P86c03B0L5a19l62j31A25P28Q47M56k36r07a79q34J56J98
$$ -1654 -2136 -1858 -1721 -935 -303 20 55 -119 -481 -612 125 853 1700 2156 1920 1013 -179 -1013 -857 -659
13505f59n02j015j117a267D04J058N99K03m07o18n44J24Q68J112J327M85k92j234
$$ -659 -1161 -2176 -3293 -1267 404 1462 2061 2264 1857 1239 695 819 1687 2799 4126 4611 4319 3085
13487C085j353C47f78j93J69L10a87G6L41O9C8a375j827J306F62K402J936K25
$$ 3085 1732 347 -678 -871 -702 -392 -187 76 417 486 38 -1375 -3202 -1896 662 3064 5000 5225
13469E225p91j609A403B90a32m46q33j125N31C49J896M70r75c24k144r15K76J181
$$ 5225 4434 2825 1403 290 -132 -578 -1411 -2536 -2005 349 2245 2715 1740 -324 -2468 -3383 -3107 -1926
13451a926P46L84K31J90I1M45Q76J47G39f04k256K11P19K37k22k06Q22A29J486
$$ -1926 -1180 -796 -565 -375 91 536 1412 1559 739 -604 -2860 -2649 -1930 -1693 -1915 -2121 -1299 129 1615
13432A615J103P51N53P04L01K14j067A829g27l171P04h19E34%a180j665k31J123
$$ 1615 2718 3469 4022 4726 5027 5241 4174 1829 -727 -3898 -3194 -819 534 534 -1180 -2845 -3076 -1953
13414a953i07d12J57A85P13O58K28p82c61q80N21C24L69b52j043m34O98F61J012
$$ -1953 -907 -412 -255 185 898 1556 1784 1002 -361 -1241 -720 324 693 -252 -1295 -1729 -1031 661 1673
13395A673l46A98f79b81B08f4j158k4A548K416J185k94j405A179h94j027h74H84
$$ 1673 1327 198 -679 -281 208 -64 -1222 -1246 1548 3964 5149 4855 3450 1179 -894 -1921 -874 884
13376B338Q13J19j153B81a735j070R54b13A103N89j09o49E5h13o98p23K2P41P28
$$ 2338 3151 3270 2117 281 -1735 -2805 -1851 -213 1103 1692 1583 934 55 -813 -1511 -2234 -2212 -1471 -743
13357g43D3K32j36f37n35n16l28j29K85O87c94j77r37j299q73M68R85a021J95
$$ -743 43 275 139 -637 -1172 -1688 -2016 -2145 -1860 -1173 -394 -571 -1508 -2807 -3680 -3212 -2227 -1021 -826
13338h26j262k205m69R11J573a137e28o1K2A72J588Q35J82q6l11O62K168L129
$$ -826 -2088 -4293 -4762 -3851 -2278 -1137 -528 -589 -567 172 1760 2595 2777 2691 2380 3042 5210 8339
13320H339J808k41k394C539h46k286c28A431K97F98k20J156J205L32j19p41m49
$$ 8339 10147 9906 7512 3539 -846 -3132 -328 1431 1728 698 478 1634 2839 3171 3052 2311 1862
13303A862j79J64pR6L23O4j14n44m37n56b91j425j758j273K56J006M56l54J12
$$ 1862 1683 1847 1840 1936 2259 2323 2209 1665 1228 672 -291 -1716 -3474 -4747 -4491 -3485 -3029 -3383 -3271
13284c271J074h24E55R21N79n86A81a620j660l6o8k98l64L5J176J109P79d63a94
$$ -3271 -2197 -824 555 1476 2055 1469 181 -1620 -3280 -3316 -3384 -3682 -4046 -4011 -2835 -1726 -947 -463 -194
13264b17n26O8n95j272j183a610A97J574Q14j4n02I16b59k76l9l72m29j35L99
$$ -217 -743 -675 -1270 -2542 -3725 -1610 197 1771 2585 2571 2069 916 -259 -535 -574 -946 -1375 -1510 -1111
13245a111J30J11a10B94L1j59K2L1O27P37Q12J120R26L96k12k42j276A092i73
$$ -1111 -981 -870 -110 294 325 166 188 219 846 1583 2395 3515 4441 4837 4625 4383 3107 1092 -973
13225b135j75J95n9o55n70N72a265D4R34R01N43O07M86R8m47o60j057A80h12m51
$$ -2135 -2310 -2115 -2174 -2829 -3399 -2827 -1265 44 978 1879 2422 3029 3515 3613 3166 2506 1449 180 -812 -1263
13205a263P7d51E69Q11J26o54d50j775n68i41D90K61a56j301j107R07d08D28P54
$$ -1263 -1186 -451 569 1380 1506 852 -450 -2225 -2793 -941 490 751 -156 -1457 -2564 -1657 -408 428 1182
13186A182K68J98M95Q09Q95K03n94A707c47j825p0f17A300J111L35m7M43J104
$$ 1182 1450 1648 2143 2952 3847 4050 3456 1707 -347 -2172 -2242 -617 1300 2411 2746 2699 3142 4246
13168D246J596J756J842J102m9j029k061k701A857a074k791J601e37C13n0d88
$$ 4246 5842 7598 9440 10542 10493 9464 7403 4702 1857 -1074 -3865 -2264 -537 313 263 -488
13151a665r34lO06j0p38j094L74J476C53J097M10m82B26h14c26D72K86%l16E8
$$ -1665 -2599 -2602 -1996 -2006 -2744 -3838 -3464 -1988 353 1450 1860 1378 226 -814 -326 472 758 758 442 58
13130c71Ec62n08L55I27J911J553P24m63j019j482b57k996k82a217E70J030R7
$$ -371 5 -362 -870 -515 927 2838 4391 5115 4652 3633 2151 -257 -3253 -3535 -1217 570 1600 1697
13112A697q40a56j823k012o47R89J128R30K58f51E00J022O35K12l91q95h4j009
$$ 1697 857 -156 -1979 -3991 -4638 -3649 -2521 -1591 -1333 -651 500 1522 2157 2369 1978 1083 -84 -1093
13094a093m63j31l48j109j477l63N21L19N01L02N20R02L26l45j91M2M62d55A150
$$ -1093 -1556 -1687 -2035 -3144 -4621 -4984 -4463 -4144 -3643 -3341 -2821 -1919 -1593 -1938 -2129 -2087 -1625 -455 1150
13074A495j74o34e8q05q88q3K57N64c60E33J303J870J154N59m22j475j455F06
$$ 1495 1321 687 -58 -863 -1751 -1834 -1577 -1013 -360 533 1836 3706 4860 5419 4997 3522 2067 606
13055g04q37n17j75n55p94j278K45R68J200J007M42n37k83O17N89j42a81A623
$$ -704 -1541 -2058 -2233 -2788 -3582 -4860 -4615 -3647 -2447 -1440 -998 -1535 -1818 -1201 -612 -754 -181 1623
13036D454L265J851n62j461k349B548E35a013o89m54l59o68K09O52j92q93o46
$$ 4454 7719 9570 9008 7547 5198 2548 535 -1013 -1702 -2156 -2515 -3183 -2974 -2322 -2514 -3407 -4053
13019d053o01R6J29k28J598a309c06m54j964j455K66M51m2m81m36P58J295O17
$$ -4053 -4654 -4558 -4429 -4657 -3059 -1309 -306 -760 -2724 -4179 -3913 -3462 -3504 -3985 -4421 -3663 -2368 -1751
13001a751k21M05f36R1q17j529M1c85A214M71j45o97n7j82f9j595o13K43i93A1
$$ -1751 -1972 -1567 -636 -545 -1362 -2891 -2850 -385 1214 1685 1540 843 786 604 -69 -1664 -2277 -2034 -993 11
12980H17O46K40o41C9a529p48i76A208K122J577K53p02r42j156A157c86j484k46
$$ 817 1463 1703 1062 39 -1529 -2277 -976 1208 3330 4907 5160 4458 3516 2360 1157 -386 -1870 -2116
12962b116G5J780J283P88J294O69K24j50j141j595A595A71g71k39d44F32J104
$$ -2116 75 1855 3138 3926 5220 5889 6113 5963 4822 3227 1595 171 -771 -1010 -444 632 1736
12945A736J001M95O0K03R52K17k25k64o61j298C75b063n80a18B007J204qr01F74
$$ 1736 2737 3232 3292 3495 4447 4664 4439 4175 3514 2216 375 -2063 -2643 -118 2007 3211 3203 2302 674
12925g39m54K45d3A167J141k3n74C01a56c0D6b95p76o73p45o12m93J60M29O49
$$ -739 -1193 -948 -43 1167 2308 2285 1711 301 -156 -30 46 -295 -1071 -1744 -2489 -3101 -3594 -3434 -3005 -2356
12905b356M84k35q37n04J97J255b47F24Q14Q18J32A158h68k314R59c95A083M64
$$ -2356 -1872 -2107 -2944 -3448 -3251 -1996 -247 624 1438 2256 2388 1158 -868 -3182 -2223 -395 1083 1547
12887A547k15D20a496j804J548D32N06A31a269j544K58f16D20J00j8J9J32k9B
$$ 1547 1332 420 -1496 -3300 -1752 432 938 131 -1269 -2813 -2555 -616 420 520 502 521 653 624 2
12867a767k181J651a002K98j87j079j399J177c99a2l00r22j343j741J197E28K999
$$ -1767 -3948 -2297 -1002 -704 -891 -1970 -3369 -2192 -399 -12 -312 -1234 -2577 -4318 -3121 528 3527
12850C527Q71p77A754f98k056p85J359R43N29h4B78e2p11q52J72d94F35J382J132
$$ 3527 4398 3621 1754 -698 -2754 -3539 -2180 -1237 -708 -84 278 -52 -763 -1615 -1443 -494 635 2017 3149
12831C149K45m30j013I36B38K89R98J139P52M51N16o30j432I72d62j182j263r87
$$ 3149 3394 2964 1951 936 238 527 1525 2664 3416 3867 4383 3753 2321 972 -462 -1644 -2907 -3894
12813c894j26R44J226g74D94J133P07P96K55M5l78r34p96F40B36a58m95j173k24
$$ -3894 -4020 -3076 -1850 -774 494 1627 2334 3130 3385 3430 3052 2118 1322 640 236 -158 -653 -1826 -2050
12794b050f68E22Q61K97m82B25a092p27J18P31L01m30o59p90o65r6r2N31P01N63
$$ -2050 -668 522 1383 1680 1198 225 -1092 -1819 -1701 -970 -669 -1099 -1758 -2548 -3213 -3309 -3401 -2870 -2169 -1606
12774a606N74b22H1a99n23a32G30M75k27B66h32q30P32E06J480N83m55H21h50
$$ -1606 -1032 -222 81 -199 -722 -132 730 1205 978 266 -832 -1662 -930 506 1986 2569 2114 821 -850
12754b499L90AK335K391J515K41o71j855A691c11o76d85J89l30p80M89E73J402
$$ -2499 -2109 1 2336 4727 6242 6483 5812 3957 1691 -311 -987 -485 -296 -626 -1406 -917 573 1975
12736A975Q96K29k57q7n80m71J31K30R94J052J368J354J058L32n62j089j362j503
$$ 1975 2871 3100 2843 2756 2176 1705 1836 2066 3060 4112 5480 6834 7892 8224 7662 6573 5211 3708
12718C708j376j139cj571n14f93A079J66E35e92K93A538K613K190Q91j73j187
$$ 3708 2332 1193 -3 -1574 -2088 -693 1079 1245 535 -592 -299 1538 4151 6341 7232 7059 5872
12701E872j711j979A29a565j41e30D20O09M12J8L67R35O55J30q26j173b88k103
$$ 5872 4161 2182 129 -1565 -1706 -530 420 1029 1441 1459 1826 2761 3416 3546 2720 1547 -288 -2391
12683b391j67a144C47R62O84M43J84j44o96G98b76r36q65o46o95J084g60H81J521
$$ -2391 -2558 -1144 347 1309 1993 2436 2620 2476 1780 798 -276 -1212 -2077 -2723 -3418 -2334 -760 881 2402
12664B402J213N23j98r79I59a880k845K54a790A095R19q09i43k216J437B190L576
$$ 2402 3615 4138 3940 2961 959 -1880 -4725 -4471 -1790 1095 2014 1205 -943 -3159 -1722 2190 5766
12647E766K389J237k45r85j466k182j351j146o45q8K73L4o38C7g71mM8K27j2l43
$$ 5766 8155 9392 9147 8162 6696 4514 3163 2017 1372 1284 1557 1591 953 37 -771 -775 -727 -500 -512 -855
12627h55m30K4J81k14k5N27A89P60M71F91a491k710b033a76G51K6d19j813j470
$$ -855 -1285 -1261 -1080 -1294 -1319 -792 189 949 1420 691 -1491 -4201 -2033 -176 751 777 -419 -2232 -3702
12608c702K01L35j78J39O24M36j74q33j042Q65J000R26c8D89jb95l50n71m12n97
$$ -3702 -3501 -3166 -3344 -3205 -2581 -2145 -2319 -3152 -4194 -3329 -2329 -1403 -38 489 488 -295 -645 -1216 -1628 -2225
12588b225j133j755N37J125J427c93D05E0h67j153j498J288D91J990Q20J75r91
$$ -2225 -3358 -5113 -4576 -3451 -2024 -393 405 50 -867 -2020 -3518 -2230 491 2481 3301 3476 2485
12571B485H00g39j013j102q52m74M55j08L50R34N43K56o76M87D48K663K252J734
$$ 2485 800 -739 -1752 -2854 -3706 -4180 -3725 -3833 -3483 -2549 -2006 -1750 -2426 -1939 448 3111 5363 7097
12553G097K63j364k279j803G78k57Q47J076P31n2j178a40k337p3i82B49L79B38
$$ 7097 7360 5996 3717 1914 778 521 1368 2444 3175 3123 1945 -140 -2477 -2550 -982 249 628 238
12534g42l30B58J619P80l28j022c5j404j060n18o01l66Q54J426a53A132J055R7
$$ -742 -1072 258 1877 2657 2329 1307 -35 -1439 -2499 -3017 -3618 -3984 -3130 -1704 -153 1132 2187 2284
12516B284o96B99i38n91f45C13J63I1d83o68l41j16N62L24n03m72n98j62N14K92
$$ 2284 1588 299 -938 -1529 -645 313 476 91 -483 -1151 -1492 -1608 -1046 -722 -1225 -1697 -2295 -2457 -1943 -1651
12496a651J66l68q45o57R4O76N80L53Q2l65J06N28O48B59J252J756J719L17k83
$$ -1651 -1485 -1853 -2698 -3355 -3261 -2585 -2005 -1652 -1570 -1935 -1829 -1301 -653 259 1511 3267 4986 5303 5020
12477E020q69j181j305E75d31j366j362q37j82J203R48O62M51a25A163J201P19
$$ 5020 4151 2970 1665 575 -431 -1797 -3159 -3996 -4178 -2975 -2027 -1365 -914 -125 1163 2364 3083
12460C083k20o99r37A70i72n57p14q30J2J034R62d84k97o03r93o47J141b77F16
$$ 3083 2863 2164 1227 170 -972 -1529 -2243 -3073 -3061 -2027 -1065 -484 -781 -1384 -2377 -3024 -1883 -277 616
12440G05b08l81c2H33J504J144P7j99r39c776l19l57k23p60n54J793J848d18G85
$$ 705 -208 -589 -32 833 2337 3481 3558 3359 2420 -3776 -4095 -4452 -4675 -5435 -5989 -4196 -2348 -418 785
12420A341j1m90m18L72J216J050J50K06O17J467J981O51j28k426k397I41e85o27
$$ 1341 1330 840 422 794 2010 3060 3210 3416 4033 5500 7481 8132 8004 5578 3181 941 -585 -1212
12402a212K73c92R6o76n19K08a69E89M1f1n40r2b58I29J628J588J267O99nj397
$$ -1212 -939 -392 -296 -972 -1491 -1283 -169 589 630 -61 -601 -693 -258 929 2557 4145 5412 6111 6106 4709
12382D709j399p24E87b033r33c71A439R49J85j055a63k171k211J762Q93N89l04
$$ 4709 3310 2586 587 -2033 -2966 -371 1439 2388 2573 1518 -163 -2334 -4545 -2783 -1890 -1301 -1605
12365a605k89K74L51M85l84q00r85j264J663a232J60j301k070q0J558a099H25
$$ -1605 -1894 -1620 -1269 -784 -1168 -1968 -2953 -4217 -2554 -1232 -1072 -2373 -4443 -4523 -2965 -1099 825
12347A879P87L85q6o58I71d22l59E61J487Q74r7q18G55c24l97j60j11l94l57k13
$$ 1879 2666 3051 2965 2307 971 -422 -781 561 2048 2922 2825 2007 755 -324 -721 -881 -992 -1386 -1743 -1956
12327a956O5K04L25K86L37k00o02j86L96e79g4H21M52E37g62j012j09Q56M28m47
$$ -1956 -1891 -1687 -1362 -1076 -739 -939 -1541 -1727 -1331 -579 -74 821 1273 537 -762 -1774 -1883 -1027 -599 -1046
12307a046j396k024o55Q17K20J75j5N99R36J118D16J423L74m57B22a833r04R48
$$ -1046 -2442 -4466 -5121 -4304 -4084 -3909 -3924 -3325 -2389 -1271 416 1839 2213 1756 222 -1833 -2737 -1789
12289a789c20D57A9a316j116r34m98K70O21J168d88F01K36l45h59j704j785P51
$$ -1789 -320 457 19 -1316 -2432 -3366 -3864 -3594 -2973 -1805 -488 601 837 492 -859 -2563 -4348 -3597
12271c597J525M39m83j406j871j929rL149f42A912K693J052j38p50j346j479E03
$$ -3597 -2072 -1633 -2116 -3522 -5393 -7322 -7331 -4182 -642 1912 4605 5657 5519 4769 3423 1944 503
12253e79n84o94p45p10l04K0k22n30K72J554g28D02M64A41a131j614o24N59N77
$$ -579 -1163 -1857 -2602 -3312 -3616 -3596 -3818 -4348 -4076 -2522 -728 402 866 141 -1131 -2745 -3369 -2810 -2233
12234b233k56r23j146b030C16J087j07A76g48k91M35k22n16k91P85D4P36M73n51
$$ -2233 -2489 -3412 -4558 -2030 316 1403 1296 176 -748 -1039 -604 -826 -1342 -1633 -848 44 780 1253 702
12215G02d58k90b19D75O00L59K7k12n5J98N98J136J244Q8q16r24l69j24N20Q26
$$ 702 -458 -748 -219 475 1075 1434 1461 1249 1194 1392 1990 3126 4370 4458 3642 2718 2349 2225 2745 3571
12195C571O82L12m21l25m57J22J90k1k69o5M1l22F26c326g88C229L460K150L78
$$ 3571 4253 4565 4144 3819 3362 3484 3674 3653 3384 3319 3360 3038 626 -3326 -788 3229 6689 8839 9217
12176I217r20j769j558j345j196o86m20M5m49k76a020j686j701J982h61i6F1L30
$$ 9217 8297 6528 4970 3625 2429 1743 1323 1368 919 643 -1020 -2706 -4407 -2425 -861 -96 61 391
12158C91J293J439J083J23m81r48j280A31a335r65l97J1L68M97N69d51A9g2n93
$$ 391 1684 3123 4206 4329 3848 2900 1620 131 -1335 -2300 -2697 -2686 -2318 -1821 -1252 -451 19 -72 -665
12139f65p95o39P9N45M38K8j38p3n50j204J293e57D80O88N53N00L19Q13J379J581
$$ -665 -1460 -2099 -2020 -1475 -1037 -1009 -1147 -1220 -1770 -2974 -1681 -557 480 1168 1721 2221 2540 3353 4732 6313
12119F313R45j202k448A110A23J983K188J520J395K229J962M94k450m192k434
$$ 6313 7258 6056 3608 1110 123 2106 4294 5814 7209 9438 11400 11894 9444 5252 2818
12104B818L703N666L488Q24k243l495k657j505j817A925a736j009B90K137N85
$$ 2818 6521 12187 15675 16499 14256 10761 8104 6599 4782 1925 -1736 -2745 290 2427 3012
12089C012j101H53C65j9L55L06k8j34M06J131J404O93m82r99m42P46J211R8j315
$$ 3012 1911 853 365 346 701 1007 979 845 1251 2382 3786 4479 3997 2998 2556 3302 4513 4611 3296
12070C296j516o20M41J422J212P46j222a453D051K1593K9245L2602L0153K1198
$$ 3296 1780 1160 1601 3023 4235 4981 3759 -1453 4051 25644 54889 87491 117644 138842
12056A38842P429p939k2558l1679l3746B2124I366L631K073l302E598i7j185d55
$$ 138842 146271 138332 115774 84095 50349 22124 9366 12997 15070 11768 5598 -97 -1282 -455
12041d29p26j340j459p77J263M07N88J226g1G28B91d66j040m57q97n26J444a44
$$ -429 -1155 -2495 -3954 -4731 -3468 -3061 -2473 -1247 -71 728 291 -466 -1506 -1963 -2860 -3386 -1942 -144
12022A349P59j73r23e6p75l32l1N2j65j97j75l75O1J31O93F1Q60j49g0j212r69
$$ 1349 2108 1935 1012 -56 -831 -1163 -1194 -1142 -1307 -1504 -1679 -2054 -1993 -1862 -1169 61 921 772 -70 -1282 -2251
12001b251k18P4K20O28c57D15M8c67j179r86N1R96d7A237P02j17D70a978k264
$$ -2251 -2469 -2395 -2175 -1547 -357 415 463 -367 -1546 -2532 -2481 -1485 -47 1237 1939 1822 470 -1978 -4242
11982d242j838K175B624J0782J2278J1462P672K599k901p380r724r531p567l499
$$ -4242 -6080 -3905 2624 13406 25684 37146 44818 47417 44516 37136 27412 17881 10314 6815
11968F815k569A933C06f12K01j79o38r85n65P03h75h4l95m48n04o42n22k68k23
$$ 6815 4246 1933 306 -612 -411 -590 -1228 -2213 -2778 -2075 -875 -84 -479 -927 -1431 -2073 -2595 -2863 -3086
11949c086J40J68r9o2J83l84o39m45j43J014J259g87D63N85R80m9F52a449k389
$$ -3086 -2946 -2778 -2877 -2939 -2756 -3140 -3779 -4224 -4367 -3353 -2094 -787 463 1048 2028 1979 652 -1449 -3838
11930c838j241l21J027J283J159P83c94C96P50N42N2l25l81O03R99O32K36m46
$$ -3838 -5079 -5400 -4373 -3090 -1931 -1148 -394 396 1146 1688 1740 1415 1034 1637 2636 3268 3504 3058
11912C058q75I64QJ117M94J62o07F49a386k116j585R86J240Q32J11P78L17J4k2
$$ 3058 2183 964 972 2089 2583 2745 2138 649 -1386 -3502 -5087 -4101 -2861 -2029 -1918 -1140 -823 -809 -831
11893h31r4J61K21q32j596m38a07C466K900Q53j277k919e48j481A54J500L72E18
$$ -831 -925 -764 -543 -1375 -2971 -3409 -107 3466 6366 7219 5942 3023 -548 -2029 154 1654 2026 518
11874b191k450f15B709K396J314L58m32o53q95j062A749d51j415L52M15k36p20
$$ -2191 -4641 -615 2709 5105 6419 6777 6345 5692 4797 3735 1749 -451 -1866 -1514 -1099 -1335 -2055
11857b055j197r95P27J401g41gB3b42p00q91o77l62JJ002d04I33O65m57d78k430
$$ -2055 -3252 -4247 -3520 -2119 -741 -7 23 -242 -942 -1833 -2510 -2872 -2871 -1869 -404 933 1598 1141 -478 -2908
11837b908k559K551A04K162R16o98I58k89L84R19M67k08o28p34D06a16p12o98
$$ -2908 -5467 -2916 104 2266 3182 2484 958 669 1053 1972 2439 2231 1603 869 406 -116 -828 -1526
11819a526K61E09J427N52n53D64a217j270o26p66j210J522i17H02R24n40P55l21
$$ -1526 -1265 509 1936 2488 1935 464 -1217 -2487 -3113 -3879 -5089 -3567 -917 802 1726 1186 1941 1620
11801A620p95P98O465J0148J1456J1966R479N735M74l937p648j2184j2779G297
$$ 1620 825 1623 8088 18236 29692 41658 51137 56872 57346 53409 45761 33577 20798 7297
11786B167K288L416M36j490l114A121k83N57M34k08B22a362j060M01g78I74J496
$$ 2167 4455 7871 8307 6817 3703 1121 838 1395 1829 1621 222 -1362 -2422 -2021 -778 974 2470
11769B470O84m60A020a179k123j364J290P90O11P31N97F8Q83N15n18b97r23%k39
$$ 2470 3154 2694 1020 -1179 -3302 -4666 -3376 -2586 -1975 -1244 -647 68 951 1466 948 -297 -1220 -1220 -1459
11750a459j080J56a06A778M86m66p32K78N97N75l18q89F4a531j144j284n81O01
$$ -1459 -2539 -2383 -106 1778 2264 1798 1066 1344 1941 2516 2198 1309 64 -1531 -2675 -3959 -4540 -3939
11732c939J450D13K979K800J265l53j623j602j371o92k3Q5n07m48p0M24Q63R81
$$ -3939 -2489 413 3392 6192 7457 7104 5481 3879 2508 1816 1793 1878 1371 923 853 1277 2140 3121
11714C121k16r33D8b323k541P34h57A528J031j14j046C68O04J083O66j73j234
$$ 3121 2905 1972 48 -2323 -4864 -4130 -857 1528 2559 2445 1399 368 972 2055 2721 2548 1314
11697A314b05j453j495o25O17R58i47f4l33j275j734j261J030a718I35K205J318
$$ 1314 -205 -1658 -3153 -3778 -3161 -2203 -947 -64 -397 -1672 -3406 -4667 -3637 -1718 935 3140 4458
11680D458M3r11r32j32J130J306l52j710G33a593k154j499L43P42J95o51j007
$$ 4458 4501 3590 2658 2526 3656 4962 4610 2900 733 -1593 -3747 -5246 -4903 -4161 -3966 -4617 -5624
11663e624P82K378D5J598R23N09j88q09F01a003m88d77F35J02b68j266k251M91
$$ -5624 -4842 -2464 45 1643 2566 3075 2887 2078 601 -1003 -1491 -477 635 737 -268 -1534 -3785 -3294
11645c294a570e37J72R3b0E2j1c2j84f4fk04m56l06l98l88N49e7A578J575P30
$$ -3294 -1570 -537 -365 -272 -20 52 41 -32 -216 -64 -6 -210 -666 -972 -1370 -1758 -1209 -57 1578 3153 3883
11624C883k12j021E45g52J33H7M21k16c56r86j423j031J12J090R46P04K05K7j5
$$ 3883 3671 2650 545 -752 -619 87 508 292 -356 -1342 -2765 -3796 -3684 -2594 -1648 -944 -739 -712 -727
11605g27m5m55p83ma005i5C81L31A88h68j245p69o90p48j092J42L28M33J471i67
$$ -727 -772 -1227 -2010 -2014 -1005 -95 381 712 188 -868 -2113 -2882 -3572 -4320 -5412 -5270 -4942 -4509 -3038 -967
11584A769K796K353J065p00k234B122c32j427N89I33K465J947L19m71j497j046
$$ 1769 4565 6918 7983 7283 5049 2122 -332 -1759 -1170 933 3398 5345 5664 5193 3696 2650
11568B650A132h85l041k659K740a571a98A929J3l50b568n638c592j616a938A806
$$ 2650 1132 -885 -3926 -6585 -3845 -1571 -198 1929 1942 1592 -2568 -8206 -3592 -5208 -1938 1806
11551E28L058J552k438b33l264m030K535b129g29J89q18j741m44J205a047G6P57
$$ 528 3586 5138 2700 -233 -3497 -7527 -4992 -2129 -729 -540 -1358 -3099 -3543 -2338 -1047 76 833
11534H33K89L94O94J234N12M72j076E59d217j29G88N740L114K036k561l955B063
$$ 833 1122 1516 2210 3444 3956 4428 3352 559 -4217 -4346 788 6528 9642 11678 9117 5162 2063
11516E27L443K773P16k044A208c875k272K449J401k94j786J254c90A356L26o54
$$ 527 3970 6743 7459 5415 1208 -3875 -6147 -3698 -2297 -2591 -4377 -3123 -390 1356 1682 1028
11500A028F1d5A214R84P77J71p73G85i40l67M61n29j752q02f86B914K634J405
$$ 1028 61 -45 1214 2198 2975 3146 2373 785 -940 -1307 -846 -1375 -3127 -3929 -686 2914 5548 6953
11482F953K00j772B278f82k312j45a494e74k76M19G92J041P13M44n51b0k455q84
$$ 6953 7153 5381 2278 -682 -2994 -3139 -1494 -574 -850 -431 792 1833 2546 2990 2439 -20 -2475 -3359
11464c359J040Q11M5k12k42L7K96f82B89J577J159Q07O82m68q89r19n76m85K05
$$ -3359 -2319 -1508 -1463 -1675 -1917 -1880 -1584 -682 289 1866 3025 3832 4514 4046 3157 2238 1662 1177 1382
11445A382N46N51L38N6m80r51F61J16O88L95m47B2a655o14a11B331K355J140p18
$$ 1382 1928 2479 2817 2873 2393 1442 661 777 1465 1860 1413 22 -1655 -2269 -111 2331 4686 5826 5108
11426E108j271j548A067A8a237j681j227J116J340g46L32A17M18P32k3k04D73
$$ 5108 3837 2289 1067 18 -1237 -2918 -4145 -3029 -1689 -746 -414 117 535 1267 1244 1040 473
11408A54i92j297j185q68Q3M70L52M18J64l9Q15O19K43J61aB003K641K282J669
$$ 154 -992 -2289 -3474 -4342 -4259 -3789 -3437 -3019 -2855 -2894 -2079 -1460 -1217 -1056 -1 2003 4644 6926 8595
11389H595K59p30j488j199j405j481A038b94j497j240r10J18L37L44N90J46l17
$$ 8595 8854 8124 6636 5437 4032 2551 1038 -294 -1791 -3031 -3941 -3823 -3486 -3142 -2552 -2406 -2723
11372b723o32q6K18O84R33O99c94a93k63m01l34k8j58l33q99j715m44J662J447
$$ -2723 -3355 -3441 -3223 -2539 -1606 -907 -394 -193 -456 -857 -1191 -1219 -1377 -1710 -2609 -4324 -4768 -3106 -1659
11353a659Q00j53o41j226j619N00J391a134c19D43R41Q20M12j250a760k929H9
$$ -1659 -859 -1012 -1653 -2879 -4498 -3998 -2607 -1134 -319 443 1384 2204 2616 1366 -1760 -4689 89
11335F085N043L608J229j080k792l494l927A584C96J89L44r5F1a705j744j779
$$ 6085 11128 14736 15965 14885 12093 8599 4672 1584 396 585 929 834 61 -1705 -3449 -5228
11319e228L22J541J472g24H72K189J652Q64M80l26o73k007C57b273j020a578d28
$$ -5228 -4906 -3365 -1893 -724 872 3061 4713 5577 6057 5731 5058 3051 357 -2273 -3293 -1578 -428
11301f47q05P11B162L178K487M06j694k970E6b464j15J278B4J041K74P42N61l79
$$ -647 -1452 -741 2162 5340 7827 8233 6539 3569 56 -2464 -2579 -1301 24 1065 1339 2081 2642 2263
11283B263F69a241q86N62O40q85j945R25g21G17J473R43k26r17p34l62K31l99
$$ 2263 669 -1241 -2127 -1565 -925 -1810 -3755 -2830 -721 717 2190 3133 2907 1990 1256 894 1125 726
11265G26l13c54j255q94k7P93P20d52R9l88m28k60O2O9M1K01b48H00J325J158
$$ 726 413 -354 -1609 -2503 -2530 -1737 -1017 -452 -353 -741 -1169 -1429 -1367 -1298 -1257 -1056 -248 800 2125 3283
11245C283L82p32H46a811k421O91a280A42N48K42k09c32j585j678K79J213O43
$$ 3283 3665 2933 846 -1811 -4232 -3541 -1280 142 690 932 723 -332 -1917 -3595 -3316 -2103 -1460
11228a460q7q19j391j032J571J498L97r11j227r64n36L92J765c87A453J765J662
$$ -1460 -1547 -2366 -3757 -4789 -3218 -1720 -1323 -2234 -3461 -4425 -4961 -4569 -2804 -387 1453 3218 4880
11211D880J298R55k99j726B110g86j122J98N4p25o10J108g51a85o57j236i73D07
$$ 4880 6178 7133 6834 5108 2110 -786 -1908 -1710 -1656 -2381 -2991 -1883 -751 -185 -842 -2078 -973 407
11192C67h58r89K63J67A1M103M665K706O14k397m257G04d408a654C230L338J226
$$ 367 -858 -1847 -1584 -1417 11 4114 8779 11485 12099 9702 5445 704 -4408 -1654 3230 6568 7794
11175G794L844N352L302j129M649J5795J5596Q946J8594O3073J05362J23136J13722
$$ 7794 11638 16990 20292 19163 23812 39607 55203 64149 82743 145816 251178 374314 488036
11162D88036P8557K5262l4345q5934j16811j22779j02707n9900j4941m527r019
$$ 488036 566593 591855 557510 471576 354765 231986 129279 69379 54438 49911 40892
11151D0892q438l717n081r522A754a8H034L766r72m003B758J49L396J823o09C613
$$ 40892 32454 28737 23656 14134 1754 -18 8034 11800 10828 6825 2758 2907 6303 8126 7517 3613
11134a809l683d77A956Q35m66A099f55j910r51R05k25j320j003R54Q50N72L12
$$ -1809 -5492 -477 1956 2791 2325 1099 -655 -2565 -3516 -2611 -2836 -4156 -5159 -4205 -3355 -2783 -2471
11117b471J036G59L055K084K09k394c88l718l152J065J566nR02a651B75J585Q61
$$ -2471 -1435 759 3814 5898 6107 3713 -388 -4106 -7258 -6193 -4627 -4632 -3730 -1651 275 1860 2721
11100B721K36m72r80a23j323e92A114J063J94l11G60D8i35j187o81Q91h07c07
$$ 2721 2957 2485 1505 -123 -1446 -592 1114 2177 2371 2060 760 48 -935 -2122 -2803 -1912 -807 -307
11081g48o96N36A261K147J417p5j229A599c80j510j465m75J153M78p39j243J183
$$ -748 -1444 -908 1261 3408 4825 4750 3521 1599 -380 -1890 -3355 -3830 -2677 -2199 -2938 -4181 -2998
11064b998a044A009R13k91C48a517q00R27J40r42j730J24J308J136N81J63k38
$$ -2998 -1044 1009 1922 1631 348 -1517 -2317 -1390 -1250 -2192 -3922 -3798 -2490 -1354 -773 -610 -848
11047h48n74j160p15R27h31A37b31e5C33K77Ba529k016j056J289a344c60J18m07
$$ -848 -1422 -2582 -3297 -2370 -831 137 -231 -55 333 610 2 -1529 -3545 -4601 -3312 -1344 -360 -242 -649
11028f49p33j177j201p21J194h91H5qe93j187j036o99n6M52K80KK20m5k68n09
$$ -649 -1382 -2559 -3760 -4481 -3287 -891 85 77 -593 -1780 -2816 -3515 -3571 -3119 -2839 -2837 -2617 -2662 -2930 -3439
11008c439k10K47J87J81R0P02J14P4l43o17J037P53e55B6Q27L42K66n34e75j734
$$ -3439 -3649 -3402 -3215 -3034 -2944 -2242 -2128 -2054 -2397 -3014 -1977 -1224 -555 26 853 1195 1461 927 -575 -2309
10988b309M21i22m0j088m03c75B475K474J366P2q34j477j291A291d36j472M9e75
$$ -2309 -1888 -922 -962 -2050 -2453 -375 2475 4949 6315 6387 5553 4076 2785 1291 -436 -1908 -1859 -575
10969D04L53f1j649j207R12d13A078J260P43O05L46j99j251E16a965j643P64h12
$$ 404 757 -61 -1710 -2917 -2005 -413 1078 2338 3081 3686 4032 3833 2582 516 -1965 -3608 -2844 -812
10950F39J432J109J323J810M24j730k103C1c168k550K262a336A77L72A84e85m81
$$ 639 2071 3180 4503 6313 6737 5007 2904 31 -3168 -5718 -3456 -1336 177 549 184 -585 -1066
10933a066N23J24k29p93j27d83A273N25R2N07J91j06q49A16a522j148r97k27K15
$$ -1066 -543 -419 -648 -1441 -1568 -483 1273 1798 1890 2397 2588 2482 1633 116 -1522 -2670 -3667 -3894 -3679
10914c679M79M05m9l88j043R32a8C158K668N63j998E84b732A409O493M092O38
$$ -3679 -3200 -2795 -2844 -3232 -4275 -3343 -18 3158 5826 6389 4391 584 -2732 1409 7902 11994 12632
10897A2632k911D618a596k299D73L157J254l6j363A236a004r59o38i15A704L571
$$ 12632 9721 4618 -1596 -3895 473 3630 4884 4848 3485 1236 -1004 -1963 -2601 -915 1704 5275
10881E275K858L601K119J401K269m725m453k986k084A609p77c36j106J18G4J771
$$ 5275 8133 11734 13853 15254 17523 12798 8345 5359 3275 1609 832 -336 -1442 -1324 74 1845
10865A845Q81k05A046i37j657n9e81A972J632L1j222D56a506j610n27N76Q32P06
$$ 1845 2726 2521 1046 -937 -2594 -2653 -581 1972 3604 3635 2413 456 -1506 -3116 -3643 -3067 -2235 -1529
10847a529L89a66A068J079J270L87n86j505D63a579g02C250L817J996J579r28
$$ -1529 -1140 -166 1068 2147 3417 3804 3218 1713 463 -1579 -702 3250 7067 9063 10642 9714
10831I714l767k209L587O042N036L442p70m184o245D090a388k353N37K03m78J424
$$ 9714 5947 3738 7325 13367 18403 21845 21075 16891 10646 4090 -1388 -3741 -3204 -3001 -3479 -2055
10815b055g1H61j28b03r50k93J78p6m6f49F82R85R22R15M02m62j603g15j892L97
$$ -2055 -71 861 733 -203 -1153 -1446 -1268 -1344 -1390 -649 682 1667 2589 3504 3906 3444 1841 -715 -2607 -2210
10795b210f77J23j820j312Q92J075K58j321k079J624J349p55k307K135g32A5a456
$$ -2210 -677 -554 -2374 -3686 -2794 -1719 -1461 -2782 -4861 -3237 -1888 -2643 -4950 -2815 -732 15 -1456
10777c744a479B144J849m61j717a6o71J18m99J09C83O58a20k645L92H82J772r6
$$ -3744 -1479 2144 3993 3532 1815 -16 -687 -569 -1068 -959 383 1041 -120 -2765 -2373 882 2654 2558
10759B558D80a597b73A496M79I44i27k28F38R65L31J0J348K107R7A713c309D429
$$ 2558 480 -1597 -273 1496 1975 944 -927 -1155 638 1603 1934 1944 3292 5399 5496 1713 -3309 4429
10740A2281M867J001M87K995M018L065K345L920J691j596J509J3280K1406K1713
$$ 12281 17148 18149 18636 21631 25649 28714 31059 34979 36670 35074 36583 49863 71269 92982
10726I2982K7345N1136Q4327J10463J21051J15063R7205O6891L0142j4112o1589
$$ 92982 120327 171463 255790 366253 487304 602367 699572 766463 796605 782493 720904
10715G20904j03766j31666j38806j19755p5833k7853j1320j6226k2102j8727j1951
$$ 720904 617138 485472 346666 226911 151078 123225 111905 95679 73577 54850 42899
10704D2899q454p441l208j257j491l204k891k086k854l475k621j097A202J62M069
$$ 42899 34445 27004 23796 22539 21048 17844 14953 12867 10013 6538 3917 2820 1202 1364 5433
10689E433M344K237o84k591k868j727j090A469f17k806R10H05L180K140l02j886
$$ 5433 9777 12014 11330 8739 5871 4144 3054 1469 -617 -3423 -2513 805 3985 6125 5823 3937
10673C937A688a563j085a49B360J659J441K313Q63j17k921B039a622l308j393
$$ 3937 1688 -1563 -2648 -149 2360 4019 5460 7773 8636 8519 5598 2039 -1622 -4930 -6323
10658f323J011N11J804a419N23n90j244l04a176i7F77c31k730J062B305L827K138
$$ -6323 -5312 -4801 -2997 -1419 -896 -1486 -2730 -3034 -1176 -97 677 -331 -3061 -1999 2305 6132 8270
10641H270k3j331k379A731F77K7j45b87j845j127l66Q53P74N36K54o6q01j103
$$ 8270 8247 6916 4537 1731 677 704 559 -287 -2132 -3259 -3625 -2772 -1998 -1462 -1208 -1274 -2075 -3178
10623c178o44K57J475B95K027O24p38E9b328r82J296P56a4A422J715J425J170
$$ -3178 -3822 -3565 -2090 295 2322 2946 2208 59 -2328 -3310 -2014 -1258 -14 1422 3137 4562 5732
10606E732M47j08p1J48O34M05j75q73j519j796j031k26N07L79n75C38d46A03K28
$$ 5732 6179 6071 6000 6148 6782 7187 7012 6139 4620 2824 1793 1567 2074 2453 1878 338 -446 103 331
10587C31a95j509j433o7L12r0J191E91K432J504m74j653C48a293o11M38d61A349
$$ 331 -195 -1704 -3137 -3204 -2892 -2982 -1791 591 3023 4527 4053 2400 348 -1293 -1904 -1466 -461 1349
10568C213J216J27k87n19o45k63k03o68C55a933l60G69K771P72j710i46l971M05
$$ 3213 4429 4556 4269 3750 3105 2842 2639 1971 355 -1933 -2293 769 3540 4312 2602 -946 -4917 -4512
10550d512J711o24j268l474K400b660a292j32K6b18A210N36P7H79h95k796k269
$$ -4512 -2801 -3425 -4693 -8167 -5767 -2660 -1292 -1424 -1398 -218 1210 1746 1823 879 -895 -3691 -5960
10533e960K740a467M82k72j167k73f03B035J885M88p38j053A260b26j960j752
$$ -5960 -3220 -1467 -985 -1257 -2424 -2697 -603 2035 3920 4408 3670 2617 1260 -226 -2186 -3938
10517c938k74q12M55O88j05n5r4l01J62L02J50R5m17M7p83R30a298A431J805P68
$$ -3938 -4212 -5024 -4569 -3881 -3986 -4041 -4135 -4436 -4274 -3972 -3822 -3727 -4144 -4097 -4880 -3950 -1298 1431 3236 4004
10497D004q06F41a648j494l4K22g35A10O61e83l64l227n87A63L072J594M5j134
$$ 4004 3198 641 -1648 -3142 -3176 -2954 -735 110 771 -583 -947 -4174 -4761 163 3235 4829 4874 3740
10479C740o90m61j070J368J160l16j457B21b173k854K44h76A713J537L53m03j008
$$ 3740 3050 2589 1519 2887 4047 3731 2274 221 -2173 -5027 -4783 -876 1713 3250 3603 3200 2192
10462B192G38h37j286k77J123i1H68P79M97L27k88p56B48a646k45a89G98O9B26
$$ 2192 738 -837 -2123 -2400 -1277 -91 868 1647 2144 2471 2183 1427 248 -1646 -1891 -189 798 867 226
10442f30n42r45p30r03p97p68K56J084Q78N99N44O28M75a17B80J64aj435j773
$$ -630 -1172 -2117 -2847 -3750 -4547 -5315 -5059 -3975 -3097 -2498 -1954 -1326 -851 -117 280 444 -1 -1436 -3209
10423c209q73L80Q04L62K52N13M03L41j95q00r51M41a035d4H93J755J563P16k98
$$ -3209 -4082 -3702 -2898 -2536 -2284 -1771 -1368 -1027 -1222 -2022 -2973 -2532 -1035 -44 893 2648 4211 4927 4629
10404D629j550A006b097k161Q55Q38j64pR64k29j261n59G414J7967K1157K1109
$$ 4629 3079 1006 -2097 -4258 -3403 -2565 -2729 -2736 -1772 -2001 -3262 -3821 7414 25381 46538 67647
10388F7647J5747P480l340j3622j9989k2180A1587A337L209R78j634H65f91M9
$$ 67647 83394 90874 87534 73912 53923 31743 11587 1337 4546 5524 3890 865 -691 -642
10374f42m90j293o04j21j79k65r06n99J09kj92J555J606e05B16K15c09j301j905
$$ -642 -1132 -2425 -3029 -3150 -3329 -3594 -4500 -5099 -4990 -4992 -5184 -3629 -2023 -505 216 431 -309 -1610 -3515
10355c515j589l69n61O80J941J527M45p29k720J476a372A54J299m20a019p90A039
$$ -3515 -5104 -5473 -6034 -5354 -3413 -1886 -1441 -2170 -4890 -3414 -1372 154 1453 1033 -1019 -1809 1039
10337D985K793M8j801B611a409p83E01J832J5j131f89k62D66J061M9n79A94I2
$$ 4985 7778 7826 6025 2611 -1409 -2192 501 2333 2348 1217 -689 -951 466 1527 1576 997 194 92
10318A253J403J848J456p90j977D20f27p58k205M10a119j071l782K751E613P632
$$ 1253 2656 4504 5960 5170 3193 420 -627 -1385 -3590 -3180 -1119 -2190 -5972 -3221 5613 13245
10302A3245N668M751O157K401J9507P5724J31860J75117J96298J85613J40451
$$ 13245 18913 23664 29821 32222 51729 127453 259313 434430 630728 816341 956792
10291I56792O7647j9344j00908j63056j93036j89095j56348I4935D2144j4659
$$ 956792 1024439 1005095 904187 741131 548095 359000 202652 94935 42144 27485
10281B7485q210o168l169m701b047o165c256E22O35N35J789J376j066A792B60
$$ 27485 19275 13107 9938 5237 -2047 -8212 -3256 522 1157 1692 3481 4857 3791 1792 260
10265a496k228o96b165b01E37j93e94j923j846j449J142J716J392c58C46P8L72
$$ -1496 -3724 -4420 -2165 -201 537 344 -594 -2517 -4363 -5812 -4670 -2954 -1562 -358 346 424 796
10248G96J96K60G9a802l162b299A788J0227Q563Q194M469j005J2316K2180J7616
$$ 796 992 1252 79 -1802 -4964 -2299 1788 12015 20578 28772 33241 32236 44552 66732 84348
10233H4348J5608J0100M753J698K585L732P262P022k273j4928k5476l1987C0755
$$ 84348 99956 110056 114809 116507 119092 122824 130086 137108 134835 119907 94431 62444 30755
10219F561K280P009M02l703n775B548A056B56L19N86l91K76J725J760J973R05
$$ 6561 8841 15850 16252 12549 6774 2548 1056 256 575 1161 770 1046 2771 4531 6504 7409
10203G409j91j089j868p35L48J667K434K128J550m88k706C166g83B933N424M030
$$ 7409 7218 6129 4261 3526 3874 5541 7975 10103 11653 11165 8459 3166 -783 2933 8357 12387
10187A2387J146j202k381k632k018q39j44Q64N88l89j546A468a618k731q43a847
$$ 12387 13533 12331 9950 7318 5300 4461 4317 5181 5769 5380 3834 1468 -1618 -4349 -5192 -1847
10170H48J358J53I42f32q22O05D18P36a18l026l009R59a924g4I34R9b43j68A231
$$ 848 2206 2359 942 -632 -1454 -849 418 1154 -118 -3144 -6153 -5194 -1924 -74 934 1033 -243 -411 1231
10150C532N54K041q50j417G99a700k165j951M15L69P53J403a224e98j22r7L25
$$ 3532 4086 6127 5277 3860 799 -1700 -3865 -5816 -5401 -5032 -4279 -2876 -1224 -598 -720 -817 -492
10133d92M9R3n00o78m03m56m6R5O42j82r65j164j040M95N37K11M60J145O86o8
$$ -492 -443 -350 -850 -1528 -1931 -2387 -2433 -2338 -1696 -1878 -2843 -4007 -5047 -4552 -4015 -3804 -3344 -2199 -1513 -1581
10113a581j540j150K014A137K301N56j028d5l042a427A389J660K56j060m54M714
$$ -1581 -3121 -4271 -2257 1137 3438 3994 2966 -45 -3087 -1427 1389 3049 3305 2245 1791 6505
10097F505Q764J0812Q712P418K875R63k298J444P902J1446J0492O067l38n682
$$ 6505 15269 26081 34793 42211 45086 46049 43751 45195 53097 64543 75035 81102 80764 75082
10083G5082j0369j2007j0541k212R236J4589J0272k763j8739A3023J4771O8251
$$ 75082 64713 52706 42165 39953 49189 63778 74050 71287 52548 13023 27794 96045
10071I6045P0084N9864M0160J3525j2836l4454m9175n3581m8820l6580k1512q807
$$ 96045 166129 225993 266153 279678 266842 232388 183213 129632 80812 44232 22720 13913
10059A3913m163m683a141l763b426F49J418j67I49j36k05a77r71N1a20A809J398
$$ 13913 9750 5067 -1141 -4904 -2426 649 2067 1900 949 813 608 -177 -1148 -1097 -120 1809 3207
10042C207K421K387J071O42o69j904j300r93n80l88p19j285D00e0B457J299q49
$$ 3207 5628 8015 9086 9728 9059 7155 5855 4862 4282 3894 3175 1890 400 -50 2457 3756 2907
10025B907B03e000k709K079a809b7A35J6N593N068K457L55k478n138A567A32J401
$$ 2907 203 -5000 -7709 -5630 -1809 -27 135 151 5744 10812 13269 13624 11146 6008 1567 132 1533
10008A533L309n70A052e832K770A99J164L913J845k151A261a604B02a285m06g41
$$ 1533 4842 4272 1052 -5832 -3062 199 1363 5276 7121 4970 1261 -1604 202 -1285 -1691 -741
9991H12J515K57i555j692L840K006A350l84J2542J7369J6220J5053J0190L707
$$ 812 2327 2584 -9555 -11247 -7407 -5401 1350 966 13508 30877 47097 62150 72340 76047
9977G6047j033n729p614r918j1478j0738j1271H930B600a294j286b7B131J373
$$ 76047 75014 69285 61671 51753 40275 29537 18266 8930 2600 -1294 -2580 -27 2131 3504
9963C504n21p99n15p93h97k277f49A942J413K6j063h0k444r22m73J505R71a27
$$ 3504 2983 2184 1669 876 -897 -3174 -649 1942 3355 3381 2318 -80 -2524 -3446 -3919 -2414 -1443 -127
9944A258P02Jp46d41j845j684J174J323A22J107O83O38Q9P79O66O98L08n91j069
$$ 1258 1960 1961 1215 -441 -2286 -3970 -2796 -1473 122 1229 1912 2550 2639 3418 4084 4782 5090 4499 3430
9925C430q61A212j98m82d44j195q13a007A405K345K532J945J671L93q27j143j636
$$ 3430 2569 1212 1014 532 -444 -1639 -2452 -1007 1405 3750 6282 8227 9898 10291 9464 8321 6685
9908F685j664j703j238m49L86N93l57E06G4N43R84Q69m37C15a124i2A370R94P74
$$ 6685 5021 3318 2080 1631 2017 2610 2253 506 74 617 1601 2470 2033 315 -1124 -92 1370 2364 3138
9889C138n46j053A36i82k93c22o16m09O6J94M72E67J001L28n11c52k813O55A772
$$ 3138 2592 1539 136 -982 -1275 -322 -938 -1347 -1281 -1087 -615 567 1568 1896 1385 -352 -3165 -2510 1772
9869F991M262J645M00m556l782d40a36C920K196J139o88l277B06a497o52m18o27
$$ 6991 11253 12898 13298 8742 4960 -440 -136 3920 6116 7255 6567 3290 206 -1497 -2149 -2567 -3194
9852c194p84O62R71J086e9D86J83G6a672j717k791K399E07M213L531J414j043
$$ -3194 -3978 -3316 -2345 -1259 -59 486 669 76 -1672 -3389 -6180 -3781 507 4720 8251 9665 8622
9835H622k975B673E81a387j820j744L59K050J216J14p07m1O95b26o6p24j243r27
$$ 8622 5647 2673 581 -1387 -3207 -4951 -4592 -2542 -1326 -1212 -1919 -1960 -1265 -226 -292 -1016 -2259 -3186
9817c186r01j49Q5N96J665D59K287Q38r47B66M68L638M489O538K297j72j457k738
$$ -3186 -4087 -4236 -4151 -3555 -1890 459 2746 3584 2637 266 734 4372 8861 15399 17696 17524 16067 13329
9799A3329l753C672a279k272A329M969L465Q47j587l778D10c046N03b87F11L15
$$ 13329 9576 3672 -1279 -3551 1329 6298 9763 10610 9023 5245 410 -3046 -2543 -287 611 926
9783I26C52h43j372j084r83r15l03J418a385H95J553L23j024D35e6H46J781R22
$$ 926 352 -843 -2215 -3299 -4282 -5197 -5500 -4082 -1385 895 2448 2771 1747 435 -56 846 2627 3549
9765C549K449J428O18j79j579k675j788b39k045a104B79M86j73c53k18E83K104
$$ 3549 5998 7426 8044 7865 6286 3611 1823 -239 -2284 -1104 279 765 592 -353 -571 583 2687
9748B687J742J369O43n62q76j150j018j75n9K51n93E72a549k609O15I39O247P424
$$ 2687 4429 5798 6441 5879 5003 3853 2835 2660 2601 2852 2259 572 -1549 -4158 -3543 939 7186 14610
9730A4610O881N189K626q17m615p912F436c511K97A747K304o29A039b080k655
$$ 14610 21491 26680 29306 28489 23874 15962 6436 -3511 -3214 1747 4051 3422 1039 -2080 -4735
9715d735K040h3A121J40n57j67J019K064K336J841J291J232l993A824a456o46
$$ -4735 -2695 -83 1121 1261 704 537 1556 3620 5956 7797 9088 10320 6327 1824 -1456 -2102
9699b102e66A449J537J039L86l97N0m84o66j337A32a871j541l72J067O96O69M30
$$ -2102 -566 1449 2986 4025 4411 4014 4064 3580 2914 1577 132 -1871 -3412 -3784 -2717 -2021 -1352 -922
9681i22k09K54J46a41D11L43K54l21c46j599j784q95b259b20G66j6B62f75q79
$$ -922 -1131 -877 -731 -141 411 754 1008 687 -346 -1945 -3729 -4624 -2259 -220 766 750 262 -675 -1554
9662a554q43m44P54i81A55R21K59o17e71j645m25O69d31B084J530R51J93k88o30
$$ -1554 -2397 -2841 -2087 -981 155 1076 1335 718 -571 -2216 -2641 -1972 -431 2084 3614 4565 4758 4470 3840
9643C840j098j273A5a102m43o47j231P60d07H34L10A19i65b3B175J348J330N32
$$ 3840 2742 1469 15 -1102 -1545 -2192 -3423 -2663 -407 834 1144 119 -965 -23 2175 3523 4853 5385
9625E385K51n2n99r10j445j310C52e1F26K240L080L065K013O65j321k583C889
$$ 5385 5636 5584 4985 4075 2630 1320 352 -51 626 2866 5946 9011 11024 11689 10368 7785 3889
9607F76a955p96N78f93I55Q29J74k10l88l45j79N05P78R40P24l4p95r82E93f89
$$ 676 -1955 -2751 -2173 -693 955 1784 1958 1748 1360 1015 836 1341 2119 3059 3783 3749 2954 1972 593 -689
9586b392k173K55a466B81K51D4a137j609r03P14J86l41j139N53J490i63J61n65
$$ -2392 -4565 -4310 -1466 281 532 44 -1137 -2746 -3649 -2935 -2749 -3090 -4229 -3676 -2186 -963 -802 -1367
9568a367r27r19j050l5J640e83I08L58C70A63e41K39l71j463j651J834h20b65
$$ -1367 -2294 -3213 -4263 -4298 -2658 -583 908 1266 370 163 -541 -302 -673 -2136 -3787 -1953 -820 -265
9549c90j30f0D76K72h15j709j405J855B022L068J586R56N59m07j315j615j886
$$ -390 -520 -60 476 748 -815 -2524 -3929 -2074 2022 5090 6676 7632 8191 7784 6469 4854 2968
9532B968A054b204m216P77a761E42J270J565J0351J1853J3860O871l586j6526
$$ 2968 1054 -2204 -6420 -5643 -1761 542 1812 3377 13728 25581 39441 46312 42726 26200
9518B6200i68C6726N0488N1044M5430L3544J7834M54j5735k9193l7151l9750l6514
$$ 26200 -968 36726 87214 138258 183688 217232 235066 235520 219785 190592 153441 113691 77177
9505G7177k9291j9470j0206o104B977e925n413N509b484n04k686Q7J526J900g48
$$ 77177 47886 28416 18210 12106 2977 -5925 -11338 -5829 -2484 -2988 -5674 -5587 -4061 -2161 -748
9489a008l07B60l6b895l316K185i24a11C282Q69k48q00A238b60F77K009L305K551
$$ -1008 -1315 260 224 -2895 -6211 -4026 -924 -111 3282 4151 3903 3103 1238 -260 677 2686 5991 8542
9471H542N58L65M993Q747L472J430L621k91o703n061n087n661C453a76l81k98
$$ 8542 9100 9465 14458 23205 26677 28107 31728 31437 24734 19673 14586 8925 3453 -176 -557 -855
9455h55j387M58F25N363J1366J0357J0347Q841M916n35o666j1067j2763G311c918
$$ -855 -2242 -1784 625 5988 17354 27711 38058 46899 51815 51280 44614 33547 20784 7311 -3918
9439b323A859M29E68b279k367q75j56r93c150C517O468L950l44l957C333d316
$$ -2323 1859 2288 568 -2279 -4646 -5521 -5677 -6670 -3150 3517 9985 13935 13591 9634 3333 -4316
9422a1879g17F429j036a166A758J3784J0435P475K8211P0288R9071J42095J55838
$$ -11879 -717 6429 5393 -1166 1758 15542 25977 33452 61663 131951 231022 373117 528955
9409E28955J35115R7873M2306k1192q1084j25314j53198j43628j23088F7901B1671
$$ 528955 664070 761943 804249 783057 701973 576659 423461 279833 156745 67901 21671
9397A5138m14l857l733l182g22n130K705A87Ia152j824l69o4J270N54O29d58G23
$$ 15138 14724 10867 7134 3952 -722 -5852 -3147 187 9 -1152 -2976 -3345 -3409 -2139 -1585 -956 -458 723
9378A945N23k25o01l77D13h88k038k481Q20J845a186D41J187J215P2n93D41a943
$$ 1945 2468 2243 1642 1265 413 -888 -2926 -5407 -4587 -2742 -1186 441 1628 2843 2915 2322 441 -1943
9359d882k29K254e59A145O41k46F23B40b68o84m89k46k22j07l21m89l87R21a079
$$ -4882 -5111 -2857 -559 1145 1786 1540 623 240 -268 -952 -1441 -1687 -1909 -2016 -2337 -2826 -3213 -2292 -1079
9339B32Q89D93a585j741q79j61J29O40J787E97K736K593J777j5j608k856c16l466
$$ 232 1121 493 -1585 -3326 -4205 -4366 -4237 -3597 -1810 597 3333 5926 7703 7688 6080 3224 -316 -3782
9321c782n48J388a224C31J342L05H53a253k560j397b432d96D14c29j319j452j72
$$ -3782 -4330 -2942 -1224 331 1673 1978 853 -1253 -3813 -5210 -2432 -496 414 -329 -1648 -3100 -3272
9304c272J160O79k82r49o97m13k14P6N93R41a180G9J080M92n56a42j178k64P09
$$ -3272 -2112 -1433 -1715 -2664 -3361 -3774 -3988 -3912 -3319 -2378 -1180 79 1159 1651 1095 -142 -1320 -1584 -875
9285h75B35l3J61L1E5a358j859n78a851c97J47m62q92p70K09R92a83G66J24B14
$$ -875 235 202 363 394 55 -1358 -3217 -3795 -1851 -397 -250 -712 -1604 -2374 -2165 -1173 -183 766 890 214
9264a277j525J5O28j12p56N49b36A952J424qA601a453j463e39A871J438n35A157
$$ -1277 -2802 -2787 -2159 -2271 -3027 -2478 -236 1952 3376 3368 1601 -1453 -2916 -539 1871 3309 2774 1157
9245d58n51M02b08j13k29k06J86B87J628J077L13m44j360b07j167j07N66b82C36
$$ -458 -1009 -607 -208 -321 -550 -756 -570 287 1915 2992 3305 2861 1501 -207 -1374 -1481 -915 -282 336
9225H53k5l79c13p07j1G2J060N46E55a923k873b024A677J308M77A321a937k226
$$ 853 828 449 -313 -1020 -1031 72 1132 1678 555 -1923 -4796 -2024 1677 2985 3462 1321 -1937 -4163
9207d163J129E00J512J171O59k40M415b065p423o980h86k048M24k235J266r59
$$ -4163 -3034 500 2012 3183 3842 3602 8017 -2065 -9488 -16468 -886 -2934 -2510 -4745 -3479 -4438
9191d438J388d75A169K06m58e16m68a81m363J077N13l13n85j090q33p6L38O93
$$ -4438 -3050 -475 1169 1375 917 -516 -984 -181 -4544 -3467 -2954 -3267 -3852 -4942 -5775 -5851 -5513 -4820
9173d820Q35J112M65J90L47L83g21F01O52m01f2o51r00m77h23A316J815J215o41
$$ -4820 -3985 -2873 -2408 -2218 -1871 -1488 -721 601 1253 852 -62 -713 -1613 -2090 -823 1316 3131 4346 3705
9154C705j333F10a054J29C19N47B14h70j666p58J57j66m69k97M23P32L69P30l83
$$ 3705 2372 610 -1054 -925 319 866 214 -870 -2536 -3294 -3137 -3303 -3772 -4069 -3646 -2914 -2545 -1815 -2198
9135b198m18n01N07J054e56K05%p81j253j582O13J661i7A307Q74K23k15m74E53
$$ -2198 -2616 -3117 -2610 -1556 -556 -351 -351 -1132 -2385 -3967 -3354 -1693 -97 1307 2181 2404 2189 1715 553
9115d89p92r08j006j442j140J220J770J333b49I33R62K17o39a8j591j385q55M11
$$ -489 -1281 -2189 -3195 -4637 -5777 -4557 -2787 -1454 -249 933 1895 2112 1473 -18 -1609 -2994 -3849 -3438
9097c438J083a025A335J722J114N27M85N3p55j826D71a493r1d84K14j032j836
$$ -3438 -2355 -1025 1335 3057 4171 4698 5183 5236 4481 2655 471 -1493 -1584 -484 -270 -1302 -3138
9080c138k080J646i26G62O92j79m95B75a88l10m07j99k94o20o91k18P36l38r74
$$ -3138 -5218 -3572 -926 762 1454 1275 780 275 -188 -498 -905 -1104 -1398 -2018 -2709 -2927 -2191 -2529 -3503
9061c503O69J215e44a20l67j100p01m50N54J031a81A2a15k801k606P17J992a246
$$ -3503 -2834 -1619 -544 -120 -487 -1587 -2288 -2738 -2184 -1153 -181 12 -115 -2916 -5522 -4805 -2813 -1246
9042f51k0q58q35j543j375k46M03k71j350K051a556A289K063L96o77r89G45a40
$$ -651 -671 -1529 -2364 -3907 -5282 -5528 -5125 -5396 -6746 -4695 -1556 1289 3352 3748 3071 2082 745 -140
9023A11J342J873J375K69j325A365h01k353j741l94L04J421J761a7A059P4l14
$$ 111 1453 3326 4701 4970 3645 1365 -801 -3154 -4895 -5289 -4985 -3564 -1803 -17 1059 1133 819
9006H19d91k262k212r92K177a546i7A003N09K24J00q95b60l39A0M45c25k110j692
$$ 819 -491 -2753 -4965 -5957 -3780 -1546 -97 1003 1512 1736 1836 941 -260 -599 10 455 -325 -2435 -4127
8987d127J519b90H82i7k079j819k93P0k54L55J182J243Q25J35J91K48A67O35K7
$$ -4127 -2608 -290 882 -97 -2176 -3995 -4288 -4218 -4472 -4117 -2935 -1692 -867 -732 -541 -293 167 802 829
8968H29b31r63o18o5l0j79Q26a01F17M4b65j524k222k01Q14O73j20l8j96J45L72
$$ 829 -231 -1194 -1812 -1877 -1907 -2086 -1260 -101 617 661 -265 -1789 -4011 -4212 -3398 -2725 -2845 -2883 -3079 -2934 -2562
8947b562N96K08m42q48r17O95J155O77l12r46i20B303K059J254j023A899a258
$$ -2562 -1966 -1758 -2200 -3048 -3965 -3270 -2115 -1438 -1750 -2696 -920 2303 4362 5616 4593 1899 -1258
8929b517a238N02L31G06J605N68M9q99q43D8i56j015L13e92F45O97J14j30n52
$$ -2517 -1238 -736 -405 706 2311 2879 2928 2029 1186 48 -956 -1971 -1658 -592 645 1342 1456 1326 774
8910G74B89c51j232r50l7M23R38l09p52r97m29q12O63J488a78A628Q80m57A015
$$ 774 289 -351 -1583 -2533 -2570 -2147 -1209 -1518 -2270 -3267 -3696 -4508 -3845 -2357 -178 1628 2508 2051 1015
8890e9j943k177j69b173E01J998L22j56o52M80Q53J293J052l6j568B000C8a457
$$ -59 -2002 -4179 -4348 -2173 501 2499 2821 2665 2013 2493 3346 4639 5691 5655 4087 2000 38 -1457
8871b048N0O20d84F82R29jF62g66oA19P22K07m75F7a79n21p12j427j891LJ8q91
$$ -2048 -1998 -1378 -484 682 1611 1610 662 -766 -772 119 841 1048 573 67 -179 -700 -1412 -2839 -4730 -4727 -4709 -5600
8849e600N97J914a464a89D40J28B18f64j288j244q29J45O68J596d52D63K08I1
$$ -5600 -5003 -3089 -1464 -189 440 568 218 -664 -1952 -3196 -4025 -3880 -3212 -1616 -452 463 671 91
8830i76o79N19d5I20R44Q65Q66O31N59R38J569J177j76j955B760C51G6Q01J0A7
$$ -976 -1655 -1136 -45 920 1864 2729 3595 4226 4785 5723 7292 8469 8293 6338 2760 351 76 877 887 17
8809a280j024l06L40Q19d16b08b1D20P09N82j57D42a266q09c13A696P97j096h47
$$ -1280 -2304 -2610 -2270 -1451 -416 -208 -21 420 1129 1711 1554 442 -1266 -2075 -313 1696 2493 1397 -847
8789c272o98k3n71j261N8K103c04C332K832J891J136J301J186J591K46j093k263
$$ -3272 -3970 -3993 -4564 -5825 -5767 -3664 -304 3332 6164 8055 9191 10492 11678 13269 13515 12422 10159
8772A0159k696l301j787e66l880L52E57M201L171L43j508j072p6j67j295A228
$$ 10159 7463 4162 2375 -566 -4446 -4094 557 4758 7929 8272 6764 5692 5616 5449 4154 1228
8755b497k865j368k7l70L508I43K592Q0A363c397m648l735p42j227c302A994a140
$$ -2497 -5362 -6730 -6757 -7127 -3619 943 3535 3615 1363 -3397 -8045 -11780 -12522 -13749 -3302 1994 -1140
8737g429n334d836B2749J9229J2221J469j4006k0630m550K9525K5107J7820J4343
$$ -7429 -12763 -4836 22749 41978 54199 55668 41662 21032 16482 46007 71114 88934 103277
8724A03277J6993O947j9944m4378J9514L5005m181j0248J2849K2407K4157P847
$$ 103277 120270 127217 107273 62895 82409 117414 113233 102985 115834 138241 162398 170245
8712A70245k1432j8385J768l7256l0243k8750A1044c433I228J3200N033J019o977
$$ 170245 148813 130428 132196 94940 64697 35947 11044 -3433 9228 22428 27461 28480 21503
8699B1503K593L539p652I025N297m178a511k736k54r273e302b322A723L020K479
$$ 21503 24096 27635 19983 9025 14322 10144 -1511 -4247 -4501 -13774 -5302 -2322 1723 4743 7222
8684G222P36M39k06j056k147B048p86Q05L5I43e31A20L511L889J66B456b586A0058
$$ 7222 7958 8397 8191 7135 4988 2048 1262 2067 2102 943 -531 120 3631 7520 7686 2456 -2586 10058
8665B1922O820M752J8623L3641M4678M4586M0875N363j1955k3801l9586m6644
$$ 21922 28742 33494 52117 85758 130436 175022 215897 221260 209305 185504 145918 99274
8653I9274m4877B5310m352J20p171A587f121g04A891N62K26o63a279m315m382
$$ 99274 54397 25310 20958 21078 13907 1587 -6121 -704 1891 2453 2679 2016 -1279 -5594 -9976
8638i976L16k066j124K324d604A40J622P81r94c83k278j647O36a388I20J151q86
$$ -9976 -9660 -11726 -12850 -10526 -4604 140 1762 2543 1549 -383 -2661 -4308 -3672 -1388 920 2071 1185
8621A185e32k094j085j4O17K56n47j534j09K257f81c23l34j606j808K76a806e43
$$ 1185 -532 -2626 -3711 -3725 -3108 -2852 -3399 -4933 -5042 -2785 -681 -323 -657 -2263 -4071 -3795 -1806 -543
8602e37l73L89A117J269K87j119h91k412O44f86A36i64j843k576n34K554J573
$$ -537 -910 -521 1117 2386 2673 1554 -891 -3303 -2659 -686 136 -964 -2807 -5383 -5917 -3363 -1790
8585a790K45r58P98A246L188K152K82j328k114j388B79e63J09D80L06l40a025
$$ -1790 -1545 -2503 -1705 1246 4434 6586 6868 5540 3426 2038 279 -563 -454 480 786 446 -1025
8567a624d97G91L70b94j102j755j003e39B320J640j63j848e69k520J522c39m82
$$ -1624 -497 791 1161 -294 -1396 -3151 -4154 -539 2320 3960 3797 1949 -569 -3089 -1567 -339 -821
8550h21j094d34B490K142O55j106A830a388k383j375M18O6P86J042N02L04Q79
$$ -821 -1915 -434 2490 4632 5287 4181 1830 -1388 -3771 -5146 -4728 -4662 -3876 -2834 -2332 -2028 -1149
8533a149F30J558N55m93I67a288k158j786R58R60O24J040Q05K11l08J65a98p6
$$ -1149 630 2188 2743 2250 967 -1288 -3446 -5232 -4274 -3314 -2690 -1650 -845 -634 -942 -777 -198 -274
8515b74n04j115q36P08R09O9l69k72J00m73m28q02M31h55A485J877Q96o63j543
$$ -274 -778 -1893 -2729 -2021 -1112 -1043 -1412 -1684 -1584 -2057 -2485 -3287 -2856 -855 1485 3362 4258 3595 2052
8496B052a71l207k331a824A020P13N05n00a81k236j578j448p87J623a686A270
$$ 2052 -171 -3378 -5709 -1824 1020 1733 2238 1738 -181 -2417 -3995 -5443 -6230 -4607 -1686 1270
8479D187K172J575P57p06j667k550A254a349k554m89M89R34J348B1J572Q37n09
$$ 4187 6359 7934 8691 7985 6318 3768 1254 -1349 -3903 -4392 -3903 -2969 -1621 21 1593 2430 1921
8462A921E01a929p67J214l74j148n44N84J082N49k0o08r20n97m58J66P89J169
$$ 1921 501 -1929 -2696 -1482 -1856 -3004 -3548 -2964 -1882 -1333 -1353 -1961 -2881 -3478 -3936 -3770 -2981 -1812
8444a812d57b15q79j055K35B02Q15C12a882j647k74k54j525Q85J377L0j063j864
$$ -1812 -457 -215 -1094 -2149 -1914 202 1017 312 -1882 -3529 -3803 -4057 -5582 -4697 -3320 -3290 -4353 -6217
8426f217J291a794H37R18F44a395j714j83P54N91o41j411j761j129K458a636A091
$$ -6217 -4926 -1794 837 1755 644 -1395 -3109 -3292 -2538 -1947 -2588 -3999 -5760 -6889 -4431 -1636 1091
8408C525J556l9j192j456b36B04J177R08K61o49p64B45b64n9e7OA1K07O13Q86
$$ 3525 5081 5042 3850 2394 -236 204 1381 2289 2550 1901 1137 245 -264 -323 -57 -51 11 218 831 1717
8388A717J535M57Q5k38j010I86a427r76k80n12r45j045k95J171K100h18r61C63
$$ 1717 3252 3709 3794 3556 2546 986 -1427 -2403 -2683 -3195 -4140 -5185 -5480 -4309 -2209 -818 -1779 363
8369b6j97q10D69K641N394N953P661O846M647M804K437k30l620q089j1379H668
$$ -26 -223 -1033 469 3110 8504 14457 22118 28964 33611 38415 40852 40622 37002 28913 17534 8668
8352D852P526J484k586E541f31l915c68B167j78f0l265m670J096K760a31A868
$$ 4852 12378 13862 11276 5541 -631 -4546 -368 2167 1989 -60 -3325 -7995 -6899 -4139 -131 1868
8335C168O32p61A367b39j373j180l50K5N47P54L01L16N07A66Q80L81k84j06a86
$$ 3168 3800 3039 1367 -239 -1612 -2792 -3142 -3117 -2570 -1816 -1515 -1199 -692 166 1046 1427 1143 1037 -186
8315h43J08j62k12n4M58b07A58O46Q92J469J024j97j917h78k330R06a053o2j396
$$ -843 -735 -897 -1109 -1163 -705 -207 158 804 1696 3165 4189 3992 2075 -878 -3208 -2302 -1053 -1115 -2511
8296b511j295R83h88a64c8k53B91J84a153k559J601G06K049n74A084R20K340K587
$$ -2511 -3806 -2823 -888 -164 -38 -291 291 475 -1153 -3712 -2111 706 2755 2181 1084 2004 4344 6931
8278F931P97l40j236j317r82q66o37p82F24a55o83J97A110J940J082p43I16a919
$$ 6931 7728 7388 6152 4835 3853 2987 2350 1568 624 -155 -838 -641 1110 3050 4132 3389 916 -1919
8259c228J082d82G74J287R73r17i29l849K161A616J669k23A498a736j577J592
$$ -3228 -2146 -482 774 2061 3034 2117 -929 -4778 -2617 1616 3285 3062 1498 -1736 -3313 -1721
8243a721B937L762J880n41l920a926j928C87K478O65J03L34j78A076b174j304
$$ -1721 2937 6699 8579 8038 4118 -1926 -3854 387 2865 3530 3633 3967 3789 1076 -2174 -3478
8227c478a93E746R571J3285J4728J2507P967J005n039r617j2254j3251j1791D702
$$ -3478 -193 5746 15317 28602 43330 55837 63804 64809 59770 50153 37899 24648 12857 4702
8212B277J111L096K481n74k703k807l4K978L599K834J901J37l051n481F50J730
$$ 2277 3388 6484 8965 8391 5688 2881 2847 5825 9424 12258 14159 14296 11245 5764 650 2380
8196B380Q267P507N470K223j246k652l014l823l425m225C186F04k86c7k341l591
$$ 2380 10647 18154 23624 25847 24601 21949 18935 15112 11687 7462 3186 604 318 -37 -2378 -5969
8180e969O62b292O08j716r43A910P962R765P533M652L132K85j692l671n322n872
$$ -5969 -5307 -2292 -1684 -3400 -4343 1910 9872 19637 27170 31822 34954 35239 33547 29876 24554 18682
8164A8682n905n443C307o44J884R63j983a928m429B17N685K659l78l853a947k584
$$ 18682 12777 7334 3307 2663 4547 5510 3527 -1928 -6357 217 5902 8561 8183 4330 -1947 -4531
8148d531B758Q942J0211J1658J1233R187O737L768O40k102m763p419q710j0988
$$ -4531 2758 11700 21911 33569 44802 53989 60726 64494 65134 63032 58269 50850 42140 31152
8134C1152j1220H552b090r65A148J891k33J095J127k47j846b73k393q88l52j457
$$ 31152 19932 8552 -2090 -3055 1148 3039 2806 3901 5028 4781 2935 -273 -2666 -3554 -3906 -5363
8118e363a546A630J566j325a488k461B65N279L983R09j434k808j455L62P42J17
$$ -5363 -1546 1630 3196 1871 -1488 -3949 265 5544 9527 10436 9002 6194 4739 5101 5843 5960
8102E960K17P76K79K370N388P690O133M117K826J181o262k000l215j70m389o290
$$ 5960 6177 6953 7232 9602 14990 22680 28813 32930 35756 36937 30675 28675 25460 25290 20901 14611
8086A4611l521R32P227R704P317L886l92k507k428j248j423l290n765n465l331
$$ 14611 11090 12022 19249 28953 36270 40156 39764 37257 34829 33581 32158 28868 23103 17638 14307
8071A4307o38n13k901l402O62N459O565M608n98n347r24J3303J8938J5491J9229
$$ 14307 13669 13156 10255 6853 7515 12974 19539 24147 23549 18202 17278 30581 49519 65010 84239
8056H4239L6913P0058R5113R9627Q4817N1639P488l7257p3706r2976r3871p6703
$$ 84239 121152 191210 286323 385950 470767 522406 529894 492637 418931 325955 232084 155381
8044A55381n2125l2684k4715k1550A1414L242N493M92k869l669k928j179J704
$$ 155381 103256 70572 45857 24307 11414 14656 20149 20641 17772 14103 11175 9996 11700
8031A1700M298M026J551r24K549Q698J1956J1078N215Q33L50N05l371p701j0172
$$ 11700 15998 20024 21575 20651 23200 31898 43854 54932 60147 60980 61330 61835 58464 50763 40591
8016D0591p340o589n988q898l429O895Q997P819R039P538J514l278K668J2617
$$ 40591 33251 26662 20674 11776 8347 15242 24239 32058 41097 48635 50149 46871 49539 62156
8002F2156J6245K2140L2960L9311M1273O2754J33962K25064K82912K85238K26944
$$ 62156 78401 100541 133501 172812 214085 276839 410801 635865 918777 1204015 1430959
7991A430959J19170j6315j45241k43260k89960k82300k31784j63752G1792B8382
$$ 1430959 1550129 1533814 1388573 1145313 855353 573053 341269 177517 71792 28382
7980G1434M0657J7526p072k2118k2884j5947j1209q670n656l879m337p171n975
$$ 71434 112091 129617 122545 100427 77543 61596 50387 41717 36061 32182 27845 20674 14699
7967A4699P76M857J736k565n928F062A123K918N192n4k643o83N07j4A395b167
$$ 14699 15475 20332 22068 19503 13575 6062 1123 4041 9233 9179 6536 5853 6360 6346 1395 -2167
7950C331N991K239l202A246d830K286B937A283L922I2J1230C309D09N36J556O33
$$ 3331 9322 11561 8359 1246 -4830 -2544 2937 1283 5205 92 11322 3309 409 945 2501 3134
7934C134K659J5350K1491K5132K0505J4482O025k526l8847j1454j9473A5769D021
$$ 3134 5793 21143 42634 67766 88271 102753 108778 106252 67405 55951 36478 15769 4021
7920C364r48f204l330b270B495A95a328B740K809q25G49a305A115J461E88d587
$$ 3364 2416 -6204 -9534 -2270 2495 195 -1328 2740 5549 4724 749 -1305 1115 2576 588 -4587
7903h532b136A209N83G98a465j60C54a46k279j650O06q06N54I67N483L695J375
$$ -8532 -2136 1209 1792 798 -1465 -1625 354 -146 -2425 -4075 -3469 -4275 -3721 967 6450 10145 11520
7886A1520L548O873P639Q199P272P297M844q70q260j4304A1570a0319M484G513
$$ 11520 15068 21941 29580 37779 45051 52348 57192 56322 48062 33758 11570 -10319 -5835 7513
7871A7742M665q76k875k901k778k409k78k183C394i43j231B75c722j621j310K659
$$ 17742 22407 21531 18656 15755 12977 10568 10290 8107 3394 -943 -2174 275 -3722 -5343 -6653 -3994
7855c994E596B434a697B92O651P411M920P060P060M232n84l156q234A2519J3518
$$ -3994 5596 2434 -1697 292 6943 14354 19274 26334 33394 37626 37042 33886 25652 12519 26037
7840B6037L838J273J642j784J773l10J970p05j4638N339m944j641k941m696m584
$$ 26037 29875 31148 32790 31006 32779 32469 34439 33734 19096 24435 19491 17850 14909 10213 5629
7825E629o18N59B413a338k1F917J1046P617P435M098O540J7258L8492N1807N7102
$$ 5629 5011 5570 2413 -1338 -1359 6917 17963 25580 33015 37113 43653 60911 99403 151210 208312
7810B08312N1200L0778O525k0306m1411n4428n6166m6456k8058j1303n533p386
$$ 208312 259512 290290 296815 276509 235098 180670 124504 78048 49990 38687 33154 25768
7798B5768o232j350K526J867k050o759F720A328L289O000K811j315E975b303o473
$$ 25768 19536 18186 20712 22579 20529 13770 6720 1328 4617 10617 13428 12113 5975 -2303 -8776
7783h776d167B409J2320L1540K413m139q492q845B803P331a235B59J6603J6242
$$ -8776 -4167 2409 14729 46269 48682 44543 36051 27206 2803 10134 -1235 259 16862 33104
7769C3104J552j4537J104P417n13m066j1669D942h237E330K0856J7884J0399q26
$$ 33104 34656 20119 21223 28640 28127 24061 12392 4942 -8237 5330 26186 44070 54469 53643
7755E3643j2945j9167A0380D123c004m039K564B573J1017O451l314p682A353N87
$$ 53643 40698 21531 10380 4123 -3004 -7043 -4479 2573 13590 20041 16727 9045 1353 1940
7741A940M847L980K372J558O05o30l169E276c606M41A1243J1819L817m16n651
$$ 1940 6787 10767 13139 14697 15302 14672 11503 5276 -3606 -3165 11243 23062 26879 26463 20812
7726B0812r188B977e033K86a27B000K55a525m78A623L659J064q34k188G19L247
$$ 20812 11624 2977 -5033 -4747 -127 2000 2255 -1525 -2003 1623 5282 6346 5512 3324 719 3966
7710C966N534K194l515B673K149P227M152j581m401m062r09Q77L70P40K553K536
$$ 3966 9500 11694 8179 2673 4822 12049 16201 14620 10219 6157 5248 6125 6495 7235 9788 12324
7694A2324j322D894C92Q284R733L846n002G289k615R421P778K833j463n344o955
$$ 12324 11002 4894 392 8676 18409 22255 17253 7289 4674 14095 21873 24706 23243 17899 10944
7679A0944J003Q324O931J753O80L006J587m102p987m858N846J0239O305K616j203
$$ 10944 11947 20271 27202 28955 29635 32641 34228 30126 22139 17281 23127 33366 39671 42287 41084
7664D1084K081J0074Q918J139o154j2327K742j2507A3871a191A4215K7851K7662
$$ 41084 43165 53239 62157 63296 57142 44815 47557 35050 13871 -1191 14215 42066 69728
7651F9728K8481K1338J080j9670r839K5181K7470J4023J1327K4026L3726O223
$$ 69728 98209 119547 120627 100957 91118 116299 143769 157792 169119 193145 226871 233094
7639B33094o912L3248N3760K1064M2786J69381K24804J43799J07595N01014J175730
$$ 233094 226182 259430 313190 334254 377040 546421 771225 915024 1022619 1523633 2699363
7628B699363J664756J876886J799803J451416Q87885J95410n30539j181771j662308
$$ 2699363 4364119 6241005 8040808 9492224 10380109 10575519 10044980 8863209 7200901
7619G200901j896502j840256j489572q53446j90681n9052j79631k04535r0025
$$ 7200901 5304399 3464143 1974571 1121125 930444 871392 691761 487226 397201
7610C97201j4813n0308p9420m3204j948j3587l1831j5163L941n958k2597j6776
$$ 397201 382388 332080 252660 209456 207508 193921 162090 146927 150868 144910 122313 105537
7598A05537q63j442j1486j2856o963p654r055N95R130M245l233k038j404q586
$$ 105537 104674 103232 91746 78890 71927 64273 55218 55813 64943 69188 65955 63917 62513 53927
7584E3927j8540q825J5608J3830K842j181L613N449K151J696Q243J2284K130j4975
$$ 53927 35387 26562 42170 56000 58842 57661 61274 66723 68874 70570 78813 91097 93227 78252
7570G8252j9114N170J9539q80l9252j8657J17665J35390J27734R5441M5016j2698
$$ 78252 59138 64308 83847 82967 43715 25058 142723 278113 405847 501288 546304 533606
7558E33606o8191j05708j17854r8776n3086j0560l855o694n203n148m770O283
$$ 533606 465415 359707 241853 143077 89991 79431 75576 68882 63679 58531 53761 60044
7546F0044J6834J1813m889k0668j9873R211K9274K9520K5998K1356J3006j271
$$ 60044 76878 88691 83802 63134 43261 52472 81746 111266 137264 158620 171626 170355
7534A70355k0704l6990l9950k5555l689m395j4824j1783R144O702m349n162J688
$$ 170355 149651 112661 72711 47156 43467 39072 24248 12465 21609 28311 23962 18800 20488
7521B0488J898p056F393K902L623D122N017J4395J0184k883j1547G784M456J1270
$$ 20488 22386 15330 6393 9295 12918 4122 9139 23534 33718 30835 19288 7784 12240 23510
7507B3510J1363P368k405j3827A1081m279L412m10k572J2040R480o781E964R986
$$ 23510 34873 42241 39836 26009 11081 6802 10214 9804 7232 19272 28752 21971 5964 15950
7493A5950J7768M985j0297H243i305I240J4773J3595Q843j427j0539j1612o387
$$ 15950 33718 38703 28406 8243 -9305 9240 24013 37608 46451 45024 34485 22873 16486
7480A6486l923K347J4313J3097J509p570k937N507M28j1866A2239N47K708p123
$$ 16486 12563 14910 29223 42320 43829 36259 33322 38829 39257 27391 12239 12786 15494 8371
7466H371L90J3477O276r260B252L606J0155M527J2141J6498N500j1631j9909m158
$$ 8371 8761 22238 28514 19254 2252 5858 16013 20540 32681 49179 54679 43048 23139 18981
7452A8981M680o138j346J8746J0751o260L62K7057K4172J198j9176j7740N839
$$ 18981 23661 17523 16177 34923 45674 39414 39776 66833 91005 92203 73027 55287 61126
7439F1126J2043K963j797l388j1202k1487j6359O059J758A4776E81J8653J0224
$$ 61126 73169 76132 74335 70947 59745 38258 21899 27958 29716 14776 581 19234 29458
7426B9458O394J4120Q347j3055A7680J6201L1094j424k7595a0582H403K7127J2373
$$ 29458 35852 49972 58319 45264 17680 33881 64975 63551 35956 -10582 8403 35530 47903
7413D7903k40M15K2869K9167K6194Q836j8443m3146C2822J8299J5036j8837j8292
$$ 47903 47663 48078 70947 100114 126308 135144 116701 73555 32822 51121 66157 47320 29028
7400B9028L2371K0211j5656k6104K5059K7223r088l0518O111K2278j3539A6869
$$ 29028 61399 81610 65954 39850 64909 92132 83044 52526 58637 80915 67376 16869
7387B8092M2208K451j6241J8622K7975r500m5074K778M3361L077l7275K907M7006
$$ 28092 70300 72751 56510 75132 103107 93607 48533 51311 94672 97749 60474 63381 110387
7374A10387N973m2920k5545M8081J4908l5534j9801M4721J7532k7750j3105M2116
$$ 110387 116360 73440 47895 95976 110884 75350 55549 100270 117802 90052 76947 119063
7362A19063N801o0729A0794Q3299L2073m0654j2745Q2360L7655m6714n0629P2160
$$ 119063 124864 64135 10794 94093 126166 85512 72767 155127 192782 146068 95439 167599
7350A67599M9437m1677p4469N9980O3059k8970p5863M9866O6092l8309F8829M6708
$$ 167599 217036 175359 100890 160870 223929 194959 119096 168962 235054 196745 68829 115537
7338A15537R7704j9115n5108J07172R7921m2509j48585N9191J45942j0364j41844
$$ 115537 213241 194126 139018 246190 344111 301602 153017 212208 358150 347786 205942
7327B05942M7590J61960j197j72574J0733K08813K7424j88050k1389K42573M4497
$$ 205942 253532 415492 414295 241721 252454 461267 488691 300641 279252 521825 566322
7316E66322k08148l4921L08542Q6080k36472p7413L79477J36368k72094j87638
$$ 566322 358174 323253 631795 717875 481403 403990 783467 919835 647741 460103
7306D60103M68355K28865l00156k72844N97131L47840l51322m20678P95010N61735
$$ 460103 928458 1157323 857167 584323 1181454 1529294 1177972 757294 1552304 2114039
7296B114039l90639o64642J063129R25132l87420r71018J475620J579112m14169
$$ 2114039 1723400 1058758 2121887 3047019 2659599 1688581 3164201 4743313 4329144
7287D329144j656034K516897L243351o9197k804029N112719Q491946K343714m576758
$$ 4329144 2673110 5190007 8433358 8364161 5560132 10672851 19164797 21508511 16931753
7278A6931753K0927841N0854140O5257132O6621756N3845363K8836442k974330
$$ 16931753 37859594 88713734 153970866 220592622 274437985 303274427 300300097
7271C00300097l4077279n7256891o7608423o3903331B9907884j3833031N425890
$$ 300300097 266222818 208965927 141357504 77454173 29907884 16074853 21500743
7264B1500743l678582q829719l426302K986714n57415l497499j690921J752551
$$ 21500743 17822161 8992442 5566140 8552854 7995439 4497940 2807019 4559570
7256D559570J1684j839489j166481J178343K05334j053920q33063P50748K25179
$$ 4559570 4571254 2731765 1565284 2743627 2948961 1895041 1061978 1812726 2037905
7247B037905o53863o53476N01893K27107m38912E04676M10946K38465k87043D32701
$$ 2037905 1384042 730566 1232459 1459566 1020654 504676 915622 1154087 867044 432701
7236F71970K09174j93494l35569J71252J76671j46538B55516J38360J78682r4858
$$ 671970 881144 687650 352081 523333 700004 553466 255516 393876 572558 477700
7226D77700B11217P1374J85463l2961j81112J2918J27357l6225j78278J1005J50589
$$ 477700 211217 282591 468054 435093 253981 266899 394256 358031 179753 190758 341347
7215C41347j640j38094P323J99415J26042J8799m8075o8119p0613l7530J6580
$$ 341347 339707 201613 208936 408351 534393 553192 505117 436998 366385 328855 345435
7204C45435J3849o4363j40707o0932J04947L2376o8001n8894Q5181N1710n2949
$$ 345435 359284 294921 154214 93282 198229 230605 162604 103710 188891 240601 187652
7193A87652G2701J3690N9796k1683n804R2324N2962n5254r2162Q5597R1036l8961
$$ 187652 72701 86391 146187 124504 118700 211024 263986 208732 116570 202167 293203 254242
7181B54242j25216O5622J30433j1251j25235K4751J27167n775j27917P4501J72560
$$ 254242 129026 194648 325081 313830 188595 213346 340513 334738 206821 281322 453882
7170D53882m801k20045O0380K90558M9924k12240J9342L29807P5056k89487o3717
$$ 453882 449081 229036 289416 579974 629898 417658 437000 766807 841863 552376 488659
7159D88659M79914K17511k95136j37196O33111L09921m49839m49344J014104N67293
$$ 488659 968573 1186084 890948 753752 1386863 1696784 1246945 797601 1811705 2378998
7149B378998o70750k56073K098089J223979j013201n24987M727403L776363j802861
$$ 2378998 1708248 1452175 3550264 4774243 3761042 3236055 7963458 11739821 9936960
7140I936960j378698K2590703L5386872M1276980L9312569K9026319J2254776
$$ 9936960 8558262 31148965 66535837 107812817 147125386 176151705 188406481
7133A88406481p330834k5164022l7197257m0984160l6545699A6685718m895981
$$ 188406481 181075647 155911625 118714368 77730208 41184509 16685718 11789737
7126A1789737J391255k698216l594773o01596J78049j442211k029336j62031M90068
$$ 11789737 13180992 10482776 6888003 6286407 6464456 5022245 2992909 2830878 3320946
7117C320946o28626A327803k1614P38059m689m87335q2966K06850j46200m57294
$$ 3320946 2692320 1327803 1306189 2044248 2039559 1552224 1469258 1676108 1529908 1072614
7107A072614j72037K28203j3478l87309A83984l1421R2696F1901J25029J62042
$$ 1072614 900577 1128780 1115302 727993 183984 152563 245259 61901 186930 348972
7097C48972q1087o3471L03983K29869j7133j95802q6508P8701k4608j69459n1806
$$ 348972 267885 204414 508397 738266 721133 525331 438823 517524 492916 323457 271651
7086B71651J30895N087j54587n5092J35072J5113j24637r764J42349K1134j24876
$$ 271651 402546 407633 253046 197954 333026 348139 223502 213738 356087 377221 252345
7075B52345o4506J11741K8574r2400m1712P9186j9292I8092K4781J68814J7239
$$ 252345 187839 299580 328154 235754 194042 273228 253936 98092 122873 291687 308926
7064C08926j21787l76J42030J6382j26609j9083J43827J3545j44841r943J78511
$$ 308926 187139 186763 328793 345175 218566 199483 343310 356855 212014 202071 380582
7053C80582L3486j31844m3083J61241K9933j56203k7000K10445M8291j62865k7430
$$ 380582 414068 282224 239141 400382 430315 274112 247112 457557 505848 342983 315553
7042C15553K40736O9341j88905p7388L01708J34119j66327k3182N04143M61499
$$ 315553 556289 625630 436725 359337 661045 795164 628837 605655 1109798 1571297
7032A571297J46584j43408k20516r4374J40273L58617L03939o2697n04239l44502
$$ 1571297 1717881 1574473 1353957 1259583 1399856 1758473 2062412 1999715 1495476 1150974
7022A150974M97096M16293j65015l74723K14245K39742n66317o51085J355368
$$ 1150974 1648070 2064363 1899348 1524625 1738870 1978612 1412295 761210 2116578
7013B116578R76234k69087n87238J330273J334552n65181j623455K538112L104183
$$ 2116578 3092812 2823725 2236487 3566760 4901312 4336131 2712676 5250788 8354971
7004H354971k19308k811287N179182Q193437J982059m679832K1137358M9673873
$$ 8354971 8135663 5324376 10503558 18696995 20679054 15999222 37136580 86810453
6996H6810453O3129615O3982415N1204174K6797011l946700l3762949n5705790
$$ 86810453 149940068 213922483 265126657 291923668 287976968 254214019 198508229
6989A98508229o5203355o1150659B7134459j1710896N191944l880149H125342
$$ 198508229 133304874 72154215 27134459 15423563 20615507 16735358 8125342
6981E442404K979423o99614l489067j468195J751721l6293j820359j138850J101988
$$ 5442404 8421827 7722213 4233146 2764951 4516672 4480379 2660020 1521170 2623158
6972B623158J35954j075491p21648Q66600K16737o69109o35942N01522K02200
$$ 2623158 2759112 1683621 961973 1828573 2045310 1376201 740259 1241781 1443981
6963A443981m57224D92938M43693K29421l03232D28682K55710K01932k09185C33000
$$ 1443981 986757 492938 936631 1166052 862820 428682 684392 886324 677139 333000
6952E51799J99114j43990k97242J34307J84616r7815B48510L6248J82904m2787
$$ 551799 750913 606923 309681 443988 628604 530789 248510 284758 467662 424875
6942D24875j87102N0346J44747l8715j82239P734J40218j5755j54689j4949J31936
$$ 424875 237773 288119 432866 394151 211912 219646 359864 344109 189420 174471 306407
6931C06407J216j26873l3446J13536J3743j08398n4871J06514K3882q5331m6126
$$ 306407 307623 180750 147304 260840 274583 166185 111314 217828 241710 156379 110253
6920A10253R1657K7531p4659o5203Q1355L5620n7303o5757O3601L7008m7237o6095
$$ 110253 201910 229441 154782 89579 170934 206554 149251 83494 147095 184103 136866 70771
6908G0771N5285L9262l8829o0915M8821M2472k8441o1362K6555L9851k3290E2675
$$ 70771 126056 165318 126489 65574 114395 156867 128426 67064 93619 133470 110180 52675
6895H3881M4698j3765n4690M749L9837q848m4313J8235M1177o693m7992l235M3131
$$ 83881 128579 114814 60124 64873 104710 95862 51549 69784 110961 104268 56276 53041 96172
6882I6172K588l9546j7271L3858M228k9944j332L5868N087l3254k0513K9175N015
$$ 96172 98760 59214 41943 75801 80029 50085 48753 84621 89708 56454 35941 65116 70131
6869G0131l4013j6446M5217J6716j9121j9949K1025J0307k3123B0965K9121K1126
$$ 70131 36118 19672 64889 81605 62484 42535 63560 73867 50744 20965 50086 71212
6857G1212j2935B8088J085J2766j4881A0929L4639K1799p530k4856J97J1682r155
$$ 71212 58277 28088 29173 41939 27058 10929 45568 67367 59837 34981 35178 46860 37705
6844C7705A5381J3081J8511o156A6993P304K0066k125j8953M440J8139j696k0185
$$ 37705 15381 28462 46973 40817 16993 24297 44363 42238 23285 27725 45864 44168 23983
6831B3983k559J7461J79A9462o309K1101N552j1165k16J4716P44j8787I147J8291
$$ 23983 21424 38885 39064 19462 13153 34254 39806 28641 28425 43141 43885 25098 9147 27438
6817B7438Q711j2001j1048J3847O693j1136r784J4077O861j1497I676J5132J0665
$$ 27438 36149 24148 13100 26947 33640 22504 12720 26797 33658 22161 9676 24808 35473
6804C5473o990j3168P223J0252o525A0511O501J4242k76j4305E2J456L142Q425
$$ 35473 28483 15315 22538 32790 26265 10511 17012 31254 30978 16673 52 1508 4650 13075
6790A3075J4526P311o925A2106J209R718k096j0356N613J1875K39j1459q316N130
$$ 13075 27601 34912 27987 12106 13315 23033 20937 10581 16194 28069 28308 16849 8533 13663
6776A3663J293k675N654P657l566I658L006J5137L116r880H884K908L789K55R113
$$ 13663 14956 12281 17935 25592 22026 9658 12664 27801 30917 21037 8884 11792 15581 15836 24949
6761B4949J2214J979j1084r467Q874R478j92l743L43p32j1651d32D685J4146K861
$$ 24949 37163 39142 28058 18591 27465 36943 36751 33008 33351 32619 20968 -432 4685 18831 21692
6746B1692N056K0896K3858J4084q34j1430j5833j5523j3248j0856o675J461P718
$$ 21692 26748 47644 71502 85586 84752 73322 57489 41966 28718 17862 11187 12648 20366
6733B0366O324k067j1064C893R137P713m162C136J416J1733K411o046l639L425
$$ 20366 26690 24623 13559 3893 13030 20743 16581 3136 4552 16285 18696 12650 9011 12436
6719A2436M55m804J305P117K482l889k437K620k016D300M33J2251M909m564n811
$$ 12436 12891 8087 9392 16509 18991 15102 12665 15285 13269 4300 4733 16984 21893 17329 11518
6704A1518L059M000l990C078d690A670K099p2L123J880k510K01N350K41B732K36
$$ 11518 14577 18577 14587 3078 -4690 1670 3769 3697 6820 8700 6190 6391 11741 11982 2732 2968
6688B968J8677J5211N538p91L13M232N976q738L510M217O664J4043K1211M6063
$$ 2968 21645 36856 42394 41603 41916 46148 52124 43386 46896 51113 57777 71820 93031 139094
6674A39094L9358L1015J4659m742k0225m1385m2715m0157j8240l2J8173Q00j6820
$$ 139094 178452 209467 224126 219384 199159 157774 115059 74902 56662 56630 74803 75603 58783
6661E8783j3395n880M030J588o395j1077j1153E968c712A994Q024J891m130B390
$$ 58783 45388 39508 43538 45126 38731 27654 16501 5968 -3712 1994 10018 11909 7779 2390
6646D222L471M96Q14K931J6n211a538m22A317a889l03G717P535K246k215k673
$$ 4222 7693 8189 9003 11934 11950 6739 -1538 -1960 1317 -1889 -2192 7717 15252 17498 15283 12610
6630A2610l201C674e753b050D957K394m9N37Q9l945b802R82B816o88A61O503P481
$$ 12610 9409 3674 -5753 -2050 4957 7351 7302 7839 7928 3983 -2802 -1820 2816 2128 161 6664 14145
6613A4145K633k665l164j38j70n022a651e41C995O34k222f94m052l190C13P651
$$ 14145 16778 14113 10949 10811 10641 5619 -1651 -541 3995 4629 2407 -694 -4746 -7936 313 7964
6597G964L018l031B668l01J024e5p914a796D514J045A437b115A096N210L944K690
$$ 7964 10982 7951 2668 2367 3391 -55 -7969 -1796 4514 5559 1437 -2115 1096 6306 10250 12940
6581A2940k33m035A767d969j447J881c76D825M150l41C735b291j330c14A854N17
$$ 12940 12707 8672 1767 -4969 -6416 -4535 -376 4825 8975 8634 3735 -2291 -3621 -314 1854 2371
6565B371A031a723E11O914L398j791A187e883a912A867O365J2584J5297J2692
$$ 2371 1031 -1723 511 7425 10823 9032 1187 -5883 -1912 1867 8232 20816 36113 48805
6551D8805P327J560k371m870p369r755j0783j1036A644f666b029F118Q741J0654
$$ 48805 56132 57692 55321 50451 43082 33327 22544 11508 1644 -6666 -2029 6118 14859 25513
6537B5513P005K448m209r931I458A475l60C68a936k400n928m412q231J226R045
$$ 25513 32518 34966 30757 20826 9458 1475 1115 368 -1936 -4336 -10264 -14676 -22907 -21681 -12636
6522a2636J885L314j401j878k886L933d036B536N057M593R80l644B293a668c1
$$ -12636 -10751 -7437 -8838 -10716 -13602 -9669 -4036 2536 7593 12186 13166 9522 2293 -1668 -31
6506D632O661P686O761O035L521K281M371P225n18P339M891J3k90M435J1236J3965
$$ 4632 11293 18979 25740 31775 35296 37577 41948 49173 48655 55994 60885 60898 60608 65043 76279 90244
6490I0244J1981M796m408j1177j6874j9025j8129j5371r516n54J904j410m978
$$ 90244 102225 107021 102613 91436 74562 55537 37408 22037 12521 11967 13871 12461 7483
6477G483H0c957g69B443M93q84J983M777O252M912J414l618o800k634R790J8447
$$ 7483 80 -3957 -769 2443 2936 2052 4035 8812 15064 19976 21390 17772 10972 8338 18128 36575
6461C6575K2707K3628K0095J2524M076n214j1299j4716j4947j2073q471o064o328
$$ 36575 59282 82910 103005 115529 119605 114391 103092 88376 73429 61356 52885 46821 40493
6448D0493o976p249o309m341m581C253a990F857J6164J4077P851j7o546j1529
$$ 40493 33517 26268 19959 15618 11037 3253 -1990 6857 23021 37098 44949 44932 38386 26857
6434B6857j1775m136k142l917b634n012C465J1978J3392J3732P851J0495J471
$$ 26857 15082 10946 8804 4887 -2634 -7646 3465 15443 28835 42567 50418 60913 62384
6421F2384k815k733k706n277q776j2703A2978F69h812D77Q931L872k660B239g916
$$ 62384 59569 56836 54130 48853 40077 27374 12978 669 -8812 477 9408 13280 10620 2239 -7916
6405a907E481P708O667M458k98m959n344M34L842n2n839E313K819P162L739k024
$$ -1907 5481 13189 19856 24314 24016 19057 13713 14147 17989 17937 12098 5313 8132 15294 19033 17009
6389A7009n36P805J0283Q538O606O200N850l4r219j4485k871J4826K0378J4267
$$ 17009 16473 24278 34561 43099 49705 55905 61755 61721 52502 38017 35146 49972 70350 84617
6375H4617L82j3252k2182r487K3854K7215M632k8930A7877J2761O2218N8227L7233
$$ 84617 84999 71747 49565 40078 63932 91147 95779 66849 17877 30638 92856 151083 188316
6362A88316J8116L8605P6403J60432K56509L08600L03276K43567J46061L4292
$$ 188316 206432 245037 321440 481872 738381 1046981 1350257 1593824 1739885 1774177
6352A774177o7473j44128j94331k25934k41567k43907k12236j42533o7494K281
$$ 1774177 1706704 1562576 1368245 1142311 900744 656837 444601 302068 234574 236855
6342B36855k1223k9982k2194q21J7382M9394O8632O4742L7812j6513p2214j04254
$$ 236855 215632 185650 163456 162635 180017 229411 298043 362785 400597 384084 311870 207616
6330B07616A01536k9708N5562O3395N3144M1959L9684L5354K7275K7695N1559
$$ 207616 101536 71828 127390 190785 243929 285888 325572 360926 388201 415896 467455
6319D67455J89014L20571L61459K98916J52376j9199j54481j81615q8872R383
$$ 467455 656469 977040 1338499 1637415 1789791 1770592 1616111 1434496 1345624 1355007
6309A355007p244j18470k52423l16105l22222H1616B6092N8790K2844N4284M5717
$$ 1355007 1347763 1229293 976870 660765 338543 81616 26092 84882 107726 162010 207727
6298B07727N308l3091n6623m8821j1162J2684Q263K502J0560K6273K8516J2595
$$ 207727 213035 179944 123321 74500 63338 76022 84285 86787 97347 123620 152136 164731
6286A64731K201k252N689j93o218k6952m5267m4326j3794J0678M359L264J0649
$$ 164731 166932 164680 170369 170176 163958 137006 91739 47413 33619 44297 48656 51920 62569
6273F2569J3327P217J0644N1948J16421J39072J44815J24401P7771K1854m4907
$$ 62569 75896 83113 93757 145705 262126 401198 546013 670414 748185 770039 725132
6262G25132j02053j39800j45571j26386j00112m0785m587Q29j4073k0145A0477
$$ 725132 623079 483279 337708 211322 111210 70425 65838 66667 52594 32449 10477
6250G893J9559J0529l867j6733C060J1928R541l079H843i52A5156J3985O962r72
$$ 7893 27452 37981 34114 17381 3060 14988 24529 21450 8843 -952 15156 29141 36103 35131
6236C5131n737j0898C849h462p92K381K937A998Q663J0609L99j025r398A482c320
$$ 35131 29394 18496 3849 -8462 -9254 -6873 -3936 1998 10661 21270 21669 20644 11246 1482 -3320
6220I58J224h29D800J0892O008j916o986n706M128R818J0624J0342Q050M360m94
$$ 958 2182 -829 4800 15692 21700 19784 12798 7092 11220 21038 31662 42004 50054 54414 53920
6205E3920j434J125J929k917q929j1982q329j251J700J214P638J8247K5386K7587
$$ 53920 52486 53611 55540 52623 43694 31712 23383 22132 23832 25046 32684 50931 76317 103904
6191A03904K4010J6923Q607n53q888j5692k2226k8546l5619C260J2547M1748L6031
$$ 103904 127914 144837 153444 152891 144003 128311 106085 77539 41920 3260 15807 57555 93586
6178I3586K7063J3684j153j4577k6000l3171B4495H273N151Q273R77k342k561
$$ 93586 120649 134333 133180 118603 92603 59432 24495 8273 13424 21697 22674 20332 17771
6165A7771n924I47f440A3677L4606M0242M3625M1421L2730J1407n764j8377k8030
$$ 17771 11847 947 -6440 13677 48283 88525 132150 173571 206301 217708 211944 193567 165537
6152A65537l1384j8858J5817M3167L9641J2901p592j7272l146K9653O8605J08856
$$ 165537 134153 115295 131112 174279 213920 226821 219229 201957 198811 228464 297069 405925
6140D05925J42594J55112J36957Q2228L735q0701j51432j89074j92014A43310
$$ 405925 548519 703631 840588 922816 926551 845850 694418 505344 313330 143310
6129B5185E483K1112J4571Q178m253j3234j5028F927C206a535o616L478E469R766
$$ 25185 5483 26595 41166 49344 45091 31857 16829 6927 3206 -1535 -8151 -4673 5469 15235
6115A5235M505L563k670D238a2145j5470i814E896J4290J404j582m045Q194J1572
$$ 15235 19740 23303 20633 4238 -12145 -27615 -9814 5896 20186 21590 20008 15963 24157 35729
6101C5729O727o150A7392E19a2917j2249m932O790K357K809A896J9517P930n820
$$ 35729 42456 36306 17392 519 -12917 -25166 -30098 -23308 -20951 -18142 1896 21413 29343 23523
6087B3523k107K3240L0534K4972J6377J0099K872n352n885j322l554k1647l1054
$$ 23523 21416 44656 75190 100162 116539 126638 129510 124158 118273 116951 113397 91750 60696
6074F0696k6744l114k119I761g055A1958g66C0539P4356O8603L7553k559k8738
$$ 60696 33952 30838 28719 9761 -7055 11958 -766 30539 104895 173498 211051 208492 179754
6061A79754l3723m5733B4373K6505Q2027K0803n6659j7426J13011M9587o8735
$$ 179754 146031 100298 24373 50878 132905 153708 97049 79623 192634 242221 173486
6050A73486k5978J91774J12799j03305p9527M37833L59327j25716j60940J874800
$$ 173486 147508 339282 452081 348776 269249 707082 1066409 940693 779753 2654553
6040B654553L022932L498663L283699K353690Q81851p97580k287095l247196l501132
$$ 2654553 5677485 9176148 12459847 14813537 15695388 14897808 12610713 9363517 5862385
6031E862385B799646G79141L9126J66706l36466B15458J24378J09960j13675A42768
$$ 5862385 2799646 779141 818267 984973 648507 215458 339836 449796 336121 142768
6020A67108O5472m8679G0336P976N9674j8580D7607N167N1770P34l6944j7615
$$ 167108 232580 183901 70336 78312 137986 119406 47607 52774 104544 105278 68334 50719
6008E0719J5842o849B2240n715L1188L211j9041k381J7916J368j7330j0990J1380
$$ 50719 66561 59712 22240 16525 47713 50924 31883 29502 47418 48786 31456 20466 31846
5995C1846J738j5764C142J4960O408p623G908N794L10D083L080J5671L312A2009
$$ 31846 33584 17820 3142 18102 24510 16887 7908 13702 14012 4083 7163 22834 26146 12009
5980h880p722N849j716J756c850L43n075k284i64E335J539b449j3799b080E756
$$ -8880 -16602 -10753 -12469 -10713 -3850 -3507 -8582 -10866 -964 5335 6874 -2449 -16248 -2080 5756
5964C044l69Q285M578Q59L667N963j23J20J7919L8882M4195L8597K5738Q928q024
$$ 3044 2675 10960 15538 16397 20064 26027 25904 26024 43943 82825 127020 165617 191355 200283 192259
5949A92259k2862l4568m0957m1704B0598r368P756J250n470n012j13j14l445k919
$$ 192259 169397 134829 93872 52168 20598 11230 18986 20236 14766 9754 9641 9527 6082 3163
5935C163J51J291r83j649R5K31m55R1k68a291m001i34E098K358j932A836b195
$$ 3163 3314 4605 3622 1973 2068 2299 1844 1935 1667 -1291 -5292 -934 5098 7456 5524 1836 -2195
5917a0733r834J006P641J851n535O895F173J5580J7465P363L785m412m735p723
$$ -10733 -20567 -19561 -11920 -10069 -15604 -8709 6173 21753 39218 46581 50366 45954 41219 33496
5903C3496j0711j0745n342P62M26k633C83d940h2E931L346P44j033k364k481A470
$$ 33496 22785 12040 6698 7460 7886 5253 383 -4940 -82 5931 9277 10021 8988 6624 4143 1470
5886b579m794k55c779A41L923L353J465M61o72k908E31e454L29b444j41r111r18
$$ -2579 -7373 -7628 -3779 141 4064 7417 8882 9343 8671 5763 531 -5454 -5125 -2444 -2585 -11696 -12614
5869a2614A243K2951K1502J8182R015K235p322j1910j6307j6349j1312E029c13
$$ -12614 1243 24194 45696 63878 72893 75128 67806 55896 39589 23240 11928 5029 -313
5855e435l194K044K734Q28j046n35r47n478q097j16j61j355j293L366M251M257
$$ -5435 -8629 -6585 -3851 -3023 -4069 -4604 -5551 -11029 -19126 -19242 -19403 -20758 -22051 -18685 -14434 -10177
5839a0177J408J828L09k324k452j844l179p210k784J0869O061d240o32o263r41
$$ -10177 -8769 -6941 -6632 -8956 -11408 -13252 -16431 -23641 -26425 -15556 -9495 -4240 -4872 -11135 -12076
5824a2076k83L596c476l663J659K339n34k001j414R4j662k537J202K658J932J801
$$ -12076 -12359 -8763 -3476 -7139 -5480 -3141 -3675 -5676 -7090 -6996 -8658 -11195 -9993 -7335 -5403 -3602
5808c602e36B119J042K30g75r622j0523n229p73m721n42N916a3111E152J5282
$$ -3602 -536 2119 3161 3391 -775 -10397 -20920 -26149 -26922 -31643 -32185 -26269 -13111 5152 20434
5793B0434N390o360A449b5080k3740O360a8870b642A9767c48r354L5a704C189
$$ 20434 25824 19464 1449 -25080 -48820 -42460 -18870 -2642 19767 -348 -9702 -9667 -1704 3189
5778D214n70m35K1k14P645J1632J4267J3467J1787L708k728q570j1176j0869j0456
$$ 4214 3644 3209 3230 3016 10661 22293 36560 50027 61814 65522 62794 54224 43048 32179 21723
5763B1723q978C957c15r50B813P912L583M592K750J163r01j782n52J080L91n266
$$ 21723 12745 3957 -315 -1265 2813 10725 14308 18900 21650 22813 21912 20130 19578 20658 21049 15783
5747A5783G820d921q484a730F653K339k761E19e245k184N98k85m792J973a47H784
$$ 15783 7820 -4921 -13405 -1730 6653 8992 6231 519 -5245 -7429 -6831 -7116 -11908 -9935 -147 8784
5730A6098L317L507K688J979P95m085m888n475l416l585B771b741l975L110g54
$$ 16098 19415 22922 25610 27589 28384 24299 19411 13936 10520 6935 2771 -2741 -6716 -3606 -754
5714F5J798K789K110r10A393e107k490b710i01j387k524k378j170p71K157K775
$$ 65 1863 4652 6762 5852 1393 -5107 -7597 -2710 -901 -2288 -4812 -7190 -8360 -9131 -6974 -4199
5698d199a284j433n413j024b592D199M531J480k224l344a426p716L127a656C305
$$ -4199 -1284 -2717 -8130 -9154 -2592 4199 8730 10210 7986 4642 -1426 -9142 -6015 -1656 3305
5682H434N162k763m841L409J2604Q803Q691L368M376k047r672r644q396A996i558
$$ 8434 13596 10833 5992 9401 22005 30808 39499 42867 47243 45196 35524 25880 17484 1996 -9558
5666c187C766J924r84E69b57E253Q077M988j072n707A383i274B339J0425N651
$$ -3187 3766 5690 4706 569 -257 5253 13330 18318 17246 11539 1383 -9274 2339 12764 18415
5651A8415J012m439D570f725a819G409M054j210B518d190B449P534K061m730b136
$$ 18415 19427 14988 4570 -6725 -1819 7409 11463 10253 2518 -4190 2449 9983 12044 7314 -2136
5635b730F721O137K959m46k677m509I59f953d49G471N051j27m500B082L233Q906
$$ -2730 6721 12858 15817 15371 12694 8185 959 -6953 -449 7471 12522 12395 7895 2082 5315 14221
5619A4221N802j770q599d151B443J3629Q016P22o319G933c104P38D329M641K255
$$ 14221 20023 18253 9654 -4151 2443 16072 24088 24810 18491 7933 -3104 -2366 4329 8970 11225
5604A1225M65j655o53K601L945J306k01J244L635K030k732o677m399L595K594
$$ 11225 11690 10035 9382 11983 15928 17234 17033 18277 21912 23942 21210 14533 10134 13729 16323
5589A6323k999E399j425R096Q772L807M67q99J85K258J989n63k497n311j550M356
$$ 16323 13324 5399 3974 13070 21842 25649 26116 25217 25402 27660 29649 29086 26589 21278 19728 24084
5573B4084L184l741q024J786J1325L913p926C291K838K9097J9751O411m441r937
$$ 24084 27268 23527 15503 17289 28614 32527 24601 3291 6129 35226 54977 61388 56947 47010
5559D7010j0219q994o536q458K868K872M201K790K454R929R10l107r932j280J6468
$$ 47010 36791 27797 21261 12803 15671 18543 22744 25534 27988 37917 38827 35720 25788 24508 40976
5544D0976J8831K1477R501M54l535M664J3943J9583J9874J2011J3832J8455J6473
$$ 40976 59807 81284 90785 91239 87704 92368 106311 125894 145768 157779 171611 190066 206539
5531B06539Q738R86m862J1756Q001j3452l7877n1040F0964B0625J9638O8005O0334
$$ 206539 215277 216263 211401 223157 231158 217706 179829 128789 60964 20625 40263 108268 168602
5518A68602M6526M1585L4217K2696R838k6825m3160l0987L2384P3599O7928P662
$$ 168602 215128 256713 290930 313626 323464 296639 253479 222492 254876 328475 396403 404065
5506D04065j5542L4409Q6075R1593M9725j9748J4427J00367K00995K21670K28437
$$ 404065 388523 422932 509007 600600 650325 630577 645004 745371 946366 1168036 1396473
5495A396473K63100L37481M72563P50441J240519J770020K104011K076822J636035
$$ 1396473 1659573 1997054 2469617 3220058 4460577 6230597 8334608 10411430 12047465
5486A2047465Q11226k49415j363338k324763k974934B732570D87940K387044J752829
$$ 12047465 12858691 12609276 11245938 8921175 5946241 2732570 487940 2874984 4627813
5477D627813R08634J24266m69313q03431q76656p64075n78688m29494l29556k46736
$$ 4627813 5536447 5660713 5191400 4387969 3511313 2747238 2168550 1739056 1409500 1162764
5467A162764j71755j22408j02693r0633r0135p6697l5409p1095m2682l4040k0894
$$ 1162764 991009 868601 765908 675275 585140 508443 473034 401939 359257 325217 304323
5456C04323k0130k2681k5309j8888j0322o578q389j5911j6818j0085m263m531
$$ 304323 284193 261512 236203 217315 206993 200415 192026 176115 159297 149212 144949 140418
5444A40418o908o796n670m437p333m654m443n244p872P74J2482J0712L935n084
$$ 140418 133510 126714 121044 116607 109274 104620 100177 94933 87061 87835 100317 111029 114964 109880
5430A09880N95N843j238q299n911J0285K1051J4373p221k2624k9445k5349j1930
$$ 109880 110475 116318 115080 106781 100870 111155 132206 146579 139358 116734 87289 61940 50010
5417E0010j820K808K612K298J267K793K878j321o449j2514j6129j1857J3267K5826
$$ 50010 48190 50998 53610 55908 57175 59968 62846 61525 55076 42562 26433 14576 27843 53669
5403E3669K1602J0150m564j5578j9085j4309r704o488O073J6526J3639M784n449
$$ 53669 75271 85421 80857 65279 46194 31885 22181 15693 21766 38292 51931 56715 51266
5390E1266q593j704J441l743j2792j2843Q88N716l099A385c36B4029K0095J0462
$$ 51266 42673 40969 42410 38667 25875 13032 13920 19636 16537 1385 -336 24029 44124 54586
5376E4586j502j2848B0065D986Q053J3888O382o59o788q517p450m240J462K609
$$ 54586 53084 40236 20065 4986 13039 26927 33309 32650 25862 17345 9895 5655 7117 9726
5362I726j916A692D34R835P939M363P1J485M170J801m391j1355D985K436M686
$$ 9726 7810 1692 434 10269 18208 22571 22642 24127 28297 30098 25707 14352 4985 7421 12107
5347A2107J716M392J0176N941m624n735K2430M2651M3707L5273K2947R147o686
$$ 12107 13823 18215 28391 34332 29708 23973 46403 89054 132761 168034 190981 200128 193442
5334A93442k2930l7873m6804C8859H650O124O705j27J45K153J683K41k760p707
$$ 193442 170512 132639 85835 38859 8650 14774 21479 21352 21497 23650 25333 25574 22814 15107
5320A5107C795K084J1297N269l372p161m367L454Q350J0260Q971K748q392A5188
$$ 15107 3795 5879 17176 22445 19073 11912 7545 10999 19349 29609 38580 41328 32936 15188
5305C304J6966J3464K381p445j0691p84L558o40n885l191Q661R226J904l910r48
$$ 3304 20270 33734 36115 28670 17979 17195 20753 20113 14228 11037 19698 28924 30828 26918 25970
5290B5970N841Q892P306O807P396L836l06k367J092J944l278p502j391J2177J8113
$$ 25970 31811 40703 48009 54816 62212 66048 65742 63375 64467 66411 63133 55631 54240 66417 84530
5275H4530J4989J1835J1065J1869J0446L680q731k4270k8586j0665N179p843j7827
$$ 84530 99519 111354 122419 134288 144734 148414 139683 115413 86827 76162 81341 73498 55671
5262E5671K7370O4497N0809J6450j5118j1889K1076M7259M2847J4490k8047m1958
$$ 55671 83041 147538 198347 214797 199679 187790 208866 256125 298972 313462 285415 243457
5250B43457M9339J44905J24933P4456K29124O33927R57381J068146R45335O01231
$$ 243457 292796 437701 562634 637090 866214 1500141 2457522 3525668 4471003 5072234
5240E072234J13935l98026q26586j060996j052793q02835l45441n2794q2982j45770
$$ 5072234 5186169 4788143 3961557 2900561 1847768 1044933 699492 646698 563716 417946
5230D17946j08024l3875k8227n8276m0164J4336R112k9935m4218j4767Q989n321
$$ 417946 309922 276047 247820 189544 149380 163716 172828 142893 98675 83908 92897 87576
5218H7576k6370k1729k415K253K1259L5333K1985r430l4129k9834j343Q996J9270
$$ 87576 61206 39477 37062 39315 60574 95907 117892 108462 74333 44499 43156 52152 71422
5205G1422L3583K3043j0390l8790k287M2677J9032j9276n356M5385K4357p037
$$ 71422 105005 128048 117658 78868 76581 119258 138290 119014 113658 159043 183400 176363
5193A76363M0956J22139R2646O579O8037M11387O33141O63395N20015K66815l0135
$$ 176363 217319 339458 432104 438683 506720 918107 1551248 2214643 2734658 3001473 2971338
5182B971338k86795m08390k49495K12922N89564O19063L79115J6870l12147m55060
$$ 2971338 2684543 2276153 2026658 2239580 2829144 3448207 3827322 3844192 3532045 3076985
5172C076985l46509j35119q9901k54794m76225n98660n15808j99226L0551l6076
$$ 3076985 2730476 2595357 2505456 2250662 1774437 1175777 659969 460743 491294 455218
5162D55218j34663r9906J4734qn5527m0910M1512M4881o727m8346l8103n961J3201
$$ 455218 320555 220649 235383 235375 179848 138938 180450 225331 218604 170258 132155 126194 139395
5149A39395R977j0646k5099j3094K4523M4845K3187l789q506J4565L1648K9479
$$ 139395 149372 138726 113627 100533 125056 169901 193088 189299 180793 195358 227006 256485
5137B56485L5571Q2084J50364J99697K23974K10021J73884J12827L6790m6953
$$ 256485 292056 374140 524504 724201 948175 1158196 1332080 1444907 1481697 1434744
5127A434744j27465j89088k22540k22119j89405j29385o5595n1044n1663q7914
$$ 1434744 1307279 1118191 895651 673532 484127 354742 289147 238103 186440 98526
5117I8526B2199K6416N9689J8323j1245k1495j7072K180j905j2623k4469G314
$$ 98526 22199 48615 108304 126627 115382 93887 76815 78995 77090 64467 39998 7314
5104d030B3355K3123J1956L32n727o437o678o682m540j357j434p772E764g110
$$ -4030 23355 46478 58434 58766 53039 46602 39924 33242 28702 27345 25911 18139 5764 -7110
5089I133J2587P030J674l118n950n733j485L69k607E592A254N130P405N205K473
$$ 9133 21720 28750 30424 27306 21356 15623 14138 14507 11900 5592 1254 6384 13789 18994 21467
5074B1467j266n131F774A71N929O698L627J226k91k504m470l453J699M490K108
$$ 21467 20201 15070 6774 171 6100 12798 16425 17651 17360 14856 10386 6933 8632 13122 15230
5059A5230l579C748j871J5436J8867J6846J2272P466O329J0007J5172J6554J2979
$$ 15230 11651 3748 1877 17313 36180 53026 65298 72764 79093 89100 104272 120826 133805
5046A33805M175n679j5577k2744k3838j6590j972N983Q247J0201K2812L7388M6353
$$ 133805 137980 132301 116724 93980 70142 53552 51580 57563 65810 76011 98823 136211 182564
5033A82564M4116L1293J1179j2378l4517m7907n0435m2960k7914j4813r221o858
$$ 182564 226680 257973 269152 256774 222257 174350 123915 80955 53041 38228 29007 22149
5021B2149l387k448l275j334K192K217j593l922l010p84k539H1C0M879K853j689
$$ 22149 18762 16314 13039 11705 13897 16114 14521 10599 7589 6805 4266 81 30 4909 7762 6073
5005F073G09c729J275A69J513J264k49j297n7K945K698j95B948c219j767C60L263
$$ 6073 709 -3729 -2454 169 1682 2946 2697 1400 1343 4288 6986 6791 2948 -3219 -4986 360 3623
4988C623p77dj204B086K998Q5k347@H94L928J760j343A453a085A159K631J06A049
$$ 3623 2846 -4 -1208 2086 5084 5169 2822 0 894 4822 6582 5239 1453 -1085 1159 3790 3896 1049
4969b530A532N854K727j761B882c207o39a448K71j134k0h10D67P65O41J11j7m39
$$ -2530 1532 7386 10113 8352 2882 -3207 -3846 -1448 -1177 -2311 -2331 -810 467 1232 1873 1984 1967 1528
4951A528G06a054k500j467L65J137g52C810L885K067o64k955B371f80l877J327
$$ 1528 706 -1054 -3554 -5021 -4656 -3519 -752 3810 7695 9762 9098 6143 2371 -680 -4557 -3230
4935c230I27K931K05j929a074k462k56a524A810J965K2A400b353l223j985L618
$$ -3230 927 3858 4063 2134 -1074 -3536 -3792 -1524 1810 3775 3797 1400 -2353 -5576 -7561 -3943
4919c943G49M388K938J236l60Q65K359K869K460J175K86n55k322m125m912C365
$$ -3943 749 5137 8075 9311 8951 9816 12175 15044 17504 18679 18965 18410 16088 11963 7051 3365
4902A595G15f28k852j851J125L57J093f53G94j25a309k26I12J394I42b234j505
$$ 1595 715 -628 -3480 -5331 -4206 -3849 -2756 -653 794 669 -1309 -1535 912 2306 942 -2234 -3739
4885c739a085A6a234k347l75J767O99j659k001K355H36K887J25A323c025k716
$$ -3739 -1085 16 -1234 -3581 -3956 -2189 -1490 -3149 -5150 -2795 836 3723 3848 1323 -3025 -5741
4869e741b590Q64r89o33f69H58l5f22j480J74O47D3J487P84I05i24j813l98J472
$$ -5741 -2590 -1726 -2715 -3348 -669 858 823 -622 -2102 -1928 -1281 43 1530 2314 905 -924 -2737 -3135 -1663
4850a663A69K53a025j608p10N52M37l78j462J86k07k435K29K890J248q64k862
$$ -1663 169 422 -1025 -2633 -3343 -2791 -2354 -2732 -4194 -4008 -4215 -6650 -6421 -3531 -2283 -3147 -6009
4833f009l73J417O20J065d03A813Q09k91A013i01k291j866b083Q29p44j41A18
$$ -6009 -6382 -4965 -4345 -3280 -403 1813 2622 2331 1013 -901 -3192 -5058 -2083 -1254 -1998 -2139 118
4815B177k23h18l928k624J437O58J695a036B62f34k841k724J549J236J214Q77
$$ 2177 1954 -818 -4746 -7370 -5933 -5275 -3580 -1036 262 -634 -3475 -6199 -4650 -3414 -2200 -1323
4799a323l03n12h17A535Q29F36b725j495J487J0j555j04J268M93J194G94J132
$$ -1323 -1626 -2138 -817 1535 2364 636 -2725 -4220 -2733 -2723 -4278 -4382 -3114 -2621 -1427 794 1926
4782A926I36a216k601K85L55L98G8K947R37j407E89L04N52H9c111k966K377i81
$$ 1926 936 -1216 -3817 -3532 -3177 -2779 78 3025 3962 2555 589 893 1445 89 -3111 -6077 -3700 -981
4763F62L8i76k071Q55f22m59k986k355L193a163l20j834q56J085J225f92B71H1
$$ 662 700 -976 -3047 -2192 -622 -1081 -4067 -6422 -3229 -1163 -1483 -3317 -4173 -3088 -1863 -692 271 81
4744b77E98J667o44a090l707Q00J809K89G35L166J078B379b827j292a5G29a995
$$ -277 598 2265 1621 -1090 -4797 -3997 -2188 -1899 735 3901 4979 2379 -2827 -4119 -15 729 -1995
4726d243J699f69C16P89j12a275j492A198L231J96j665j068n28C38F8L218K806
$$ -4243 -2544 -669 316 1105 993 -1275 -2767 1198 4429 4625 2960 1892 1364 338 68 3286 6092
4709F092p46I70e338a371C934K866P70o33k534D27i59A128J170F89a457k08g38
$$ 6092 5346 970 -5338 -1371 3934 6800 7570 6937 4403 427 -959 1128 2298 689 -1457 -1665 -738
4691F92L013L405J020k692B032Q15O85G08d497i38A467B1a466B413L039p59A512
$$ 692 3705 7110 8130 5438 2032 2847 3532 708 -4497 -938 1467 21 -1466 2413 5452 4693 1512
4673B51Q05h09n542a575C274N94E88b202f33j075k917a003C503K74e48j213C689
$$ 251 1056 -809 -6351 -1575 3274 3868 588 -2202 -633 -1708 -4625 -1003 3503 3777 -548 -1761 3689
4655E497k269A245K144J500k430a418d46K01j933A705M907L31A994a338C370J662
$$ 5497 3228 1245 3389 4889 2459 -1418 -446 -245 -2178 1705 6612 6943 1994 -1338 3370 5032
4639E032A896EN296K322C442d541c26E205o84k252K380K070C304a484D428M683
$$ 5032 1896 5 5301 7623 3442 -4541 -326 5205 4521 2269 4649 6719 3304 -1484 4428 9111
4623I111k879c455B375Q778J940m901E27b793Q74A623P051M035k892A485J312
$$ 9111 6232 -3455 2375 11153 13093 8192 527 -2793 -1919 1623 8674 12709 9817 1485 2797
4608B797Q508J478F051a882B057L04K39J1198J0627J934q477E148k437J923H00
$$ 2797 11305 12783 6051 -1882 2057 2361 2600 13798 24425 26359 17882 5148 2711 4634 800
4592C897J0405K493p942C123J2810R807o93o889J374J8162K8513L7244M2000L8833
$$ 3897 14302 16795 8853 3123 15933 25740 25047 18158 19532 37694 66207 103451 145451 184284
4578A84284K5804O939j3895l2388m3371m4116l1083j4754j1463j0990O983P351
$$ 184284 210088 217027 203132 170744 127373 83257 52174 37420 25957 14967 21950 29301
4566B9301n533A0783P380J1013l312A0099L160J4620j093A3040O019J7285L70
$$ 29301 23768 10783 18163 29176 25864 10099 13259 27879 26786 13040 19059 36344 36714
4553C6714A7718C848K0607N572j0222K246J6075J220j9589I540K5518P771j5455
$$ 36714 17718 3848 24455 30027 19805 22051 38126 39346 19757 9540 35058 42829 27374
4540B7374j3670K1204P192j8545A1329K8987J0265j9378j4819L6597J6332j6778
$$ 27374 13704 34908 42100 23555 11329 40316 50581 31203 16384 52981 69313 52535
4528E2535k6191K6287J9484j7898B4028L3488K6463j6589A9984L2485L2976j5164
$$ 52535 26344 52631 72115 54217 24028 57516 83979 67390 19984 52469 85445 70281
4516G0281C2072M2395L9925j6704C3960L3556N8505p255E4397K0063O7779j885
$$ 70281 32072 74467 114392 97688 33960 67516 126021 118766 54397 74460 142239 140354
4504A40354o8302J6755Q1231K711H5934J4619J09467J1264r9601l327J43840L0754
$$ 140354 72052 88807 170038 172749 85934 100553 210020 221284 121683 118356 262196 292950
4492B92950j17674k9146J87309N4668j45053p5034K65715J11431j65719j37181
$$ 292950 175276 146130 333439 388107 243054 168020 433735 545166 379447 242266
4482B42266L61719J92208k03433k34799N43396L61317k44347m24024R23656Q35446
$$ 242266 603985 796193 592760 357961 901357 1262674 1018327 594303 1517959 2353405
4472B353405r8393n10559J410016J694476n94220A392040R593330J4902901J7666307
$$ 2353405 2255012 1744453 3154469 4848945 4254725 1392040 10985370 25888271 43554578
4463D3554578J7144500J2989209N892802k595550j0466172j5918184j7885885
$$ 43554578 60699078 73688287 79581089 76985539 66519367 50601183 32715298
4456C2715298j6319592D290552j477339K058035j043223j874860K5207M81530
$$ 32715298 16395706 4290552 2813213 4871248 3828025 1953165 1978372 2459902
4448B459902n22223H57560p2936M73422j48351E26503j07018L43972m0928l53056
$$ 2459902 1937679 857560 784624 1258046 1109695 526503 419485 763457 722529 369473
4438C69473j11322K48753K148k28467j08294J80141J9815j63151j02695J55487
$$ 369473 258151 506904 509052 280585 172291 352432 372247 209096 106401 261888
4428B61888L4868j13017H5023J12758L5638q2587E5305R2902L9718n7873E6728
$$ 261888 296756 183739 85023 197781 233419 150832 55305 148207 187925 130052 56728
4416A25734L7246m2982D4472M4265L5829l1236C3096M5911L5662k4397C3081K8551
$$ 125734 162980 119998 44472 88737 124566 93330 33096 79007 114669 90272 33081 61632
4404F1632L6223j3556C6177R462L2024r356B6730J0795L1418m382l1848r3K3535
$$ 61632 97855 84299 36177 45639 77663 68307 26730 37525 68943 64561 32713 32620 56155
4391E6155n300B0195J0948K9320l93k8906A2435K6238L189A9359k721K6619O063
$$ 56155 50855 20195 31143 60463 60070 31164 12435 38673 41862 19359 16638 43257 49320
4378D9320j7093j3159J5353N404j5610H141J7827O477j3041o678J9193N784j3348
$$ 49320 32227 19068 34421 39825 24215 8141 25968 32445 19404 12726 31919 37703 24355
4365B4355G708J8502J0469q103A0675M977Q763o111G267J2286J0727n434A1358
$$ 24355 7708 26210 36679 28576 10675 15652 24415 18304 7267 19553 30280 24846 11358
4351B1980J5289l17j5154K303L5234L8726L4782K9428K3201J3749Q63j6354l3668
$$ 21980 37269 36952 21798 24101 59335 98061 132843 162271 185472 199221 200084 183730 150062
4338A50062m5285m5788k9036k772m128A1412J320J0977Q01j0255F223Q206L189
$$ 150062 104777 58989 29953 27181 23053 11412 12732 23709 24510 14255 6223 14429 17618
4325A7618n678l329N710O78o015k057O975J998o535a640E220M342D639a398D425
$$ 17618 11940 8611 14321 14999 8984 6927 13902 15900 9365 -1640 5220 9562 4639 -1398 4425
4309G293j771K203O593K507n109A761Q64M381k595b375E127O860m18n276B156
$$ 7293 5522 7725 14318 16825 11716 1761 2625 7006 4411 -2375 5127 11987 11569 6293 2156
4293B814j111a333D168L918j646A675J588K856j852b686a57G355J896l454F63
$$ 2814 1703 -1333 4168 8086 6440 1675 3263 6119 4267 -2686 -157 7355 9251 5797 663
4277e03f1l299E47K649r40h57A614O214K201k308l096j96k04A037b426F68J666
$$ -503 -61 -3360 547 3196 2256 -857 1614 7828 10029 7721 4625 4429 4225 1037 -2426 668 2334
4260B334A053J229L982Q46C395b991C86L229j226a253n05g5n59l238J489A95c9
$$ 2334 1053 2282 6264 7110 3395 -2991 386 3615 2389 -1253 -1758 -75 -634 -3872 -2383 195 -39
4242b529a234hE65L055M435K025k516A941l52L148K8I48a182C059J209A952b554
$$ -2529 -1234 -8 565 3620 8055 10080 7564 1941 1589 4737 4765 948 -1182 3059 4268 1952 -2554
4224g91A710n25a006r77e4C161L903J065k459dl650B543K586j901a183m106b276
$$ -791 1710 1185 -1006 -1983 -54 3161 7064 8129 5670 -4 -3654 2543 5129 3228 -1183 -5289 -2276
4206a234L74Eh51j354A687M094K050p85k747E73a770e99A717J079I32b923c86
$$ -1234 -860 5 -851 -2205 1687 5781 7831 7046 4299 573 -1770 -599 1717 2796 932 -2923 -386
4188D446K452j378A343c439M38a184l51j812J427d7A473J232O00p99I17j71O56
$$ 4446 6898 5520 1343 -3439 -3001 -1184 -1535 -3347 -1920 -47 1473 2705 3305 2506 917 746 1402
4171A402D57b616j50F89K800K580J899J234j546l691d73j407AJ034rC05f49j852
$$ 1402 457 -2616 -2766 689 3489 6069 7968 9202 7656 3965 -473 -1880 1 1035 1026 305 -649 -2501
4153b501K23g78G7O94J43J8rA95d51o6n52j380a128A111P30g15k506a83B717J859
$$ -2501 -2278 -778 77 771 914 932 923 195 -451 -517 -1069 -2449 -1128 1111 1841 -715 -3221 -183 2717 4576
4133D576K83m17j7K195J596J480o99k270l320B51a496p38N77H0J250n33a201r62
$$ 4576 4859 4442 4425 6620 8216 9696 8997 6727 3407 251 -1496 -2234 -1657 80 1330 797 -1201 -2163
4115b163f57a32o46j467j357R86e95A888J621m95C44f14C254L071O96j594k457
$$ -2163 -657 -132 -778 -2245 -3602 -2616 -595 1888 3509 3014 344 -614 3254 6325 7021 5427 2970
4098B970A247j94O90M19r35g81K06A800J525k41A446a105k037j95M29N61M29M41
$$ 2970 1247 1053 1743 2162 1227 -781 -575 1800 3325 3084 1446 -1105 -3142 -3337 -2908 -2347 -1918 -1477
4080a477o80o62m39a434A43R38l52e1j023n42K89a59A504J994J026L2j145j004
$$ -1477 -2157 -2819 -3258 -1434 143 1081 729 -51 -1074 -1616 -1327 -159 1504 3498 4524 4556 3411 2407
4062B407n14O94O08j39j047a25k536O93A55R11K62L4j87A67b80A634K958J371
$$ 2407 1893 2587 3195 3056 2009 -125 -2661 -1968 155 1066 1328 1362 1175 167 -280 1634 4592 5963
4044E963j398A107b583r49a580A036K481J424O8p76j085A477a104k723a329A255
$$ 5963 4565 1107 -2583 -3532 -1580 1036 3517 4941 5009 4233 3148 1477 -1104 -3827 -1329 1255
4027A975I13g63j314p8O1n07o08N8J346f55a09o02J25I73J772J075j31j189A241
$$ 1975 913 -763 -2077 -2155 -2094 -2601 -3209 -3151 -1805 -655 -109 -711 -586 973 2745 3820 3689 2500 1241
4007c1j048p36q8oj4A50K283K064J536L51r48q05p24k92K44M44j86q47A459a23
$$ -31 -1079 -1815 -1903 -1909 -1923 150 2433 4497 6033 6384 5436 4631 3907 3615 3859 4303 4117 3270 1459 -123
3986a724N49E03Q52k37a38j502j023K81J035N81m84q89n58R8M41O89N83O9r02
$$ -1724 -1175 503 1355 1118 -138 -1640 -2663 -2382 -1347 -766 -1250 -2139 -2697 -2599 -2158 -1469 -886 -817 -1719
3967a719m29O95e38k28j561j544M7J342P55m88j049m48P02O58o7l04O30h86B54
$$ -1719 -2148 -1453 -538 -766 -2327 -3871 -3824 -2482 -1727 -2215 -3264 -3712 -3010 -2352 -2419 -2723 -2093 -886 254
3947A147J75n68b11j126o57o93j210l89J93R82J472B73K241J891O99l75j202A260
$$ 1147 1322 754 -211 -1337 -1994 -2687 -3897 -4286 -4093 -3111 -1639 273 2514 4405 5104 4729 3527 1260
3928a701Q30A616J198J87n74o73k61K57J11l89M25J568J378O2j812d80l761P87
$$ -1701 -871 1616 2814 3001 2427 1754 1493 1750 1861 1472 1897 3465 4843 4905 3093 -480 -4241 -3454
3910c454a289b06O7p24p16m08n51j041o09J730g61C51r5f85o06P0J26q56j550
$$ -3454 -1289 -206 -139 -863 -1579 -1987 -2538 -3579 -4188 -2458 -761 351 256 -685 -1291 -1221 -1095 -1951 -3501
3891c501J153E74J837Q91j47j102p41K10L25K9p03C87d00p63P9b49B68m9h09j452
$$ -3501 -2348 574 2411 3302 3155 2053 1312 1522 1847 1876 1173 387 -400 -1163 -1084 -249 268 219 -809 -2261
3871b261q79k91l66J239h60A75L01j21J03O76R19Q0F80a057D01L235L143J607
$$ -2261 -3140 -3431 -3797 -2558 -860 175 476 355 458 1134 2053 2133 680 -1057 401 3636 6779 8386
3853H386o31k613A985a067j521o11k62P17J267E7J224O96P3j004A28b23j63r15
$$ 8386 7755 5142 1985 -1067 -2588 -3199 -3461 -2744 -1477 57 1281 1977 2050 1046 128 -223 -386 -1301
3835a301j674q44a869b89D83K23q6j83j09j30D6J86P41P21k48hj671Ka43D15d30
$$ -1301 -2975 -3819 -1869 -289 483 706 620 437 328 198 46 232 973 1694 1446 -8 -1679 -1677 -143 415 -430
3813a200j110p96k74K63L94L59k50q32j116L01J974h88d38j92j39K62A5M7e92
$$ -1200 -2310 -3106 -3380 -3117 -2723 -2364 -2614 -3446 -4562 -4261 -2287 -888 -438 -630 -769 -507 15 62 -592
3793a716j272m81R66J064f09j8k33o55j226p08R01Q37l11j143O08i32b66n64k125
$$ -1716 -2988 -3469 -2503 -1439 -609 -627 -860 -1515 -2741 -3449 -2548 -1711 -2022 -3165 -2557 -932 -266 -830 -2955
3774b955J362A108J648K3A348a425l323n26J704O23j50m59j07N36P06Q85e82C50
$$ -2955 -1593 1108 2756 2779 1348 -1425 -4748 -5274 -3570 -2947 -3097 -3556 -3663 -3127 -2421 -1536 -582 350
3755G61k62e83q92J35M81M7j118j285m71J668b36A031N6A95h96j187j048J85M48
$$ 761 499 -583 -1475 -1340 -859 -812 -1930 -3215 -3686 -2018 -236 1031 1087 195 -896 -2083 -3131 -2946 -2498
3736b498Q58f23E29P43L94m72b56o01k64n71j287n67i91A044J466M83l41k31r8
$$ -2498 -1640 -623 529 1272 1666 1194 -256 -857 -1121 -1692 -2979 -3546 -991 1044 2510 2993 2652 2421 2323
3717B323J135R54K017K003J752R89K92j111l248C325H32a3A27L71M2k0N84O15
$$ 2323 3458 4412 6429 8432 10184 11173 11465 10354 7106 3325 832 -13 127 498 540 520 1104 1719
3699A719N02l5o77m29L41P93O88P7m09j234E94k35Q74J093O54k57p83I51C39q4
$$ 1719 2221 2186 1509 1080 1421 2214 2902 2979 2570 1336 594 359 1233 2326 2980 2723 1940 951 339 255
3679B55N60O76K65l50E58a123j576l90J53j14P7R89K32o62j074J199i87d56J11
$$ 255 815 1491 1756 1406 558 -1123 -2699 -3089 -2936 -3050 -2973 -1984 -1752 -2414 -3488 -2289 -987 -456 -345
3660c45p49p20p6O08a40A066J108K70j42r68G6h61j38c50G23J218L35l18F87g33
$$ -345 -1094 -1814 -1890 -1282 -140 1066 2174 2444 2302 1334 76 -861 -999 -350 723 1941 2276 1958 687 -733
3639a679k36p7n20n01J105g58L59l11r0a18A291J796J162M04l6m62j132A002a154
$$ -1679 -1915 -1992 -2512 -3013 -1908 -758 -399 -710 -800 -118 1291 3087 4249 4653 4617 4155 3023 1002 -1154
3619a041I65J212j58p35M03J884K402J968K30j470j786k093F29a356j873j49J266
$$ -1041 965 2177 2019 1284 1687 3571 5973 7941 8171 6701 4915 2822 629 -1356 -3229 -3378 -2112
3602b112O63m08l11j188m46P93a499d26p1j326k049m61J238J115i32A11K32j21
$$ -2112 -1449 -1857 -2168 -3356 -3802 -3009 -1499 -426 -497 -1823 -3872 -4333 -3095 -1980 -932 111 343 222
3584B22b10j41j07J65a46q10j490n32J261b91I93R50R3q28C82f3n2r77j455j328
$$ 222 -210 -351 -458 -293 -146 -956 -2446 -2978 -1717 -291 993 1943 2036 1208 382 -63 -115 -1092 -2547 -3875
3564c875L1J332a252c3A150M55k09m52D31d11J12F13L72l29e08j109l03d14H38
$$ -3875 -3844 -2512 -1252 -33 1150 1605 1396 944 431 -411 -299 613 985 656 -508 -1617 -1920 -414 838
3544A360j38l88l49M44Qm54@g57n40o01p20l32Q12P33M34J42K07K15p6a40F39
$$ 1360 1222 834 485 929 937 483 0 -757 -1297 -1898 -2618 -2950 -2138 -1405 -971 -829 -622 -407 -483 -140 639
3522B011J249K82q78A048d42p14j57n8m25n88j48L46Q88g1A046R24N55J29o35
$$ 2011 3260 3542 2664 1048 -442 -1156 -1313 -1371 -1796 -2384 -2532 -2186 -1298 -71 1046 1970 2525 2654 2019
3503B019G99e43j123p42J50Q39g9A973J916J477M86q25j857H33a376j245q45q37
$$ 2019 799 -543 -1666 -2408 -2258 -1419 -79 1973 3889 5366 5852 5027 3170 833 -1376 -2621 -3466 -4303
3485d303J800b79A518P26n07B94a794j353M73p1k17P61h11G85J345R33O28M65
$$ -4303 -2503 -279 1518 2244 1737 294 -1794 -3147 -2674 -2745 -2962 -2201 -811 785 2130 3063 3691 4156
3467D156P95L15n49j526B20c028k166a999B81J357J49o45D8a638j113m6O58Q8
$$ 4156 4951 5266 4717 3191 220 -3028 -5194 -1999 281 1638 1787 1142 48 -1638 -2751 -2797 -2139 -2051
3449b051k78o64J300d14B22g7j260j227p99Q96g92A032R26l05D24g95k97J97j9
$$ -2051 -2329 -2993 -1693 -414 222 -77 -1337 -2564 -3363 -2467 -792 1032 1958 1653 424 -795 -1092 -895 -914
3430i14K76A93L18J42k59c05n17K32A31N18J63l91f62j281q22K76h69G13J342
$$ -914 -638 193 511 653 394 -305 -822 -590 131 649 812 421 -662 -1943 -2765 -2489 -869 713 2055
3411B055J193P34r7m65n33k61n36G32g41j89d65A08L04a71j943j556Q08K2k03
$$ 2055 3248 3982 3885 3420 2887 2626 2090 732 -741 -930 -465 108 412 -171 -2114 -3670 -2862 -2840 -3043
3392c043k10Q4N35M24O66P35b57l8q60q06m64M41N64J5k93k36j12l64o73o83J855
$$ -3043 -3253 -3169 -2634 -2210 -1544 -809 -257 -295 -1155 -1961 -2425 -1984 -1420 -1405 -1698 -1934 -2046 -2410 -3083 -3766 -1911
3371a911E70J827P32j27q30C62a832j559f81A430Q45J11k14p77a91j890j238Q01
$$ -1911 570 2397 3129 3002 2172 362 -1832 -3391 -681 1430 2275 2386 2172 1395 -191 -2081 -3319 -2518
3353b518a010B35N98M16j74Q6P91O97m87H57h35l91g0A204O44N06o19A99a376
$$ -2518 -1010 235 833 1249 1075 1161 1952 2649 2162 857 -835 -1226 -70 1204 1848 2354 1735 199 -1376
3333B46K529K024L04r69B005i33k732J394a57A148L68J3Kk45L0n15k36A45a12
$$ 246 2775 4799 5103 4134 2005 -933 -3665 -2271 -157 1148 1516 1529 1531 1286 1316 801 565 145 -112
3313d39aI68N98K51m70m84l68K2a8j142j207k78P64b61A751K136K462R03l75p77
$$ -439 -1 968 1566 1817 1347 863 495 517 -18 -1160 -2367 -2645 -1881 -261 1751 3887 6349 7252 6877 6100
3293F100j17J81L67l6n43p42r31o67l26m96r50G02e22j268j057p90k37N47J426
$$ 6100 5983 6164 6531 6495 5952 5210 4279 3612 3286 2790 1840 702 -522 -1790 -2847 -3637 -3874 -3327 -1901
3274a901e48E44N50K83k14E41b42B53J841K648J651O21r33k384I42b507l70a028
$$ -1901 -548 544 1094 1377 1163 541 -242 253 2094 4742 6393 7014 6081 3697 942 -2507 -2877 -1028
3255c03j42k62l09n18j054o82R50d92A738J390M35l49p16r29p58l95a05p84j086
$$ -303 -445 -707 -1016 -1534 -2588 -3270 -2320 -492 1738 3128 3563 3214 2498 1569 811 416 -105 -889 -1975
3236a975j004L47O62J32k27L3K55O36M12J95l62l09N76c05m64j255j470q67J407
$$ -1975 -2979 -2632 -1970 -1838 -2065 -2032 -1777 -1141 -729 -534 -896 -1205 -629 -305 -769 -2024 -3494 -4361 -2954
3217b954J261O86L60b12E45J005N68o9p01n74M55Q75M91r5J20l49o19G79a23j201
$$ -2954 -1693 -1007 -647 -212 545 1550 2118 2049 1348 774 1229 2104 2595 2500 2620 2271 1652 779 -123 -1324
3197a324j219j041m13K96M78K28j43M7O42Q41P22A97J416N84J40k22l05k93l42
$$ -1324 -2543 -3584 -3997 -3701 -3223 -2995 -3138 -3091 -2449 -1608 -886 197 1613 2197 2337 2115 1810 1517 1175
3178A175j31r0J46M85J91j48G77j28O5C11c37o89l75j48R2j19l76L91j75k55l1
$$ 1175 1044 954 1100 1585 1776 1628 777 649 714 311 -337 -1026 -1401 -1549 -1457 -1576 -1952 -1561 -1736 -1991 -2022
3157b022J72m01n70l42L03O20P08f35b67L2l38l19c10C49N31P00P19L02n02D26
$$ -2022 -1850 -2251 -2821 -3163 -2860 -2240 -1532 -635 -267 -235 -573 -892 -310 349 880 1580 2299 2601 2099 426
3136b565o45e25A703J720J635k9j476j609H62h2p46K28D59R98L22n37C35f77o82
$$ -2565 -3210 -525 1703 3423 5058 5029 3553 1944 862 -82 -828 -600 459 1457 1779 1242 335 -677 -1359
3117a359k3K78A7J819J183P97k69r41j184o8O97O06r2j203h98k700J699B07J923
$$ -1359 -1382 -1104 17 1836 3019 3816 3547 2606 1422 1354 2051 2657 2565 1362 -898 -3598 -1899 207 2130
3098B130J468k03A630a491k922a827B127K330R15P13P31M2m61j308k322B35a012
$$ 2130 3598 3395 1630 -1491 -4413 -1827 2127 4457 5372 6085 6816 6858 6397 5089 2767 235 -1012
3080f11B49L54f59k185K05E24K572J345j08q89j205A102D14j59Q3P55J267J558
$$ -611 249 603 -659 -2844 -2639 524 3096 4441 4333 3444 2239 1102 414 255 338 1093 2360 3918
3062C918J227P81m96j877A09c724n13J626J283O52a46B90K69k8j99J17Q41J288
$$ 3918 5145 5926 5430 3553 109 -3724 -4237 -2611 -1328 -676 -146 290 559 531 332 449 1290 2578
3044B578J221N61o48j492H7b521j038a373G05J164K57q91d26k482K03J216O42
$$ 2578 3799 4360 3712 2220 87 -2521 -3559 -1373 705 1869 2126 1235 -426 -2908 -2705 -1489 -847
3027h47K1o64q82j466o96J653J204Q19d05om48q41j240n00P27L71O6L81a76B184
$$ -847 -826 -1490 -2372 -3838 -4534 -2881 -1677 -858 -405 -411 -859 -1700 -2940 -3440 -2713 -2342 -2276 -1895 -176 2184
3006C834J093n58k173a549m240J995c24B176Q87O30j453D7a840j72A20K589J723
$$ 3834 4927 4369 2196 -1549 -5789 -3794 -324 2176 3063 3693 2240 47 -1840 -2012 120 2709 4432
2989D432L9j455E88a937j271O15J39r44O21a195A39R38L72l92g6j694q92P86a34
$$ 4432 4471 3016 588 -1937 -3208 -2593 -2454 -3398 -2777 -1195 139 1077 1449 1057 -76 -1770 -2662 -1876 -134
2969A110O98P99o78B05a659k009J346d89H82M92P80O65j26k37o18G76c55j489
$$ 1110 1808 2607 1929 205 -1659 -3668 -2322 -489 882 1374 2154 2819 2693 2456 1838 776 -355 -1844
2951a844j028a161F76Q25G29a605k864r5a954b7H18m4A35i22p11j98P01A78J763
$$ -1844 -2872 -1161 676 1501 729 -1605 -4469 -4564 -1954 -27 818 774 135 -922 -1633 -1831 -1130 178 1941
2932A941J193N3j78j179D71c69g3G91M25j99B22h54j220o23J026g55h1p8j51n66
$$ 1941 3134 3187 3009 1830 471 -369 -73 791 1216 1017 222 -854 -2074 -2697 -1671 -755 -81 -159 -310 -876
2912h76m73k37J48q5J98M05c46B46J216J621K822J904J025m07j490k206k256A217
$$ -876 -1349 -1586 -1438 -1523 -1325 -920 -346 246 1462 3083 5905 7809 8834 8427 6937 4731 2475 1217
2893C36f0p75j299r20O74J036L93c46B5L44M43M07K61P1o70i44k126j246J09j04
$$ 336 -60 -835 -2134 -3054 -2380 -1344 -951 -346 25 369 812 1219 1480 1551 881 -944 -3070 -4316 -4207 -4311
2873d311m22K053e44A354J378N84n9r11j057E51C2f07m89L03A87J128O85K31N84
$$ -4311 -4733 -2680 -544 1354 2732 3316 3257 2346 1289 551 32 -607 -1096 -793 187 1315 2000 2231 2815
2854B815Q48Q80j0j012I85b745n00a18B000J599Q39m76j563r00p20B01a057j542
$$ 2815 3663 4543 4533 3521 985 -2745 -3245 -118 2000 3599 4438 3962 2399 1499 779 201 -1057 -2599
2836b599o4c67B315K359J989J272k65j495k091A897B99J86j26E7M03J289K005
$$ -2599 -2663 -367 2315 4674 6663 7935 7670 6175 4084 1897 299 485 359 57 460 1749 3754
2819C754J648J334N73m51j975A374b518n37a258a15A45b43j479j520j317k61J640
$$ 3754 5402 6736 7309 6858 4883 1374 -2518 -3055 -1258 -115 145 -243 -1722 -3242 -4559 -4820 -3180
2802c180J483c87D24K70k84a42m12n85r08p87l44l1L31R26P57L23R7m2L56a13
$$ -3180 -1697 -387 424 694 410 -142 -554 -1139 -2047 -2834 -3178 -3209 -2878 -1952 -1195 -872 -775 -817 -461 -113
2781B53K08K76J83K39N7l45@a716j200a028A197M06F23a482k533J026i88B35o0
$$ 253 461 737 920 1159 1216 871 0 -1716 -2916 -1028 1197 1603 623 -1482 -4015 -2989 -988 235 175
2762A75g07r34o37p12a443A14R20M23R2n59d1r18p01q54m96M22J238a34F39K42
$$ 175 -707 -1641 -2278 -2990 -1443 114 1034 1457 1549 990 -41 -959 -1660 -2514 -3010 -2588 -1350 -134 639 881
2742H81k29a13j249j489j222J605a27A741J349N74j43k67l5M03J598J248P40n84
$$ 881 652 -113 -1362 -2851 -4073 -2468 -127 1741 3090 3664 3521 3254 3219 3622 5220 6468 7208 6624
2724F624k161A429i92p62e94A070J205L24k18j133B38n4Q50J001J327P42K0o55
$$ 6624 4463 1429 -992 -1754 -594 1070 2275 2599 2381 1248 238 184 1034 2035 3362 4104 4124 3469
2706C469r08j168C89c67m25j005o13N40O25d24A94J38F8L18R45J304J329P07m49
$$ 3469 2561 1393 389 -367 -792 -1797 -2410 -1870 -1245 -424 194 332 68 386 1331 2635 3964 4671 4222
2687D222j041A497c02j436p97o7f87B097K600J880J266L48o54j100k096A335a523
$$ 4222 3181 1497 -302 -1738 -2535 -2602 -687 2097 4697 6577 7843 8191 7537 6437 4341 1335 -1523
2669c488O77f10A750K207J032l89j293A614B2f66n60L72F04K824J486j11j611
$$ -3488 -2811 -610 1750 3957 4989 4600 3307 1614 22 -666 -1226 -854 604 3428 4914 4803 3192
2652C192F03b880k283b161H35K768J153j89q63j237D65a589o62a004F7a79j209
$$ 3192 603 -2880 -5163 -2161 835 3603 4756 4567 3704 2467 465 -1589 -2251 -1004 67 -179 -1388
2635a388j370j096Q24R42J25J62M12O72A32g27j212j013J332A801K661J992K49
$$ -1388 -2758 -3854 -3030 -2088 -1963 -1801 -1389 -717 132 -727 -1939 -2952 -1620 1801 4462 6454 6703
2618F703j215j825j679F46b06o43m11L46a94E44K02C62c74q02l85J12M73K0m52
$$ 6703 5488 3663 1984 646 -206 -849 -1260 -914 -194 544 746 362 -374 -1176 -1561 -1449 -976 -956 -1408
2599a408o79q24K75a047A156J548R48P5m70j177E38c29H08R50m58a61j739r52
$$ -1408 -2087 -2911 -2636 -1047 1156 2704 3652 3727 3257 2080 538 -329 808 1758 1300 -161 -1900 -2852
2581b852g93G93M57D75a261l80d2A072m3m81b50LH62P88P3o82n15J19L79M6A1
$$ -2852 -793 793 1250 475 -1261 -1641 -42 1072 1029 548 -250 -247 862 1650 1723 1041 526 645 1024 1070 11
2559a194j270P29b26I37L10H1g11o40n12l85K44N29N07A8Q50M93J21n0j86m40
$$ -1194 -2464 -1735 -226 937 1247 81 -711 -1351 -1863 -2248 -2004 -1475 -968 18 868 1361 1482 1432 1246 806
2539H06j29K39K51O03O94O45n62j080g77j567j35O09O14c67A179J415J264M86
$$ 806 677 916 1167 1770 2464 3109 2547 1467 -777 -2344 -2479 -1870 -1256 -367 1179 2594 3858 4344
2521D344n07j496A82b244j843J377a022C14N33K69K30J14j43m59a4j454j841l0
$$ 4344 3837 2341 182 -2244 -4087 -2710 -1022 314 847 1116 1346 1460 1317 858 -14 -1468 -3309 -3339
2503c339a513E90J688J677Q74j005I32b548N92H12K182J170m4r15j090E12g75
$$ -3339 -1513 590 2278 3955 4829 3824 932 -2548 -1956 812 2994 4164 4120 3205 2115 512 -775
2485a172N53a02j16o81r81j115M06h59H94J516M16k89n99o50o24L2O21Q02K08
$$ -1172 -619 -102 -218 -899 -1880 -2995 -2589 -859 894 2410 2826 2537 1938 1288 664 696 1317 2119 2327
2466B327m72q26F5a368j207q14j087J56J263J177O59N09a22H20P11Q3n79D02d66
$$ 2327 1855 1029 65 -1368 -2575 -3389 -4476 -4320 -3057 -1880 -1221 -712 -122 820 1531 1614 1035 402 -466
2446a172l3e29A90L01B4a091j378r54K77Q53J033N59jq14j484l48J201J067M1
$$ -1172 -1205 -529 190 491 24 -1091 -2469 -3423 -3146 -2293 -1260 -701 -702 -1516 -3000 -3348 -2147 -1080 -1039
2427a039m10J97M93J94o01j428j036R8k04N36J342A75J248l0C93a083p49O02F54
$$ -1039 -1449 -1252 -759 -565 -1166 -2594 -3630 -3532 -3736 -3200 -1858 175 1423 1393 393 -1083 -1832 -1230 654
2407B111R19R6j224G53A40a54j11l76l04p8p5n26q05k57R19a52A183P25K13k98
$$ 2111 3030 3126 1902 753 140 -154 -265 -641 -945 -1023 -1098 -1624 -2429 -2686 -1767 -152 1183 1908 2121 1823
2387A823n29o06e5q3a9C3J39M65O66P91J007R31R45N94k00q39n49n62r28j059
$$ 1823 1294 688 -55 -138 -19 33 172 637 1303 2094 3101 4032 4977 5571 5371 4532 3983 3421 2493 1434
2367A434J02P85J31j46q60F02b86l21eH26N17r5C38a185k160j036J953a187c39
$$ 1434 1536 2321 2452 2306 1446 602 -286 -607 -5 826 1343 1248 338 -1185 -3345 -4381 -2428 -1187 -339
2347A56L47p4B09a10m41j79K49D72J485J106n2j13l00k09j74R8j41o28b1j536
$$ 156 503 429 209 -110 -551 -730 -481 472 1957 3063 3011 2898 2598 2389 2215 2313 2172 1544 -21 -1557
2327a557j319Q82D79J934O72n18q32G15k61O72J289R42m41n14l38K73R4p50a52
$$ -1557 -2876 -1994 479 2413 3085 2567 1735 715 454 1126 2415 3357 2916 2402 2064 2337 2431 1681 -152
2307b575k016J517J338O9p73l59J09a067b81q7r35j025L06h26A22K61j68b02j47
$$ -2575 -4591 -3074 -1736 -1667 -2440 -2799 -2690 -1067 -281 -368 -1303 -2328 -2022 -826 122 383 215 -202 -349
2288c49o4l42n12q88o77j72P92a046a27C68a7j327j663N97d37A170J232L97n03
$$ -349 -413 -755 -1267 -2155 -2832 -3004 -2212 -1046 -127 368 -17 -1344 -3007 -2410 -437 1170 2402 2799 2296
2269B296n37q28B60a60k53p03j044l14J071e99b36p5m97j201q97m32p77p42l71
$$ 2296 1759 931 260 -160 -413 -1116 -2160 -2474 -1403 -599 -236 -311 -808 -2009 -2906 -3338 -4115 -4857 -5228
2250e228K45N30M92J033J220e88D28N50K53k64D12b30o45n67m24K09N08A78J273
$$ -5228 -4983 -4453 -3961 -2928 -1708 -588 428 978 1231 967 412 -230 -875 -1442 -1866 -1657 -1149 178 1451
2231A451L27L5l62o03C30a64H9O20P01Q91M91P1o83I83i64j694q54J18J46qK63
$$ 1451 1778 1813 1451 848 330 -164 89 709 1410 2301 2792 2863 2180 983 -964 -2658 -3512 -3394 -3248 -3256 -2993
2210b993M78L56N00O28c68J00n03q08n61K38h27C75N52K42n9C03f18q59J64d06
$$ -2993 -2515 -2159 -1659 -1031 -368 -268 -771 -1579 -2140 -1902 -827 375 927 1169 1110 303 -618 -1477 -1313 -406
2189D16E2a182j272j110R97a224A07J644P98N41n6o5j14K9k12n41l70m17E39g68
$$ 416 52 -1182 -2454 -3564 -2567 -1224 107 1751 2549 3090 3034 2969 2855 2884 2672 2131 1761 1344 539 -768
2168b230o89g37A235J176K48m48j006f5j506j9B30J751M31N10O03k15q73A110
$$ -2230 -2919 -737 1235 2411 2659 2211 1205 -65 -1571 -1590 230 1981 2412 2922 3525 3310 2437 1110
2149b31p89l44l52k07O56f15a40j08n73j074j324r97j68Q46R10J034R8j9J78f68
$$ -231 -1020 -1364 -1716 -1923 -1267 -615 -140 -248 -821 -1895 -3219 -4216 -4384 -3538 -2628 -1594 -1496 -1515 -1337 -668
2128B38J126R77N67l0j375A86a330q88l38P9R07A49J239P97O96p13q66l3M91P88
$$ 238 1364 2341 2908 2878 1503 186 -1330 -2218 -2556 -2477 -1570 149 1388 2185 2881 2168 1302 1269 1760 2548
2108B548R19r0p94q86G32c41m81j6a91A98R9c60j539j329a575e75C38qa06m46
$$ 2548 3467 3377 2583 1697 732 -341 -822 -838 -191 198 297 -360 -1899 -3228 -1575 -575 338 330 -106 -552
2088e52l50k3k42b40C79O86N36K71o00E36d16j320l94J007K95K08p8qK50f8G48
$$ -552 -902 -925 -1167 -240 379 1065 1601 1872 1272 536 -416 -1736 -2130 -1123 -828 -620 -698 -706 -456 -68 748
2066A300N4j28j03qJ87l0n38b80n23L85F1J28b46r83j298j618a939i62N8m62o05
$$ 1300 1354 1226 1123 1115 1302 1272 734 -280 -803 -418 61 189 -246 -1229 -2527 -4145 -1939 -962 -904 -1366 -1971
2045a971p59n63O26K55M1n27m18q18R17J407a20A153O95Jn38m38B58b69k19k10
$$ -1971 -2730 -3293 -2667 -2412 -2371 -2898 -3316 -4134 -3217 -1810 -120 1153 1848 1849 1311 873 258 -269 -488 -698
2025f98K64D1N74M57P36M05o5o64o96a8o76p35o91o47m22k56j09O5L64P30N98
$$ -698 -434 41 615 1072 1808 2213 2148 1484 788 -18 -694 -1429 -2120 -2767 -3189 -3445 -3554 -3489 -3125 -2395 -1797
2004a797M47L86J46B12J260Q34Q31O71J368N16m07j553A498d52j312l61j10m38
$$ -1797 -1350 -964 -818 212 1472 2306 3137 3808 5176 5692 5285 3732 1498 -452 -1764 -2125 -2235 -2673
1986b673j53O23R04K89m83j84J0K32o61j041K46J303f97G0P18K40j78k13j64o5
$$ -2673 -2826 -2203 -1299 -1010 -1493 -1677 -1667 -1435 -2096 -3137 -2891 -1588 -697 70 788 1028 850 637 473 408
1966D08n4L42K24N77J466J908J781J766K80k88j392k194A773a147j012e85A538
$$ 408 354 696 920 1497 2963 4871 6652 8418 8698 8410 7018 4824 1773 -1147 -2159 -585 1538
1948B742J11q50D4b364j995j019J561J815d41G06Q80P13N33R11M33p0j063A186
$$ 2742 2853 2003 44 -2364 -4359 -5378 -3817 -2002 -441 706 1586 2299 2832 3743 4176 4106 3043 1186
1929a871k623J551J372e38A44N26M08k38g1j867r43J146A63J783J127Q15N98n62
$$ -1871 -4494 -2943 -1571 -538 144 670 1078 840 -71 -1938 -2881 -1735 163 1946 3073 3888 4486 3924
1911C924j768D28a386j740j206o00j00O69R17R69L74j74m55P47i16d13M0o94j262
$$ 3924 2156 428 -1386 -3126 -4332 -4932 -5032 -4363 -3446 -2477 -2103 -2277 -2732 -1985 -916 -413 -373 -1067 -2329
1892b329j87P56g63f7E31M45O26J924K372J422K26j599k140A318a681j005J107
$$ -2329 -2516 -1760 -763 -67 531 976 1602 3526 5898 7320 7546 5947 3807 1318 -1681 -2686 -1579
1875a579L16M07D12J600J102Qm58q39C31a235j080O34b93A304J146J52o21I30
$$ -1579 -1263 -856 412 2012 3114 3122 2664 1825 331 -1235 -2315 -1681 -293 1304 2450 2602 1981 930
1856a13k83A3J180J219J423O21l17o79k30n98m09N3m01q99c68j831n98a246C42
$$ -113 -396 13 1193 2412 3835 4456 4139 3460 3230 2632 2223 2276 1875 976 -368 -2199 -2797 -1246 342
1836A205m29f81j775j719J01Q45P42R03d94A21J541R82O09J84o84A298d23j122
$$ 1205 776 -681 -2456 -4175 -4074 -3229 -2487 -1584 -494 121 1662 2644 3253 3437 2753 1298 -423 -1545
1818a545N66a33E59q7A47N15Q52N46P43R9l02o10o61C26f81n58o27l56r0L90f07
$$ -1545 -979 -133 559 472 147 662 1514 2060 2803 2902 2600 1990 1329 326 -681 -1239 -1866 -2222 -2312 -1922 -607
1796I02J139J45r01C54a509k394j411N82J643a388B08P20J0C30J5J064K126J826
$$ 902 2041 2186 1285 354 -1509 -3903 -5314 -4732 -3089 -1388 208 928 938 330 345 1409 3535 5361
1778E361J146K94j071j081l90R09R89K27q16j916E97b073o59J234N92j41L36F93
$$ 5361 6507 6801 5730 4649 4259 5168 6157 6384 5568 3652 597 -2073 -2732 -1498 -906 -1047 -711 693
1759A802J71o13c23j276p14M88L21p3J15M45c14C49K6a51o65o45K22A55J579R35
$$ 1802 1973 1360 -323 -1599 -2313 -1825 -1504 -1577 -1462 -1017 -314 349 375 -151 -816 -1461 -1239 155 1734 2669
1739B669L41r91G62i19o73J83R9l98o36n60n50K65a346D29P57j68A43a333j154
$$ 2669 3010 2019 762 -919 -1592 -1409 -1310 -1708 -2344 -2904 -3454 -3189 -1346 429 1186 1018 143 -1333 -2487
1720b487l75P54h40b67F7L65K39O2k30j23J75J071J415P68K55l59q86q01q76B69
$$ -2487 -2862 -2108 -840 -267 67 432 671 733 503 380 555 1626 3041 3809 4064 3705 2819 2018 1142 269
1699i7j049j07L8d3A799J907J303K94j000j343A316d04p87e18F71R37J016O29
$$ -97 -1146 -1253 -1215 -43 1799 3706 5009 5303 4303 2960 1316 -404 -1191 -518 671 1608 2624 3253
1681C253k04k53l36n13l16K10O86K44o41G23a415j610J020g84a70m1n55m51n05
$$ 3253 3049 2796 2460 1947 1631 1841 2527 2771 2130 723 -1415 -3025 -2005 -784 -170 -211 -766 -1217 -1722
1662a722l89l98J164B22J076O76k8n53B07a164J94A443K222J033j283D36b757
$$ -1722 -2111 -2509 -1345 222 1298 1974 1946 1393 207 -1164 -970 1443 3665 4698 3415 436 -2757
1644a870D61N30h5k729J271A369J612K7j263b62k562a363E4N11J51O74J009R00
$$ -1870 461 991 -85 -2814 -1543 1369 2981 3008 1745 -262 -2824 -1363 54 565 716 1390 2399 3299
1626C299K19k63q20A098c06j424j042Q47b10I87P31J93p77c68j646o86j70O41
$$ 3299 3518 3255 2435 1098 -306 -1730 -2772 -1925 -210 987 1718 1911 1134 -368 -2014 -2700 -2870 -2229
1608b229Q30g9H91N6B67a493j734O69a269E2R70K11m37A93h21j001k59h08A57
$$ -2229 -1399 -79 891 947 267 -1493 -3227 -2558 -1269 52 1022 1233 796 193 -821 -1822 -2081 -808 157
1588C22b30j222j554R81a32A298K05E58i27j193j9i95d24l5j40j0g9A276J724
$$ 322 -230 -1452 -3006 -2025 -132 1298 1503 558 -927 -2120 -2139 -995 -424 -459 -599 -609 -79 1276 3000
1569C000J001J78n9o08q47A031A60J37K33Ii61q30L56a76A113P24J51n47D6a520
$$ 3000 4001 4179 4120 3512 2665 1031 160 297 530 9 -961 -1791 -1435 -176 1113 1837 1988 1441 46 -1520
1548b262R6K74i00I24K060J773R80m9p97j432j697B79b79n46m84j06b84A464J435
$$ -2262 -2166 -1892 -900 924 2984 4757 5737 5688 4891 3459 1762 279 -279 -825 -1309 -1415 -284 1464 2899
1529B899R99k79j371G22i54j115p28p74O60i51H55J118M67o61E50f55r09r05m47
$$ 2899 3898 3619 2248 722 -954 -2069 -2797 -3571 -2911 -951 855 1973 2440 1779 550 -655 -1564 -2469 -2916
1510b916N28g85F80M79A90a495j029K21h24A473J304L48r89D21d22A00P43j04
$$ -2916 -2388 -785 680 1159 190 -1495 -2524 -2303 -824 1473 2777 3125 2136 421 -422 100 843 739
1492G39k75J05J21L0j00A18i56j248j866J849C79J840O05L4n48j022D17b70p34
$$ 739 464 569 690 720 620 118 -956 -2204 -4070 -2221 379 2219 2824 2858 2310 1288 417 -270 -1004
1473a004j097j694j656J982J595P48n58j600j63B31L404K033M97q97k371C7b074
$$ -1004 -2101 -3795 -5451 -3469 -1874 -1126 -1684 -3284 -3447 231 3635 5668 6165 5268 2897 37 -2074
1455b798k39r67r25J7K47q3K63J273a513AR68R48O39K11l39k74k0J7r0j42p65
$$ -2798 -3037 -4004 -4929 -4912 -4665 -4748 -4485 -3212 -1513 1 969 1917 2556 2767 2428 2154 2134 2151 2061 1919 1154
1434A154f15k451j723K215e62F52L91J33qm14K56j44b63j511k045j287b545A95
$$ 1154 -615 -3066 -4789 -2574 -562 652 1043 1176 1168 754 1010 866 -263 -1774 -3819 -5106 -2545 195
1415A950J005j45r68D27h24j141n94N90b31A325J344N49J30J3n57q54H81f86j546
$$ 1950 2955 2810 1842 427 -824 -1965 -2559 -1969 -231 1325 2669 3218 3348 3361 2804 1950 881 -686 -2232
1396b232j250J289g25G4J36d49q43l36M04N29K70j16q75q30j660n11J773e58A381
$$ -2232 -3482 -2193 -725 74 210 -449 -1292 -1628 -1224 -695 -425 -541 -1416 -2246 -3906 -4417 -2644 -558 1381
1376C010J111P42q07A884a058k152b68B091J555P81m57r07j292F53E0h21j318
$$ 3010 4121 4863 4056 1884 -1058 -3210 -268 2091 3646 4427 3970 3063 1771 653 50 -821 -2139
1359b139j243J269b68A366J144L46o69p22J33J570J976J007j96r73j228r45l31
$$ -2139 -3382 -2113 -268 1366 2510 2856 2187 1465 1598 3168 5144 6151 5955 4982 3754 2809 2478
1342B478JN54N70p8j040A008f07p78L56d78J77C72J557J471J397J022p3m97l1
$$ 2478 2479 3033 3603 3525 2485 1008 -607 -1385 -1029 -478 -301 372 1929 3400 4797 5819 5746 5249 5218
1323E218n65o02q91r61k26L00K37K24j67n84H07g63j369j49K89j65j95K00M61
$$ 5218 4653 4051 3160 2199 1973 2273 2510 2734 2567 1983 807 -763 -2132 -2281 -1992 -2157 -2352 -2152 -1691
1304a691N4j20j04g11E70J030R10K2m68j011A73D3K47N74L22j5j27n04a6n22j913
$$ -1691 -1637 -1757 -1861 -711 570 1600 2510 2532 2064 1053 173 43 290 864 1186 1171 1044 540 -16 -538 -2451
1283b451j274Q6P76L13l98k58L67N09j78j97k33N16P96e68I7N31K96L39j2E54
$$ -2451 -3725 -3639 -2863 -2550 -2948 -3206 -2839 -2330 -2508 -2705 -2938 -2422 -1626 -568 97 628 924 1263 1251 554
1262f33j608j243l93L02K15m27j09O74J055d66A113R72M86r9p22n87m66P33Q61
$$ -633 -2241 -3484 -3877 -3575 -3360 -3787 -3896 -3222 -2167 -466 1113 2085 2571 2472 1750 1163 697 1430 2291
1243B291R80l22j07m58o69p63m09o2A71L2l8EN50O95O34K83j62n51n00n5R9J86
$$ 2291 3271 2949 2842 2384 1715 952 543 481 171 203 165 5 555 1250 1884 2167 2005 1454 954 899 998 1184
1221A184M10P04J106J791J445J013k99j073j693j766A229c89j483j043l21K16
$$ 1184 1594 2298 3404 5195 6640 7653 7354 6281 4588 2822 1229 -389 -1872 -2915 -3236 -3020
1205c020P54Q71M24m21k28N80b54G71N41j34A11a631j349J475B09J068M49j04
$$ -3020 -2266 -1395 -971 -1392 -1620 -1040 -254 771 1312 1178 111 -1631 -2980 -1505 209 1277 1726 1622
1187A622l55m9k48l42B27e82j202j036l10Q83a039L75Ln69r10m40J37r5L71M38
$$ 1622 1267 1218 970 628 227 -582 -1784 -2820 -3130 -2247 -1039 -664 -661 -1230 -2140 -2580 -2443 -2538 -2167 -1729
1167a729K22O09a67H20J444J147Q88M01J60r53j072A231e46n18C24J722O81k35
$$ -1729 -1507 -898 -167 820 2264 3411 4299 4700 4860 3907 2835 1231 -546 -1064 324 2046 2727 2492
1149B492n39n78E47A50L99J7M19Q62J056R42N82j51q38j220A016h17j452l74g04
$$ 2492 1953 1375 547 150 549 566 985 1847 2903 3845 4427 4276 3438 2218 1016 -817 -2269 -2643 -704
1129A955K091J438J97q71j618j282p67K50J011J269L64q74A468g80j419J49L31
$$ 1955 4046 5484 5681 4810 3192 1910 1143 1393 2404 3673 4037 3163 1468 -780 -2199 -2050 -1719
1112a719b69E86N99Q32P2l18H05c05j127j080P4i55H3N24L88K24J4E36g22j820
$$ -1719 -269 586 1185 2017 2089 1771 805 -305 -1432 -2512 -2438 -955 83 607 995 1219 1233 536 -722 -2542
1092b542Q03A178K341J497L43j271j520H86e65m94K36A8J350J128M50l26p73E09
$$ -2542 -1739 1178 3519 5016 5359 4088 2568 886 -565 -1059 -823 18 1368 2496 2946 2620 1847 509
1073f51o11q6K81B10J725K505K140J308L90o36j368k086B082bj955q09J112b95
$$ -651 -1262 -1348 -1067 210 1935 4440 6580 7888 8278 7642 6274 4188 2082 -2 -1957 -2766 -1654 -295
1054H44O72J31l52F19O0N95P32K72k15n44o94q6K71j21k35J14C72a80j028j649
$$ 844 1516 1647 1295 619 679 1274 2006 2278 2063 1519 825 739 1010 889 654 768 372 -180 -1208 -2857
1034b857m45i83A240J917J039L65n37j098p83n04k46l38R5M16P14N92K10n77H78
$$ -2857 -3302 -983 1240 3157 4196 4561 4024 2926 2143 1639 1393 1055 1150 1566 2280 2872 3082 2505 878
1014i06q90M80L40K06j62p83o41j145j265o7R20J609Q42e83a83D23J597J894J680
$$ -906 -1796 -1316 -976 -770 -932 -1715 -2356 -3501 -4766 -4833 -3913 -2304 -1462 -583 -183 423 2020 3914 5594
995E594J048o27j650k004G72c35o21k8p59j044K46a142e31m70n78L24a97A533
$$ 5594 6642 6015 4365 2361 772 -335 -956 -984 -1743 -2787 -2541 -1142 -531 -1001 -1579 -1255 -197 1533
976B654p1p59G55B21J79N88C58a002r80b99B369K123O55p72j287q54k62J77M22
$$ 2654 2583 1824 755 221 400 988 358 -1002 -1982 -299 2369 4492 5147 4375 3088 2234 1972 2149 2571
957B571k0n31G70f20k41G62N52K73n54B4d18N2C82O37m80e37o59o27j352M13g19
$$ 2571 2551 2020 770 -620 -861 762 1314 1587 1033 24 -418 -366 382 1019 539 -537 -1196 -1823 -3175 -2762 -719
935A092J461R49q3o10r32D69a165j879j480L10R54N91K99R7L17k4k98k66l11M67
$$ 1092 2553 3502 3419 2809 1877 469 -1165 -3044 -4524 -4214 -3260 -2669 -2370 -2273 -1956 -1980 -2278 -2544 -2855 -2388
915b388K95R03c67B81J107J344K118K340J272L37q35k163k375E73b022n74J146
$$ -2388 -2093 -1190 -367 281 1388 2732 4850 7190 8462 8799 7964 5801 3426 573 -2022 -2596 -1450
898a450e53K58p53j272p33a045G43R28Q9m45C41g65j419q06L39P06Q63a8I38N96
$$ -1450 -553 -295 -1048 -2320 -3053 -1045 743 1671 1760 1315 341 -765 -2184 -2990 -2651 -1945 -1082 -18 938 1534
878A534q0F85d14r56k49O11d5G52R41P39P33P27M98M46l33q00r82A311D4a251
$$ 1534 1454 685 -414 -1370 -1619 -1008 -45 752 1693 2432 3165 3892 4390 4836 4503 3703 2721 1311 44 -1251
857a998o4L8j06P9J46Q34c91D64N51l23d27j799o99J247g10k43j718k178J351
$$ -1998 -2062 -2024 -2130 -2051 -1905 -1071 -391 464 1015 692 -427 -2226 -2925 -1678 -710 -953 -2671 -4849 -3498
838c498i92I35O13nj09N45J451J044N56R8o14q69l04p51Q9P72N33mp49j172E78
$$ -3498 -992 935 1548 1543 1434 1979 3430 4474 5030 5128 4514 3645 3341 2590 2679 3451 3984 3980 3231 2059 578
816e71q44k68k98J29O88c70E10O12L32k89k78j97k20e9j041n24k89j74q55j111
$$ -571 -1415 -1683 -1981 -1852 -1164 -370 510 1122 1454 1165 887 690 470 -59 -1100 -1624 -1913 -2087 -2942 -4053
796d053J239d90A876J792R28L98N7J88L42K24J10n25j176j275A336a83n08A96
$$ -4053 -2814 -490 1876 3668 4596 4994 5051 5239 5581 5805 5915 5390 4214 2939 1336 -183 -691 196
777I66M61j85D35g9D36J126Q73L76O0p77p40E05a42m83Lb82@b99p61p44m79l8
$$ 966 1427 1242 435 -79 436 1562 2435 2811 2871 2094 1354 505 -142 -625 -622 -282 0 -299 -1060 -1804 -2283 -2321
755b321K75P78d50B63J03k4A62JP8J003J468J411J292L83n32j122j343j103n28
$$ -2321 -2046 -1268 -450 263 366 342 162 163 241 1244 2712 4123 5415 5798 5266 4144 2801 1698 1170
736A170k04k81j08J94Q6K24K52J03M5j45n52A37h90o94n76n69j16M2Q73N28k89
$$ 1170 966 685 577 771 857 1081 1333 1436 1481 1336 784 137 -890 -1584 -2160 -2729 -2845 -2803 -1930 -1402 -1691
715a691n92j159m26a880H94K469K071K66n39j249j864B9a872j355P4Q11K24m06
$$ -1691 -2283 -3442 -3868 -1880 894 3363 5434 5700 5161 3912 2048 29 -1872 -3227 -3153 -2342 -2118 -2524
697b524o70N26i50E36J321R13O65K07l99n53o77q44i9j096n91J27L59j53q49p12
$$ -2524 -3194 -2668 -950 536 1857 2770 3435 3642 3243 2690 2013 1169 -99 -1195 -1786 -1659 -1300 -1453 -2302 -3014
677c014R44b83A034Q22m04A24b035j820P03R44O63M44L42K16Q4l09r18r84n13
$$ -3014 -2070 -283 1034 1856 1452 124 -2035 -3855 -3152 -2208 -1545 -1101 -759 -543 -459 -768 -1686 -2670 -3183
658c183N59O76K74p78j002J007a120b80qn90j214j006J55P95K00l58q95p29J668
$$ -3183 -2624 -1948 -1674 -2452 -3454 -2447 -1120 -280 -288 -878 -2092 -3098 -2943 -2148 -1948 -2306 -3201 -3930 -2262
639b262Q98J91l3J33K81f3A090J060P20p7j232a21j600j320k57N83J090M10l78
$$ -2262 -1364 -1173 -1206 -1073 -792 -63 1090 2150 2870 2793 1561 -121 -1721 -3041 -3298 -2715 -1625 -1215 -1593
620a593j117j095o41l36O8J421a381I6J244L23q08d75q78J90e35J86j88J0m15
$$ -1593 -2710 -3805 -4446 -4782 -4714 -3293 -1381 96 1340 1663 855 -475 -1353 -1163 -535 -349 -537 -527 -942
601i42n13j11N67M82o76j368m67R78g75L51p96j491q35Q96Q97m05k63Q16c29G1
$$ -942 -1455 -1566 -999 -517 -1193 -2561 -3028 -2050 -775 -424 -1220 -2711 -3546 -2650 -1753 -2158 -2421 -1605 -329 71
580g39k054p27J632a26A231K81j19a9o52C86K101J873P26q17j887b1k727j544
$$ -739 -2793 -3520 -1888 -126 1231 1512 1393 -19 -671 386 2487 4360 5086 4269 2382 -21 -2748 -4292
562d292J446O41Ro85j227K77J599d99D76K22B0i30j284l91J007B83J088J57E20
$$ -4292 -2846 -2205 -2196 -2881 -4108 -3831 -2232 -499 476 698 20 -930 -2214 -2605 -1598 283 1371 1528 520
542b102j021J114f78e2q24j324o21P00h73H4R07Q45J59p94f96p55C84K914J574
$$ -2102 -3123 -2009 -678 -52 -876 -2200 -2821 -2121 -873 84 991 1836 1995 1201 -696 -1451 384 3298 4872
523D872j07j518A270a104r24f27E86j69o9L15K04N43p8n39l20J074J523J209O5
$$ 4872 4765 3247 1270 -1104 -2028 -627 586 417 348 663 867 1410 1332 793 473 1547 3070 4279 4344
504D344j323I96a079n93d79H43L31C74g59p1L51j61q82n8f00B69L65d67j988m31
$$ 4344 3021 996 -1079 -1672 -479 843 1174 374 -759 -830 -479 -640 -1522 -1580 -600 269 634 -467 -2455 -2886
484b886f88I84Q98j06m23L51K019K776J516p24k069B509a25k215n89J391D67J869
$$ -2886 -688 984 1882 1776 1353 1704 3723 6499 8015 7291 5222 2509 -125 -2340 -2929 -1538 467 2336
466B336J236R60m78j669C42b064Ja12A875Q23l10r78e86j758P47N38L56m57j321
$$ 2336 3572 4532 4054 2385 342 -2064 -2063 -112 1875 2698 2388 1410 -586 -2344 -1597 -1059 -703 -1160 -2481
447b481j471J282g59A948K489J643o56j64r00m02n17j019q08o33m58j30J92J77
$$ -2481 -3952 -2670 -759 1948 4437 6080 5424 5260 4360 3958 3441 2422 1614 981 523 393 585 762
429G62o1k99A67b04n43p22m76n59M22i70D01J476J304K64m4o94j243d0n26G82
$$ 762 701 402 167 -204 -747 -1469 -1945 -2504 -2082 -970 401 1877 3181 3445 3401 2707 1464 -40 -566 782
408B725J634P15K91k38r42B025h23n46A344K076P67r60n37j155f91j923a249j79
$$ 2725 4359 5074 5365 5127 4185 2025 -823 -1369 1344 3420 4187 3227 2690 1535 -691 -2614 -1249 -1428
390a428j115j093M26O19P14M60l15k85l16O17g11B08M73m9a8j172j188j85J260
$$ -1428 -2543 -3636 -3210 -2591 -1877 -1417 -1732 -2017 -2333 -1716 -711 208 681 632 -18 -1190 -2378 -2563 -1303
371a303D76J948J493P87m08j208A359c68j235P90H68J52A7a247K30G46J533P73
$$ -1303 476 2424 3917 4704 4296 3088 1359 -368 -1603 -813 868 1020 17 -1247 -1017 746 2279 3052
353C052J68m32n30j42P90M30J9j220b98k312j619a801G08K094J196n5o1L5M81
$$ 3052 3220 2788 2258 2116 2906 3336 3355 2135 -298 -2610 -4229 -1801 708 2802 3998 3943 3882 3917 4398
334D398O89p56j274j112E29a083j028q13l41L7K24O86O51J75k30n54m46i71A113
$$ 4398 5087 4331 3057 1945 529 -1083 -2111 -2924 -3265 -3228 -3004 -2318 -1667 -1492 -1722 -2276 -2722 -971 1113
314B602M77l52p74k81J22M63K04n29n31M50J389K081J691O30r88k287A498a107
$$ 2602 3079 2727 1953 1672 1794 2257 2461 1932 1401 1851 3240 5321 7012 7642 6654 4367 1498 -1107
295b936k53M98K38k55o46J79h47B011K827K706K244J216O32m1m56p59j395j809
$$ -2936 -3189 -2691 -2453 -2708 -3354 -3175 -847 2011 4838 7544 9788 11004 11636 11595 11139 10380 8985 7176
277G176k464k113F96h30r47n38k5Q22f64%o03j22b60A548J326K92o56j035E14
$$ 7176 4712 2599 696 -830 -1777 -2315 -2340 -1518 -664 -664 -1267 -1389 -260 1548 2874 3166 2510 1475 514
257c01d1I92J228J021R5j038E60a091p74g79H74J608O41k53j041F2a206o46K24
$$ -301 -41 992 2220 3241 3336 2298 560 -1091 -1865 -779 874 2482 3123 2870 1829 62 -1206 -1852 -1628
238a628O49C55J772K334K808K393K238J345n40j995l302C390b08j839O51M87m58
$$ -1628 -979 355 2127 4461 7269 9662 11900 13245 12705 10710 7408 3390 -208 -2047 -1396 -909 -1367
221a367r15k11P24P48a37D32k07g53j664j226l67q5J99P41N20k77m86J282F4K006
$$ -1367 -2282 -2493 -1769 -1021 -137 432 225 -753 -2417 -3643 -4010 -4095 -3896 -3155 -2635 -2912 -3398 -2116 64 2070
201B070J378Q79p27A696a175j035C73L108L149J406r78k719F35b816j513N66l27
$$ 2070 3448 4327 3600 1696 -1175 -2210 373 3481 6630 8036 7058 4339 635 -2816 -4329 -3763 -4090
184d090M85a122a28A031l5C90G1K02M63j08A06i82o70l52j00K09P23j22j60l29
$$ -4090 -3605 -1122 -128 1031 996 390 71 273 736 628 106 -982 -1652 -2004 -2104 -1895 -1172 -1294 -1454 -1783
164a783m98K6k29m38J111B27J497J072P69m22A568g8q78P4J28n32r16k47R02g50
$$ -1783 -2281 -2255 -2484 -2922 -1811 227 1724 2796 3565 3143 1568 -78 -956 -882 -754 -1286 -2202 -2449 -1547 -750
143f19O8o7K22E8P00R90R89N7n50o07o62l13O01J321J364J289M81m08j612A493
$$ -619 -551 -618 -396 58 758 1748 2737 2794 2244 1637 975 662 1263 2584 3948 5237 5718 5310 3698 1493
122b7A383J925J110l74j390G70a030o19f10G29P61L30M3R7J0M82L24K86k93l60
$$ -27 1383 3308 4418 4044 2654 770 -1030 -1649 -610 729 1490 1820 1863 1960 1970 2452 2776 3062 2769 2409
102B409p6n6k40G63a624j623f48I75L12p3L90R10L17o64p07J032K423J314p34
$$ 2409 2333 2277 2037 763 -1624 -3247 -648 975 1287 1214 1604 2514 2831 2167 1460 2492 4915 6229 5495
83E495k216D30a502j55l91n26c69A329O08F96a115N46A822J760j07r44H51d84
$$ 5495 3279 430 -1502 -1657 -2048 -2574 -369 1329 1937 696 -1115 -569 1822 3582 3475 2531 851 -484
64a041p04K11M46j56r58j069j69a560f98p13j010J114M72l90L04A173K860J140
$$ -1041 -1745 -1534 -1088 -1244 -2202 -3271 -3440 -1560 -698 -1411 -2421 -1307 -835 -1225 -921 1173 4033 5173
46E173m82A845a013j901a199H66J234P93M40K27k24o74q85o69D10j18j44c01r49
$$ 5173 4691 1845 -1013 -2914 -1199 866 2100 2893 3333 3560 3336 2662 1777 1108 410 292 148 -301 -1250
27a250n06P53a79D01M83O48N39j70o80d7m24J22i7m78j292j399LL92m38J04J120
$$ -1250 -1756 -1003 -179 401 884 1532 2071 1901 1221 -47 -471 -349 -97 -575 -1867 -3266 -3263 -2871 -3309 -3205 -2085
6b085K65q8P07B5J025R30
$$ -2085 -1820 -1908 -1201 25 1050 1980
0A980
$$ 1980
##PAGE= F1=-0.101556585365
##FIRST=     25.9928259484165, 8223.18227667557, 2907
##DATA TABLE= (F2++(Y..Y)), PROFILE
16383B907P00M89j04p34r86p9Q12J041P27m06j783A12a047D02K219Q27q67H96
$$ 2907 3607 4096 3992 3258 2272 2193 3005 4046 4773 4367 2584 112 -1047 402 2621 3448 2581 896
$$ [...]