
##TITLE=AC1405_GUAAH12214_7652929_W1vMAXHEe5
##JCAMPDX= 6.0         $$ Bruker NMR JCAMP-DX V2.0
##DATA TYPE= NMR SPECTRUM
##DATA CLASS= NTUPLES
##ORIGIN= BRUKER
##OWNER= Administrator
$$ 1.72 TOPSPIN		Version 2.1
$$ 2013-03-19 22:40:00.364 -0500  Administrator@X
$$ Compression mode = diff/dup
##.OBSERVE FREQUENCY= 400.02188249412
##.OBSERVE NUCLEUS= ^1H
##.ACQUISITION MODE= SIMULTANEOUS (DQD)
##.ACQUISITION SCHEME= undefined
##.AVERAGES= 8
##.DIGITISER RES= 22
##SPECTROMETER/DATA SYSTEM= spect
##.PULSE SEQUENCE= zg30
##.SOLVENT NAME= COFFEE_meoh
##.SHIFT REFERENCE= INTERNAL, COFFEE_meoh, 1, 14.98509
##AUDIT TRAIL= $$ (NUMBER, WHEN, WHO, WHERE, PROCESS, VERSION, WHAT)
$$ ##TITLE= Audit trail, TOPSPIN		Version 2.1
$$ ##JCAMPDX= 5.01
$$ ##ORIGIN= Bruker BioSpin GmbH
$$ ##OWNER= Administrator
$$ $$ E:\/data/COFFEE/nmr/AC1405_GUAAH12214_7652929_W1vMAXHEe5/10/pdata/1/auditp.txt
$$ ##AUDIT TRAIL=  $$ (NUMBER, WHEN, WHO, WHERE, PROCESS, VERSION, WHAT)
(   1,<2013-03-19 22:39:52.177 -0500>,<Administrator>,<X>,<go>,<TOPSPIN 2.1>,
      <created by zg
	started at 2013-03-19 22:38:46.098 -0500,
	POWCHK enabled, PULCHK disabled,
       configuration hash MD5:
       86 BA 57 50 F2 9D 5C 9B 26 00 A9 28 5F 66 2E 89
       data hash MD5: 64K
       D5 34 D1 25 3B FA D3 FE B0 59 2F 41 2B 6F 35 20>)
(   2,<2013-03-19 22:39:55.255 -0500>,<Administrator>,<X>,<proc1d>,<TOPSPIN 2.1>,
      <Start of raw data processing
       efp LB = 0 FT_mod = 6 PKNL = 1 PHC0 = 0 PHC1 = 0 SI = 32K 
       data hash MD5: 32K
       B0 4F 74 3B ED 19 59 3A 49 F5 FF F3 3A EC E2 A4>)
(   3,<2013-03-19 22:39:55.708 -0500>,<Administrator>,<X>,<proc1d>,<TOPSPIN 2.1>,
      <pk PHC0 = 103.1067 PHC1 = 0 
       data hash MD5: 32K
       D6 EA 48 8B 28 BD 30 FB 51 44 6F 45 A3 9E 4C 0B>)
(   4,<2013-03-19 22:39:55.942 -0500>,<Administrator>,<X>,<proc1d>,<TOPSPIN 2.1>,
      <abs ABSG = 1 
       data hash MD5: 32K
       98 F2 D8 36 C1 4A 2B 95 44 57 F9 CD 1A F5 05 CF>)
(   5,<2013-03-19 22:39:56.098 -0500>,<Administrator>,<X>,<proc1d>,<TOPSPIN 2.1>,
      <abs ABSG = 2 
       data hash MD5: 32K
       32 BA B1 FE B8 DF 9B 7B 3A C5 17 1E F4 1E 07 39>)
(   6,<2013-03-19 22:39:56.239 -0500>,<Administrator>,<X>,<proc1d>,<TOPSPIN 2.1>,
      <abs ABSG = 3 
       data hash MD5: 32K
       7C 21 B5 76 CD 2E EF D6 FD 1A 30 6B D2 8E 7C 6E>)
(   7,<2013-03-19 22:39:56.380 -0500>,<Administrator>,<X>,<proc1d>,<TOPSPIN 2.1>,
      <abs ABSG = 4 
       data hash MD5: 32K
       A4 A9 7F 83 B3 7E 7D 71 43 25 85 8C 8A 23 27 1B>)
(   8,<2013-03-19 22:39:56.536 -0500>,<Administrator>,<X>,<proc1d>,<TOPSPIN 2.1>,
      <abs ABSG = 5 
       data hash MD5: 32K
       08 70 7F 78 74 B3 36 D7 30 A9 49 D1 35 C0 DF 88>)
$$ ##END=
$$ 
$$ $$ hash MD5
$$ $$ F7 9E E2 22 B2 30 14 CD 84 44 81 BA 94 BE E9 B3
##$RELAX= 
##$RELAX= 
##$RELAX= 
##$RELAX= 
##$RELAX= 
##$RELAX= 
##$RELAX= 
$$ Bruker specific parameters
$$ --------------------------
##$DU= <E:\>
##$EXPNO= 10
##$NAME= <AC1405_GUAAH12214_7652929_W1vMAXHEe5>
$$ [...]
150 150 150 150 150 150 150 150
##$TP07= 0
##$TPNAME0= <>
##$TPNAME1= <>
##$TPNAME2= <>
##$TPNAME3= <>
##$TPNAME4= <>
##$TPNAME5= <>
##$TPNAME6= <>
##$TPNAME7= <>
##$TPOAL= (0..7)
0.5 0.5 0.5 0.5 0.5 0.5 0.5 0.5
##$TPOFFS= (0..7)
0 0 0 0 0 0 0 0
##$TUNHIN= 0
##$TUNHOUT= 0
##$TUNXOUT= 0
##$USERA1= <user>
##$USERA2= <user>
##$USERA3= <user>
##$USERA4= <user>
##$USERA5= <user>
##$V9= 5
##$VALIST= <valist>
##$VCLIST= <CCCCCCCCCCCCCCC>
##$VD= 0
##$VDLIST= <DDDDDDDDDDDDDDD>
##$VPLIST= <PPPPPPPPPPPPPPP>
##$VTLIST= <TTTTTTTTTTTTTTT>
##$WBST= 2048
##$WBSW= 25
##$XGAIN= (0..3)
0 0 0 0
##$XL= 0
##$YL= 0
##$YMAX_a= 625914
##$YMIN_a= -535300
##$ZGOPTNS= <>
##$ZL1= 120
##$ZL2= 120
##$ZL3= 120
##$ZL4= 120
##$ABSF1= 14.98509
##$ABSF2= -5.573092
##$ABSG= 5
##$ABSL= 3
##$ALPHA= 0
##$AQORDER= 0
##$ASSFAC= 0
##$ASSFACI= 0
##$ASSFACX= 0
##$ASSWID= 0
##$AUNMP= <proc_prof1d_extract_pilot.lims>
##$AXLEFT= 0
##$AXNAME= <>
##$AXNUC= <1H>
##$AXRIGHT= 0
##$AXTYPE= 0
##$AXUNIT= <>
##$AZFE= 0.1
##$AZFW= 0.1
##$BCFW= 0
##$BC_mod= 0
##$BYTORDP= 0
##$COROFFS= 0
##$CY= 15
##$DATMOD= 1
##$DC= 0
##$DFILT= <>
##$DTYPP= 0
##$F1P= 0
##$F2P= 0
##$FCOR= 0.5
##$FTSIZE= 32768
##$FT_mod= 6
##$GAMMA= 0
##$GB= 0
##$INTBC= 1
##$INTSCL= 1
##$ISEN= 128
##$LB= 0
##$LEV0= 0
##$LPBIN= 0
##$MAXI= 10000
##$MC2= 0
##$MEAN= 0
##$ME_mod= 0
##$MI= 0
##$NCOEF= 0
##$NC_proc= -8
##$NLEV= 6
##$NOISF1= 0
##$NOISF2= 0
##$NSP= 0
##$NTH_PI= 0
##$NZP= 0
##$OFFSET= 14.98509
##$PC= 1
##$PHC0= 103.1067
##$PHC1= 0
##$PH_mod= 1
##$PKNL= yes
##$PPARMOD= 0
##$PPDIAG= 0
##$PPIPTYP= 0
##$PPMPNUM= 2147483647
##$PPRESOL= 1
##$PSCAL= 4
##$PSIGN= 0
##$PYNMP= <proc.py>
##$REVERSE= no
##$SF= 400.02
##$SI= 32768
##$SIGF1= 0
##$SIGF2= 0
##$SINO= 400
##$SIOLD= 32768
##$SPECTYP= <>
##$SREGLST= <1H.CDCl3>
##$SSB= 0
##$STSI= 32768
##$STSR= 0
##$SW_p= 8223.68421052631
##$SYMM= 0
##$S_DEV= 0
##$TDeff= 65536
##$TDoff= 0
##$TI= <>
##$TILT= no
##$TM1= 0
##$TM2= 0
##$TOPLEV= 0
##$USERP1= <user>
##$USERP2= <user>
##$USERP3= <user>
##$USERP4= <user>
##$USERP5= <user>
##$WDW= 1
##$XDIM= 32768
##$YMAX_p= 436281898
##$YMIN_p= -662193
##$CURPLOT= <Network HP LaserJet P1505>
##$CURPRIN= <$Network HP LaserJet P1505>
##$DFORMAT= <normdp>
##$LAYOUT= <+/1D_H.xwp>
##$LFORMAT= <normlp>
##$PFORMAT= <normpl>
##$SURQMSG= 1
$$ End of Bruker specific parameters
$$ ---------------------------------
##NTUPLES= NMR SPECTRUM
##VAR_NAME=  FREQUENCY,     SPECTRUM/REAL,   SPECTRUM/IMAG
##SYMBOL=    X,             R,               I
##VAR_TYPE=  INDEPENDENT,   DEPENDENT,       DEPENDENT
##VAR_FORM=  AFFN,          ASDF,            ASDF
##VAR_DIM=   32768,         32768,           32768
##UNITS=     HZ,            ARBITRARY UNITS, ARBITRARY UNITS
##FACTOR=    0.250966925370066, 1,           1
##FIRST=     8223.43324360094, 65160,        -291210
##LAST=      0,             204703,          76539
##MIN=       0,             -662193,         0
##MAX=       8223.43324360094, 436281898,    0
$$ Real data points
##PAGE= N=1
##DATA TABLE= (X++(R..R)), XYDATA
$$ [...]
$$ plain form
29191 -83332 382165 212821 52809 112022 358288 44600 339203 229203 153045 -22100 169865
29179 420356 40562 138110 -3063 -34187 128644 32079 -145746 208529 -89289 104019 -331174
29167 108028 -414253 -6456 126770 86725 259178 21620 -151604 -4974 247003 100531 148522
29156 148522 77947 -93072 -130434 95985 45984 107979 157776 421317 281878 236375 -184161
29144 -10855 -56800 11145 -209523 116605 160788 264620 1500 108136 -26535 -478567 334584
29132 -96567 15747 -111960 -122537 195194 -11270 55680 180608 -2908 -245417 -88327 190618
29120 202978 -106078 -64459 222941 -133907 63130 259639 315488 22067 -44711 -29958 48662
29108 -43953 47225 -132632 1886 -18972 -4807 34235 -35741 76530 -85558 103566 -16934 120943
$$ packed form
29191h3332C82165j69344E2809N9213K46266D4600K94603j10000p6158b2100A69865
29179D20356D0562R7548c063l1124A28644C2079a45746B08529h9289A04019c31174
29167A08028d14253f456A26770m0045J72453B1620a51604d974B47003A00531M7991
29156A48522p0575i3072l7362I5985D5984O1995M9797K63541j39439m5503a84161
29144a0855m5945A1145b09523A16605M4183J03832A500J06636b6535m52032C34584
29132i6567A5747a11960j0577A95194a1270E5680J24928b908k42509h8327A90618
29120B02978a06078M1619B22941a33907F3130J96509N5849B2067d4711J4753D8662
29108d3953D7225a32632A886a8972d807C4235c5741G6530h5558A03566a6934A20943
$$ plain form
29095 108135 209813 -57668 -30184 -44845 157744 177396 175386 -236497 -10057 -128924 255886
29083 161239 75480 -36381 -197897 390603 -1086 187935 -120290 -97762 336637 -249728
29072 -108786 -50759 63514 31370 60965 39719 182239 -52172 -12304 -69324 -331605 55007
29060 -62503 347405 -240232 -34543 187429 86653 239366 -132811 206798 -86932 -35240
29049 337152 380230 91121 233831 168446 -66963 -227245 -152429 -70640 81933 -15419 44223
29037 134079 254677 -59661 214109 -287971 109894 230202 87499 91555 49224 -102102
29026 165861 -90897 -115392 -7300 29742 -103690 11944 282230 7382 -160159 43138 336079
29015 336079 -73601 3371 254399 305464 -71076 215162 85344 187675 -182299 62520 102157
$$ packed form
29095A08135J01678e7668K7484j4661A57744J9652k010b36497a0057j18867B55886
29083A61239G5480c6381j61516C90603a086A87935a20290K2528C36637b49728
29072a08786e0759F3514C1370K9595k1246J42520e2172a2304n7020k62281E5007
29060f2503C47405b40232c4543A87429H6653J52713a32811B06798h6932c5240
29049C37152M3078I1121J42710o5385f6963j60282P4816g0640H1933a5419D4223
29037A34079J20598e9661B14109b87971A09894J20308H7499M056m2331a02102
29026A65861i0897k4495g300B9742a03690A1944K70286G382a60159D3138K92941
29015C36079g3601C371K51028N1065g1076B15162H5344J02331a82299F2520L9637
$$ plain form
29004 102157 130644 367183 94795 -89763 258693 -272722 149735 23772 -380984 420301
28993 123729 -200 20396 -129629 220419 479073 30218 -37206 148579 105579 80854 129920
28982 129920 -124408 -170614 -76747 109027 -181042 -70499 95208 81465 48635 102433 -128528
28970 -112148 -339102 -119694 226076 211673 -9208 -68211 339487 -83223 93469 178484 220847
28959 220847 88961 132848 -55093 -9237 -188531 -6040 157467 158828 -12350 54135 99833 256531
28947 256531 338874 138517 -86997 -183054 144579 -88623 107737 38116 294960 205074 74362
28935 75720 -19078 189030 214706 47104 227075 228930 182073 -36603 53179 54236 -184975
28923 -98918 38585 -202352 177750 292461 162877 -22206 -178988 47035 78684 324433
$$ packed form
29004A02157K8487K36539I4795h9763B58693b72722A49735B3772c80984D20301
28993A23729b00B0396a29629B20419K58654C0218c7206A48579m3000k4725M9066
28982A29920a24408m6206g6747A09027a81042g0499I5208j3743l2830N3798a28528
28970a12148k26954a19694B26076j4403i208n9003C39487h3223I3469Q5015M2363
28959B20847H8961M3887e5093i237j79294f040A57467J361a2350E4135M5698J56698
28947B56531Q2343A38517h6997r6057A44579h8623A07737C8116K56844q9886G4362
28935G5720a9078A89030K5676D7104J79971J855m6857c6603E3179J057a84975
28923i8918C8585b02352A77750J14711j29584b2206j56782D7035L1649K45749
$$ plain form
28913 324433 150629 -65910 -142718 -149070 -85079 121807 346441 -2784 -68385 -365895 92111
28901 129920 68501 209174 353442 10519 61018 189381 -12527 312028 -52349 -68635 -206719
28890 -206719 -128888 -12837 77212 230029 -160766 30649 15120 -279740 -128743 -168497 100474
28878 156091 13511 321967 -103839 117354 320164 269984 -99286 -124507 -86574 203801
28867 40438 -135130 135439 -98338 -137187 -132474 -9388 -24459 -161807 74999 -390700 -118557
28855 46078 -14039 158629 59796 124889 54080 -29958 -57869 -150719 51966 112071 -178808
28843 166055 -16659 182415 34502 69377 197371 -13112 186770 19284 -61920 -48717 -108137
28832 -108137 62223 -154118 -63782 -193421 -55553 -297510 -17586 -135279 -106100 27969 -267514
$$ packed form
28913C24433A50629f5910p6808o352O3991A21807K24634b784o5601k97510I2111
28901A29920o1419J40673J44268A0519N0499J28363a2527C12028e2349j6286j38084
28890b06719P7831a2837G7212J52817a60766C0649A5120b79740a28743l9754A00474
28878A56091A3511L08456a03839A17354K02810n0180i9286k5221L7933B03801
28867D0438a35130A35439i8338l8849M713i388j5071j37348G4999c90700a18557
28855D6078a4039A58629E9796O5093E4080b9958k7911r2850E1966O0105a78808
28843A66055a6659A82415C4502L4875J27994a3112A86770A9284f1920J3203n9420
28832a08137F2223a54118f3782j29639e5553k41957a7586j17693K9179B7969b67514
$$ plain form
28820 114679 111481 -186526 -45500 18006 -48214 -57254 -24243 185895 -112237 249380 10212
28808 -73277 198454 94872 16348 384648 91290 169400 81627 109308 491838 16115 16561
28797 16561 -71296 -68538 308680 147270 -78630 49605 -90886 236537 -3484 -31198 167387
28785 -361410 145496 -192730 -130644 -69246 25372 78115 78512 94207 -97346 320588 206750
28774 206750 -9372 5886 -155529 135496 -65713 6838 -208813 146392 80535 -18968 -72569
28763 -72569 -197955 -92895 -111197 42691 162427 -15172 -14487 -221365 209066 -242587 122750
28751 144014 -177335 367988 -163100 -13437 -73736 -98952 -55910 99113 250133 3214 292450
28740 292450 165219 -38113 36628 -254134 181789 150182 200754 67426 263331 -161606
$$ packed form
28820A14679l198a86526d5500A8006d8214r040b4243A85895a12237B49380A0212
28808g3277A98454I4872A6348L68300I1290P8110H1627K7681L82530A6115M46
28797A6561g1296K758C08680A47270g8630D9605i0886B36537c484k7714A67387
28785c61410A45496a92730O2086O1398B5372N2743L97J5695i7346C20588j13838
28774B06750i372E886a55529A35496f5713F838b08813A46392o5857a8968n3601
28763g2569j25386i2895j8302D2691J19736a5172O85k06878B09066b42587A22750
28751A44014a77335C67988a63100a3437o0299k5216M3042I9113J51020C214K89236
28740B92450j27231c8113C6628b54134A81789l1607N0572F7426J95905a61606
$$ plain form
28729 1815 -301000 -329352 337702 -346013 181379 188931 -479610 -535215 112892 -142083 116642
28717 -193405 51182 -84548 110193 130294 -104790 113536 218227 -91476 -21828 -454501
28707 -454501 -200146 -255310 -131001 206231 -148649 86492 308799 -47142 184606 -151219
28696 -85129 -1284 181404 46326 121641 334525 181581 -116482 312630 159376 251580 -11494
28684 -1497 -189919 75452 240047 -30150 83133 219886 217067 -157334 188374 -89492 -266321
28673 -266321 213147 145983 76688 -98190 -224109 -22122 69723 132120 5820 99600 -94042
28661 199160 -64271 -136365 149010 170484 -38560 64058 16811 -60411 132789 -101729 33629
28649 241976 163225 -57817 209770 229233 -257962 -69824 255756 250652 247975 -57090 -225685
$$ packed form
28729A815c01000k8352C37702c46013A81379P552d79610n5605A12892a42083A16642
28717a93405E1182h4548A10193K0101a04790A13536J04691i1476b1828m32673
28707d54501b00146n5164J24309B06231a48649H6492K22307d7142A84606a51219
28696h5129a284A81404D6326P5315K12884j52944a16482C12630j53254R2204a1494
28684a497j88422G5452J64595c0150H3133J36753k819a57334A88374h9492j76829
28673b66321B13147o7164o9295i8190j25919b2122F9723O2397E820R3780i4042
28661A99160f4271p2094A49010K1474c8560F4058A6811f0411A32789a01729C3629
28649B41976p8751e7817B09770J9463b57962f9824B55756n104k677e7090j68595
$$ plain form
28638 -225685 -264032 111018 114871 32978 393641 -41514 143493 325126 83832 -44756 -221679
28627 -221679 -159041 -9741 -93212 98895 -290438 -144850 138984 215856 -47831 161893 298569
28616 298569 -230458 393333 -35344 49196 18551 349477 -172680 -1829 6255 -287621 -56577
28604 21760 -226247 12558 99163 -142356 -9284 -1014 -10258 -126515 182409 375146 128447
28592 136273 -30963 -24430 -148972 37614 275771 54500 -98176 175863 -247250 2656 452077
28581 452077 126763 200080 72319 -111255 -61492 -217436 123843 -183862 -36507 176518
28570 -14419 203929 50447 -125094 72132 232472 -140999 -433697 275682 119001 87485
28560 87485 -138394 -39261 53664 -458237 60903 211651 230604 111828 -88540 293655 255254
$$ packed form
28638b25685l8347A11018L853C2978L60663d1514A43493J81633H3832d4756j76923
28627b21679O2638i741q3471I8895b90438a44850A38984P6872d7831A61893J36676
28616B98569b30458C93333c5344D9196A8551L30926a72680a829F255b87621e6577
28604B1760b26247A2558Q6605a42356i284a014r244j16257A82409J92737A28447
28592A36273c0963O533j24542C7614K38157E4500i8176A75863b47250B656M49421
28581D52077A26763P3317G2319a11255M9763j55944A23843a83862c6507A76518
28570a4419B03929E0447a25094G2132J60340a40999k92698B75682A19001l1516
28560H7485a38394c9261E3664d58237F0903J50748J8953A11828h8540B93655l8401
$$ plain form
28549 255254 244177 93249 143385 68096 -179810 199805 111232 -156289 -90852 -73734 201012
28537 158755 -239987 42001 -117801 -118084 60163 233091 280078 148005 53820 -169367 354590
28525 -132467 204792 -156582 -285984 58533 -175549 61964 412709 230526 53557 239154
28515 239154 45379 126564 173372 28502 -496498 39360 -224030 190664 -137204 -79915 64096
28503 199893 212595 -22418 -71155 14545 222486 89234 -111215 4059 -13074 -158244 104559
28491 -58133 -59778 297447 152954 -138778 34613 -175026 35564 -5980 46966 -1008 23617
28479 -107162 418635 310371 41701 -10512 97964 104684 -272500 189916 -16996 -239981 112058
28467 -215678 -451763 -279729 199776 168102 -114025 17073 251512 75325 4525 42649 33212
$$ packed form
28549B55254j1077I3249N0136F8096a79810A99805q8573a56289O5437J7118B01012
28537A58755b39987D2001a17801k83F0163J72928M6987j32073E3820a69367C54590
28525a32467B04792a56582j29402E8533a75549F1964L50745j82183E3557J85597
28515B39154D5379Q1185M6808B8502d96498C9360b24030A90664a37204N7289F4096
28503A99893J2702b2418m8737A4545K07941H9234a11215D059a3074j45170A04559
28491e8133j645B97447j44493a38778C4613a75026C5564e980D6966a008B3617
28479a07162D18635j08264D1701a0512I7964O720b72500A89916a6996k22985A12058
28467b15678k36085J72034A99776l1674a14025A7073K34439G5325D525L8124r437
$$ plain form
28456 33212 106464 68377 -229321 -286949 42015 155441 288670 -135266 154667 -285866
28445 -199696 -20475 166842 296654 -272750 1158 90043 -357288 61869 300963 106309
28434 -128112 -303706 258244 124591 338961 -79783 211338 250916 -118432 90554 101353
28424 101353 -259473 -139418 187119 82706 -149786 -13162 166497 143876 170844 116994
28414 116994 -168534 408872 -223176 -182412 -201792 173752 -281277 -29534 -69780 199353
28403 336410 11510 349583 -243846 112772 -179727 50786 123460 35767 -153148 -130221
28393 -130221 203375 247256 23437 -306346 -23677 -109119 -26737 149698 267187 125171
28382 223268 -79981 -386077 208434 69530 192740 196690 198479 142311 -761 269879 148610
$$ packed form
28456C3212P3252l8087b29321n7628D2015J13426J33229a35266A54667b85866
28445a99696b0475A66842J29812b72750A158Q8885c57288F1869K39094A06309
28434a28112j75594B58244A24591K14370g9783B11338L9578a18432I0554J0799
28424A01353b59473J20055A87119H2706a49786a3162A66497k2621K6968n3850
28414A16994a68534D08872b23176M0764j9380A73752b81277b9534m0246A99353
28403C36410A1510L38073b43846A12772a79727E0786P2674C5767a53148K2927
28393a30221B03375M3881B3437c06346b3677q5442b6737A49698J17489A25171
28382B23268g9981l06096B08434F9530J23210L950J789n6168g61B69879j21269
$$ plain form
28371 148610 203574 166162 -135484 -67818 156821 38445 9494 158449 101672 187651 -177636
28359 203397 -131179 -91881 -357142 39773 -5253 91369 -248530 11495 40902 -13734 -269218
28348 -269218 12130 42047 -64656 -23930 148104 -32072 220992 121655 -204036 186182 89962
28336 -218561 241304 -412519 -131059 -54979 124280 176268 -29759 43642 14124 335083
28326 335083 150389 209740 -76602 -79627 -138953 180149 -108569 -83707 -157133 250850 151575
28315 151575 343910 120384 300316 244184 -116685 130515 62957 57648 164532 -44611
28304 32165 -149175 -29172 -45208 66368 241603 83828 -128956 -89906 155570 -73340 80016
28292 -124095 326331 -11961 58784 -221590 -338631 -89818 118980 -246621 147492 -66046
$$ packed form
28371A48610N4964l7412a35484O7666A56821C8445I494J48955n6777Q5979a77636
28359B03397a31179L9298k65261C9773e253I1369b48530A1495K9407a3734k55484
28348b69218A2130K9917f4656b3930A48104c2072B20992r9337b04036A86182H9962
28336b18561B41304d12519a31059e4979A24280N1988b9759D3642A4124L20959
28326C35083A50389N9351g6602l025n9326A80149a08569K4862p3426B50850r9275
28315A51575J92335A20384J79932n6132a16685A30515F2957n309J06884d4611
28304C2165a49175b9172j6036F6368J75235H3828a28956L9050A55570g3340H0016
28292a24095C26331a1961E8784b21590j17041h9818A18980b46621A47492f6046
$$ plain form
28281 339419 -45439 78186 58987 -64455 -205930 180244 249929 282601 -203321 -85480 427320
28269 193935 21126 -146757 -116323 -175032 -194329 -3990 211361 -70883 310876 25075 232166
28258 232166 -289495 -116463 128030 26334 100034 -67346 -254876 -42707 -60209 -280918
28248 -280918 -18264 175618 71696 -58578 -361095 -175100 275071 146844 19521 39165
28238 39165 49843 15070 301347 128811 44396 -11902 159316 -104448 42545 -178571 -29673
28226 71403 -65282 -116404 -62671 29370 -224738 -126499 -32889 -255169 -247612 86696 14405
28214 -117548 87609 311717 -97280 93457 236086 4995 296530 247658 188115 -201604 124987
28202 193507 -10448 -263311 -227896 135750 231583 34082 283879 117355 438505 189069
$$ packed form
28281C39419d5439G8186j9199f4455j41475A80244O9685L2672b03321h5480D27320
28269A93935B1126a46757L0434n8709j9297c990B11361g0883C10876B5075K07091
28258B32166b89495a16463A28030B6334P3700f7346j87530d2707j7502k20709
28248b80918a8264A75618G1696e8578l02517a75100B75071j28227A9521J9644
28238C9165J0678A5070K86277A28811D4396a1902A59316a04448D2545a78571b9673
28226G1403f5282n1122N3733B9370b24738R8239c2889k22280P557H6696A4405
28214a17548H7609K24108i7280I3457J42629D995K91535m8872n9543b01604A24987
28202A93507a0448k52863L5415A35750R5833C4082K49797A17355L21150A89069
$$ plain form
28191 271458 -96091 89048 -255103 96200 -198057 272299 -64707 -48842 183729 -88341 197217
28179 283158 158266 -18398 -10823 100922 -76546 -145382 306490 -96234 184670 64754 185926
28168 185926 -103260 -7734 -59177 140271 -101491 -69825 175119 -150181 -51053 -13916 26256
28156 -142966 218157 90994 171024 -6906 -78079 91892 70736 281957 8661 -136552 97476
28144 65389 -4211 -232442 -241713 76895 -156526 -50759 201316 642865 61821 -223990 37562
28132 91477 -270667 185140 55702 124144 40445 310818 -43261 -153261 -473426 5873 208786
28121 208786 -79503 216291 -83855 -63636 -127092 99984 113412 78704 232720 118855 234780
28110 234780 -25345 99763 -134212 137574 122188 -140557 15913 -250575 296025 -154564
$$ packed form
28191B71458i6091H9048b55103I6200a98057B72299f4707J5865A83729h8341A97217
28179B83158j24892a8398P575A00922g6546o8836C06490i6234A84670F4754J21172
28168A85926a03260g734n1443A40271a01491L1666A75119a50181e1053a3916B6256
28156a42966B18157I0994Q0030f906p1173I1892k1156K11221H661a36552I7476
28144F5389d211k28231r271G6895a56526e0759B01316M41549F1821b23990C7562
28132I1477b70667A85140E5702O8442D0445K70373d3261j10000l20165E873K02913
28121B08786g9503B16291h3855K0219o3456I9984J3428l4708J54016j13865J15925
28110B34780b5345I9763a34212A37574j5386a40557A5913b50575B96025a54564
$$ plain form
28099 -78239 200962 -119267 -36421 -29473 146736 247352 65610 -83169 282617 -65476 239644
28087 -71262 94601 262037 168493 163853 -15880 167047 333537 -235309 -100202 -17012 146259
28075 179825 -259911 -75604 -40930 149002 285310 65485 43331 34859 -80542 202022 98536
28063 106490 -93380 -141763 186006 -248235 66930 171694 -63484 -42225 -183682 -109814 -148485
28052 -148485 -62730 -60096 134699 357917 -39471 -269792 -103726 294757 62021 276231
28042 276231 22140 74682 -27268 -9023 40978 87713 -165034 304278 182339 -11844 -7894
28031 -7894 292939 -75389 -71520 370394 114294 134483 -29437 -33682 145431 -325762 171969
28019 54899 123176 -93080 -20493 116806 -78111 -118576 105031 -79735 193895 209157 48786
$$ packed form
28099g8239B00962a19267c6421O948A46736J00616F5610h3169B82617f5476B39644
28087g1262I4601J67436r3544m640a5880A67047J66490b35309a00202a7012A46259
28075A79825b59911g5604L4674A49002J36308F5485k2154q472h0542B02022I8536
28063A06490i3380m8383A86006b48235F6930J04764f3484K1259j41457P3868l8671
28052a48485f2730K634A34699K23218c9471k30321a03726B94757F2021K14210
28042B76231B2140N2542b7268i023D0978M6735a65034C04278j21939a1844L950
28031g894B92939g5389L869C70394A14294K0189b9437m245A45431c25762A71969
28019E4899O8277i3080b0493A16806g8111m0465A05031g9735A93895J5262D8786
$$ plain form
28007 -62237 -202306 113693 209858 -10369 -62557 -337351 -291479 -207237 52341 -34643 -35822
27996 -35822 29552 -216426 -29389 140099 137774 266480 161141 -81882 -91813 150884 257534
27985 257534 69363 218480 54937 -42819 -79077 372903 281744 6720 160756 -14689 180309
27973 -129253 -198053 77571 237957 177080 -89320 -967 -249128 -512 -247520 260359 238761
27962 238761 -32447 104011 104780 -85076 46426 257876 -196225 -50908 193829 203740 255780
27951 255780 13322 -243642 -77898 150558 70588 -173871 -55062 332415 115539 -122451
27940 -163550 -187671 122576 176245 -218777 14682 332876 -205760 40788 -162566 167642
27929 -2514 -13329 -119664 -204382 -30882 -155971 -95451 72603 253908 -87576 610 136803
$$ packed form
28007f2237j40069A13693R6165a0369n2188k74794M5872Q4242E2341c4643j179
27996c5822B9552b16426b9389A40099k325J28706j05339h1882r931A50884J06650
27985B57534F9363J49117E4937d2819l6258C72903r1159F720J54036a4689A80309
27973a29253o8800G7571J60386o0877h9320i67k48161e12k47008B60359k1598
27962B38761c2447A04011P69h5076D6426K11450a96225e0908A93829R911N2040
27951B55780A3322b43642g7898A50558G0588a73871e5062C32415A15539a22451
27940a63550k4121A22576N3669b18777A4682L18194b05760D0788a62566A67642
27929b514j0815j06335q4718c0882j25089O0520G2603J81305h7576F10J36193
$$ plain form
27918 136803 244149 189007 302737 -169173 294707 -68097 143963 174747 136741 -269534
27907 -138199 175206 -305252 -165170 34705 -318436 264264 -126205 91954 17531 194932
27897 194932 75563 242649 186099 -44777 325241 -190779 112939 -144459 83031 116551
27887 116551 -285395 75600 119711 -60200 69122 163713 56053 224501 171468 -130648 267016
27875 -221780 345876 -17101 256127 109208 127106 -132453 51333 -82348 -26609 -17545 -87993
27864 -87993 18166 -68446 -267635 128062 -147240 14931 -44309 201782 18058 86685 213440
27853 213440 298429 222160 47426 375382 -243843 116531 -319386 151428 391369 50001
27842 11194 101071 -3396 45291 224600 198517 179090 -262975 9240 240164 -50196 12220
$$ packed form
27918A36803J07346n5142J13730a69173B94707f8097A43963L0784l8006b69534
27907a38199A75206c05252J40082C4705c18436B64264a26205I1954A7531J77401
27897A94932G5563J67086n6550d4777C25241a90779A12939a44459H3031L3520
27887A16551b85395G5600M4111f0200F9122R4591E6053J68448n3033a30648B67016
27875b21780C45876a7101B56127A09208J7898a32453E1333h2348b6609R064p0448
27864h7993A8166f8446j99189A28062a47240A4931d4309B01782A8058O8627J26755
27853B13440Q4989p6269D7426L27956b43843A16531c19386A51428K39941E0001
27842A1194Q9877c396D5291J79309k6083j9427b62975I240K30924e0196A2220
$$ plain form
27830 -186575 171778 -325045 -53633 -148445 521672 -356325 200005 -207267 -97133 -129632
27820 -129632 -238148 3348 -206810 92635 184571 277319 -1039 -142654 220954 -12068 -326734
27809 -326734 -15437 -102402 -195827 -209674 -226036 180063 284301 -191132 -90226 147898 177801
27798 177801 -53236 -44083 -132210 92378 14659 67623 146576 162853 -244853 187826 127203
27787 127203 13970 -79050 -96343 311451 120631 189565 -146002 -143550 214103 140074 -187987
27775 119390 62485 119252 -46410 215730 -151606 -170325 226155 265955 161204 135531 -209456
27763 17877 115738 82258 -340945 87784 -343911 2234 27406 5955 150135 294627 -80181
27751 -221886 191801 -29424 176646 218429 -28717 -169698 -140168 -219855 418849 -215118
$$ packed form
27830a86575A71778c25045e3633r4812E21672c56325B00005b07267i7133l2499
27820a29632j08516C348b06810I2635R1936R2748a039j41615B20954a2068l14666
27809c26734a5437q6965r3425j3847j6362A80063J04238a91132i0226A47898K9903
27798A77801e3236R153q8127I2378A4659N2964P8953J6277b44853A87826o0623
27787A27203A3970g9050j7293C11451A20631O8934a46002K452B14103p4029a87987
27775A19390n6905N6767d6410B15730a51606j8719B26155L9800j04751k5673b09456
27763A7877R7861l3480c40945H7784c43911B234K5172E955J44180J44492h0181
27751b21886A91801b9424A76646M1783b8717j40981K9530p9687D18849b15118
$$ plain form
27740 70657 84307 -66563 422206 -157768 -26120 308851 249433 340678 52257 283666 170660
27729 170660 96202 -136335 32613 6164 21711 74921 -148498 -46055 152541 -1579 220638
27717 -206748 55567 185775 113484 245667 -54276 165307 12681 -78591 -64790 -34715 -220722
27706 -220722 -309350 -48952 -19942 260913 145888 102103 25506 -36717 128167 -271268 147129
27694 -135843 -162075 -107725 -18113 336481 17451 89883 -102277 172432 -74389 -93508 -215750
27683 -215750 53374 194644 170628 -188540 82882 12426 -111610 102784 150713 -244743
27672 1936 -30607 -325133 229767 -71882 52804 1246 102145 -40697 -151869 182448 -265627
27660 316868 -87603 115666 250638 116418 30792 26442 97827 262683 -55672 28471 -166127
$$ packed form
27740G0657J3650f6563D22206a57768b6120C08851n9418R1245E2257K31409j13006
27729A70660p4458a36335C2613F164J5547N3210a48498d6055A52541a579B20638
27717b06748E5567J30208p2291J32183e4276A65307A2681g8591J3801L0075j86007
27706b20722q8628d8952a9942B60913j15025m3785B5506c6717A28167b71268A47129
27694a35843k6232N4350a8113C36481A7451P2432a02277A72432g4389j9119j22242
27683b15750E3374J41270k4016a88540H2882A2426a11610A02784M7929b44743
27672A936c0607k94526B29767g1882E2804A246J00899d0697j11172A82448b65627
27660C16868h7603A15666J34972A16418C0792m350P1385J64856e5672B8471a66127
$$ plain form
27648 -1869 -46108 -97438 -85149 -33267 462678 -286517 -149519 200660 -34415 44154 -116768
27636 10915 138364 34409 64968 103778 106068 -188103 32437 -44143 407 152258 -70861 -32836
27623 27873 88080 335210 108382 104350 74649 213831 -34142 -259896 12710 190045 -25703
27611 105465 -220938 -47384 -147150 229713 223139 466752 -251151 2467 115974 -1966 18524
27599 191882 299186 159182 -101738 149611 -97460 -58897 -107808 -154207 407811 -205363
27588 238156 -276524 -38901 -26606 -11923 310777 44955 -47588 -5516 -68026 103535 54707
27577 54707 111868 -1538 -40250 -22309 -202023 -47521 160504 213281 76437 122841 -356751
27565 -130730 13800 -220021 73725 20475 101024 280787 -113033 -271492 324586 -165666
$$ packed form
27648a869m4239n1330J2289c3267D62678b86517J36998B00660c4415D4154a16768
27636A0915J27449C4409L0559L8810K290a88103C2437d4143D07J51851g0861c2836
27623B7873O0207K47130A08382m032k9701J39182c4142k25754A2710J77335b5703
27611A05465b20938d7384r9766B29713o574K43613b51151B467J13507a966A8524
27599A91882J07304j40004a01738A49611i7460L8563m8911m6399D07811b05363
27588B38156b76524c8901J2295a1923C10777D4955d7588e516o2510A03535m8828
27577E4707N7161a538l8712J7941j79714d7521A60504N2777G6437M6404c56751
27565a30730A3800b20021G3725B0475Q0549J79763a13033j58459C24586a65666
$$ plain form
27554 -13391 182373 -307728 -293 -95912 48806 88756 86340 -118375 101838 -81642 91135
27542 102460 -241506 -184557 -111223 65532 258722 173340 -27865 -176298 94304 168110 45825
27530 61628 463004 -61912 -10127 1202 330779 67787 49238 -279026 -166948 87866 50012
27519 50012 74200 305922 153248 372967 454156 3997 72494 262238 -157373 70130 130054
27508 130054 -161455 -11653 131683 -240755 -38315 168363 233515 161361 -68619 157011
27497 18108 -44609 24187 -7365 160768 112926 269874 -105848 240248 159166 269287 106876
27485 115861 116512 84695 149384 23289 -157472 -57757 -68421 79537 127269 30510 62359 58911
27473 58911 -197688 -33441 8301 24672 212494 -54719 357032 -45765 -48182 58116 -327834
$$ packed form
27554a3391A82373c07728b93r5619D8806L9950k416a18375A01838h1642I1135
27542A02460b41506N6949P3334F5532J93190q5382b7865j48433I4304P3806D5825
27530F1628M01376f1912a0127A202L29577F7787j8549b79026J12078H7866l7854
27519E0012K4188K31722j52674K19719Q1189C997O8497J89744a57373G0130N9924
27508A30054a61455a1653A31683b40755c8315A68363O5152p2154f8619A57011
27497A8108d4609B4187g365A60768m7842J56948a05848B40248q1082J10121A06876
27485A15861O51l1817O4689B3289a57472e7757j0664G9537M7732C0510L1849l448
27473E8911a97688c3441H301J6371J87822e4719C57032d5765k417E8116c27834
$$ plain form
27461 416595 -46597 30418 -2666 -322574 128032 160092 25628 -157717 391844 -168289 -79027
27449 -31993 -58543 32970 -194474 253000 -50995 -261280 68637 63453 60745 -216322 43969
27437 84322 192693 -60479 80816 104978 -320186 103121 85229 148334 89489 202105 145324
27426 145324 130938 61742 -28304 -85286 161499 -156407 251300 205436 56116 -39434 167
27414 -286357 128616 225088 123252 -38479 -28280 -44030 250169 60834 171708 -270147
27403 211357 112986 5494 -238655 139344 37183 -6770 -319637 -31340 234754 -225108 -143295
27392 -143295 154980 23961 22690 51081 118632 4856 -719 -37877 -120342 255020 233391 289965
27380 289965 282253 32194 182365 -96484 230065 -84782 53458 -21479 35039 90620 -270305
$$ packed form
27461D16595d6597C0418b666l19908A28032L2060B5628a57717C91844a68289g9027
27449c1993k6550C2970a94474B53000e0995k10285F8637n184k708b16322D3969
27437H4322J08371f0479H0816K4162c20186A03121j7892O3105n8845J12616n6781
27426A45324j4386F1742b8304n6982A61499a56407B51300m5864E6116c9434A67
27414b86357A28616R6472j01836c8479J0199j5750B50169F0834J10874b70147
27403B11357r8371E494b38655A39344C7183f770l12867c1340B34754b25108Q1813
27392a43295A54980B3961j271K8391O7551D856g19l7158q2465B55020k1629N6574
27380B89965p712C2194J50171i6484B30065h4782E3458b1479C5039N5581b70305
$$ plain form
27368 -265745 -184780 212062 195526 118603 -114322 -19235 120306 299666 -138570 -27273
27357 38255 -124426 51878 137674 28795 -267682 147595 -269063 121996 221298 -223585
27346 189535 -180479 -109961 434643 3419 138701 -173566 168708 -311739 -118707 63816
27335 -18890 -60261 -350968 111914 78537 28112 -137982 -323415 36635 44314 -77450 -168808
27324 -168808 -88907 20304 -362072 -84583 17837 43208 42203 2664 132042 106038 225021
27313 225021 101731 -28845 38333 399148 -72937 -33523 -24808 -84079 130725 -67698 -175369
27302 -175369 6866 421114 -43655 76501 54022 -131457 -28878 108890 152693 278074 -211306
27290 -234654 -137599 -204140 320628 -167823 99013 22249 20777 201601 67314 207549 82790
$$ packed form
27368b65745Q0965B12062j6536p6923a14322a9235A20306J79360a38570b7273
27357C8255a24426E1878Q5796B8795b67682A47595b69063A21996R9302b23585
27346A89535a80479P0518D34643C419J35282a73566A68708c11739a18707F3816
27335a8890m1371k90707A11914l3377B8112a37982j85433C6635P679g7450r1358
27324a68808P9901B0304c62072h4583A7837K5371j005B664J29378k6004J18983
27313B25021A01731b8845C8333L60815g2937c3523Q715n9271A30725f7698j07671
27302a75369F866M14248d3655G6501k2479a31457b8878A08890M3803J25381b11306
27290b34654R7055o6541C20628a67823I9013B2249j472J80824F7314J40235H2790
$$ plain form
27278 -51605 -133744 24896 196064 283042 33657 88986 37371 147919 166412 92970 298134
27267 298134 -248792 -84145 -59665 46045 325898 134377 -273064 -36520 -69628 -235972
27257 -235972 42735 -287079 114623 127392 335519 12756 -105217 -43897 -50013 -149990 11277
27245 -143693 167804 -200518 199704 177377 -5678 -188855 -212899 9905 56569 25376 262516
27234 262516 -24723 -24257 300059 -4083 142309 -65888 76844 -164714 -192152 -98967 -266534
27223 -266534 -176215 -387321 1397 -70715 -143551 -434362 -314133 -260352 23094 -912 365178
27211 -188774 152971 -215593 -35825 128954 158945 7289 -206633 -137892 -158600 50944 155073
27200 155073 386789 -310826 133575 310683 418733 -186940 -15699 198927 273794 -202292
$$ packed form
27278e1605q2139B4896J71168Q6978C3657N5329C7371J10548J8493p3442K05164
27267B98134b48792h4145K4480D6045K79853A34377b73064c6520l3108j66344
27257b35972D2735b87079A14623J2769K08127A2756a05217d3897o116r9977A1277
27245a43693A67804b00518A99704k2327e678j83177k4044I905M6664B5376K37140
27234B62516b4723M66C00059d083A42309f5888G6844a64714k7438R3185j67567
27223b66534R0319k11106A397g0715p2836k90811J20229N3781B3094i12C65178
27211a88774A52971b15593c5825A28954K9991G289b06633O8741k0708E0944J04129
27200A55073K31716c10826A33575J77108J08050a86940a5699A98927P4867b02292
$$ plain form
27189 -360309 118579 14055 -140184 375094 -248458 41836 308579 122688 93642 -57082
27178 -29477 81539 -215614 -166542 -67154 -48112 92558 14999 -187279 22195 -129970 389941
27166 -26074 -142246 25795 76175 -104877 82871 -40815 161919 10976 423080 339531 -182215
27154 -152770 96218 75328 -189110 -74930 26484 -139579 85533 360966 209855 176172 169910
27143 169910 -184258 -115164 51577 -40681 -83184 51392 122309 61168 -16517 148995 75864
27132 75864 143810 -217114 -21157 194623 119362 -54360 113079 -94258 157805 78025 -210052
27120 7800 170859 1679 -124427 -234368 217331 -355921 -49393 170360 -145644 168856
27109 -22546 -128478 328742 100324 13280 -43977 -124053 256826 183687 -152322 78870 122591
$$ packed form
27189c60309A18579A4055a40184C75094b48458D1836K66743A22688k9046e7082
27178b9477H1539b15614M9072f7154J9042I2558A4999a87279B2195a29970C89941
27166b6074j16172B5795N0380a04877H2871d0815A61919A0976M12104q3549a82215
27154a52770I6218k0890a89110g4930B6484a39579H5533K75433j51111l3683o262
27143A69910a84258O9094E1577d0681m2503E1392P0917o1141a6517A48995p3131
27132G5864O7946b17114b1157A94623p5261e4360A13079i4258A57805G8025b10052
27120G800J63059A679a24427j09941B17331c55921d9393A70360a45644A68856
27109b2546j05932C28742A00324A3280d3977q0076B56826p3139a52322G8870M3721
$$ plain form
27098 122591 401898 314590 -56396 235355 980 -138796 257361 -55874 -139322 -277433 178600
27086 142156 171399 182127 -209757 396304 30805 -39118 297079 147386 -38252 -70782 -23390
27074 193257 92463 -163210 10286 350249 -3408 448061 -103857 -62391 -38687 -69090 -150804
27063 -150804 -95991 37661 30640 20367 6360 -10919 -47518 132227 66119 225830 -74908
27051 45948 47935 87502 -108308 -100589 9690 209420 -54991 -96826 -54355 -44682 86200 50424
27039 50424 -230644 -367597 291988 -21499 -360174 -274496 -259845 243304 124670 -299053
27028 49718 11593 210262 82825 -261653 118448 39452 41453 -158557 -123486 -18142 -143005
27017 -143005 157309 62742 153998 275723 -12226 339653 -90687 -270651 32615 126650 90579
$$ packed form
27098A22591K79307q7308e6396B35355I80a38796B57361e5874q3448j38111A78600
27086A42156K9243J0728b09757C96304C0805c9118B97079A47386c8252l2530b3390
27074A93257I2463a63210A0286L39963c408D48061a03857M1466K3704l0403q1714
27063a50804N4813C7661p021j0273F360a0919l6599A32227o6108J59711g4908
27051D5948J987L9567a08308P719I690J99730e4991m1835M2471R673H6200l5776
27039E0424b30644j36953B91988b1499l38675Q5678J4651B43304j18634b99053
27028D9718A1593J98669H2825b61653A18448C9452K001a58557L5071a8142j24863
27017a43005A57309F2742R1256J21725a2226C39653i0687j79964C2615R4035l6071
$$ plain form
27006 90579 -114612 100078 99969 -22866 96430 189473 27792 -53072 -477431 357693 1191
26994 -166783 207794 -21002 21149 168022 371237 -325868 -28368 -184150 -20037 59877
26983 -234717 -194124 267099 274871 6013 -66825 212489 251367 -36488 33727 163849 8754
26971 9960 107672 331708 -292907 113923 -66044 -15016 270831 -70600 -48790 -188850 22904
26959 157856 -62461 338934 147114 190369 18904 58776 137355 -168452 -250431 191238 -262633
26947 239976 -105448 30949 -22533 -296130 -227562 132564 -57443 206497 313211 -19338
26936 297594 103413 -159078 71011 16605 273508 -138388 57400 16956 -72955 -84512 -104307
26925 -104307 144327 77550 148885 -140905 -10602 40661 -122517 151271 16736 49610 169901
$$ packed form
27006I0579a14612A00078j09b2866I6430R3043B7792e3072m24359C57693A191
26994a66783B07794b1002B1149J46873K03215c25868b8368j55782b0037E9877
26983b34717M0593B67099P772F013f6825B12489L8878c6488C3727J30122H754
26971I960R7712K24036b92907A13923f6044a5016B70831g0600K1810j40060B2904
26959A57856f2461C38934A47114M3255A8904L9872P8579a68452q1979A91238b62633
26947B39976a05448C0949b2533k73597O8568A32564e7443B06497J06714a9338
26936B97594A03413a59078G1011A6605K56903a38388E7400A6956g2955j1557j9795
26925a04307A44327o6777P1335a40905a0602D0661a22517A51271A6736L2874J20291
$$ plain form
26914 169901 -18717 -69965 -74541 -49564 -279729 4739 -310435 -50265 -10429 52358 352560
26903 352560 -192471 216119 -434660 -34269 343761 -46779 -8890 30114 235035 79138 209590
26892 209590 13356 13548 -114358 -120669 -112175 80113 -57481 -202354 -226561 129765 36580 46803
26880 46803 -137163 849 -44533 168479 77814 223489 87251 259786 149557 -100592 74721
26868 -197529 48044 -164724 64544 73442 -75084 -10941 -82635 -23716 22929 -55800 15711
26856 246831 -49324 283231 66104 -203776 4894 7899 103150 -78276 260902 949 -29756 57131
26843 2033 128481 -210689 -79827 159477 -29723 -204769 27357 -45778 -130717 183998 -133947
26831 291281 11363 165107 -192344 154628 116782 -117715 -60019 496846 249661 21823
$$ packed form
26914A69901a8717n1248m576K4977k30165D739c10435e0265a0429E2358L00202
26903C52560a92471B16119d34660c4269C43761d6779h890C0114K04921G9138J30452
26892B09590A3356J92a14358o311Q494H0113e7481j44873k4207A29765C6580J0223
26880D6803a37163H49d4533A68479G7814J45675H7251J72535j10229a00592G4721
26868a97529D8044a64724F4544Q898g5084a0941p1694b3716B2929e5800A5711
26856B46831d9324B83231F6104b03776D894L005R5251g8276B60902I49b9756E7131
26843B033J26448b10689g9827A59477b9723j75046B7357d5778q4939A83998a33947
26831B91281A1363J53744a92344A54628l7846a17715N7696D96846k47185B1823
$$ plain form
26820 -68437 314218 168867 -20412 74506 -16009 -77743 240447 283304 215868 -29446 229467
26808 -228108 154945 407808 -72183 12008 318873 -35864 155223 -47341 -66297 -22643 18562
26796 233043 187418 -252038 91121 158294 251787 32148 178509 236283 326673 50381 25323
26785 25323 115020 282945 -268766 -172188 131602 28820 -255270 -194679 -158519 -302765 87687
26773 -147309 -410474 66490 -3514 129031 -131978 49796 137318 138465 231852 172790 -64500
26761 317433 -161162 140061 -211432 -185125 100932 14856 86798 301980 -193703 -28037
26750 -432921 42146 82773 233251 -65391 -184044 71596 1962 172457 410595 -130544 -67136
26739 -67136 53901 58655 96132 -17079 172603 -23529 203424 54748 -95558 95436 -164697
$$ packed form
26820f8437C14218j45351b0412G4506a6009o1734B40447M2857o7436b9446B29467
26808b28108A54945K52863g2183A2008L06865c5864A55223d7341j8956b2643A8562
26796B33043m5625b52038I1121O7173R3493C2148J46361N7774R0390E0381k5058
26785B5323Q9697J67925b68766R6578A31602B8820b55270O0591L6160j44246H7687
26773a47309k63165F6490c514A29031a31978D9796Q7522J147R3387n9062f4500
26761C17433a61162A40061b11432K6307A00932A4856P1942K15182a93703b8037
26750d32921D2146M0627J50478f5391j18653G1596A962J70495K38138a30544O3408
26739f7136E3901M754L7477a7079A72603b3529B03424E4748i5558I5436a64697
$$ plain form
26727 -63643 -262068 -173247 -319702 -60341 -45386 -43804 236596 -208183 -74601 -67788 -85955
26716 -85955 24612 -36988 224831 -35326 383113 7625 57072 327101 127220 5110 196191
26705 196191 -192429 -65493 -251946 14012 -204272 -235165 26219 66556 63542 -194347 29339
26693 39645 63249 85109 263209 9009 -94627 134939 309253 -131820 -28076 -24893 374898
26681 -135546 -275755 71572 -110533 -116326 487452 85923 -109257 -204745 -49884 -201088 138677
26669 261521 5832 52996 -127492 -52219 -120724 118354 -4572 326319 -58187 219923 13671
26657 -18888 193909 234932 125423 137810 -50737 -179797 174102 73937 -103318 189973
26646 438009 211513 -185115 130628 -196622 6454 304957 112270 329939 -218980 252106
$$ packed form
26727f3643j98425Q8821j46455f0341J4955J582B36596b08183g4601O813j8167
26716h5955B4612c6988B24831c5326C83113G625M9447K70029A27220E110J91081
26705A96191a92429f5493j86453A4012b04272l0893B6219M0337l014a94347B9339
26693C9645K3604K1860J78100I009i4627A34939J74314a31820b8076L183C74898
26681a35546j40209G1572a10533n793D87452H5923a09257r5488d9884j51204A38677
26669B61521E832M7164a27492e2219o8505A18354d572C26319e8187B19923A3671
26657a8888A93909M1023j09509J2387e0737j29060A74102G3937a03318A89973
26646D38009B11513a85115A30628a96622F454K98503A12270K17669b18980B52106
$$ plain form
26635 -140442 -173084 7052 405188 -67361 -17646 -161389 -140188 88195 -379384 108332 149995
26624 149995 -93024 29788 336258 117607 -184097 -33542 170298 -53812 -141287 -61893 194458
26612 30767 16258 -45437 240878 -337439 -44912 -154626 -18376 22139 323940 82938 102388
26601 102388 484367 52740 146566 103456 -8424 -91799 425898 -146230 55440 -69983 -223495
26590 -223495 -119915 -4405 -163564 77522 -3431 -143718 327049 -260688 -113139 90135 106589
26579 106589 4912 55544 190021 -152751 40207 -273714 -7410 -281848 296113 253586 -10998
26567 95941 87558 -134329 -209984 -15132 256786 56040 -263341 17071 -201650 -209326 -194354
26556 -194354 -50042 64701 -44760 80212 173366 -182787 -247627 -1112 -32225 -44499 -105730
$$ packed form
26635a40442l2642G052L98136f7361a7646j43743K1201H8195c79384A08332M1663
26624A49995i3024B9788L06470A17607a84097c3542A70298e3812q7475f1893A94458
26612C0767j4509d5437B40878c37439d4912j09714a8376B2139L01801H2938J9450
26601A02388L81979E2740R3826m3110h424q3375D25898a46230E5440f9983j53512
26590b23495J03580d405j59159G7522c431j40287C27049b60688a13139I0135J6454
26579A06589D912N0632J34477a52751D0207b73714g410k74438B96113m2527a0998
26567I5941q383a34329p5655a5132B56786E6040b63341A7071b01650p676J4972
26556a94354e0042F4701d4760H0212R3154a82787o4840a112l1113j2274o1231
$$ plain form
26545 -105730 14994 16291 -118358 10089 116152 397464 157835 321153 117922 -40764
26534 -93459 303378 -95312 -13320 43147 -143747 -112162 -168644 -226992 41896 -153876 -79482
26523 -79482 -131276 129399 -211332 -264485 181732 -67443 196830 234007 19896 -179883 5355
26511 -194371 -161331 -163539 163183 -103271 73005 201358 -157954 98872 -100398 114484
26500 477963 354316 212659 93350 -5374 -2592 87654 60566 178633 419136 -160477 48227
26488 -7721 -224173 122037 -110659 -161572 138023 -133195 89807 80179 -515103 -20174 116042
26476 -123670 241667 -214317 235658 -2531 -328559 99608 25999 -41319 -354443 -143099
26465 -145661 259246 -315689 164507 193175 152829 153766 -68840 152053 53180 -21283 254361
$$ packed form
26545a05730A4994J297a18358A0089J06063K81312A57835J63318A17922d0764
26534i3459C03378i5312a3320D3147a43747L1585n6482n8348D1896a53876P4394
26523g9482n1794A29399b11332n3153A81732f7443A96830L7177A9896a79883E355
26511a94371L3040k208A63183a03271G3005J28353a57954I8872a00398A14484
26500D77963j23647j41657I3350e374b592H7654k7088J18067K40503a60477D8227
26488g721k16452A22037a10659n0913A38023a33195H9807r628e15103b0174A16042
26476a23670B41667b14317B35658b531l26028I9608B5999d1319l13124a43099
26465a45661B59246c15689A64507K8668m0346R37f8840A52053E3180b1283B54361
$$ plain form
26453 -86192 144054 255955 -113315 93667 87596 200544 145896 -188608 212789 -95373 46064
26441 179045 227002 -210750 221312 -80878 264584 -14903 222152 -474997 -324357 211919
26430 -202664 -895 -113645 -181238 213689 308083 -331850 51770 -120651 18588 74554 34712
26418 32923 -64799 237819 49814 -82486 -100031 -223585 -83928 282834 -153383 25151 25588
26407 25588 71176 132527 160750 288287 80499 -12192 2992 -101030 150738 -64046 -63789 92803
26394 -179678 -252660 429474 -119255 -92682 -89756 -193596 168353 -84401 113269 27221 -4563
26382 11424 247833 58870 -225670 137201 134084 -102273 -302079 74407 -83951 260336 50742
26370 -73777 312414 -33477 284218 -29374 143523 -74421 148461 -15271 8066 -164474 -59904
$$ packed form
26453h6192A44054J11901a13315I3667o071J12948n4648a88608B12789i5373D6064
26441A79045M7957b10750B21312h0878B64584a4903B22152d74997J50640B11919
26430b02664h95j12750o7593B13689R4394c31850E1770a20651A8588N5966C4712
26418C2923f4799B37819D9814h2486j7545j23554h3928B82834a53383B5151M37
26407B5588M5588O1351K8223J27537H0499a2192B992a01030A50738f4046K57I2803
26394a79678p2982D29474a19255K6573K926j03840A68353h4401A13269B7221d563
26382A1424K36409E8870b25670A37201l117a02273j99806G4407h3951B60336E0742
26370g3777C12414c3477B84218b9374A43523g4421A48461a5271H066a64474e9904
$$ plain form
26358 -83331 -183175 -760 -36196 96816 -112933 43982 90138 62433 -102607 149236 16568
26346 7549 71585 -163066 -261120 -81647 -69569 -30001 -127436 378015 66864 -86381 252162
26334 61512 -388886 75954 -84126 54076 22833 -61637 29652 -25858 775 131613 136088 -72098
26321 109628 289317 28929 -147126 118672 31683 114762 194667 138512 -341077 96463 -104916
26309 111157 195190 99513 216446 -130278 230982 -44808 8274 100064 155275 -88907 169578
26297 359299 386894 169252 -100804 88375 101153 95718 -43879 61799 -24660 40485 110205
26286 110205 175740 78356 -175121 -54885 77794 -148566 285693 95280 -90551 -162866 309534
26274 275317 -205491 -220915 50230 53058 49644 22621 -98041 -390345 5579 -66278 116935
$$ packed form
26358h3331r9844g60l5436I6816a12933D3982M6156k7705a02607A49236A6568
26346G549O4036a63066r8054h1647J2078c0001r7435C78015F6864h6381B52162
26334F1512c88886G5954h4126E4076B2833f1637B9652b5858G75J30838M475g2098
26321A09628J79689B8929a47126A18672C1683Q3079P9905n6155c41077I6463a04916
26309A11157Q4033r5677J16933a30278B30982d4808H274R1790N5211h8907A69578
26297C59299K7595A69252a00804H8375J2778n435d3879F1799b4660D0485O9720
26286A10205O5535G8356a75121e4885G7794a48566B85693I5280i0551p2315C09534
26274B75317b05491j5424E0230K828l414B2621i8041k92304E579f6278A16935
$$ plain form
26262 322456 -56781 -23239 27234 -243953 -40465 -295676 224358 260900 231101 47536 33932
26251 33932 -16190 58308 -234046 -201517 137780 -68524 -33171 98603 71471 -12574 79673
26239 342984 -168527 -272786 30343 -290993 16807 137230 5218 16723 130573 -41286 12404
26227 -72751 22986 165602 33798 -166648 -16688 23207 377077 140014 -121691 -3505 -51072
26216 -51072 -51479 -362549 65482 220626 403095 -3694 371866 -162787 7207 -266647 -17059
26204 281516 -14746 85900 22986 -189034 336855 160632 113516 -441628 -239598 7764 121534
26193 121534 -218384 133481 83305 -346005 -14547 -16564 -96186 -144135 -140047 46651 209184
26182 209184 203651 30702 -37952 36005 16902 114757 -135591 -429400 -203866 -43576 -83498
$$ packed form
26262C22456e6781b3239B7234b43953d0465k55211B24358L6542k9799D7536j3604
26251C3932a6190E8308b34046L2529A37780f8524c3171I8603k7132a2574G9673
26239C42984a68527j04259C0343b90993A6807J20423E218J1505J13850d1286A2404
26227g2751B2986J42616C3798a66648a6688B3207L53870A40014a21691c505m7567
26216e1072m07l11070F5482J55144J82469c694C71866a62787G207b66647a7059
26204B81516a4746H5900B2986a89034C36855A60632m7116d41628K02030G764J13770
26193A21534b18384A33481n0176c46005a4547k017p9622m7949M088D6651J62533
26182B09184n533C0702c7952C6005A6902R7855a35591k93809b03866d3576l9922
$$ plain form
26171 -83498 -226663 -205810 -99140 -95950 273906 177116 199894 -241692 61201 -59088 94974
26159 60384 97789 -21782 134277 156 153685 18260 85525 -40449 -139358 317626 -50717
26147 -208863 138788 -86373 346176 186961 128207 342697 952 -38421 198989 238686 25489
26135 137204 155805 -177996 -33215 177220 29050 145871 129587 -15236 8543 278098 -184460
26123 297896 497464 -165306 248651 309475 -80695 63878 -226947 152591 -243076 66215
26112 65822 67055 -194914 -24875 -143496 -100939 331022 -34446 115426 83610 -28190 143519
26100 -147830 218542 127313 -9327 112267 -93681 -202634 -25625 84407 183458 -48749 -121346
26089 -121346 -222081 -149786 -408058 37080 88322 11454 41804 -78459 73809 -25991 330888
$$ packed form
26171h3498j43165K0853i9140L190B73906r6790K2778b41692F1201e9088I4974
26159F0384L7405b1782A34277A56J53529A8260O7265d0449r8909C17626e0717
26147b08863A38788h6373C46176j59215n8754K14490I52c8421A98989L9697B5489
26135A37204J8601a77996c3215A77220B9050J16821j6284a5236H543K69555a84460
26123B97896J99568a65306B48651O0824h0695F3878b26947A52591b43076F6215
26112F5822J233a94914b4875j18621M2557C31022c4446A15426l1816b8190A43519
26100a47830B18542r1229i327A12267i3681j08953b5625H4407R9051d8749p2597
26089a21346j00735P2295k58272C7080N1242A1454L0350g8459G3809b5991C30888
$$ plain form
26077 -116577 12928 -119072 154075 -37984 69910 -148381 211325 8008 68358 -107094 -342095
26066 -342095 108431 -50439 -134224 -106805 -99375 109387 37049 153226 -49055 256867 7218
26054 343172 -270901 -207368 -88074 19552 -103428 82424 -125080 -143424 -177639 59182 -183218
26042 -13491 96993 -92346 -75577 350996 -25751 48050 51106 21540 -146536 174784 -36856
26030 273745 322890 -6415 216342 240827 85718 -3338 154199 -284166 173094 -71384 94754
26018 -606 -138339 74835 -191095 -425342 289282 -30616 111352 77761 197294 29729 -238685
26006 96505 123394 -40878 -70299 -79709 175138 -3430 179610 192659 -224404 -100239 -107658
25995 -107658 81349 -85780 36101 109822 264703 32543 -86756 4054 247241 334785 303614
$$ packed form
26077a16577A2928a19072A54075c7984F9910a48381B11325H008O0350a07094k35001
26066c42095A08431e0439q3785K7419P430A09387C7049J16177d9055B56867G218
26054C43172b70901O3533h8074A9552a03428H2424a25080j8344l4215E9182a83218
26042a3491I6993i2346J6769C50996b5751D8050L056B1540a46536A74784c6856
26030B73745M9145f415B16342K4485H5718c338A54199b84166A73094g1384I4754
26018f06j37733G4835a91095k34247B89282c0616A11352l3591J19533B9729b38685
26006I6505K6889d0878k9421r410A75138c430A79610J3049b24404a00239p419
25995a07658H1349h5780C6101P3721J54881C2543h6756D054K43187Q7544l1171
$$ plain form
25984 303614 1038 -61765 -175238 -54589 41133 3619 568291 -109774 143347 59304 74794
25973 74794 -52128 -315044 -172035 -84434 -112582 -418816 280810 181793 -41036 188260 119492
25962 119492 -94971 73268 67855 14133 -359062 77027 -122877 102452 -97019 179051 119923
25951 119923 61823 208722 -137848 70033 208915 69328 162274 62194 59058 31687 39547
25940 39547 142013 79341 20470 259900 -169261 -197269 235113 -220041 -7045 40845 11793
25928 41858 28121 38627 11347 331198 -93915 -50035 87821 227318 236930 -10598 -60251
25917 -60251 21070 -335329 86193 196366 -346517 -124790 220011 -65400 161961 -13492
25906 -83909 -158954 78644 -103480 65990 32098 -62857 -259169 136937 -367603 -409293 -468857
$$ packed form
25984C03614A038f1765j13473e4589D1133C619N64672a09774A43347E9304J5490
25973G4794e2128k62916J43009h4434k8148l06234B80810r9017d1036A88260o8768
25962A19492i4971G3268n413A4133c59062G7027a22877A02452i7019A79051n9128
25951A19923n8100J46899a37848G0033J38882F9328R2946F2194l136k7371P860
25940C9547J02466o2672B0470K39430a69261k8008B35113b20041g045D0845A1793
25928D1858j3737J0506A1347L19851i3915M3880H7821J39497R612a0598m9653
25917f0251B1070c35329H6193J10173c46517a24790B20011f5400A61961a3492
25906h3909p5045G8644a03480F5990C2098f2857j96312A36937c67603m1690n9564
$$ plain form
25895 -468857 -170345 -249635 36103 258353 -117278 257845 158387 27042 107351 -233280
25884 78708 103882 -70261 224104 111666 -343720 164307 162202 239383 -167430 -183597 -5508
25872 455783 -55765 137086 -49086 -136502 -13956 75404 -9423 -210007 -403013 105735 222168
25861 222168 299218 -78360 -128666 412237 -223527 11900 422013 9229 -16580 -188050 70950
25849 243510 -216283 237978 296319 -145254 177665 149573 -198098 309857 -105440 107762
25838 -3829 3944 -38821 248655 134693 302169 -30648 -206279 158879 -79456 109904 52049
25826 306328 -180790 132376 -234556 124097 -20127 -150601 8486 210500 -227290 -11074
25815 18107 -11706 -61180 82474 -9531 66586 -87443 -9647 329569 98289 5049 -97548 140416
$$ packed form
25895d68857a70345p9290C6103K22250a17278B57845r9458B7042Q0309b33280
25884G8708K5174g0261B24104A11666c43720A64307k105P7181a67430j6167e508
25872D55783e5765A37086d9086q7416a3956G5404i423k00584j93006A05735J16433
25861B22168P7050g8360n0306D12237b23527A1900M10113I229a6580j71470G0950
25849B43510b16283B37978N8341a45254A77665k8092a98098C09857a05440A07762
25838c829C944c8821B48655j13962J67476c0648j75631A58879g9456A09904E2049
25826C06328a80790A32376b34556A24097b0127j30474H486K02014b27290a1074
25815A8107a1706m9474H2474i531F6586h7443i647C29569I8289E049i7548A40416
$$ plain form
25802 -237119 -17047 165371 -239761 -186089 -211119 35136 -276062 -95619 -242878 -34466 -18993
25791 -18993 -236790 91225 -170242 -18889 61809 -18424 -82525 -12757 80041 226075 41784
25779 67627 10995 82866 -248540 55899 48204 -68900 149134 344992 -101474 -93222 -74275
25768 -74275 -374568 -8430 -159329 -170233 70658 218848 138384 -53875 285823 -56778 -26148
25756 -203837 209242 63204 263090 312337 241108 -87751 -222106 23418 214929 79605 -356645
25744 63077 222502 -121612 3527 -85023 -32754 -39634 -239178 86934 59123 187306 119199
25733 119199 -15903 -98837 -83441 19320 -148484 -54333 28269 -163433 46273 121296 -194902
25721 -175132 70383 -96726 290326 127494 -34297 -208468 163355 281970 -251189 -91814
$$ packed form
25802b37119a7047A65371b39761N3672k5030C5136b76062i5619j47259c4466J5473
25791a8993k17797I1225a70242a8889F1809a8424o4101a2757H0041J46034D1784
25779F7627A0995P1871b48540E5899p695f8900A49134J95858a01474Q252J8947
25768g4275l00293h430j50899j0904G0658J48190q0464e3875B85823e6778b6148
25756b03837B09242F3204J99886M9247p1229h7751j34355B3418J91511G9605c56645
25744F3077J59425a21612C527h5023c2754o880j99544H6934k7811J28183o8107
25733A19199a5903q2934J5396A9320a48484e4333B8269a63433D6273P5023a94902
25721a75132G0383i6726B90326A27494c4297j74171A63355J18615b51189i1814
$$ plain form
25710 103598 335629 207692 99309 291823 183347 -44480 -82091 138933 25160 -58906
25699 357081 -96723 -136466 23498 29114 117753 189246 89521 146297 90448 142248 -80209 157186
25686 70387 169715 53954 150657 180374 -149157 -4474 -204578 -32422 -160345 69695 69487 292080
25674 292080 -134967 -65736 123135 -242035 -207977 53847 156618 -25292 121850 -36130
25663 -175470 107842 -3294 24557 130668 70498 108295 1924 85350 268844 -258102 289176
25651 -152905 -75359 266417 106628 -121782 128879 16496 62621 -273123 56990 238390
25641 238390 -114367 249899 -78771 -22158 -88317 22225 44711 212368 -477050 144140
25630 120278 229709 -43459 336844 354558 -34625 7014 299263 -51743 283382 -197168 -51037
$$ packed form
25710A03598K32031j27937I9309J92514j08476d4480l7611A38933B5160e8906
25699C57081i6723l9743B3498N616Q8639P1493H9521N6776n5849N1800h0209A57186
25686G0387R9328E3954R6703K9717a49157d474k00104c2422j27923F9695k08K22593
25674B92080a34967f5736A23135b42035L4058E3847J02771b5292A21850c6130
25663a75470A07842c294B4557J06111o0170L7797A924Q3426J83494b58102B89176
25651a52905g5359B66417A06628a21782A28879A6496M6125b73123E6990J81400
25641B38390a14367B49899g8771b2158o6159B2225K2486J67657d77050A44140
25630A20278J09431d3459C36844J7714c4625G014K92249e1743B83382a97168e1037
$$ plain form
25618 173671 -164341 123962 150967 200406 -252071 -110696 -176782 284627 43342 -42628
25607 80910 -371380 11681 153577 77630 -8383 -170308 275363 14270 392790 -88199 -180083
25596 -180083 -118818 -53778 -380799 -222696 -73167 -66266 -19022 36330 -6940 165742 273150
25585 273150 -108585 -299466 11231 80818 143348 112251 -125484 223734 63494 39141 162543
25574 162543 -418184 -152015 -106992 -82122 70261 -49085 -184422 -179187 81898 18971 -93560
25562 64884 354550 172435 -51577 -89248 73185 84586 -21544 66033 202681 60387 -280363
25550 205984 85648 205261 112800 45720 76715 -124967 18447 206590 -4094 -143776 -131559
25539 -131559 242816 78923 -75987 -244536 176440 -34393 37564 143834 307762 -116266
$$ packed form
25618A73671a64341A23962K7005M9439b52071a10696o6086B84627D3342d2628
25607H0910c71380A1681J41896p5947h383j61925B75363A4270L78520h8199r1884
25596a80083O1265e3778l27021J58103g3167O901a9022C6330f940A65742J07408
25585B73150a08585j90881A1231O9587O2530l1097a25484B23734F3494k4353J23402
25574A62543d18184a52015M5023K4870G0261d9085j35337N235H1898A8971i3560
25562F4884K89666A72435e1577l7671G3185J1401b1544F6033J36648F0387b80363
25550B05984H5648J19613r2461D5720L0995a24967A8447J88143d094j39682J2217
25539a31559B42816G8923g5987j68549A76440c4393C7564J06270J63928a16266
$$ plain form
25528 60308 165646 -6701 -250455 -193036 -33099 -132206 -78025 -2457 275919 -85910 -90128 -212648
25516 -212648 -23300 -61539 6821 -13785 151513 103816 137094 93541 53368 -55170 -15218
25504 98805 -206687 25373 -102179 28505 23094 -94630 -71573 105026 -137449 -298506 152403
25492 -112374 -173455 -24779 524087 183334 -120248 -82491 101745 -142882 -180252 -198646
25482 -198646 43254 -136579 4818 -57845 7686 -205168 -85790 24435 -228805 -394276 230207
25470 -204891 -42675 -9268 -60878 -168819 -95339 -117226 141452 2585 37924 -194858 -324166
25459 -324166 139320 -229566 -102501 231274 -115144 297336 264405 202226 215381 253489
25449 253489 41210 -224102 48289 405652 -175753 115744 -197557 -68961 364034 -130410
$$ packed form
25528F0308J05338f701k43754N7419c3099r9107N4181b457B75919h5910m218j22520
25516b12648b3300l8239F821a3785A51513m7697L3278m3553m0173e5170a5218
25504I8805b06687B5373a02179B8505n411i4630K3057A05026a37449j61057A52403
25492a12374o1081b4779E24087A83334a20248L7757A01745a42882l7370j8394
25482a98646D3254a36579D818e7845G686b05168h5790B4435b28805j65471B30207
25470b04891d2675i268n1610j07941P3480k1887A41452B585L5339a94858j29308
25459c24166A39320b29566a02501B31274a15144B97336l2931o2179J3155L8108
25449B53489D1210b24102D8289L57363a75753A15744a97557f8961C64034a30410
$$ plain form
25438 80487 -183466 142087 -52027 174347 -103279 39694 164723 -181050 117676 125353
25428 125353 75758 -226858 20051 82211 -370776 -148090 -2503 164411 -28239 329145 32738
25416 -61743 -253662 -35737 67916 48390 116058 -77877 -60441 -127784 118514 -76849 -6017
25404 150217 125407 332927 -73205 144152 -98606 190342 209383 -52251 -111635 136843 -315733
25392 -19004 247024 175698 -78009 -36055 164485 181270 78407 11224 -16133 -241484 21254
25380 -109473 221096 -63606 -18001 -50527 50698 43642 197188 -179105 -152917 170502 53800
25368 12161 109015 348565 173956 70891 61584 -19453 -111721 -53745 25514 -31559 32096
25356 -67526 306568 166296 66817 223097 11537 164174 -110849 242882 -88676 79660
$$ packed form
25438H0487a83466A42087e2027A74347a03279C9694J25029a81050A17676P677
25428A25353m9595b26858B0051O2160c70776a48090b503A64411b8239C29145C2738
25416f1743j91919c5737F7916j9526O7668g7877J7436o7343A18514g6849f017
25404A50217k4810K07520g3205A44152i8606A90342J9041e2251n9384A36843c15733
25392a9004B47024p1326g8009c6055A64485J6785G8407A1224a6133k25351B1254
25380a09473B21096f3606a8001l2526E0698p056J53546a79105K6188A70502E3800
25368A2161R6854K39550A73956G0891r307a9453r2268e3745B5514c1559C2096
25356f7526C06568j40272F6817J56280A1537J52637a10849B42882h8676G9660
$$ plain form
25345 -209561 -39149 -148904 321347 -206774 -90932 107802 203774 -78600 -130365 131478
25334 38193 55124 1439 -32325 -245789 -113717 137449 211200 -39104 -94480 307057 9916
25322 4254 -163273 -94020 291158 -1306 -32016 6552 168281 61453 57702 316158 197378
25311 197378 60220 182456 147029 34078 -37267 -157507 210279 182746 -137376 41230 -24489
25299 -41400 -57815 312883 -175689 -131534 -183056 92379 -104538 -26392 6435 67398 -10958
25287 180970 -136342 -206845 -122781 -164346 324496 -114559 -150749 -36653 2923 447 -129618
25275 140130 82167 334106 56351 -20735 -21238 -233008 -43638 189862 135532 234606 -313173
25263 -128130 -150300 -40664 -365677 16861 -38540 294953 -23384 54568 -27620 72940 77360
$$ packed form
25345b09561c9149j09755C21347b06774i0932A07802R5972g8600n1765A31478
25334C8193J6931A439c2325k13464a13717A37449P3751c9104n5376C07057I916
25322D254a63273O9253B91158a306l0710F552J61729F1453l751K58456j18780
25311A97378F0220J22236l5427C4078c7267j20240B10279k7533a37376D1230b4489
25299d1400j6415C12883a75689M4155n1522I2379a04538b6392F435O0963a0958
25287A80970a36342p0503Q4064m1565C24496a14559l6190c6653B923D47a29618
25275A40130n7963K51939E6351b0735n03k11770d3638A89862n4330R9074c13173
25263a28130k2170d0664l25013A6861c8540B94953b3384E4568b7620G2940M420
$$ plain form
25252 77360 -117522 27475 198208 17571 -90548 -31973 -409085 151809 -117599 329200
25241 298071 162689 -158107 254335 -223394 400495 110204 -116564 121193 151115 7870
25230 73079 -75621 -270931 225039 141412 -208958 -239976 297685 42768 64501 147507 166573
25219 166573 62108 -65122 -141372 -64697 -207859 -66691 127703 -154139 -262022 -142408
25209 -142408 -29842 338266 -44498 234751 61674 -58513 18255 -64094 -171699 -3929 175793
25197 -333123 12923 -353635 44312 -42603 -17160 -146283 -341104 -219553 38363 -74523 245389
25185 -12724 30616 6666 60994 -155940 65309 226961 175547 393764 -69319 53778 -122830
25173 311598 -258384 -297072 -163755 -138252 127437 105484 30603 -98429 -29372 -151598 275173
$$ packed form
25252G7360a17522B7475J70733A7571i0548c1973l77112A51809a17599C29200
25241B98071j35382a58107B54335b23394D00495A10204a16564A21193K9922G870
25230G3079g5621j95310B25039q3627b08958l1018B97685D2768K1733Q3006J9066
25219A66573F2108f5122p6250f4697j43162f6691A27703a54139j07883J19614
25209a42408b9842C38266d4498B34751F1674e8513A8255f4094j07605c929A75793
25197c33123A2923c53635D4312d2603a7160j29123j94821J21551C8363g4523B45389
25185a2724C0616F666N4328a55940F5309J61652n1414K18217f9319E3778a22830
25173C11598b58384l8688J33317K5503A27437k1953C0603i8429b9372j22226B75173
$$ plain form
25161 -182869 93807 25810 -70284 71474 132485 -129360 15622 26834 -8688 -127387 -150208
25150 -150208 296948 229152 313122 -55363 -329695 195878 23994 220939 174972 -35374 -84186
25139 -84186 -106408 73205 114523 -117229 138685 -155282 -9536 -24579 328350 781 182279
25128 182279 -394336 -70292 256290 121818 -83676 169143 -13021 -133066 33251 104626
25118 104626 47553 -117976 -30338 72881 -3552 209 -82444 -161618 59467 93042 305716 312751
25106 312751 112776 -112824 114156 335900 16545 107154 109242 5159 28437 -51251 -64565
25095 -64565 -212496 144048 -170328 -15179 243690 108228 -488495 -124501 -279046 -170679
25085 -170679 -144906 -61647 -70868 158880 30823 73252 76900 241040 -316345 -98763 -149176
$$ packed form
25161a82869I3807B5810g0284G1474O1011a29360A5622J1212h688j18699k2821
25150a50208B96948o7796Q3970e5363k74332A95878B3994J96945m5967c5374m8812
25139h4186k2222G3205M1318a17229A38685a55282i536j5043C28350G81J81498
25128A82279c94336g0292B56290A21818h3676A69143a3021j20045C3251P1375
25118A04626D7553a17976c0338G2881c552B09h2444p9174E9467L3575K12674P035
25106C12751A12776a12824A14156K21744A6545R0609K088E159K3278e1251j3314
25095f4565j47931A44048a70328a5179B43690A08228d88495a24501j54545J08367
25085a70679K5773f1647r221A58880C0823M2429L648J64140c16345i8763n0413
$$ plain form
25074 -149176 -44296 175118 382255 -116336 -46271 -48273 -407885 -258988 -48201 58463 48696
25063 48696 316432 -12709 76518 -106483 -227722 -78019 51151 186047 -50827 -806 -188019
25052 -188019 -211687 -107872 375749 -128286 -93803 68208 -105057 -159298 -50024 107701
25041 31954 -114413 246298 32832 130011 39597 -176042 -208652 -168437 -209619 208024 27415
25029 38550 182000 -1037 -40365 112674 20828 -135750 -143688 343826 -48343 -92679 21277
25017 -46139 220049 100372 64970 -13255 13051 42984 22089 74100 309950 -179664 33505
25005 359195 -116438 46712 267787 -50133 -111425 -83118 165268 151475 31218 -251272 57087
24993 184470 60898 -201210 197685 -49270 -76835 -192103 -4388 89060 -31764 13038 -220854
$$ packed form
25074a49176d4296A75118K07137a16336d6271k002l59612J48897d8201E8463r767
25063D8696K67736a2709G6518a06483j21239g8019E1151J34896e0827h06j87213
25052a88019k3668J03815C75749a28286L4483F8208a05057n4241e0024A07701
25041C1954a14413B46298C2832R7179C9597a76042l2610M0215m1182B08024B7415
25029C8550J43450a037l9328A12674B0828a35750p938C43826d8343m4336B1277
25017d6139B20049A00372l5402a3255A3051K9933k0895N2011K35850a79664C3505
25005C59195a16438D6712K21075e0133o1292K8307A65268j3793C1218b51272E7087
24993A84470F0898b01210A97685d9270k7565j15268d388H9060c1764A3038b20854
$$ plain form
24981 150064 86203 123413 -148418 -211850 -42748 -184358 -76142 49142 14389 209121 -5392
24969 152478 -34194 -98589 -622888 -30067 287854 -40095 -125239 -209353 124024 -119209 56509
24957 32515 -167040 -51941 -91502 129985 129820 -182191 -154568 -130317 -76884 -210029 178760
24945 -107283 1272 -119024 54684 -114996 -233003 -294900 118518 -13337 -173732 -135685 -217064
24934 -217064 127220 -1202 107216 -209120 163829 -254948 198664 401652 11572 424819
24924 424819 75524 112828 -48338 -61581 219944 -364629 133980 289714 -100174 -247498
24914 -247498 -268207 262561 -39567 115745 405183 185066 48794 -9529 173838 -100392
24903 -294188 57456 38451 -54330 169272 125367 -101378 -46840 -44957 207328 -37588 -494463
$$ packed form
24981A50064o3861L7210a48418o3432d2748j41610g6142D9142A4389J94732e392
24969A52478c4194o4395n24299c0067B87854d0095q5144q4114A24024a19209E6509
24957C2515a67040e1941l9561A29985j65a82191K7623K4251N3433j33145A78760
24945a07283A272a19024E4684a14996j18007o1897A18518a3337j60395L8047q1379
24934b17064A27220a202A07216b09120A63829b54948A98664K02988A1572M13247
24924D24819G5524L7304d8338j3243B19944c64629A33980J55734a00174j47324
24914b47498k0709B62561c9567A15745K89438A85066D8794i529A73838a00392
24903b94188E7456j9005e4330A69272m3905a01378d6840J883B07328c7588m56875
$$ plain form
24892 -494463 -12891 -115530 324933 -154849 111904 104439 348670 -34774 96500 -74650 -74018
24881 -74018 -180530 117235 241330 219097 -17226 165054 109536 -78903 -310547 60509 68814
24870 68814 -128312 39142 -129513 -199748 101932 136826 -174056 91315 35770 -128099 27785
24858 -8989 -128002 63508 -11345 -276293 266130 -171433 506110 -200724 -40137 -331175
24848 -331175 -64787 98045 230843 -146002 -19572 -43878 -119609 65325 -225087 -367434 81717
24836 171791 -156938 -227727 147097 130987 35032 28127 224358 -120510 -78322 -105414 38908
24824 -136637 -38696 -162859 471001 278016 128958 236895 -61498 -127105 59908 -30792
24813 -170444 300369 72932 104853 67856 -60716 -144378 -26825 -52912 -198480 -224567 -366168
$$ packed form
24892d94463a2891j02639C24933a54849A11904p465K44231c4774I6500g4650O32
24881g4018j06512A17235J24095k2233a7226A65054n5518g8903k31644F0509Q305
24870F8814a28312C9142a29513p0235A01932L4894a74056I1315C5770a28099B7785
24858h989j19013F3508a1345k64948B66130a71433E06110b00724d0137k91038
24848c31175f4787I8045J32798a46002a9572k4306p5731F5325b25087j42347H1717
24836A71791a56938p0789A47097j6110C5032o905J96231a20510M2188k7092C8908
24824a36637c8696j24163D71001j92985A28958J07937f1498o5607E9908c0792
24813a70444C00369G2932L1921l6997f0716q3662b6825k6087j45568k6087j41601
$$ plain form
24802 -366168 -144605 -50323 24103 235083 272918 -86322 9550 -277985 65 49100 50591 204873
24790 204873 228391 -64481 106327 -112683 90724 -16151 72285 -78931 296282 -93871 -183072
24779 -183072 227279 38997 -51639 53159 115409 68487 89784 49706 852 -364897 -165292
24767 240211 241244 -92245 170101 -5661 -82670 -157661 147062 62145 -9459 178039 -145061
24755 -121498 -3494 328169 193683 -41324 49083 234574 26277 200746 -71092 45737 -448107
24743 886 -95853 135250 -149685 370230 -286593 -140670 289590 -90551 208961 -6508 -247130
24732 -247130 -131719 10975 -4714 369938 -239464 -117262 92968 310515 281503 428318
24722 428318 -55660 -140403 188786 -47323 -24341 -215733 -13930 -289597 -218272 38484 -90263
$$ packed form
24802c66168a44605e0323B4103K10980L7835h6322I550b77985F5M9035J491J54282
24790B04873K3518f4481A06327a12683I0724a6151G2285g8931B96282i3871q9201
24779a83072B27279C8997e1639E3159O2250m6922K1297m0078H52c64897a65292
24767B40211J033i2245A70101e661p7009p4991A47062F2145i459A78039a45061
24755a21498c494C28169j34486d1324D9083J85491B6277J74469g1092D5737d48107
24743H86i5853A35250a49685C70230b86593a40670B89590i0551B08961f508k40622
24732b47130J15411A0975d714C69938b39464a17262I2968K17547k9012J46815
24722D28318e5660q4743A88786d7323K2982j91392a3930k75667P1325C8484i0263
$$ plain form
24710 -118811 -161074 -161000 32258 -116197 -10981 -361763 918 102336 189921 -155301 170178
24698 150887 285753 282042 76804 -172542 240506 57322 81192 -80488 -150871 -103740 209635
24686 90287 -82123 493777 65094 -74659 -285229 22937 68165 206558 -128621 -22281 299494
24674 -161572 103260 -182842 -51571 -119257 119150 16920 102620 -147280 195173 372935
24664 372935 296687 230274 -138876 -204269 110862 74744 -329346 53417 191406 -83246 17776
24652 145542 -13019 -141110 -328426 -117021 -48876 -33306 131073 -26638 -115579 -109981 187412
24640 -7274 -226398 122114 154749 -99638 -295013 124255 -29377 19774 -50609 -92754 28949
24628 231129 -341289 120712 -95808 63385 -171464 -70424 -37815 -3914 -34936 -236010 165069
$$ packed form
24710a18811m2263P4C2258a16197a0981l50782I18J01418Q7585a55301A70178
24698A50887J34866l711G6804a72542B40506E7322K3870h0488p0383M7131B09635
24686I0287h2123D93777F5094g4659k10570B2937M5228J38393a28621b2281B99494
24674a61572A03260a82842e1571o7686A19150A6920Q5700a47280A95173J77762
24664C72935p6248o6413a38876o5393A10862l6118c29346E3417J37989h3246A7776
24652A45542a3019j28091j87316a17021d8876J5570A31073b6638q8941N598A87412
24640g274k19124A22114L2635i9638j95375A24255b9377A9774e0609m2145B8949
24628B31129c41289A20712i5808F3385a71464g0424L2609c914l1022k01074A65069
$$ plain form
24616 -188538 2841 -121068 -290040 -18398 -8523 -177073 -53213 -93236 135827 -130596 286287
24604 -211660 247347 143461 -206045 -142647 155652 -39807 -95166 207255 16849 -9758 -283669
24593 -283669 -133718 -88310 -341247 102850 71038 110276 81371 44879 -188886 165133
24582 -306925 68979 408237 -53294 -136709 22110 37329 219766 -130384 132078 48651 -217871
24570 -7291 91044 -47662 39714 -174265 187515 -55551 175055 85928 -80846 292802 123422
24558 -285297 -172299 -185490 30665 -181285 -192785 -183572 91905 168338 -223445 331662 338211
24547 338211 55966 187038 191323 76145 -91061 63313 247198 74294 -212318 214336 280005
24536 280005 162586 -129670 -472186 -93228 145085 233826 -214466 117455 243044 -228013
$$ packed form
24616a88538B841a21068j68972a8398h523j68550e3213m0023A35827a30596B86287
24604b11660B47347j03886b06045O3398A55652c9807n5359B07255A6849i758k73911
24593b83669a33718M5408k52937A02850l1812L9238k8905l6492a88886A65133
24582c06925F8979L39258e3294q3415B2110J5219J82437a30384A32078D8651b17871
24570g291I1044d7662C9714a74265A87515e5551A75055H5928h0846B92802A23422
24558b85297J12998j3191C0665a81285j1500R213I1905P6433b23445C31662O549
24547C38211E5966J31072M285G6145i1061F3313J83885G4294b12318B14336O5669
24536B80005j17419a29670l42516i3228A45085Q8741b14466A17455J25589b28013
$$ plain form
24525 158581 -37951 -10630 268193 -228733 -144725 -21674 -106883 -92242 -167512 -221706 105239
24513 264610 -134995 252592 139639 43298 150788 142 -12016 -167010 -172616 20204 54083
24502 54083 290238 -101161 -210666 -141591 78372 -380083 -248503 70948 35562 -151097
24491 -241266 117084 -199495 109858 -49222 -123928 -311068 -24880 -201910 -50992 25944
24480 27014 -19493 -123949 138413 4313 -29301 -169452 201715 274397 -267159 253566 232714
24469 232714 -48246 -176616 100119 251004 -38545 208642 -36546 -64155 34825 -161328
24458 -60067 -10812 -25771 -490233 40076 -94501 106537 -176956 65482 66606 -23754 -50828
24447 -50828 135278 154354 297121 -140844 111784 251089 98238 84856 -63727 100520
$$ packed form
24525A58581c7951a0630B68193b28733Q4008b1674q5209J4641p5270n4194A05239
24513B64610a34995B52592j12953D3298J07490A42a2016j54994n606B0204L3879
24502E4083K36155a01161j09505O9075G8372c80083J31580G0948l5386a51097
24491b41266A17084a99495A09858d9222p4706j87140b4880j77030e0992B5944
24480B7014a9493j04456A38413D313b9301j40151B01715P2682b67159B53566k0852
24469B32714d8246j28370A00119J50885c8545B08642c6546k7609C4825a61328
24458f0067a0812j4959m64462D0076i4501A06537a76956F5482J124b3754k7074
24447e0828A35278J9076J42767a40844A11784J39305I8238j3382f3727A00520
$$ plain form
24436 111407 -281846 -65385 170709 -66349 172924 15149 92540 70829 -54697 372295 -41066
24424 214837 -47484 132963 187524 127093 22452 50997 53863 -64319 134515 54826 166758
24413 166758 -269059 140144 10259 124243 292885 -80006 119142 -243637 -118870 56804
24402 246031 61225 -47456 -301066 108658 -176210 89152 -176267 -55540 -19345 113293
24391 -346273 188234 -33520 -166118 164571 19294 159096 -55459 -108066 319769 -452024
24380 -115029 -158069 -241716 62525 -125639 70222 48747 230441 -212165 -158364 170464 19729
24368 107457 -203292 -320704 245377 190626 -277008 49726 -124297 -92065 -171447 15492
24357 -134774 -41218 -12013 275505 56837 85476 -77919 -40846 -39152 -97897 -113006 -42358
$$ packed form
24436A11407b81846f5385A70709f6349A72924A5149P7391k1711e4697C72295d1066
24424B14837d7484A32963N4561o0431B2452K8545K866f4319A34515E4826J11932
24413A66758b69059A40144A0259J13984J68642h0006A19142b43637a18870E6804
24402B46031F1225d7456k53610A08658a76210H9152a76267e5540a9345A13293
24391c46273A88234c3520j32598A64571A9294J39802e5459n2607C19769d52024
24380a15029m3040q3647F2525a25639G0222k1475J81694b12165N3801A70464A9729
24368A07457b03292j17412B45377n4751b77008D9726a24297L2232p9382A5492
24357a34774d1218a2013B75505E6837K8639g7919L7073J694n8745j5109d2358
$$ plain form
24345 -12009 -107475 107009 32026 19085 -198391 -283288 172877 76378 70395 -81511 -56061
24334 -56061 -339905 -44821 -164883 113737 -8762 195068 222270 57324 -101757 27917 -427515
24322 185728 -350139 -114317 -78844 -25349 283859 -161078 117875 -102100 27919 -277258
24311 95847 26734 -43679 71105 -126792 -158851 -528784 -510 58042 -58697 46032 22249 229480
24299 229480 97620 156464 116062 -62765 25855 136718 -26038 -312503 -107418 -15486 -242535
24288 -242535 340968 19427 -38137 -56832 -270413 -160921 153891 -198885 -151475 -21640
24277 57004 219325 188892 -250800 197394 195787 73897 258341 -53423 -86449 111995 -132228
24265 277595 170253 100441 -19880 -146052 30217 -147459 361570 -336136 -153207 -185073
$$ packed form
24345a2009r5466A07009C2026j2941a98391q4897A72877G6378n983h1511K5450
24334e6061k83844d4821j20062A13737h762A95068K7202E7324a01757B7917d27515
24322A85728c50139a14317L5473b5349B83859a61078A17875a02100B7919b77258
24311I5847B6734d3679G1105a26792l2059l69933e10E8042e8697D6032B2249K07231
24299B29480I7620N8844m0402f2765B5855J10863b6038k86465a07418a5486k27049
24288b42535C40968A9427c8137j8695k13581J09492A53891a98885M7410b1640
24277E7004J62321l0433b50800A97394j607G3897J84444e3423l3026A11995a32228
24265B77595j07342o9812a9880j26172C0217a47459C61570c36136a53207l1866
$$ plain form
24255 -185073 -79862 -38937 -167006 206156 -52713 149860 76042 8203 -168316 -37805 27488
24243 -204392 -105286 82471 -45775 22239 52024 -236710 -197489 -264496 131431 -149009 -109967
24232 -109967 358241 -20931 -212703 23740 20030 -59339 -3006 150859 -71890 -79156 -44157
24221 -44157 -18760 -40681 -279559 -53032 45248 185867 134706 105796 67945 -151533 167539
24209 -42277 148470 25356 -224760 -141554 -99644 -121927 -6540 -179672 194303 204358 -412829
24197 185878 -52211 243917 -8003 -19473 -326803 8321 -46373 -228923 96863 195388 -5679
24185 330227 101729 107327 103580 -148161 -86586 -110547 -99022 42937 63233 291917 -86073
24173 58494 53583 -26028 180122 127714 132537 -122974 104802 5680 45113 472240 -279748
$$ packed form
24255a85073g9862c8937j28069B06156e2713A49860p3818H203a68316c7805B7488
24243b04392R9106H2471d5775B2239K9785b36710L9221o7007A31431a49009L9042
24232a09967C58241b0931j91772B3740l710e9339c006A50859g1890p266L4999
24221d4157a8760k1921k38878e3032D5248J40619n1161k8910l7851a51533A67539
24209d2277A48470B5356b24760Q3206M1910k2283f540j73132A94303J0055d12829
24197A85878e2211B43917h003j1470l07330H321d6373j82550I6863R8525e679
24185C30227A01729N598l747a48161O1575k3961J1525D2937K0296K28684h6073
24173E8494m911b6028A80122n2408M823a22974A04802E680L9433M27127b79748
$$ plain form
24161 109090 335395 -91535 149593 -92897 390579 125689 340566 115721 -26025 -125900
24151 -125900 132825 -421317 99384 -54245 391531 -49738 -173207 110097 -84748 119250
24140 -22474 -324223 -39008 -42374 -259495 -50655 73353 138743 -75700 -166158 -174251 145187
24128 -104814 69764 -10331 24819 88737 228237 -258387 178942 -272585 -8920 56153 -409810
24116 -104187 334696 -180325 -137714 54527 -27226 -36857 97877 -598 90134 23078 -71943 128828
24103 -279305 221976 -115095 -195383 77910 -276676 -123671 -33980 -407584 -33074 150567
24092 -449360 -85394 -190878 64665 117317 179287 326599 280357 -153924 78623 146952 62551
24080 406591 -49672 189490 -102244 -106985 -200367 201681 180254 175432 135386 157995 140631
$$ packed form
24161A09090K26305i1535A49593i2897C90579A25689K14877A15721b6025r9875
24151a25900A32825d21317I9384e4245C91531d9738j23469A10097h4748A19250
24140b2474l01749c9008l366k17121e0655G3353O5390g5700r0458q093A45187
24128a04814F9764a0331B4819O3918J39500b58387A78942b72585h920E6153d09810
24116a04187C34696a80325M2611E4527b7226r631I7877e98I0134B3078g1943A28828
24103b79305B21976a15095q0288G7910b76676a23671c3980l73604c3074A50567
24092d49360h5394j05484F4665N2652O1970J47312m6242a53924G8623O8329F2551
24080D06591d9672A89490a02244m741r3382B01681k1427m822m0046K2609j7364
$$ plain form
24069 140631 -88453 -116840 -13441 -15239 20949 -76842 -176343 -10274 146395 33828 -327231
24057 670 -190035 -19606 -89251 -10094 28116 78418 -46018 45880 -210146 64093 267010
24046 267010 -67580 104097 116903 -280060 -93883 140653 -86918 -39614 -29282 -77740 43269
24034 -195245 215933 317489 -313213 271765 -192761 -116369 -82519 -321454 -53557 296147
24023 214277 -212500 -35548 214101 -69351 42890 -45381 203402 264770 -123079 15031 -282493
24011 68272 -16251 151732 -6578 21764 -273146 -116224 -73825 -23588 252262 32353 52954
24000 52954 223052 -26189 274730 138056 -137249 -86414 -42243 -143770 177384 82187
23989 128554 40451 -230454 -141445 10735 191904 450163 -161456 -12102 165942 277284
$$ packed form
24069A40631h8453k8387a3441j798B0949g6842r9501a0274A46395C3828c27231
24057F70a90035a9606o9645a0094B8116N0302d6018D5880b10146F4093K02917
24046B67010f7580A04097J2806b80060i3883A40653h6918c9614J0332m8458D3269
24034a95245B15933J01556c13213B71765a92761P6392L3850k38935e3557B96147
24023B14277b12500c5548B14101f9351D2890d5381B03402O1368a23079A5031b82493
24011F8272a6251A51732f578B1764b73146a16224M2399b3588B52262C2353K0601
24000E2954J70098b6189B74730j36674a37249N0835d2243j01527A77384H2187
23989A28554D0451b30454Q9009A0735J81169K58259a61456a2102A65942J11342
$$ plain form
23979 277284 117299 -7339 -124569 148997 25500 -140958 -70493 -191482 31927 -341927
23968 136750 84281 -51202 -148265 272996 -109169 -70003 -32502 -72286 -94570 28422 191706
23957 191706 -224829 101812 809 -6559 195932 -213482 -283848 -418 262872 -162617 47077
23945 -152867 64633 -191427 -134132 31666 110231 -22150 142920 -62068 -56824 -148087 -147848 -159286
23933 -159286 -226734 82312 5850 53192 137540 -126758 -186764 -247043 132221 23423 77239
23922 77239 133474 -77001 305092 -25636 -231566 460 249622 117268 -151079 219031 89647
23910 99248 29514 -271680 -13959 -249451 -77004 24616 254808 -12387 152491 -188643 -64628
23898 -198873 70571 134046 43737 -35062 286022 -43202 -197735 -15131 252690 410606 -77891
$$ packed form
23979B77284A17299g339j17230A48997B5500a40958P0465j20989C1927c41927
23968A36750n2469e1202r7063B72996a09169L9166c2502l9784k2284B8422J63284
23957A91706b24829A01812H09f559A95932b13482p0366d18B62872a62617D7077
23945a52867F4633a91427N7295C1666P8565b2150A42920f2068N244r1263K39j1438
23933a59286o7448H2312E850M7342Q4348a26758o0006o0279A32221B3423N3816
23922G7239N6235g7001C05092b5636k05930D60K49162A17268a51079B19031H9647
23910I9248B9514b71680a3959k35492g7004B4616K30192a2387A52491a88643f4628
23898a98873G0571O3475D3737c5062B86022d3202j54533a5131B52690J57916g7891
$$ plain form
23886 -55512 -190635 189108 253020 -88076 -56668 -98825 -174439 -160053 207672 65890 -365729
23874 -144922 -24813 -150343 -190841 -80629 -173488 -48115 199957 -112783 180265 -171880
23863 -35517 133976 -492334 -149654 93690 -53915 219406 374110 -131435 259402 253656
23853 253656 -225988 178087 44274 245642 207385 19402 29585 35211 -42234 359689 -151086
23841 48718 -41942 102337 -91154 -98702 178810 143769 87782 115416 -397621 111868 -281050
23829 -34607 -46449 5547 -115587 -72402 -38222 -7958 21027 -168004 -7988 54563 -104281 -61726
23817 -61726 192576 -72988 74330 -67340 -119355 -67051 -348968 -35422 -107638 -78586 8548
23805 -417010 88646 -73243 288380 117358 151755 -101478 145750 -155545 -170962 354502
$$ packed form
23886e5512j35123A89108O3912h8076L1408m2157p5614J4386B07672F5890c65729
23874a44922b4813j25530m0498h0629r2859d8115A99957a12783A80265a71880
23863c5517A33976d92334a49654I3690e3915B19406J54704a31435B59402n746
23853B53656b25988A78087D4274K01368l8257A9402J0183N626d2234C59689a51086
23841D8718d1942A02337i1154p548A78810l5041n5987K7634c97621A11868b81050
23829c4607j1842E547a15587M3185L4180g958B1027a68004g988E4563a04281M2555
23817f1726A92576g2988G4330f7340n2015N2304k81917c5422p2216K9052H548
23805d17010H8646g3243B88380A17358L4397a01478A45750a55545j5417C54502
$$ plain form
23794 -83022 -404252 172424 -68566 216643 -98536 -371719 16468 235530 -188870 -24791
23783 164837 157567 -163819 -23066 292086 28440 122083 194354 145705 -175259 -96692 -19919
23771 -139743 -98212 -147133 156093 -12045 -193937 461999 90211 -230472 -297246 -366276 110385
23759 -286960 67341 110705 -190825 -62767 59954 106538 -213412 -84689 79282 -269268 329512
23747 9212 -94061 149987 131442 -44675 -332532 -148451 -458131 72094 81582 15845 55739
23736 55739 417434 -97810 103234 -240842 54806 -39890 -26616 99038 -8092 -115520 81774
23724 -160105 4211 -293963 -121845 84433 -74938 61167 -120659 -260153 279577 157483
23714 157483 118069 -163066 -53220 -56197 241618 309683 -207411 -79670 107628 265410 -302528
$$ packed form
23794h3022l21230A72424f8566B16643i8536k73183A6468K19062a88870b4791
23783A64837p270a63819b3066B92086B8440R3643P2271m8649a75259P8567a9919
23771a39743M1531m8921A56093a2045j81892D61999I0211b30472o6774o9030A10385
23759b86960F7341M3364a90825f2767E9954M6584b13412h4689G9282b69268C29512
23747I212i4061A49987j8545d4675k87857a48451l09680G2094R488A5845L9894
23736E5739L61695i7810A03234b40842E4806c9890J3274I9038h092j07428H1774
23724a60105D211b93963a21845H4433g4938F1167a20659j39494B79577j22094
23714A57483l9414a63066e3220k977B41618O8065b07411g9670A07628J57782c02528
$$ plain form
23702 133785 -262493 -14489 143485 42307 -106902 85206 148517 -151223 -78123 -287251
23692 -287251 33590 142442 140540 -203912 -29511 -134619 167371 29127 -5901 414021 -110502
23680 -100002 197992 262111 -32099 230703 251563 -55881 -165749 -415907 256844 10153
23669 -132656 77901 145691 -92451 213481 -91905 18022 -115258 86030 -38572 191754 26286
23657 -213187 -10060 44613 -3453 183473 -151481 144174 77217 46768 90939 -136236 34055
23645 57231 -173652 69246 448616 16129 145095 13965 189741 -16215 -84898 95092 -41466
23633 -226643 -200500 63747 -267764 -112490 -159166 172909 87836 -253109 45582 30061 -148835
23621 -239042 204428 -382058 251144 -5395 -97315 -107551 -109042 -311443 -211436 266411 221254
$$ packed form
23702A33785b62493a4489A43485D2307a06902H5206O3311a51223P3100k09128
23692b87251C3590J08852j902b03912b9511j05108A67371B9127e901D14021a10502
23680a00002A97992O4119c2099B30703K0860e5881j09868k50158B56844A0153
23669a32656G7901O7790i2451B13481i1905A8022a15258H6030c8572A91754B6286
23657b13187a0060D4613c453A83473a51481A44174o6957l0449M4171a36236C4055
23645E7231a73652F9246L79370A6129J28966A3965J75776a6215o8683I5092d1466
23633b26643K6143F3747b67764a12490m6676A72909q5073b53109D5582j5521a48835
23621b39042B04428c82058B51144e395r1920j0236j491k02401J00007B66411m5157
$$ plain form
23610 221254 -327772 -14425 -112378 -244622 -106300 326236 -246571 187234 -309591 -351556
23600 -351556 -132419 96441 219842 -25164 -134467 94682 -122649 163959 344287 64843
23589 -41340 -280846 64576 80507 -14476 -170813 101119 232826 4022 203992 422299 27723
23577 54248 61376 -27588 35118 -436759 105559 195488 528 170797 -173833 272796 -97573
23565 37475 61719 116094 85307 297259 247553 149905 -135153 -83271 -288027 260651 -43698
23553 100438 -215110 28429 -192933 199190 189810 -259688 66065 -118791 -192826 -281361 53196
23541 -194346 -144886 8897 -139326 -98186 -233377 243664 -177200 -161512 -252898 53736 -562866
23529 146856 325337 67385 -266390 65913 89412 47877 68955 -1879 -142165 312019 -378946
$$ packed form
23610B21254c27772a4425r7953j32244a06300C26236b46571A87234c09591m1965
23600c51556a32419I6441J23401b5164j09303I4682a22649A63959J80328F4843
23589d1340k39506F4576J5931a4476j56337A01119J31707D022J99970K18307B7723
23577E4248P128b7588C5118d36759A05559Q9929E28J70269a73833B72796i7573
23565C7475K4244N4375l0787K11952m9706r7648a35153N1882k04756B60651d3698
23553A00438b15110B8429a92933A99190r380b59688F6065a18791p4035q8535E3196
23541a94346M9460H897a39326M1140j35191B43664a77200J5688r1386E3736e62866
23529A46856J78481F7385b66390F5913K3499m1535K1078a879j40286C12019c78946
$$ plain form
23517 69353 -80708 -137578 56526 -44635 269486 140003 77038 -126314 -142648 58476 17539
23505 -233067 67868 30051 -5697 -19421 -279219 159839 -179087 -56184 2892 -472463 43079
23493 -130460 -300257 51992 -23135 84109 165252 264950 37605 -127269 -202214 161919 -35165
23481 129744 -159792 122719 -83095 -510410 75319 -51943 -72990 -259839 271162 132113
23470 367148 11242 283128 72529 -134019 -125564 90422 -212236 -106868 -73878 -75971 180973
23458 215304 84183 -238813 2700 19113 41071 -66617 31680 143192 -93421 597999 273155
23446 194738 -86203 -275426 -59107 -82316 31927 53032 205739 45490 -396281 66008 -287338
23434 64935 -172580 -163764 -38956 167269 -95514 -278516 -156400 53643 -115099 -16258 235841
$$ packed form
23517F9353h0708n6870E6526d4635B69486j29483o2965a26314j6334E8476A7539
23505b33067F7868C0051e697j3724k59798A59839a79087e6184B892d72463D3079
23493a30460j69797E1992b3135H4109Q1143R9698C7605a27269p4945A61919c5165
23481A29744a59792A22719h3095m27315G5319e1943k1047j86849B71162A32113
23470C67148A1242K71886G2529a34019Q455I0422b12236J05368L2990k093A80973
23458B15304H4183b38813B700J6413K1958f6617C1680J11512i3421E97999B73155
23446A94738h6203j89223e9107k3209C1927K1105J52707D5490c96281F6008b87338
23434F4935a72580Q816c8956A67269i5514j83002J22116E3643a15099a6258B35841
$$ plain form
23422 53408 -331269 -170395 -148901 -117709 -40937 -77696 63261 360614 90118 -15659 138275
23410 -25922 -91821 -51991 -173620 -199071 -106368 59451 82274 -332163 -169434 132841 453109
23399 453109 194404 121712 -5510 -146096 98175 123892 106153 -68537 105611 -74070 -36177
23387 172919 -9989 115999 1800 -126932 -153051 152905 -109192 123999 91730 -205625 -36975
23375 49986 207276 -222374 182777 -331162 -12900 75342 119222 -233465 96345 -72767 204868
23363 -110961 -286484 2736 -34874 135944 -115 -347982 -198920 -7871 -6252 5016 59379 93072
23351 93072 -221104 -108738 -172303 8521 -237304 -264586 206959 -29022 -243804 75695 -157470
23339 11535 -195327 -205364 -268629 -263231 -164424 203096 -112700 -124020 -397452 -211036 -278869
$$ packed form
23422E3408c31269J60874K1494L1192d0937l6759F3261K97353I0118a5659A38275
23410b5922o5899L9830j21629k5451R2703E9451K2823c32163J62729A32841L20268
23399D53109A94404p2692e510j40586I8175K5717j7739f8537A05611g4070c6177
23387A72919i989A15999A800a26932k6119A52905a09192A23999l2269b05625c6975
23375D9986J57290b22374A82777c31162a2900G5342M3880b33465I6345g2767B04868
23363a10961j75523B736c4874A35944a15l47867J49062g871J619E016N4363L3693
23351I3072b21104a08738o3565H521b37304k7282B06959b9022k14782G5695a57470
23339A1535a95327j0037o3265N398R8807B03096a12700j1320k73432J86416o7833
$$ plain form
23328 -278869 -186625 -209212 -12605 -314894 -48731 -45348 -303700 130785 -47570 51414 -87889
23316 -1311 -203982 -159247 150838 -237473 -152927 89931 208103 30455 -100135 173528 -203257
23304 -146893 -24283 98898 -185571 85886 216758 22944 210110 -77338 -67436 81068 324216
23293 324216 213619 164212 85067 125830 -84522 -14721 97149 127487 71455 200654 95044
23281 -98630 -132198 -412894 -60256 -8809 -125369 100404 98102 -252151 18569 54040 106905
23270 106905 82641 90153 184437 -144612 -355738 124667 72095 -191959 161418 -183041
23259 4289 -20108 8884 -118832 -377593 155891 105021 80123 -194480 -110946 -298624 -191888
23248 -191888 -70068 -139369 -37849 -306646 150904 220191 -1190 -60687 -10739 -163434 7488
$$ packed form
23328b78869R2244k2587a2605l02289d8731L383k58352A30785d7570E1414h7889
23316a311k02671M4735A50838b37473Q4546H9931J18172C0455a00135A73528b03257
23304a46893b4283I8898a85571H5886J30872B2944J87166g7338R902H1068K43148
23293C24216j10597m9407p9145M0763h4522a4721I7149L0338n6032J29199I5044
23281i8630l3568k80696f0256h809j16560A00404k302b52151A8569L5471N2865
23270A06905k4264P512R4284a44612k11126A24667n2572a91959A61418a83041
23259D289b0108H884a18832k58761A55891n0870k4898a94480Q3534j87678J06736
23248a91888g0068o9301c7849k68797A50904O9287a190n9497a0739j52695G488
$$ plain form
23236 -253412 144556 -113218 117568 -18315 -342535 64027 -20113 -291875 46777 94820
23226 94820 363353 169186 -94801 129022 74981 14375 44413 -45964 149795 218208 4412
23214 -86458 162013 93693 -159890 36686 -51454 -53908 -325826 19967 238056 -181505 -272789
23203 -272789 254294 -77571 -3925 21348 164195 96332 -114326 -127639 -230862 -18257 -296496
23192 -296496 96078 -261613 -284598 48867 -114173 30879 -206742 104394 -151973 -229493
23182 -229493 -33028 -110859 165539 301210 131828 -17610 285815 -64388 64155 70747 -505809
23170 -143470 -104496 75545 -171031 -78625 66386 -70953 -198559 -101149 277405 200797 384624
23159 384624 -264579 -169376 -377478 101020 108512 -60651 -192088 85886 -112022 115182
$$ packed form
23236b53412A44556a13218A17568a8315l24220F4027b0113k71762D6777M8043
23226I4820K68533A69186i4801A29022n4041A4375L0038d5964A49795O8413D412
23214h6458A62013o8320a59890C6686e1454k454k71918A9967K18089a81505r1284
23203b72789B54294g7571c925B1348J42847o7863a14326j3313j03223a8257k78239
23192b96496I6078b61613k2985D8867a14173C0879b06742A04394a51973p7520
23182b29493c3028p7831A65539J35671A31828a7610B85815f4388F4155O592e05809
23170a43470L8974G5545a71031g8625F6386g0953j27606R7410B77405p6608J83827
23159C84624b64579R5203k08102A01020P492f0651j31437H5886a12022A15182
$$ plain form
23148 -250661 -91307 -163858 -79136 177824 89903 125661 -61615 169374 -122994 -32860 -89668
23137 -89668 -10681 221516 -7799 27272 -302767 -273935 -397910 52923 112234 205054 -290002
23125 127712 -19394 -123248 402416 -333732 -79482 -2149 -37107 -133078 -156094 159981 -277214
23113 243365 -191221 -166857 143919 47063 40373 239217 29438 30753 288700 198183 123499
23102 123499 -247466 306585 -71545 190110 247339 -201331 382951 -136400 -392342 20752
23091 106461 31366 101421 -60694 -276793 -331629 -246553 493343 90305 84212 143185 162352
23080 162352 -183853 32582 -166898 248503 -136462 61506 -11598 -192871 -304856 -320287
23070 -320287 -245229 -151380 -57671 -179572 -447444 -180525 182361 -100800 -36047 171410
$$ packed form
23148b50661i1307p2551g9136A77824q7921L5758f1615A69374a22994c2860n6808
23137h9668a0681B21516g799B7272c02767K8832j23975E2923N9311R2820b90002
23125A27712a9394j03854D02416c33732g9482b149l4958r5971k3016A59981b77214
23113B43365a91221K4364A43919D7063o690J98844B9438J315K57947r0517p4684
23102A23499b47466C06585g1545A90110N7229b01331C82951a36400k55942B0752
23091A06461C1366P0055f0694k16099n4836Q5076D93343I0305o093N8973J9167
23080A62352a83853C2582a66898B48503a36462F1506a1598j81273j11985j5431
23070c20287P5058R3849e7671j21901k67872a80525A82361a00800c6047A71410
$$ plain form
23059 78525 116083 -148401 45459 -113824 -287040 -282238 55525 -156216 180419 64168 -177003
23047 -166210 119114 -210219 115034 172475 -303422 -7011 129573 -30233 83402 -147400
23036 -53184 -287516 104735 -245617 474936 -4086 -84437 233284 -125877 342361 -194255
23025 93270 187550 85885 -26941 -46964 382198 -344112 -224991 -273292 -206313 -45127 -245426
23014 -245426 -282456 106334 -4742 -41248 -231212 -79293 50899 69842 -45935 -34881 -96019
23003 -96019 118607 17304 265508 -202239 49731 -407695 -23127 112539 -41924 77116 132592
22992 132592 180625 123789 -199120 -21270 264486 -104968 -128092 245330 -70826 -21168 -287127
22981 -287127 -39459 -238974 114054 -64889 -46162 -96183 -165563 203193 -284412 -236177 -126631
$$ packed form
23059G8525L7558a48401D5459a13824j73216M802E5525a56216A80419F4168a77003
23047a66210A19114b10219A15034N7441c03422g011A29573c0233H3402a47400
23036e3184k34332A04735b45617D74936d086q0351B33284a25877C42361a94255
23025I3270R4280H5885b6941k0023C82198c44112J19121m8301O6979d5127k00299
23014b45426l7030A06334d742l6506j89964g9293E0899J8943d5935J1054o1138
23003i6019A18607A7304K48204b02239D9731d07695b3127A12539d1924G7116N5476
22992A32592M8033n6836a99120b1270B64486a04968k3124B45330g0826b1168k65959
22981b87127c9459j99515A14054f4889J8727n0021o9380B03193b84412M8235J09546
$$ plain form
22970 -126631 111964 -120219 43986 -147166 -4236 -117637 -74155 -3993 -78546 -177754 187587
22958 195273 32811 196910 -13266 -48473 -250593 -310713 -207616 -298676 -131354 -30869 83165
22946 -67431 -223096 -44384 81500 -285341 -76436 -14701 20806 57239 27456 -9093 189687
22934 8310 -78880 -91951 146853 200992 123225 -270864 45778 -119012 -158117 -7820 62457
22922 -50079 65404 126067 126733 213525 104405 6295 -203602 79150 111632 324298 9111 44618
22910 44618 60637 -333772 154035 -295093 146902 171688 268226 171567 -193300 1019 -308393
22898 126563 -173224 -55075 -210724 -41662 -215036 16902 18340 117772 -208403 50043 149287
22887 149287 171737 -32767 255949 14882 174936 -35121 -224515 273652 205907 143188 30139
$$ packed form
22970a26631A11964a20219D3986a47166d236j13401M3482c993p4553r9208A87587
22958A95273C2811J64099a3266l5207k02120o0120J03097r1060a31354c0869H3165
22946f7431j55665d4384H1500b85341g6436a4701B0806L6433B7456i093A89687
22934H310g8880j3071A46853N4139p7767b70864D5778a19012l9105g820F2457
22922e0079F5404O0663O66Q6792A04405F295b03602G9150L2482K12666I111L5507
22910D4618J6019c33772A54035b95093A46902K4786R6538r6659a93300A019c08393
22898A26563a73224e5075j55649d1662j73374A6902J438R9432b08403E0043R9244
22887A49287K2450c2767B55949A4882J60054c5121j89394B73652o7745o2719C0139
$$ plain form
22875 417447 117069 128174 99855 16455 -192623 59980 -179922 70882 -234728 94876 75590
22864 75590 112808 311558 76703 78249 -226541 -104622 -98962 -224089 -151212 259536 -70036
22852 -238181 141449 153345 -283054 -77886 -42514 -60144 -184269 -167826 -67953 -31953 -35488
22841 -35488 107972 52594 16787 -86317 -124282 -198884 -282748 -9109 118695 95032 52101
22830 52101 -234687 160870 296322 187603 -116984 -123674 165772 -223351 -180820 31766
22819 -311555 320493 137454 -82590 -62457 -176747 21546 14266 -123621 -27065 -259105 -68892
22807 -49655 -72964 -122195 -65236 -63746 -152986 -106953 -236409 78395 -64823 -351894 -100078
22795 -5134 -148880 -46355 298479 271080 -9193 -251801 101223 287093 45491 33393 301331
$$ packed form
22875D17447A17069J1105k8319A6455a92623E9980a79922G0882b34728I4876j9286
22864G5590L7218J98750G6703J546b26541a04622N660j25127P2877B59536g0036
22852b38181A41449J1896b83054g7886L5372j7630j24125J6443f7953c1953l535
22841c5488A07972E2594A6787h6317l7965p4602q3864i109A18695k3663m2931
22830E2101b34687A60870J35452j08719a16984o690A65772b23351M2531C1766
22819c11555C20493A37454h2590K0133j14290B1546p280a23621b7065k32040f8892
22807d9655k3309m9231N6959J490q9240M6033j29456G8395f4823k87071a00078
22795e134j43746d6355B98479k7399i193k42608A01223J85870D5491j2098K67938
$$ plain form
22784 301331 -342767 -94146 64419 -33795 -126091 10735 -358525 -70261 99479 90550 -31212
22772 -11815 -199947 -18880 70706 137974 41882 -199736 79912 27381 144818 -16975 -229414
22761 -229414 395290 255970 -177306 -25750 -64507 -231028 110397 95212 377146 -234323
22750 188266 -216887 107516 275236 41872 -200618 162742 172519 265692 -4464 57456 -272893
22738 -107055 -192151 -196289 94520 104680 -71792 18230 -159785 -51850 -112306 -61904 96115
22726 104905 152583 -260117 -131333 -409786 -351755 77143 25072 -252092 -265722 -18862 80353
22714 -21538 -180396 -1415 -271568 -10396 -114989 -306005 -264953 -140931 -179411 -264440 163295
22702 11103 217239 44983 -115881 -211526 170284 -235266 -80844 130695 192915 -72420 27323
$$ packed form
22784C01331c42767i4146F4419c3795r2296A0735c58525g0261I9479q929c1212
22772a1815j88132a8880G0706O7268D1882a99736G9912B7381J17437a6975k12439
22761b29414C95290j39320a77306b5750l8757j66521A10397j5185K81934b34323
22750A88266b16887A07516J67720D1872b00618A62742R777R3173d464E7456b72893
22738a07055q5096m138I4520J0160g1792A8230a59785e1850o0456N0402I6115
22726A04905M7678b60117J28784k78453N8031G7143B5072b52092j3630a8862H0353
22714b1538j58858a415k70153a0396j04593j91016M1052J24022l8480q5029A63295
22702A1103K06136D4983a15881r5645A70284b35266h0844A30695O2220g2420B7323
$$ plain form
22690 -35299 106975 123694 -221453 -30349 -308015 115438 -166280 -4397 -5029 66461 21905
22678 -238467 137535 -159751 4722 146977 -185845 -195120 -56975 -20444 178042 96419 -411557
22666 105307 -15976 133817 181083 25818 -26066 146949 -91840 -88259 104423 -31965 -70654
22655 -70654 -376281 -326300 -227903 -155984 -305826 -175826 -3851 -66906 169450 -123981 -91812
22644 -91812 72731 58058 56324 3546 54893 -116087 -166138 -149139 -238929 -53219 111437 65414
22632 65414 102563 -164767 20811 75230 -8414 502522 -278952 -45025 -71077 77228 89641
22621 89641 -134236 77957 -75974 -34799 -169511 -59731 36626 193889 -22524 139166 85551
22610 85551 -282303 -283473 83270 -20962 313448 -563079 38012 -12342 -216921 349272 490
$$ packed form
22690c5299A06975J6719b21453c0349k77666A15438a66280d397o32F6461B1905
22678b38467A37535a59751D722J42255a85845r275e6975b0444A78042q1623d11557
22666A05307a5976A33817M7266B5818b6066A46949i1840L581A04423c1965l8689
22655g0654l05627M9981R8397P1919j49842J30000c851o3055A69450a23981L2169
22644i1812G2731j4673j734C546N1347a16087n0051J6999q9790e3219A11437m6023
22632F5414L7149a64767B0811N4419h414E02522b78952d5025k6052G7228J2413
22621H9641a34236G7957g5974c4799j34712e9731C6626J57263b2524A39166n3615
22610H5551b82303j170H3270b0962C13448e63079C8012a2342k04579C49272D90
$$ plain form
22598 31855 -181221 114184 -207594 12139 -125574 4745 -95112 135423 -326445 -113163
22587 -231690 -71349 7302 -99177 328557 291315 36670 32383 -41727 -21298 127211 58290
22575 -153621 -135116 -176970 33544 -156232 96275 71582 -32653 42489 -176798 118938 -214425
22563 108863 75540 -84411 -90767 59299 141597 333701 -92319 -404324 -233796 -156702 -146433
22552 -146433 273073 294436 -525536 -50679 -2945 -128085 19673 -21581 -87564 -156839 -227961
22541 -227961 -230483 -156534 9037 -129722 -6985 34519 63975 -81906 -260369 128701 -54758
22529 4465 501058 18955 134360 162528 -249588 -241268 277716 -151370 -101106 198738 97690
22517 87868 40181 -80905 230991 -296438 -199379 -86736 -27609 -139470 50999 -14674 -157811
$$ packed form
22598C1855a81221A14184b07594A2139a25574D745i5112A35423c26445a13163
22587b31690g1349G302i9177C28557l7242C6670m287d1727K0429A27211E8290
22575a53621J8505m1854C3544a56232I6275k4693c2653D2489a76798A18938b14425
22563A08863l3323h4411o356E9299Q2298J92104i2319l12005J70528P7094J0269
22552a46433B73073K1363e25536e0679b945j25140A9673b1581o5983o9275p1122
22541b27961k522P3949I037a29722f985C4519K9456h1906j78463A28701e4758
22529D465M96593A8955J15405K8168b49588Q320B77716a51370N0264A98738I7690
22517H7868D0181h0905B30991b96438R7059h6736b7609j11861E0999a4674j43137
$$ plain form
22506 -157811 175 176517 -12806 -326909 -51583 301257 -184676 26560 -143991 62639 37085
22495 37085 242720 318991 104767 -138932 102658 90530 -45298 -324335 259862 260785 239989
22484 239989 -57211 -270978 50197 163939 175403 266663 373384 -21947 55785 134220 140324
22473 140324 -8616 -117756 -2189 -120469 -272599 186290 -146642 -234520 -175207 -216063 50356
22461 -142452 21934 -82823 188675 21193 303850 267192 75923 -19685 -144577 -302475 -120278
22449 155163 54752 33824 -27565 -54328 -78961 -154797 -116095 237183 -386097 -24830 -141397
22438 -141397 -177613 -130406 152785 -391145 -84597 68558 242042 60648 -90711 -106529 -100270
22427 -100270 -127424 216594 182719 14161 -203561 -104634 -255688 -331718 -39383 -63134 52696
$$ packed form
22506a57811A75J76342a2806l14103e1583C01257a84676B6560a43991F2639k5554
22495C7085K05635P6271A04767a38932A02658j2128d5298k79037B59862R23k0796
22484B39989e7211k13767E0197J13742J1464R1260J06721b1947E5785P8435O104
22473A40324h616j09140b189j18280j52130A86290a46642q7878N9313m0856E0356
22461a42452B1934h2823A88675B1193K82657l6658G5923a9685j24892j57898a20278
22449A55163E4752k0928b7565k6763k4633p5836L8702B37183c86097b4830j16567
22438a41397l6216M7207A52785c91145h4597F8558J73484F0648i0711j5818O259
22427a00270k7154B16594l3875A4161b03561R8927j51054p6030c9383k3751E2696
$$ plain form
22415 -50481 -257487 -284175 -133018 -265404 149692 181569 -37902 60391 -180131 -233260 -208654
22404 -208654 -78127 -16469 -181280 -123609 -2464 50524 -323301 287270 -1094 156740 -67696
22392 70929 -98366 45063 -23479 59749 207846 -104087 -110284 -13790 -283352 99559 -7386
22380 249808 176016 66020 -162838 -446318 -162425 -152194 55666 -104155 113213 36259
22369 226314 -204360 -117231 63675 36895 -276286 -285503 25253 -251298 245400 73169 -371975
22357 99739 -315258 94289 30491 108447 209 -123053 91560 -4945 37247 -168716 -200240 85569
22344 -32075 -117519 137187 50979 -253598 -103344 -328313 -311592 46195 149810 49363 -55919
22332 338834 -294221 244971 -234315 249518 177375 50410 -196237 -129135 -60907 -162482
$$ packed form
22415e0481k07006k6688a33018j32386A49692L1877c7902F0391a80131n3129K4606
22404b08654g8127a6469j64811N7671b464E0524c23301B87270a094A56740f7696
22392G0929i8366D5063b3479E9749J48097a04087o197a3790k69562I9559g386
22380B49808p3792F6020a62838k83480a62425J0231E5666a04155A13213C6259
22369B26314b04360Q7129F3675k6780b76286r217B5253b51298B45400G3169c71975
22357I9739c15258I4289C0491P7956B09a23053I1560d945C7247a68716l1524H5569
22344c2075q5444A37187E0979b53598a03344k24969J6721D6195J03615D9363e5919
22332C38834b94221B44971b34315B49518p2143E0410a96237O7102f0907j01575
$$ plain form
22322 -162482 110611 -326632 133224 -186534 -85829 -95519 -217250 122606 -242783 -138683
22312 -138683 -7205 -231194 -62369 -33178 -300789 -7432 153981 108121 -16216 -23192 109407
22300 -258267 -11825 -124563 213710 79064 149579 -181914 -54053 7096 -145362 -251237 -15063
22288 -115298 -39937 210409 46352 110079 216198 -48277 3863 -203521 -212089 42561 -197337
22276 305822 -265006 216378 84850 108337 -53488 -229339 -133060 10531 14513 20114 51873
22265 51873 -100684 161081 102386 -138513 -64561 -171595 412988 -152128 -193440 -43043
22254 -197261 142824 -52812 -58433 -323763 -60085 -194470 -62925 214110 -210891 -217095 244847
22242 -38072 -121666 118173 -59938 -89084 -188580 -147427 -279375 -98918 -167134 -235041 195641
$$ packed form
22322a62482A10611c26632A33224a86534h5829r690j21731A22606b42783J04100
22312a38683g205k23989f2369K9191k67611g432A53981m5860a6216o976A09407
22300b58267a1825j12738B13710G9064P0515a81914e4053G096a45362j05875a5063
22288a15298c9937B10409D6352O3727J06119d8277C863b03521q568D2561a97337
22276C05822b65006B16378H4850K3487e3488j75851R6279A0531L982N601L1759
22265E1873a00684A61081n8695a38513f4561j07034D12988a52128m1312d3043
22254a97261A42824e2812n621k65330f0085j34385f2925B14110b10891o204B44847
22242c8072q3594A18173e9938k9146r9496M1153j31948i8918o8216o7907A95641
$$ plain form
22230 -112015 90111 -205816 -231700 105123 -180654 198820 -69207 372745 53883 -307492
22219 -132505 -10609 -84290 63912 15910 -194523 80377 -262402 -74298 -67740 179276 20875
22207 -16481 343705 70199 -133141 271046 78085 -47061 -308287 -160535 174950 -3846 -109598
22196 -109598 187919 87125 -157811 202473 -80724 -257917 -86007 -74555 -102404 -311768
22186 -311768 10957 -96387 20972 -8930 -160419 41013 84101 174213 -113832 -362720 109299
22174 -46343 -182357 -178356 -102782 17967 115830 54223 -27248 -266960 73064 -418535 209139
22162 -162944 -157647 205859 -183841 -255165 -3521 48924 -117604 16395 -175756 -152990 -176544
22151 -176544 -115020 -168440 270113 -34189 -73924 -209910 100811 -47213 -195641 17496 1525
$$ packed form
22230a12015I0111b05816k5884A05123a80654A98820f9207C72745E3883c07492
22219a32505a0609p3681F3912A5910a94523H0377b62402g4298O558A79276B0875
22207a6481C43705G0199a33141B71046G8085d7061k61226J47752A74950c846j05752
22196a09598A87919H7125a57811B02473h0724j77193h6007J1452k7849k09364
22186c11768A0957i6387B0972h930j51489D1013M3088R0112a13832k48888A09299
22174d6343j36014M001P5574A7967R7863E4223b7248k39712G3064d18535B09139
22162a62944N297B05859a83841p1324c521D8924a17604A6395a75756K2766k3554
22151a76544O1524n3420B70113c4189l9735j35986A00811d7213j48428A7496A525
$$ plain form
22139 -27676 -8485 2979 166207 101322 216476 -57407 -174688 -161374 127764 -75896 -115547
22128 -115547 -257778 92934 54964 -37173 -359130 -10224 236609 -302780 238852 -74818
22117 -258794 20766 253811 172062 -52256 -159187 -117265 32313 72647 -162725 84580 36971
22105 116539 169974 -220130 226159 -104319 99472 -138488 366111 -199045 -276485 -218964
22095 -218964 -68819 -27537 -71686 4072 75112 -233986 -6378 -190331 -348099 154879 20925
22083 -389672 149051 -203251 -68252 -249746 -95171 -101178 -112872 -30451 372106 -175400 90794
22071 -106138 -11947 13194 -58211 -6416 -237618 -52345 -114839 30365 -48551 -44542 -41560 118370
22058 62509 161703 -424648 -246212 -74520 46856 257299 45999 -40771 -175945 -87489 -5604
$$ packed form
22139b7676h485B979J63228o4885J15154e7407j17281J3314A27764g5896l9651
22128a15547j42231I2934l7970c7173l21957a0224B36609c02780B38852g4818
22117b58794B0766K33045q1749e2256j06931M1922C2313M0334a62725H4580C6971
22105A16539N3435b20130B26159a04319I9472a38488C66111a99045p7440N7521
22095b18964f8819b7537m4149D072P1040b33986f378j83953j57768A54879B0925
22083c89672A49051b03251f8252j81494i5171o007j1694c0451C72106a75400I0794
22071a06138a1947A3194e8211f416k31202e2345o2494C0365d8551M009K982A18370
22058F2509R9194d24648J78436g4520D6856K10443D5999d0771j35174h7489e604
$$ plain form
22046 -57224 234552 -195348 168278 71980 -34511 404138 25474 45742 -71366 -233849 -127531
22035 -127531 83619 -201446 27803 132331 65370 -110651 173923 -198486 -66194 -132309
22025 -132309 -67858 172210 78197 -6801 -114662 310693 366070 8166 213530 74002 91113
22014 91113 -123889 -43647 -142854 48943 -180670 -40406 -20381 -115633 -324782 50286 -162701
22002 -236339 -101116 -12039 -213940 317580 185259 -60663 211763 220002 -116858 125079
21991 -154088 -205433 -500809 78555 214710 14639 -216196 -212309 57214 -109677 -178442 36942
21979 241452 -55022 66897 -209062 295227 -120550 -81427 249113 -21682 30897 247800
21969 247800 -130174 -57115 -70336 11629 24342 215105 -92145 -204888 -41555 -51699 157255
$$ packed form
22046e7224B34552a95348A68278G1980c4511D04138B5474K0268g1366j62483J06318
22035a27531H3619b01446B7803J04528F5370a10651A73923a98486f6194o6115
22025a32309O4451A72210G8197f801j07861C10693N5377H166K05364G4002J7111
22014I1113a23889d3647r9207D8943a80670d0406K0025r5252k09149E0286a62701
22002b36339a01116a2039k01901C17580j32321f0663B11763Q239a16858A25079
21991a54088n1345k95376G8555J36155A4639b16196L887E7214a09677o8765C6942
21979B41452e5022F6897b09062B95227a20550L9123B49113b1682C0897K16903
21969B47800a30174e7115j3221A1629J2713J90763i2145j12743d1555j0144A57255
$$ plain form
21957 -85533 -34044 21132 -315759 -242796 -23953 -276632 -43178 -51894 -113598 52415 82459
21946 82459 -252336 5926 -264368 -152766 32540 65150 -37247 153879 57610 227603 83483
21934 -57371 54454 -70289 -212738 -220919 -298995 240413 -66982 -237671 160207 183772 13567
21922 -34157 -150702 455942 -78863 -155370 -113026 -136682 -25484 184942 -151221 12065 52585
21911 52585 -129361 -294364 -167539 83141 137793 149827 -251586 -317540 -123485 -223695
21901 -223695 -85530 -126923 -417197 35247 9796 197234 10510 -183547 -252113 -148102 90517
21889 19548 -224402 70468 26326 112379 301178 -7769 -107617 47662 75193 359156 -314079
21877 -33380 74748 21881 -88183 -89207 273376 -174505 75191 28953 -101916 -371829 195596
$$ packed form
21957h5533c4044B1132c15759P2963b3953k52679d3178q716o1704E2415L0044
21946H2459b52336E926b64368J11602C2540L2610c7247A53879E7610J69993H3483
21934e7371E4454g0289j42449q181p8076B40413f6982j70689A60207K3565A3567
21922c4157j16545D55942g8863p6507M2344k3656b5484A84942a51221A2065M0520
21911E2585a29361j65003J26825H3141N4652J2034b51586o5954a23485j00210
21901b23695h5530m1393k90274C5247I796J87438A0510a83547o8566J04011I0517
21889A9548b24402G0468B6326Q6053J88799g769r9848D7662K7531K83963c14079
21877c3380G4748B1881h8183j024B73376a74505G5191B8953a01916k69913A95596
$$ plain form
21865 8844 53651 275130 157 -6235 -67554 72115 371009 171249 -257422 -38893 -264594
21854 -264594 -223757 104072 220833 -18726 -221297 -212189 -90207 -137137 -53120 297321 -76282
21842 265749 -103496 12077 1676 39278 334612 185119 -94244 -80366 -8884 -211628 -175637
21831 -175637 -71841 -19448 3706 -333892 176203 200059 -83453 124769 -222169 253845 34523
21819 73950 94262 -96142 -166657 -84372 -329291 11551 -21508 -250155 95807 -158289 -170405
21808 -170405 -108137 -162492 -318093 -210514 -243488 75890 -94117 -120392 44686 -151549 290489
21796 -149691 -45598 175180 -43473 -258689 -94592 -147400 -109428 -238741 -219861 78171 74857
21785 74857 -60385 -25129 120405 -308420 -138439 76910 132469 151490 -195227 -387945 -340058
$$ packed form
21865H844M4807K21479A57f235o1319G2115K98894A71249b57422c8893k25701
21854b64594M0837A04072J16761a8726k02571R108i0207m6930e3120B97321g6282
21842B65749a03496A2077A676L7602K95334j49493i4244J3878h884k02744L5991
21831a75637g1841a9448C706c33892A76203K3856h3453A24769b22169B53845C4523
21819G3950K0312i6142p0515Q2285k44919A1551b1508k28647I5807a58289j2116
21808a70405O2268n4355j55601J07579l2974G5890i4117k6275D4686a51549B90489
21796a49691d5598A75180d3473k15216i4592n2808L7972j29313J8880G8171l314
21785G4857f0385b5129A20405c08420a38439G6910N5559J9021a95227j92718M7887
$$ plain form
21774 -340058 -100172 -123777 215479 -280110 32380 -114059 -89072 12444 63449 -10106 -44165
21763 -44165 -16858 141748 -122271 295957 29590 -115006 47345 -286324 41362 132347 -67878
21751 8202 146020 151922 -148319 72536 5112 -62745 -14372 497414 -28729 8135 -211210 -315231
21739 -315231 -196648 212623 -139395 49851 -1406 -121976 42850 108762 78485 -343864 11576
21727 48790 -147290 -52543 157308 -116610 -104499 103862 -50050 -41378 -156798 55527 14377
21715 -10551 9335 -116627 -42805 118695 101008 22163 -116308 114707 10795 -103695 223702
21703 -369003 -20900 -105008 23975 -159678 -114237 -289788 110110 -47316 -105998 41625 -174326
21691 228948 142237 -258207 -89889 -125522 -48483 -138475 38051 228579 205445 58573 -101117
$$ packed form
21774c40058a00172k3605B15479b80110C2380a14059K4987A2444N1005a0106l4059
21763d4165a6858A41748a22271B95957B9590a15006D7345b86324D1362R0985f7878
21751H202J37818N902a48319G2536E112f2745a4372D97414b8729H135b11210j04021
21739c15231J18583B12623a39395D9851a406j20570D2850O5912l0277c43864A1576
21727D8790a47290e2543A57308a16610J2111A03862e0050Q672j15420E5527A4377
21715a0551I335a16627d2805A18695j7687B2163a16308A14707A0795a03695B23702
21703c69003b0900q4108B3975a59678M5441j75551A10110d7316n8682D1625a74326
21691B28948q6711b58207h9889l5633d8483q9992C8051J90528k3134E8573a01117
$$ plain form
21679 -172254 -182565 -315162 -21429 148224 14582 77036 -178519 -238984 -40720 36809 178599
21668 178599 22776 120015 -68270 -76449 427491 123509 154218 -76306 51168 -323040 -224371
21657 -224371 -72052 90814 -185892 -35638 -123144 152975 262779 -190682 -175458 48856 81136
21646 81136 -41910 -509906 54163 -69499 -521607 -175845 173386 39033 -187983 98003 37092
21634 -182209 -24866 -291209 132678 37412 -39407 142121 -149914 75837 192712 -17782
21623 -272865 -242123 -275610 -80089 -210972 354839 -53231 -3645 -105094 2057 -42729 -64305
21612 -64305 -69897 230110 220197 -274940 32333 -145797 -136605 -281953 45035 -183216 99544
21600 111317 -1856 -24010 87598 -211079 -273976 -50734 -161693 -2898 5463 -275451 -16988
$$ packed form
21679a72254j0311j32597b1429A48224A4582O2454a78519o0465d0720C6809J41790
21668A78599B2776R7239f8270q179D27491A23509L0709g6306E1168c23040R8669
21657b24371g2052I0814a85892c5638q7506A52975J09804a90682J5224D8856L2280
21646H1136d1910m67996E4163f9499m52108a75845A73386C9033a87983I8003C7092
21634a82209b4866k66343A32678C7412c9407A42121a49914G5837J16875a7782
21623b72865L0742l3487h0089j30883C54839e3231c645j01449B057d2729k1576
21612f4305n592B30110r913b74940C2333a45797R192j45348D5035a83216I9544
21600A11317a856k2154H7598b11079o2897e0734j10959b898E463b75451a6988
$$ plain form
21588 87237 301709 -281144 -52176 -114924 -252973 95497 153458 -133180 -295240 135060
21577 -268914 -114638 -27155 -39427 -212660 -102801 -101311 144473 108399 -54771 93141 44622
21565 -72640 86168 -154336 107366 -179690 -321153 8506 66788 -203090 -178482 106254 -312961
21553 -35179 -118312 26182 193528 -359718 94645 -67337 -42948 -103431 -1354 -153505 -35115
21541 -79433 -174705 -189262 -150336 126960 -240491 368027 -95672 -32104 -202752 -1389 289653
21529 -81974 113738 -51115 152329 87992 -177225 136863 -245716 -10829 -72322 71813 -455045
21517 -133238 -128806 -74289 -211195 32785 -205860 221073 -93651 -222414 -103699 -103376 -208253
21506 -208253 12163 45155 -229839 -26120 -387449 462813 -46116 -210402 -145096 -242747 -341320
$$ packed form
21588H7237K14472b81144e2176o2748j38049I5497N7961a33180j62060A35060
21577b68914a14638b7155j2272j73233a02801J490A44473l6074e4771I3141D4622
21565g2640H6168a54336A07366a79690j41463H506N8282b03090K4608A06254c12961
21553c5179q3133B6182J67346c59718I4645f7337K4389o0483a354j52151c5115
21541g9433r5272j4557L8926A26960b40491C68027i5672c2104j70648a389B89653
21529h1974A13738e1115A52329o4337a77225A36863b45716a0829o1493G1813d55045
21517a33238M432N4517j36906C2785b05860B21073i3651j28763a03699L23j04877
21506b08253A2163L2992b29839b6120l61329D62813d6116j64286O5306r7651r8573
$$ plain form
21495 -341320 73152 140267 105059 233024 -137246 156725 -337856 -165422 52084 -27962
21484 80077 23561 72778 22333 -121432 -554789 69208 -280588 -57954 -122493 97012 51071
21473 51071 -57195 -83164 25405 217380 -112275 67224 49450 -330963 100736 -154588 -378674
21462 -378674 -9532 -115131 -43107 -11672 -9903 -127107 140469 -281128 -88424 -250001 -64752
21450 -57473 84388 208765 223158 -76012 250079 -35034 -176633 84686 10210 66892 268751
21439 268751 382688 -168914 119560 343375 168887 478838 188178 918 55299 129642
21429 129642 -298614 -269481 55360 -211666 12712 138292 -317955 290376 -131991 68942
21418 82309 -496492 -73799 -23625 -201724 213493 -209702 -148151 -28744 -51633 -88577 -377270
$$ packed form
21495c41320G3152O7115l5208J27965a37246A56725c37856a65422E2084b7962
21484H0077B3561M9217B2333a21432m33357F9208b80588e7954o4539I7012m5941
21473E1071e7195k5969B5405J91975a12275F7224j7774c30963A00736a54588k24086
21462c78674i532j05599d3107a1672J769j17204A40469b81128h8424j61577f4752
21450e7473H4388J24377J4393g6012B50079c5034j41599H4686A0210N6682K01859
21439B68751J13937a68914A19560K23815A68887L09951A88178I18N4381P4343
21429A29642b98614K9133E5360b11666A2712J25580c17955B90376a31991F8942
21418H2309d96492g3799b3625j78099B13493b09702O1551b8744k2889l6944k88693
$$ plain form
21407 -377270 -145684 -79798 5431 31083 -61511 -291169 -181321 43623 -228926 124691 70695
21396 70695 -290135 -202686 -179734 -263024 35944 119053 -151466 -254231 -94498 22716 121843
21385 121843 117276 143348 855 -199004 89155 -67146 45979 -253421 -193517 101213 74524
21374 74524 23646 -75206 -34607 3247 -200680 -348209 190268 -337906 -76191 -60774 -120931
21363 -120931 74205 -80457 -76432 46042 -9741 220377 168421 -33921 -479978 -356226 -320453
21352 -320453 96196 129148 -84373 -154137 -247792 337061 74847 11718 -190992 -235446 -269674
21341 -269674 135692 180610 -163084 254007 -371158 44405 -182790 68045 44917 -84131
21330 7629 183116 -133046 209240 -33142 -335360 -149893 28795 -326059 26835 57376 -124689
$$ packed form
21407c77270a45684O5886E431K5652f1511k29658J09848D3623b28926A24691n3996
21396G0695b90135Q7449K2952q3290C5944Q3109a51466j02765i4498B2716R9127
21385A21843m567K6072H55a99004H9155f7146D5979b53421N9904A01213k6689
21374G4524B3646g5206c4607C247b00680j47529A90268c37906g6191J5417o0157
21363a20931G4205h0457M025D6042i741B20377n1956c3921m46057J23752L5773
21352c20453I6196L2952h4373o9764r3655C37061G4847A1718a90992m4454l4228
21341b69674A35692M4918a63084B54007c71158D4405a82790F8045k3128h4131
21330G629J75487a33046B09240c3142l02218a49893B8795c26059B6835L0541a24689
$$ plain form
21318 -397647 28000 -151317 -293635 -168636 -105151 -66587 -134660 51003 161985 266982
21308 266982 -89100 79362 237806 230951 -87577 98208 -62854 88376 102377 -35889 -50912
21297 -50912 -107842 -292940 -4892 -157638 -73759 -270569 133328 -134125 -257225 -26946 -88673
21286 -88673 198313 363 -131523 10430 4267 214041 -160324 -33619 256144 -90345 -52350
21275 -52350 59612 29112 54736 161524 60057 42048 90972 -8613 -132666 26764 -228135
21263 -203369 -401739 -61777 -96344 -82517 -179045 -214731 63748 -146212 -208783 -40358 -323346
21252 -323346 -298472 -177651 -70364 -213691 -29322 5823 -50337 1011 108402 156193 196479
21241 196479 -57631 153720 -211310 21592 79479 88211 -144857 -14504 87832 -18834 176449
$$ packed form
21318c97647B8000a51317j42318J24999O3485L8564o8073E1003J10982J04997
21308B66982h9100G9362J58444o855h7577I8208f2854H8376J4001c5889j5023
21297e0912n6930j85098d892j52746g3759j96810A33328a34125j23100b6946o1727
21286h8673A98313C63a31523A0430D267K09774a60324c3619B56144i0345L7995
21275e2350E9612B9112K5624J06788F0057j8009M8924h613j24053B6764b28135
21263b03369j98370f1777l4567J3827r6528l5686F3748a46212o2571d0358k82988
21252c23346K4874J20821g0364j43327b9322E823e0337A011J07391M7791M0286
21241A96479e7631A53720b11310B1592N7887Q732a44857a4504H7832a8834A76449
$$ plain form
21229 239081 20962 -54524 37057 -52296 -209077 157655 42679 209312 10256 -123863 -384321
21218 -384321 60556 -161601 290399 81949 216702 134869 127946 -22416 72386 14518 -304863
21206 -58444 262317 -332049 -135606 -64397 -181093 -259480 -58662 34110 240575 -518354
21195 2896 66978 -89002 143392 215251 -154931 -209305 30150 45865 -134799 -197955 152280
21183 120071 100704 229662 -194040 86935 142731 86300 -386938 -174489 25276 -317999
21172 -59194 -35836 -177334 219900 60926 -67460 -284899 -110096 81854 63410 -147614 171885
21160 -4200 -93794 -216662 -179491 189290 112701 -73829 93450 38879 -51284 66165 207490
21149 207490 31221 14329 -4321 76088 -218457 -140754 -52498 -149322 -343503 -12181 -320988
$$ packed form
21229B39081B0962e4524C7057e2296j56781A57655D2679J66633A0256a23863k60458
21218c84321F0556a61601B90399H1949J34753q1833o923b2416G2386A4518c04863
21206e8444B62317c32049a35606f4397j16696p8387e8662C4110K06465e18354
21195B896O4082h9002A43392P1859a54931n4374C0150J5715a34799o3156A52280
21183A20071j9367J28958a94040H6935N5796n6431c86938a74489B5276c17999
21172e9194K3358j41498B19900F0926f7460k17439a10096H1854j8444a47614A71885
21160d200q9594j22868L7171A89290p6589g3829I3450C8879e1284F6165J41325
21149B07490C1221A4329d321G6088b18457P7703e2498r6824j94181a2181l08807
$$ plain form
21138 -320988 -80299 -163419 42604 -63877 -140509 -34827 -45179 -5990 54634 -230153 -294175
21127 -294175 -548201 80691 -235366 -34903 224582 -109530 183491 90775 -178523 188129
21116 -165156 106250 -131143 158251 -191228 -19711 -42116 -99149 257348 56837 249022
21106 249022 43916 157890 -27691 -119231 30870 -254680 -92607 -295861 -136277 -56989 -122323
21095 -122323 -247300 15436 -221042 -103145 -182069 -37023 -70562 136030 -232048 51558
21084 -343599 71299 160936 -35643 89005 50780 108538 -239969 136285 -148595 -10941 78861
21072 223494 152806 3873 -301316 482775 -213439 -172756 -170525 -160466 -189167 -94114 110154
21060 -126584 -136529 -12437 -193615 -223889 -60737 -29980 -327339 28990 59222 -119225 -57002
$$ packed form
21138c20988h0299q3120D2604f3877p6632c4827j0352e990E4634b30153o4022
21127b94175k54026H0691b35366c4903B24582a09530A83491I0775a78523A88129
21116a65156A06250a31143A58251a91228a9711k2405n7033B57348E6837J92185
21106B49022D3916J13974b7691r1540C0870b54680i2607k03254a36277e6989o5334
21095a22323j24977A5436b21042a03145p8924c7023l3539A36030b32048E1558
21084c43599G1299Q9637c5643H9005l8225N7758b39969A36285a48595a0941G8861
21072B23494p0688C873c01316D82775b13439M0683K231J0059k8701i4114A10154
21060a26584r945a2437j81178l0274f0737b9980k97359B8990L0232a19225e7002
$$ plain form
21048 140634 132012 211793 -43303 -236088 96788 -63260 -199463 2971 104508 115618 -109108
21036 -259968 -442591 6182 121264 -248135 -85936 -347173 378890 -67506 3246 55282 34722
21025 34722 -199440 -195362 -86974 -108540 -330046 -38099 -42108 27413 -269642 -36344 37139
21013 269240 25840 98119 156875 -266162 265887 15058 225050 168759 -97898 -365416 120683
21001 97315 165509 -150025 273267 188310 -6309 -97703 -217060 336307 -76854 -194137 147840
20989 180546 -291066 57792 -29492 -179092 -267093 1054 -225649 -65196 -193940 -46246 -54959
20978 -54959 -91611 -284513 -53882 122630 -23777 -129819 -26553 59231 -10783 -211015 -248802
20967 -248802 -271767 13374 -182329 60571 123992 -78186 159790 89950 85963 -37121 103070
$$ packed form
21048A40634q622P9781d3303j92785I6788f3260j36203B971J01537J1110a09108
21036b59968j82623F182J15082b48135h5936k61237C78890f7506C246N2036k0560
21025C4722a99440M078h6974k1566k21506c8099m009B7413b69642c6344C7139
21013B69240B5840P2279N8756b66162B65887A5058K09992n6291i7898k67518A20683
21001I7315O8194a50025B73267q4957f309r1394j19357C36307g6854j17283A47840
20989A80546b91066E7792b9492j49600q8001A054b25649f5196j28744d6246q713
20978e4959l6652j92902e3882A22630b3777j06042b6553E9231a0783k00232l7787
20967b48802k2965A3374a82329F0571O3421g8186A59790o9840l987c7121A03070
$$ plain form
20955 -58947 -45353 489896 -15107 141222 -80012 175539 -99502 252866 -37092 -14296 -185619
20944 -185619 -125637 -380263 154785 151904 -117229 -222082 70791 -297352 -63265 32952 -250074
20932 -22784 -132999 206131 118222 459175 245669 35342 -76920 -145649 -122465 15803 -79155
20920 4488 -54304 140497 63323 43814 -2472 186532 128104 126255 -126528 7329 -169456 -60740
20907 -177936 -121469 -7002 -138946 90827 67397 -158011 -91213 17513 -150435 -40784 67191
20895 -312096 -184176 111116 -278446 17794 -217729 -106961 -123826 -160593 -165469 -62832 5867
20883 -290384 19333 -246094 -30113 -92869 -52257 211711 -140372 -95218 -218330 7357 46060
20872 46060 196403 51983 -102745 -152289 47178 -144953 98524 -309255 -56561 234370 -289784
$$ packed form
20955e8947J3594D89896a5107A41222h0012A75539i9502B52866c7092a4296j71323
20944a85619N9982k54626A54785k881a17229j04853G0791b97352f3265C2952b50074
20932b2784j10215B06131q7909L40953k13506C5342g6920o8729K3184A5803g9155
20920D488e4304A40497F3323j9509b472A86532n8428j849a26528G329a69456f0740
20907a77936N6467g002j31944I0827k3430a58011O6798A7513a50435d0784F7191
20895c12096J27920A11116b78446A7794b17729a06961j6865l6767m876f2832E867
20883b90384A9333b46094c0113o2756M0612B11711a40372M5154j23112G357L8703
20872D6060J50343E1983a02745m9544D7178a44953I8524c09255e6561B34370b89784
$$ plain form
20860 190134 29306 6685 133433 -152857 174748 -101562 -155870 -86540 -172579 -281121 41146
20848 -91980 -189358 -178539 49853 -81032 360600 145288 67546 -16823 66243 -143668 -107540
20837 -107540 77742 5566 45096 -148163 -2032 190829 283232 -226201 -41640 -126790 197025
20825 -131952 -252927 -187363 -24388 -69863 11462 61550 -299996 280596 93356 -99102 -137164
20814 -137164 15703 -148688 199359 -262397 -205464 32353 -216669 -160413 -252005 -112952
20803 -75242 -196962 -131432 107847 467126 -247030 -200567 -107536 -395114 -37694 -111225 -298352
20792 -298352 113652 -106363 -233746 156599 -177628 100496 221004 -56869 -192533 124928
20781 -158346 -95904 142277 -133669 -221728 -116034 241346 75252 193873 -219673 -63290
$$ packed form
20860A90134B9306F685J26748a52857A74748a01562n4308O9330q6039j08542D1146
20848i1980r7378J0819D9853h1032C60600A45288F7546a6823F6243a43668L6128
20837a07540G7742E566L9530a48163b032A90829R2403b26201d1640q5150A97025
20825a31952j20975O5564b4388m5475A1462N0088b99996B80596I3356i9102l8062
20814a37164A5703a48688A99359b62397N6933C2353b16669N6256r1592a12952
20803g5242j21720O5530A07847L59279b47030M6463R3031k87578c7694p3531j87127
20792b98352A13652a06363j27383A56599a77628A00496J20508e6869j35664A24928
20781a58346O2442A42277a33669q8059J05694B41346G5252J18621b19673f3290
$$ plain form
20770 -95780 -10527 145118 37787 165536 -94879 134933 94339 -179386 -67409 175636 -139701
20758 -244796 135990 80256 7429 -132756 125867 271926 -17425 -95212 -198397 -76345 70471
20746 -179845 -160251 91532 9333 204061 -51291 336238 144996 -87045 93175 -234440 -92797
20734 -44593 -42066 -5490 -214709 -192268 98621 -228676 -90303 -1537 21046 -307851 68190 88890
20722 88890 -216286 -226969 153896 -153661 -115494 -361878 31209 120289 -130794 -249238
20712 -249238 -241328 208249 -183141 -63925 -72203 -106427 -4200 14374 185052 -12110 22294
20700 21076 -63233 76491 -252301 191601 -373353 53196 -180847 -65812 -56498 -135545 -300264
20689 -300264 107354 30442 -7579 -13356 -175576 -75128 -52829 -109445 -51528 243610 7597
$$ packed form
20770i5780a0527A45118C7787J27749i4879A34933m0594a79386f7409A75636a39701
20758b44796A35990n5734G429a32756A25867J46059a7425p7787j03185g6345G0471
20746a79845J9594I1532I333J94728e1291C36238A44996h7045I3175b34440i2797
20734d4593K527e490k09219K2441I8621b28676i0303a537B1046c07851F8190K0700
20722H8890b16286j0683A53896a53661L8167k46384C1209Q9080a30794j18444
20712b49238P910B08249a83141f3925q278l4224d200A4374J70678a2110B2294
20700B1076f3233G6491b52301A91601c73353E3196a80847f5812R314p9047j64719
20689c00264A07354C0442g579n777j62220g5128K2299n6616e1528B43610G597
$$ plain form
20677 -61508 5481 -31009 -7478 434940 -6868 -6634 -59842 108828 -53628 116726 -148577 128622
20664 -205823 -271945 -379756 -519543 -179614 -44329 -46120 -212317 -82985 7697 125942 153168
20653 153168 -61373 37008 47116 -142970 -101087 -145352 -20774 -17499 101602 -252838 171734
20641 -545246 -144151 -57851 -248643 156325 8098 -18986 -149917 170057 144706 201259 -18593
20629 -235969 -252738 -230597 -301066 121870 115784 -10590 -100915 50002 -198213 83684 52220
20618 52220 -212061 5786 56781 -109669 -151992 -16175 8690 14034 -279641 227162 -120577
20606 -366482 -278817 233420 22885 -299881 97396 -117429 29845 80147 53591 -128126 -87214
20595 -87214 -114793 -201919 -96924 57343 46028 -179852 38761 241361 270965 -215641 -58693
$$ packed form
20677f1508E481c1009g478D34940f868K34n3208A08828e3628A16726a48577A28622
20664b05823o6122j07811j39787a79614d4329j791j66197h2985G697J18245K7226
20653A53168f1373C7008J0108a42970M1883m4265b0774L275A01602b52838A71734
20641e45246a44151e7851j90792A56325H098a8986j30931A70057k5351N6553a8593
20629b35969j6769K2141p0469A21870o086a0590r0325E0002a98213H3684l1464
20618E2220b12061E786N0995a09669m2323a6175H690N344b79641B27162a20577
20606c66482Q7665B33420B2885b99881I7396a17429B9845N0302k6556a28126M0912
20595h7214k7579q7126i6924E7343j1315a79852C8761K02600K9604b15641e8693
$$ plain form
20583 158477 -185491 -94564 95757 57746 -209254 126119 191660 23190 78556 32068 30493
20572 30493 -115668 -237520 -91285 -83410 -69065 -174439 -92742 -236998 -100719 2220 71478
20561 71478 -15494 186560 -12342 -81422 -7161 52430 140968 -52862 -302655 -170015 141145
20549 56912 72948 -57942 8069 -213677 170039 -56352 -33171 -135192 -127188 -122885 -16113 -412242
20537 -412242 -152571 240570 -207851 -6842 -77476 -2393 -38649 -92742 -99048 -96153 42648 -191813
20524 -170396 -18161 -118144 141294 -66013 14763 25211 -55006 313430 423130 93616 49314
20513 49314 -4439 71656 125464 -35827 -159137 -155963 -151558 -149087 -319836 -144143 20171 83419
20501 83419 -206870 -99715 -173600 -106490 49798 -165034 -131832 64365 -219634 -60209 149092
$$ packed form
20583A58477a85491R0927I5757l8011b09254A26119O5541B3190N5366C2068j575
20572C0493a15668j21852i1285P875J4345j05374Q1697j44256a00719B220O9258
20561G1478a5494A86560a2342o9080g161E2430Q8538e2862k49793J32640A41145
20549E6912J6036e7942H069b13677A70039e6352K3181j02021Q004M303a6113l96129
20537d12242a52571B40570b07851f842p0634b393l6256n4093o306K895D2648a91813
20524a70396a8161r9983A41294f6013A4763J0448e5006C13430J09700I3616m4302
20513D9314d439G1656N3808c5827j23310L174M405K471j70749a44143B0171O3248
20501H3419b06870i9715p3885O7110D9798a65034L3202F4365b19634f0209A49092
$$ plain form
20489 -248830 33110 -120102 -97641 119551 184472 148430 -196365 184767 -461694 58022
20478 253294 -192891 -203755 -48995 -32468 -286569 147933 -240340 -223396 -334937 233771
20467 -170000 216256 -21239 136369 169103 -190435 -70444 -134005 -59111 -84088 148237 247215
20456 247215 -163493 228574 177452 156847 262837 -172688 196488 -127666 191979 150795
20446 150795 11210 -232759 -379103 73863 -189549 -37935 125108 116856 56305 -66379 -145153
20435 -145153 -344182 -30724 167871 60209 88413 -94361 77093 88213 40340 -58826 33459
20423 -74914 -129756 -112742 -438554 97896 -269217 -198418 -106618 -13660 136527 -359883 -88793
20411 -322829 42588 320 212329 -183885 174512 -91581 23034 -73817 206852 -233489 -125954
$$ packed form
20489b48830C3110a20102K2461A19551O4921l6042a96365A84767d61694E8022
20478B53294a92891j0864d8995J6527k54101A47933b40340J6944j11541B33771
20467a70000B16256b1239A36369L2734a90435g0444o3561e9111k4977A48237R8978
20456B47215a63493B28574n1122k0605J05990a72688A96488a27666A91979m1184
20446A50795A1210b32759j46344G3863a89549c7935A25108q252E6305f6379p8774
20435a45153j99029c0724A67871F0209K8204i4361G7093J1120D0340e8826C3459
20423g4914n4842J7014l25812I7896b69217P0799R1800a3660A36527c59883h8793
20411c22829D2588C20K12009a83885A74512i1581B3034g3817B06852b33489J07535
$$ plain form
20400 -125954 -9884 -191579 111387 -197472 -136776 153278 -167655 -11900 134486 159549
20390 159549 -136071 133971 -122192 95551 -134198 -152162 207891 159350 -84437 -257653
20380 -257653 -116594 -137877 -1756 -113200 -5528 -199775 172622 -19996 -188334 -120711 -84095
20369 -84095 132625 -130475 -182064 349897 86851 -181342 -55875 -58661 -175535 -231969 -491808
20358 -491808 -83425 -145221 -43346 89364 -114290 82269 -197222 405131 219465 128975 -140357
20346 -114103 238650 6518 419852 97407 -151136 172920 8569 -46590 -155021 -159511 -494813
20335 -494813 54246 -163563 55525 -333459 82755 -246088 -210352 60485 171542 104547 -51345
20323 -174375 298787 -52411 -39112 -101476 112783 -128262 -55245 -237693 112944 75648
$$ packed form
20400a25954i884j81695A11387a97472O0696A53278a67655a1900A34486K5063
20390A59549a36071A33971a22192I5551a34198j7964B07891m8541h4437j73216
20380b57653a16594k1283a756j11444e528j94247A72622a9996j68338O7623L6616
20369h4095A32625a30475n1589C49897H6851a81342e5875k786j16874n6434k59839
20358d91808h3425o1796d3346H9364a14290H2269a97222D05131j85666r0490a40357
20346a14103B38650F518M13334I7407a51136A72920H569d6590j08431m490l35302
20335d94813E4246a63563E5525c33459H2755b46088L5736F0485J11057o6995e1345
20323a74375B98787e2411J3299o2364A12783a28262e5245j82448A12944l7296
$$ plain form
20313 75648 -165681 -212915 -61055 261341 68745 -465342 -20269 -382136 9578 -86866 -228602
20302 -228602 -468439 118085 -104169 152828 -304147 -176436 -243808 -307012 206720 57994
20291 -494487 49197 162945 12543 58058 -32486 -169095 -24851 -32398 28963 131023 200822
20280 200822 20694 -40222 -137677 93041 74452 -104209 44652 30231 86682 -105376 -24759
20268 262854 -154567 42059 98150 -26986 -23683 -28980 -103509 120836 -126157 -59261 -33171
20257 -33171 288479 -58320 117085 32963 -109103 91245 -332122 -40736 -153170 90432 -62616
20245 19646 141709 119446 -376571 -149496 -234818 -56493 -223482 -118364 -183182 155264
20234 -308148 -308844 -24368 -101758 -182615 -140264 50086 9509 -434803 9856 166469 -128286 -27752
$$ packed form
20313G5648a65681m7234f1055B61341F8745d65342b0269l61867I578h6866j41736
20302b28602k39837A18085a04169A52828c04147J27711o7372o3204B06720E7994
20291d94487D9197J13748A2543M5515c2486j36609b4851p547B8963J02060O9799
20280B00822B0694d0222r7455I3041j8589a04209D4652j4421N6451a05376b4759
20268B62854a54567D2059N6091b6986L303n297p4529A20836a26157e9261K6090
20257c3171B88479e8320A17085C2963a09103I1245c32122d0736j12434I0432f2616
20245A9646J22063k2263c76571a49496q5322e6493j66989J05118o4818A55264
20234c08148o96b4368p7390q0857M2351E0086I509d34803I856J56613a28286b7752
$$ plain form
20221 -137915 -37255 13934 218455 -193651 16698 -27946 -242080 -23420 -199625 -278553 66113
20209 4936 20976 325691 125159 243780 -174896 -64118 40977 -220075 -41636 -261437 -538771
20198 -538771 -326845 -102320 -93531 -489738 -96016 -175550 -44984 -124926 -4606 -202698 -11087
20186 143093 -7392 -109868 -125230 263638 -231387 -95553 -66847 -77889 195994 194546 -146185
20174 -144655 106368 143076 -131961 143835 -128552 -11255 -80611 -104828 6234 204427 163945
20163 163945 -66656 121919 -98752 -272031 -74739 -121831 -151635 3401 51685 -23559 37100
20151 -33979 -45028 -49420 -215759 192207 34945 -85656 221419 -293705 -99680 -4237 -455904
20140 -455904 -210038 -169172 111868 287345 147411 -164581 69349 151451 -15545 -62507
$$ packed form
20221a37915c7255A3934K04521a93651A6698b7946k14134b3420j76205p8928F6113
20209D936J6040L04715A25159J18621a74896f4118D0977b20075d1636k19801k77334
20198e38771K11926a02320Q789l96207i6016p9534d4984p9942d606j98092a1087
20186A43093g392j02476j5362B63638b31387i5553K8706j1042A95994j448a46185
20174a44655A06368L6708a31961A43835a28552a1255o9356k4217F234J98193m0482
20163A63945f6656A21919i8752j73279g4739m7092k9804C401M8284b3559C7100
20151c3979j1049m392j66339A92207C4945h5656B21419b93705i9680d237m51667
20140d55904b10038M0866A11868J75477j39934a64581F9349Q2102a5545m6962
$$ plain form
20130 -62507 -103530 -157956 150844 -225888 43679 -17567 86364 213479 -11635 -354997 150600
20118 -448742 -81521 66225 -147781 -264643 -185323 127883 -135827 -128820 -442176 -342120
20108 -342120 10058 -68197 -168532 -161164 -101877 -325358 8468 -300873 199280 -88456 106052
20096 -134748 138860 -159550 46418 -153120 -19046 -210517 -212039 84907 -133978 -270679
20086 -270679 -174429 25662 -32693 310219 51989 87603 54623 27571 109446 -271034 -108626
20074 14581 -25595 96010 -197069 54361 75480 13756 -109912 274483 -137890 -290541 270959
20062 131684 -70258 -435324 92254 -144400 -152113 -119492 67463 -194684 455393 -255202 77827
20050 -88743 -177684 -23581 -151934 -295965 -72974 -557384 8976 11991 175885 -167510 61541
$$ packed form
20130f2507m1023n4426A50844b25888D3679a7567H6364J27115a1635l43362A50600
20118d48742h1521F6225a47781j16862P9320A27883a35827P007l13356J00056
20108c42120A0058f8197j00335P368N9287k23481H468c00873A99280h8456A06052
20096a34748A38860a59550D6418a53120a9046j91471j522H4907a33978j36701
20086b70679R6250B5662c2693C10219E1989L5614l2980k7052Q1875b71034a08626
20074A4581b5595I6010a97069E4361K1119A3756a09912B74483a37890j52651B70959
20062A31684g0258l65066I2254a44400p713L2621F7463a94684D55393b55202G7827
20050h8743q8941b3581j28353j44031g2974m84410H976L015J63894a67510F1541
$$ plain form
20038 -168774 3817 -95738 -188226 -253979 -253990 20160 34369 261472 -492300 8312 -62209 214424
20025 -188631 -308605 -231276 -178833 -241584 27036 165620 -270931 -125521 110605 166310
20015 166310 -110333 -27582 2960 -272262 -179373 -107235 -238612 127309 53139 -144603 40050
20003 -216708 -185175 -202491 -118514 50170 -29675 78950 103000 124035 213494 -255890 84462
19991 -103067 -42505 142175 -208754 -10312 -130181 -60876 -118107 -210870 76862 -139961 50943
19979 -180689 23133 68108 -40498 -85265 -202491 222435 -197394 79884 -74204 -123836 -509207
19968 -509207 -163498 55114 51800 -106085 155045 230214 -327021 -68204 -305862 -217465 72115
19956 14823 106440 -75732 27388 352719 493379 83752 99367 -146728 -231835 -7202 -34084
$$ packed form
20038a68774C817i5738r2488o5753j1B0160J4209K27103d92300H312f2209B14424
20025a88631j19974P7329N2443o2751B7036J38584b70931a25521A10605N5705
20015A66310a10333b7582B960b72262R2889P2138j31377A27309E3139a44603D0050
20003b16708L1533j7316Q3977E0170b9675G8950K4050K1035Q9459b55890H4462
19991a03067d2505A42175b08754a0312j19869f0876n7231r2763G6862a39961E0943
19979a80689B3133M4975d0498m4767j17226B22435a97394G9884g4204m9632l85371
19968e09207a63498E5114l314a06085A55045P5169c27021f8204k37658Q8397G2115
19956A4823R1617g5732B7388L25331J40660H3752J5615a46728q5107g202k6882
$$ plain form
19945 -34084 59285 -22724 162822 -155965 -245034 71868 333640 -139358 -84323 90325 -128185
19933 -132391 -125714 247917 148447 -1387 -48159 -242417 -34092 -36389 47108 -42172 -241988
19922 -241988 225298 85566 -206691 191291 -115019 87929 -279111 91719 -115021 -270213
19912 -270213 -182830 67460 -58995 245406 -54089 75531 -123076 78297 328078 -39068 96862
19900 -271604 120531 -20139 -75110 -197985 -409429 153351 -215398 -91828 -81104 -48732
19890 -48732 -247316 189965 17686 16321 -190637 -140609 33529 -66786 -21454 -136752 102149
19878 -138399 -491487 -303031 66284 -70644 181707 -30943 45455 9956 -75184 147391 16980
19866 -136042 -129380 222135 71036 225849 -13228 255282 -122558 -121874 77914 158159 -286799
$$ packed form
19945c4084E9285b2724A62822a55965q9069G1868K61772a39358N5035I0325a28185
19933a32391O677B47917r9470a387m6772j94258c4092k297D7108d2172j99816
19922b41988B25298H5566b06691A91291a15019H7929b79111I1719a15021j55192
19912b70213Q7383F7460e8995B45406e4089G5531a23076G8297K49781c9068I6862
19900b71604A20531b0139n4971j22875k11444A53351b15398i1828J0724L2372
19890d8732j98584A89965A7686j365a90637N0028C3529f6786b1454j15298A02149
19878a38399l53088J88456F6284g0644A81707c0943D5455I956g5184A47391A6980
19866a36042O662B22135G1036J54813a3228B55282a22558O84G7914Q0245b86799
$$ plain form
19854 -208247 50080 -238685 44792 -23670 -92616 -3075 -64695 -203239 13347 -89554 -161897
19843 -161897 -334729 54617 -131714 -245370 -73386 -66589 -27047 -335409 81976 -151859 20014
19831 18224 -194035 -268081 -798 -103865 -529495 -41578 -150229 -39364 -240822 192497 -32562
19819 -407446 3730 51125 13901 113175 -150975 114268 -101492 109179 61568 85214 -282280
19807 -95990 169173 134534 -227677 113875 36689 169591 169221 258730 -98811 -56377 -131503
19796 -131503 64915 -261352 3394 -29796 182973 -42586 33290 -345491 -291069 6172 -97788
19784 62531 139488 -253435 -247383 230634 -5699 32948 65954 -300178 50923 -95798 -186784
19773 -186784 -27740 -52887 91722 -413341 13835 -62723 -22710 -78102 212840 -17094 -282765
$$ packed form
19854b08247E0080b38685D4792b3670o8946c075o1620j38544A3347h9554p2343
19843a61897j72832E4617a31714j13656g3386O797b7047l08362H1976a51859B0014
19831A8224a94035p4046g98j03067m25630d1578j08651c9364k01458A92497c2562
19819d07446C730M7395A3901R9274a50975A14268a01492A09179m7611K3646b82280
19807i5990A69173l4639b27677A13875C6689J32902l70Q9509i8811M2434p5126
19796a31503F4915b61352C394b9796A82973d2586C3290c45491N4422F172i7788
19784F2531P6957b53435O052B30634e699C2948L3006c00178E0923i5798r0986
19773a86784b7740k5147I1722d13341A3835f2723b2710n5392B12840a7094k65671
$$ plain form
19762 -282765 17853 102295 -215728 36560 -254649 34214 -50873 -109308 124529 7651 -65457
19750 196185 -226632 -13387 -110380 -53073 -261895 -2194 -35821 31362 16168 -278903 220139
19738 -188483 129190 61802 -1628 53678 -135922 -198108 -256012 -161640 -148023 -104299 -9071
19726 -173655 -32759 -54931 -210898 236151 73063 -153638 -326979 77834 -278403 -42020
19715 139236 -94972 169821 -234418 -90356 -75242 -135455 -105673 117911 -136757 -228531 -83119
19703 -127045 -465554 35929 -65986 -128353 -148400 -138403 30008 2683 -112423 -140880 -198086
19692 -198086 -155034 -567 161041 34947 -154669 28038 -157941 -280110 -100213 90353 -44446
19680 -106548 391557 121011 194223 32559 58092 -4919 -26626 157576 -179530 -15811 207806
$$ packed form
19762b82765A7853Q4442b15728C6560b54649C4214e0873n8435A24529G651f5457
19750A96185b26632a3387r6993e3073k08822b194l3627C1362j5194b78903B20139
19738a88483A29190F1802a628E3678a35922o2186n7904R4372J3617M3724i071
19726a73655c2759k2172j55967B36151G3063a53638j73341G7834b78403d2020
19715A39236i4972A69821b34418i0356J5114o0213K9782A17911a36757r1774h3119
19703a27045l38509C5929f5986o2367k0047R997C0008B683a12423k8457n7206
19692a98086M3052e67A61041C4947a54669B8038a57941j22169a00213I0353d4446
19680a06548C91557A21011P3212C2559K5533d919k1707A57576a79530a5811B07806
$$ plain form
19668 -8638 -24581 147894 -114065 -249601 -254030 46657 -181228 -121232 -59953 -133178 -233105
19657 -233105 -58800 -238655 -188409 -9578 -70988 -131682 -170512 -231458 157664 25198 -109475
19645 285310 -206594 28943 -128814 32452 -44933 31533 101039 -71861 -52303 -73901 -156830
19634 -156830 -118144 -443 -79482 92493 -125102 51956 -86647 -31466 417449 117075 134649
19623 134649 -99604 -154965 -401751 -167732 -44254 142720 -97522 -179412 -275073 -88164 -228879
19612 -228879 235881 -203454 81982 29173 -205150 -397 44613 137585 -19394 -3614 -114785
19601 -114785 58301 -164188 -302 352312 -320589 -120140 131016 -192544 133765 -164321
19590 -20597 -196978 119822 -234921 225026 -25473 -57389 23534 -93496 -147528 -130675 42706
$$ packed form
19668h638j5943A47894a14065j35536m429D6657a81228N9996e9953p3225r9927
19657b33105e8800j79855N0246i578o1410o0694l8830o0946A57664B5198a09475
19645B85310b06594B8943a28814C2452d4933C1533O9506g1861J9558k1598q2929
19634a56830L8686d43p9039I2493a25102E1956h6647c1466D17449A17075J7574
19623A34649i9604n5361k46786a67732d4254A42720i7522q1890r5661h8164j40715
19612b28879B35881b03454H1982B9173b05150c97D4613R2972a9394c614j11171
19601a14785E8301a64188c02C52312c20589a20140A31016a92544A33765a64321
19590b0597j76381A19822b34921B25026b5473l1916B3534i3496n4032J6853D2706
$$ plain form
19578 -145356 87243 -239896 -144566 -170673 236279 160533 52816 60665 179951 119461 244358
19567 244358 -274893 -37829 208391 162419 44925 113946 -153299 147015 -406803 -274750
19557 -274750 -134086 -177032 -27420 -255712 128244 -250185 141203 15356 177882 -241792
19546 150549 -132420 -195084 62275 -121715 -132940 443221 -142249 257625 -68330 98645
19535 -208295 -69121 -515747 136000 -174671 -6187 111235 -139230 3086 -145813 -99983 105090
19523 155491 -284965 -15619 47829 -163818 -185722 -160278 -186600 13071 47365 -75091 -239854
19512 -239854 124232 61877 1410 2015 102645 -176506 164997 108945 -68091 -93224 148141
19500 -7789 -98701 182093 -201758 388123 -137536 -53838 95816 151979 -64511 -337880 -217971
$$ packed form
19578a45356H7243b39896R5330k6107B36279p5746E2816P849J19286o0490J24897
19567B44358b74893c7829B08391m5972D4925O9021a53299A47015d06803J32053
19557b74750a34086m2946b7420k28292A28244b50185A41203A5356J62526b41792
19546A50549a32420o2664F2275a21715j1225D43221a42249B57625f8330I8645
19535b08295f9121m46626A36000a74671f187A11235a39230C086a45813M5830A05090
19523A55491b84965a5619D7829a63818k1904K5444k6322A3071L4294g5091j64763
19512b39854A24232F1877A410O05J00630a76506A64997n6052f8091k5133A48141
19500g789r0912A82093b01758C88123a37536e3838I5816N6163f4511k73369J19909
$$ plain form
19489 -217971 184586 -64852 83870 108022 144865 -119201 12348 72486 344776 2322 -158044
19477 -281304 135716 -65861 -97080 286816 -178643 70635 -170447 -197231 -81809 -186253
19467 -186253 -186452 -224372 303628 -19416 -22507 -33442 -198833 -160998 -272520 -58397 72850
19455 -180840 -156329 95135 21985 -240172 -63961 -287640 -74801 14338 114739 62456 164003
19444 164003 170514 -36639 -304497 -142664 -63882 -101537 32083 -260298 73112 101332 8546
19432 22396 68590 -158212 9710 -166391 -416467 130415 102158 -298410 -252096 -161778 -137651
19421 -137651 22557 -136563 103271 -155494 -222291 -301781 -281897 -157945 -280098 -146100
19411 -146100 -238700 -87930 -166451 87356 64981 58837 -360246 52015 417 -81489 43583 -121739
$$ packed form
19489b17971A84586f4852H3870K4152L6843a19201A2348O0138K72290B322a58044
19477b81304A35716f5861l1219B86816a78643G0635a70447k6784h1809j04444
19467a86253j99l7920C03628a9416l091j0935j65391L7835j11522e8397G2850
19455a80840K4511I5135B1985b40172f3961k23679g4801A4338J00401n2283J01547
19444A64003O511c6639k67858a42664f3882l7655C2083b60298G3112K8220H546
19432B2396M6194a58212I710a66391k50076A30415k8257b98410M6314R0318K4127
19421a37651B2557a36563A03271a55494o6797p9490J9884J23952j22153J33998
19411a46100r2600h7930p8521H7356k2375o144c60246E2015D17h1489D3583a21739
$$ plain form
19398 -136877 -195557 -218859 -50659 -38443 34658 202345 70099 -199477 135385 117934 -34770
19386 63899 -83452 -59844 132782 -75807 -76641 -71407 -155117 -83359 25812 91311 -66085 82846
19373 49658 76262 124895 -130858 -176344 346237 -260469 255949 20518 -188447 67862 -225152
19361 -376414 -84975 108769 139572 13374 -168062 -12370 -8515 51852 -16428 -100518 331354
19349 24522 -80790 -25375 -176793 82733 -188532 -64615 -331917 -285695 -31042 17987 -313835
19337 -117002 -327001 -90671 242985 -56142 -236594 11091 73499 -247404 -131300 -165891
19327 -165891 -91607 8443 -111995 -333575 -170595 4908 -254370 61031 -98285 25637 -199619
19315 317672 164839 117294 106749 61840 -420812 -28590 -350894 -306088 -96174 74761 -359041
$$ packed form
19398a36877n8680k3302e0659J2216C4658J67687G0099a99477A35385j7451c4770
19386F3899h3452K3608A32782g5807q34N234q3710P1758B5812O5499f6085H2846
19373D9658K6604M8633a30858m5486C46237b60469B55949B0518a88447F7862b25152
19361c76414h4975A08769L0803A3374a68062a2370L855E1852a6428q4090C31354
19349B4522h0790b5375j51418H2733a88532f4615k67302M6222c1042A7987c13835
19337a17002k09999i0671B42985e6142j80452A1091O2408b47404J16104l4591
19327a65891P4284H443a11995k21580J62980D908b54370F1031i8285B5637a99619
19315C17672j52833m7545j0545m4909d20812b8590l22304M4806i6174G4761c59041
$$ plain form
19303 -250939 -90423 -440021 -448001 17365 -75455 514 -3256 -63918 109381 -482466 -127722
19291 -54645 -360134 172214 101223 -78400 -31967 -265851 26307 -33833 -95157 125135 -208899
19279 -143868 -40449 20476 110805 -72175 -236075 -6748 -15235 35590 -305668 18256 213125
19268 213125 178151 -107227 226917 -251104 261695 137504 111325 202094 484550 -49225
19257 63454 -46679 169406 -111035 -229529 98299 -30710 155705 123926 -147784 -50343 128422
19245 -237019 21945 -8789 -187928 70377 -153211 63910 156130 -492854 -95396 -284349 -217954
19234 -217954 187131 15104 7991 -142562 -198714 83516 -224429 66407 283164 260974 -212142
19222 -173523 -263526 4328 -99294 -184239 -106428 -321889 173502 -279953 172387 -40678 -113980
$$ packed form
19303b50939i0423l49598p980A7365g5455E14c256o0662A09381d82466a27722
19291e4645l05489A72214p0991g8400c1967k33884B6307c3833o1324A25135b08899
19279a43868d0449B0476R0329g2175j63900f748q487C5590c05668A8256J94869
19268B13125l4974a07227B26917b51104B61695j24191k6179R0769K82456d9225
19257F3454d6679A69406a11035j18494I8299c0710A55705l1779a47784e0343A28422
19245b37019B1945h789j79139G0377a53211F3910R2220d92854i5396j88953O6395
19234b17954A87131A5104p113a42562n6152H3516b24429F6407K16757k2190b12142
19222a73523r0003D328i9294q4945P7811k15461A73502b79953A72387d0678p3302
$$ plain form
19211 -113980 201043 -112626 230441 11115 -437173 -28885 -283552 -107007 -153279 -20336
19200 -250119 58718 -111827 15746 -182350 -125188 -38697 -214004 -140561 67291 -212567 -23781
19188 40138 29158 -275824 131216 53423 -286731 -84368 -118002 -148091 -149499 4700 -243460
19176 352051 -22373 -191851 -54080 -102338 -273279 -145173 7066 -371664 -106188 -493360
19166 -493360 16336 -303197 125666 -181922 9700 178992 272 -33016 -96035 175720 471013
19155 471013 10213 162929 -178985 12137 -78266 401340 -209256 100715 -31834 5875 25914
19144 25914 62775 -15462 -229280 220579 -356516 -28276 -188196 -67208 -38462 -188538 -61811
19132 19996 -39784 413073 -152808 -185784 -370275 -480342 -40835 -623716 7347 -85995 -14129
$$ packed form
19211a13980B01043a12626B30441A1115d37173b8885k54667a07007m6272b0336
19200b50119E8718a11827A5746a82350N7162c8697j75307P3443F7291b12567b3781
19188D0138j0980b75824A31216E3423b86731h4368l3634l0089j408D700b43460
19176C52051b2373j69478e4080m8258j70941J28106G066c71664a06188l87172
19166d93360A6336c03197A25666a81922I700J69292B72c3016o3019A75720K95293
19155D71013A0213J52716a78985A2137g8266D01340b09256A00715c1834E875K0039
19144B5914L6861a5462k13818B20579c56516b8276j59920f7208K8746j50076f1811
19132A9996c9784D13073a52808l2976j84491j10067d0835n82881G347h5995a4129
$$ plain form
19120 56345 29773 44935 -117620 92897 -8497 166759 -97438 -131680 165273 -147009 108482
19108 10528 -40426 153246 43116 136379 -362567 -122617 -111022 -243276 -44632 -43984 139646
19096 -91324 -137106 76036 -189926 -262863 -233282 170793 -1266 -46756 -81953 264852 -51966
19084 205232 259640 -73720 39982 193136 -23188 67992 111373 -240939 114775 267025 70041
19072 123400 -144058 -59423 357045 -229462 123151 28432 -220941 -256459 -188648 -36008
19061 9371 -153645 -34727 -27374 -215428 -48814 -207664 149850 -252782 -209252 54953 -315346
19049 228931 -202886 -8426 -169121 -88830 -19998 108945 -119245 15784 418758 -211933
19038 -64349 -333823 190359 -13315 -99893 -22120 -78529 422874 -146317 108134 261972
$$ packed form
19120E6345k6572J5162a17620I2897h497A66759i7438l4242A65273a47009A08482
19108A0528d0426A53246D3116R3263c62567a22617J1595j32254d4632O48A39646
19096i1324m5782G6036a89926p2937K9581A70793a266m5490l5197B64852e1966
19084B05232N4408g3720C9982J53154b3188F7992M3381b40939A14775J52250G0041
19072A23400a44058e9423C57045b29462A23151B8432b20941l5518O7811c6008
19061I371a53645c4727P353j88054d8814j58850A49850b52782M3530E4953c15346
19049B28931b02886h426j60695Q0291a9998A08945a19245A5784M02974b11933
19038f4349k69474A90359a3315q6578b2120n6409D22874a46317A08134J53838
$$ plain form
19028 261972 124128 -236410 95219 -83212 320678 513296 -57470 298226 336084 202459
19018 202459 81990 411154 -39305 -32478 -108472 -4920 -184329 117618 -15732 252037 -146779
19006 -2707 -218419 -113853 -87722 35072 -17413 -28951 -177172 -240690 -40055 -237111 65529
18994 -295210 -212094 94008 -113968 -181197 127362 157769 -212777 121567 -62871 134408
18983 12287 -242985 -175026 43118 -199525 251427 -143770 -36175 -217305 24505 123039 -24972
18971 -324356 87911 -263258 -39910 -221836 121934 -166789 -74261 -399735 -227629 16230
18960 49860 90175 237190 14250 -58352 14220 -52578 -16273 -117214 185511 3729 -99614
18948 43765 94158 -72025 -132355 354299 -96139 -165231 134759 -230906 99128 -72727 -9386
$$ packed form
19028B61972A24128b36410I5219h3212C20678J92618e7470B98226L7858j33625
19018B02459H1990L29164c9305O827p5994d920j79409A17618a5732B52037a46779
19006b707k15712J04566K6131C5072a7413j1538j48221o3518d0055j97056F5529
18994b95210Q3116I4008a13968o7229A27362L0407b12777A21567f2871A34408
18983A2287b42985O7959D3118a99525B51427a43770c6175j81130B4505R8534b4972
18971c24356H7911b63258c9910j81926A21934a66789g4261l25474J72106A6230
18960D9860M0315J47015A4250e8352A4220e2578a6273j00941A85511C729i9614
18948D3765N0393g2025o0330C54299i6139o9092A34759b30906I9128g2727i386
$$ plain form
18936 104722 -319043 217614 -83243 -21167 -190767 -158064 47978 77130 10051 90530 19776
18924 -22005 538955 -83339 -45190 -222681 160550 -19643 4551 493645 -67110 15232 37385
18913 37385 -179040 -426174 -4108 -145325 58807 -284756 -209018 201981 126954 8586 -111752
18901 154017 -142805 -117344 -15694 201660 -203893 39051 -164513 -199767 -124406 142473
18890 -57296 127382 -127390 -194088 -88827 240665 100705 24205 -2301 -10595 -118062 -28008
18878 -4020 -378237 -2010 -78009 43717 -11233 -250179 -209240 162688 32043 96893 -54696
18866 -146037 121073 -199197 -107372 -79233 288011 -203699 100025 -250917 -69890 -102646
18856 -102646 -43435 -287631 -156737 12835 -147122 -149062 179089 -11264 -74213 -224802 -21140
$$ packed form
18936A04722c19043B17614h3243b1167j69600L2703D7978K9152A0051Q0479A9776
18924b2005E38955h3339L8149j77491A60550a9643D551M89094f7110A5232K2153
18913C7385a79040k47134d108j41217E8807b84756P5738B01981p5027H586a11752
18901A54017a42805K5461a5694B01660b03893C9051a64513l5254P5361A42473
18890e7296A27382a27390o6698h8827B40665A00705B4205b301q294j07467b8008
18878d020l74217b010p5999D3717a1233k38946M0939A62688C2043O4850e4696
18866a46037A21073a99197R1825K8139B88011b03699A00025b50917f9890l2756
18856a02646d3435k44196J30894A2835a47122j940A79089a1264o2949j50589b1140
$$ plain form
18844 119499 -189581 48274 -266651 -308346 -83552 120333 216799 -252842 201226 -213631
18833 487306 83917 -180758 -39824 -131381 -286360 -458696 119092 128440 -311684 -239766 -124627
18822 -124627 215429 -102136 272600 -12948 163940 -156406 -129679 138226 -38899 224845
18811 -18829 322404 251731 -37564 -35164 -3886 -117434 -3053 147800 -45150 189202 10808
18799 48370 -19813 -218544 -27195 -130020 -111821 -119678 -112890 169244 -115723 -68633 62959
18787 -183897 -172092 242540 27978 -152240 -473810 -16549 -201096 115387 -81361 209634
18776 -161953 -102092 -133073 92283 -43981 -207868 -319076 146484 -70722 -125774 212942 -189385
18764 66890 -277492 -148899 68836 165412 -252240 -4172 248942 -65542 -53308 -493933 101183
$$ packed form
18844A19499a89581D8274b66651m1695h3552A20333R6466b52842B01226b13631
18833D87306H3917a80758c9824r1557j54979j72336A19092R348c11684P1918J15139
18822a24627B15429a02136B72600a2948A63940a56406K6727A38226c8899B24845
18811a8829C22404p0673c7564K400c886j13548c053A47800d5150A89202A0808
18799D8370a9813j98731b7195j02825J8199p857O788A69244a15723M7090F2959
18787a83897J1805B42540B7978a52240l21570a6549j84547A15387h1361B09634
18776a61953N9861l0981I2283d3981j63887j11208A46484g0722n5052B12942a89385
18764F6890b77492J28593F8836R6576b52240d172B48942f5542J2234m40625A01183
$$ plain form
18752 31578 -249869 108000 -77714 -14005 13354 109842 -112096 -152460 -23655 87168 -179686
18740 241606 321411 -159756 106473 -101977 -24494 182957 254389 -130637 -94299 -35445
18729 -225430 -11072 149559 -105222 -36389 -102645 -110673 -199971 -24871 82081 -52137 248173
18717 -2404 -76832 89646 8109 -37797 152793 -34883 -197401 50115 257860 231643 221865 -148267
18704 -196637 158909 -17346 -138348 88061 266450 129294 37533 81751 75186 -153370 -67404
18692 -253097 -100499 196816 -148705 4183 -126828 -97591 -32818 -18988 -224634 108445
18681 -100426 -18948 -57696 -136101 -116878 -223375 148446 -80892 -337010 -43740 32260 -94981
18669 -111826 -61605 207100 -16496 -192067 -90274 -134409 -32852 -87989 219773 -73651 -33129
$$ packed form
18752C1578b49869A08000g7714a4005A3354R6488a12096m0364b3655H7168a79686
18740B41606P9805a59756A06473a01977b4494A82957P1432a30637L6338c5445
18729b25430a1072A49559a05222c6389o6256q028q9298b4871H2081e2137B48173
18717b404p4428H9646H109c7797A52793c4883j62518E0115K07745k6217r778a48267
18704a96637A58909a7346j21002H8061J78389A29294C7533M4218o565a53370f7404
18692b53097a00499A96816a48705D183a26828K9237c2818J3830k05646A08445
18681a00426a8948l8748p8405J9223j06497A48446h0892k56118d3740C2260i4981
18669a11826N0221B07100a6496j75571i0274m4135c2852n5137B19773g3651c3129
$$ plain form
18657 1676 -114928 -342128 -119832 -136321 143284 72501 181679 -249228 -349036 9747 -271176
18645 -388951 -433000 167116 123073 -11923 52438 -334836 104673 241261 -335646 -50727
18634 178685 75567 -151718 100996 189917 -80158 -188622 -49026 -185773 80319 -342237
18623 114614 -74548 50060 -251309 321821 -270184 -29712 141628 -146770 -342462 -73354
18612 -18730 -80541 -19668 134603 198020 -200534 -232252 -187013 -55000 -151823 75797 -370657
18600 191995 71756 54043 70272 146373 -357149 -158471 111065 -44271 79456 -139033 -80217
18589 -80217 204240 4375 -24384 -309939 119107 44540 -332128 52451 84886 -229370 -188595
18578 -188595 -165323 -90375 12907 -183889 -381313 339209 -363370 -253895 -440766 16373
$$ packed form
18657A676a14928k27200a19832j6489A43284p0783J09178b49228r9808I747b71176
18645c88951m4049A67116m4043a1923E2438c34836A04673J36588c35646e0727
18634A78685G5567a51718A00996Q8921h0158j08464d9026j36747H0319c42237
18623A14614g4548E0060b51309C21821b70184b9712A41628a46770j95692g3354
18612a8730o1811a9668A34603O3417b00534l1718M5239e5000r6823G5797c70657
18600A91995G1756j7713J6229P6101c57149a58471A11065d4271G9456a39033N8816
18589h0217B04240D375b4384k85555A19107D4540c32128E2451L2435b29370M0775
18578a88595K3272P4948A2907a83889j97424C39209c63370J09475j86871A6373
$$ plain form
18567 -153952 -151680 -137383 -125705 94633 72251 -7952 115057 43875 -47836 274232 -88716
18555 -307526 -107065 -153511 29833 -181302 231383 -29700 -283462 -93463 186377 -214155
18544 -8046 -317712 -10198 -66122 157598 -425919 212777 11219 201293 -50743 -101523 -36092
18532 -50472 -87935 -92545 -427937 -107229 -28075 72034 38053 -32799 -148090 -274578 -166643
18521 -166643 68494 29322 241333 48719 141397 -172848 -93198 -83859 -174569 140414 -210642
18509 -48994 -134060 -43508 -154523 65589 -108488 -29459 -190381 -110661 -129955 -166362 150722
18497 128333 115725 -192398 -132174 31842 -220901 242451 139590 122087 162443 -65479 -102452
18486 -102452 -173275 -239706 -24859 -267204 -226548 -148816 -338509 186839 207120 -20621 6370
$$ packed form
18567a53952K272J4297J1678I4633k2382g952A15057D3875d7836B74232h8716
18555c07526a07065m6446B9833a81302B31383b9700k53762i3463A86377b14155
18544h046l09666a0198n5924A57598d25919B12777A1219J90074e0743n0780c6092
18532e0472l7463m610l35392a07229b8075G2034l3981c2799j15291j26488J07935
18521a66643F8494B9322K12011D8719R2678a72848P9650R339r0710A40414b10642
18509d8994q5066d3508j11015F5589a08488b9459j60922P9720j9294l6407A50722
18497A28333j2608a92398O0224C1842b20901B42451j02861j7503M0356f5479l6973
18486a02452p0823o6431b4859k42345M0656P7732j89693A86839K0281b0621F370
$$ plain form
18474 -27357 73507 36443 183286 138469 167157 29672 92947 -423076 5654 -213265 -134766
18463 -134766 -48564 -284341 -316031 -180375 -116669 -209935 -45494 -2079 -82970 -37773 -47093
18452 -47093 -191773 220860 -128597 158304 -77593 -413810 -15520 -231748 -69926 27165
18441 -15369 -154109 161477 203142 64348 135790 -80794 -62790 -296204 -867 -20689 -39446
18430 -39446 52654 153895 -125393 137412 -110117 255433 23914 214492 -95819 104123
18419 -165270 -150526 115028 418519 161434 16184 386048 -192650 -58239 -165265 100113
18408 78923 -299818 -193822 139276 -190927 -329142 -144399 -12484 -31497 142573 68696
18397 -124096 -364873 226913 66232 12820 172956 -6778 -194718 -268164 133417 145406 72225
$$ packed form
18474b7357G3507C6443J46843m4817K8688B9672O3275d23076E654b13265P8499
18463a34766d8564k35777l1690J35656O3706r3266d5494b079q0891c7773r320
18452d7093j44680B20860a28597A58304g7593l36217a5520k16228f9926B7165
18441a5369j38740A61477M1665F4348P1442h0794J8004k33414h67j9822j8757
18430c9446E2654J01241a25393A37412a10117B55433B3914J90578i5819A04123
18419a65270J4744A15028L03491A61434A6184L69864a92650e8239j07026A00113
18408G8923b99818J05996A39276a90927j38215a44399a2484j9013A42573F8696
18397a24096k40777B26913F6232A2820J60136f778j87940p3446A33417J1989G2225
$$ plain form
18385 132856 -28570 187716 6417 -183560 -15263 116628 26457 -69693 51700 71267 -5288
18373 -27555 -104040 -72649 -54744 278315 906 113849 -140972 150659 163662 125091 58411
18361 -283187 237039 -41434 49826 -96743 -24230 1544 -120113 -178758 -38947 -62609 170038
18349 206055 -81995 -240546 -99766 -299542 77143 -27024 -133783 19291 93464 -409066 20166
18337 -167875 -227207 -22436 -247415 -258552 -26490 -159248 90885 -311802 -437426 -390322 -117958
18325 -124524 58230 -74030 24471 25607 137916 -54335 -184669 -299873 94861 22938 -80514
18313 77034 -39854 -22985 -182021 -82961 -23463 -499467 -143265 180785 -195212 90648 154340
18302 154340 368458 -198891 -109956 -174456 -26963 -152234 52434 -21046 -85276 -119782 -172622
$$ packed form
18385A32856b8570A87716F417a83560a5263A16628B6457f9693E1700J9567e288
18373b7555p6485L1391J7905B78315I06J12943a40972A50659J3003l8571E8411
18361b83187B37039d1434D9826i6743b4230A544a20113n8645c8947k3662A70038
18349B06055h1995j58551i9766j99776G7143b7024j06759A9291P4173d09066B0166
18337a67875n9332b2436k24979j1137b6490j32758I0885c11802j25624M7104a17958
18325a24524E8230g4030B4471J136J12309e4335j30334j15204I4861B2938h0514
18313G7034c9854J6869j59036h2961b3463m76004a43265A80785a95212I0648O3692
18302A54340K14118a98891Q8935o4500b6963j25271E2434b1046o4230l4506n2840
$$ plain form
18291 -172622 -24736 55839 -517888 -85814 192723 -24329 -183625 -206642 -89279 -340468 -76135
18279 110484 -157425 -23856 32676 126344 96685 2626 74183 -14095 -201 96910 -105027 -185880
18267 -185880 -65110 49099 230595 -136017 -50198 135343 38996 92359 -175295 3414 17114
18256 17114 -48672 -59631 -79265 -38777 217056 18375 -255156 -20167 -142618 80071 -149013
18244 -36572 -201940 -204670 -253007 21766 11653 228101 -65128 -152722 -34021 -43232 -25736 -110636
18232 -110636 248013 -96547 -10779 -7479 -251171 -6164 204349 -81344 -92717 -109183 74918
18220 87625 -310589 81564 -412577 37562 -13262 50474 -7882 -420806 136068 -86293 170453
18208 -86311 -124599 -171548 -269926 24037 -72311 -145651 -188406 -265060 151543 486499 -141588
$$ packed form
18291a72622b4736E5839e17888h5814A92723b4329j59296k3017h9279k51189g6135
18279A10484a57425b3856C2676R3668k9659B626P1557a4095b01I6910a05027q0853
18267a85880f5110D9099J81496a36017e0198A35343C8996N3363a75295C414J3700
18256A7114d8672j0959j9634c8777B17056A8375b55156b0167j22451H0071a49013
18244c6572j65368k730m8337B1766j0113K16448f5128q7594c4021r211J7496q4900
18232a10636B48013i6547a0779L300k43692f164B04349h1344j1373j6466G4918
18220H7625c10589H1564d12577C7562a3262E0474g882m12924A36068h6293A70453
18208h6311l8288m6949r8378B4037g2311p3340m2755p6654A51543L34956a41588
$$ plain form
18196 44033 -198197 -24721 -140562 49606 26266 456316 -246872 20001 -93629 281906 -20498
18184 10527 -258529 104656 -35275 -205904 12443 -161821 224837 15958 23740 -199264 85392
18172 -218234 40375 -315847 -445124 -169065 162152 146703 21870 -9788 119995 -28396 -50700
18161 -50700 -312104 351970 98337 -242185 143594 26004 194987 -118494 170711 -167631
18150 68528 -152133 121959 -171763 -52417 171280 513973 -136047 -15395 -197459 -220805
18140 -220805 -487447 -319709 66112 -145446 -122114 -331139 -129460 -4935 90675 -79617 -114185
18129 -114185 182483 -105198 -38696 -148723 136271 -101159 -2944 115388 -83781 -14908
18118 1241 -294656 141315 -165676 -185753 -12214 -252746 -135464 -7508 44945 -338571 36484
$$ packed form
18196D4033a98197b4721j15841D9606k3340M30050b46872B0001i3629B81906b0498
18184A0527b58529A04656c5275j70629A2443a61821B24837A5958P782a99264H5392
18172b18234D0375c15847j29277a69065A62152j5449B1870i788A19995b8396k2304
18161e0700k61404C51970I8337b42185A43594B6004J68983a18494A70711a67631
18150F8528a52133A21959a71763e2417A71280L42693a36047a5395j82064k3346
18140b20805k66642J67738F6112a45446K3332k09025a29460d935I0675g9617l4568
18129a14185A82483a05198c8696j10027A36271a01159b944A15388h3781a4908
18118A241b94656A41315a65676k0077a2214k40532J17282g508D4945c38571C6484
$$ plain form
18106 -133888 397547 -89384 -542591 -100619 115238 -273754 29844 -210286 -58470 19884
18095 -35649 162383 154256 240779 -64142 89991 -149580 42923 -153824 50913 121724 -51337
18083 70426 134188 26800 71880 -97185 203824 -96087 -21131 -224821 116357 -190658 38746
$$ packed form
18106a33888C97547h9384m53207a00619A15238b73754B9844b10286e8470A9884
18095c5649A62383q127Q6523f4142H9991a49580D2923a53824E0913P0811e1337
18083G0426O3762B6800M5080i7185B03824i6087b1131k03690A16357a90658C8746
18071h