
##TITLE=AC1407_PERAH12216_7653017_7f91amZpev
##JCAMPDX= 6.0         $$ Bruker NMR JCAMP-DX V2.0
##DATA TYPE= NMR SPECTRUM
##DATA CLASS= NTUPLES
##ORIGIN= BRUKER
##OWNER= Administrator
$$ 1.72 TOPSPIN		Version 2.1
$$ 2013-03-19 22:03:43.017 -0500  Administrator@X
$$ Compression mode = diff/dup
##.OBSERVE FREQUENCY= 400.02188249412
##.OBSERVE NUCLEUS= ^1H
##.ACQUISITION MODE= SIMULTANEOUS (DQD)
##.ACQUISITION SCHEME= undefined
##.AVERAGES= 8
##.DIGITISER RES= 22
##SPECTROMETER/DATA SYSTEM= spect
##.PULSE SEQUENCE= zg30
##.SOLVENT NAME= COFFEE_meoh
##.SHIFT REFERENCE= INTERNAL, COFFEE_meoh, 1, 14.98509
##AUDIT TRAIL= $$ (NUMBER, WHEN, WHO, WHERE, PROCESS, VERSION, WHAT)
$$ ##TITLE= Audit trail, TOPSPIN		Version 2.1
$$ ##JCAMPDX= 5.01
$$ ##ORIGIN= Bruker BioSpin GmbH
$$ ##OWNER= Administrator
$$ $$ E:\/data/COFFEE/nmr/AC1407_PERAH12216_7653017_7f91amZpev/10/pdata/1/auditp.txt
$$ ##AUDIT TRAIL=  $$ (NUMBER, WHEN, WHO, WHERE, PROCESS, VERSION, WHAT)
(   1,<2013-03-19 22:03:34.736 -0500>,<Administrator>,<X>,<go>,<TOPSPIN 2.1>,
      <created by zg
	started at 2013-03-19 22:02:28.673 -0500,
	POWCHK enabled, PULCHK disabled,
       configuration hash MD5:
       86 BA 57 50 F2 9D 5C 9B 26 00 A9 28 5F 66 2E 89
       data hash MD5: 64K
       18 BA EB 40 00 D7 63 41 A5 4E 7A A2 A5 97 32 F3>)
(   2,<2013-03-19 22:03:37.845 -0500>,<Administrator>,<X>,<proc1d>,<TOPSPIN 2.1>,
      <Start of raw data processing
       efp LB = 0 FT_mod = 6 PKNL = 1 PHC0 = 0 PHC1 = 0 SI = 32K 
       data hash MD5: 32K
       C7 D7 91 C5 DF FC 7E 9E BF 03 FA 70 84 A0 B1 4E>)
(   3,<2013-03-19 22:03:38.329 -0500>,<Administrator>,<X>,<proc1d>,<TOPSPIN 2.1>,
      <pk PHC0 = 102.7441 PHC1 = 0 
       data hash MD5: 32K
       77 9D D5 B0 5E CF 11 E8 17 99 F1 05 B1 BC 18 A9>)
(   4,<2013-03-19 22:03:38.564 -0500>,<Administrator>,<X>,<proc1d>,<TOPSPIN 2.1>,
      <abs ABSG = 1 
       data hash MD5: 32K
       68 3A 8F C1 80 43 A0 7F F7 CD E9 45 06 66 A2 D5>)
(   5,<2013-03-19 22:03:38.720 -0500>,<Administrator>,<X>,<proc1d>,<TOPSPIN 2.1>,
      <abs ABSG = 2 
       data hash MD5: 32K
       D0 FF 80 81 D7 82 F8 8A C0 AE CA 53 4C 3A 56 10>)
(   6,<2013-03-19 22:03:38.861 -0500>,<Administrator>,<X>,<proc1d>,<TOPSPIN 2.1>,
      <abs ABSG = 3 
       data hash MD5: 32K
       9E 38 D6 CB 5E 08 C9 FB AE 54 26 3A 3E F1 CC C0>)
(   7,<2013-03-19 22:03:39.032 -0500>,<Administrator>,<X>,<proc1d>,<TOPSPIN 2.1>,
      <abs ABSG = 4 
       data hash MD5: 32K
       2A E6 20 CF 79 54 06 73 A1 44 D7 6E 71 B5 B9 76>)
(   8,<2013-03-19 22:03:39.173 -0500>,<Administrator>,<X>,<proc1d>,<TOPSPIN 2.1>,
      <abs ABSG = 5 
       data hash MD5: 32K
       B3 71 3A 6A F5 83 7D 4E 6F B2 C6 39 90 63 D3 8A>)
$$ ##END=
$$ 
$$ $$ hash MD5
$$ $$ 2C 07 A0 1E 1F 21 74 92 40 E0 7D F5 24 06 A4 8A
##$RELAX= 
##$RELAX= 
##$RELAX= 
##$RELAX= 
##$RELAX= 
##$RELAX= 
##$RELAX= 
$$ Bruker specific parameters
$$ --------------------------
##$DU= <E:\>
##$EXPNO= 10
##$NAME= <AC1407_PERAH12216_7653017_7f91amZpev>
$$ [...]
##$TP= (0..7)
150 150 150 150 150 150 150 150
##$TP07= 0
##$TPNAME0= <>
##$TPNAME1= <>
##$TPNAME2= <>
##$TPNAME3= <>
##$TPNAME4= <>
##$TPNAME5= <>
##$TPNAME6= <>
##$TPNAME7= <>
##$TPOAL= (0..7)
0.5 0.5 0.5 0.5 0.5 0.5 0.5 0.5
##$TPOFFS= (0..7)
0 0 0 0 0 0 0 0
##$TUNHIN= 0
##$TUNHOUT= 0
##$TUNXOUT= 0
##$USERA1= <user>
##$USERA2= <user>
##$USERA3= <user>
##$USERA4= <user>
##$USERA5= <user>
##$V9= 5
##$VALIST= <valist>
##$VCLIST= <CCCCCCCCCCCCCCC>
##$VD= 0
##$VDLIST= <DDDDDDDDDDDDDDD>
##$VPLIST= <PPPPPPPPPPPPPPP>
##$VTLIST= <TTTTTTTTTTTTTTT>
##$WBST= 2048
##$WBSW= 25
##$XGAIN= (0..3)
0 0 0 0
##$XL= 0
##$YL= 0
##$YMAX_a= 602628
##$YMIN_a= -516839
##$ZGOPTNS= <>
##$ZL1= 120
##$ZL2= 120
##$ZL3= 120
##$ZL4= 120
##$ABSF1= 14.98509
##$ABSF2= -5.573092
##$ABSG= 5
##$ABSL= 3
##$ALPHA= 0
##$AQORDER= 0
##$ASSFAC= 0
##$ASSFACI= 0
##$ASSFACX= 0
##$ASSWID= 0
##$AUNMP= <proc_prof1d_extract_pilot.lims>
##$AXLEFT= 0
##$AXNAME= <>
##$AXNUC= <1H>
##$AXRIGHT= 0
##$AXTYPE= 0
##$AXUNIT= <>
##$AZFE= 0.1
##$AZFW= 0.1
##$BCFW= 0
##$BC_mod= 0
##$BYTORDP= 0
##$COROFFS= 0
##$CY= 15
##$DATMOD= 1
##$DC= 0
##$DFILT= <>
##$DTYPP= 0
##$F1P= 0
##$F2P= 0
##$FCOR= 0.5
##$FTSIZE= 32768
##$FT_mod= 6
##$GAMMA= 0
##$GB= 0
##$INTBC= 1
##$INTSCL= 1
##$ISEN= 128
##$LB= 0
##$LEV0= 0
##$LPBIN= 0
##$MAXI= 10000
##$MC2= 0
##$MEAN= 0
##$ME_mod= 0
##$MI= 0
##$NCOEF= 0
##$NC_proc= -8
##$NLEV= 6
##$NOISF1= 0
##$NOISF2= 0
##$NSP= 0
##$NTH_PI= 0
##$NZP= 0
##$OFFSET= 14.98509
##$PC= 1
##$PHC0= 102.7441
##$PHC1= 0
##$PH_mod= 1
##$PKNL= yes
##$PPARMOD= 0
##$PPDIAG= 0
##$PPIPTYP= 0
##$PPMPNUM= 2147483647
##$PPRESOL= 1
##$PSCAL= 4
##$PSIGN= 0
##$PYNMP= <proc.py>
##$REVERSE= no
##$SF= 400.02
##$SI= 32768
##$SIGF1= 0
##$SIGF2= 0
##$SINO= 400
##$SIOLD= 32768
##$SPECTYP= <>
##$SREGLST= <1H.CDCl3>
##$SSB= 0
##$STSI= 32768
##$STSR= 0
##$SW_p= 8223.68421052631
##$SYMM= 0
##$S_DEV= 0
##$TDeff= 65536
##$TDoff= 0
##$TI= <>
##$TILT= no
##$TM1= 0
##$TM2= 0
##$TOPLEV= 0
##$USERP1= <user>
##$USERP2= <user>
##$USERP3= <user>
##$USERP4= <user>
##$USERP5= <user>
##$WDW= 1
##$XDIM= 32768
##$YMAX_p= 457570068
##$YMIN_p= -741653
##$CURPLOT= <Network HP LaserJet P1505>
##$CURPRIN= <$Network HP LaserJet P1505>
##$DFORMAT= <normdp>
##$LAYOUT= <+/1D_H.xwp>
##$LFORMAT= <normlp>
##$PFORMAT= <normpl>
##$SURQMSG= 1
$$ End of Bruker specific parameters
$$ ---------------------------------
##NTUPLES= NMR SPECTRUM
##VAR_NAME=  FREQUENCY,     SPECTRUM/REAL,   SPECTRUM/IMAG
##SYMBOL=    X,             R,               I
##VAR_TYPE=  INDEPENDENT,   DEPENDENT,       DEPENDENT
##VAR_FORM=  AFFN,          ASDF,            ASDF
##VAR_DIM=   32768,         32768,           32768
##UNITS=     HZ,            ARBITRARY UNITS, ARBITRARY UNITS
##FACTOR=    0.250966925370066, 1,           1
##FIRST=     8223.43324360094, 72869,        82887
##LAST=      0,             260331,          -64177
##MIN=       0,             -741653,         0
##MAX=       8223.43324360094, 457570068,    0
$$ Real data points
##PAGE= N=1
##DATA TABLE= (X++(R..R)), XYDATA
$$ [...]
19576a99027J9809F3199K49262B4620K66473C4558b76279o2972a49545j77961
$$ -199027 -179218 63199 312461 24620 291093 34558 -276279 -339251 -149545 -327506
19566c27506A43488b63823A70026h1910k69383f2062k61091e5921j0221A55519
$$ -327506 143488 -263823 170026 -81910 -351293 -62062 -323153 -55921 -66142 155519
19555A32435b21645B93803I034a59631e8425l29684F5744b69501e3307D7060h3105
$$ 132435 -221645 293803 9034 -159631 -58425 -388109 65744 -269501 -53307 47060 -83105
19543A01673b18394o505Q4928O0712o6249n0377L9231j3735Q1737p0775N4918
$$ 101673 -218394 -224899 -139971 -79259 -145508 -195885 -156654 -170389 -88652 -159427 -104509
19532a04509I910a37537f1758j1584j65054R6046j77978B21588k9873B1887K76720
$$ -104509 9910 -137537 -61758 -73342 -238396 -142350 -320328 221588 191715 21887 298607
19521B98607D1853M3115J10965b41240C1596a35736M1864C664b35574A00745A9556
$$ 298607 41853 84968 195933 -241240 31596 -135736 -93872 3664 -235574 100745 19556
19509a56138B4477O422M6672K1216a97311B74153D2699M8974b70285f8381H9602
$$ -156138 24477 30899 77571 98787 -197311 274153 42699 91673 -270285 -68381 89602
19497b86689r2348B93880f3000I044R3615c25033A70171a67798D1290a95893k3009
$$ -286689 -379037 293880 -63000 9044 102659 -325033 170171 -167798 41290 -195893 -218902
19486b18902A59274b0993g496p6508C24203G4124C2449a85470I7027l4963a43046
$$ -218902 159274 -20993 -7496 -84004 324203 74124 32449 -185470 97027 62064 -143046
19474A11789c9492o7045o2792j24749B0964a1608n62q3666n006B98a91271p6895
$$ 111789 -39492 -106537 -169329 -294078 20964 -11608 -12170 -95836 -100842 298 -191271 -268166
19462b68166A1749a57913N9441C56474a61454j17706i3728j66667f6027B01353
$$ -268166 11749 -157913 -98472 356474 -161454 -279160 -93728 -260395 -66027 201353
19451b22696e3964G7980B6829c46301A29878M798a20571C33714a68365d3882n1806
$$ -222696 -53964 77980 26829 -346301 129878 134676 -120571 333714 -168365 -43882 -95688
19440i5688b868k57165o1428C46511c2960j1414A77440n0071a1820B866J03200
$$ -95688 -2868 -260033 -321461 346511 -32960 -44374 177440 127369 -11820 2866 106066
19429A06066J71628a22974f040o609j41392k83373h8910B55138A4198a01417d4947
$$ 106066 277694 -122974 -6040 -12649 -154041 -437414 -88910 255138 14198 -101417 -44947
19417b72416Q7229q5707J05304C1629J26512a04924m28590F1046O8278g5492E6862
$$ -272416 -185187 -270894 -165590 31629 158141 -104924 -533514 61046 129324 -75492 56862
19405i913G0711h3412k46256B0756d1275p2310Q33E3240O2513e4354q4128j88050
$$ -9913 70711 -83412 -329668 20756 -41275 -113585 -112752 53240 115753 -54354 -138482 -326532
19393c26532f8488p270c6117A69593b00610I6567K51247A00338b72790h3197J9178
$$ -326532 -68488 -75758 -36117 169593 -200610 96567 347814 100338 -272790 -83197 -64019
19382f4019q1141j19064N8987Q8217k24378g996D9378b04628F6041K01914C9797
$$ -64019 -145160 -264224 -205237 -117020 -341398 -7996 49378 -204628 66041 267955 39797
19370a04194A5881i7122D2789A6429a43983a5656n3776C888b84416b8963B5815
$$ -104194 15881 -97122 42789 16429 -143983 -15656 -69432 3888 -284416 -28963 25815
19358F3006c59941A34214b9638m7616J636A39145A8168f7086k13633f3331r6065
$$ 63006 -359941 134214 -29638 -77254 -75618 139145 18168 -67086 -280719 -63331 -159396
19347a59396N9692J259A66019c93117a16533A04099h8215a6790B21313i074A05758
$$ -159396 -99704 -98445 166019 -393117 -116533 104099 -88215 -16790 221313 -9074 105758
19335b74725a26796l2888c5701p2586k16053A08084a85241F4157j7781J15374
$$ -274725 -126796 -159684 -35701 -108287 -324340 108084 -185241 64157 46376 161750
19325A61750B3279b44909A34359e21019b14483I8712a38140E405d95706A95325
$$ 161750 23279 -244909 134359 -521019 -214483 98712 -138140 5405 -495706 195325
19314D2811L61497A1040b9650D8310J6105J43637K2899e7314r2405f0199D9541
$$ 42811 404308 11040 -29650 48310 64415 208052 230951 -57314 -149719 -60199 49541
19302a36483r6723G5406a343B17088q7505c65135a66698A17923a18460F0713b22472
$$ -136483 -233206 75406 -1343 217088 129583 -365135 -166698 117923 -118460 60713 -222472
19290E5888a67696l5731K9345f3886L1573k0929j09053H783J51874h5631C8178
$$ 55888 -167696 -203427 -174082 -63886 -32313 -53242 -162295 8783 160657 -85631 38178
19278A21945J2674E8234J38745a20037A55645a79117e9239m255F6443J95464e1195
$$ 121945 134619 58234 196979 -120037 155645 -179117 -59239 -63494 66443 261907 -51195
19266a20417A36677i0136q4407C41067b11944K5289e0472q4280m0138j2998E9244
$$ -120417 136677 -90136 -174543 341067 -211944 -186655 -50472 -134752 -174890 -187888 59244
19254d6520j77757k05011J56139a2481j60954c3214B22873d3187E1844b31065
$$ -46520 -224277 -429288 -273149 -12481 -173435 -33214 222873 -43187 51844 -231065
19243b15762C931h247j81824E8220a08990l0271L185M6702A26221i7138k06694
$$ -215762 3931 -8247 -190071 58220 -108990 -139261 -136076 -89374 126221 -97138 -303832
19232c03832O6391E2345a53735A70510b41433K8534k9533A71322c06941A01985
$$ -303832 -237441 52345 -153735 170510 -241433 -212899 -242432 171322 -306941 101985
19221c909l6505m3266E0830N6773E1812L7794c08848A16423a81723B00548F3240
$$ -3909 -40414 -83680 50830 107603 51812 89606 -308848 116423 -181723 200548 63240
19209h8609j04722C4924L31155A27230e4950A84102d91717e2030o2747K3103A17633
$$ -88609 -193331 34924 366079 127230 -54950 184102 -491717 -52030 -114777 -91674 117633
19197A12804C7414C755N5316c6807j7273k36765a8997m45848e1291J574k928B09264
$$ 112804 37414 3755 59071 -36807 -54080 -290845 -18997 -464845 -51291 -49717 -52645 209264
19184a73248P4763B38800H0154c68399K9780c0647k7825K5608C83299b33886O5940
$$ -173248 -98485 238800 80154 -368399 -338619 -30647 -58472 -32864 383299 -233886 -167946
19173a67946L5123L5372j64313q3989a72179A60965J20705b03440H2262c4821
$$ -167946 -132823 -97451 -261764 -345753 -172179 160965 281670 -203440 82262 -34821
19162a77054E8527J9750h034k07010b0938p2744M6441p4874G8980l0845K0666
$$ -177054 58527 78277 -8034 -215044 -20938 -93682 -47241 -122115 78980 48135 68801
19151F8801j199g3199m2129B2435e4991o3904r4181f6961k5754j30036K2938h649
$$ 68801 67602 -73199 -115328 22435 -54991 -118895 -213076 -66961 -92715 -222751 -199813 -8649
19138A01896g7111k97383C02445d14417a589o7424A77849l0576I383a33377l12112
$$ 101896 -77111 -374494 302445 -414417 -1589 -69013 177849 147273 9383 -133377 -445489
19127d45489i5058D6290J19855a30178J2835l19318D8582M0520b93932D4257J30984
$$ -445489 -95058 46290 166145 -130178 -117343 -436661 48582 89102 -293932 44257 175241
19116A75241A9570p820K97599b75533A41575d33571l3561e2892K2964j04948A36960
$$ 175241 19570 11750 309349 -275533 141575 -433571 -467132 -52892 -29928 -134876 136960
19104g4349F1216c23633D5099A5482i5848j27100k6494G2477G672a09786C630
$$ -74349 61216 -323633 45099 15482 -95848 -222948 -249442 72477 7672 -109786 3630
19092A9350a90826C03681j47052Q8744a09786k49710c3040k6169D6462K75173
$$ 19350 -190826 303681 156629 245373 -109786 -359496 -33040 -59209 46462 321635
19082C21635A47180q408a46713B85058F7960a18574A61317b68700B82906a05008
$$ 321635 147180 138772 -146713 285058 67960 -118574 161317 -268700 282906 -105008
19071a36470o8558m1379a2062k11254j45319G1905a02138G4608a96918E666b861
$$ -136470 -205028 -246407 -12062 -223316 -368635 71905 -102138 74608 -196918 5666 -2861
19059c14152B53036E2883b89866a03068j7160B916a37451j55010o8229J55700
$$ -314152 253036 52883 -289866 -103068 -120228 2916 -137451 -292461 -360690 -204990
19049b04990R8792H6214a98851I0602c08713i2341m3096D7127c3402A8821L4955
$$ -204990 -106198 86214 -198851 90602 -308713 -92341 -135437 47127 -33402 18821 53776
19038E3776b81314E1611d9744j86141C14301d18487G1612f0165B22494r5026K602
$$ 53776 -281314 51611 -49744 -235885 314301 -418487 71612 -60165 222494 127468 130070
19027A30070h8972k357E09007b54852A43199J07399A06687a5679j07738A27800
$$ 130070 -88972 -91329 509007 -254852 143199 250598 106687 -15679 -123417 127800
19016A76187K5763D2637b50144c3963q9279c8421D49885d4048D0654d1531A36623
$$ 176187 201950 42637 -250144 -33963 -123242 -38421 449885 -44048 40654 -41531 136623
19004A75464p0084b77093c8502I2497a14784l6977G9902b40875B53294a5177G3622
$$ 175464 105380 -277093 -38502 92497 -114784 -151761 79902 -240875 253294 -15177 73622
18992d5850l34457D60210c65577A6358b58416a315B56816b24520J1751P8027B71735
$$ -45850 -380307 460210 -365577 16358 -258416 -1315 256816 -224520 -212769 -134742 271735
18980d7293k25028k9445G4298k1086P5872a76157g6851p1926r6164c3887I2506
$$ -47293 -272321 -301766 74298 53212 129084 -176157 -76851 -148777 -244941 -33887 92506
18968D4619a92447O4057k17638A75270j0912p8718e2419A94103e6628k37639h5662
$$ 44619 -192447 -128390 -346028 175270 164358 85640 -52419 194103 -56628 -294267 -85662
18956h3410k566j84628E9674d20893J91921L1292L2320r6809B10817a95665P0210
$$ -83410 -85976 -270604 59674 -420893 -228972 -197680 -165360 -262169 210817 -195665 -125455
18945a25455K613J8014C76638A47206a81415A60958d3358C2342R1951B4792J15495
$$ -125455 -122842 -104828 376638 147206 -181415 160958 -43358 32342 124293 24792 140287
18934A40287g6768j43139H0825a60550B7150I35N4530d1657A6800a54766p7637
$$ 140287 -76768 -219907 80825 -160550 27150 935 55465 -41657 16800 -154766 -232403
18923b32403a4651P2A23719g7815b2969j96707N9902L1584K6732r2510E6701b25789
$$ -232403 -14651 -14579 123719 -77815 -22969 -219676 -159774 -128190 -101458 -193968 56701 -225789
18910c04566G0349a63990A11145D8042J11697K3257a68735E5404K49928F4081
$$ -304566 70349 -163990 111145 48042 159739 182996 -168735 55404 305332 64081
18899a25973b1196k27932R4180k9837A4252a74954A39795e0410k63942A0396a39999
$$ -125973 -21196 -249128 -154948 -184785 14252 -174954 139795 -50410 -314352 10396 -139999
18887a76542M3207j08014J9754n6431a38392E7672a2457j29163A34459b25519
$$ -176542 -133335 -241349 -221595 -278026 -138392 57672 -12457 -141620 134459 -225519
18876D6475O4029b63584P2136j28203a52242j25686b6776j05362j87566A78886
$$ 46475 110504 -263584 -191448 -319651 -152242 -277928 -26776 -132138 -319704 178886
18865h0898J2595j08473B6026h4076B23440a32912A5362i2764B98450r8437D6569
$$ -80898 -68303 -176776 26026 -84076 223440 -132912 15362 -92764 298450 200013 46569
18853B51130A1628a07797G7048d8989A37610a13529j43311a9839B13957a37611
$$ 251130 11628 -107797 77048 -48989 137610 -113529 -256840 -19839 213957 -137611
18842A93451j2274a59033c7911n8643E1863J93072j5861l0401O4011D7732a63280
$$ 193451 181177 -159033 -37911 -96554 51863 244935 229074 198673 262684 47732 -163280
18830a5395F4880f710j78102M0118q9885e5222k5148l979A8766K00745D4938J94496
$$ -15395 64880 -6710 -184812 -144694 -234579 -55222 -80370 -84349 18766 219511 44938 239434
18818B39434I5635L51170a08922c7310j9847A24514m0129J126G770L7533b17263
$$ 239434 95635 446805 -108922 -37310 -57157 124514 84385 85511 7770 45303 -217263
18806b99063B0502K75656e149j42499c8954B18147d2455j85424A20618c3421J3384
$$ -299063 20502 296158 -5149 -147648 -38954 218147 -42455 -227879 120618 -33421 -20037
18795b0037k14099h170k1177l25245N5494N2650I2071B7208R2459b35680i7430
$$ -20037 -234136 -8170 -29347 -354592 -299098 -246448 92071 27208 119667 -235680 -97430
18783b1640k19597A90959c5652A16375a12269l25551J20043B2652c49215J71270
$$ -21640 -241237 190959 -35652 116375 -112269 -437820 -317777 22652 -349215 -177945
18773a77945o7227a04878l65850D1446i9954A67716h2440D3599d4880k7261j09833
$$ -177945 -245172 -104878 -470728 41446 -99954 167716 -82440 43599 -44880 -72141 -181974
18762a81974q34P1232E8762J22278c10915a52052M3090k67207A6184g4359I1207
$$ -181974 -182808 -111576 58762 181040 -310915 -152052 -108962 -376169 16184 -74359 91207
18750a15769J3715A07294a93177Q6259B22728n26b36635a06371I5580j6852e53152
$$ -115769 -102054 107294 -193177 -106918 222728 222202 -236635 -106371 95580 78728 -553152
18738a15859L3980o4770B50369D6261K32361c09271J50055C47465h8671A86803
$$ -115859 -81879 -146649 250369 46261 278622 -309271 -159216 347465 -88671 186803
18727a92501O651F8245P472k1975K49034b2722g354A09602n1705f9826d169k84671
$$ -192501 -185850 68245 75717 53742 302776 -22722 -7354 109602 57897 -69826 -4169 -288840
18715b88840o1550b5175A97989J17275c11479f795k75725C7205O4797a45383a2245
$$ -288840 -350390 -25175 197989 315264 -311479 -6795 -282520 37205 102002 -145383 -12245
18703c7620j48268K3638d0506j45701C67020c79300a38340b7850I8099m4389K98818
$$ -37620 -185888 -162250 -40506 -186207 367020 -379300 -138340 -27850 98099 53710 352528
18692C52528E5401a49213d2734p5416o2750k25647B30864E7797A0001R035a80877
$$ 352528 55401 -149213 -42734 -118150 -180900 -406547 230864 57797 10001 19036 -180877
18680a19366A57834Q3695a93612b4613A84478B3003N38b19798B02496J3640H9898
$$ -119366 157834 241529 -193612 -24613 184478 23003 23541 -219798 202496 216136 89898
18668a14020C5129a55363A16360a53741D1930J99394B2656Q6327L59914b09363
$$ -114020 35129 -155363 116360 -153741 41930 241324 22656 108983 468897 -209363
18657A80462b68639A1764a58402b5096D0849i1687B02107a31839B78865b28753
$$ 180462 -268639 11764 -158402 -25096 40849 -91687 202107 -131839 278865 -228753
18646d5279k40382b0314r9172D1531a06029c7464j0185l2414j58944e8694A07454
$$ -45279 -285661 -20314 -119486 41531 -106029 -37464 -47649 -80063 -239007 -58694 107454
18634b47946M2177G6706d55450C01777a11611q27j78225h0717D9964a76147j92320
$$ -247946 -205769 76706 -455450 301777 -111611 -112438 -290663 -80717 49964 -176147 -368467
18623c68467g4990p6260K7021j55177k2208C24947a74102C62104b21278d7041
$$ -368467 -74990 -151250 -124229 -279406 -301614 324947 -174102 362104 -221278 -47041
18612i3139j14949f2608B21842b09487d0014A86895D2222B992a36277k2391k7531
$$ -93139 -208088 -62608 221842 -209487 -40014 186895 42222 2992 -136277 -158668 -186199
18601a86199B47955a49346O8682j8356j14971G1060b1762k17921i2846o1969c4725
$$ -186199 247955 -149346 -80664 -99020 -213991 71060 -21762 -239683 -92846 -154815 -34725
18589c14742M3042A69873b0843B6199O4828f6952A89484b67848C31731f4207j13014
$$ -314742 -271700 169873 -20843 26199 91027 -66952 189484 -267848 331731 -64207 -177221
18578a77221A14873c5824k78676H2710A7327C464J87644q1396e6728j7514L488
$$ -177221 114873 -35824 -314500 82710 17327 3464 191108 109712 -56728 -74242 -70754
18567g0754j8477D6291b62096l0591D8244b15884C2953g7751p1548k39799A0188
$$ -70754 -89231 46291 -262096 -292687 48244 -215884 32953 -77751 -149299 -389098 10188
18555I8464i7075c4544c02C34175i8643L8382A3892b11339Q1808n4621K8620B86784
$$ 98464 -97075 -34544 -302 334175 -98643 -60261 13892 -211339 -129531 -184152 -155532 286784
18542a91658A25618i5622E5181J0840J01047a75077C8887b9855l81187a12224
$$ -191658 125618 -95622 55181 66021 167068 -175077 38887 -29855 -411042 -112224
18531C0874d0057n0483m485j05531P0050A8474a81317O9447b4445k56580O871
$$ 30874 -40057 -90540 -95025 -200556 -130506 18474 -181317 -111870 -24445 -281025 -274154
18520b74154C5387K84836a57812e5618B4364c66129J66440p7286A09816a24426
$$ -274154 35387 320223 -157812 -55618 24364 -366129 -199689 -276975 109816 -124426
18509a43392j46778B81006b4368G2835b34933G347c8834B27279m9438b84896B490
$$ -143392 -290170 281006 -24368 72835 -234933 7347 -38834 227279 177841 -284896 2490
18497b43783j61030a3911o878m10663A55417p5318f8674n6944A68646f3511A854
$$ -243783 -404813 -13911 -20789 -431452 155417 80099 -68674 -125618 168646 -63511 1854
18485d8817C44080c73915A51781e1018n7444q5894e1707J4803k07641n1563B54401
$$ -48817 344080 -373915 151781 -51018 -108462 -194356 -51707 -36904 -244545 -296108 254401
18473B78830a12481A51779B9335a83819g0838m257A68689d3618j09911N0948i563
$$ 278830 -112481 151779 29335 -183819 -70838 -75095 168689 -43618 -153529 -102581 -9563
18461b44324E44a22236E7650M8764a21549c5807B34433b69811f10m4807J9530
$$ -244324 544 -122236 57650 106414 -121549 -35807 234433 -269811 -610 -45417 -25887
18450b5887A08399A9772q716D32a46977k27217a61742J5344g2806B7118b87684
$$ -25887 108399 19772 11056 432 -146977 -374194 -161742 -146398 -72806 27118 -287684
18438g5291b4116H0066b4677q0497r3646b0104k38045C9416e6033r026r8853A46415
$$ -75291 -24116 80066 -24677 -105174 -198820 -20104 -258149 39416 -56033 -65059 -163912 146415
18425d28961f2629G2408b22261A86036a4921q3275j5030p1959o8415C93325b56881
$$ -428961 -62629 72408 -222261 186036 -14921 -98196 -113226 -185185 -253600 393325 -256881
18413b53557A41187c6555k4107k7453A68927Q9743a76069P9790C27489a18211
$$ -253557 141187 -36555 -60662 -88115 168927 258670 -176069 -96279 327489 -118211
18402e335j49789k48330d6643A13014R6290r9979C3012c51635J21743A75265o7188
$$ -5335 -155124 -403454 -46643 113014 209304 109325 33012 -351635 -229892 175265 108077
18391A08077a74189e7655h63j16602H095K82639H7164b59468e2691k25281A91659
$$ 108077 -174189 -57655 -863 -117465 8095 290734 87164 -259468 -52691 -277972 191659
18379a26400A98385A6219J78925J41087a26150A14422b22829k40012C7673R3831
$$ -126400 198385 16219 195144 336231 -126150 114422 -222829 -462841 37673 131504
18369A31504J93858b54874B04086a31793A60164d851F8154i9455O102J8350K9349
$$ 131504 325362 -254874 204086 -131793 160164 -4851 68154 -99455 -93353 -75003 -45654
18358d5654j77483Q1183C8818f6500A49408a11895F9112J6147c2906j53402A5970
$$ -45654 -223137 -141954 38818 -66500 149408 -111895 69112 85259 -32906 -186308 15970
18346e3389B47711a37326d8860j18231C64509H6268h8887b1681j8696a4777G3986
$$ -53389 247711 -137326 -48860 -167091 364509 86268 -88887 -21681 -40377 -14777 73986
18334A33676n6949f9260r9332A31660J9031a04925d2087D9931L489G191b61768
$$ 133676 76727 -69260 -168592 131660 150691 -104925 -42087 49931 53420 7191 -261768
18322A09860d7819B3267a87099H6138f4506b48B27152a61922r2904E4638J4027
$$ 109860 -47819 23267 -187099 86138 -64506 -248 227152 -161922 -254826 54638 68665
18311F8665P5691C9776N4149a02045q1466m2198M7723H9330f6618j82043p7251
$$ 68665 144356 39776 93925 -102045 -183511 -225709 -177986 89330 -66618 -248661 -325912
18300c25912A30b3999B27795p0282c9703l06994a2601j91484q5544D0058D936
$$ -325912 130 -23999 227795 157513 -39703 -346697 -12601 -204085 -289629 40058 4936
18288C7942J67177H4711a57894P1417c0896k05646C57990A0053a27231o5845G4425
$$ 37942 205119 84711 -157894 -86477 -30896 -236542 357990 10053 -127231 -193076 74425
18276h609k3202B18939b59029a13178A7573a56171J9072H2620L06633B4259e0928
$$ -8609 -31811 218939 -259029 -113178 17573 -156171 -137099 82620 389253 24259 -50928
18264E0377e5196A83662c6477H6053C5625J63025h3683a8917A32316D8958O2541
$$ 50377 -55196 183662 -36477 86053 35625 198650 -83683 -18917 132316 48958 111499
18253A11499i7109m6679L5584H3009B6298a63115p3104D4153a66964J7708E864
$$ 111499 -97109 -143788 -108204 83009 26298 -163115 -236219 44153 -166964 -149256 5864
18241H9306C1137h3400m8995B02971b12935Q9652l5237j74446j3856B56216B6373
$$ 89306 31137 -83400 -132395 202971 -212935 -123283 -158520 -332966 -346822 256216 26373
18229c7350A74486b03320D6323A0024Q3628f9987A07051j1078c88644a28326j48704
$$ -37350 174486 -203320 46323 10024 93652 -69987 107051 95973 -388644 -128326 -277030
18218b77030I5497e3879j03852N4881F3944F50b52010e0287A17703c08624g8173
$$ -277030 95497 -53879 -157731 -102850 63944 650 -252010 -50287 117703 -308624 -78173
18206c8185j04766A84174q5485m4341c3544j1833n9275A49404B5088b87628J20131
$$ -38185 -142951 184174 98689 54348 -33544 -45377 -104652 149404 25088 -287628 -167497
18195a67497A3604K28716l3691r7639j2806J3511d25644A83923C5605i7633j96208
$$ -167497 13604 242320 208629 110990 98184 111695 -425644 183923 35605 -97633 -293841
18184b93841m9924J64947j4727i345I7743a50430D2113c14136C0781a80277j83993
$$ -293841 -343765 -178818 -193545 -9345 97743 -150430 42113 -314136 30781 -180277 -364270
18173c64270f5916D1280O1014b08380j3165c9500A51790N9678C5270K4371i499
$$ -364270 -65916 41280 102294 -208380 -221545 -39500 151790 211468 35270 59641 -9499
18161I0419a65038J9167l1156e9469B40287G0162a30839b1116I2422b47973G5710
$$ 90419 -165038 -145871 -177027 -59469 240287 70162 -130839 -21116 92422 -247973 75710
18149a96834j3021R3232l21473b06325c817C1894a16794a9791j25802B5395a37028
$$ -196834 -209855 -116623 -438096 -206325 -3817 31894 -116794 -19791 -145593 25395 -137028
18137D5359R5795a59626l41769h7785A76091a87339g0758A30118b36210B70111
$$ 45359 141154 -159626 -501395 -87785 176091 -187339 -70758 130118 -236210 270111
18126H9682g599r0675b9486Q413m3038E0064J8724i5927r1945K3047j3074k43742
$$ 89682 -7599 -98274 -29486 -21073 -64111 50064 68788 -95927 -187872 -164825 -177899 -421641
18114d21641d229k02089j87477f3211r4548G9364k2411K6776O9965a1673j17101
$$ -421641 -4229 -206318 -393795 -63211 -157759 79364 56953 83729 153694 -11673 -128774
18103a28774a8435l2386j24698A36285B2335F149M4006a69816l017d3745m322
$$ -128774 -18435 -50821 -175519 136285 22335 6149 50155 -169816 -172833 -43745 -48067
18092d8067j50425D0258b24598J1933B18697c42077d0775M346E2085b33269E6125
$$ -48067 -198492 40258 -224598 -212665 218697 -342077 -40775 -36429 52085 -233269 56125
18080c55403b4001l75070b0793k35578f4615r1346N7089C37229a18031n5400A4655
$$ -355403 -24001 -399071 -20793 -256371 -64615 -155961 -98872 337229 -118031 -173431 14655
18068e4094A54620b91797H2442M1555a2540j48359C43749h1369A59709g1647a6483
$$ -54094 154620 -291797 82442 123997 -12540 -160899 343749 -81369 159709 -71647 -16483
18056b39234H4334b46845B38857L8156a09234B55081B6957a1991A40065J46992
$$ -239234 84334 -246845 238857 277013 -109234 255081 26957 -11991 140065 287057
18046B87057b41793B52289B3854C929b90489B20569n6230K1395K52777a59283
$$ 287057 -241793 252289 23854 3929 -290489 220569 164339 185734 438511 -159283
18035A86658h5536A653c3911k34199J33924A17796J8564c7163A07972c26319B13261
$$ 186658 -85536 1653 -33911 -268110 -134186 117796 136360 -37163 107972 -326319 213261
18023D856b40865D5295J66218c0610l1141B35842M9f0137k4286A71595b07314
$$ 4856 -240865 45295 211513 -30610 -61751 235842 235891 -60137 -84423 171595 -207314
18011a10457a1982k8281A87649a05438K4404k50744I5846Q1216a41163B8549b23782
$$ -110457 -11982 -40263 187649 -105438 -81034 -331778 95846 177062 -141163 28549 -223782
17999E1766c14223O8375C13100q4187D3951R4499N9638I5564b54714A3771J6169
$$ 51766 -314223 -245848 313100 228913 43951 138450 198088 95564 -254714 13771 29940
17988B9940b41683B08220r8148d3575A39291c6745A46743J5813o7981b9150C3762
$$ 29940 -241683 208220 110072 -43575 139291 -36745 146743 162556 94575 -29150 33762
17976a33655K4557M7114G5706B8968Q0626b03898p9663B26722B5346R3751f0267
$$ -133655 -109098 -61984 75706 28968 109594 -203898 -283561 226722 25346 119097 -60267
17964a15115L0309n8897b058j67999D1873M2434h9557c5697p4141q516j17884
$$ -115115 -84806 -143703 -2058 -170057 41873 84307 -89557 -35697 -109838 -118354 -236238
17953b36238A0455i548B44568b3495p0850n1942A9618a6997C21823b01289B11073
$$ -236238 10455 -9548 244568 -23495 -94345 -146287 19618 -16997 321823 -201289 211073
17941A47718n4104k3837b07770I9484J95477A42249E1077J11191D9224M928Q9836
$$ 147718 93614 69777 -207770 99484 294961 142249 51077 162268 49224 54152 143988
17930A43988a24548A23051b06969I9429J29459b99032a44536A01192E74Q4072
$$ 143988 -124548 123051 -206969 99429 228888 -299032 -144536 101192 574 84646
17920H4646J16361h7457K4259b1459j62547D0191b69908M20c2792j09254J0170
$$ 84646 201007 -87457 -63198 -21459 -184006 40191 -269908 -269488 -32792 -142046 -131876
17909a31876B26134F5524L7698a14881K1398f187A03517b35491d2821j20103N330
$$ -131876 226134 65524 103222 -114881 -93483 -6187 103517 -235491 -42821 -162924 -157594
17898a57594E4433e7271C83a29528A10639c99118C17111b34240A54026a66504
$$ -157594 54433 -57271 383 -129528 110639 -399118 317111 -234240 154026 -166504
17887g0033j86252I4237a87266j65944a21242A11646O4881c05538d5322J9146
$$ -70033 -256285 94237 -187266 -353210 -121242 111646 176527 -305538 -45322 -26176
17877b6176I590h2513j9602b5228A13082b51849F2060d5089I7536l6799a0690
$$ -26176 9590 -82513 -102115 -25228 113082 -251849 62060 -45089 97536 60737 -10690
17865d0922F1573q827a4077q9751B9490n531J2185L20350g1499k57450i6906A09666
$$ -40922 61573 52746 -14077 -103828 29490 23959 36144 356494 -71499 -328949 -96906 109666
17852b66542B07255R3675a52745A87936c94345M0896e8599E2894J55005J49111
$$ -266542 207255 300930 -152745 187936 -394345 -353449 -58599 52894 207899 357010
17842C57010c34742A38391A7379d8415G5119a8309j29929c148k27032g1272B39940
$$ 357010 -334742 138391 17379 -48415 75119 -18309 -148238 -3148 -230180 -71272 239940
17830D0188K23017K02320A02969h2598l205I0738a27885I1843a01877k39624h9431
$$ 40188 263205 465525 102969 -82598 -85803 90738 -127885 91843 -101877 -341501 -89431
17818h990A51116f8761J392r3841j51288B30260a13086N5280A4235g8561B84412
$$ -8990 151116 -68761 -67369 -161210 -312498 230260 -113086 -57806 14235 -78561 284412
17806b49916A73107J7857b06746A0385b59887M5463f9061I1456r596J39729k0623
$$ -249916 173107 190964 -206746 10385 -259887 -214424 -69061 91456 81860 221589 200966
17795B00966G7887K70108D7577c6191k49079d6079A31360d9227A68104f7870b4322
$$ 200966 77887 347995 47577 -36191 -285270 -46079 131360 -49227 168104 -67870 -24322
17783I2919A8930O4410Q4896b20043P6660A7502J7010J23137a0080r836k21200
$$ 92919 18930 83340 168236 -220043 -143383 17502 34512 157649 -10080 -19916 -241116
17772b41116B08242c7792B3412N4280J50182E1893O1024a59016O2872H706b32080
$$ -241116 208242 -37792 23412 77692 227874 51893 112917 -159016 -96144 8706 -232080
17760H4294Q1127h2260a0880k69441A12075b7689H2649m0354b33047F0464R2998
$$ 84294 165421 -82260 -10880 -280321 112075 -27689 82649 42295 -233047 60464 153462
17749A53462a07591L3099B26419j08551c9160G705Q1098j0029b21420a01814H8931
$$ 153462 -107591 -74492 226419 117868 -39160 7705 88803 78774 -221420 -101814 88931
17737B2336P9034Q2748e7429A09664d3720B53207F3360J32373a12506L3931A61963
$$ 22336 101370 184118 -57429 109664 -43720 253207 63360 195733 -112506 -78575 161963
17725C27133q2543J7907F411O2435i2812A16519J63143D6110c37354J65384N6433
$$ 327133 244590 262497 6411 68846 -92812 116519 279662 46110 -337354 -171970 -115537
17714a15537I3386a64765d674o9848A12621i5299b4570B0656b94652A61250a39183
$$ -115537 93386 -164765 -4674 -74522 112621 -95299 -24570 20656 -294652 161250 -139183
17702B4607J40811a56629A61521A7724R3298H460a31219f3839F7376G715N441
$$ 24607 165418 -156629 161521 17724 111022 8460 -131219 -63839 67376 7715 13156
17691A3156b41187B57837k402l6796b97423A37042D7987J93940N8380F622L3131
$$ 13156 -241187 257837 255435 218639 -297423 137042 47987 241927 300307 6622 39753
17680C9753d7566q7375I6776a20173B23579P1063B1000p017J82874d2964p0508
$$ 39753 -47566 -134941 96776 -120173 223579 294642 21000 13983 196857 -42964 -113472
17669a13472B15899G8687j2734b86074e686B05066d8137A16330K02667A44361
$$ -113472 215899 78687 65953 -286074 -5686 205066 -48137 116330 318997 144361
17658b86608B07105E914a85807A04439b4440f298l57506B72959b95564G7623N8313
$$ -286608 207105 5914 -185807 104439 -24440 -6298 -363804 272959 -295564 77623 135936
17647A35936B9585J63140a12792G7095a14467M3392a002A64632a83624j74715
$$ 135936 29585 192725 -112792 77095 -114467 -71075 -1002 164632 -183624 -358339
17637c58339G8735n754N2318K10320a82376B0779J56279d885j47998C19068A13818
$$ -358339 78735 72981 125299 335619 -182376 20779 177058 -4885 -152883 319068 113818
17625E5296K03047a38632j59737a38394G8811Q0975b42871E5481J37844a15863
$$ 55296 258343 -138632 -298369 -138394 78811 159786 -242871 55481 193325 -115863
17614a20405k0211K1112b9702j64154N6339C53937j52823a8931e631j04362k7282
$$ -120405 -140616 -119504 -29702 -193856 -137517 353937 201114 -18931 -5631 -109993 -137275
17603a37275c2833j81843A73656i5186A73521F9374a35315a5993k66745E157a10970
$$ -137275 -32833 -214676 173656 -95186 173521 69374 -135315 -15993 -282738 5157 -110970
17591e0534k71857C68755A28508f7093C05359o1096k317h03A27970P1666c2780
$$ -50534 -322391 368755 128508 -67093 305359 244263 241946 -803 127970 199636 -32780
17579B28132a08701r9997C06215a2443j6251B12699F2201K8022c40239C06363
$$ 228132 -108701 -208698 306215 -12443 -28694 212699 62201 90223 -340239 306363
17568a46674B21040o0434c9547k7288G0383J4851j964J51883k2099o6165h6831
$$ -146674 221040 160606 -39547 -66835 70383 85234 83270 235153 213054 146889 -86831
17556a09955A83349b22289I818e5372B71285a76789B53415b70619D05500j94229
$$ -109955 183349 -222289 9818 -55372 271285 -176789 253415 -270619 405500 211271
17546B11271b57915B66688c66797B11314n299D466c04246f1443G429J39311C4122
$$ 211271 -257915 266688 -366797 211314 206015 4466 -304246 -61443 7429 146740 34122
17534A47805b60026B73387r5584i472o038q3556d0107l68696A08885P7772B8356
$$ 147805 -260026 273387 177803 -9472 -15510 -99066 -40107 -408803 108885 186657 28356
17522C8911c22011i1605A7047J95927A02317D8095K692m866J13604K82069j85496
$$ 38911 -322011 -91605 17047 212974 102317 48095 50787 45921 159525 441594 256098
17511B56098n0469E6980L65973G6945J29547j02487j4042M1189h5549j20475B99331
$$ 256098 205629 56980 422953 76945 206492 104005 89963 131152 -85549 -206024 299331
17499f4768D297K07109b68841A47351B5956e1581o0468C76512j11996D0297g9704
$$ -64768 4297 211406 -268841 147351 25956 -51581 -112049 376512 264516 40297 -79704
17487A15148e8100B70585J00739j03981J6534h7360C9164A297J09950h0949a8339
$$ 115148 -58100 270585 371324 267343 283877 -87360 39164 1297 111247 -80949 -18339
17475a37048A42299k9853G363Q1439i1957D0818R904j3712d4203l8810k1605B27219
$$ -137048 142299 112446 7363 88802 -91957 40818 50722 37010 -44203 -83013 -104618 227219
17462B24288b26719E2937i6906J5264A57975l2349K51518b07580P0261B23524
$$ 224288 -226719 52937 -96906 -81642 157975 125626 377144 -207580 -137319 223524
17451A70612J46770A45338n6834J7214M97078k91318c60093A18198J81418A19294
$$ 170612 317382 145338 88504 105718 602796 311478 -360093 118198 299616 119294
17440A54719m3675L33489j31400C6152R6569K8808q100Q6754c14502B47694A06718
$$ 154719 111044 444533 313133 36152 132721 161529 153429 240183 -314502 247694 106718
17428H8667P6194p2291J08572J98184J0939A06241K82723I6543L8165K22283i7854
$$ 88667 164861 92570 201142 399326 410265 106241 388964 96543 134708 356991 -97854
17416B16284J74968j01128A40861b9159C09707b2981j81143C8590D281P87141
$$ 216284 391252 290124 140861 -29159 309707 -22981 -204124 38590 4281 791422
17406G91422A26212L72379H6357A1776M8708K07877K46650A81290K79837E607
$$ 791422 126212 498591 86357 11776 60484 268361 515011 181290 461127 5607
17395C12626b4157A07290j1763M2033l5408a66553B99634A36761o0602a2296D8635
$$ 312626 -24157 107290 95527 137560 102152 -166553 299634 136761 76159 -12296 48635
17383f0799F06483b40686A83211O9265c1837E3049L18053j11213K0275A37409
$$ -60799 606483 -240686 183211 252476 -31837 53049 371102 259889 280164 137409
17372f10j62257I7884e0223C95844F8559J51296d6993D2311e1493C27717c48064
$$ -610 -162867 97884 -50223 395844 68559 219855 -46993 42311 -51493 327717 -348064
17360B03774C5933J72233c3128f245B12178G071f088B23944B3668K38778a8640
$$ 203774 35933 208166 -33128 -6245 212178 7071 -6088 223944 23668 262446 -18640
17348I9244a09992K8404F0922P9907L1506J59370j20178a99829c0896D3931P9239
$$ 99244 -109992 -81588 60922 140829 172335 331705 211527 -199829 -30896 43931 123170
17337A23170E3660Q2017J43182a41262j91D08900A98937a82939G9564b66841A57214
$$ 123170 53660 135677 278859 -141262 -141453 408900 198937 -182939 79564 -266841 157214
17325i9805B00836r7941j1267K9493a43264j63926C03741a66118C97100q3775
$$ -99805 200836 102895 91628 121121 -143264 -307190 303741 -166118 397100 313325
17315C13325j04185Q4761h1186p3963E87005b0453n8906A69134K19451j31127
$$ 313325 209140 293901 -81186 -155149 587005 -20453 -79359 169134 388585 257458
17305B57458A25198d828a063A22529L05956j3353D3962h529E1100j8966J9287
$$ 257458 125198 -4828 -1063 122529 428485 415132 43962 -8529 51100 32134 51421
17294E1421R3570i2772B17176j05982c8894A6868M42639A94661b974D1611e166
$$ 51421 144991 -92772 217176 111194 -38894 16868 459507 194661 -2974 41611 -5166
17282B73899L9633E2397h7616B15810R4610d4844B12098O2702j08829N0651h5861
$$ 273899 313532 52397 -87616 215810 310420 -44844 212098 274800 165971 216622 -85861
17270e3940b3547F007J2292J4664b8345m68k70740B97939j37640J92329A69339
$$ -53940 -23547 6007 18299 32963 -28345 -28813 -299553 297939 160299 352628 169339
17258D07906A86360K8476R311A07948K31557l8167K46748B70360j20757L7554
$$ 407906 186360 214836 224147 107948 339505 301338 548086 270360 149603 187157
17248A87157G3778J86709C1603Q2823N228J4474J19121D5269K27987J93636g1669
$$ 187157 73778 260487 31603 114426 119654 134128 253249 45269 273256 466892 -71669
17236B81162b03243Q6436A78827K27264a3019A02014J04691k4454H7800b34271
$$ 281162 -203243 -116807 178827 406091 -13019 102014 206705 182251 87800 -234271
17225b3962C6099J743A2035P2085k8565P7242a10144B41304R3248A20028d4112
$$ -23962 36099 37842 12035 84120 55555 132797 -110144 241304 334552 120028 -44112
17213C54229G5453J2846P4528a121q0975C18793j18932r4786J03953J62759j11273
$$ 354229 75453 88299 162827 -1121 -82096 318793 199861 105075 209028 371787 260514
17202B60514o0763G7962L03676d0924G2415B2334K07942A13031l8914N1614K56762
$$ 260514 199751 77962 381638 -40924 72415 22334 230276 113031 74117 125731 382493
17191C82493r0865j33632k1059C6706J87802K09828G3521L09704P2712p1452P6387
$$ 382493 291628 157996 136937 36706 224508 434336 73521 383225 455937 384485 460872
17180D60872D9129J06526n4193K07372p5864e7569D00865j53338K6046q6933P3253
$$ 460872 49129 155655 101462 308834 232970 -57569 400865 247527 273573 186640 259893
17169B59893F3732L07559a18127d2934G6245L19245l6582A04329J82052i3235
$$ 259893 63732 371291 -118127 -42934 76245 395490 358908 104329 286381 -93235
17158B57655k4177K39257k26062m5720j1270k4065O5290L004K1076j9597J101
$$ 257655 233478 472735 246673 200953 189683 165618 230908 233912 254988 235391 236492
17147B36492a81873C14631L1353l3752A42298D106K39633k8461L51899j22937
$$ 236492 -181873 314631 345984 312232 142298 4106 243739 215278 567177 444240
17137D44240b39835C17005J72868n4333M3033B34370P8054A47278F4838C1159
$$ 444240 -239835 317005 489873 435540 478573 234370 312424 147278 64838 31159
17126E29473k33349O3885F2498K90447o4838I3322C2517M10314A79900j9527J28858
$$ 529473 296124 360009 62498 352945 288107 93322 32517 442831 179900 160373 289231
17115B89231J15383j83798K35999B10258Q6405J15721I0775L44557l1832G4574
$$ 289231 404614 220816 456815 210258 296663 412384 90775 435332 403500 74574
17104B56445R3460B7080J67835J02262D1633K83081J87639l9917J19757A85152
$$ 256445 349905 27080 194915 297177 41633 324714 512353 472436 592193 185152
17093A0493Q9784K8247M64304q9237k22495J26765j67294J62051A86350K61734
$$ 10493 100277 128524 592828 503591 281096 407861 240567 402618 186350 448084
17083D48084K4577J06834A93527K68413j26265o2800Q1919c1768D4036f3075D71479
$$ 448084 472661 579495 193527 461940 335675 272875 354794 -31768 44036 -63075 471479
17071C67464L7254j70090O6931J13167J19147o9348j26223Q0836J38295q0771
$$ 367464 404718 234628 301559 414726 533873 464525 338302 419138 557433 476662
17061D76662n6280o7439N1833j45937G8799J07044M29747j42910J62128k68190
$$ 476662 420382 352943 404776 258839 78799 185843 615590 472680 634808 366618
17051C66618L18416q0772k16264o3576p0826J29206J34508k16368K82622m4670
$$ 366618 685034 604262 387998 324422 253596 382802 517310 300942 583564 538894
17041E38894k54619L79651j41361n9793j55746J22139K87618m5854A99962K16185
$$ 538894 284275 663926 522565 462772 307026 429165 716783 670929 199962 416147
17031D16147J2016B11532M50601l7596k21872K19223k25498M24681B15981K01100
$$ 416147 428163 211532 662133 624537 402665 621888 396390 821071 215981 417081
17021D17081M44143k41850A22817J92910N8982j6716J34520K91423l61700K24372
$$ 417081 861224 619374 122817 315727 374709 357993 492513 783936 422236 646608
17011F46608K5965r7334j00567J18768L8893O7181C41299L45013j48082Q4112
$$ 646608 672573 575239 474672 593440 632333 699514 341299 686312 538230 622342
17001F22342j08948J2238j3832J71631j2907n1398J01084L9349l24849P2436K04717
$$ 622342 513394 525632 511800 683431 670524 619126 720210 759559 434710 507146 711863
16990G11863j48632K28258j20389n2228B84073J82211N31410l69319j6406j752
$$ 711863 563231 791489 671100 618872 284073 466284 997694 628375 611969 610217
16980F10217K52746j81696J11664j54335J07942j43553p1042R2542K32122k06841
$$ 610217 862963 681267 792931 638596 746538 602985 531943 624485 856607 649766
16970F49766K46818m24896N33442C94958L39865K06861j29884j53771O7464K738
$$ 649766 896584 471688 1005130 394958 734823 941684 811800 658029 725493 728231
16960G28231k56895J78204K77558o905r0666O3773k13501j9243p6338L81483n7132
$$ 728231 471336 649540 927098 920193 829527 893300 679799 660556 584218 965701 908569
16949I08569L7830j10824J69774j07800k93683N45723j16193K0780j43746K93163
$$ 908569 946399 835575 1005349 897549 603866 1149589 1033396 1054176 910430 1203593
16939A203593j76870J41518r2211p8940K2534j40998L83980k05775l76271L45745
$$ 1203593 1026723 1168241 1076030 997090 1019624 878626 1262606 1056831 680560 1026305
16929A026305j95766J68262n0211l8189L06330n9373j00516k2364K10442k50964
$$ 1026305 830539 998801 948590 910401 1216731 1157358 1056842 1034478 1244920 993956
16919I93956J28079J97439j43095j37094K77031j07195J71515n2976K79460l91520
$$ 993956 1122035 1319474 1176379 1039285 1316316 1209121 1380636 1327660 1607120 1215600
16909A215600J31814r8037L52263l81187J29852J03560j68013j43497M05502j02129
$$ 1215600 1347414 1249377 1601640 1220453 1350305 1453865 1285852 1142355 1547857 1445728
16899A445728k28980j7053L63383k15504Q2244J88094r0524r9233j09136M31544
$$ 1445728 1216748 1199695 1563078 1347574 1429818 1617912 1527388 1428155 1319019 1750563
16889A750563k15499J53088p0963K35245k61868J15392K13090J24387k98416o7485
$$ 1750563 1535064 1688152 1617189 1852434 1590566 1705958 1919048 2043435 1745019 1677534
16879A677534K76107J73067m96733J56120j8459n7712L77835j63464J11483J10346
$$ 1677534 1953641 2126708 1629975 1786095 1767636 1709924 2087759 1924295 2035778 2146124
16869B146124L17781k17861R8452m63626M02200j80827p4327J83534K21313j78835
$$ 2146124 2463905 2246044 2344496 1880870 2283070 2102243 2027916 2211450 2432763 2253928
16859B253928J27420k06327O31777k58736M5712J22265j14963K53488r9189J23136
$$ 2253928 2381348 2175021 2806798 2548062 2593774 2716039 2601076 2854564 2755375 2878511
16849B878511k17800J08028J96774j68111r8131L11087M54342n68758K72540M02162
$$ 2878511 2660711 2768739 2965513 2797402 2699271 3010358 3464700 2895942 3168482 3570644
16839C570644j06959j32867j78337J14766P1999K06603k05381L33048j1758J49235
$$ 3570644 3463685 3330818 3152481 3267247 3339246 3545849 3340468 3673516 3661758 3810993
16829C810993j8480J66550q9398j87246K14917K59764P8672N57468p10159M45288
$$ 3810993 3792513 3959063 3869665 3682419 3897336 4157100 4235772 4793240 4083081 4528369
16819D528369K92218k77100K30000L79062k04046Q1491K99686J8237j85922K58868
$$ 4528369 4820587 4543487 4773487 5152549 4948503 5029994 5329680 5347917 5161995 5420863
16809E420863R2076M4504j92083O63795M9585o7320M01552m9963K39119J24942
$$ 5420863 5512939 5557443 5365360 6029155 6078740 6011420 6412972 6363009 6602128 6727070
16799F727070n2112N29924q8119O31592j83215J13499j15342R51047J2854L61694
$$ 6727070 6674958 7204882 7116763 7748355 7565140 7678639 7563297 8514344 8527198 8888892
16789H888892J79962J06299J85464J71737N53241m2865K75812N92273J85704K19694
$$ 8888892 9068854 9175153 9360617 9532354 10085595 10042730 10318542 10910815 11096519 11316213
16779A1316213O92500N6072O29227N08331J07254N83804K98619M41597P28543
$$ 11316213 12008713 12064785 12694012 13202343 13309597 13893401 14192020 14633617 15362160
16770A5362160N47170P13574M73590M54955N08950P49786R43849R48534M57233
$$ 15362160 15909330 16622904 17096494 17551449 18060399 18810185 19754034 20702568 21159801
16761B1159801J015108P04985R21284J082106J293044J215145J323140J355752
$$ 21159801 22174909 22879894 23801178 24883284 26176328 27391473 28714613 30070365
16753C0070365J194286J880760J620144J685765J891921K171713J831151K467402
$$ 30070365 31264651 33145411 34765555 36451320 38343241 40514954 42346105 44813507
16745D4813507K542874K732775K710117L336835L290173L666973M087829M507598
$$ 44813507 47356381 50089156 52799273 56136108 59426281 63093254 67181083 71688681
16737G1688681M379099N124039N267225O077704O096801O861602O904563P208160
$$ 71688681 76067780 81191819 86459044 92536748 98633549 105495151 112399714 119607874
16729A19607874P567685Q348750P939331Q529174P829198P725952P095002O679781
$$ 119607874 127175559 135524309 143463640 151992814 159822012 167547964 174642966 181322747
16721A81322747N573738M049330L478367J216100j23175j897244l258923m304443
$$ 181322747 186896485 190945815 194424182 195640282 195517107 193619863 190360940 186056497
16713A86056497n975271o568712p931987p673755q345654q151191q549902p982995
$$ 186056497 180081226 173512514 165580527 157906772 149561118 141409927 132860025 124877030
16705A24877030p781532p639940o855935o869918o122774n901327n372546m735084
$$ 124877030 117095498 109455558 102599623 95729705 89606931 83705604 78333058 73597974
16697G3597974m575799m292240m456264l173932l227150l309456k966674k659388
$$ 73597974 69022175 64729935 60273671 57099739 53872589 50563133 47596459 44937071
16689D4937071k077748k643200k280144j835851j840409j435041j961724j059558
$$ 44937071 42859323 40216123 37935979 36100128 34259719 32824678 30862954 29803396
16681B9803396j494986j645770r06433j312292j070721j123933j149686p42433
$$ 29803396 28308410 26662640 25756207 24443915 23373194 22249261 21099575 20357142
16673B0357142n25367j022495l95239j206599n96721k58617q85994l91763p02241
$$ 20357142 19831775 18809280 18414041 17207442 16610721 16352104 15466110 15074347 14372106
16664A4372106O238j018889k81932j46202r16799n0632n90970m77170o2804l50381
$$ 14372106 14378344 13359455 13077523 12931321 12014522 11963890 11372920 10895750 10832946 10482565
16654A0482565m33080r9269o36644j72693l07820r8794p57350L65159n80871k5548
$$ 10482565 10049485 9950216 9313572 9140879 8833059 8734265 7976915 8342074 7761203 7735655
16644G735655k73062j55649j72786l76962j24415J09336l14641k72524q973j64959
$$ 7735655 7462593 7306944 7134158 6757196 6632781 6742117 6427476 6154952 6145979 5981020
16634E981020k93693j57224l37741L91162k81372k89904l48265M98989l83266
$$ 5981020 5687327 5530103 5192362 5583524 5302152 5012248 4663983 5162972 4779706
16625D779706m9850O4766l50026J07768n29362R2787O3610j20324L3717J52n60670
$$ 4779706 4729856 4794622 4444596 4552364 4023002 4115789 4179399 4059075 4092792 4092944 3532274
16614C532274K3182J08108m06621j11265K51438N9972m63462L83458J0411l26306
$$ 3532274 3555456 3663564 3256943 3145678 3397116 3457088 2993626 3377084 3387495 3061189
16604C061189L4389j49022K13190j34470l93026K66512K3077j63805n72927O13906
$$ 3061189 3095578 2946556 3159746 3025276 2632250 2898762 2921839 2758034 2185107 2799013
16594B799013k8087j91109K71534j78070l40076K66131j88788k0776j26776m2462
$$ 2799013 2770926 2579817 2851351 2673281 2333205 2599336 2410548 2389772 2262996 2220534
16584B220534k14250J88887m7571j93142r327J80347j54841J57775m50876K78233
$$ 2220534 2006284 2195171 2147600 1954458 1945131 2125478 1970637 2128412 1677536 1955769
16574A955769p7692r84L9101r2225K02372k44757l44157N7021j47297N46632n56720
$$ 1955769 1878077 1877093 1916194 1823969 2026341 1781584 1437427 1494448 1347151 1893783 1337063
16563A337063M31114j19069k27024J65196Q0927j27937k69069J95685K65929J17105
$$ 1337063 1768177 1649108 1422084 1587280 1668207 1540270 1271201 1466886 1732815 1849920
16553A849920o01220K45547k10301K53425k41627j20498j9130m4158N07223j52605
$$ 1849920 1248700 1494247 1283946 1537371 1295744 1175246 1156116 1111958 1619181 1466576
16543A466576m68696J35648J13786r4572k73884Q0301J32638o8908j84272L63949
$$ 1466576 997880 1133528 1247314 1152742 878858 959159 1091797 1022889 838617 1202566
16533A202566p6041p6464J46901j50685k2370j9879K31016m17850l2353R9420
$$ 1202566 1126525 1050061 1196962 1046277 1023907 1004028 1235044 817194 784841 884261
16523H84261J77479m74976J38274L30172n23159O27024k23678j10298j207k5109
$$ 884261 1061740 586764 725038 1055210 532051 1159075 935397 825099 823892 798783
16513G98783J6505o9353K84248m51055L80193k00472R4699k57826j7458k3836
$$ 798783 815288 745935 1030183 579128 959321 758849 853548 595722 578264 554428
16503E54428N75272m49148N1507L31706P3536l04751p396J92026k69179j165N886
$$ 554428 1129700 680552 732059 1063765 1137301 832550 825154 1017180 748001 746836 752722
16492G52722j57564m1151M7138j81004K62049Q8222n3559j45051K74936k80994
$$ 752722 595158 554007 601145 420141 682190 770412 716853 571802 846738 565744
16482E65744j5565p0726k6435J02138r6819N5105J76744l08121L59603k32995
$$ 565744 550179 479453 453018 555156 458337 513442 690186 382065 741668 508673
16472E08673J0335L11016N5232k25226Q030A77556M25287k51173K55531k25992
$$ 508673 519008 830024 885256 660030 668060 177556 602843 351670 607201 381209
16462C81209K02352p4437j8967o8461M3182B08417J81934o1926J73061j71144
$$ 381209 583561 509124 490157 421696 464878 208417 390351 328425 501486 330342
16452C30342J79855j5441j25601A40277J35283L02983l6111j2833m7324J03764
$$ 330342 510197 494756 369155 140277 275560 578543 542432 529599 482275 586039
16442E86039q2995k42013K63642A39730L76273o546L1375A98528J28923j38674
$$ 586039 503044 261031 524673 139730 516003 509457 540832 198528 327451 188777
16432A88777L07944j83838P1789A17791N13641P9164k39560k28373K98595k14644
$$ 188777 496721 312883 384672 117791 631432 710596 471036 242663 541258 326614
16422C26614J75091B48502K51913K18836k47466A36089J31068J19243R1181j22893
$$ 326614 501705 248502 500415 719251 471785 136089 267157 386400 477581 354688
16412C54688L4784l9173J89281j83692j08522k7631G3138J75434K64218r5196
$$ 354688 389472 350299 539580 355888 247366 219735 73138 248572 512790 417594
16402D17594A59433k9877L58218m0445A75294L2865O5169K87434k47832K95249
$$ 417594 159433 129556 487774 447329 175294 208159 273328 560762 312930 608179
16392F08179B75389l3800J88795q0909A74489g1351C91280A7267K50037N9168
$$ 608179 275389 241589 430384 349475 174489 -71351 391280 17267 267304 326472
16382C26472j22876K8514Q9607M24534B71192J82368F9529J07146K00339A41300
$$ 326472 203596 232110 321717 746251 271192 453560 69529 176675 377014 141300
16371C26464m8678I6871L30192B04349i1827B49707q4700k6195n7883O04591B07302
$$ 326464 277786 96871 427063 204349 -91827 249707 165007 138812 80929 685520 207302
16359H9197K37988a43113A89930O3776O6548j40821o4277K40548A38289J52528
$$ 89197 327185 -143113 189930 253706 320254 179433 115156 355704 138289 290817
16349B90817l9351j4915j02386J12268j14269J49423a90204C00698o8839R471
$$ 290817 251466 236551 134165 246433 132164 281587 -190204 300698 231859 241330
16339B41330p0896L9110j00930L73779B18146G2671K11442J24158j79106B8468
$$ 241330 170434 209544 108614 482393 218146 72671 284113 408271 229165 28468
16328A69163K82984A25093J66895H9854J13688K61047A75125b83810A72950J62669
$$ 169163 452147 125093 291988 89854 203542 464589 175125 -283810 172950 335619
16318C35619A24897L6586e4978B42769L02245A61439a1878A77498l3615E5901
$$ 335619 124897 161483 -54978 242769 545014 161439 -11878 177498 143883 55901
16307A76639P212O9240L1256k2445A0767J29352B1434K29754o6497c25871H1270
$$ 176639 183851 253091 284347 261902 10767 140119 21434 251188 184691 -325871 81270
16295e8418A35465J11979J35198n5469a52955J8290H920R4234P732o390d8731
$$ -58418 135465 247444 382642 327173 -152955 -134665 8920 103154 110886 104496 -48731
16283F5519J0096Q6197K07980J28550B9465Q5977c7477C27991I8859D7092i7877
$$ 65519 75615 161812 369792 498342 29465 115442 -37477 327991 98859 47092 -97877
16271B54930b5424B78726K22941a45560C4618J60000a54970J8l3649b9326A2189
$$ 254930 -25424 278726 501667 -145560 34618 194618 -154970 -154952 -188601 -29326 12189
16259a37924A61421q0497A6450L54862b09651d3579B66011a81083B70284G9845
$$ -137924 161421 80924 16450 371312 -209651 -43579 266011 -181083 270284 79845
16248F1601J88853E5903K37309I5740D1904j9344k428c3158A3898K82112j12914
$$ 61601 250454 55903 293212 95740 41904 22560 20132 -33158 13898 296010 183096
16237A83096a82585D94630f72A54615a7425B6218b52341J3914D83719i6751F1664
$$ 183096 -182585 494630 -672 154615 -17425 26218 -252341 -238427 483719 -96751 61664
16225B9765R2009d9908D18746I9960i7469A83144i3229A58380l8647J14006A2933
$$ 29765 121774 -49908 418746 99960 -97469 183144 -93229 158380 119733 233739 12933
16213A509a193A93329M5098p2714k0205a63485j99559B74585o750a81065c983
$$ 1509 -1193 193329 238427 165713 145508 -163485 -363044 274585 267835 -181065 -3983
16201a7845C03893b2204Q952A72308a25091E8108O9166E2817b08993i9150G3772
$$ -17845 303893 -22204 -13252 172308 -125091 58108 127274 52817 -208993 -99150 73772
16189B36038q2328b70288D9971K55750E7932h9479l7200B73930M1461a25209B9305
$$ 236038 153710 -270288 49971 305721 57932 -89479 -126679 273930 315391 -125209 29305
16177a50764e5272B06792c3013M411A02797H911h244C19924a94049g5711A20841
$$ -150764 -55272 206792 -33013 -28602 102797 8911 -8244 319924 -194049 -75711 120841
16165a67789g571A06317b11826O1009B34438A07712Q8500b73103E8382J86460
$$ -167789 -7571 106317 -211826 -150817 234438 107712 196212 -273103 58382 244842
16155B44842a93344e0832r5551F6742P2312J19432f4838J556F3041c0308P919
$$ 244842 -193344 -50832 -146383 66742 139054 258486 -64838 -63282 63041 -30308 -22389
16144b2389e633r1108k0293A90638h1288j19644O1320B07278a2329F9563J57145
$$ -22389 -5633 -96741 -117034 190638 -81288 -200932 -139612 207278 -12329 69563 226708
16133B26708l4980a66576D7071O6831B0093a73159d3771G5145k0370a51656j1301
$$ 226708 191728 -166576 47071 113902 20093 -173159 -43771 75145 54775 -151656 -162957
16122a62957O3842O774b906A37676e3207j9471a6498G9521e1639h380j66131C9277
$$ -162957 -99115 -92341 -2906 137676 -53207 -72678 -16498 79521 -51639 -8380 -174511 39277
16109b89624J3534e5036j29832G06613l12923a14194H1374J59704b9936H4653
$$ -289624 -276090 -55036 -184868 706613 393690 -114194 81374 241078 -29936 84653
16098H7677b08753B29622l2629L2186b9734m402B94565b15801d1288E4538c0641
$$ 87677 -208753 229622 196993 229179 -29734 -34136 294565 -215801 -41288 54538 -30641
16086a53119F3626g3292B14589c2073A61505a42533M9456A52416a08992j45494
$$ -153119 63626 -73292 214589 -32073 161505 -142533 -93077 152416 -108992 -254486
16076b54486H8487c74937i7331B79158j38010M3567D1080b19510A75899c94129
$$ -254486 88487 -374937 -97331 279158 141148 184715 41080 -219510 175899 -394129
16065a91769A02304n536b70586A33509i5346e181o0302B15808K07330a03692n3515
$$ -191769 102304 96768 -270586 133509 -95346 -5181 -65483 215808 423138 -103692 -157207
16054a57207e8405j19817g9082E048a96417o4469g6484l79060D68856f0894B13009
$$ -157207 -58405 -178222 -79082 5048 -196417 -260886 -76484 -455544 468856 -60894 213009
16042b20543l9715A48752a61443P5863g325B60255a16214L9053b363D5952P8438
$$ -220543 -260258 148752 -161443 -85580 -7325 260255 -116214 -77161 -2363 45952 124390
16031A24390a47827I5795f8274l29410J3394J16218A63108a5517B6346L0137J35774
$$ 124390 -147827 95795 -68274 -397684 -384290 -268072 163108 -15517 26346 56483 192257
16020A92257B4932i636o0146B062b54709J02921k26934R7561J26647E4279J26069
$$ 192257 24932 -9636 -69782 2062 -254709 -151788 -378722 -281161 -154514 54279 180348
16009A80348b95468C16072a16988J1511m867D38294b67603F5427B3498b60793
$$ 180348 -295468 316072 -116988 -105477 -110344 438294 -267603 65427 23498 -260793
15998a98328C7711a65168A0071c24800a07847A15505a0875G6182J8867C9776K45404
$$ -198328 37711 -165168 10071 -324800 -107847 115505 -10875 76182 95049 39776 285180
15987B85180a53260B4495a7815A48252j276D8736K2003C4095c1704A02062a72489
$$ 285180 -153260 24495 -17815 148252 146976 48736 70739 34095 -31704 102062 -172489
15975a60584p792F0694b3965A2998J80774b96669A2251b65469i7690C13293j7641
$$ -160584 -168376 60694 -23965 12998 193772 -296669 12251 -265469 -97690 313293 295652
15964B95652A21946a09260j89807B60966A29197a24487B24305J2234E3214m778
$$ 295652 121946 -109260 -299067 260966 129197 -124487 224305 236539 53214 48436
15954D8436O3078f9160K0185A95201i0961F2207a8665j29553c2239C76269a83610
$$ 48436 111514 -69160 -48975 195201 -90961 62207 -18665 -148218 -32239 376269 -183610
15942d19729a5323l938o6752B02158m7927C4777c850B10433A7770R8160c48059
$$ -419729 -15323 -19261 -86013 202158 154231 34777 -3850 210433 17770 115930 -348059
15930i9392q1899O6535J6320F7740k5770J53840b32435d1176m0229A04695c56052
$$ -99392 -181291 -114756 -98436 67740 41970 195810 -232435 -41176 -81405 104695 -356052
15918a5170B3986c60255E435b38533C2496J9223f2986D8238h4151j42984c1372
$$ -15170 23986 -360255 5435 -238533 32496 51719 -62986 48238 -84151 -227135 -31372
15906B5561F514J22681b07130h5902K3085H210a00554J710A12518b22319e5235
$$ 25561 6514 129195 -207130 -85902 -62817 8210 -100554 -98844 112518 -222319 -55235
15894a49636A06083c52010A16122a08859B7974Q3733a15967j03377j00205C0890
$$ -149636 106083 -352010 116122 -108859 27974 111707 -115967 -219344 -319549 30890
15883h9802e040j31306d8430j39015N1543r2134d2017A88900b40650B06306b41748
$$ -89802 -5040 -136346 -48430 -187445 -135902 -228036 -42017 188900 -240650 206306 -241748
15871B17931q5577a16334m0152a4417j2159k6239C37027F9252J07056a85711A21356
$$ 217931 132354 -116334 -156486 -14417 -26576 -52815 337027 69252 176308 -185711 121356
15859d31657D1070J3285a84105A0396M9061b03896A74742m1194A5243F455P6137
$$ -431657 41070 54355 -184105 10396 59457 -203896 174742 133548 15243 6455 82592
15848H2592c2136j02849k48038A95921a89686M9905A73129b36439d8315A42879
$$ 82592 -32136 -134985 -383023 195921 -189686 -139781 173129 -236439 -48315 142879
15837A74353D7976d4124B25509a63463e884B65733A18909D6020A3252a06658d1824
$$ 174353 47976 -44124 225509 -163463 -5884 265733 118909 46020 13252 -106658 -41824
15825i6769A41699d6226J4751j70875A93661a9951k95417a56225B5209a60358
$$ -96769 141699 -46226 -31475 -202350 193661 -19951 -315368 -156225 25209 -160358
15814A0597a48394P1148A51947a68205B0364d514j50202L5395o7035a1310A79853
$$ 10597 -148394 -77246 151947 -168205 20364 -4514 -154716 -119321 -186356 -11310 179853
15802g9346q5366A28479b08987a0562k76198J31861o0742B19415a6834A22482
$$ -79346 -164712 128479 -208987 -10562 -286760 -154899 -215641 219415 -16834 122482
15791d3552k45533a1106B25776r5347C0872g2902d016B7305J24148G0299j3104
$$ -43552 -289085 -11106 225776 130429 30872 -72902 -4016 27305 151453 70299 57195
15780E7195A1420a67801d1357r5040A29039c32485h9252B37390G473J12854a44717
$$ 57195 11420 -167801 -41357 -136397 129039 -332485 -89252 237390 7473 120327 -144717
15768a69886p0634a08095b8075p4003h776r3354o0879g3179h196H1195a67504
$$ -169886 -240520 -108095 -28075 -102078 -8776 -102130 -163009 -73179 -8196 81195 -167504
15756B74366c02485B25558a75799G0252b45303D3601a52411B4095L18092j26095
$$ 274366 -302485 225558 -175799 70252 -245303 43601 -152411 24095 342187 216092
15746B16092J10301b29058J12531a2117F7435a06841j50542E7386J69862a9426
$$ 216092 326393 -229058 -116527 -12117 67435 -106841 -257383 57386 227248 -19426
15735b3591A4652K43712d7030j7037c0086k7358k81141E1379d09692A66950a32519
$$ -23591 14652 258364 -47030 -64067 -30086 -57444 -338585 51379 -409692 166950 -132519
15723B33097b04706D6471p864a39306j51775E8693g6679L6620B61860l9925d9272
$$ 233097 -204706 46471 38607 -139306 -291081 58693 -76679 -40059 261860 221935 -49272
15711E9267a74171c013A37389a58220d7430Q46K454k69283J35302h2555r7014
$$ 59267 -174171 -3013 137389 -158220 -47430 -46584 -44130 -313413 -178111 -82555 -179569
15700a79569r1723I4516K22334E8108a22092j62877f6843K0354A51811J70681
$$ -179569 -271292 94516 316850 58108 -122092 -284969 -66843 -46489 151811 322492
15690C22492b3200A00273K9489C6710a63031A26820R74F088c36166B63629j16852
$$ 322492 -23200 100273 129762 36710 -163031 126820 127794 6088 -336166 263629 146777
15679A46777f5655E8899h5389G1551e1934m6848E1011k4258c8657a1113o204p8840
$$ 146777 -65655 58899 -85389 71551 -51934 -98782 51011 26753 -38657 -11113 -17317 -96157
15667i6157F1037c60214A69106n4118J20554p7655b06451N2737A56910b06864
$$ -96157 61037 -360214 169106 114988 235542 157887 -206451 -153714 156910 -206864
15656h9870B41436a85682a9899o1651k29173a278A93232i5128c5372k37350d7035
$$ -89870 241436 -185682 -19899 -81550 -310723 -1278 193232 -95128 -35372 -272722 -47035
15644A87585o3389b2449k2679A17652m6075a46259l0334A98543J24180a93146
$$ 187585 124196 -22449 -45128 117652 71577 -146259 -176593 198543 322723 -193146
15633f7416j04629B01276n4684a90340B3393J49360a21708A45107c2967l9048
$$ -67416 -172045 201276 146592 -190340 23393 172753 -121708 145107 -32967 -72015
15623g2015A11084D5816a07339A60276P8838b80598B74956b1977k6462C63866
$$ -72015 111084 45816 -107339 160276 239114 -280598 274956 -21977 -48439 363866
15612e150A35062K08628H4821N488A9692a52088A22869c53733B6780a69281k20990
$$ -5150 135062 343690 84821 90309 19692 -152088 122869 -353733 26780 -169281 -390271
15601c90271i0680j42028j35449A18598Q7848a19821N7126M431F208a13276k98031
$$ -390271 -90680 -232708 -368157 118598 206446 -119821 -62695 -58264 6208 -113276 -411307
15590d11307I8821b47164d8730p5388H4010l5762a38875M6948A85596n2749a04306
$$ -411307 98821 -247164 -48730 -124118 84010 48248 -138875 -91927 185596 132847 -104306
15578G4951m036J1667a00697A50434D991J48228H135b11140H0362C7436i1953
$$ 74951 70915 82582 -100697 150434 4991 153219 8135 -211140 80362 37436 -91953
15566a5480A68814a55245A9412c5622k71341B89687i02n5393O744K2781q9415
$$ -15480 168814 -155245 19412 -35622 -306963 289687 -902 -56295 -49551 -26770 -116185
15555a16185n140b9002H4616a20139L195a0249F816b8569j47555N2427A35870
$$ -116185 -121325 -29002 84616 -120139 -116944 -10249 6816 -28569 -176124 -123697 135870
15543a07951j61211g1976j21954A17253E4647j9513O4457a34498E4697J04703
$$ -107951 -269162 -71976 -193930 117253 54647 35134 99591 -134498 54697 159400
15533A59400O1878a48017l0031J9867B65564b41423l2376G900Q6774i7012o7305
$$ 159400 221278 -148017 -178048 -158181 265564 -241423 -273799 7900 94674 -97012 -164317
15522a64317a5821q1088B11081E2507a55657B1421a1632A1423g1366k08064g9318
$$ -164317 -15821 -96909 211081 52507 -155657 21421 -11632 11423 -71366 -279430 -79318
15510B2715a2998B0733a6808A72668a95255c4751l99927B90151j27687a44464
$$ 22715 -12998 20733 -16808 172668 -195255 -34751 -434678 290151 162464 -144464
15499E7495J26859Q4410c71626b246C2001J48777J51335b41727f7291B8482P9949
$$ 57495 184354 268764 -371626 -2246 32001 180778 332113 -241727 -67291 28482 108431
15488A08431c9536E711a38597B7331J75326a21742n520C8572c92109a54208d7534
$$ 108431 -39536 5711 -138597 27331 202657 -121742 -127262 38572 -392109 -154208 -47534
15476e9754p2880j60932a38853a4329B01210a44006A3265b62280D938J02800g3772
$$ -59754 -132634 -293566 -138853 -14329 201210 -144006 13265 -262280 4938 107738 -73772
15464A11229K2304a8670A44009N8034H0863J45049G1043J46181h4083q994J1031
$$ 111229 133533 -18670 144009 202043 80863 225912 71043 217224 -84083 -93077 -82046
15453h2046M0774p948j17945I1552J84492c08228A99814a11181j5985A56248E7040
$$ -82046 -41272 -49220 -167165 91552 276044 -308228 199814 -111181 -127166 156248 57040
15441a36461B35785b12634I5601g3418F0610f3014B7986b06144A84814o7926c31792
$$ -136461 235785 -212634 95601 -73418 60610 -63014 27986 -206144 184814 116888 -331792
15429C801g8815B81689a35102B95138d3121B83602h8451L641o4931p7329A14604
$$ 3801 -78815 281689 -135102 295138 -43121 283602 -88451 -84810 -149741 -227070 114604
15417A09329g4677C8935a50984A05562D8664a44556k07886C3855h6053F4119J91988
$$ 109329 -74677 38935 -150984 105562 48664 -144556 -352442 33855 -86053 64119 256107
15406B56107b4720R419k58991A7206K05232h8910a5954q6007k76641d6469E0266
$$ 256107 -24720 -15301 -274292 17206 222438 -88910 -15954 -101961 -378602 -46469 50266
15394D0296a51006d4559k56058b2098J332A26301b57007d1404J0185j03795j00551
$$ 40296 -151006 -44559 -300617 -22098 -20766 126301 -257007 -41404 -31219 -135014 -235565
15383b35565B59213H8789A5184a5978G8938J1706i5058k21924A4861a04832B1512
$$ -235565 259213 88789 15184 -15978 78938 90644 -95058 -316982 14861 -104832 21512
15371B88009n6843l8605k9831b30070a6602A83214J6636a17085I4454l9114K05472
$$ 288009 231166 192561 162730 -230070 -16602 183214 199850 -117085 94454 55340 260812
15360B60812d2630H8097f1461B3754L35185a27706N5800b7554n6214D7655a44566
$$ 260812 -42630 88097 -61461 23754 358939 -127706 -71906 -27554 -83768 47655 -144566
15348A47332a23687B2616J32265b01354h3932B39372c83619C19651A21939a17125
$$ 147332 -123687 22616 154881 -201354 -83932 239372 -383619 319651 121939 -117125
15337D2315b99526H6958C8644O0794a04682B11750D4647J60326r4087L463A4096
$$ 42315 -299526 86958 38644 99438 -104682 211750 44647 204973 110886 114349 14096
15325E0400J28584b9304A04782g1263B33456c26246a58138g715D33061F5540J41616
$$ 50400 178984 -29304 104782 -71263 233456 -326246 -158138 -7715 433061 65540 207156
15314B07156d7763A56365b94470F1008b26310B38846m2077q8758i45k86653A547
$$ 207156 -47763 156365 -294470 61008 -226310 238846 196769 108011 -945 -287598 1547
15302A18866a57578C27883J12898C2768J6828M15909g1513A64404a17381E1572
$$ 118866 -157578 327883 440781 32768 49596 465505 -71513 164404 -117381 51572
15291E1843a48124A94332b85643d5589b0967A03557b25277B07767D0276f8883
$$ 51843 -148124 194332 -285643 -45589 -20967 103557 -225277 207767 40276 -68883
15280f2173C0686Q8915j5523C3013P2089C4941L03395b4083B99024j21832q8556
$$ -62173 30686 119601 104078 33013 105102 34941 338336 -24083 299024 177192 88636
15269H8636M0619b00443B03898E2816J71923M7919m8805b04964B83403A2347h988
$$ 88636 129255 -200443 203898 52816 224739 272658 223853 -204964 283403 12347 -8988
15257a13409K0083d422A82216A8344K38347b8951D2237K46105K30796P13893k7179
$$ -113409 -93326 -4422 182216 18344 256691 -28951 42237 288342 519138 1233031 1205852
15246A205852j69234M04903o14317A29919J14139j19277R786m5084c2655j85725
$$ 1205852 1036618 1441521 827204 129919 244058 124781 134567 89483 -32655 -218380
15236b18380i9178P450l46754b5546G1784b36428A8851a89973a6141j3630m8244
$$ -218380 -99178 -91728 -438482 -25546 71784 -236428 18851 -189973 -16141 -29771 -78015
15225g8015A81543i540j50747A98112a68358f3257B3406R2335b6416A11920l5906
$$ -78015 181543 -9540 -160287 198112 -168358 -63257 23406 115741 -26416 111920 76014
15214G6014L2495J0920D1225e2000A56917b6749A5693L01488j28358a5871p0069
$$ 76014 108509 119429 41225 -52000 156917 -26749 15693 317181 188823 -15871 -85940
15203h5940J3215B8721a30002A75529F7309L71914g3652k4719B9011J21985m2514
$$ -85940 -72725 28721 -130002 175529 67309 439223 -73652 -98371 29011 150996 108482
15192A08482b43459d1756P599B82369M6038G3393d3671I1854J26888c51639a10075
$$ 108482 -243459 -41756 -34157 282369 328407 73393 -43671 91854 218742 -351639 -110075
15180D42905C1363O546b87060c8967A2635a46562B54761j07763c03328A26280
$$ 442905 31363 37909 -287060 -38967 12635 -146562 254761 146998 -303328 126280
15169E6768A5487J17320O2367F780K3508J22675C9792b38375k335J03386E1634
$$ 56768 15487 132807 195174 6780 30288 152963 39792 -238375 -240710 -137324 51634
15157D8185K44045a33635B71799j00416k0875J73225q8333K51755B03245b30356
$$ 48185 292230 -133635 271799 171383 150508 323733 235400 487155 203245 -230356
15146h887l18535B08198b70789E6724J61870j0228B2089M5517g0507j06517A631
$$ -8887 -327422 208198 -270789 56724 218594 208366 22089 67606 -70507 -177024 1631
15134B9053J81996Q5187b71014G5941R7168a49853o8272P4480A02943m5998L21900
$$ 29053 211049 296236 -271014 75941 173109 -149853 -218125 -143645 102943 56945 378845
15123C78845j67538l6042n6558m1467J0292R6524J94128j85806I2288M1264C6913
$$ 378845 211307 175265 118707 77240 87532 184056 378184 192378 92288 133552 36913
15111a89005d44n8222F5213A0332K51114B780b6057B36330K31D0613b4884a55
$$ -189005 -444 -58666 65213 10332 261446 2780 -26057 236330 236561 40613 -24884 -155
15098E6111j6815J79106F3491a01898A34099F6861K1741j3255L3285P3083m4986
$$ 56111 39296 218402 63491 -101898 134099 66861 88602 75347 108632 181715 136729
15087A36729E1777K58830a2931A33924E1258e1890d145A24881e5719I205K43851
$$ 136729 51777 310607 -12931 133924 51258 -51890 -4145 124881 -55719 9205 253056
15076B53056A21237m5015c61211A50247a69969C69594J88846d4967A12914R5238
$$ 253056 121237 76222 -361211 150247 -169969 369594 558440 -44967 112914 208152
15066B08152p3561b28145A7L07368a44967F242L28845A11382M0196J14535b09043
$$ 208152 134591 -228145 17 307385 -144967 6242 335087 111382 151578 266113 -209043
15054A4567J06420a40787N6672B4809a79481k8965C11418j248A2425J41368J32004
$$ 14567 120987 -140787 -84115 24809 -179481 -208446 311418 310170 12425 153793 285797
15043B85797r6666a4048E287L94819m4200F6060Q0854K35167A26124j7091J10519
$$ 285797 189131 -14048 5287 400106 355906 66060 146914 382081 126124 109033 219552
15032B19552p1880k6242h3202A0770K89582A14851b9877A89294J44627I1774R9110
$$ 219552 147672 121430 -83202 10770 300352 114851 -29877 189294 333921 91774 190884
15021A90884i5256H133M35627A90501J43457r8232I2940j0816J21019A2445a40235
$$ 190884 -95256 8133 443760 190501 333958 235726 92940 82124 203143 12445 -140235
15009D13054k1785j31291J13021A03348J06195k4555l0309K4212K91465A26655
$$ 413054 391269 259978 372999 103348 209543 184988 154679 178891 470356 126655
14998b88252B70209k4135n7342J65484r2486A30758i791E40004I7935b0559B40825
$$ -288252 270209 246074 188732 354216 261730 130758 -9791 540004 97935 -20559 240825
14986C13557A36335d4593B23180j6029K16117A79556G7593K13326A09127L25154
$$ 313557 136335 -44593 223180 207151 423268 179556 77593 290919 109127 434281
14976D34281A52280a43351f2995A67672M9047o74A6841i9313B75636A18406m1474
$$ 434281 152280 -143351 -62995 167672 216719 216045 16841 -99313 275636 118406 76932
14965G6932K1440M99784j96959j10229K49720n459j65851H543K03106J56059A04029
$$ 76932 98372 598156 401197 290968 540688 535229 369378 8543 211649 367708 104029
14953H0586K47305j22594E9990c09911C43332P3388A22511M1948a3293E29459
$$ 80586 327891 205297 59990 -309911 343332 416720 122511 164459 -13293 529459
14942A79914D3191M41788A40571J05222o0972J77696j76813L21887r6453I6764
$$ 179914 43191 484979 140571 245793 184821 362517 185704 507591 411138 96764
14931a07580a9747D77923j68404G752f433B44594q6616J55169j47557J26488j15811
$$ -107580 -19747 477923 309519 7752 -6433 244594 157978 313147 165590 292078 176267
14920A76267R2395J18650A31575J13788K1748H4447J49518o1496J30289j06262
$$ 176267 268662 387312 131575 245363 267111 84447 233965 172469 302758 196496
14910A96496P6711j6710J57974F7210b64176A39532N3949a2191H9746A6711J08680
$$ 196496 273207 256497 414471 67210 -264176 139532 193481 -12191 89746 16711 125391
14899A25391L121K8760J5423J53520A27683M32786k05797A51932O0538Q4514J2896
$$ 125391 128512 157272 172695 326215 127683 560469 354672 151932 212470 296984 309880
14888C09880G9567J15341K13448E4186M4331J20278P9547o6202q1397L11572j91810
$$ 309880 79567 194908 408356 54186 98517 218795 298342 232140 150743 462315 270505
14877B70505q1672J20667j00578J87864j71539A12008J56926L12162j61442q1087
$$ 270505 188833 309500 208922 396786 225247 112008 268934 581096 419654 338567
14867C38567l5077o7723J15454K97082C17809A25007M30911k18273A21291K67913
$$ 338567 303490 235767 351221 648303 317809 125007 555918 337645 121291 389204
14857C89204c2495C67794A36540K23498K69150j68217k22403K09627p0953G0024
$$ 389204 -32495 367794 136540 360038 629188 460971 238568 448195 377242 70024
14846B95859o7166J61301o1514A27261J86759H4111J13775k5819O422O8773J60684
$$ 295859 228693 389994 328480 127261 314020 84111 197886 172067 178489 247262 407946
14835D07946j97276k0682N7150Q6251O4831L31750j55067k37890e5331E50334
$$ 407946 210670 189988 247138 333389 398220 729970 574903 337013 -55331 550334
14824B79207j7542N76083C33969k8486q6735J98923n5121q2830j00126M8992o6901
$$ 279207 261665 837748 333969 305483 218748 417671 362550 279720 179594 228586 161685
14813A61685J77233l21J65148N8395j4477j26519L4412J00547k42348J71943J09504
$$ 161685 338918 338597 503745 562140 547663 421144 455556 556103 313755 485698 595202
14802E95202B35238J7575J09934J0367K48141j02827R6029A03424K50250K50423
$$ 595202 235238 252813 362747 373114 621255 518428 614457 103424 353674 604097
14792F04097m9833k6793k44560K17926j42182K42883H2856L06648J26826k14422
$$ 604097 554264 527471 282911 500837 358655 601538 82856 389504 516330 301908
14782C01908J90803j78570N28764j81888j47952P1158p7382m2176m8509L1154
$$ 301908 492711 314141 842905 661017 513065 584223 506841 464665 416156 447310
14772D47310M03607m08260J40851J39298j06856l01455L68505k70164j45427J24389
$$ 447310 850917 442657 583508 722806 615950 314495 683000 412836 267409 391798
14762C91798L19354n7301j52609l6760p5841K95793k00137K53152j79638j10291
$$ 391798 711152 653851 501242 464482 388641 684434 484297 737449 557811 447520
14752D47520K46730j5398k59321K65987j69648J42993C13374L11078n8010M6119
$$ 447520 694250 678852 419531 685518 515870 658863 313374 624452 566442 612561
14742F12561j14679Q4915K4589k8962j4368J35008J41764k55522p39N11806m34698
$$ 612561 497882 582797 607386 578424 564056 699064 840828 585306 584567 1096373 661675
14731F61675j11837K68519r2402A74711O21720q6899N8594j83911j27011M2617
$$ 661675 549838 818357 725955 174711 796431 709532 768126 584215 457204 499821
14721D99821K04238R8227j91408J4631P0737J13632K5873k83772Q1491M1750j480
$$ 499821 704059 802286 610878 625509 696246 809878 835751 551979 633470 675220 673740
14710F73740k18402Q1932J70159r4241K77830j95683L07649l82455J99172O3579
$$ 673740 455338 537270 707429 613188 891018 695335 1002984 620529 819701 883280
14700H83280o2173o2925R6898j41119o8347L36576D15070K88695L31444j27685
$$ 883280 821107 758182 855080 713961 645614 982190 415070 703765 1035209 907524
14690I07524r3989j36715J00539r6488N3754K22284k23017J77001l8526k65857
$$ 907524 813535 676820 777359 680871 734625 956909 733892 910893 872367 606510
14680F06510J73810l54494K63566K14610k65796j15057K36042J32830o3981J13983
$$ 606510 780320 425826 689392 904002 638206 523149 759191 892021 828040 942023
14670I42023l17992O12551l43685l00918L28999K94542j33709j16493P281r0303
$$ 942023 624031 1236582 892897 591979 920978 1215520 1081811 965318 972599 882296
14660H82296J26993k19542J14663j46653Q1025n3262m0937K21498K94642j60875
$$ 882296 1009289 789747 904410 757757 838782 785520 744583 966081 1260723 1099848
14650A099848J14181j33878q4893M565j68800J19934k59923K83357K0855K77724
$$ 1099848 1214029 1080151 995258 999823 831023 950957 691034 974391 995246 1272970
14640A272970j20691k92954L52564l15511N38144n00521K93532k80330J1845O6376
$$ 1272970 1152279 859325 1211889 896378 1434522 934001 1227533 947203 959048 1025424
14630A025424M73151k49527m1695K1825j80290J12843J01175l5008l30693M69351
$$ 1025424 1498575 1249048 1207353 1229178 1048888 1161731 1262906 1227898 897205 1366556
14620A366556j97827k1465j0265k40048K57040R4630j78711K43567k73900K71528
$$ 1366556 1168729 1147264 1136999 896951 1153991 1248621 1069910 1313477 1039577 1311105
14610A311105k04123j09989K31114k93368O80129l33132J04865P6986N5796k26476
$$ 1311105 1106982 996993 1228107 934739 1614868 1281736 1386601 1463587 1519383 1292907
14600A292907K65693K13577o28809N868N6692O2583K25160j4902R0995P7083N5757
$$ 1292907 1558600 1772177 1143368 1149236 1205928 1268511 1493671 1478769 1569764 1646847 1702604
14589A702604k80778j41143L67344j41174L46942l55246K50560k42900M53984
$$ 1702604 1421826 1280683 1648027 1506853 1853795 1498549 1749109 1506209 1960193
14580A960193m49190q2596K14607j16143K56432k027l4516O1573j19941O5237
$$ 1960193 1511003 1428407 1643014 1526871 1783303 1781276 1746760 1808333 1688392 1753629
14570A753629L27432k20255j03299P16505p15700K52703L84907l03967o9879K58903
$$ 1753629 2081061 1860806 1757507 2474012 1758312 2011015 2395922 2091955 2022076 2280979
14560B280979l26097O93121l99200N65739j34000L13547j53597L00110L87292
$$ 2280979 1954882 2648003 2248803 2814542 2680542 2994089 2840492 3140602 3527894
14551C527894N41459J031472J967501M404678J0605250J1294201P543805k0165250
$$ 3527894 4069353 5100825 7068326 11473004 22078254 33372455 40916260 20751010
14543B0751010H785934C889888j488771p97570P5015J16729O9010j57343j0088
$$ 20751010 8785934 3889888 2401117 1603547 1678562 1795291 1864301 1706958 1696870
14534A696870j71619M97338o30047L18594J39619P4377j19480J26578N9810K29263
$$ 1696870 1525251 2022589 1392542 1711136 1850755 1925132 1805652 1932230 1992040 2221303
14524B221303m3421j50485j80312K16984n2114J67088n3942J05623J58780j70105
$$ 2221303 2177882 2027397 1847085 2064069 2011955 2179043 2125101 2230724 2389504 2219399
14514B219399K66397o9250k94249L20489l20786K54907J40902K61855k85242J918
$$ 2219399 2485796 2416546 2122297 2442786 2122000 2376907 2517809 2779664 2494422 2496340
14504B496340j13878K52618m6642J36351J73035k40387j0004r2357M39647J2992
$$ 2496340 2382462 2635080 2588438 2724789 2897824 2657437 2647433 2555076 2994723 3007715
14494C007715L4230L0318J33791k15208l10850N66585l96900J01490Q461K73445
$$ 3007715 3041945 3072263 3206054 2990846 2679996 3246581 2849681 2951171 2959632 3233077
14484C233077J28581j00358k79741J87176J33973n87349P84730k50311K09730
$$ 3233077 3361658 3261300 2981559 3168735 3302708 2715359 3500089 3249778 3459508
14475C459508M3088O0867K02071p4319K5578m2675k17812L41190j27034O0500
$$ 3459508 3502596 3563463 3765534 3691215 3716793 3674118 3456306 3797496 3670462 3730962
14465C730962M24701l90403N21409j95819R7263J36091q37360M78087m4007M06496
$$ 3730962 4155663 3765260 4286669 4090850 4188113 4324204 3486844 3964931 3920924 4327420
14455D327420o4456K74751j53079K76098k0250j16302J1691J17120K95844J01316
$$ 4327420 4262964 4537715 4384636 4660734 4640484 4524182 4535873 4652993 4948837 5050153
14445E050153l73098K83537K3138J93940M95322l20391l48296L77615N05087j75873
$$ 5050153 4677055 4960592 4983730 5177670 5672992 5352601 5004305 5381920 5887007 5711134
14435E711134m64686N21767K17802p9549l1628J90178l95512L87156J46602J04478
$$ 5711134 5246448 5768215 5986017 5906468 5874840 6065018 5669506 6056662 6203264 6307742
14425F307742Q3848R0621j8480R6263J09776k6760M97638J57575l1662N2257J85909
$$ 6307742 6391590 6482211 6463731 6559994 6669770 6643010 7140648 7298223 7266561 7318818 7504727
14414G504727l03486K72885L78234m28557M22502O6906j61005K86784N88290k67110
$$ 7504727 7201241 7474126 7852360 7423803 7846305 7913211 7752206 8038990 8627280 8360170
14404H360170J91691L60838j50660j35465K41231O21345j77504L91930j55524
$$ 8360170 8551861 8912699 8762039 8626574 8867805 9489150 9311646 9703576 9548052
14395I548052M17083J2111N3170N61327l97493M64500M52189k6375k3225N37079
$$ 9548052 9965135 9977246 10030416 10591743 10194250 10658750 11110939 11084564 11061339 11598418
14385A1598418n7278M20718J55996L72192J28882K354M02521K42035K28971J52569
$$ 11598418 11541140 11961858 12117854 12490046 12618928 12621282 13023803 13265838 13494809 13647378
14375A3647378O77102n441j69797O70280n6788M29954N20467L45185K35968N27942
$$ 13647378 14324480 14319039 14149242 14819522 14762734 15192688 15713155 16058340 16294308 16822250
14365A6822250m6685N38810L08527j6712N03103P82453J04278P45616P12955K91803
$$ 16822250 16775565 17314375 17622902 17606190 18109293 18891746 18996024 19741640 20454595 20746398
14355B0746398M20679K48241O32832L81634N44262M48376P39504O88613L43925
$$ 20746398 21167077 21415318 22048150 22429784 22974046 23422422 24161926 24850539 25194464
14346B5194464Q32528K97323Q74629J084564J80400J054605P28531R79456P60678
$$ 25194464 26026992 26324315 27198944 28283508 28463908 29518513 30247044 31226500 31987178
14337C1987178J302303M43548Q82921J209493R55746J009725J164858J557786
$$ 31987178 33289481 33733029 34615950 35825443 36781189 37790914 38955772 40513558
14329D0513558J132221J440358R08449J789473J577402J400386J454394K285862
$$ 40513558 41645779 43086137 43994586 45784059 47361461 48761847 50216241 52502103
14321E2502103J024423K195880J885333J954376K918190K140759K431270L035769
$$ 52502103 53526526 55722406 57607739 59562115 62480305 64621064 67052334 70088103
14313G0088103K278018L016225L405408L237588L535741L542466M015210M035320
$$ 70088103 72366121 75382346 78787754 82025342 85561083 89103549 93118759 97154079
14305I7154079M660394M194643N268492N336836N410615O029037O197029P086994
$$ 97154079 101814473 106009116 111277608 116614444 122025059 128054096 134251125 141338119
14297A41338119P246161P750029Q028573Q551464R686717R697500J0564315J1267392
$$ 141338119 148584280 156334309 164362882 172914346 182601063 192298563 202862878 214130270
14289B14130270J1743622J2357566J3137625J4043179J4271882J4945501J5756456
$$ 214130270 225873892 238231458 251369083 265412262 279684144 294629645 310386101
14282C10386101J5950982J6261087J6580998J6071622J6027911J5526542J4113167
$$ 310386101 326337083 342598170 359179168 375250790 391278701 406805243 420918410
14275D20918410J3217428J0449452O646825L180111j165375j048564L970498J401283
$$ 420918410 434135838 444585290 451232115 454412226 453246851 452198287 456168785 457570068
14267D57570068k137098o821110r715615j1309486j2633176j4343918j5846361
$$ 457570068 455432970 448611860 438896245 427586759 414953583 400609665 384763304
14260C84763304j6072162j6587748j7210569j6337868j6117604j5578699j3982964
$$ 384763304 368691142 352103394 334892825 318554957 302437353 286858654 272875690
14253B72875690j4375774j3909976j2900428j2204712j1876985j0937847j0589136
$$ 272875690 258499916 244589940 231689512 219484800 207607815 196669968 186080832
14246A86080832r717301q486551q566135p969825p757364o811556o550351o333673
$$ 186080832 176363531 167876980 159310845 151341020 143583656 136772100 130221749 123888076
14238A23888076n488741n239856n152435m869064m924603m297262l555324l422759
$$ 123888076 118399335 113159479 108007044 103137980 98213377 93916115 90360791 86938032
14230H6938032l596175l570231l487274l248724k328344k842588k718290k525368
$$ 86938032 83341857 79771626 76284352 73035628 70707284 67864696 65146406 62621038
14222F2621038k234966j901636j998961k005903k055801j508723j669182k065225
$$ 62621038 60386072 58484436 56485475 54479572 52423771 50915048 49245866 47180641
14214D7180641j136314r13067j881225j522766j589852r01062q61738p10073j132542
$$ 47180641 46044327 45131260 43250035 41727269 40137417 39236355 38374617 37664544 36532002
14205C6532002j448822j051914j156984q04484q87490o55066o13365q78974q00983
$$ 36532002 35083180 34031266 32874282 32069798 31182308 30527242 29913877 29034903 28233920
14196B8233920j336470l82722l19260q68935l50273r15102o07896o94265m69617
$$ 28233920 26897450 26514728 26195468 25326533 24976260 24061158 23453262 22758997 22289380
14187B2289380l85699p36332k18022o61525m83520l02256n78653l17336l00236
$$ 22289380 21903681 21167349 20949327 20287802 19804282 19502026 18923373 18606037 18305801
14178A8305801m71849k63511m14527l47741m33379m30436j45435k10678m39478
$$ 18305801 17833952 17570441 17155914 16808173 16374794 15944358 15798923 15588245 15148767
14169A5148767k90632j76156j42849l98904o51247k3869j36215l12119k44998
$$ 15148767 14858135 14681979 14539130 14140226 13488979 13465110 13328895 13016776 12771778
14160A2771778M7614l24431l25671l23366m07651k8644J06150j62305m26590k79324
$$ 12771778 12819392 12494961 12169290 11845924 11438273 11409629 11515779 11353474 10926884 10647560
14150A0647560K99354n37566j94920m30645L60360o09560Q0436k19429j18070
$$ 10647560 10946914 10409348 10214428 9783783 10144143 9534583 9615019 9395590 9277520
14141I277520m20714p0170j53948j40564l1011J81698j79629l61766k22578o068
$$ 9277520 8856806 8786636 8632688 8492124 8461113 8642811 8463182 8101416 7878838 7872770
14131G872770k34032J80106k05758j49230J01189k31104J51282l41270q2320j94736
$$ 7872770 7638738 7818844 7613086 7463856 7565045 7333941 7485223 7143953 7061633 6866897
14121F866897r5819l401n33702J52022J85940j16119m31345M90666j04556P233
$$ 6866897 6771078 6767677 6233975 6385997 6571937 6455818 6024473 6515139 6410583 6417816
14111F417816q6876k79447q3745j05153m07881r4945O3K67910k26371k0174L73407
$$ 6417816 6330940 6051493 5967748 5862595 5454714 5359769 5359832 5627742 5401371 5381197 5754604
14100E754604m48302j05957K76149j26860j52691l69689N1493j66250j20096J23690
$$ 5754604 5306302 5200345 5476494 5349634 5196943 4827254 4878747 4712497 4592401 4716091
14090D716091O7635r4577J15529l32902j69222J91344p7187k78223N10687l21036
$$ 4716091 4783726 4689149 4804678 4471776 4302554 4493898 4416711 4138488 4649175 4328139
14080D328139j12058o9560K6227k48696K40015l34448l08392M30385L37645p08957
$$ 4328139 4216081 4146521 4172748 3924052 4164067 3829619 3521227 3951612 4289257 3580300
14070C580300o8277L97K91187p1611j87873J55525j15828j49663N2415J84253
$$ 3580300 3512023 3512420 3803607 3731996 3544123 3699648 3583820 3434157 3486572 3670825
14060C670825k84531M63136j38701j56221m8612k14752o3065l9197j15270K23098
$$ 3670825 3386294 3849430 3710729 3554508 3505896 3291144 3228079 3188882 3073612 3296710
14050C296710P7954o90066K72331K469q2641M47636l53891k34624j18572L24698
$$ 3296710 3374664 2684598 2956929 2959398 2876757 3324393 2970502 2735878 2617306 2942004
14040B942004l61076J4236K08202j04172k72778K05911P2200j99096K65492r1833
$$ 2942004 2580928 2595164 2803366 2699194 2426416 2632327 2704527 2505431 2770923 2679090
14030B679090J56396j68448j60533k21774J65566l09295K90027k0049K25928l38944
$$ 2679090 2835486 2667038 2506505 2284731 2450297 2141002 2431029 2410980 2636908 2297964
14020B297964j54660K20295n3748l48954K52708l21175K59763l76702M73584j63906
$$ 2297964 2143304 2363599 2309851 1960897 2213605 1892430 2152193 1775491 2249075 2085169
14010B085169J05925j14448k45213k15090K26593J79857J2589j58000J71030l7736
$$ 2085169 2191094 2076646 1831433 1616343 1842936 2022793 2035382 1877382 2048412 2010676
14000B010676r8580j39159J85063j31378m5707K4448j02092L45433j27399M6845
$$ 2010676 1912096 1772937 1958000 1826622 1780915 1805363 1703271 2048704 1921305 1968150
13990A968150M88155J267215L445636R326060J2173511J3006280j6501143A1383965
$$ 1968150 2456305 3723520 7169156 16495216 28668727 41675007 25173864 11383965
13981G080408k019305j096597n43654j19689p08550J97945j55125l56840j95J21016
$$ 7080408 5061103 3964506 3420852 3301163 2592613 2790558 2635433 2278593 2278398 2399414
13971B399414k12540J39260j16147k11827L4911K53809j39624k08884Q5641k01132
$$ 2399414 2186874 2326134 2209987 1998160 2033071 2286880 2147256 1938372 2024013 1822881
13961A822881j0540P8332r6765j14393K99693m60628L19640j52909N4549k30682
$$ 1822881 1812341 1890673 1793908 1679515 1979208 1518580 1838220 1685311 1739860 1509178
13951A509178J59087k9004k21103j85340N24812k36676l11743L94222k27627L96768
$$ 1509178 1668265 1639261 1418158 1232818 1757630 1520954 1209211 1603433 1375806 1772574
13941A772574l80918o1601L86143N9549k15741j04464j84443J85147J12980m46117
$$ 1772574 1391656 1330055 1716198 1775747 1560006 1455542 1271099 1456246 1569226 1123109
13931A123109K74562J71825r4978l3618K502o8255r2616J61829k08579K33740
$$ 1123109 1397671 1569496 1474518 1440900 1443402 1375147 1282531 1444360 1235781 1469521
13921A469521m46983K43076R7919O8732j45452J32706j02361k91593M01822k39306
$$ 1469521 1022538 1265614 1363533 1432265 1286813 1419519 1317158 1025565 1427387 1188081
13911A188081O7789N5012k13182K67602k24347k2660J85849n0336j68115m9071
$$ 1188081 1255870 1310882 1097700 1365302 1140955 1118295 1304144 1253808 1085693 1036622
13901A036622L65260k21503k92118J73262j48093j00169L73162J22480k25857
$$ 1036622 1401882 1180379 888261 1061523 913430 813261 1186423 1308903 1083046
13892A083046J94423n269J56507N00k00363q3570k90587M88451m90475K12778
$$ 1083046 1277469 1272200 1428707 1429207 1228844 1145274 854687 1343138 852663 1065441
13882A065441L9868k03974j33181P14673l37925k23154K61601R9369n85182J76438
$$ 1065441 1105309 901335 768154 1482827 1144902 921748 1183349 1282718 697536 873974
13872H73974J16332J71123l40155k59543K86160K83003J38396l61018L9918j61652
$$ 873974 990306 1161429 821274 561731 847891 1130894 1269290 908272 948190 786538
13862G86538k3082M6523k02106N01189k03680N9295J2163K03250l28578J88729
$$ 786538 763456 809979 607873 1109062 905382 964677 976840 1180090 851512 1040241
13852A040241M1625m74113L69171L7596l79536N90997E12250L87584o6478J07500
$$ 1040241 1081866 607753 976924 1014520 634984 1225981 512250 899834 833356 940856
13842I40856j67107O9963M40240n23510m6727P5324m6677M4492J35981m60320
$$ 940856 773749 843712 1283952 760442 713715 789039 742362 786854 922835 462515
13832D62515L26294J35511J02213l03943J61561k30542j95700K60704N7099K6796
$$ 462515 788809 924320 1026533 722590 884151 653609 457909 718613 775712 802508
13822H02508L56483E56251j37401K00031J45181k74244Q1577K43095j4338O3103
$$ 802508 1158991 556251 418850 618881 764062 489818 571395 814490 800152 863255
13812H63255p0088k50618j85171M68537k70978L22588j26847n8270L74612m33933
$$ 863255 793167 542549 357378 825915 554937 877525 750678 692408 1067020 633087
13802F33087P7912j48613K44997j92057K72809q3363o289l01847L08860j56446
$$ 633087 710999 562386 807383 615326 888135 804772 798483 496636 805496 649050
13792F49050K61614k38985k2825p6818N359O3448P9182J58162j92418K5876j23876
$$ 649050 910664 671679 648854 572036 577395 640843 720025 878187 685769 711645 587769
13781E87769L9564j05127J01225n2016m9764K88121j64566k40546L91849j98934
$$ 587769 627333 522206 623431 571415 521651 809772 645206 404660 796509 597575
13771E97575K4097j35710p8431L01066j17108K9064O6297j0848j78621j17056
$$ 597575 621672 485962 407531 708597 591489 620553 686850 676002 497381 380325
13761C80325K41035R2868J6809J04837j20170q1946j14422J94609L1444j88245
$$ 380325 621360 714228 731037 835874 715704 633758 519336 713945 745389 557144
13751E57144j49237L53192C73091L30481N376k36682K89468j19413J90985l25842
$$ 557144 407907 761099 373091 703572 708948 472266 761734 642321 833306 507464
13741E07464B11595L00521Q9971k40739k2154R263J48265B08479L62930L369N2497
$$ 507464 211595 512116 602087 361348 339194 348457 496722 208479 571409 574778 627275
13730F27275j99285j9900j4886J32944j66847K99496k93897j21064m3994M43163
$$ 627275 427990 408090 393204 526148 359301 658797 364900 243836 199842 643005
13720F43005B71249J61430L0613O3586R9613B81109K07319k30968M96955A95836
$$ 643005 271249 432679 463292 526878 626491 281109 488428 257460 754415 195836
13709E35212m9406k15521L8535K05902K09851p7878M387l18066p923K50958q9932
$$ 535212 485806 270285 308820 514722 724573 646695 651082 333016 325093 576051 486119
13698D86119J29722k65321J11958J03946I9531j3374K00021M62211l7557k81178
$$ 486119 615841 350520 462478 566424 99531 86157 286178 748389 710832 429654
13688D29654E4888K45863k3803Q1651L862Q9302J79902m0501j08331J01104j48218
$$ 429654 54888 300751 276948 358599 362461 451763 631665 591164 482833 583937 435719
13677D35719m1562R7870K1629j93654A43107k4412L64255A79405L07713B42946
$$ 435719 394157 492027 513656 320002 143107 118695 482950 179405 487118 242946
13666C83252K86810k77392n4204O5768j30116J50465o1271J13003n5061o7191
$$ 383252 670062 392670 338466 404234 274118 424583 363312 476315 421254 354063
13656C54063A39816K67110j56355O2156M7707o6786J01415R1767F2845N76764
$$ 354063 139816 406926 250571 312727 360434 293648 395063 486830 62845 639609
13646F39609j69342Q616j10273j58220L38607j15593j2184j46857N63629k48408
$$ 639609 470267 478883 368610 210390 548997 433404 421220 274363 837992 589584
13636E89584j16378A99749M0649K70014j62254A35666J28550L60458j77674J4254
$$ 589584 473206 199749 240398 510412 348158 135666 264216 624674 447000 461254
13626D61254d3756B65459j22010M76665j87139O3186o6849J5321R2216J5046B33400
$$ 461254 -43756 265459 143449 620114 432975 496161 429312 444633 536849 551895 233400
13614D62299K59435B75640J3257j08894K22106O9868k24362j8523j07701l8230
$$ 462299 721734 275640 288897 180003 402109 471977 247615 229092 121391 83161
13604H3161L73406A85418K08929A89094L06929m6346J71950C03377j37828l8038
$$ 83161 456567 185418 394347 189094 496023 449677 621627 303377 165549 127511
13594A27511M4932P838L9887J80075o8955o5406k1336N5176K53821B07298K13472
$$ 127511 172443 180281 220168 400243 331288 265882 244546 299722 553543 207298 420770
13583D20770J3411j10267K98581e3818A85285J64283p3012O3757A62364K8514
$$ 420770 434181 323914 622495 -53818 185285 349568 276556 340313 162364 190878
13573A90878g4590D05610j42425H4644J96487J84877B19724l1319R095K4985K76510
$$ 190878 -74590 405610 263185 84644 281131 466008 219724 188405 197500 222485 498995
13562D98995A79872N8268J05027p522k298G9612P2768L67186A69203L47973j67482
$$ 498995 179872 238140 343167 335645 333347 79612 152380 519566 169203 517176 349694
13551C49694P3016j37251a92612D27184l3483B4589e4281C61604A75979K70357
$$ 349694 422710 285459 -192612 427184 393701 24589 -54281 361604 175979 446336
13541D46336a07382A20604L84662A83422J34297p3503k9325q2422L22526e7564
$$ 446336 -107382 120604 505266 183422 317719 244216 214891 132469 454995 -57564
13530I2536J41791j16084g5021E94613B84634n145A2849K31274q7711p298k5811
$$ 92536 234327 118243 -75021 594613 284634 279489 12849 244123 156412 149114 123303
13519A23303J77430h130I87L14249L7200A19855K64382A47058E1718K95662p363
$$ 123303 300733 -8130 987 315236 352436 119855 384237 147058 51718 347380 340017
13508C40017a36183A11636M29437B69360A0369K35205l6082k4914C7291K2219
$$ 340017 -136183 111636 541073 269360 10369 245574 209492 184578 37291 59510
13498E9510J44088K19763A59337N1467L5211J12591b6552A63970K48380j25624
$$ 59510 203598 423361 159337 210804 246015 358606 -26552 163970 412350 286726
13488B86726A28117K71214G1573b40057B47218p7962B6665K26308M1617A11254
$$ 286726 128117 399331 71573 -240057 247218 169256 26665 252973 294590 111254
13477C60062m3567M1592j70825g2228C21518A20216b08836A83970o5666Q7255
$$ 360062 316495 358087 187262 -72228 321518 120216 -208836 183970 118304 205559
13467B05559J13548J71339E4570b9264B78310J72708j05404j57123c7738A75906
$$ 205559 319107 490446 54570 -29264 278310 451018 345614 188491 -37738 175906
13456B10002B2030L52080A42242L57491G1386O4351J78805N1105K63518B91367
$$ 210002 22030 374110 142242 499733 71386 135737 314542 365647 629165 291367
13445D25099A39744N3290J23222A1706K46233K8155O2073j18265o1503K85117
$$ 425099 139744 193034 316256 11706 257939 286094 348167 229902 168399 453516
13435D53516B17208K83113B45100A14980C9459K28264K6201p2055o0302Q857L8503
$$ 453516 217208 500321 245100 114980 39459 267723 293924 221869 161567 170424 208927
13424B08927J36467b9544B63254h7052k083M1724B24736m9765M1907r1867Q8864
$$ 208927 345394 -29544 263254 -87052 -89135 -47411 224736 174971 216878 125011 213875
13413B13875L995I0349j3165a42443A54883n6662J04581h9071D35648k11926I1438
$$ 213875 217870 90349 77184 -142443 154883 98221 202802 -89071 435648 223722 91438
13401A78304K95449e3783H8080P3800e044q1816C11956O1931A48571Q2948A03274
$$ 178304 473753 -53783 88080 161880 -5044 -86860 311956 373887 148571 231519 103274
13389H1839e2358C87647j31683J98298e9362k328C68621J27430g5828j2289A75793
$$ 81839 -52358 387647 255964 454262 -59362 -61690 368621 496051 -75828 -88117 175793
13377A05747J09180F5536g3249B34823j12798C8860J67789l6893J349K40820F7515
$$ 105747 214927 65536 -73249 234823 122025 38860 206649 169756 171105 411925 67515
13365I2598R5510l497q1197K4125a10795A91863j2741K5072M5711a28672A10426
$$ 92598 188108 184611 103414 127539 -110795 191863 179122 204194 249905 -128672 110426
13353F1975f3109F3968a70042E70295k24536G400Q5099J07265n3724l865K61495
$$ 61975 -63109 63968 -170042 570295 345759 7400 92499 199764 146040 142175 403670
13342D03670j53096J78180j88965J49909C5618N81100h9944D8198K50684q0249
$$ 403670 250574 428754 239789 389698 35618 616718 -89944 48198 298882 218633
13332B18633Q8611k6343a06250M6235A81737J28176E9690K18772J38591q3536
$$ 218633 307244 280901 -106250 -60015 181737 309913 59690 278462 417053 333517
13322C33517d8706A01439L04413A87898J25184r0724Q7489I8063a43479G2555
$$ 333517 -48706 101439 405852 187898 313082 222358 309847 98063 -143479 72555
13311A81599b5692j71345D40659A23223C9134J69996J34207J1992k9385f1433
$$ 181599 -25692 -197037 440659 123223 39134 209130 343337 355329 325944 -61433
13300b42968I4770a02185G9504K66062A69937J10597G5313F857K1228J72886J4275
$$ -242968 94770 -102185 79504 345566 169937 280534 75313 6857 28085 200971 215246
13289B15246J02947G327N275P5516L04138H787a51739C37758A00517J11365g5794
$$ 215246 318193 7327 12602 88118 392256 8787 -151739 337758 100517 211882 -75794
13277F87059F2949a8828A01650l5761J88416F7247j407K11802b46469A13006k3857
$$ 687059 62949 -18828 101650 65889 254305 67247 65840 277642 -246469 113006 89149
13266H9149f8919j9395D43469A539P2875J43832K48487j77998g164l8766B28084
$$ 89149 -68919 -88314 443469 1539 74414 218246 466733 288735 -7164 -45930 228084
13254E3867L74709a13204B9124q195P0561P9125Q0009D8307Q6299J05271A04013
$$ 53867 428576 -113204 29124 20929 91490 170615 250624 48307 134606 239877 104013
13242B1785A0327K64003A34416k642J60011f4311B5136c79333B54429f0796B2238
$$ 21785 10327 274330 134416 131774 291785 -64311 25136 -379333 254429 -60796 22238
13230B37232d12814l1722C08869A21533M1065k8718d4718A08096c568j81479A5108
$$ 237232 -412814 -444536 308869 121533 162598 133880 -44718 108096 -3568 -185047 15108
13218e0668r6346D2274d6044A1032L13246C2587b6653r4784N0842C05186I6080
$$ -50668 -147014 42274 -46044 11032 324278 32587 -26653 -121437 -70595 305186 96080
13206C06973F7074d7395k36691J27352b4491n7918B67211p4624J76004p077A80226
$$ 306973 67074 -47395 -284086 -156734 -24491 -82409 267211 192587 368591 361514 180226
13194b25862L1614A48241a73665c497A87983b7031h5B40482k8602a91642I6943
$$ -225862 -194248 148241 -173665 -3497 187983 -27031 -85 240482 211880 -191642 96943
13182C10543A8561M25154F689L64238h7605A01304b09458C48785D984M228f0576
$$ 310543 18561 443715 6689 370927 -87605 101304 -209458 348785 4984 9212 -60576
13170B15398N131b15318M7569c7699B00955J40436a20874A40f3762q1826A24717
$$ 215398 220529 -215318 -167749 -37699 200955 341391 -120874 140 -63762 -145588 124717
13158B6669J30822J2315c41211J39364g1772E5703Q897h8851C79882a68571C16862
$$ 26669 157491 169806 -341211 -201847 -71772 55703 64600 -88851 379882 -168571 316862
13146A58087J90685I9528M9776g745A77401a23076E7039J82815C5963A4105J44474
$$ 158087 348772 99528 149304 -7745 177401 -123076 57039 239854 35963 14105 158579
13135A58579a89608o020I4873N86655d6654a9606G8855J50331E2147g2332A73846
$$ 158579 -189608 -195628 94873 681528 -46654 -19606 78855 229186 52147 -72332 173846
13123d1798A44046m3998K4619L05109H4968a77428B30627c4947P659o0788b0152
$$ -41798 144046 100048 124667 429776 84968 -177428 230627 -34947 -27288 -88076 -20152
13111F2371d4790j85565A32537j9169a90674D5469a27217F0700d6615k84817a04992
$$ 62371 -44790 -230355 132537 113368 -190674 45469 -127217 60700 -46615 -331432 -104992
13099E9432M77950I1083a29687B84405a62686B43120o6221g9492D57623H4261
$$ 59432 537382 91083 -129687 284405 -162686 243120 176899 -79492 457623 84261
13088B4406J81685B2974Q4201B7176J04041E5667K20046g3826A56648J24951b29867
$$ 24406 206091 22974 107175 27176 131217 55667 275713 -73826 156648 281599 -229867
13076d473A22994J38384g1966C4550C377a9839A71712L089n7564J59c0245o60953
$$ -4473 122994 261378 -71966 34550 3377 -19839 171712 174801 117237 117396 -30245 -691198
13064f91198H4388J49284n8164D2786b2977o8140B20675D8011R3280b4900D15291
$$ -691198 84388 233672 175508 42786 -22977 -91117 220675 48011 141291 -24900 415291
13052B082J56375M9941b17304A62157b54463g7609A83117h7761n16A56420K04850
$$ 2082 158457 208398 -217304 162157 -254463 -77609 183117 -87761 -88277 156420 361270
13041C61270H7371K29704h7368A85812b07517q313g2040q9242A37643B4840J19304
$$ 361270 87371 317075 -87368 185812 -207517 -215830 -72040 -161282 137643 24840 144144
13030A44144M08225a46000a7611B76377J9109a23233B11058A6750J02558N8645
$$ 144144 552369 -146000 -17611 276377 295486 -123233 211058 16750 119308 177953
13020A77953b4442I3515l4219J969b1632B62404I5173J31594o2703a53836D6747
$$ 177953 -24442 93515 59296 61265 -21632 262404 95173 226767 164064 -153836 46747
13008b2779D0642b52109C17422f7359C15633p9024k1344c1488q5035F2274N0326
$$ -22779 40642 -252109 317422 -67359 315633 236609 215265 -31488 -116523 62274 112600
12997A12600P0376f0918A73535i7483C14944f1909m1798C2105Q8060a73425f6157
$$ 112600 182976 -60918 173535 -97483 314944 -61909 -103707 32105 120165 -173425 -66157
12985a41445F6703b10165a7296C239K62131n4551K4860A01229K0837a97251A06541
$$ -141445 66703 -210165 -17296 3239 265370 210819 235679 101229 122066 -197251 106541
12973a24982A02653K8073a89174G8281K9537J28261I8706Q036K34257j26449b22779
$$ -124982 102653 130726 -189174 78281 107818 236079 98706 106742 340999 214550 -222779
12961A41604a1835D5107i2267I4552a92888A52391a8492B4256a66147B38612c2849
$$ 141604 -11835 45107 -92267 94552 -192888 152391 -18492 24256 -166147 238612 -32849
12949b38196A17869D9833b21752a03805j4834B6839J04997f2755a9356j3959A07238
$$ -238196 117869 49833 -221752 -103805 -118639 26839 131836 -62755 -19356 -33315 107238
12937C24973E0711Q8737d5014B7862b10983F7581J16401a38824A17613b36867
$$ 324973 50711 139448 -45014 27862 -210983 67581 183982 -138824 117613 -236867
12926A05418f0119k03645B19448O5227O5811N4011b6693B852c12151N0573f462
$$ 105418 -60119 -263764 219448 284675 350486 404497 -26693 2852 -312151 -261578 -6462
12914a1058B39939A04238a12002j23430B1504K5415d18026g5251J3153A58838
$$ -11058 239939 104238 -112002 -235432 21504 46919 -418026 -75251 -62098 158838
12903C12007f0878A8247a19349A18092a09276L8673B37838a872H4745O5718b3541
$$ 312007 -60878 18247 -119349 118092 -109276 -70603 237838 -1872 84745 150463 -23541
12891A97849A16J1661R6858m6930J46711c2192k29353a15951b1486D08255a01802
$$ 197849 116 11777 108635 61705 208416 -32192 -261545 -115951 -21486 408255 -101802
12879c12319B65172g8975A38084a84403g2355B53237p2352l7175b59088E7563
$$ -312319 265172 -78975 138084 -184403 -72355 253237 180885 143710 -259088 57563
12868a30425B9963a18278A05515i5154e908I2388e6298B14138e0763A22553K0026
$$ -130425 29963 -118278 105515 -95154 -5908 92388 -56298 214138 -50763 122553 142579
12857A42579d7345j83376H3585R4504B9671K34250a57909b5129k0697k31966n537
$$ 142579 -47345 -230721 83585 178089 29671 263921 -157909 -25129 -45826 -277792 -283329
12846b83329A15861K79100a79970a01A87539K53639A07918B0693f1162j77590
$$ -283329 115861 394961 -179970 -101 187539 441178 107918 20693 -61162 -238752
12836b38752N0069l0425A07007N0048R0800P9075H1586K36572d3362B13807a66308
$$ -238752 -188683 -219108 107007 157055 247855 326930 81586 318158 -43362 213807 -166308
12824H7442g9035C7070c47991A69370B7956J28349l405D527i8456D05515A30485
$$ 87442 -79035 37070 -347991 169370 27956 156305 152900 4527 -98456 405515 130485
12812b80877g5128k0450j3516j62047J29109j4778C69786A08345e8895f122B6438
$$ -280877 -75128 -95578 -109094 -271141 -142032 -156810 369786 108345 -58895 -6122 26438
12800B13680k073H7390a00711b8697B9b11474e8267j80013D4011h109B77121C2310
$$ 213680 211607 87390 -100711 -28697 29 -211474 -58267 -238280 44011 -8109 277121 32310
12787h6327B16837g3893o3008o9879A53270E4519c3132A04984d5076R018A02926
$$ -86327 216837 -73893 -136901 -206780 153270 54519 -33132 104984 -45076 -36058 102926
12775a08101L382J9673G7645J41024I4024a14384B16503O0692A24398f9956r4018
$$ -108101 -104719 -85046 77645 218669 94024 -114384 216503 277195 124398 -69956 -163974
12764a63974j13938J4980D2812K09687F5715O8617m0983D2407K5663L1340K02040
$$ -163974 -277912 -262932 42812 252499 65715 134332 93349 42407 68070 99410 301450
12753C01450a80209e0908j39513B18806a08388j65257j38697d4554C20252b4587
$$ 301450 -180209 -50908 -190421 218806 -108388 -273645 -412342 -44554 320252 -24587
12742b1575p4212M0742l3406B47388q538c08988A71194j4805c2804k4535G195
$$ -21575 -95787 -55045 -88451 247388 238850 -308988 171194 156389 -32804 -57339 7195
12730B07107O1158A08800f7826I7791k0609J8063K85563d5139N185h424j45637
$$ 207107 268265 108800 -67826 97791 77182 95245 380808 -45139 -39954 -8424 -154061
12719a54061C40973b15027A62519J36739a14338A49069h7976C23302a00744A30368
$$ -154061 340973 -215027 162519 299258 -114338 149069 -87976 323302 -100744 130368
12708A60827M37201B30867i7990A55168m1736b9790B78592A24741B9445J49244
$$ 160827 598028 230867 -97990 155168 113432 -29790 278592 124741 29445 178689
12698A78689K68496a48507c6923k06929a8672C90498j86713G9116g2733G4789
$$ 178689 447185 -148507 -36923 -243852 -18672 390498 203785 79116 -72733 74789
12687b2590j40301g2564j13622A97224e0620B1066L88136D219J69424J25889H9525
$$ -22590 -162891 -72564 -186186 197224 -50620 21066 409202 4219 173643 299532 89525
12675a65527B02128L0852a4522n9842I8196m2625c6375o9479p2677f3745B11881
$$ -165527 202128 232980 -14522 -74364 98196 55571 -36375 -105854 -178531 -63745 211881
12663A84803i7120b0130A54311n3475J48092e982j75359A73374n4187c4746C07325
$$ 184803 -97120 -20130 154311 100836 248928 -5982 -181341 173374 119187 -34746 307325
12651A14729a21344a1673B05272b6029o042k39070C3931a7452B8348c9919l1908
$$ 114729 -121344 -11673 205272 -26029 -32071 -271141 33931 -17452 28348 -39919 -71827
12640g1827G9431f0341A35437J64296a21193A26301i7904n2120A63792p2456Q377
$$ -71827 79431 -60341 135437 299733 -121193 126301 -97904 -150024 163792 91336 99713
12629I9713B7019K63879H1172N0285j1937A8672K60204A04217C8184J92938c8122
$$ 99713 27019 290898 81172 131457 119520 18672 278876 104217 38184 231122 -38122
12617A28016J34196H0440J62357a06920m6799O2240K4238A04078M4884e7159E8138
$$ 128016 262212 80440 242797 -106920 -153719 -91479 -67241 104078 148962 -57159 58138
12605E0511J02947J05389A20138c9399A61642R0489A6282a77636N4486D30418
$$ 50511 153458 258847 120138 -39399 161642 252131 16282 -177636 -123150 430418
12594E9330J12654a19843e0323A76573a13456m2000A68590o9620f4705j3482k0200
$$ 59330 171984 -119843 -50323 176573 -113456 -155456 168590 98970 -64705 -78187 -98387
12583i8387c8863m3828C1921a59495E9193i1889B16541p1217J1848A2223b7510
$$ -98387 -38863 -82691 31921 -159495 59193 -91889 216541 145324 157172 12223 -27510
12571D0682J07318b64558A98128I7167l1491a51838B5581b86685h6525I4562d4438
$$ 40682 148000 -264558 198128 97167 65676 -151838 25581 -286685 -86525 94562 -44438
12559H9635J11015F3997K6199b43281d497B12416b68414A34003J72329A6306O5289
$$ 89635 200650 63997 90196 -243281 -4497 212416 -268414 134003 306332 16306 81595
12548H1595h9666G6414j5134c90767E3837b01639P0360C36985e7288O067m3447
$$ 81595 -89666 76414 61280 -390767 53837 -201639 -131279 336985 -57288 -51221 -94668
12537i4668d5636A36421i5118L7305o3745B06630c9726j39462B15398a06103B12611
$$ -94668 -45636 136421 -95118 -57813 -121558 206630 -39726 -179188 215398 -106103 212611
12525a09148E793a47219a4450N995H8127D0681a07799b3488F1104c55366B68708
$$ -109148 5793 -147219 -14450 -8455 88127 40681 -107799 -23488 61104 -355366 268708
12513B88460a401A03624J99129A7977a08939b1734A0815a97604r4646J01690B80582
$$ 288460 -1401 103624 302753 17977 -108939 -21734 10815 -197604 -292250 -190560 280582
12501G4629L1845l7500k4416a476j01453K8604c6200G6159Q7257i0491K0467B75678
$$ 74629 106474 68974 44558 -1476 -102929 -74325 -36200 76159 163416 -90491 -70024 275678
12488C11965h8498D9229a75871j66939d0850J4805p9485B7932d830j03752A08427
$$ 311965 -88498 49229 -175871 -342810 -40850 -26045 -105530 27932 -4830 -108582 108427
12476F3753J494c6762A39306n6746h0501l3333d16m4521b1462j36305H4645Q8239
$$ 63753 65247 -36762 139306 82560 -80501 -113834 -416 -44937 -21462 -157767 84645 172884
12464A72884o849J36622a4043B34823j4807c10844R4724r3591a14979H5935k0296
$$ 172884 166035 302657 -14043 234823 220016 -310844 -216120 -309711 -114979 85935 65639
12453F5639e500r8121j55285B7288M3209g6713k51225A04541L93010F5252P7501
$$ 65639 -5500 -103621 -258906 27288 70497 -76713 -327938 104541 497551 65252 142753
12442A42753n4878b65304q40A67979k6199D8262L5655g1995A63874a02680B8645
$$ 142753 87875 -265304 -266144 167979 141780 48262 83917 -71995 163874 -102680 28645
12430C6368c13621B18460b09133a1422l53775h1886C98259A77257j3972a01656
$$ 36368 -313621 218460 -209133 -11422 -365197 -81886 398259 177257 163285 -101656
12419a98780D4233K56678j36698J17835c11310b1114I5269k128g8069j07223I4933
$$ -198780 44233 300911 164213 282048 -311310 -21114 95269 93141 -78069 -185292 94933
12407D12099b6688A19151a2936A54369K3260I443i360C69812C6397a30411G8070
$$ 412099 -26688 119151 -12936 154369 177629 9443 -9360 369812 36397 -130411 78070
12395a52931h281F243c8112k08767g36G5098a25549q341C30144b09326R0650h702
$$ -152931 -8281 6243 -38112 -246879 -736 75098 -125549 -133890 330144 -209326 -118676 -8702
12382b356k59664B87211j36823h4864r1769B94554b95207A27431e3016d998l7628
$$ -2356 -262020 287211 150388 -84864 -176633 294554 -295207 127431 -53016 -4998 -42626
12371d2626I2458a61239B86656N7817E2714K63211a21540B02398J82276A53457
$$ -42626 92458 -161239 286656 344473 52714 315925 -121540 202398 384674 153457
12360B5004b20072Q7827E8328J90578j20328b14496B84531C8591J19938J85443
$$ 25004 -220072 -132245 58328 248906 128578 -214496 284531 38591 158529 343972
12350C43972j37945a84871M7263A06015K21689a86512A80846D5645K14286E2991
$$ 343972 206027 -184871 -137608 106015 327704 -186512 180846 45645 259931 52991
12339A56803m9280k4985B9163a83936C05969h4413B62940g3245A4706R6654i457
$$ 156803 107523 82538 29163 -183936 305969 -84413 262940 -73245 14706 111360 -9457
12327b63347R7601O5725M3541B6170f4676j69817A53826e3876B24612B9704J64042
$$ -263347 -165746 -100021 -56480 26170 -64676 -234493 153826 -53876 224612 29704 193746
12316A93746m9865D337c161k03990k5069k09769H366J44615a83172p9515A15607
$$ 193746 143881 4337 -3161 -207151 -232220 -441989 8366 152981 -183172 -262687 115607
12304d6799A18023b17075l9029D28175a41950A80379D5914k278A7841J14931f7498
$$ -46799 118023 -217075 -256104 428175 -141950 180379 45914 43636 17841 132772 -67498
12292a33725j05277D117b1198m7222C88931D3896e8559A83575M9178a2423l8490
$$ -133725 -239002 4117 -21198 -68420 388931 43896 -58559 183575 232753 -12423 -50913
12281e0913D2095N1178J19514A9260O1759h9844B03982e058p176B72805b32166
$$ -50913 42095 93273 212787 19260 81019 -89844 203982 -5058 -12234 272805 -232166
12269C43612j30635p8347a97734E5309K33783a21140L6733j84431J23035I2127
$$ 343612 212977 134630 -197734 55309 289092 -121140 -84407 -268838 -145803 92127
12258G2678K43716a59327a9837D5742a5449B65369a31901d381C57231A22927C6755
$$ 72678 316394 -159327 -19837 45742 -15449 265369 -131901 -4381 357231 122927 36755
12246A17982K52258c9143L766B39516o86b4513C64382b5058F8980J6329f8438
$$ 117982 370240 -39143 -35377 239516 238830 -24513 364382 -25058 68980 85309 -68438
12234d2076A04214r18d5808C41104L26652C4573h2914E3701K00228E4455a02509
$$ -42076 104214 103296 -45808 341104 667756 34573 -82914 53701 253929 54455 -102509
12222C51021o1652j6019F7265J78926K17356j44126j38713F7495a15639A87653
$$ 351021 289369 273350 67265 246191 463547 319421 180708 67495 -115639 187653
12211A31180A9771a8174A75512H433a42144G1564c1636B67305A26484J80231q6774
$$ 131180 19771 -18174 175512 8433 -142144 71564 -31636 267305 126484 306715 219941
12200B19941N051F8075O5011b9027K136E08759j85853j39358M9282j1442J36594
$$ 219941 224992 68075 133086 -29027 -26891 508759 322906 183548 232830 221388 357982
12189C57982A25996R149E7008e256A81402N5563P9659A374a16093B51745d5828
$$ 357982 125996 135145 57008 -5256 181402 236965 316624 1374 -116093 251745 -45828
12177a43910B05439E285d8276k61169A13167b32761c1638E33232B23883N7399
$$ -143910 205439 5285 -48276 -309445 113167 -232761 -31638 533232 223883 281282
12167B81282o8932o3738K0497q0245l2299j6166a94860H6059b04876C61619j01482
$$ 281282 212350 148612 169109 88864 56565 40399 -194860 86059 -204876 361619 260137
12156B60137G9383K61800k6122A27653e6343C52467A20521Q7360a08654B32851
$$ 260137 79383 341183 315061 127653 -56343 352467 120521 207881 -108654 232851
12145g1363k82892J10913r6311A49744b48353j66613B5572g4310j42459G5162
$$ -71363 -354255 -243342 -339653 149744 -248353 -414966 25572 -74310 -216769 75162
12134d9492C79947a21767A64657a76092e6908j77962b4031I500a21364A66475
$$ -49492 379947 -121767 164657 -176092 -56908 -234870 -24031 9500 -121364 166475
12123d6890r7613L7628k51684A88732i5303k18485J51726k29576J86364C13924
$$ -46890 -144503 -106875 -358559 188732 -95303 -313788 -162062 -391638 -205274 313924
12112D8578f4554l6595k1659A15008E0725g1454C11320A18899a86315C0656J98161
$$ 48578 -64554 -101149 -122808 115008 50725 -71454 311320 118899 -186315 30656 228817
12101B28817a60062F3751j4080a8339C29550c77804B25969f6542j3989N151b5440
$$ 228817 -160062 63751 49671 -18339 329550 -377804 225969 -66542 -80531 -75380 -25440
12089B09656p7083b20350L3073E0778P9447b05408E3487J50804c4309n7353A14763
$$ 209656 132573 -220350 -187277 50778 130225 -205408 53487 204291 -34309 -91662 114763
12077a90526c5407A98065a4802E8073b37145A30250b56515C3207J97973J59893
$$ -190526 -35407 198065 -14802 58073 -237145 130250 -256515 33207 231180 391073
12067C91073h0165A16815b458A03821J07906O69226Q22478F69126j51938B8386
$$ 391073 -80165 116815 -2458 103821 211727 880953 1703431 669126 517188 28386
12056D0138a30579A73333a49437m4568e6825g453c435k15814c3029C32310n0024
$$ 40138 -130579 173333 -149437 -194005 -56825 -7453 -3435 -219249 -33029 332310 282286
12045B82286b21336B13780b8480F2050R8186m8996i9032A19626C9740g2648B3816
$$ 282286 -221336 213780 -28480 62050 160236 111240 -99032 119626 39740 -72648 23816
12033b41421g7397j27333j15309L7902A65830P44b47781J7603A10983L7121b6460
$$ -241421 -77397 -204730 -320039 -282137 165830 166574 -247781 -230178 110983 148104 -26460
12021E4034j2401K54917A10368c06193Q6847A05220a08667A60005d7249j7572
$$ 54034 41633 296550 110368 -306193 -219346 105220 -108667 160005 -47249 -64821
12011f4821C8831b41334b2731j72939d4150C1447J94100a17893C19458a87476
$$ -64821 38831 -241334 -22731 -195670 -44150 31447 225547 -117893 319458 -187476
12000A02751a13238l4074d7629a9994p3364j05290A78950p2869a43293F51237
$$ 102751 -113238 -147312 -47629 -19994 -93358 -198648 178950 106081 -143293 651237
11989A6233a38852B95741e7024j25416D8900A3310J69509b59883E6367a2661j18611
$$ 16233 -138852 295741 -57024 -182440 48900 13310 182819 -259883 56367 -12661 -131272
11978a31272A25135a06624I01b61607a07406j08957A24965e1969A77232J72767
$$ -131272 125135 -106624 901 -261607 -107406 -216363 124965 -51969 177232 349999
11968C49999j30975e1682C4901a54228B47294j04097j2705B1022a26454F723a19925
$$ 349999 219024 -51682 34901 -154228 247294 143197 130492 21022 -126454 6723 -119925
11956c05258A70205e0433A5504K0967P6708P3609i4421C8282a7571B0109b4166
$$ -305258 170205 -50433 15504 36471 113179 186788 -94421 38282 -17571 20109 -24166
11944G8573i470n4655k50M649B1772b14875A38690h7373A64786a92306A03723
$$ 78573 -9470 -64125 -64375 -59726 21772 -214875 138690 -87373 164786 -192306 103723
11932i1164a3965B52153Q5564A38776O5142J00745a33477j92193e9822K582A17208
$$ -91164 -13965 252153 337717 138776 203918 304663 -133477 -325670 -59822 -57240 117208
11920A13647D9613J36088q1455B7542c80058g1480E6373e0572b2840j4112D9744
$$ 113647 49613 185701 104246 27542 -380058 -71480 56373 -50572 -22840 -36952 49744
11908d8013j76223L9407Q2360l4756A97364K5426b46977C55503A32199f7745A05768
$$ -48013 -224236 -184829 -102469 -137225 197364 222790 -246977 355503 132199 -67745 105768
11896e15866A38579K35619L6010A55795a59042K0872k01030a64604M9332H1035
$$ -515866 138579 374198 410208 155795 -159042 -138170 -339200 -164604 -115272 81035
11885e7868j55530r7226O9208A69632F0702Q3499K0748o0762K7755a8772l11900
$$ -57868 -213398 -310624 -241416 169632 60702 144201 164949 104187 131942 -18772 -330672
11874c30672D401a72743F8333g8320j85175a16129a6649k44562R4386r5757b0998
$$ -330672 4401 -172743 68333 -78320 -263495 -116129 -16649 -261211 -166825 -262582 -20998
11862B20023c19021J53879B62537b25780c9028C0933a23979A28642j9824c6515
$$ 220023 -319021 -165142 262537 -225780 -39028 30933 -123979 128642 108818 -36515
11851B9439a15099N3805I9388a72292g1969B9158J6276J62392A7812M565P693
$$ 29439 -115099 -61294 99388 -172292 -71969 29158 45434 207826 17812 22377 30070
11840C0070O6570b46910J06810m131l6653j9783L5126H5905R4378C5763J38328
$$ 30070 96640 -246910 -140100 -144231 -180884 -200667 -165541 85905 180283 35763 174091
11829A74091N8483F993d6325j74533d2122j68202P4683a8647A24617b05181C46144
$$ 174091 232574 6993 -46325 -220858 -42122 -210324 -135641 -18647 124617 -205181 346144
11817i9939j03362j88023e7815A30075a05249E8246J58045a96334j02942A22965
$$ -99939 -203301 -391324 -57815 130075 -105249 58246 216291 -196334 -299276 122965
11806b16373k05281A5485b41106R9951m2507r4597B37639d67215G0604e4625k55843
$$ -216373 -421654 15485 -241106 -141155 -183662 -278259 237639 -467215 70604 -54625 -310468
11795c10468J16439I4271a22812l0095A02793b90134H5831B5455b3937j88348
$$ -310468 -194029 94271 -122812 -152907 102793 -290134 85831 25455 -23937 -212285
11785b12285B55431d7961n3144E4912J35883h4751H5656g9214I1789K36881C2321
$$ -212285 255431 -47961 -101105 54912 190795 -84751 85656 -79214 91789 328670 32321
11773A13514d0474D4436K5447J7033A7601a44317A94869r5965b50685B81336b81696
$$ 113514 -40474 44436 69883 86916 17601 -144317 194869 98904 -250685 281336 -281696
11761E2991K27799D5379e460j29813O4709F994d0433o8071L5249a6363B20064
$$ 52991 280790 45379 -5460 -135273 -70564 6994 -40433 -108504 -73255 -16363 220064
11749b9120o2945A93114o4846a17555J4679B05919a73601Q4168A03850r518b37661
$$ -29120 -92065 193114 128268 -117555 -102876 205919 -173601 -89433 103850 94332 -237661
11737e9133H239M90654b15690h9587l381A67751E0924a88872H9712J64541J6900
$$ -59133 8239 498893 -215690 -89587 -92968 167751 50924 -188872 89712 254253 271153
11726B71153a648A12389b59597g4959r7090d1437A85442i8685L7097C08324J41416
$$ 271153 -1648 112389 -259597 -74959 -172049 -41437 185442 -98685 -61588 308324 449740
11715D49740I7004J71497f7131A91786a33940A39071b92521A98155G8205B9954
$$ 449740 97004 268501 -67131 191786 -133940 139071 -292521 198155 78205 29954
11704c29853A06340a04536B25952b51270J10580k4865B35529i148B01140n9979
$$ -329853 106340 -104536 225952 -251270 -140690 -165555 235529 -9148 201140 141161
11694A41161l7481B4257a15688A46611e216B1923c82385a84624A30148a31431
$$ 141161 103680 24257 -115688 146611 -5216 21923 -382385 -184624 130148 -131431
11683a10262j11912I8471j4090J68188a61457B22672i2517n5568B46R497a12513
$$ -110262 -222174 98471 84381 252569 -161457 222672 -92517 -148085 246 9743 -112513
11671A38940B2498a8416A52093a72442d57B48677a1983A06810i8172K483m1462
$$ 138940 22498 -18416 152093 -172442 -457 248677 -11983 106810 -98172 -95689 -137151
11660a37151L0087B8202i3803K7988p0329j482I9007K6502e8169B40316a62735
$$ -137151 -107064 28202 -93803 -65815 -136144 -137626 99007 125509 -58169 240316 -162735
11648A81445J46061a58423G7034A8010P1786K15813e2529o2596A54942k2553G097
$$ 181445 327506 -158423 77034 18010 89796 305609 -52529 -115125 154942 132389 7097
11636B94435j43438b25965c6242k55358f5340N269o4746f0187p1284k2594B76828
$$ 294435 150997 -225965 -36242 -291600 -65340 -60071 -124817 -60187 -131471 -154065 276828
11624I7940a44909E1056J91268r9113b45191a10083B05801e3964E9892O4244d4336
$$ 97940 -144909 51056 242324 143211 -245191 -110083 205801 -53964 59892 124136 -44336
11612A00048b72111F3816Q9364a57674c9154A03357a18818A01968a26185I1986
$$ 100048 -272111 63816 153180 -157674 -39154 103357 -118818 101968 -126185 91986
11601b722l7362E2345g1341A94269C2578a48770A87047q7400I921b44340A46381
$$ -2722 -40084 52345 -71341 194269 32578 -148770 187047 99647 9921 -244340 146381
11589A68956b1912A91155B4684L15943L7391j69794n020K7436d2532A37730a1754
$$ 168956 -21912 191155 24684 340627 378018 208224 203204 230640 -42532 137730 -11754
11577B2221b43981a17032N0607a9506B86945j37569K02589K34282A64496i1537
$$ 22221 -243981 -117032 -66425 -19506 286945 149376 351965 586247 164496 -91537
11566E1602J04283j0682j5621L9259O5744H642M26639b1093o9757b8210B07940
$$ 51602 155885 145203 129582 168841 234585 8642 435281 -21093 -90850 -28210 207940
11554a51288H15J9191J91696H7804L6863E5369O1866f0896C42736n2539j22818
$$ -151288 815 20006 211702 87804 124667 55369 117235 -60896 342736 290197 167379
11543A67379i3906C22346j44728R1295A07544K8376m1231a08138K0770C21283
$$ 167379 -93906 322346 177618 268913 107544 135920 94689 -108138 -87368 321283
11532B20908A2966a46205B93081E950N7841G638K84069A40349D4026a20896d601
$$ 220908 12966 -146205 293081 5950 63791 7638 291707 140349 44026 -120896 -4601
11520A65301K52914C4481J72622a74792f397k16754A35096J79139I6271M8700
$$ 165301 418215 34481 207103 -174792 -6397 -223151 135096 314235 96271 144971
11510A44971R4849E6130J04502d3724B88231G5631b6134n1889B03092R5949g8203
$$ 144971 239820 56130 160632 -43724 288231 75631 -26134 -78023 203092 299041 -78203
11498A84895C3384a68993B83564D3553a62148A9973d5716H9860K0430J86081J8144
$$ 184895 33384 -168993 283564 43553 -162148 19973 -45716 89860 110290 296371 314515
11487C14515A16448a02541B64411j04190O4110g662q003B657J51596j3386n6309
$$ 314515 116448 -102541 264411 160221 224331 -7662 -15665 2657 154253 140867 84558
11476H4558b8936E0928K22279q4506r486B3311K43538A27886O264n4674L5848
$$ 84558 -28936 50928 273207 188701 179215 23311 266849 127886 134150 79476 115324
11465A15324P9390q8088J22427J28712H8890H361a3241D40185A32396j9998L1269
$$ 115324 194714 106626 229053 357765 88890 8361 -13241 440185 132396 112398 143667
11454A43667a88858B23920a1892A84555b14315c2475A54981l4949m3361K0463
$$ 143667 -188858 223920 -11892 184555 -214315 -32475 154981 120032 76671 97134
11444I7134A3871J54343J947N7632K2845b20738J02205l149A79481b59759a1600
$$ 97134 13871 168214 170161 227793 250638 -220738 -118533 -121682 179481 -259759 -11600
11432C0164f4094b2001B93137b6052q0899d7941G3590d7113B30803a0072j77234
$$ 30164 -64094 -22001 293137 -26052 -106951 -47941 73590 -47113 230803 -10072 -187306
11421a87306H9049f2639a0779C1906a18438l8692C2164L5481b45617i1242C3163
$$ -187306 89049 -62639 -10779 31906 -118438 -157130 32164 67645 -245617 -91242 33163
11409g8628B2641G265J42870A5763d7097o074B35048g2852B98032a39623D04136
$$ -78628 22641 7265 150135 15763 -47097 -53171 235048 -72852 298032 -139623 404136
11397d1549j79938p542E12148F1118J33136a54773O7153A77873N0667i7469A46937
$$ -41549 -221487 -229029 512148 61118 194254 -154773 -87620 177873 228540 -97469 146937
11385b49340A02453e6387A58379a32362A09624a67549c2403q4428j61258I9775
$$ -249340 102453 -56387 158379 -132362 109624 -167549 -32403 -116831 -278089 99775
11374D19661A27542c514A7525K18658a48750B15633c12235B09902a06039F3779
$$ 419661 127542 -3514 17525 236183 -148750 215633 -312235 209902 -106039 63779
11363h2905K6347A0184a47090K1849k30056J55010o1346B5116K07556A2503a64573
$$ -82905 -56558 10184 -147090 -125241 -355297 -200287 -261633 25116 232672 12503 -164573
11351a94935N4947B4670J55612a81221g5439j7949k35956B79203p6529b8602m4041
$$ -194935 -139988 24670 180282 -181221 -75439 -93388 -329344 279203 202674 -28602 -72643
11340g2643j877A01934L4555C3165Q513g0722b0032m4543B41497E1202a18287
$$ -72643 -74520 101934 136489 33165 41678 -70722 -20032 -64575 241497 51202 -118287
11328F5824e9313k29352i3475k21922Q2768G9421a83580A01644b4917Q833j8083
$$ 65824 -59313 -288665 -93475 -315397 -232629 79421 -183580 101644 -24917 -16084 -34167
11317c4167D9163J51364c27209A10582a2763A49041g1221C47271I4426J037E026
$$ -34167 49163 200527 -327209 110582 -12763 149041 -71221 347271 94426 95463 5026
11305a59379d5154f265A04406N763D3412h9015b4745n9227j53843J8827g4154
$$ -159379 -45154 -6265 104406 110169 43412 -89015 -24745 -83972 -237815 -218988 -74154
11293E7451d7227J9993n5803E2039f3689C63342A17737e7993H5312l6891b47965
$$ 57451 -47227 -27234 -83037 52039 -63689 363342 117737 -57993 85312 48421 -247965
11281c79804d7697p1847A35013b88238C6236c1079j48087b2877p1628j71616J10921
$$ -379804 -47697 -119544 135013 -288238 36236 -31079 -179166 -22877 -94505 -266121 -155200
11270a55200j10736J28009I5812C7552c74309B6916K22826m0627j00569a58084
$$ -155200 -265936 -137927 95812 37552 -374309 26916 249742 209115 108546 -158084
11259A89149H4057a17404B96944b32154G5616k6003J74612A7712K68349G8334
$$ 189149 84057 -117404 296944 -232154 75616 49613 224225 17712 286061 78334
11248a6496B1322a7580j07361j5029k33825R888a00149M5449D088J02473J10630
$$ -16496 21322 -17580 -124941 -139970 -373795 -363907 -100149 -54700 4088 106561 217191
11237B17191b08574R8532B47440o820b7130B4117O081M5449b31264L0829o8480
$$ 217191 -208574 -110042 247440 240620 -27130 24117 30198 75647 -231264 -200435 -268915
11226b68915a02555o5064A02551e8937A5182J37894h7632j04944L2318k8379F1468
$$ -268915 -102555 -167619 102551 -58937 15182 153076 -87632 -192576 -160258 -188637 61468
11214a05120j79059f3272j09448A0758P9639R0163E2758c6702B35919I5218K5503
$$ -105120 -284179 -63272 -172720 10758 90397 180560 52758 -36702 235919 95218 120721
11203A20721b61565e7376A08132c11610A1936N5933b27133c5981B12389a46105
$$ 120721 -261565 -57376 108132 -311610 11936 67869 -227133 -35981 212389 -146105
11192b19852B23167E7735c06449N2485B38980b07684g6474j8230c9847j79579
$$ -219852 223167 57735 -306449 -253964 238980 -207684 -76474 -94704 -39847 -219426
11182b19426M2289Q3336k69907a22681L2893H1972a87825C3515a06092A30203
$$ -219426 -177137 -93801 -363708 -122681 -89788 81972 -187825 33515 -106092 130203
11171B34423r3581c31001B53413M2626a8036I3344J4070J50735j19077a26855
$$ 234423 140842 -331001 253413 296039 -18036 93344 107414 258149 139072 -126855
11160A15090A5378b2543G2446b41k15952d6338m7978C6941b74678B44279a44518
$$ 115090 15378 -22543 72446 -241 -216193 -46338 -94316 36941 -274678 244279 -144518
11148D95006a79324K7563j43611B58595F1424i5147C9221a4431B10844G7040L3450
$$ 495006 -179324 -151761 -295372 258595 61424 -95147 39221 -14431 210844 77040 110490
11137A10490a94600m0411c770J30D62441a08527c4635A85222E8799K72576q0007
$$ 110490 -194600 -235011 -3770 -3640 462441 -108527 -34635 185222 58799 331375 251368
11126B51368J73067F0244l265a28486A3775a24304A06689J88957h1516k0066A03675
$$ 251368 424435 60244 56979 -128486 13775 -124304 106689 295646 -81516 -101582 103675
11114A42461b38996R6372k1180A93476a60151c9687I7585J78200a28809B26456
$$ 142461 -238996 -142624 -163804 193476 -160151 -39687 97585 275785 -128809 226456
11103H3111K88985a77481g4648k5353E76266B01483R0686I4456L82002A13621
$$ 83111 372096 -177481 -74648 -100001 576266 201483 292169 94456 476458 113621
11092B84479F9427M97029b27707A63919g9234A92626L5119b6393C29976J05963
$$ 284479 69427 566456 -227707 163919 -79234 192626 227745 -26393 329976 435939
11082D35939A24914R4265R1309N5191j27718I2477j7453L79536c1550C08388F3559
$$ 435939 124914 219179 310488 365679 237961 92477 75024 454560 -31550 308388 63559
11070C15732A32560K39203j81362J59416r1127L00633l8107k23402N4063J33288
$$ 315732 132560 371763 190401 349817 258690 559323 521216 297814 351877 485165
11060D85165J13585p7339J50453J7123n7153K6556j04797J82266l0992j26050
$$ 485165 598750 521411 671864 688987 631834 658390 553593 735859 704867 578817
11050E78817K36864L8336R1502J71949m18607P7172j29802J74330k8093j51236
$$ 578817 815681 854017 945519 1117468 698861 776033 646231 820561 792468 641232
11040F41232J11443k0941L10534k32426P0894j36898J25594l72928J49375J08840
$$ 641232 752675 731734 1042268 809842 880736 743838 869432 496504 645879 754719
11030G54719B06811L24217M41549k00255J36694P3675k39434K63718j02671k08813
$$ 754719 206811 531028 972577 772322 909016 982691 743257 1006975 904304 695491
11020F95491N3720M11k06545K15192j48818j17231J11412P606J1507k46283L62456
$$ 695491 749211 749622 543077 758269 609451 492220 603632 611238 622745 376462 738918
11009G38918n1614k73821K73416K32418o689m07889B00602N99790j29130j10043
$$ 738918 687304 413483 686899 919317 912628 504739 200602 800392 671262 561219
10999E61219O09018C56410q5681N23844k3853p3687J1124L5983l28865N37297
$$ 561219 1170237 356410 270729 794573 770720 697033 708157 744140 415275 952572
10989I52572j8712j78070r1832L34271J12648k80931K60879j92764N12819j27359
$$ 952572 933860 755790 663958 998229 1110877 829946 1090825 898061 1410880 1283521
10979A283521K76672J84318K97272j11805L79118K33506K46882K98694Q4988o7327
$$ 1283521 1560193 1744511 2041783 1929978 2309096 2542602 2789484 3088178 3173166 3105839
10969C105839j15255j64484k42689m38637l55459J32288K0412k68968J00418J56545
$$ 3105839 2990584 2826100 2583411 2144774 1789315 1921603 1942015 1673047 1773465 1930010
10959A930010o6598K39890k24753J79126j30461l41901k62545l97116M57049n55700
$$ 1930010 1863412 2103302 1878549 2057675 1927214 1585313 1322768 925652 1382701 827001
10949H27001j70669o8649q1994j49053K6870j13082J6235G3558J44376J48572
$$ 827001 656332 587683 505689 356636 383506 270424 286659 73558 217934 366506
10939C66506J29262A42241M6394B2989a64349B92499A40750F4294J62419n895
$$ 366506 495768 142241 188635 22989 -164349 292499 140750 64294 226713 220818
10929B20818j05676A2920b1460F4397b74967h6770C6440a01249I809J80946f4784
$$ 220818 115142 12920 -21460 64397 -274967 -86770 36440 -101249 9809 190755 -64784
10917B14640b29703A95457B4979K61649d17441A08195m5124a8893A48818j8476
$$ 214640 -229703 195457 24979 286628 -417441 108195 63071 -18893 148818 130342
10907A30342E16O5829J40714q5802a01405E954d1493j47461A01625R4578N3929
$$ 130342 516 66345 207059 121257 -101405 5954 -41493 -188954 101625 196203 250132
10896B50132c57634e8486j32103A43078F6456a92220C270M4259O8770a55743G4563
$$ 250132 -357634 -58486 -190589 143078 66456 -192220 3270 47529 116299 -155743 74563
10884a15348k2010k18425A33310c05106B80870A28463b07839J977f5006j02454
$$ -115348 -137358 -355783 133310 -305106 280870 128463 -207839 -205862 -65006 -167460
10874a67460A87660I897J94335c16852g8786b44l8497D9987h3762B9128M7830
$$ -167460 187660 9897 204232 -316852 -78786 -244 -38741 49987 -83762 29128 76958
10863G6958J28479a01207p410A0295J00984k6331a61415F1909a4471C4954J916
$$ 76958 205437 -101207 -108617 10295 111279 84948 -161415 61909 -14471 34954 36870
10852C6870E054b0663B0744c8908a870C4173a1855A20597b7419o5266I8517J3664
$$ 36870 5054 -20663 20744 -38908 -1870 34173 -11855 120597 -27419 -92685 98517 112181
10840A12181d1801r8417B39630i4203A06830O4191b08820l962E6548d6596A06243
$$ 112181 -41801 -140218 239630 -94203 106830 171021 -208820 -212782 56548 -46596 106243
10828c0981r4729d1946J9214n0140J1375m8675j548M8737n1185B8733b03481D147
$$ -30981 -125710 -41946 -22732 -72872 -61497 -110172 -111720 -62983 -114168 28733 -203481 4147
10815B39210A2287b44422Q9885J7131k21998J13449K5648f0428k78398a37365
$$ 239210 12287 -244422 -154537 -137406 -359404 -245955 -220307 -60428 -338826 -137365
10804a85786j53085a67134I5804b45082B94305b69339P5095A28921J17466G4902
$$ -185786 -338871 -167134 95804 -245082 294305 -269339 -194244 128921 246387 74902
10793a9187k1390n2426o9709A27094a04082j03019B86023b97271F192N3082J19560
$$ -19187 -40577 -93003 -162712 127094 -104082 -207101 286023 -297271 6192 59274 178834
10782A78834b46142C4845a19995b6169C166Q6189l3722K2453h6285j18746E5778
$$ 178834 -246142 34845 -119995 -26169 3166 89355 55633 78086 -86285 -205031 55778
10770C55392B8857g7633C44104c78941a19736j41917O9512B65554f3904a7699
$$ 355392 28857 -77633 344104 -378941 -119736 -261653 -192141 265554 -63904 -17699
10759A17902a62663J4853k50922A22453L7797A260L8906i8334A00134b62526e9314
$$ 117902 -162663 -147810 -398732 122453 160250 1260 40166 -98334 100134 -262526 -59314
10747I6972l7333k4406b50311c5927k59951B64753a49033E3998d40661i0659B23152
$$ 96972 59639 35233 -250311 -35927 -295878 264753 -149033 53998 -440661 -90659 223152
10735a17514M1551L5557j11845B6190J28212E1053d42210a16448r6132B81241
$$ -117514 -75963 -40406 -152251 26190 154402 51053 -442210 -116448 -212580 281241
10724a62772r3548h6948C60868A27328C4550a27123d9770b4322B29913K1758j03571
$$ -162772 -256320 -86948 360868 127328 34550 -127123 -49770 -24322 229913 251671 148100
10713A48100b4529j128F4382d5508n1785k0952K1440D14163C8138c5362A01854
$$ 148100 -24529 -25657 64382 -45508 -97293 -118245 -96805 414163 38138 -35362 101854
10701e2324G0837e8529j09368r6083i8761l33554J98285g459j68297J4172d1540
$$ -52324 70837 -58529 -167897 -263980 -98761 -432315 -234030 -7459 -175756 -161584 -41540
10689C6924b83681K0092B3791a51317N2319A72881b01557B11517b7555j5221D0269
$$ 36924 -283681 -263589 23791 -151317 -98998 172881 -201557 211517 -27555 -42776 40269
10677a97530j45669k25117D603P8655h0670g679k84277a01915l4137B03777b8394
$$ -197530 -343199 -568316 4603 83258 -80670 -7679 -291956 -101915 -136052 203777 -28394
10665h4551j0463C0596f7264c614j68849h4307q5901G0551A3222K85265C0356
$$ -84551 -95014 30596 -67264 -3614 -172463 -84307 -170208 70551 13222 298487 30356
10653c4848q6350L913c1254B73647A11793J04780L5573e1809j45517e5562m0462
$$ -34848 -121198 -117285 -31254 273647 111793 216573 252146 -51809 -197326 -55562 -96024
10642i6024B879c65737f328A07283m0472a81998h1203B24665a68045b5918R219
$$ -96024 2879 -365737 -6328 107283 66811 -181998 -81203 224665 -168045 -25918 -16699
10631a6699l66887A42306k2849f9431l1517G3654a04379r0064k4890L7627E279
$$ -16699 -383586 142306 119457 -69431 -100948 73654 -104379 -194443 -219333 -181706 5279
10619a06849a5929k33505H1200M451b19338a8090A45162a46466A67339a29783
$$ -106849 -15929 -249434 81200 85651 -219338 -18090 145162 -146466 167339 -129783
10608b08903a6205B34655a65696b3818C3198K73387f8430A03408a49667F974d28101
$$ -208903 -16205 234655 -165696 -23818 33198 306585 -68430 103408 -149667 6974 -428101
10596a78383b4759j0185J71A6032c48799J43671R8297c1595j22381c5373A06627
$$ -178383 -24759 -34944 -34773 16032 -348799 -205128 -106831 -31595 -153976 -35373 106627
10584I2209i7442a3104q1909D9153A5500a66355c4088G1998a45021N8893n8719
$$ 92209 -97442 -13104 -95013 49153 15500 -166355 -34088 71998 -145021 -86128 -144847
10573a44847k616f4698B80300A14512b6404A4094a19074d4988G3238A2307b06477
$$ -144847 -147463 -64698 280300 114512 -26404 14094 -119074 -44988 73238 12307 -206477
10561a12588k4414A77130c21008A68487G2305m039J36211A0143J5740N3343J31299
$$ -112588 -137002 177130 -321008 168487 72305 68266 204477 10143 25883 79226 210525
10550B10525a38358k82178i2931C43175a61000C54379j29816B2820a06924M9767
$$ 210525 -138358 -420536 -92931 343175 -161000 354379 224563 22820 -106924 -57157
10540e7157B95662d9418H0281b33806A38377B7221a5584q6645j71754h614j01
$$ -57157 295662 -49418 80281 -233806 138377 27221 -15584 -102229 -273983 -8614 -8715
10529h715k11132a6837A46769a05375F4013J1254b30321A59261b2983k31238B7892
$$ -8715 -219847 -16837 146769 -105375 64013 75267 -230321 159261 -22983 -254221 27892
10517A19335e3354H8207P7449a32516A0702b25194M948M6273g8253j459c5408
$$ 119335 -53354 88207 165656 -132516 10702 -225194 -220246 -173973 -78253 -79712 -35408
10505d0458B18008j05680a83494A53491e3470k27349A0572M1869M3408m1366e14818
$$ -40458 218008 112328 -183494 153491 -53470 -280819 10572 52441 95849 54483 -514818
10493a10498n1835l0396R1620D1841f2844H996M4632A09K11054l4034J59008j54433
$$ -110498 -162333 -192729 -101109 41841 -62844 8996 53628 109 211163 177129 336137 181704
10481A81704L43351P4902r6320p4288A53397g3072b4642B71044n1670c41295A0279
$$ 181704 525055 599957 503637 429349 153397 -73072 -24642 271044 219374 -341295 10279
10469B17917h9888k95327D5661a66169A42016A8506J50867a69622B39694a09173
$$ 217917 -89888 -385215 45661 -166169 142016 18506 169373 -169622 239694 -109173
10458f7162A59900Q5226N57p7887b8061A72594b95099M8489h7223A7974c08190
$$ -67162 159900 245126 245683 167796 -28061 172594 -295099 -246610 -87223 17974 -308190
10446f657j286G8584Q8656a15064j14581d3637k30401A73105F9823J75731j22026
$$ -6657 -7943 78584 167240 -115064 -229645 -43637 -274038 173105 69823 245554 123528
10435A23528B495a8661k17893Q4044B2275d20j32004A53926a50179n1044G5485
$$ 123528 2495 -18661 -236554 -152510 22275 -420 -132424 153926 -150179 -201223 75485
10423b11056B99665H4051k5970A8492a3461E2557R3014J23336c46548A56108a5390
$$ -211056 299665 84051 58081 18492 -13461 52557 145571 268907 -346548 156108 -15390
10411h0603A6143p775a39169A74947J5196H289d8370C55340A60742a13625l156
$$ -80603 16143 8368 -139169 174947 190143 8289 -48370 355340 160742 -113625 -116781
10400a16781a9020r8373d2292A87687b18207c0631B29873C3098J5132J27695e2226
$$ -116781 -19020 -117393 -42292 187687 -218207 -30631 229873 33098 48230 175925 -52226
10388a31928C31497B6024c4737j67412E6722M7514i3102B99128a02174A58156
$$ -131928 331497 26024 -34737 -202149 56722 104236 -93102 299128 -102174 158156
10377D82352m9928A05447K0355h833B73285j15259K95615k11414m5921K66670
$$ 482352 432424 105447 125802 -8833 273285 158026 453641 242227 196306 462976
10367D62976j24516k8482m8872L40798k65382j8528J60204B26703o4453B8956
$$ 462976 338460 309978 261106 601904 336522 317994 478198 226703 162250 28956
10356F0200J14394D0280K00936q5686L69480A72375M82822j59802K8539j30843
$$ 60200 174594 40280 241216 155530 525010 172375 655197 495395 523934 393091
10346C93091o5104o8864J02817L88651k34593j95088j28829M01169E1536j7721
$$ 393091 327987 259123 361940 750591 515998 320910 192081 593250 51536 33815
10336C3815m513A4018F880L02127e900A99209a53223A61166n6836a53145C69976
$$ 33815 29302 14018 6880 309007 -5900 199209 -153223 161166 104330 -153145 369976
10324C31313l4478r4726J76621A79591H7603i868E21202k25142F7109K07182C4805
$$ 331313 296835 202109 378730 179591 87603 -9868 521202 296060 67109 274291 34805
10312B1482P5680K2606a24667K5118A12001a60796C2727J76691b9555d956A05750
$$ 21482 97162 119768 -124667 -99549 112001 -160796 32727 209418 -29555 -4956 105750
10300b01689D9759c1576A66999D0938N3118M9619m8423e8068j23670l81844E5089
$$ -201689 49759 -31576 166999 40938 94056 143675 95252 -58068 -181738 -563582 55089
10288i6924A9305J15000d5228p2262g102l42227A93972a16825l035l71342B64636
$$ -96924 19305 134305 -45228 -117490 -7102 -349329 193972 -116825 -119860 -491202 264636
10276C20532B5132O5842a01748L246B56024l4162a48507o4763G9875K57744b16621
$$ 320532 25132 90974 -101748 -98502 256024 221862 -148507 -213270 79875 337619 -216621
10264I8963K48890a03160C23300o846P1754j31501p2994l9267e7191C99543a9191
$$ 98963 347853 -103160 323300 316454 388208 256707 183713 144446 -57191 399543 -19191
10252A95236C6736J58139g1044a0484j43612D26041a00536r7179B99405d2951
$$ 195236 36736 194875 -71044 -10484 -154096 426041 -100536 -197715 299405 -42951
10241G1496a46386r35O2571j12138I9554P8195F7135R6034a72239L6405l5380
$$ 71496 -146386 -147321 -84750 -196888 99554 177749 67135 163169 -172239 -135834 -171214
10230a71214R401j82774a6649j61784C0581c81643B19411b38275h1407j87j02778
$$ -171214 -161813 -344587 -16649 -178433 30581 -381643 219411 -238275 -81407 -81594 -184372
10219a84372k7306h498n7358I6455k1991c67834J25715R4354j15653j83178e146
$$ -184372 -211678 -8498 -65856 96455 74464 -367834 -242119 -147765 -263418 -446596 -5146
10207E5867c86305a87660D03081D5618c88515J18247d4879k51718A29118l895
$$ 55867 -386305 -187660 403081 45618 -388515 -270268 -44879 -296597 129118 125223
10197A25223a95133A26262N5017c06391L8635i6585c7649A28807a75395Q5673
$$ 125223 -195133 126262 181279 -306391 -267756 -96585 -37649 128807 -175395 -89722
10187h9722A21301f2534A3426L03320q4874C6075O9957a34895L8443H5766B6609
$$ -89722 121301 -62534 13426 316746 231872 36075 106032 -134895 -96452 85766 26609
10175h5241C72017A80997d286k04201C7791J31128h2815j47300i0559b3141l07147
$$ -85241 372017 180997 -4286 -208487 37791 168919 -82815 -230115 -90559 -23141 -330288
10164c30288D5874c70053G3328a49556n4580F1397a27830H661b71218N8208d7108
$$ -330288 45874 -370053 73328 -149556 -204136 61397 -127830 8661 -271218 -213010 -47108
10152i9891B24744n8155c08235H6021e9103A29996f9838j01250N3323H1211b75471
$$ -99891 224744 166589 -308235 86021 -59103 129996 -69838 -171088 -117765 81211 -275471
10140A7473b01908O4803I1952b39994r586i6099G5018f1553k76172C5530e1799
$$ 17473 -201908 -137105 91952 -239994 -249580 -96099 75018 -61553 -337725 35530 -51799
10128C9785a55338B9371a83485d6820N562n767m608j84648k5283B8443a78794
$$ 39785 -155338 29371 -183485 -46820 -41258 -47025 -51633 -236281 -261564 28443 -178794
10116b72409J27691A82991b42968j59910A38785b12741R4449D8273i1875c2808
$$ -272409 -144718 182991 -242968 -402878 138785 -212741 -118292 48273 -91875 -32808
10105B32372J8126p6742a90270B65628c29346B1057a93288i5533A63984m5902
$$ 232372 250498 173756 -190270 265628 -329346 21057 -193288 -95533 163984 118082
10095A18082a70941d8413m34813a53845C38695a02107B73622b82269C7807c64772
$$ 118082 -170941 -48413 -483226 -153845 338695 -102107 273622 -282269 37807 -364772
10084c60802a14304j01737G2205J647P1772a0465l2688j21712H6619A279b46678
$$ -360802 -114304 -216041 72205 73852 145624 -10465 -43153 -164865 86619 1279 -246678
10072H4651j6518a89536e6303k0036k47329e0280k44122d9783A88866h8633C169
$$ 84651 68133 -189536 -56303 -76339 -323668 -50280 -294402 -49783 188866 -88633 3169
10060C65267i7435B88200A2938g7450m3573C05094A2743a20576k2241p6977e1696
$$ 365267 -97435 288200 12938 -77450 -121023 305094 12743 -120576 -142817 -219794 -51696
10048a02802A06327J64281F7269b18870b2276r2290a1181C2227a46417c4671l70716
$$ -102802 106327 270608 67269 -218870 -22276 -114566 -11181 32227 -146417 -34671 -405387
10037d05387a80801B7200J77242F8380b65950A75547M5202c6624o4882j61796
$$ -405387 -180801 27200 204442 68380 -265950 175547 220749 -36624 -101506 -263302
10027b63302H4805i5992A11107a6598A74099b15191H658c37956B83156r0469e7188
$$ -263302 84805 -95992 111107 -16598 174099 -215191 8658 -337956 283156 192687 -57188
10015b08433j1634O0266j57453A09860O7704c47709J49806n326Q0059l33609f8770
$$ -208433 -220067 -159801 -317254 109860 177564 -347709 -197903 -203229 -123170 -456779 -68770
10003a6161m9447G1320f4275A94494m4551a1240k66794d624l7692j16195j16730
$$ -16161 -65608 71320 -64275 194494 149943 -11240 -278034 -4624 -42316 -158511 -275241
9992b75241N4059C01492J30965b12880a2097B34201a6292A10950D1547K89741
$$ -275241 -221182 301492 432457 -212880 -12097 234201 -16292 110950 41547 331288
9982C31288E3546a67647f3125j85568d493j03871j84369a34500A33473R4112J15130
$$ 331288 53546 -167647 -63125 -248693 -4493 -108364 -292733 -134500 133473 227585 342715
9971C42715F8259a42890e4621C2101J72620a91417r7422J22191e3344j65216C03010
$$ 342715 68259 -142890 -54621 32101 204721 -191417 -288839 -166648 -53344 -218560 303010
9959A37897c14043P5158k615A46151e0582j75423K1227l2760J12299q6403B18272
$$ 137897 -314043 -238885 -241500 146151 -50582 -226005 -204778 -237538 -125239 -211642 218272
9947a51179F7290c06589A49701A8728O4788a66397n5765f9149j48124f3563I6977
$$ -151179 67290 -306589 149701 18728 83516 -166397 -222162 -69149 -217273 -63563 96977
9935a67711B7538b86605B00067a91135M479k5715B34261d1718j96981C04390B8357
$$ -167711 27538 -286605 200067 -191135 -186656 -212371 234261 -41718 -238699 304390 28357
9923A61950h1872l78478B2024L31958g3589c010B76437e95942a58910j86604D92118
$$ 161950 -81872 -460350 22024 353982 -73589 -3010 276437 -595942 -158910 -345514 492118
9911G4040e74667c4382j03798a2682l11055c1665m5308K6243A51018C459b9295
$$ 74040 -574667 -34382 -138180 -12682 -323737 -31665 -76973 -50730 151018 3459 -29295
9899C8810a14867A11362d7489I4624h0806j38574g1677A18217j6384q318j5969
$$ 38810 -114867 111362 -47489 94624 -80806 -219380 -71677 118217 101833 93515 77546
9888G7546B7192c3186j66744g0589o8192O5866H3273d05756E3066B3660a15990
$$ 77546 27192 -33186 -199930 -70589 -138781 -72915 83273 -405756 53066 23660 -115990
9876e1413j15745r2685g5461A1905J18427J50841A06402K9485F6648a21205k10426
$$ -51413 -167158 -259843 -75461 11905 130332 281173 106402 135887 66648 -121205 -331631
9865c31631i5824n3597d4235A36712a45349b5407p4893A2943b6347i450o4328
$$ -331631 -95824 -149421 -44235 136712 -145349 -25407 -100300 12943 -26347 -9450 -73778
9854g3778m08516h8500r3854E6883M9625A4339e4891j16035L8222A99300h2228
$$ -73778 -482294 -88500 -182354 56883 106508 14339 -54891 -170926 -132704 199300 -82228
9842A26934n8763a55419J7621n4779A88524a43110l67249b16579P3063B18106
$$ 126934 68171 -155419 -137798 -192577 188524 -143110 -510359 -216579 -143516 218106
9831c91021B81918a95521K4508b3078l14730A66855B6403R3444E7767i6098a4140
$$ -391021 281918 -195521 -171013 -23078 -337808 166855 26403 119847 57767 -96098 -14140
9819h4160j06389A10598a11730k59789p0965A01119f3031r0362F8355Q2075c1256
$$ -84160 -190549 110598 -111730 -371519 -442484 101119 -63031 -153393 68355 150430 -31256
9807F6810a12891D902N3782i8592A20016a1511k36317e7862n3017A45095a09884
$$ 66810 -112891 4902 58684 -98592 120016 -11511 -247828 -57862 -110879 145095 -109884
9795A71387b35435E5298a04514O414l11846J68150K1521i2509J2327l21233i500
$$ 171387 -235435 55298 -104514 -98100 -409946 -241796 -220275 -92509 -80182 -401415 -9500
9783C1907g3712J1019a9353m45120a54434A54737L9149b38358a04810n1436M3058
$$ 31907 -73712 -62693 -19353 -464473 -154434 154737 193886 -238358 -104810 -156246 -113188
9772a13188A09507b92089J35380a9k64225j4448a35989p7911f4443B31472j11885
$$ -113188 109507 -292089 -156709 -19 -264244 -278692 -135989 -213900 -64443 231472 119587
9761A19587b98030h1906A11198P2048D2122a7478B20451C6603L6904e7028o4523
$$ 119587 -298030 -81906 111198 183246 42122 -17478 220451 36603 73507 -57028 -121551
9750a21551n91182e2680A04298c52599A68964E4567b78369I8826m3626K9847J1709
$$ -121551 -712733 -52680 104298 -352599 168964 54567 -278369 98826 55200 85047 96756
9739I6756K7767B7058c04031B45078b23840H7438R9513a07293n9026L7916A09884
$$ 96756 124523 27058 -304031 245078 -223840 87438 186951 -107293 -166319 -128403 109884
9727a03527J3130K430A4344b92722n4585c4129A38731b98348a03275M3102b3986
$$ -103527 -90397 -87967 14344 -292722 -347307 -34129 138731 -298348 -103275 -60173 -23986
9715I0908A4467c858k42699B63601e5170G040N4563K4183Q8065b08335k15425
$$ 90908 14467 -3858 -246557 263601 -55170 7040 61603 85786 173851 -208335 -423760
9704d23760B83088a6417k2531J6147l980L833j49183K7853j56760J02862A60554
$$ -423760 283088 -16417 -38948 -22801 -26781 -22948 -172131 -144278 -301038 -198176 160554
9692b81215M7940J07433j99359B96736e6536k5970A29404h2847k08693A73391
$$ -281215 -233275 -125842 -325201 296736 -56536 -82506 129404 -82847 -291540 173391
9681b66297J29504m1801A09238a21875H4644a32109c9797j58657B53113a91254
$$ -266297 -136793 -178594 109238 -121875 84644 -132109 -39797 -198454 253113 -191254
9670c6131j26894A61523A6343a09381j20536e7481Q242a3684l45759E2646A5996
$$ -36131 -163025 161523 16343 -109381 -229917 -57481 -49239 -13684 -359443 52646 15996
9658a57113p1554A93046a14879d4599E1046b6854A44182A6255b59970Q9501c4286
$$ -157113 -228667 193046 -114879 -44599 51046 -26854 144182 16255 -259970 -170469 -34286
9646b53228j0245a12143q4814A98021a31666q0848A50078j4764n484a86043R0040
$$ -253228 -263473 -112143 -196957 198021 -131666 -212514 150078 135314 129830 -186043 -96003
9635i6003k45993a62758b6660j15111A65332J58095H8989a18559j20388J3325
$$ -96003 -341996 -162758 -26660 -141771 165332 323427 88989 -118559 -238947 -225622
9625b25622e987l14609B6908b05229b8066M116j04119A64631b16752j1832j29342
$$ -225622 -5987 -320596 26908 -205229 -28066 -23950 -128069 164631 -216752 -228584 -357926
9614c57926J47388B87412f0411j57159d7928k6996a835A69434F9862l4373K36256
$$ -357926 -210538 287412 -60411 -217570 -47928 -74924 -1835 169434 69862 35489 271745
9603B71745p0661I4716C0578a14963K8499A16229b33620B1650h3109b0164j32491
$$ 271745 201084 94716 30578 -114963 -86464 116229 -233620 21650 -83109 -20164 -152655
9592a52655E15652b66752B13816L6860a20553n2958C21963a17567j83852d2102
$$ -152655 515652 -266752 213816 250676 -120553 -173511 321963 -117567 -301419 -42102
9581A31837B2939a9283A72016B7314b60636I2176e09757A56544J7540a71265C5716
$$ 131837 22939 -19283 172016 27314 -260636 92176 -509757 156544 174084 -171265 35716
9569H0025h2751D31162h7760A40543C4408b69185B5342a27439p0042Q7453j67602
$$ 80025 -82751 431162 -87760 140543 34408 -269185 25342 -127439 -197481 -110028 -277630
9558b77630A87225H6476L8194J90943b78381A8046a48036K4238A98230A5902c16480
$$ -277630 187225 86476 124670 315613 -278381 18046 -148036 -123798 198230 15902 -316480
9546a45655L837C38024a72738A58276f4102L1796k00394B25252a85119k6965b6978
$$ -145655 -141818 338024 -172738 158276 -64102 -32306 -232700 225252 -185119 -212084 -26978
9534E1311d42945H0726h3673j12865H6229d5824D4705d34746a626C5693a56183
$$ 51311 -442945 80726 -83673 -196538 86229 -45824 44705 -434746 -1626 35693 -156183
9522c92138e4570B55713c080k34314P7720L1157A51985g782C917M0991c63304
$$ -392138 -54570 255713 -3080 -237394 -159674 -128517 151985 -7782 3917 44908 -363304
9510a40791A22534i0992D3982d0099l8930D762b67714A57942b6885j90980j72965
$$ -140791 122534 -90992 43982 -40099 -79029 4762 -267714 157942 -26885 -217865 -390830
9499c90830E3117a12554B3009f3544q3910J2177c8732m28575a18919k96923A25404
$$ -390830 53117 -112554 23009 -63544 -147454 -135277 -38732 -467307 -118919 -415842 125404
9487A86376g1003J2762A14106b9203n7710r1826F5276J6924a69407A76413I271
$$ 186376 -71003 -58241 114106 -29203 -86913 -178739 65276 82200 -169407 176413 9271
9475F9184L24895D8234P0095g7537m27896A55070a23576k57156b3316l38624A45883
$$ 69184 394079 48234 118329 -77537 -505433 155070 -123576 -380732 -23316 -361940 145883
9463a89809A18649B2847d32194J69265e9290j65773F8938c7758j3976r8744O8137
$$ -189809 118649 22847 -432194 -262929 -59290 -225063 68938 -37758 -51734 -150478 -82341
9452h2341c7419l8411n3269k1096c04B14407C6472r074g8286A09554a6309m36316
$$ -82341 -37419 -75830 -129099 -150195 -304 214407 36472 27398 -78286 109554 -16309 -452625
9440d52625J41501D378d1926k73234a06055r4281a4560j07670m6164D0041a59035
$$ -452625 -311124 4378 -41926 -315160 -106055 -200336 -14560 -122230 -168394 40041 -159035
9428E3806b39009c4313j84196E2231a13522j68303O3077L8201M3900L4672B45004
$$ 53806 -239009 -34313 -218509 52231 -113522 -281825 -218748 -180547 -136647 -101975 245004
9416a88434J4400k925A35189J88188a10566C9840a98278g901j23975N0538A3992
$$ -188434 -174034 -176959 135189 323377 -110566 39840 -198278 -7901 -131876 -81338 13992
9404A88699E1508e6649b1913A61429d0869j00066L1296N319n2911j89677C45615
$$ 188699 51508 -56649 -21913 161429 -40869 -140935 -109639 -104320 -157231 -346908 345615
9392A5980h2952j01920d6812D9512N0627R7489a49920I1284b17841P9779b7076
$$ 15980 -82952 -184872 -46812 49512 100139 197628 -149920 91284 -217841 -138062 -27076
9380B61411A05737b48865c4004P184I9023B8907E187a45255j05708A16644m7322
$$ 261411 105737 -248865 -34004 -26820 99023 28907 5187 -145255 -250963 116644 69322
9369F9322g6061j23519L1468n0144O9741A25849E4531a10019d4550J5557a1673
$$ 69322 -76061 -199580 -168112 -218256 -148515 125849 54531 -110019 -44550 -28993 -11673
9357A58779p7960d9206E1828b1733A33974d11186f7168A03747a7372j8901g097
$$ 158779 80819 -49206 51828 -21733 133974 -411186 -67168 103747 -17372 -36273 -7097
9345E5520Q1136a05731D9627a1229n7237k02879G5016c5010m8902j67031H6064
$$ 55520 136656 -105731 49627 -11229 -68466 -271345 75016 -35010 -83912 -250943 86064
9333A13972d00841B8573a06935A74539A8936a0940I0325b12871A9106a11785M9476
$$ 113972 -400841 28573 -106935 174539 18936 -10940 90325 -212871 19106 -111785 -62309
9322f2309j44421A22262g8475j19111k9463d1076l440j3492n8814r9335b005A1368
$$ -62309 -206730 122262 -78475 -197586 -227049 -41076 -44516 -58008 -116822 -216157 -2005 11368
9309A07639a83726r6638q1787C19120g556F7464a49840A46344l5690b03419A0993
$$ 107639 -183726 -280364 -362151 319120 -7556 67464 -149840 146344 110654 -203419 10993
9297E2406R0613A1366M4411L9883a28538b465j3274B48932b24476Q123O7190A1762
$$ 52406 143019 11366 55777 95660 -128538 -2465 -15739 248932 -224476 -216353 -149163 11762
9284b8778n4973l4286j03785o4585a07951A6915b31827B46676E6009b69153B12808
$$ -28778 -83751 -118037 -221822 -286407 -107951 16915 -231827 246676 56009 -269153 212808
9272a39326B03362c70436a74248B3098J42416d2064j39424J9401b3939o0500A83689
$$ -139326 203362 -370436 -174248 23098 165514 -42064 -181488 -162087 -23939 -84439 183689
9260C3829i4374k41487j9985I1108m4184b72230a10667A92476b07662H6036M7156
$$ 33829 -94374 -335861 -355846 91108 46924 -272230 -110667 192476 -207662 86036 133192
9249A33192a55836f8499k69129a29342a0280j77639F5051b5530H2998B4322a24628
$$ 133192 -155836 -68499 -337628 -129342 -10280 -187919 65051 -25530 82998 24322 -124628
9237D128f4786A50453a24551K3014M2676k41889A29157L3786n0174a17057Q558
$$ 4128 -64786 150453 -124551 -101537 -58861 -300750 129157 162943 112769 -117057 -108499
9226a08499F1023K48010A37658a18223j93116f90A48412f1311j31224g0721j79903
$$ -108499 61023 309033 137658 -118223 -311339 -690 148412 -61311 -192535 -70721 -250624
9215b50624l7886e3610A11276b94985M0768c0536n0487B98596a62394a3934o1468
$$ -250624 -288510 -53610 111276 -294985 -254217 -30536 -81023 298596 -162394 -13934 -75402
9204g5402L6308k55869G6068a16990G4112a66228B0740j0109J18259a30750c2147
$$ -75402 -39094 -294963 76068 -116990 74112 -166228 20740 10631 128890 -130750 -32147
9192d9116p6726b3682A1326d32301A78404d87573K8175d9822A32979c13833J33483
$$ -49116 -125842 -23682 11326 -432301 178404 -487573 -459398 -49822 132979 -313833 -180350
9181a80350k2862O7289D683J656J6988O2332b35921A38504a0644j46205J4469
$$ -180350 -203212 -135923 4683 6339 23327 85659 -235921 138504 -10644 -156849 -142380
9170a42380f0079A2179d57861A44642a2713k56032Q7357k4752J6138M6892e2387
$$ -142380 -60079 12179 -457861 144642 -12713 -268745 -181388 -206140 -190002 -143110 -52387
9158b53701A84396o9415a43681A42133C0252M7007i0454D2932c9123C2443G999
$$ -253701 184396 114981 -143681 142133 30252 77259 -90454 42932 -39123 32443 7999
9146E7367c39A19424O415b52831c9926B24116I5305f0808l7811m1341D8312c56136
$$ 57367 -339 119424 125839 -252831 -39926 224116 95305 -60808 -98619 -139960 48312 -356136
9133a05682C02333k7528j09061A1295K77979d5006l2437j28114h3443a1016H8591
$$ -105682 302333 274805 165744 11295 289274 -45006 -77443 -205557 -83443 -11016 88591
9121g2066g194K854m19128f6079k13712a07504a6484A12541b6283k10782O9121
$$ -72066 -7194 -4340 -423468 -66079 -279791 -107504 -16484 112541 -26283 -237065 -167944
9110a67944K6176J3151I8804b74224B43847b03940f8636H5076a15238I8906N1307
$$ -167944 -141768 -128617 98804 -274224 243847 -203940 -68636 85076 -115238 98906 150213
9099A50213e6777l31025h5607j60028a10093j14355d2387k49669a35955E3227
$$ 150213 -56777 -387802 -85607 -245635 -110093 -224448 -42387 -292056 -135955 53227
9088c7387o8850N2630k2689m6518N3024j79144A87798g7387I5g7721j7660A64261
$$ -37387 -106237 -53607 -76296 -122814 -69790 -248934 187798 -77387 95 -77721 -95381 164261
9075B61165I7274g4316j65888a2110A26974b42913N8903F5209C2582L9049d9495
$$ 261165 97274 -74316 -240204 -12110 126974 -242913 -184010 65209 32582 71631 -49495
9063e4107j32306L5617A24963c5833j87378A34005k2160J74522c1483A89122b32332
$$ -54107 -186413 -150796 124963 -35833 -223211 134005 111845 286367 -31483 189122 -232332
9051c0240j23927A6961a170F7572J5380c14528g3996k14850A25591o2615M3906
$$ -30240 -154167 16961 -1170 67572 82952 -314528 -73996 -288846 125591 62976 106882
9040A06882j4326c33498D610f6361k69922E1075c02658h6529j13722A22962D8977
$$ 106882 92556 -333498 4610 -66361 -336283 51075 -302658 -86529 -200251 122962 48977
9028b76163i4221B34676a71918B60630A06780H960g8022j45911R5508H6054P3417
$$ -276163 -94221 234676 -171918 260630 106780 8960 -78022 -223933 -128425 86054 159471
9017A59471b43066E12095f3696F7203L47646b59520A1913b43409j628A16039A9361
$$ 159471 -243066 512095 -63696 67203 414849 -259520 11913 -243409 -245037 116039 19361
9005A10460i9372B1883i0146c5897C25445a11712A48627b07449F2728g2285I9364
$$ 110460 -99372 21883 -90146 -35897 325445 -111712 148627 -207449 62728 -72285 99364
8993a17894A46932L0308D817Q9176c14309a55993G4919d4992m8429A65067K854
$$ -117894 146932 177240 4817 93993 -314309 -155993 74919 -44992 -93421 165067 167921
8982A67921C0127O6590b6104h483j99644A7077J10880a93184F4017b20854a06363
$$ 167921 30127 96717 -26104 -8483 -208127 17077 127957 -193184 64017 -220854 -106363
8970A15575j7073g2123m49698G228e233j21483J6243F8037f7967o5045B5109b51034
$$ 115575 98502 -72123 -521821 7228 -5233 -126716 -110473 68037 -67967 -133012 25109 -251034
8957a68901B58008a88441A2459f539B66329C5935f1119H3362a64824A39624e8381
$$ -168901 258008 -188441 12459 -6539 266329 35935 -61119 83362 -164824 139624 -58381
8945A38060E7580g4363k56621A88097a52118g5707J3435j47484E6340Q9964M337
$$ 138060 57580 -74363 -330984 188097 -152118 -75707 -62272 -209756 56340 146304 150641
8934A50641b71075J34565D837J65713n409Q293n2028J89257q4839M41052J051883
$$ 150641 -271075 -136510 4837 170550 165141 173434 121406 310663 225824 666876 1718759
8923A718759L586538M834991l344061A442889C39170b8304j27991B59482j21431
$$ 1718759 5305297 10140288 6796227 1442889 339170 -28304 -156295 259482 138051
8914A38051b15441B72716a9118d946A37535K45049j25194d63909a66330L3708
$$ 138051 -215441 272716 -19118 -4946 137535 382584 257390 -463909 -166330 -132622
8904a32622B127d7772C2470O8870Q4659b22702J6376M2940F061c22126P1366E768
$$ -132622 2127 -47772 32470 101340 185999 -222702 -206326 -163386 6061 -322126 -250760 5768
8891e6361J528r447K1129q0677l010B92918A26780h1084A20659a91313a7715j53797
$$ -56361 -54833 -64280 -43151 -123828 -126838 292918 126780 -81084 120659 -191313 -17715 -171512
8879a71512H3787c24060a42614k71668A82426l0416a74477j44105A27417D7295
$$ -171512 83787 -324060 -142614 -414282 182426 152010 -174477 -318582 127417 47295
8868a46691j63956K1353a06734C30275A19098J35993b7555j89990C11071a01506
$$ -146691 -310647 -289294 -106734 330275 119098 255091 -27555 -217545 311071 -101506
8857b80087N5570B18363c17320a24931M771e8980j65235C8988p141J012b2708
$$ -280087 -224517 218363 -317320 -124931 -120160 -58980 -224215 38988 31847 32859 -22708
8845b85504A89806H5514K70441b48910a12652b7398B07063i4945j97177b4073
$$ -285504 189806 85514 355955 -248910 -112652 -27398 207063 -94945 -292122 -24073
$$ [...]
##END NTUPLES=NMR SPECTRUM
##END=
