
##TITLE=AC1408_AMCAH12217_7653457_wT77oWUpKg
##JCAMPDX= 6.0         $$ Bruker NMR JCAMP-DX V2.0
##DATA TYPE= NMR SPECTRUM
##DATA CLASS= NTUPLES
##ORIGIN= BRUKER
##OWNER= Administrator
$$ 1.72 TOPSPIN		Version 2.1
$$ 2013-03-19 21:40:49.187 -0500  Administrator@X
$$ Compression mode = diff/dup
##.OBSERVE FREQUENCY= 400.02188249412
##.OBSERVE NUCLEUS= ^1H
##.ACQUISITION MODE= SIMULTANEOUS (DQD)
##.ACQUISITION SCHEME= undefined
##.AVERAGES= 64
##.DIGITISER RES= 22
##SPECTROMETER/DATA SYSTEM= spect
##.PULSE SEQUENCE= noesygpps1d.comp
##.SOLVENT NAME= COFFEE_meoh
##.SHIFT REFERENCE= INTERNAL, COFFEE_meoh, 1, 14.96075
##AUDIT TRAIL= $$ (NUMBER, WHEN, WHO, WHERE, PROCESS, VERSION, WHAT)
$$ ##TITLE= Audit trail, TOPSPIN		Version 2.1
$$ ##JCAMPDX= 5.01
$$ ##ORIGIN= Bruker BioSpin GmbH
$$ ##OWNER= Administrator
$$ $$ E:\/data/COFFEE/nmr/AC1408_AMCAH12217_7653457_wT77oWUpKg/12/pdata/1/auditp.txt
$$ ##AUDIT TRAIL=  $$ (NUMBER, WHEN, WHO, WHERE, PROCESS, VERSION, WHAT)
(   1,<2013-03-19 21:40:43.249 -0500>,<Administrator>,<X>,<go>,<TOPSPIN 2.1>,
      <created by zg
	started at 2013-03-19 21:29:13.265 -0500,
	POWCHK enabled, PULCHK disabled,
       configuration hash MD5:
       86 BA 57 50 F2 9D 5C 9B 26 00 A9 28 5F 66 2E 89
       data hash MD5: 64K
       CD 2A 0F C1 4B E2 C2 04 77 14 08 3A 69 75 21 06>)
(   2,<2013-03-19 21:40:46.421 -0500>,<Administrator>,<X>,<proc1d>,<TOPSPIN 2.1>,
      <Start of raw data processing
       efp LB = 0.3 FT_mod = 6 PKNL = 1 PHC0 = 0 PHC1 = 0 SI = 128K 
       data hash MD5: 128K
       83 21 C3 60 36 C6 5C 1D BD EC 3E 7A 72 55 1A 78>)
(   3,<2013-03-19 21:40:47.499 -0500>,<Administrator>,<X>,<proc1d>,<TOPSPIN 2.1>,
      <pk PHC0 = -75.71777 PHC1 = 0 
       data hash MD5: 128K
       51 A8 A6 2D FB 79 44 51 B3 40 94 24 F6 11 02 86>)
(   4,<2013-03-19 21:40:48.124 -0500>,<Administrator>,<X>,<proc1d>,<TOPSPIN 2.1>,
      <abs ABSG = 1 
       data hash MD5: 128K
       68 76 3F D1 02 73 AD 28 B6 01 44 6E C4 ED 5B 16>)
(   5,<2013-03-19 21:40:48.312 -0500>,<Administrator>,<X>,<proc1d>,<TOPSPIN 2.1>,
      <abs ABSG = 2 
       data hash MD5: 128K
       3B B6 AB F3 56 2B 28 7C 4C 25 52 F7 53 A1 E1 B0>)
(   6,<2013-03-19 21:40:48.515 -0500>,<Administrator>,<X>,<proc1d>,<TOPSPIN 2.1>,
      <abs ABSG = 3 
       data hash MD5: 128K
       C3 7F BF E8 F3 CF 3C 85 55 F4 03 91 36 40 FE 1A>)
(   7,<2013-03-19 21:40:48.687 -0500>,<Administrator>,<X>,<proc1d>,<TOPSPIN 2.1>,
      <abs ABSG = 4 
       data hash MD5: 128K
       01 5D 01 80 CC BB A7 52 37 1B C7 DB FC 72 E7 CA>)
(   8,<2013-03-19 21:40:48.859 -0500>,<Administrator>,<X>,<proc1d>,<TOPSPIN 2.1>,
      <abs ABSG = 5 
       data hash MD5: 128K
       91 0F 1D 01 B8 31 89 B0 D2 07 22 0B 62 54 1E B3>)
$$ ##END=
$$ 
$$ $$ hash MD5
$$ $$ 8C 1A 70 7A F2 0A 4B B9 30 FC D4 FA E7 6A 2C DA
##$RELAX= 
##$RELAX= 
##$RELAX= 
##$RELAX= 
##$RELAX= 
##$RELAX= 
##$RELAX= 
##$RELAX= 
$$ Bruker specific parameters
$$ --------------------------
##$DU= <E:\>
##$EXPNO= 12
$$ [...]
##$TP07= 0
##$TPNAME0= <>
##$TPNAME1= <>
##$TPNAME2= <>
##$TPNAME3= <>
##$TPNAME4= <>
##$TPNAME5= <>
##$TPNAME6= <>
##$TPNAME7= <>
##$TPOAL= (0..7)
0.5 0.5 0.5 0.5 0.5 0.5 0.5 0.5
##$TPOFFS= (0..7)
0 0 0 0 0 0 0 0
##$TUNHIN= 0
##$TUNHOUT= 0
##$TUNXOUT= 0
##$USERA1= <user>
##$USERA2= <user>
##$USERA3= <user>
##$USERA4= <user>
##$USERA5= <user>
##$V9= 5
##$VALIST= <valist>
##$VCLIST= <CCCCCCCCCCCCCCC>
##$VD= 0
##$VDLIST= <DDDDDDDDDDDDDDD>
##$VPLIST= <PPPPPPPPPPPPPPP>
##$VTLIST= <TTTTTTTTTTTTTTT>
##$WBST= 2048
##$WBSW= 25
##$XGAIN= (0..3)
0 0 0 0
##$XL= 0
##$YL= 0
##$YMAX_a= 6531869
##$YMIN_a= -13666037
##$ZGOPTNS= <>
##$ZL1= 120
##$ZL2= 120
##$ZL3= 120
##$ZL4= 120
##$ABSF1= 14.96075
##$ABSF2= -5.597432
##$ABSG= 5
##$ABSL= 3
##$ALPHA= 0
##$AQORDER= 0
##$ASSFAC= 0
##$ASSFACI= 0
##$ASSFACX= 0
##$ASSWID= 0
##$AUNMP= <proc_prof1d_extract.lims>
##$AXLEFT= 0
##$AXNAME= <>
##$AXNUC= <1H>
##$AXRIGHT= 0
##$AXTYPE= 0
##$AXUNIT= <>
##$AZFE= 0.1
##$AZFW= 0.1
##$BCFW= 0
##$BC_mod= 0
##$BYTORDP= 0
##$COROFFS= 0
##$CY= 15
##$DATMOD= 1
##$DC= 0
##$DFILT= <>
##$DTYPP= 0
##$F1P= 0
##$F2P= 0
##$FCOR= 0.5
##$FTSIZE= 131072
##$FT_mod= 6
##$GAMMA= 0
##$GB= 0
##$INTBC= 1
##$INTSCL= 1
##$ISEN= 128
##$LB= 0.3
##$LEV0= 0
##$LPBIN= 0
##$MAXI= 10000
##$MC2= 0
##$MEAN= 0
##$ME_mod= 0
##$MI= 0
##$NCOEF= 0
##$NC_proc= -2
##$NLEV= 6
##$NOISF1= 0
##$NOISF2= 0
##$NSP= 0
##$NTH_PI= 0
##$NZP= 0
##$OFFSET= 14.96075
##$PC= 1
##$PHC0= -75.71777
##$PHC1= 0
##$PH_mod= 1
##$PKNL= yes
##$PPARMOD= 0
##$PPDIAG= 0
##$PPIPTYP= 0
##$PPMPNUM= 2147483647
##$PPRESOL= 1
##$PSCAL= 4
##$PSIGN= 0
##$PYNMP= <proc.py>
##$REVERSE= no
##$SF= 400.020009738199
##$SI= 131072
##$SIGF1= 0
##$SIGF2= 0
##$SINO= 400
##$SIOLD= 131072
##$SPECTYP= <>
##$SREGLST= <1H.CDCl3>
##$SSB= 0
##$STSI= 131072
##$STSR= 0
##$SW_p= 8223.68421052631
##$SYMM= 0
##$S_DEV= 0
##$TDeff= 65536
##$TDoff= 0
##$TI= <>
##$TILT= no
##$TM1= 0
##$TM2= 0
##$TOPLEV= 0
##$USERP1= <user>
##$USERP2= <user>
##$USERP3= <user>
##$USERP4= <user>
##$USERP5= <user>
##$WDW= 1
##$XDIM= 131072
##$YMAX_p= 428050552
##$YMIN_p= -14155
##$CURPLOT= <Network HP LaserJet P1505>
##$CURPRIN= <$Network HP LaserJet P1505>
##$DFORMAT= <normdp>
##$LAYOUT= <+/1D_H.xwp>
##$LFORMAT= <normlp>
##$PFORMAT= <normpl>
##$SURQMSG= 1
$$ End of Bruker specific parameters
$$ ---------------------------------
##NTUPLES= NMR SPECTRUM
##VAR_NAME=  FREQUENCY,     SPECTRUM/REAL,   SPECTRUM/IMAG
##SYMBOL=    X,             R,               I
##VAR_TYPE=  INDEPENDENT,   DEPENDENT,       DEPENDENT
##VAR_FORM=  AFFN,          ASDF,            ASDF
##VAR_DIM=   131072,        131072,          131072
##UNITS=     HZ,            ARBITRARY UNITS, ARBITRARY UNITS
##FACTOR=    0.0627417313425164, 1,          1
##FIRST=     8223.62146879497, 1568,         -67839
##LAST=      0,             4528,            -67660
##MIN=       0,             -14155,          0
##MAX=       8223.62146879497, 428050552,    0
$$ Real data points
##PAGE= N=1
##DATA TABLE= (X++(R..R)), XYDATA
$$ [...]
61690D38440l078l604l727k912j641q49r30j562k308k990l461l406k661j524n36
$$ 438440 435362 431758 428031 425119 423478 422629 421699 420137 417829 414839 411378 407972 405311 403787 403251
61675D03251JJ70J85J90K18J99L4k93o61r34j032q91m68J34O54Q80P84M71J20
$$ 403251 403252 403422 403607 403797 404015 404214 404248 403955 403294 402360 401328 400437 399969 400103 400757 401637 402421 402892 403012
61656D03012PL20Q97J360J620J973K587L157L341L228L147L155K989K492J872
$$ 403012 403019 403339 404236 405596 407216 409189 411776 414933 418274 421502 424649 427804 430793 433285 435157
61641D35157J634K239L595M872N193M607L880L258K098J23j778k673k933l574
$$ 435157 436791 439030 442625 447497 452690 457297 461177 464435 466533 466656 464878 462205 459272 455698
61627D55698m676n411n430n196m943m292l121j962j236q16n49n04m14K97J563
$$ 455698 451022 445611 440181 434985 430042 425750 422629 420667 419431 418615 418066 417562 417148 417445 419008
61612D19008K407K146J197J81j088k982m968o135o513o971p777q127p336n784
$$ 419008 421415 423561 424758 424939 423851 420869 415901 409766 403253 396282 388505 380378 373042 367258
61598C67258m390l626l425l617m007m251m129l899l929m062l754l003k556k876
$$ 367258 362868 359242 355817 352200 348193 343942 339813 335914 331985 327923 324169 321166 318610 315734
61584C15734l344l053k181j767k128k335j581l86J56k54j077j857k439k579k141
$$ 315734 312390 309337 307156 305389 303261 300926 299345 298959 299115 298861 297784 295927 293488 290909 288768
61569B88768j569j488j810j885j492j040p68m65m2K74M52O73P18J27q20j100l38
$$ 288768 287199 285711 283901 282016 280524 279484 278716 278251 278209 278483 278935 279608 280326 280453 279633 278533 278195
61552B78195N56O19J06p7L64J053J668K049J869R38k51q86p11j20N31J225J912
$$ 278195 278751 279370 279476 279399 279763 280816 282484 284533 286402 287340 287089 286203 285492 285372 285903 287128 289040
61535B89040K321K311K077J912J877J777J408Q27M34N71R78R11j19j814l354m028
$$ 289040 291361 293672 295749 297661 299538 301315 302723 303550 303984 304555 305533 306444 306325 304511 301157 297129
61519B97129l632k643j989k246k924l027k311j464r43m47K17N46K61J4L80P44
$$ 297129 293497 290854 288865 286619 283695 280668 278357 276893 275950 275503 275720 276266 276527 276541 276921 277665
61503B77665J73j032j667j336q18o78n05J85J104J668J695J296O07o3k87r3r4
$$ 277665 277838 276806 275139 273803 272985 272307 271802 271987 273091 274759 276454 277750 278357 278294 278007 277914 277820
61486B77820o50j256j177l77N08R85J046Q49M46j09o47r56q71l17O01J522J967
$$ 277820 277170 275914 274737 274360 274868 275853 276899 277748 278194 278085 277438 276482 275611 275294 275895 277417 279384
61469B79384J685Q49m8n85o99o25m91j30O62J656K229J895P52n71j359j251m57
$$ 279384 281069 281918 281870 281285 280586 279961 279470 279340 280002 281658 283887 285782 286534 285963 284604 283353 282896
61452B82896L69O41L35oJ24O62J106J129R09P96Q45Q97R81J318J866K270K430
$$ 282896 283265 283906 284241 284235 284359 285021 286127 287256 288165 288961 289806 290703 291684 293002 294868 297138 299568
61435B99568K745L460M050L814K948K428K765L444L716L440K840J994R70J57m9
$$ 299568 302313 305773 309823 313637 316585 319013 321778 325222 328938 332378 335218 337212 338182 338339 338290
61420C38290K27N10N98P12J091J652K043J956J431Q98P21P22L61n42j614k504
$$ 338290 338517 339027 339625 340337 341428 343080 345123 347079 348510 349408 350129 350851 351212 350670 349056 346552
61404C46552l200l637l495k779k123k085k453k729k902l203l347k749j460j98
$$ 346552 343352 339715 336220 333441 331318 329233 326780 324051 321149 317946 314599 311850 310390 310192
61390C10192N37Q62R89Q78O08N19P02P61M18j5n2L31Q43J437K285L239L740L454
$$ 310192 310729 311591 312580 313458 314066 314585 315287 316048 316466 316451 316399 316730 317573 319010 321295 324534 328274 331728
61372C31728K787K479K784L233L232K677J911J277R25R20J208J537J623J542J672
$$ 331728 334515 336994 339778 343011 346243 348920 350831 352108 353033 353953 355161 356698 358321 359863 361535
61357C61535K249L107L903M378M439M275M422N339O875Q364R370R938J0092R501
$$ 361535 363784 366891 370794 375172 379611 383886 388308 393647 400522 408886 418256 428194 438286 447787
61343D47787P970N930M150L111K830L028L223L018K470K049K014K112J969J500
$$ 447787 455757 461687 465837 468948 471778 474806 478029 481047 483517 485566 487580 489692 491661 493161
61329D93161P82j10r62j515j863k426l304m061m359m310m077l638l195l195l532
$$ 493161 493943 493833 492871 491356 489493 487067 483763 479702 475343 471033 466956 463318 460123 456928 453396
61314D53396l368k237p34L99J259K276L344M237N314O948Q686R821J0511J1323
$$ 453396 450028 447791 447057 447456 448715 450991 454335 458572 463886 470834 479520 489341 499852 511175
61300E11175J1940J1310R044N805K375q59l530n284o221o709o730o133n385n196
$$ 511175 523115 534425 543469 549274 551649 550790 547260 541976 535755 529046 522316 516183 510798 505602
61286E05602n405n205m512m109m246m109l084j675n99K23J228K363L294M054M927
$$ 505602 500197 494992 490480 486371 482125 478016 474932 473257 472658 472881 474109 476472 479766 483820 488747
61271D88747N954O916P564P636P029O143N585N393N003M292M080N208P433R646
$$ 488747 494701 501617 509181 516817 523846 529989 535574 540967 545970 550262 554342 559550 566983 576629
61257E76629J0911J1073J0587J0065R719R116P713N648L658K181J092L14N2J83
$$ 576629 587540 598613 609200 619265 628984 638100 645813 651461 655119 657300 658392 658706 658758 658941
61243F58941P9o38j727k999m677o674q181q587q285p959p607o938o303o260o443
$$ 658941 659020 658382 656655 653656 648979 642305 634124 625537 617252 609293 601686 594748 588445 582185 575742
61228E75742n813m190k691k356k870l097k439j315m36m2J11L05N89Q81J213J799
$$ 575742 569929 565739 563048 560692 557822 554725 552286 550971 550535 550493 550604 550909 551498 552379 553592 555391
61212E55391K795L978M729M508L460K399J921J687R09m26j360j213l89M17J391
$$ 555391 558186 562164 566893 571401 574861 577260 579181 580868 581777 581351 579991 578778 578389 578806 580197
61197E80197L246O042R035J1653J3949J6079J7943J9381K0199J9975J8339J5533
$$ 580197 583443 589485 598520 610173 624122 640201 658144 677525 697724 717699 736038 751571
61185G51571J2250Q950N861L565K774L359M175M212L440K375J330L55n17j268
$$ 751571 763821 772771 778632 782197 784971 788330 792505 796717 800157 802532 803862 804217 803700 802432
61171H02432j854k100j965j950k738m293n798o619o903p138p598q357r388j0422
$$ 802432 800578 798478 796513 794563 791825 787532 781734 775115 768212 761074 753476 745119 735731 725309
61157G25309j1119j1495j1828j2151j2159j1672j0713r218p147m847k766r66N29
$$ 725309 714190 702695 690867 678716 666557 654885 644172 634954 627807 622960 620194 619228 619757
61144F19757J130J45k246n230q313j1215j3129j3302j2265j1243j0397q897o814
$$ 619757 620887 621032 618786 613556 605243 594028 580899 567597 555332 544089 533692 524795 517981
61131E17981n269m477l278j251L81Q32J198K640M472N461N920P082R214J1651
$$ 517981 512712 508235 504957 503706 504087 504919 506117 508757 513229 518690 524610 531692 540906 552557
61117E52557J4017J6121J7338J7465J7648J9123K1439K3186K4008K4563K4865
$$ 552557 566574 582695 600033 617498 635146 654269 675708 698894 722902 747465 772330
61106G72330K4229K2807K1761K1637K1757K1400K0595J9411J7382J4060R557M317
$$ 772330 796559 819366 841127 862764 884521 905921 926516 945927 963309 977369 986926 991243
61094I91243j129o049r711j1898j3039j3801j4774j6245j7949j9324k0218k0949
$$ 991243 990114 984065 974354 962456 949417 935616 920842 904597 886648 867324 847106 826157
61082H26157k1503k1292k0230j9172j8689j8170j6926j5449j4539j3904j2730
$$ 826157 804654 783362 763132 743960 725271 707101 690175 674726 660187 646283 633553
61071F33553j1175j0071r509q794p618o205m584k765j383j021j055l28J201K540
$$ 633553 622378 612307 602798 594004 586386 580181 575597 572832 571449 570428 569373 569045 570246 572786
61057E72786L292M028N000N676N775N818O336P240Q191R005R685J0497J1920J4020
$$ 572786 576078 580106 585106 590782 596557 602375 608711 615951 624142 633147 642832 653329 665249 679269
61043F79269J6225J8096J9903K1817K3321K4194K5330K7522L0141L2144L3654
$$ 679269 695494 713590 733493 755310 778631 802825 828155 855677 885818 917962 951616
61032I51616L5401L7321L9076M1179M4050M6687M7906M8226M8770M9132M8428
$$ 951616 987017 1024338 1063414 1104593 1148643 1195330 1243236 1291462 1340232 1389364 1437792
61021A437792M7883M9984N5325O2517P0868Q0619R0897J00208J09206J20282J34556
$$ 1437792 1485675 1535659 1590984 1653501 1724369 1804988 1895885 1996093 2105299 2225581 2360137
61010B360137J52229J75841K09479K54277L08416L72233M49286N42250O53896
$$ 2360137 2512366 2688207 2897686 3151963 3460379 3832612 4281898 4824148 5478044
61001E478044P94172R79415J219934J512840J845387K184452K442718K471470
$$ 5478044 6272216 7251631 8471565 9984405 11829792 14014244 16456962 18928432
60993A8928432K137973J451565O11628r7970m82850n20225k99930O6664M57642
$$ 18928432 21066405 22517970 23129598 23031628 22548778 22028553 21728623 21795287 22252929
60984B2252929P03824O21531J35872o29931j414631j984625k252790k266222k119234
$$ 22252929 22956753 23578284 23714156 23084225 21669594 19684969 17432179 15165957 13046723
60975A3046723j890718j634279j385814j163698r70465q03135o60955n43324m46587
$$ 13046723 11156005 9521726 8135912 6972214 6001749 5198614 4537659 3994335 3547748
60966C547748l66744l02402k52701k14765j85218j62162j44124j29004j15489
$$ 3547748 3181004 2878602 2625901 2411136 2225918 2063756 1919632 1790628 1675139
60957A675139j03833r3986q4505p4428o4627n6048m8201m0651l4633l1660l1381
$$ 1675139 1571306 1477320 1392815 1318387 1253760 1197712 1149511 1108860 1074227 1042567 1011186
60946A011186l2036l2343l1875l0403k7982k5232k2755k0566j8569j7021j6046
$$ 1011186 979150 946807 914932 884529 856547 831315 808560 787994 769425 752404 736358
60935G36358j5366j4901j5027j5750j6287j5998j5090j4126j3349j2724j2051
$$ 736358 720992 706091 691064 675314 659027 643029 627939 613813 600464 587740 575689
60924E75689j0926r309q088q131q747q309o544m910m368m222l698l181l046k624
$$ 575689 564763 555454 547366 539235 530488 522179 515635 510725 506357 502135 498437 495256 492210 489586
60910D89586j496o60j159k388k946k540j839j172m48M4k6k78j53R8j33p42j202
$$ 489586 488090 487430 486271 483883 480937 478397 476558 475386 474938 474982 474956 474678 474525 474623 474490 473748 472546
60893D72546j539k048k460k333k032k236k751k851k666l085m209n052n021m656
$$ 472546 471007 468959 466499 464166 462134 459898 457147 454296 451630 448545 444336 439284 434263 429607
60879D29607m535m288l298j735l86K35K44M6M4M53J217K090K894L595M196M734
$$ 429607 425072 420784 417486 415751 415365 415600 415844 415890 415934 416387 417604 419694 422588 426183 430379 435113
60863D35113N293N896O527P313Q422R566R988R272P862O459N199L951L009K853
$$ 435113 440406 446302 452829 460142 468564 478130 488118 497390 505252 511711 516910 520861 523870 526723
60849E26723L421M177M766N032M590L197J501O04P29R74O46J03j45m20j377k863
$$ 526723 530144 534321 539087 544119 548709 551906 553407 554011 554740 555714 556360 556463 556318 555898 554521 551658
60833E51658l987m215l848l363k720j545K16K053L392M175M861N840P050Q177
$$ 551658 547671 543456 539608 536245 533525 531980 532196 534249 537641 541816 546677 552517 559567 567744
60819E67744R056R701J0128J0407J0757J1297J1824J2104J2349J2965J3869J4415
$$ 567744 576800 586501 596629 607036 617793 629090 640914 653018 665367 678332 692201 706616
60807G06616J4170J3363J2437J1464J0279Q948P732O640N321L434R98j692m315
$$ 706616 720786 734149 746586 758050 768329 777277 785009 791649 796970 800404 801402 799710 795395
60794G95395o663q551r732j0056r781r577j0012j0967j1749j1861j1557j1431
$$ 795395 788732 780181 770449 760393 750612 741035 731023 720056 708307 696446 684889 673458
60782F73458j1574j1417j0555r494r211r968j0844j0737r605q386p805p705p605
$$ 673458 661884 650467 639912 630418 621207 611239 600395 589658 580053 571667 563862 556157 548552
60769E48552p429p300p083o613o197o349o943p183o589n654n208n406n697n627
$$ 548552 541123 533823 526740 520127 513930 507581 500638 493455 486866 481212 476004 470598 464901 459274
60755D59274n288m987m867m985n443o144o548o021m512k711j482j193j542j900
$$ 459274 453986 448999 444132 439147 433704 427560 421012 414991 410479 407768 406286 405093 403551 401651
60741D01651j766j154o71j011k178l359l749l441l203l474l876l772l009j995
$$ 401651 399885 398731 398060 397049 394871 391512 387763 384322 381119 377645 373769 369997 366988 364993
60727C64993j195o85j85N35J260J514J186P46O06M92j35j123j719j618j389j610
$$ 364993 363798 363113 362928 363463 364723 366237 367423 368169 368775 369267 369132 368009 366290 364672 363283 361673
60711C61673k120k487k734l088l360l166k635k354k536k743k509j910j427j474
$$ 361673 359553 357066 354332 351244 347884 344718 342083 339729 337193 334450 331941 330031 328604 327130
60697C27130k101k899l175k591j684j412k015k645k378j285j74M09N35M57L32
$$ 327130 325029 322130 318955 316364 314680 313268 311253 308608 306230 304945 304771 305180 305715 306172 306504
60682C06504M15R80J810K254K070J881K319L043L158K436J552J073Q54O74P82
$$ 306504 306919 307899 309709 311963 314033 315914 318233 321276 324434 326870 328422 329495 330349 331023 331805
60667C31805J453K388L044L188K768J658N8j157j156j33J026J911K730L393L345
$$ 331805 333258 335646 338690 341878 344646 346304 346362 345205 344049 343916 344942 346853 349583 352976 356321
60652C56321K559J958K324L335M135M513M964N752O405O231N021L251J594K43
$$ 356321 358880 360838 363162 366497 370632 375145 380109 385861 392266 398497 403518 406769 408363 408606
60638D08606j211l075m864n728n477m770m224l807l305k830k545k325k068k014
$$ 408606 407395 404320 399456 393728 388251 383481 379257 375450 372145 369315 366770 364445 362377 360363
60624C60363k356k821k974k761k463k282k230k187j899j208m69l12q25j319j220
$$ 360363 358007 355186 352212 349451 346988 344706 342476 340289 338390 337182 336713 336401 335576 334257 333037
60609C33037p09k04K87Q04R87N89O1J1L38N23M91M86M41J87J15P86J872K349J829
$$ 333037 332328 332124 332411 333215 334202 334791 334852 334863 335201 335724 336215 336701 337142 337329 337444 338230 340102 342451 344280
60590C44280R98N61M79M53N17P64R73Q78M76j08p80j292j271o03M68J640K703
$$ 344280 345278 345839 346318 346771 347288 348052 349025 349903 350379 350271 349491 348199 346928 346325 346793 348433 351136
60573C51136L431L685L662L677L758L928M704O676R560J2275J4063J4878J4719
$$ 351136 354567 358252 361914 365591 369349 373277 377981 384657 394217 406492 420555 435433 450152
60560D50152J3375J1079Q528N899K648j283m839p059q116q559q203o654m350k115
$$ 450152 463527 474606 483134 489033 491681 490398 485559 478500 470384 461825 453622 446968 442618 440503
60546D40503l7K227M346N571O139P244R433J1868J3627J4899J6331J7714J7973
$$ 440503 440466 442693 447039 452610 458749 465993 475426 487294 500921 515820 532151 549865 567838
60533E67838J6354J3128R185N233J459k199n633q446j0238j0859j0343q836o831
$$ 567838 584192 597320 606505 611738 613197 610998 605365 596919 586681 575822 565479 556643 549812
60520E49812n172m470m507m517m048l256k418j517m21Q09J830K221J855J260J354
$$ 549812 544640 540170 535663 531146 527098 523842 521424 519907 519486 520295 522125 524346 526201 527461 528815
60505E28815K526M229N895P952J1294J5774K0152K3681K7064L1262L6083M0541
$$ 528815 531341 535570 541465 549417 560711 576485 596637 620318 647382 678644 714727 755268
60493G55268M4280M7693N0779N2608N2286M9768M5311L8530K8619J5592P94j3967
$$ 755268 799548 847241 898020 950628 1002914 1052682 1097993 1136523 1165142 1180734 1181528 1167561
60481A167561k7556l9478m9126n5592n8404n8060n5620n1971m7630m2986l8394
$$ 1167561 1140005 1100527 1051401 995809 937405 879345 823725 771754 724124 681138 642744
60470F42744l4071l0073k6284k2476j8596j5175j3003j2117j1498j0186q372o895
$$ 642744 608673 578600 552316 529840 511244 496069 483066 470949 459451 449265 440893 433998
60458D33998n921m897l658k745k504k623k828l315m144m773m714m233l947m002
$$ 433998 428077 423180 419522 416777 414273 411650 408822 405507 401363 396590 391876 387643 383696 379694
60444C79694m072l879l337k442j378m69J98Q80J589J803J176J50n74q53r23p94
$$ 379694 375622 371743 368406 365964 364586 364117 364315 365195 366784 368587 369763 369913 369339 368486 367563 366769
60428C66769m61m13j133k122k258j285k20Kl18k51M50J185J450J440J601J914
$$ 366769 366308 365895 364762 362640 360382 359097 358877 358879 358561 358310 358760 359945 361395 362835 364436 366350
60412C66350J840J039L3j92O87J867K345K053J621J366J067O89O18J020J489J633
$$ 366350 368190 369229 369262 369070 369757 371624 373969 376022 377643 379009 380076 380765 381383 382403 383892 385525
60396C85525J553J488J486J614K120K900L232K531J210L48N12J252J761J716J445
$$ 385525 387078 388566 390052 391666 393786 396686 399918 402449 403659 404007 404519 405771 407532 409248 410693
60381D10693J415J684J825J411N90mQ2O88J385J950K357K559K557K547K680K791
$$ 410693 412108 413792 415617 417028 417618 417614 417696 418384 419769 421719 424076 426635 429192 431739 434419 437210
60365D37210K629K238J840J385O31k77o97k33O58J139J065J168K026L217L853
$$ 437210 439839 442077 443917 445302 445933 445656 444959 444726 445384 446523 447588 448756 450782 453999 457852
60350D57852L806L887M797O308P787Q972R915J0481J0423R684Q207N696K167j468
$$ 457852 461658 465545 470342 476650 484437 493409 503324 513805 524228 533912 542119 547815 549982 548514
60336E48514m100n685p073q582r494r213q152p070o156n214m285l565l124l028
$$ 548514 544414 538729 531656 523074 513580 504367 496215 489145 482989 477775 473490 469925 466801 463773
60322D63773l356l825l851l295k656k233j729j092r53j566j985j193N14K102L387
$$ 463773 460417 456592 452741 449446 446790 444557 442828 441736 440783 439217 437232 436039 436553 438655 442042
60307D42042M957O867Q523R845J1527J4055J7200K0522K3391K4590K2976J8954
$$ 442042 446999 453866 462389 472234 483761 497816 515016 535538 558929 583519 606495 625449
60295F25449J4318J0237O156J092m860j0728j5614j8835j9889j9038j7494j6367
$$ 625449 639767 650004 656160 657252 652392 641664 626050 607215 587326 568288 550794 534427
60283E34427j5654j4665j3023j0799q216n791m313m043m236m042l505l118k897
$$ 534427 518773 504108 491085 480286 472070 466279 461966 457923 453687 449645 446140 443022 440125
60270D40125k613k575l209m036m045l156k420k534k950k774j942j059n97o05q55
$$ 440125 437512 434937 431728 427692 423647 420491 418071 415537 412587 409813 407871 406812 406215 405610 404755
60255D04755r97q37p08j169k102k604k027p79L24J058J650K072K073J733J355
$$ 404755 403758 402921 402213 401044 398942 396338 394311 393532 393856 394914 396564 398636 400709 402442 403797
60240D03797R19K48l76l82J76O03O13P54J424K093K131J814J898K450K875K950
$$ 403797 404716 404964 404588 404206 404382 404985 405598 406352 407776 409869 412000 413814 415712 418162 421037 423987
60224D23987L030L201L000K270J626J644K016J966J277N18M04J196K581L908M646
$$ 423987 427017 430218 433218 435488 437114 438758 440774 442740 444017 444535 444939 446135 448716 452624 457270
60209D57270M793M778M887N081N299N614N904N840N391M979M862M822M727M879
$$ 457270 462063 466841 471728 476809 482108 487722 493626 499466 504857 509836 514698 519520 524247 529126
60195E29126N349N506M776L537K593K078J546R30O26O95O86K65n26j588k737l430
$$ 529126 534475 539981 544757 548294 550887 552965 554511 555441 556067 556762 557448 557713 557187 555599 552862 549432
60179E49432l282k870l193m195m682l998k987k792l326l628l225k524k085k081
$$ 549432 546150 543280 540087 535892 531210 527212 524225 521433 518107 514479 511254 508730 506645 504564
60165E04564k396k745k696k002r89m29q15j793k384j907o68L86Q15J088J726K434
$$ 504564 502168 499423 496727 494725 493736 493307 492492 490699 488315 486408 485740 486126 486941 488029 489755 492189
60149D92189K559K104J603J249Q30M87P35J622K553L074L253L193K924K894L778
$$ 492189 494748 496852 498455 499704 500534 501021 501756 503378 505931 509005 512258 515451 518375 521269 525047
60134E25047N432O739O888O191N314M412L429K617K153J681Q51j08p45r78r64
$$ 525047 530479 537218 544106 550297 555611 560023 563452 566069 568222 569903 570754 570646 569901 568923 567959
60119E67959p66n21m57m57r1O16J079J119J352K126K791K645J973J444J034L96
$$ 567959 567193 566672 566215 565758 565667 566283 567362 568481 569833 571959 574750 577395 579368 580812 581846 582242
60103E82242k99o51q14j181j630j812j930k452l293l945m153l884l005j689o95
$$ 582242 581943 581292 580478 579297 577667 575855 573925 571473 568180 564235 560082 556198 553193 551504 550809
60088E50809m70l80L96J653K690L603M782N575M885L062J776J706J703P11o49
$$ 550809 550339 549959 550355 552008 554698 558301 563083 568658 573543 576605 578381 580087 581790 582501 581852
60073E81852j242j187j548k832m529n964o885p375p576p585p391o963o383n794
$$ 581852 580610 579423 577875 575043 570514 564550 557665 550290 542714 535129 527738 520775 514392 508598
60059E08598n318n163n548o212o329n475m370m006m226l945k753j415o78l39J98
$$ 508598 503280 498117 492569 486357 480028 474553 470183 466177 461951 458006 455253 453838 453160 452821 453019
60044D53019J136K313L465M222M381M314M567N007M968M378L901L819L521K562
$$ 453019 454155 456468 459933 464155 468536 472850 477417 482424 487392 491770 495671 499490 503011 505573
60030E05573J404O66J90n37j543k550l561m735n898o742p287p789q233q272p663
$$ 505573 506977 507643 507833 507296 505753 503203 499642 494907 489009 482267 474980 467191 458958 450686 443023
60015D43023o551n426m732m427m003l216k505k280k076j100M37J462J580J547
$$ 443023 436472 431046 426314 421887 417884 414668 412163 409883 407807 406707 407144 408606 410186 411733
60001D11733J892K023J260J2q08r67q68p15m27m2L47Q59J556K206K707L332M190
$$ 411733 413625 415648 416908 416920 416112 415145 414277 413562 413135 413093 413440 414299 415855 418061 420768 424100 428290
59984D28290M796M768M496M539M662M226L316K637K374J900Q38k69o87m64k38
$$ 428290 433086 437854 442350 446889 451551 455777 459093 461730 464104 466004 466842 466573 465886 465422 465184
59969D65184l24l80mO42J015Q84N74M78O08Q93J547K678L718L846L020K015J321
$$ 465184 464860 464480 464476 465118 466133 467017 467591 468069 468677 469570 471117 473795 477513 481359 484379 486394 487715
59952D87715O33l46j290j758j860j969k142k239k220k011j440o94m19r64j813
$$ 487715 488348 488002 486712 484954 483094 481125 478983 476744 474524 472513 471073 470379 469960 468996 467183
59937D67183k260k298k420k854l422l925m194l986l249k378j796j428q86l2R90
$$ 467183 464923 462625 460205 457351 453929 450004 445810 441824 438575 436197 434401 432973 432087 432055 433045
59922D33045K010K840L237L196L085L163L328L569M228N326O126O012N451N367
$$ 433045 435055 437895 441132 444328 447413 450576 453904 457473 461701 467027 473153 479165 484616 489983
59908D89983N800N995N686N455N707O026N777M751L045R13j029k101k358k684
$$ 489983 495783 501778 507464 512919 518626 524652 530429 535180 538225 539138 538109 536008 533650 530966
59894E30966l633m703n112m854m411l768k492o96Q11J581K100K910L694L795L329
$$ 530966 527333 522630 517518 512664 508253 504485 501993 501297 502108 503689 505789 508699 512393 516188 519517
59879E19517L122L552M147M453M682N116N441N137M220L103K004R14j31j183k495
$$ 519517 522639 526191 530338 534791 539473 544589 550030 555167 559387 562490 564494 565408 565277 564094 561599
59864E61599l965m780m323l145k367k272k291k185k266k393j828l40J349K563
$$ 561599 557634 552854 548531 545386 543019 540747 538456 536271 534005 531612 529784 529444 530793 533356
59850E33356L391M180N069O232P741Q838Q296N931K982N78j287k748l142j954
$$ 533356 536747 540927 545996 552228 559969 568807 577103 583034 586016 586594 585307 582559 579417 577463
59836E77463Q5J677K187J496n72l740o753q389q682q353p631o423n156m426m107
$$ 577463 577548 579225 581412 582908 582336 578596 571843 563454 554772 546419 538788 532365 527209 522783 518676
59821E18676l742l457l601l857l696l339l267l092k127q24m11j031j485r80n6
$$ 518676 514934 511477 507876 504019 500323 496984 493717 490625 488498 487674 487263 486232 484747 483767 483711
59806D83711N16O70N67J65l25l47O4J4j064k515l324l387l427l907m564m905m798
$$ 483711 484227 484897 485464 485629 485304 484957 485021 485035 483971 481456 478132 474745 471318 467411 462847 457942 453144
59789D53144m434l909l005j661n17m71j461k252j938j103q55j242j463j239r59
$$ 453144 448710 444801 441796 440135 439618 439147 437686 435434 433496 432393 431538 430296 428833 427594 426635
59774D26635p41l17J48K00K1L16J091J576J521J630K383L298L714L626L321K936
$$ 426635 425894 425577 425725 425925 425946 426262 427353 428929 430450 432080 434463 437761 441475 445101 448422 451358
59758D51358K627K592K611K240J694J849L027M447N278N597N901O342O817P262
$$ 451358 453985 456577 459188 461428 463122 464971 467998 472445 477723 483320 489221 495563 502380 509642
59744E09642P455O995N897M732L860L067K209J612J479J400R60L03k60p05j031
$$ 509642 517097 524092 529989 534721 538581 541648 543857 545469 546948 548348 549308 549611 549351 548646 547615
59729E47615r95n62r5K35P33J456J818J393O27J75kk95o21o26l97l00k36K50J219
$$ 547615 546620 546058 545963 546198 546931 548387 550205 551598 552225 552400 552398 552103 551482 550856 550459 550159 549923 550173 551392
59710E51392K183K783L133L404L464L158K709K552K804L067K960K649K639K997
$$ 551392 553575 556358 559491 562895 566359 569517 572226 574778 577582 580649 583609 586258 588897 591894
59696E91894L270L346L741M603N033M219K787K006J895J271k98j812k400k381
$$ 591894 595164 598510 602251 606854 611887 616106 618893 620899 622794 624065 623767 621955 619555 617174
59682F17174k354k198j686j178j088j261j447j841k605l454m151m857n548n822
$$ 617174 614820 612622 610936 609758 608670 607409 605962 604121 601516 598062 593911 589054 583506 577684
59668E77684n681n713n959n538m065k603k299k806k950k358j474n56L70J035J354
$$ 577684 572003 566290 560331 554793 550728 548125 545826 543020 540070 537712 536238 535682 536052 537087 538441
59653E38441J873K819L294K507J420J718L354M436L693J762j00j437k318k741
$$ 538441 540314 543133 546427 548934 550354 552072 555426 559862 563555 565317 565217 563780 561462 558721
59639E58721k958l587m774n725n647m817m214m317m626m327l306k356k289k879
$$ 558721 555763 552176 547402 541677 536030 531213 526999 522682 518056 513729 510423 508067 505778 502899
59625E02899l079k487j960k306l013l069k474k005j827j512j337k283m420o368
$$ 502899 499820 497333 495373 493067 490054 486985 484511 482506 480679 479167 477830 475547 471127 464759
59611D64759o862o016m659l252j944r44k62M23J191J663J727J857K223K119R23
$$ 464759 457897 451881 447222 443970 442026 441082 440820 441243 442434 444097 445824 447681 449904 452023 452946
59596D52946q14j902j840j063j62N44Q71Q34P92J071J500J660J474J146O94n1
$$ 452946 452132 450230 448390 447327 447165 447709 448580 449414 450206 451277 452777 454437 455911 457057 457751 457700
59580D57700j064k147l178m010m254l703k902k718l317l996m143l795l188k344
$$ 457700 456636 454489 451311 447301 443047 439344 436442 433724 430407 426411 422268 418473 415285 412941
59566D12941j398p75o22m80K7N70O75N37N99O23M5q57j046j82Q88J445J813K427
$$ 412941 411543 410768 410146 409666 409693 410263 410938 411475 412074 412697 412742 411885 410839 410657 411545 412990 414803 417230
59548D17230K846K572K148K465L373M040M362M942N872O747P833R958J3073J6234
$$ 417230 420076 422648 424796 427261 430634 434674 439036 443978 449850 456597 464430 474388 487461 503695
59534E03695J9217K2559K5254K4146J7187O499l260r051j0894j0045p564m539
$$ 503695 522912 545471 570725 594871 612058 618557 615297 606246 595352 585307 577743 573204
59522E73204j972J25K430M804O117N845M775L659K159k22k997n299p003q506r783
$$ 573204 571232 571357 573787 578591 584708 590553 595328 598987 601146 600924 597927 592628 585625 577119 567336
59507E67336j0456j0555j0505j0439j0055r274q482q029p775p260o181m625l062
$$ 567336 556880 546325 535820 525381 515326 506052 497570 489541 481766 474506 468325 463700 460638
59494D60638k103k097k774l324l027j938q14k53N5P91J896K504K265K016K618
$$ 460638 458535 456438 453664 450340 447313 445375 444561 444308 444363 445154 447050 449554 451819 453835 456453
59479D56453L630L956L485L194L633M312M710M974N199M846L545J895Q10L97J62
$$ 456453 460083 464039 467524 470718 474351 478663 483373 488347 493546 498392 501937 503832 504642 505039 505201
59464E05201n6j4K14J65k27l54L15J565K793L788M820O054P168P727P784P914
$$ 505201 505145 505131 505345 505510 505283 504929 505244 506809 509602 513390 518210 524264 531432 539159 546943 554857
59448E54857Q567R608J0527J0993J0919J0139Q373N553J960j999n931r336j1686
$$ 554857 563424 573032 583559 594552 605471 615610 623983 629536 631496 629497 623566 614230 602544
59435F02544j2732j2638j1677j0107q309o767n755n185m872m769m763m458l343
$$ 602544 589812 577174 565497 555390 547081 540314 534559 529374 524502 519733 514970 510512 507169
59422E07169j251J397L788N351O357P724R999J2722J5100J7042J9078K1553K4577
$$ 507169 505918 507315 511103 516454 522811 530535 540534 553256 568356 585398 604476 626029 650606
59409F50606K8320L2111L3099K7517J4507j921j5743k3427k5181k2875j8227j2514
$$ 650606 678926 711037 744136 771653 786160 784239 768496 745069 719888 697013 678786 666272
59397F66272o239J071R247J5267J4449N121q800k0960k7774k9662k8390k5087
$$ 666272 660033 661104 670351 685618 700067 705188 696388 675428 647654 617992 589602 564515
59385E64515k0743j6802j4185j2537j1020r297p405n337l273j639m70Q15K385
$$ 564515 543772 526970 512785 500248 489228 479931 472526 467189 463916 462277 461807 462622 465007
59372D65007L328K777J353O43J273K356K861K813K851L242L765M200M434M328
$$ 465007 468335 471112 472465 473108 474381 476737 479598 482411 485262 488504 492269 496469 500903 505231
59358E05231L838L247L073L650M889O335P533Q404R281J0454J1872J3339J4857
$$ 505231 509069 512316 515389 519039 523928 530263 537796 546200 555481 565935 577807 591146 606003
59345F06003J6458J7886J8828J9307J9476J9201J8356J7427J7089J7084J6229
$$ 606003 622461 640347 659175 678482 697958 717159 735515 752942 770031 787115 803344
59334H03344J3796J0310O659L112l54l361n492p008q554j0266j1658j2314j2281
$$ 803344 817140 827450 834109 837221 836867 833506 828014 821006 812452 802186 790528 778214 765933
59321G65933j1862j1396j1179j1264j1395j1319j1017j0505r717q779q038p509
$$ 765933 754071 742675 731496 720232 708837 697518 686501 675996 666279 657500 649462 641953
59309F41953o685n301l860k902k122q09J141L316N597Q187J1009J3700J5986J7293
$$ 641953 635268 629967 626107 623205 621083 620274 621415 624731 630328 638515 649524 663224 679210 696503
59295F96503J6117J0995K471o629j3358j6625j7060j5734j3580j1336r291p281
$$ 696503 712620 723615 726086 719457 706099 689474 672414 656680 643100 631764 622473 615192
59283F15192n274l625k481j313M03K373L863M682N288O056O925P787Q675R572
$$ 615192 609918 606293 603812 602499 602902 605275 609138 613820 619108 625164 632089 639876 648551 658123
59269F58123J0353J1022J1629J1965J1691J0865R933R046P659N232K010j194l959
$$ 658123 668476 679498 691127 703092 714783 725648 735581 744627 752286 757518 759528 758334 754375
59256G54375o625r592j2507j4440j4792j3895j2665j1772j1204j0588r750q878
$$ 754375 747750 738158 725651 711211 696419 682524 669859 658087 646883 636295 626545 617667
59244F17667q103p214n909m325l033k430k212j649l44J319K541K895K773K918
$$ 617667 609564 602350 596441 592116 589083 586653 584441 582792 582448 583767 586308 589203 591976 594894
59230E94894L427L520K512Q28m55r93j483k521l859n080o291p595q515q683q561
$$ 594894 598321 601841 604353 605181 604726 603733 602250 599729 595870 590790 584499 576904 568389 559706 551145
59215E51145q682q610p564n830m517m100m126m242m370l992k480l34J120J576
$$ 551145 542463 533853 526289 520459 515942 511842 507716 503474 499104 495112 492632 492298 493418 494994
59201D94994K036K902L213K479J884K592L941M545M318M138M176L878L271L032
$$ 494994 497030 499932 503145 505624 507508 510100 514041 518586 522904 527042 531218 535096 538367 541399
59187E41399L404M101N063O313P283P266O527O008O003O008N735N423N119M539
$$ 541399 544803 548904 553967 560280 567563 574829 581356 587364 593367 599375 605110 610533 615652 620191
59173F20191L738L124K770K413K139K335K928L429L798M512N662O655O977O692
$$ 620191 623929 627053 629823 632236 634375 636710 639638 643067 646865 651377 657039 663694 670671 677363
59159F77363O060N245M473L922L335K208M18j721l905n925p472q369q856r153
$$ 677363 683423 688668 693141 697063 700398 702606 703024 701303 697398 691473 684001 675632 666776 657623
59145F57623r028q339p657p597p792p423o514n781n375m776l903l285k986k409
$$ 657623 648595 640256 632599 625002 617210 609787 603273 597492 592117 587341 583438 580153 577167 574758
59131E74758j347k59P01J968L565M698M859M546M506M905N616O634P826Q795R368
$$ 574758 573411 573152 573853 575821 579386 584084 588943 593489 597995 602900 608516 615150 622976 631771 641139
59116F41139R808J0281J0583J0544J0272R874R366Q870Q391P600O428N659O002
$$ 641139 650947 661228 671811 682355 692627 702501 711867 720737 729128 736728 743156 748815 754817
59103G54817O767O453M802L150K498K355J882J132N00j73j241k528l532l977l847
$$ 754817 761584 768037 772839 775989 778487 780842 782724 783856 784356 784183 782942 780414 776882 772905 769058
59088G69058l289k648k215j842j382j339k338m010n364o249p395q915j0004j0325
$$ 769058 765769 763121 760906 759064 757682 756343 754005 749995 744631 738382 730987 722072 712068 701743
59074G01743j0530j0998j1255j1085j0987j0951j0098q251o655o279o443o066
$$ 701743 691213 680215 668960 657875 646888 635937 625839 617588 610933 604654 598211 592145
59062E92145n279m770m550m316m300m661m830m380l904l958m000l393k765l036
$$ 592145 586866 582096 577546 573230 568930 564269 559439 555059 551155 547197 543197 539804 537039 534003
59048E34003l721l564k473j531j256j129q01n96p05q26p08l47L87J555K617K839
$$ 534003 530282 526718 524245 522714 521458 520329 519528 518932 518227 517401 516693 516346 516733 518288 520905 523744
59032E23744K322K020K529L449L979L846L553L949N437P497R254J0572J2084J3957
$$ 523744 526066 528086 530615 534064 538043 541889 545442 549391 554828 562325 571579 582151 594235 608192
59018F08192J5496J6275J6803J7429J7455J6182J4002J1511Q284L816q84l969
$$ 608192 623688 639963 656766 674195 691650 707832 721834 733345 741629 745445 744561 740592
59006G40592m897m707m303l641k643j671q04M13K084L577M322M373L964L050J597
$$ 740592 735695 730988 726685 723044 720401 718730 717926 718339 720423 724000 728322 732695 736659 739709 741306
58991G41306j18j753l119m117m792n481o499p670q433q510q170p915q015q260
$$ 741306 741188 739435 736316 732199 727407 721926 715427 707757 699324 690814 682644 674729 666714 658454
58977F58454q013o763m787k961j738o94P32K516M312N903P042P461P492P998R156
$$ 658454 650441 643678 638891 635930 634192 633498 634230 636746 641058 646961 654003 661464 668956 676954 686110
58962F86110R894R303P973P146P010O691N557L710J464q78k935m643o540q966
$$ 686110 696004 705307 713280 720426 727436 734127 739684 743394 744858 743980 741045 736402 729862 720896
58948G20896j1318j2690j2972j2628j1772j0288q550p175o208n280m329l424k297
$$ 720896 709578 696888 683916 671288 659516 649228 640678 633503 627295 622015 617686 614262 611965
58935F11965q73Kn99k249l550l836l684l696l774l636l299k883k538k598l176
$$ 611965 611092 611094 610495 608246 604696 600860 597176 593480 589706 586070 582771 579888 577350 574752 571576
58920E71576l686l454k718k328k547k867k942k877k641k009j148m94pP61J784
$$ 571576 567890 564436 561718 559390 556843 553976 551034 548157 545516 543507 542359 541865 541858 542619 544403
58905E44403K565L076L934N465P267Q924J0434J1748J2512J2595J2292J1768J0802
$$ 544403 546968 550044 553978 559443 566710 575634 586068 597816 610328 622923 635215 646983 657785
58892F57785R412Q282Q148R025J0344J1706J3219J5118J7216J8812J9180J8173
$$ 657785 667197 675479 683627 692652 702996 714702 727921 743039 760255 779067 798247 816420
58880H16420J6184J3705J1134Q854P008N142K671l16l264o164r406j2497j4073
$$ 816420 832604 846309 857443 866297 873305 878447 881118 880802 877538 871374 861968 849471 835398
58867H35398j3724j2774j2495j2480j1699j0236q918p913o880o051o032o803p845
$$ 835398 821674 808900 796405 783925 772226 761990 753072 745159 738279 732228 726196 719393 711548
58854G11548q944j0093j0902j1006j0728j0569j0379r728q641p328n742m147l396
$$ 711548 702604 692511 681609 670603 659875 649306 638927 629199 620558 613230 607488 603341 599945
58841E99945l780m340m219m000m658n937o834o959o323m694k454j188j834l054
$$ 599945 596165 591825 587606 583606 578948 573011 566177 559218 552895 548201 545747 544559 542725 539671
58827E39671l032k157k093k922l229k617j975j446k67J225J582N55l89k72K92
$$ 539671 536639 534482 532389 529467 526238 523621 521646 520200 519933 521158 522740 523295 522906 522634 522926
58812E22926O16Q42J054R68Q69J420K279K395J798J524J652J160m4q41r08j165
$$ 522926 523542 524384 525438 526406 527275 528695 530974 533369 535167 536691 538343 539503 539459 538618 537710 536545
58796E36545j807j866j275j293k183k498j640j043j660k228j466j81L87P28J915
$$ 536545 534738 532872 531597 530304 528121 525623 523983 522940 521280 519052 517586 517405 517792 518520 520435
58781E20435L494M371M716N327N957N930N753O348P143O494L956Q14j568k973
$$ 520435 523929 528300 533016 538343 544300 550230 555983 562331 569474 575968 579924 580738 579170 576197
58767E76197l873m687n535o152o091n353m572m236m138l894l450k809j825n79
$$ 576197 572324 567637 562102 555950 549859 544506 539934 535698 531560 527666 524216 521407 519582 519003
58753E19003N56J504K462L183L106K395J940J985J875J458J518K350L123L393
$$ 519003 519559 521063 523525 526708 529814 532209 534149 536134 538009 539467 540985 543335 546458 549851
58739E49851M007N576P182P694P434P445P819P946P823P973Q385Q516Q191P736
$$ 549851 553858 559434 566616 574310 581744 589189 597008 604954 612777 620750 629135 637651 645842 653578
58725F53578P337O852O063M762K863P56q87j809k271k337j718m47R77K369L921
$$ 653578 660915 667767 673830 678592 681455 682211 681324 679515 677244 674907 673189 672742 673719 676088 680009
58710F80009N384O014N631M848L977K646P22j361l488n995q622j0438j1298j2162
$$ 680009 685393 691407 697038 701886 705863 708509 709231 707870 704382 698387 689765 679327 668029 655867
58696F55867j3532j4733j5285j5729j6380j6460j5245j3114j0801q576o779o048
$$ 655867 642335 627602 612317 596588 580208 563748 548503 535389 524588 516012 509233 503185
58684E03185o283o354n629m722m200l694k914k346k140j577m76J03n02j304j058
$$ 503185 496902 490548 484919 480197 475997 472303 469389 467043 464903 463326 462850 462953 462451 461147 460089
58669D60089J53J647L272M864N687N561N550O475P674Q116P785O962N281K625
$$ 460089 460242 461889 465161 470025 475712 481273 486823 493298 500972 509088 516873 523835 529116 531741
58655E31741m5j845l028l982m289l810l506m041m645m572m515n198n734m941l349
$$ 531741 531696 529851 526823 522841 518552 514742 511236 507195 502550 497978 493463 488265 482531 477590 474241
58640D74241k350k167k148k304k949l487l029j833p81O4J067J881K055K173K977
$$ 474241 471891 469724 467576 465272 462323 458836 455807 453974 453193 453257 454324 456205 458260 460433 463410
58625D63410L819L423J873M93J6R0L27P11J092J336J799K838M138N201O047O712
$$ 463410 467229 470652 472525 473018 473034 473124 473451 474162 475254 476590 478389 481227 485365 490566 496613 503325
58609E03325O767O062N307N028M677L641K368J577J155P60P01J170J466R58J62
$$ 503325 510092 516154 521461 526489 531166 534807 537175 538752 539907 540667 541368 542538 544004 544962 545124
58594E45124j50j58l79o99r05j285j710j199O58K774M142N197O596P886Q594R376
$$ 545124 544974 544816 544437 543738 542833 541548 539838 538639 539297 542071 546213 551410 558006 565892 574486 583862
58578E83862J0667J1371J0463Q864Q105Q092P780P112O727O540O156O036O841
$$ 583862 594529 605900 616363 625227 633332 641424 649204 656316 663043 669583 675739 681775 688616
58565F88616Q355J0229J2768J5849J8235J9439K0871K3594K6229K6910K5940K4596
$$ 688616 696971 707200 719968 735817 754052 773491 794362 817956 844185 871095 897035 921631
58553I21631K2583J8947J4436J0605P306L345j053m538o834q659j0020j0569j0980
$$ 921631 944214 963161 977597 988202 995508 998853 997800 993262 986428 977769 967749 957180 946200
58540I46200j2114j3442j4226j5318j7728k0353k1387k1192k1381k1835k1163
$$ 946200 934086 920644 906418 891100 873372 853019 831632 810440 789059 767224 746061
58529G46061j9539j8358j7424j5140j1417p964n713m147l089k843k720j625n4
$$ 746061 726522 708164 690740 675600 664183 656219 650506 646359 643270 640427 637707 636082 636028
58516F36028N67L34M95R27M13q22j244o44k59k49M57J690J854N32r51j795k509
$$ 636028 636595 636929 637424 638351 638764 637942 636698 636054 635795 635546 636003 637693 639547 640079 639128 637333 634824
58499F34824l203l190k522j987j495m02O52M37n08m05Q50J666J625J940K930L541
$$ 634824 631621 628431 625909 623922 622427 622025 622677 623114 622606 622201 623051 624717 626342 628282 631212 634753
58483F34753L732M827P004Q804R671J0800J2849J4855J6076J6909J7504J7195
$$ 634753 638485 643312 650316 659120 668791 679591 692440 707295 723371 740280 757784 774979
58471G74979J5839J3911J1166O958J997k140n274q384j1215j2327j1628j0511
$$ 774979 790818 804729 815895 822853 824850 822710 817436 809052 797837 785510 773882 763371
58459G63371r399p429m743k709j532O5K477M694O364Q063R394R148P623O332N229
$$ 763371 753972 746543 741800 739091 737559 737624 740101 744795 751159 759222 768616 777764 785387 791719 796948
58444G96948K705j306m826o843q350r821j0189q972p158n416l524j910j419j298
$$ 796948 799653 798347 793521 786678 778328 768507 758318 749346 742188 736772 733248 731338 729919 728621
58430G28621J29K543L942M057M782O843Q846J0049J1313J2706J2999J2140J1489
$$ 728621 728750 731293 735235 739292 744074 750917 759763 769812 781125 793831 806830 818970 830459
58417H30459J0958Q838N075J827k5k011m854p052p755q159q988r272q657q332
$$ 830459 841417 850255 855330 857157 857132 855121 850267 843215 835460 827301 818313 809041 800384 792052
58403G92052q569p997o232m676l837k494l95J023J395K166L689M429L920L580
$$ 792052 783483 775486 769254 764578 760741 758247 757852 758875 760270 762436 766125 770554 774474 778054
58389G78054L786L131J468N01M31o47k904l875k701j840k894m032l364j730l38
$$ 778054 781840 784971 786439 786940 787371 786724 783820 779945 777244 775404 772510 768478 765114 763384 763046
58374G63046J431M037O332P810R591J1797J2713J1939J1416J1977J1999J0906
$$ 763046 764477 768514 774846 782656 792247 804044 816757 828696 840112 852089 864088 874994
58362H74994J0694J2330J3875J3960J3909J4637J4685J3308J2294J2658J2590
$$ 874994 885688 898018 911893 925853 939762 954399 969084 982392 994686 1007344 1019934
58351A019934J0701Q349O759M857K024k3j24L30K80R61L202N587P144Q926J1226
$$ 1019934 1030635 1038984 1045743 1050600 1052624 1052601 1052477 1052807 1053087 1054048 1057250 1062837 1069981 1078907 1090133
58336A090133J2344J1853J1942J3703J5266J5338J5337J6196J6389J5018J3641
$$ 1090133 1102477 1114330 1126272 1139975 1155241 1170579 1185916 1202112 1218501 1233519 1247160
58325A247160J3203J2348J0354Q524P315N597L880M328O393O787N076M565O269
$$ 1247160 1260363 1272711 1283065 1291589 1298904 1304501 1308381 1312709 1319102 1325889 1330965 1335530 1341799
58312A341799P138O123O445R491J1989J1976J2124J4129J5377J4482J4663J7878
$$ 1341799 1348937 1355060 1361505 1370996 1382985 1394961 1407085 1421214 1436591 1451073 1465736 1483614
58300A483614K0835K0772K0122K1471K2801K1872K0487K0371J9578J7043J5872
$$ 1483614 1504449 1525221 1545343 1566814 1589615 1611487 1631974 1652345 1671923 1688966 1704838
58289A704838J8048K0521K0658K0716K2891K4946K4981K5441K8124L0292K9977
$$ 1704838 1722886 1743407 1764065 1784781 1807672 1832618 1857599 1883040 1911164 1941456 1971433
58278A971433K9949L2183L3860L3167L3234L5845L7362L5688L4928L8007M1199
$$ 1971433 2001382 2033565 2067425 2100592 2133826 2169671 2207033 2242721 2277649 2315656 2356855
58267B356855M1464M2501M7554N2953N5153N7520O3306O8575O9287O9017P2276
$$ 2356855 2398319 2440820 2488374 2541327 2596480 2654000 2717306 2785881 2855168 2924185 2996461
58256B996461P6339P7141P7046P9260Q0705P8176P5460P6734P9192P9706Q1969
$$ 2996461 3072800 3149941 3226987 3306247 3386952 3465128 3540588 3617322 3696514 3776220 3858189
58245C858189Q9213R6963J01214J06329J16361J26450J31919J37718J49113J61280
$$ 3858189 3947402 4044365 4145579 4251908 4368269 4494719 4626638 4764356 4913469 5074749
58235E074749J68539J75553J88355K02703K12871K23549K40949K60496K75872
$$ 5074749 5243288 5418841 5607196 5809899 6022770 6246319 6487268 6747764 7023636
58226G023636K91828L15061L41082L63490L87395M19782M55784M88954N25549
$$ 7023636 7315464 7630525 7971607 8335097 8722492 9142274 9598058 10087012 10612561
58217A0612561N73619O28051O82183P43440Q20807R08348R98924J102249J230634
$$ 10612561 11186180 11814231 12496414 13239854 14060661 14969009 15967933 17070182 18300816
58208A8300816J380040J545407J740794J982713K269018K598002K992109L477658
$$ 18300816 19680856 21226263 22967057 24949770 27218788 29816790 32808899 36286557
58200C6286557M060114M747928N580233O599784P822310R269641J1010636J3136150
$$ 36286557 40346671 45094599 50674832 57274616 65096926 74366567 85377203 98513353
58192I8513353J5730162J8905703K2804801K7460688L2638839L7777793M1890701
$$ 98513353 114243515 133149218 155954019 183414707 216053546 253831339 295722040
58185B95722040M3379420M0249660L1199787J6973032N26613j4514810k5812663
$$ 295722040 339101460 379351120 410550907 427523939 428050552 413535742 387723079
58178C87723079l2952543l6607382l7524613l6284080l3517428k9927114k6078651
$$ 387723079 354770536 318163154 280638541 244354461 210837033 180909919 154831268
58171A54831268k2316831j8853833j5819299j3237491j1058669r238093p748915
$$ 154831268 132514437 113660604 97841305 84603814 73545145 64307052 56558137
58164E6558137o540605n544443m718145m044371l493328l025573k625107k294755
$$ 56558137 50017532 44473089 39754944 35710573 32217245 29191672 26566565 24271810
58156B4271810k023695j789326j584920j416800j278916j155569j044193r51653
$$ 24271810 22248115 20458789 18873869 17457069 16178153 15022584 13978391 13026738
58148A3026738q72771p94653p17701o51613n95010n38478m83315m38401m02440
$$ 13026738 12153967 11359314 10641613 9990000 9394990 8856512 8373197 7934796 7532356
58139G532356l67067l33857l11236k97793k84546k70411k60272k51311k36293
$$ 7532356 7165289 6831432 6520196 6222403 5937857 5667446 5407174 5155863 4919570
58130D919570k17459k02941j92190j78531j62983j52123j44951j35127j23721
$$ 4919570 4702111 4499170 4306980 4128449 3965466 3813343 3668392 3533265 3409544
58121C409544j17005j13871j07772r9137r3920r1727q7016q0306p6914p6147p2608
$$ 3409544 3292539 3178668 3070896 2971759 2877839 2786112 2699096 2618790 2541876 2465729 2393121
58110B393121o6808o3904o3318n9968n4493n2166n2816n1595m8525m7782m8633
$$ 2393121 2326313 2262409 2199091 2139123 2084630 2032464 1979648 1928053 1879528 1831746 1783113
58099A783113m6554m2314m0743m1530m0167l7019l6399l7594l5799l1301k8897
$$ 1783113 1736559 1694245 1653502 1611972 1571805 1534786 1498387 1460793 1424994 1393693 1364796
58088A364796k8771k6575k2288k0415k1496k1580k0086k0270k1997k1819k0175
$$ 1364796 1336025 1309450 1287162 1266747 1245251 1223671 1203585 1183315 1161318 1139499 1119324
58077A119324k0782k3028k2568j9497j8288j9541j9343j7047j6212j7388j7204
$$ 1119324 1098542 1075514 1052946 1033449 1015161 995620 976277 959230 943018 925630 908426
58066I08426j5258j4790j5905j5067j2037j0551j1289j0817q346p071p913q309
$$ 908426 893168 878378 862473 847406 835369 824818 813529 802712 794366 787295 779382 771073
58054G71073p987r616j2785j3693j1860j0994j2057j1702q854o746o840o542m727
$$ 771073 763086 753470 740685 726992 715132 704138 692081 680379 671525 664779 657939 651397 646670
58041F46670l940n297o345n749n380o148o423n826o114p141o643m964n259p950
$$ 646670 642730 637433 631088 625339 619959 613811 607388 601562 595448 588307 581664 576700 571441 563491
58027E63491r753r265q700r073q520o713o060p112p369o048n467o342o290m527
$$ 563491 553738 544473 535773 526700 518180 511467 505407 498295 490926 484878 479411 473069 466779 462252
58013D62252l443l945l736j938r47j885k492j481q36j761k363j406n72q98o54
$$ 462252 458809 454864 451128 449190 448243 446358 443866 442385 441549 439788 437425 436019 435447 434549 433895
57998D33895J082K261J431K89N94J498J824K100K580K054K69j086j254j548k586
$$ 433895 434977 437238 438669 438958 439552 441050 442874 444974 447554 449608 449877 448791 447537 445989 443403
57983D43403l163k980l417m551m569l366l331n205o468n488m051l938m175l535
$$ 443403 440240 437260 433843 429292 424723 421357 418026 412821 406353 400865 396814 392876 388701 385166
57969C85166k907l106k895j257N84J215J052R03N80K40R27K491L093J965N71N8
$$ 385166 382259 379153 376258 375001 375585 376800 377852 378755 379335 379575 380502 382993 386086 388051 388622 388680
57953C88680k20p46q06l54n53j441j408P4J449J723J751K089K141K133L344N476
$$ 388680 388460 387714 386908 386554 386001 384560 383152 383226 384675 386398 388149 390238 392379 394512 397856 403332
57937D03332O526O237O823R175J1128J0915R588Q619P666O204M946M071K291q72
$$ 403332 409858 416095 422918 432093 443221 454136 463724 472343 480009 486213 491159 495230 497521 496649
57923D96649l900n635o796q130r140r631j0321j1063j0716r590r537j0674j0747
$$ 496649 492749 487114 480318 472188 463048 453417 443096 432033 421317 411727 402190 391516 380769
57910C80769q725o360n038l812j926n61m77n03J39L65m50j122r97j208k191k429
$$ 380769 372044 365684 360646 356834 354908 354347 353870 353367 353506 353871 353421 352299 351302 350094 347903 345474
57894C45474j266l77q15j083O4J378J552J532K386L070K438J463J361J347L14
$$ 345474 344208 343831 343016 341933 341997 343375 344927 346459 348845 351915 354353 355816 357177 358524 358838
57879C58838r56j299j366k340l851m886n482n978n898n050m374m409m357l794
$$ 358838 357882 356583 355217 352877 349026 344140 338658 332680 326782 321732 317358 312949 308592 304798
57865C04798l656m320m511l422k120j495o75J027K429K434K045K758M342N697
$$ 304798 301142 296822 292311 288889 286769 285274 284599 285626 288055 290489 292534 295292 299634 305331
57851C05331O598P189P083O255N555N278M558L050J618O12p15k263k735k124k328
$$ 305331 311929 319118 326201 332456 338011 343289 347847 350897 352515 353127 352412 350149 347414 345290 342962
57836C42962m039n278m520k996k320k000j102l19m71o70J42J336J933K275K934
$$ 342962 338923 333645 329125 326129 323809 321809 320707 320388 319917 319247 319389 320725 322658 324933 327867
57821C27867L470L650M284N537O149N558M980N135M928L591J956L30k520o678
$$ 327867 331337 334987 339271 344808 350957 356515 361495 366630 371558 375149 377105 377435 374915 368237
57807C68237r864j0716j0836j1704j2055j0534q533p843p610o200m263l436l603
$$ 368237 358373 347657 336821 325117 313062 302528 293995 286152 278542 272342 268079 264643 261040
57794B61040l737l823l876k880q28J96p85j520j0K157K690K526L732N448N464
$$ 261040 257303 253480 249604 246724 245896 246092 245307 243787 243777 245934 248624 251150 254882 260330 265794
57779B65794M293M221N406O253O678P684Q643Q209P194P385Q137P321N012L121
$$ 265794 270087 274308 279714 285967 292645 300329 308972 317181 324375 331760 339897 347218 352230 355351
57765C55351J836k93l039m557m776n599p476q671q284p451p092o829o479o348
$$ 355351 357187 356894 353855 349298 344522 338923 331447 322776 314492 307041 299949 293120 286641 280293
57751B80293n860m035j607m62q07j013m57l47j349k467k785k517j970j097l81
$$ 280293 274433 270398 268791 268329 267522 266509 266052 265705 264356 261889 259104 256587 254617 253520 253139
57736B53139n82j319j397o71j67l51p36j141j791k233j668l63N67P70P40O38L18
$$ 253139 252557 251238 249841 249170 249003 248652 247916 246775 244984 242751 241083 240720 241287 242057 242797 243435 243753
57719B43753J90O41R61K83q48j303j259j723k666l229l312l349l100k267j710
$$ 243753 243943 244584 245545 245828 244980 243677 242418 240695 238029 234800 231488 228139 225039 222772 221062
57704B21062k276l080k751j769j612k207k291j771j525j360m20P22P11j24k44
$$ 221062 218786 215706 212955 211186 209574 207367 205076 203305 201780 200420 200000 200722 201433 201309 201065
57689B01065L01mj274j872j156k24L12J059K027K345K239L148N317P341Q639J0440
$$ 201065 201366 201362 200088 198216 197060 196836 197148 198207 200234 202579 204818 207966 213283 220624 229263 239703
57673B39703J3579J7344K1183K5866L2142L9837M8869N9430P0105P7063P5922
$$ 239703 253282 270626 291809 317675 349817 389654 438523 497953 568058 645121 721043
57662G21043O3949M0962J0124k1785m7070o1685o6666o5216n9848n2392m4672
$$ 721043 784992 825954 836078 814293 767223 705538 638872 573656 513808 461416 416744
57651D16744l7776l1621k5966k1110j7238j4041j1405r544q264o983n603m498
$$ 416744 378968 347347 321381 300271 283033 268992 257587 248043 239779 232796 227193 222695
57639B22695l607k486j197j84N30J094J178O59L88J016J608R36m30j077j148j828
$$ 222695 219088 216602 215405 215221 215751 216845 218023 218682 219070 220086 221694 222630 222200 221123 219975 218147
57623B18147k844k716j428o29j025j658j977k556l342l283k261j530j685j888
$$ 218147 215303 212587 211159 210530 209505 207847 205870 203314 199972 196689 194428 192898 191213 189325
57609A89325j589j280j099m25O78J174P42K02j3k56l86J33O59j27j807k383j365
$$ 189325 187736 186456 185357 184932 185610 186784 187526 187728 187715 187459 187073 187206 187865 187738 185931 183548 182183
57592A82183n86j283k447k997l418m186m410l368j911j128r58r99j342j733j357
$$ 182183 181597 180314 177867 174870 171452 167266 162856 159488 157577 156449 155491 154492 153150 151417 150060
57577A50060l31L3o71j106l93L46k26j653k652k903k768k289j551j159j394j657
$$ 150060 149729 149762 149091 147985 147592 147938 147712 146059 143407 140504 137736 135447 133896 132737 131343 129686
57561A29686j387p34P7J057J725J290K6p45m80M1L09P68J495J735J362J197J349
$$ 129686 128299 127565 127642 128699 130424 131714 131740 130995 130515 130556 130865 131633 133128 134863 136225 137422 138771
57544A38771Q72k80p93k33O1o81j298p69R1L09M15J001J231L43p08p42k33k02
$$ 138771 139643 139363 138570 138337 138398 137717 136419 135650 135741 136050 136465 137466 138697 139040 138332 137590 137357 137155
57526A37155l61J1M10J1n89j84J009J701J448R62Q00R35J329J971K642L168L548
$$ 137155 136794 136805 137215 137226 136637 136453 137462 139163 140611 141573 142373 143308 144637 146608 149250 152418 155966
57509A55966L425K255M95m53j00M36K66nK68L38o35k019k644k468k184k032k069
$$ 155966 159391 161646 162141 161688 161588 162024 162290 162285 162553 162891 162256 160237 157593 155125 152941 150909 148840
57492A48840k727l885m335l328j873j288j259o90L13O92K44k17k07K4K38M46O04
$$ 148840 146113 142228 137893 134565 132692 131404 130145 129455 129768 130460 130704 130487 130280 130304 130542 130988 131592
57475A31592P28R85J176P23l62j237j505j844k659l169k665j701j085o44JL46
$$ 131592 132320 133305 134481 135204 134842 133605 132100 130256 127597 124428 121763 120062 118977 118333 118334 118680
57459A18680j88j080j413j104n26K98J170J271L34n20k81M27L86l84r85j170j237
$$ 118680 118492 117412 115999 114895 114369 114667 115837 117108 117442 116922 116641 117068 117454 117070 116085 114915 113678
57442A13678j042l07M70O04K84J25J42Q4K25P48R10j5j404j894j086K69J357J775
$$ 113678 112636 112329 112799 113403 113687 113812 113954 114038 114263 115011 115921 115906 114502 112608 111522 111791 113148 114923
57424A14923J349L47m25m75j79l2L0J15n4m71o37n62r39j699j663m51N78M39J19
$$ 114923 116272 116619 116194 115719 115540 115508 115538 115653 115599 115128 114491 113929 112990 111291 109628 109177 109755 110194 110313
57405A10313P97J691J380J76n48n45n27m91L5O11L71m20q05p13p30o82K1J041
$$ 110313 111110 112801 114181 114357 113809 113264 112737 112246 112281 112892 113263 112843 112038 111325 110595 109913 109934 110975
57387A10975J514J485J566J632J289J111J878K909K846J807J159J265J216O97
$$ 110975 112489 113974 115540 117172 118461 119572 121450 124359 127205 129012 130171 131436 132652 133349
57373A33349M58O61M19n93j514j684j566j759k107k215k080j811j397r23n44k58
$$ 133349 133807 134468 134887 134294 132780 131096 129530 127771 125664 123449 121369 119558 118161 117238 116694 116436
57357A16436k2J38M89J483K782L206K394J580J762K119J580Q76J285K171J824
$$ 116436 116414 116552 117041 118524 121306 124512 126906 128486 130248 132367 133947 134823 136108 138279 140103
57342A40103L39m96j30M7p50j413q61L78J253J589J617J208L16n92j090j167q34
$$ 140103 140442 139946 139816 139863 139113 137700 136839 137217 138470 140059 141676 142884 143200 142608 141518 140351 139517
57325A39517k1R36J432J365J087O68p5r01j364j584j898j967j196K6O41L93oj77
$$ 139517 139496 140432 141864 143229 144316 144984 144909 144008 142644 141060 139162 137195 135999 136025 136666 137059 137053 136876
57307A36876m24p12m91K48P35N47Q8j51j11J48M91M64k25j104j504j452j198l82
$$ 136876 136452 135740 135249 135497 136232 136779 136867 136716 136605 136753 137244 137708 137483 136379 134875 133423 132225 131843
57289A31843J161K302J762J61o73l25j34p73j212n95M18Q54P17M31K6m35n57l59
$$ 131843 133004 135306 137068 137229 136556 136231 136097 135324 134112 133517 133935 134789 135506 135937 135963 135528 134971 134612
57271A34612m03p19m81P42K221L122L547M039M675N203N474N404N002M602M532
$$ 134612 134209 133490 133009 133751 135972 139094 142641 146680 151355 156558 162032 167436 172438 177040 181572
57256A81572M511L988L090K422J992J300N65P02J805K707K553J899J750K223K727
$$ 181572 186083 190071 193161 195583 197575 198875 199440 200142 201947 204654 207207 209106 210856 213079 215806
57241B15806K827K439J707J091J161J975L031L928M576M797M353L460K720K421
$$ 215806 218633 221072 222779 223870 225031 227006 230037 233965 238541 243338 247691 251151 253871 256292
57227B56292K428K692L205L587L469L314L997N494O742O998O631O482O952P846
$$ 256292 258720 261412 264617 268204 271673 274987 278984 284478 291220 298218 304849 311331 318283 326129
57213C26129Q484Q135O834N661N560O184O561O545O723P278P948Q840J0135J1246
$$ 326129 334613 342748 349582 355243 360803 366987 373548 380093 386816 394094 402042 410882 421017 432263
57199D32263J1401J0847J0409J0101R428Q805R184J0324J0900J0473R956R950
$$ 432263 443664 454511 464920 475021 484449 493254 502438 512762 523662 534135 544091 554041
57187E54041J0103J0326J1157J2559J3695J4268J4770J5170J4791J3904J3789
$$ 554041 564144 574470 585627 598186 611881 626149 640919 656089 670880 684784 698573
57176F98573J4659J5119J4428J3812J4505J5851J6474J6254J5970J5847J5640
$$ 698573 713232 728351 742779 756591 771096 786947 803421 819675 835645 851492 867132
57165H67132J5528J5969J6939J8025J8879J9222J8984J8728J9200K0158K0498
$$ 867132 882660 898629 915568 933593 952472 971694 990678 1009406 1028606 1048764 1069262
57154A069262J9953J9611K0311K1518K2463K3309K4369K5119K4980K4465K4601
$$ 1069262 1089215 1108826 1129137 1150655 1173118 1196427 1220796 1245915 1270895 1295360 1319961
57143A319961K5646K7097K8570L0040L1519L2995L4452L5675L6495L7366L9044
$$ 1319961 1345607 1372704 1401274 1431314 1462833 1495828 1530280 1565955 1602450 1639816 1678860
57132A678860M1488M3810M5570M7338M9634N2164N4565N7097O0066O3206O6189
$$ 1678860 1720348 1764158 1809728 1857066 1906700 1958864 2013429 2070526 2130592 2193798 2259987
57121B259987O9235P2770P6950Q1764Q7164R2934R9028J06122J15169J26332J39116
$$ 2259987 2329222 2401992 2478942 2560706 2647870 2740804 2839832 2945954 3061123 3187455 3326571
57110C326571J53550J70363J89939K12065K37032K66132L01074L43781L96810
$$ 3326571 3480121 3650484 3840423 4052488 4289520 4555652 4856726 5200507 5597317
57101E597317M62876N43915O41595P58719Q98771J063902J254768J472337J718073
$$ 5597317 6060193 6604108 7245703 8004422 8903193 9967095 11221863 12694200 14412273
57092A4412273J991455K288457K602804K926943L250412L558047L830811M048263
$$ 14412273 16403728 18692185 21294989 24221932 27472344 31030391 34861202 38909465
57084C8909465M190522M238965M175251L978994L628206L106906K417176J586563
$$ 38909465 43099987 47338952 51514203 55493197 59121403 62228309 64645485 66232048
57076F6232048O65809k80201j184445j991440k668284l205485l607050l879788
$$ 66232048 66897857 66617656 65433211 63441771 60773487 57568002 53960952 50081164
57068E0081164m030337m067334m002451l849990l627473l355658l055480k744634
$$ 50081164 46050827 41983493 37981042 34131052 30503579 27147921 24092441 21347807
57060B1347807k437298k145105j876183j633999j418993j231019j069140r30435
$$ 21347807 18910509 16765404 14889221 13255222 11836229 10605210 9536070 8605635
57052H605635q11168p08894o22012n48034m84022m28310l80243l38592l01794
$$ 8605635 7794467 7085573 6463561 5915527 5431505 5003195 4622952 4284360 3982566
57043C982566k69338k41486k17689j96655j77744j61013j46073j32053j18590
$$ 3982566 3713228 3471742 3254053 3057398 2879654 2718641 2572568 2440515 2321925
57034B321925j05836r3632q1429o8709n4852l9248k2120m259J4412L3973N0382
$$ 2321925 2216089 2122457 2041028 1972319 1917467 1878219 1856099 1851840 1866252 1900225 1950607
57023A950607N4287L7608J950m1243p9044j04436j16790j18606j13241j03928
$$ 1950607 2004894 2042502 2044452 2003209 1924165 1819729 1702939 1584333 1471092 1367164
57013A367164r2959q1601p0786o1307n3365m6748m1394l7110l3102k8790k4867
$$ 1367164 1274205 1192604 1121818 1060511 1007146 960398 919004 881894 848792 820002 795135
57002G95135k2411k1205k0037j8524j7326j6581j5436j3406j1067r091p514o234
$$ 795135 772724 751519 731482 712958 695632 679051 663615 650209 639142 630051 622537 616303
56990F16303n304m522l373j654M53K934N889Q851J0718J0417P374J670n557j2336
$$ 616303 610999 606477 603104 601450 601903 604837 610726 619577 630295 640712 648086 649756 644199 631863
56976F31863j7254k0460k2682k3773k3054k0691j7624j4427j1202q342o289m604
$$ 631863 614609 594149 571467 547694 524640 503949 486325 471898 460696 452354 446065 441461
56964D41461k333P09L870O792R723J2798J5880J8960K1731K2790K0311J3826M778
$$ 441461 439128 439837 443707 450499 460222 473020 488900 507860 529591 552381 572692 586518 591296
56951E91296m707j2952j8922k2233k3241k2626k0874j8400j5750j3167j0315p053
$$ 591296 586589 573637 554715 532482 509241 486615 465741 447341 431591 418424 408109 401056
56939D01056l969j524Q55M010P953J2280J7099K2491K7526L0763L1308K8518K1444
$$ 401056 397087 395563 396418 400428 408381 420661 437760 460251 487777 518540 549848 578366 599810
56926E99810R985l716j6254k5344l0516l2160l1163k9024k6857k4367k0866j6961
$$ 599810 609795 606079 589825 564481 533965 501805 470642 441618 414761 390394 369528 352567
56914C52567j3960j1968j0072q171p052o666n943m546l343k839k447j758j295
$$ 352567 338607 326639 316567 308396 301344 294678 288735 284189 280846 278007 275560 273802 272507
56901B72507j419j537r52K17J407K308K920L431M185N391O890Q605J0870J3842
$$ 272507 271088 269551 268599 268816 270223 272531 275451 278882 283067 288458 295348 303953 314823 328665
56887C28665J6961J9646K1875K3311K2494J8122J0745K252n792j2357j6384j7514
$$ 328665 345626 365272 387147 410458 432952 451074 461819 464071 458279 445922 429538 412024
56875D12024j6885j5745j3712r858m968r71J599L888O705J0003J4196J9987K6796
$$ 412024 395139 379394 365682 355824 350856 349885 351484 355372 362077 372080 386276 406263 433059
56862D33059L3234L9361M6500N4208N9115N7475M7858L1295J0627r859k6019l6215
$$ 433059 466293 505654 552154 606362 665477 722952 770810 802105 812732 802873 776854 740639
56850G40639m1355m2542m0121l5026k9118k3271j6668q772o29O612J3283K0542
$$ 740639 699284 656742 616621 581595 552477 529206 512538 503766 503137 509749 523032 543574
56838E43574K9170L9536N1589O4309P6159Q6130R2960R3021Q1314N6108K1776
$$ 543574 572744 612280 663869 728178 804337 890467 983427 1076448 1157762 1213870 1235646
56827A235646j3840m4100o5500p7081p9801p6071o8612n9583n0500m2041l3681
$$ 1235646 1221806 1177706 1112206 1035125 955324 879253 810641 751058 700558 658517 624836
56816F24836k4643j5435p328j72P772J7410K7792L7944M8086N7958O5290O6863
$$ 624836 600193 584758 577430 577258 585030 602440 630232 668176 716262 774220 839510 906373
56804I06373O0211M4162J9675q841l4753n3319o3955o8059o6491o0343n2190m4479
$$ 906373 966584 1010746 1030421 1021580 986827 933508 869553 801494 735003 674660 622470 577991
56792E77991l7551l0745k4406j9237j4563r043k645L661R620J5698K1768K7166
$$ 577991 540440 509695 485289 466052 451489 442446 439801 443462 453082 468780 490548 517714
56780E17714L1573L4326L3242K5847J2271m100j9030k9939l6362l9171l9629l8515
$$ 517714 549287 583613 616855 642702 654973 650873 631843 601904 565542 526371 486742 448227
56768D48227l5948l2090k7734k3754k0417j7631j5432j3682j1825r621p676o649
$$ 448227 412279 380189 352455 328701 308284 290653 275221 261539 249714 240093 232417 225768
56756B25768o298n958n500n199m972m394l274j831n58j05p80j921k323j661r09
$$ 225768 219470 213512 208012 202813 197841 193447 190173 188342 187784 187679 186899 184978 182655 180994 180085
56741A80085r27j391j499j121o32k45j3K3P2M61R86J005M49j8j14k78n84l81M66
$$ 180085 179158 177767 176268 175147 174515 174270 174257 174280 174352 174813 175799 176804 177253 177235 177121 176843 176259 175878 176344
56722A76344J009O13m0j00J88J50j87l88l74j60M33J237J571J280J058J238J177
$$ 176344 177353 177966 177926 177826 178014 178164 177977 177589 177215 177055 177488 178725 180296 181576 182634 183872 185049
56705A85049N16K5L57Q64O17j42n24k59L52J061J539J310O35N65J417K008J324
$$ 185049 185565 185590 185947 186811 187428 187286 186762 186503 186855 187916 189455 190765 191400 191965 193382 195390 196714
56688A96714K6o34n38l66l41l70p06j373j595p98L86J007J034Q32K56q00j676
$$ 196714 196740 196106 195568 195202 194861 194491 193785 192412 190817 190019 190405 191412 192446 193278 193534 192734 191058
56671A91058j801j597j553j209j76O32J20j221j961j632q79j93L68N54J59l24
$$ 191058 189257 187660 186107 184898 184722 185354 185474 184253 182292 180660 179781 179588 179956 180510 180669 180345
56655A80345k55K64P77J277J892K368K617L097L858M069L376K772L061L468K987
$$ 180345 180090 180354 181131 182408 184300 186668 189285 192382 196240 200309 203685 206457 209518 212986 215973
56640B15973K126J904J967J331L07j8L06K89j71k83Nm1m38l58M55J312J653J515
$$ 215973 218099 220003 221970 223301 223608 223590 223896 224185 224014 223731 223736 223695 223257 222899 223354 224666 226319 227834
56622B27834J022L83O1K8o27k322l822l694k380j445j298j167r26j238k036k427
$$ 227834 228856 229239 229300 229328 228701 226379 222557 218863 216483 215038 213740 212573 211647 210409 208373 205946
56606B05946k193j911j663r68m9K36k00n76n70n72o00k57K74L59N7l9L9j22j65
$$ 205946 203753 201842 200179 199211 199162 199398 199198 198622 198052 197480 196880 196623 196897 197256 197313 197274 197313 197191 197026
56587A97026N64J496J397M73K52J081J448L87j000j238n09l8l02o66l36R16K606
$$ 197026 197590 199086 200483 200956 201208 202289 203737 204124 203124 201886 201377 201339 201037 200371 200035 200951 203557
56570B03557L781L817L114K668K949L663M384M875M994M956N477P046R240J1302
$$ 203557 207338 211155 214269 216937 219886 223549 227933 232808 237802 242758 248235 255281 264521 275823
56556B75823J2895J3600J2461R109M845J526l28j300j632j260q09j026j513j344
$$ 275823 288718 302318 314779 323888 328733 330259 329931 328631 326999 325739 324930 323904 322391 321047
56542C21047p75q77j729k374k484k612k932l131l428m279n132n041m341m204m539
$$ 321047 320272 319395 317666 315292 312808 310196 307264 304133 300705 296426 291294 286253 281912 277708 273169
56527B73169m136k948k348k750k869j980j121j229j617j299n59k06l31o83j406
$$ 273169 269033 266085 263737 260987 258118 256138 255017 253788 252171 250872 250313 250107 249776 249093 247687
56512B47687k544l527l852l701l376k768j845j017o22n30n76q16j157j350j389
$$ 247687 245143 241616 237764 234063 230687 227919 226074 225057 224435 223905 223329 222513 221356 220006 218617
56497B18617j413j218n34K84N73K73j62m96n97m1J171J932J294O8j15Q56J587
$$ 218617 217204 215986 215452 215736 216309 216582 216420 215924 215327 215286 216457 218389 219683 219751 219636 220492 222079
56480B22079J290M91k42p96q05O8J074J123N53O78J548J827J054L14L49P01J046
$$ 222079 223369 223860 223618 222822 222017 222085 223159 224282 224835 225513 227061 228888 229942 230256 230605 231306 232352
56463B32352J732K482K261J034J09J49L32N3p5L54O33K86l4J59L17%k58n3J12
$$ 232352 234084 236566 238827 239861 239970 240119 240451 240504 240429 240783 241416 241702 241668 241827 242144 242144 241886 241833 241945
56444B41945j20k27J28L48n0n97o77l60O0L99K24p36j617j132M45J379R68L99
$$ 241945 241825 241598 241726 242074 242024 241427 240750 240390 240450 240849 241073 240337 238720 237588 238033 239412 240380 240779
56426B40779O40J037P79K60J07J32P2J79L40o8q41p69M10J294R04J39J85P60R97
$$ 240779 241419 242456 243235 243495 243602 243734 243806 243985 244325 244257 243416 242647 243057 244351 245255 245394 245579 246339 247336
56407B47336Q46N39j81j266j777j188l24q0j19J86N06K89j29j19K90Q38J623K464
$$ 247336 248182 248721 248540 247274 245497 244309 243985 243905 243786 243972 244478 244767 244638 244519 244809 245647 247270 249734
56389B49734K650K047J637K115K795K740K094J569J314J092Q36M29l43j103j003
$$ 249734 252384 254431 256068 258183 260978 263718 265812 267381 268695 269787 270623 271052 270709 269606 268603
56374B68603KQ75R53P43Q26J059J313J865K506K396J421N71M57N57M57N96J102
$$ 268603 268605 269480 270433 271176 272002 273061 274374 276239 278745 281141 282562 283133 283590 284147 284604 285200 286302
56357B86302J212N62k8J67P37R96R21O59J84j96p2R4m99j349j083K66J166J105
$$ 286302 287514 288076 288048 288215 288952 289948 290869 291528 291712 291516 291444 291538 291039 289690 288607 288873 290039 291144
56339B91144J246K032K262J404P93J425K422K796K931L217K986K089J744K559
$$ 291144 292390 294422 296684 298088 298881 300306 302728 305524 308455 311672 314658 316747 318491 321050
56325C21050L362L191K760K769K562J705J134J299J040k62j234q53l74j152k216
$$ 321050 324412 327603 330363 333132 335694 337399 338533 339832 340872 340610 339376 338523 338149 336997 334781
56310C34781j894m07R48J810K225J673L33j13J224K767K879K453L126M383M551
$$ 334781 332887 332480 333428 335238 337463 339136 339469 339356 340580 343347 346226 348679 351805 356188 360739
56295C60739L502K289J197Q3l12N93J755J868J301J133J271J226J578K918M366
$$ 360739 364241 366530 367727 367810 367498 368091 369846 371714 373015 374148 375419 376645 378223 381141 385507
56280C85507M769M440M259M198M162M815O101O530N567M935N835O789O371N956
$$ 385507 390276 394716 398975 403173 407335 412150 418251 424781 430348 435283 441118 447907 454278 460234
56266D60234P253Q986Q943P766P681Q757R511J0211J2360J5491J7495J7954J8504
$$ 460234 467487 476473 485416 493182 500863 509620 519131 529342 541702 557193 574688 592642 611146
56253F11146K0199K2829K6402L1001L5575L9115M2489M6985N1843N5505N8392
$$ 611146 631345 654174 680576 711577 747152 786267 828756 875741 927584 983089 1041481
56242A041481O1879O5333O6888O6572O5908O4797O1481N5423M7742L8993K8872
$$ 1041481 1103360 1168693 1235581 1302153 1368061 1432858 1494339 1549762 1597504 1636497 1665369
56231A665369J7980P513k549j2885k2800l0892l7203m2669m7044m9609n1151n2778
$$ 1665369 1683349 1690862 1688313 1675428 1652628 1621736 1584533 1541864 1494820 1445211 1394060 1341282
56219A341282n3575n2075m9348m7807m7419m5964m2826l9598l7050l4292l1066
$$ 1341282 1287707 1235632 1186284 1138477 1091058 1045094 1002268 962670 925620 891328 860262
56208H60262k8338k6368k4455k2589k1251j9861j7578j5220j4108j3586j2069
$$ 860262 831924 805556 781101 758512 737261 717400 699822 684602 670494 656908 644839
56197F44839r941q767q260o837m725l586l414k719j568j464k241k103p90O6j30
$$ 644839 634898 626131 617871 611034 606309 602723 599309 596590 595022 593558 591317 589214 588424 588490 588360
56182E88360l25j72l53n76J24J192J221O44J133K573L387L529M222N154M929M080
$$ 588360 588035 587863 587510 586934 587058 588250 589471 590115 591248 593821 597208 600737 604959 610113 615042 619122
56166F19122M478N897O331N597N475O344O928P275Q708J0789J1690J1585J2360
$$ 619122 623600 629497 635828 641425 646900 653244 660172 667447 676155 686944 698634 710219 722579
56153G22579J3975J4636J4574J5989J9092K1813K3790K6940L1706L6528M1553
$$ 722579 736554 751190 765764 781753 800845 822658 846448 873388 905094 941622 983175
56142I83175M9107N9710P1294Q3029R6318J11057J24405J33969J38965J37764
$$ 983175 1032282 1091992 1163286 1246315 1342633 1453690 1578095 1712064 1851029 1988793
56132A988793J28287J11834R3290P6686O3489N5102N2612N3262N1280M3537L1282
$$ 1988793 2117080 2228914 2322204 2398890 2462379 2517481 2570093 2623355 2674635 2718172 2749454
56121B749454J6291m00j5587k4744k7434k8151l0841l6683m7440o5475q8519j09351
$$ 2749454 2765745 2765345 2749758 2725014 2697580 2669429 2638588 2601905 2554465 2488990 2400471 2291120
56109B291120j22956j29973j31689j26727j15173j01154q8178p5639o2470n0410
$$ 2291120 2168164 2038191 1906502 1779775 1664602 1563448 1475270 1399631 1337161 1286751
56099A286751m1014l3034k5399j9408j5611j1950p313l600k078j143L04Q84J92
$$ 1286751 1245737 1212703 1187304 1167896 1152285 1140335 1133022 1129422 1127344 1126201 1126505 1127389 1127581
56086A127581M34K385L470K241J049J868L176L391L802N530P013P076P215Q613
$$ 1127581 1128015 1130400 1133870 1136111 1137160 1139028 1142204 1145595 1149397 1154927 1161940 1169016 1176231 1184844
56072A184844J0052J0767J1908J3531J3804J2861J3390J5714J6725J5513J5314
$$ 1184844 1194896 1205663 1217571 1231102 1244906 1257767 1271157 1286871 1303596 1319109 1334423
56061A334423J7706J9793J9645J9600K1335K2605K1935K1719K3493K4672K3327
$$ 1334423 1352129 1371922 1391567 1411167 1432502 1455107 1477042 1498761 1522254 1546926 1570253
56050A570253K1677K1651K1465J9800J8819J9787K0318J9138J9000K1583K4245
$$ 1570253 1591930 1613581 1635046 1654846 1673665 1693452 1713770 1732908 1751908 1773491 1797736
56039A797736K5012K5937K8343K9797K9114K9194L1537L3267L2951L3770L7379
$$ 1797736 1822748 1848685 1877028 1906825 1935939 1965133 1996670 2029937 2062888 2096658 2134037
56028B134037M0491M1215M2671M6402M8636M7432M7075N0586N4338N5063N5656
$$ 2134037 2174528 2215743 2258414 2304816 2353452 2400884 2447959 2498545 2552883 2607946 2663602
56017B663602N8946O2151O3026O4932P0198P4938P6177P7588Q2444Q7633R0450
$$ 2663602 2722548 2784699 2847725 2912657 2982855 3057793 3133970 3211558 3294002 3381635 3472085
56006C472085R4285J01460J07647J09861J12583J19494J26733J31098J36914J47571
$$ 3472085 3566370 3667830 3775477 3885338 3997921 4117415 4244148 4375246 4512160 4659731
55996D659731J58387J65408J72928J84621J96082K04215K14739K31780K49537
$$ 4659731 4818118 4983526 5156454 5341075 5537157 5741372 5956111 6187891 6437428
55987F437428K63414K79350L02466L27021L47979L71622M03467M37026M66615
$$ 6437428 6700842 6980192 7282658 7609679 7957658 8329280 8732747 9169773 9636388
55978I636388M99748N44107N94239O44619P03123P77027Q58934R42402J037860
$$ 9636388 10136136 10680243 11274482 11919101 12622224 13399251 14258185 15200587 16238447
55969A6238447J156421J292719J442136J619610J841772K106982K414816K788126
$$ 16238447 17394868 18687587 20129723 21749333 23591105 25698087 28112903 30901029
55961C0901029L252632L813635M478512N281289O257030P416445Q780026J0414549
$$ 30901029 34153661 37967296 42445808 47727097 53984127 61400572 70180598 80595147
55953H0595147J2405940J4833837J7812949K1499185K5957212L0999631L6120027
$$ 80595147 93001087 107834924 125647873 147147058 173104270 204103901 240223928
55946B40223928M0389633M2250534L9655370L1065935J6857354k30032j6328230
$$ 240223928 280613561 322864095 362519465 393585400 410442754 410212722 393884492
55939C93884492k8430948l5496949l8105880l7485588l4851271l1195932k7229148
$$ 393884492 365453544 329956595 291850715 254365127 219513856 188317924 161088776
55932A61088776k3359970j9785823j6615881j3903947j1629169r728634q154471
$$ 161088776 137728806 117942983 101327102 87423155 75793986 66065352 57910881
55925E7910881o872264n828830m964260m245516l657431l172921k760330k408380
$$ 57910881 51038617 45209787 40245527 36000011 32342580 29169659 26409329 24000949
55917B4000949k117030j872873j656681j465619j305628j170108j046239r34400
$$ 24000949 21883919 20011046 18354365 16888746 15583118 14413010 13366771 12432371
55909A2432371q41868p64259o91028o22814n66559n19601m74383m32926m01507
$$ 12432371 11590503 10826244 10135216 9512402 8945843 8426242 7951859 7518933 7117426
55900G117426l76450l49533l22278l01252k84228k64351k43251k27144k14235
$$ 7117426 6740976 6391443 6069165 5767913 5483685 5219334 4976083 4748939 4534704
55891D534704j98410j81371j69087j59948j47992j34390j24523j16939j06217
$$ 4534704 4336294 4154923 3985836 3825888 3677896 3543506 3418983 3302044 3195827
55882C195827r3971q6554q4345q3078q3002q6938r1804r1802q7902q5179q3096
$$ 3195827 3101856 3015302 2930957 2847879 2764877 2677939 2586135 2494333 2406431 2321252 2238156
55871B238156p7551p0270o6876o7123o5834o2168n9623n8098n4250m8814m5723
$$ 2238156 2160605 2090335 2023459 1956336 1890502 1828334 1768711 1710613 1656363 1607549 1561826
55860A561826m4742m2257l8471l6770l6870l5549l3127l2504l2753l0442k6441
$$ 1561826 1517084 1474827 1436356 1399586 1362716 1327167 1294040 1261536 1228783 1198341 1171900
55849A171900k4810k5705k5857k5174k6383k8777k8791k6426k5050k5105k3913
$$ 1171900 1147090 1121385 1095528 1070354 1043971 1015194 986403 959977 934927 909822 885909
55838H85909k1341j9864j9351j7375j4476j3592j4423j3746j1164r409r065q115
$$ 885909 864568 844704 825353 807978 793502 779910 765487 751741 740577 731168 722103 713988
55826G13988o501o280p350p732p793r494j1870j2126j0797j1031j2919j3431j1797
$$ 713988 707487 701207 693857 686125 678332 668838 656968 644842 634045 623014 610095 596664 584867
55813E84867j0266r520q087o267o057p027o604m645l411l130j852K72J006M32
$$ 584867 574601 565081 556994 550727 544670 537643 531039 526394 522983 519853 518001 518273 519279 519711
55799E19711J033L096M186L535K952L077K639J667J596K008J004r92j614q21j000
$$ 519711 520744 523840 528026 531561 534513 537590 540229 541896 543492 545500 546504 545512 543898 543077 542077
55784E42077k566l364k754k682m237o652r769j3992j7643j8107j5796j3527j1961
$$ 542077 539511 536147 533393 530711 526474 519822 510053 496061 478418 460311 444515 430988 419027
55771D19027r371n727k992j112K007N967P427N023J112k187m960o853o327l755
$$ 419027 409656 403929 400937 399825 401832 407799 415226 420249 421361 419174 414214 407361 401034 397279
55757C97279j794j528j386o31o73j958k921l096m078o366q291r076r944j1227
$$ 397279 395485 393957 392571 391940 391267 389309 386388 383292 379214 372848 364557 355481 345537 334310
55743C34310j1409j0045q687p971o705m707l555l592l193j975j646k628l027k149
$$ 334310 322901 312856 304169 296198 289493 284786 281231 277639 274446 272471 270825 268197 265170 263021
55729B63021j920l345m556m014k901k682k859k806l337m790n674m917l506k586
$$ 263021 261101 257756 253200 249186 246285 243603 240744 237938 234601 229811 224137 219220 215714 213128
55715B13128j823q27k14q1O39K216L411L642L852M356M076K787J883J927J602
$$ 213128 211305 210478 210264 210183 210822 213038 216449 220091 223943 228299 232375 235162 237045 238972 240574
55700B40574J13j587k952m812p166q319p559o370n793m870l021j622j602j680
$$ 240574 240687 239100 236148 231336 224170 215851 208292 201922 196129 191259 188238 186616 185014 183334
55686A83334p11K48k9o49j55J162K211K978L941M855N384N727N587L994J186q77
$$ 183334 182623 182871 182842 182193 182038 183200 185411 188389 192330 197185 202569 208296 213883 217877 219063 218186
55670B18186j105p19j049j508j147n86q81j699k041j708r89M6J005J163P95J245
$$ 218186 217081 216362 215313 213805 212658 212072 211191 209492 207451 205743 204754 204800 205805 206968 207763 209008
55654B09008K746L667K806J059q1k57K74J311J953R00j455k863k208j007r17j528
$$ 209008 211754 215421 218227 219286 219205 218948 219222 220533 222486 223386 221931 219068 216860 215853 214936 213408
55638B13408j915k518l895n093n069m480m510m931m863m474m454m599m302l750
$$ 213408 211493 208975 205080 199987 194918 190438 185928 180997 176134 171660 167206 162607 158305 154555
55624A54555l450l225k645j838j121n03k11o79j514j541m97M10K74m31j073j782
$$ 154555 151105 147880 145235 143397 142276 141773 141562 140883 139369 137828 137331 137741 138015 137584 136511 134729
55608A34729k480k428j594j047j265j384r46q07j437j979j856j782k112j868o10
$$ 134729 132249 129821 128227 127180 125915 124531 123585 122778 121341 119362 117506 115724 113612 111744 111134
55593A11134L90J62l66j47J06o22j655j745j053n13k49M0Q3k13n4R70J905J943
$$ 111134 111524 111686 111320 111173 111279 110657 109002 107257 106204 105691 105442 105482 105565 105352 105298 106268 108173 110116
55575A10116J765K170K558K183J746K191K956K989K650K932L543L265J793j09
$$ 110116 111881 114051 116609 118792 120538 122729 125685 128674 131324 134256 137799 141064 142857 142748
55561A42748j804k991l322k834k298k284k542k868l553m271l827k022m46k40m33
$$ 142748 140944 137953 134631 131797 129499 127215 124673 121805 118252 113981 110154 108132 107686 107446 107013
55546A07013K25J117J061N04O14J120R36J71j63J0n3l76k91K92R38J623K410K705
$$ 107013 107238 108355 109416 109920 110534 111654 112590 112761 112598 112608 112555 112179 111888 112180 113118 114741 117151 119856
55528A19856K043J101Q64J165J234J020Q61L89r10k462l140k750k035j503j163
$$ 119856 121899 123000 123864 125029 126263 127283 128144 128533 127623 125161 122021 119271 117236 115733 114570
55513A14570j034j119j207j265j573j983j904j427j431k057k249j489o10k17K32
$$ 114570 113536 112417 111210 109945 108372 106389 104485 103058 101627 99570 97321 95832 95222 95005 95237
55498I5237Q70O78n26j130k14O88M7j146j213o35q22j363r60q1j34p25k60J114
$$ 95237 96107 96785 96259 95129 94915 95603 95650 94504 93291 92656 91834 90471 89511 89430 89296 88571 88311 89425
55480H9425J650Q95J63R8n9n81o71n9M77N02L64J48m19r81q94m42m84r59j159
$$ 89425 91075 91970 92133 92231 92172 91591 90920 90861 91338 91840 92204 92352 91933 90952 90058 89616 89132 88173 87014
55461H7014j156j531j911j404k93K75J58J22J30n45j524j473k52Q26J100J241
$$ 87014 85858 84327 82416 81012 80719 80994 81152 81274 81404 80859 79335 77862 77610 78436 79536 80777
55445H0777J539J216M2r29q73k33L02P50J186J213O14k59j030j547j463n20O42
$$ 80777 82316 83532 83574 82645 81772 81539 81841 82591 83777 84990 85604 85345 84315 82768 81305 80785 81427
55428H1427R34K08n83o99k42M61J162J382P61k23o60l68J20M55O00L13m96j136
$$ 81427 82361 82569 81986 81287 81045 81506 82668 84050 84811 84588 83928 83560 83680 84135 84735 85048 84552 83416
55410H3416r09j65L39P26J473J999J180q42k639l236k774j724n88j23n29p24K76
$$ 83416 82507 82342 82681 83407 84880 86879 88059 87217 84578 81342 78568 76844 76256 76133 75604 74880 75156
55393G5156J558J409o7j121j020p27q79q67l12J83K78M75R80J214R40O56N58K70
$$ 75156 76714 78123 78056 76935 75915 75188 74309 73442 73130 73313 73591 74066 75046 76260 77200 77856 78414 78684
55375G8684j63k03N9o5n29n52j21j24p01q76k26N03Q83J502K573L213K734J581
$$ 78684 78521 78318 78377 78312 77783 77231 77110 76986 76285 75409 75183 75686 76569 78071 80644 83857 86591 88172
55357H8172M41m82q53j76J034J312J63j113j236n30K7K85O38J005J021O46M3p34
$$ 88172 88613 88131 87278 87102 88136 89448 89611 88498 87262 86732 86759 87044 87682 88687 89708 90354 90397 89663
55339H9663j503j940k062k108j891r58M17J324J403J186J024O79J37j40LJ73K23
$$ 89663 88160 86220 84158 82050 80159 79201 79618 80942 82345 83531 84555 85234 85371 85231 85234 85407 85630
55322H5630L45L69r5o91n52L26R94R27M48j98r81j289m78O33M08j116k011j231
$$ 85630 85975 86344 86249 85558 85006 85332 86326 87253 87701 87503 86522 85233 84755 85388 85796 84680 82669 81438
55304H1438m4J19l50l82j5J22M4O1kk66k42L07P23M12j53j66L98J019J403J498
$$ 81438 81394 81513 81163 80781 80766 80888 80932 80993 80991 80725 80483 80790 81513 81925 81772 81606 82004 83023 84426 85924
55284H5924J301J016Q95P38K07k68R4J055J503J132P12M80l08j674k299j419q3
$$ 85924 87225 88241 89136 89874 90081 89813 89907 90962 92465 93597 94309 94789 94481 92807 90508 89089 89006
55267H9006L57n0n15p51p30j84P24J140P04J28k4j53n19m78L24J054Q80J71l68
$$ 89006 89363 89313 88798 88047 87317 87133 87857 88997 89701 89829 89805 89652 89133 88655 88979 90033 90913 91084 90716
55248I0716p69j172j128m62J22J72K59P38Q47Q8n97k88K69j23j113j349n35M26
$$ 90716 89947 88775 87647 87185 87307 87479 87738 88476 89323 89411 88814 88526 88795 88672 87559 86210 85675 86101
55230H6101Q41O88J3r47j477j158m97p0L96J143J427N50p49j191p78m54m12N2
$$ 86101 86942 87630 87643 86696 85219 84061 83564 83494 83890 85033 86460 87010 86261 85070 84292 83838 83426 83478
55212H3478J131K157K536K184J179j15q38m32M91Q41M06j60l60k00K31P00O41
$$ 83478 84609 86766 89302 91486 92665 92550 91712 91280 91771 92612 93018 92858 92498 92298 92529 93229 93870
55195I3870k07j220j596j328r21n27j16k0n09j113j076l23N86J186J272P51j36
$$ 93870 93663 92443 90847 89519 88598 88071 87955 87935 87426 86313 85237 84914 85500 86686 87958 88709 88573
55178H8573p68p94m54NN96J029P41m9l06K70O34L3p93q93m75n8N97J572J930J123
$$ 88573 87805 87011 86557 86562 87158 88187 88928 88879 88573 88843 89477 89510 88717 87824 87349 87291 87888 89460 91390 92513
55158I2513L12P52J702J554L92l06n7K34N8j68k48m16m01L48J405J656R08N4m33
$$ 92513 92825 93577 95279 96833 97225 96919 96862 97096 97154 96986 96738 96322 95921 96269 97674 99330 100238 100292 99859
55139I9859r03j412j392o49K68Q93J188J041L73l22m63l41o42j150r73m1P07O80
$$ 99859 98956 97544 96152 95503 95771 96664 97852 98893 99266 98944 98481 98140 97498 96348 95375 95334 96041 96721
55121I6721K03l32q87j289j196p02k04K65Q76J327J228Q46O20K42o98j465r33
$$ 96721 96924 96592 95705 94416 93220 92518 92314 92579 93455 94782 96010 96856 97476 97718 97020 95555 94622
55104I4622N51J402J006L42K57M36M13L49L90K31j48k28J59M99M58L42M58P32
$$ 94622 95173 96575 97581 97923 98180 98616 99029 99378 99768 99999 99851 99623 99782 100281 100739 101081 101539 102271
55086A02271J112J539J445K87j332k029j396m08L5k4l53r58j357o75R18J930J396
$$ 102271 103383 104922 106367 106654 105322 103293 101897 101489 101524 101500 101147 100189 98832 98157 99075 101005 102401
55069A02401J30n58n29m08k93J47P25Q38L77j08j78K3J6m65j119j278o84Q1K84
$$ 102401 102531 101973 101444 101036 100743 100890 101615 102453 102830 102722 102544 102567 102583 102118 100999 99721 99037 99118 99402
55050I9402Q1J76N73M51n05j443j453p70l32n20q18o17L7N53N06J79J73N62P87
$$ 99402 99483 99659 100232 100683 100178 98735 97282 96512 96180 95660 94842 94225 94262 94815 95321 95500 95673 96235 97022
55031I7022O06N11Q02Q80J74q03j164r89r44r04k09Q65J110J41r52j013o4J062
$$ 97022 97628 98139 98941 99821 99995 99192 98028 97039 96095 95191 94982 95847 96957 97098 96146 95133 95069 96131
55013I6131J633J308K94n79n66P9M59L00J15K09L64N25Q72J158Q81K25n7J64K59
$$ 96131 97764 99072 99366 98787 98221 98300 98759 99059 99174 99383 99747 100272 101144 102302 103183 103408 103351 103515 103774
54994A03774rq5L23P69Q57P47O47O06Q73J580K026J373N7n54j16L72L24K83M84
$$ 103774 103765 103680 104003 104772 105629 106376 107023 107629 108502 110082 112108 113481 113538 112984 112868 113240 113564 113847 114331
54975A14331K06p16j137k45J108J701J549J313J069O80N09P68Q61L30j80N1N06
$$ 114331 114537 113821 112684 112439 113547 115248 116797 118110 119179 119859 120368 121136 121997 122327 122147 122198 122704
54958A22704K45n40q96o43m09m12k53O9J8n53j048r62m93j91l11n54l30O19J661
$$ 122704 122949 122409 121513 120870 120461 120049 119796 119865 119883 119330 118282 117320 116827 116636 116325 115771 115441 116060 117721
54939A17721J736N80q51j518j368r48n08m9J73q8n41o44k91K11O72J070J293J271
$$ 117721 119457 120037 119186 117668 116300 115352 114844 114795 114968 114880 114339 113695 113404 113615 114287 115357 116650 117921
54921A17921J337J982L313M895O147O740O754O581O618O948P385P666P303N602
$$ 117921 119258 121240 124553 129448 135595 142335 149089 155670 162288 169236 176621 184287 191590 197192
54907A97192K349j559m718o447p011o834o199n543n228m970m307l518l232l171
$$ 197192 199541 197982 193264 186817 179806 172972 166773 161230 156002 151032 146725 143207 139975 136804
54893A36804k425j133n53j172j892j692r34l72Q1P80J449J690J661J559J142M56
$$ 136804 134379 133246 132693 131521 129629 127937 127003 126631 126712 127492 128941 130631 132292 133851 134993 135449
54877A35449K39R28J969K823L752M983N884N922N605N587N601N061M036K694O57
$$ 135449 135688 136616 138585 141408 145160 150143 156027 161949 167554 173141 178742 183803 187839 190533 191190
54862A91190k065m275m907m521m382m695m915n116n659n996n299l991l255l170
$$ 191190 189125 184850 179943 175422 171040 166345 161430 156314 150655 144659 139360 135369 132114 128944
54848A28944k774j833j178j198j302j121r93j031q35m43n19j204j711j453p56
$$ 128944 126170 124337 123159 121961 120659 119538 118545 117514 116679 116236 115717 114513 112802 111349 110593
54833A10593j47L33P13P66M31O0m0J25N42J137J422Q94j15o72m68j29j00o0L20
$$ 110593 110446 110779 111492 112258 112689 112749 112709 112834 113376 114513 115935 116829 116714 116042 115574 115445 115345 115285 115605
54814A15605P64R57J076J269J172M41n74j160r83k91M30P38M77m1k85j06J31N9
$$ 115605 116369 117326 118402 119671 120843 121284 120710 119550 118567 118276 118706 119444 119921 119880 119595 119489 119620 119679
54796A19679k35m02k45J26L76J84l58p47o43l33k75l35M4R47J740J812J265P37
$$ 119679 119444 119042 118797 118923 119299 119483 119125 118378 117735 117402 117127 116792 116836 117783 119523 121335 122600 123337
54778A23337P45J184J380P61l35q33j95Q52J319J299J592K323K790K721K771L508
$$ 123337 124082 125266 126646 127407 127072 126239 126044 126896 128215 129514 131106 133429 136219 138940 141711 145219
54762A45219M620N495O082O672P204P260O622N487M103K454M02j896l871n053
$$ 145219 149839 155334 161416 168088 175292 182552 189174 194661 198764 201218 201620 199724 195853 190800
54748A90800n616o137o726o867o262n320m486l582k349j179o74p69r08r24j031
$$ 190800 185184 179047 172321 165454 159192 153872 149386 145804 143455 142276 141602 140833 139925 139001 137970
54733A37970j179j045o36k16K50J000J832K232K116J885J752J622J648K232L336
$$ 137970 136791 135746 135110 134894 135144 136144 137976 140208 142324 144209 145961 147583 149231 151463 154799
54718A54799M395N004N249N279N118M871M650M162K952J096q67k706m564o176
$$ 154799 159194 164198 169447 174726 179844 184715 189365 193527 196479 197575 196708 194002 189438 183262
54704A83262o831o357n537n160n151m964m357l457k448j541r94q40q38q18q78
$$ 183262 176431 170074 164537 159377 154226 149262 144905 141448 139000 137459 136465 135625 134787 133969 133091
54689A33091j068j220j159q82m40K0J39l33j095j592j732j799j681q98L81J142
$$ 133091 132023 130803 129644 128762 128322 128342 128481 128148 127053 125461 123729 121930 120249 119351 119732 120874
54673A20874P85K2n4O20J233J301J073Q29M36k07q59j252j482j730j800j327m48
$$ 120874 121659 121681 121627 122247 123480 124781 125854 126683 127119 126912 126053 124801 123319 121589 119789 118462 118014
54656A18014J65J51l0J93N64M03j71k68L77Q66M69k68m06lK43K21L68O53N90K13
$$ 118014 118179 118330 118300 118493 119057 119460 119289 119021 119398 120264 120733 120465 120059 120056 120299 120520 120888 121541 122131 122344
54636A22344J04M29P46P90P05M63r6n85l42M65Q23L10l38l91q5N0J6l7l27q72
$$ 122344 122448 122877 123623 124413 125118 125581 125485 124900 124558 125023 125846 126156 125818 125427 125342 125392 125408 125371 125044 124172
54616A24172j038l51O09R16N70L88P41J129J055O32K02j97o26q60n57J51N90K95
$$ 124172 123134 122783 123392 124308 124878 125266 126007 127136 128191 128823 129025 128828 128202 127342 126785 126936 127526 127821
54598A27821l22m31P5L97rn87n71j91k39o67n80K78J012Q30J13l02k69k34l98
$$ 127821 127499 127068 127143 127540 127531 126944 126373 126182 125943 125276 124696 124974 125986 126816 126929 126627 126358 126124 125726
54579A25726n49n02l05q8L0J5M3L33P99J104J125J034Q67M93J00J68P28J127Q60
$$ 125726 125177 124675 124370 124282 124312 124327 124370 124703 125502 126606 127731 128765 129632 130125 130225 130393 131121 132248 133108
54560A33108K74L9K83N66M96Q0k94j15P39J604J556N39n02q01o40o63q57p66l04
$$ 133108 133382 133421 133704 134270 134766 134846 134552 134437 135176 136780 138336 138875 138373 137572 136932 136269 135412 134646 134342
54541A34342K66Q75J611K237K284J726J107R30J177J495J620J548J407J275J012
$$ 134342 134608 135483 137094 139331 141615 143341 144448 145378 146555 148050 149670 151218 152625 153900 154912
54526A54912M15m06r29p13N3O59N51j72r41j334j447j641j934j939j450q21n10
$$ 154912 155327 154921 153992 153279 153332 153991 154542 154370 153429 152095 150648 149007 147073 145134 143684 142863 142353
54509A42353m86m37k98j92k1L56O52L89l58j017j319j468j482r90Q0J180J742
$$ 142353 141867 141430 141132 140940 140919 141275 141927 142316 141958 140941 139622 138154 136672 135682 135762 136942 138684
54492A38684J737J359P05j3l66j47L55P29P99N84K59J90N30P71L04n16o09K93
$$ 138684 140421 141780 142485 142472 142106 141959 142314 143043 143842 144426 144685 144875 145405 146176 146480 145964 145355 145648
54474A45648J157J107O40P80J591K266K256J742J203J056J456J971J810Q24q3
$$ 145648 146805 147912 148552 149332 150923 153189 155445 157187 158390 159446 160902 162873 164683 165507 165424
54459A65424q9M30N11K5k84m8K02j17q52j397j396j045q05q74q92l82M51P32L4
$$ 165424 165335 165765 166276 166301 166017 165969 166171 166054 165202 163805 162409 161364 160559 159685 158793 158411 158862 159594 159628
54440A59628r59j332j076q35q39q06o55n94n21n3P29J196J034O64N49N56L84J57
$$ 159628 158669 157337 156261 155426 154587 153781 153126 152532 152011 151958 152687 153883 154917 155581 156130 156686 157070 157227
54422A57227J99M03L32p9l97k92OR1JQ9L93M74J9o74j061r93o87l15J00M82P81
$$ 157227 157426 157829 158161 158082 157685 157393 157399 157490 157491 157580 157973 158447 158466 157792 156731 155738 155051 154736 154836 155318 156099
54401A56099J136J524J479O86k72m07L74J209J592J917K451K601J851P48J62M5
$$ 156099 157235 158759 160238 160924 160652 160245 160619 161828 163420 165337 167788 170389 172240 172988 173150 173195
54385A73195k74q59j033m60L56P76O35R0o74j407j796j721j293o30J70Q77J207
$$ 173195 172921 172062 171029 170569 170925 171701 172336 172426 171752 170345 168549 166828 165535 164905 165075 165952 167159
54368A67159J214J274J571J732J204Oj086j204k65R29J524J318O62q5o97r75r93
$$ 167159 168373 169647 171218 172950 174154 174160 173074 171870 171605 172534 174058 175376 176038 175953 175256 174281 173288
54351A73288j239j985k615k235r67R8L18J87K91L98J13k71k42j9k91j143j875
$$ 173288 172049 170064 167449 165214 164247 164345 164663 164850 165141 165539 165652 165381 165139 165120 164829 163686 161811
54334A61811j803q52N57J793K336K087J427P71J94m15j019j481j672j518j102
$$ 161811 160008 159156 159713 161506 163842 165929 167356 168127 168321 167906 166887 165406 163734 162216 161114
54319A61114p38o49n50m8N51N22j40n94m21j71k75k68K59P45N34k4j77L3Q4O7
$$ 161114 160376 159727 159177 159129 159680 160202 160062 159468 159047 158876 158601 158333 158592 159337 159871 159847 159670 159703 159787 159854
54299A59854M44J024J096N01k88r89j587j761j193m20m16j207j768j446p09j78
$$ 159854 160298 161322 162418 162919 162631 161642 160055 158294 157101 156681 156265 155058 153290 151844 151135 150957
54283A50957J84N71P31M34M7J14N91Q94O45P2k33R1P87J240J183J005J064J024
$$ 150957 151141 151712 152443 152877 152924 153038 153629 154523 155168 155240 155007 155098 155885 157125 158308 159313 160377 161401
54265A61401L29q11j504j232l72M21Q78J067J084J020R69R33Q75Q94J114J433
$$ 161401 161730 160919 159415 158183 157811 158232 159110 160177 161261 162281 163250 164183 165058 165952 167066 168499
54249A68499J576J398R83M88Q4j13k88q33j719k249j849r19l79n23q78j107j398
$$ 168499 170075 171473 172456 172944 173028 172915 172627 171794 170075 167826 165977 165058 164679 164156 163278 162171 160773
54232A60773j840k000j509p22m17q80j476j253jJ380J726P94n77j458j520q56
$$ 160773 158933 156933 155424 154702 154285 153405 151929 150676 150675 152055 153781 154575 153998 152540 151020 150164
54216A50164K59J164J096J61n88m80p1j16l80k68jj90o42o66k69n0%M50J248J678
$$ 150164 150423 151587 152683 152844 152256 151776 151705 151589 151209 150941 150940 150750 150108 149442 149173 149123 149123 149573 150821 152499
54196A52499J623J763K302K504J885R62L92J53J8M6J04l37j342k077j865j208
$$ 152499 154122 155885 158187 160691 162576 163538 163930 164083 164101 164147 164251 163914 162572 160495 158630 157422
54180A57422j050j448j562q73K18R48R75N53K05K00K79K3n41r16p78l35N3K83
$$ 157422 156372 154924 153362 152489 152707 153655 154630 155183 155388 155588 155867 155890 155349 154433 153655 153320 153373 153656
54162A53656L84K84q1n61q53p52k98J62J99k62p40o98j20N97J147J420J300P28
$$ 153656 154040 154324 154243 153682 152829 152077 151779 151941 152140 151878 151138 150440 150320 150917 152064 153484 154784 155512
54144A55512o6p42j153j233q59j39M15M79L57M10M25J23j09K50R05J134R37Q81
$$ 155512 155446 154704 153551 152318 151459 151320 151735 152214 152571 152981 153406 153529 153420 153670 154575 155709 156646 157527
54126A57527J014Q74M99M12O35P11P14J150J707J405K15o39n21k63o17r91n78
$$ 157527 158541 159415 159914 160326 160961 161672 162386 163536 165243 166648 166863 166224 165703 165440 164823 163832 163254
54109A63254K54O26N02L50J99j01k26J08M41K78K5L39Q99Q26O2o03p93q93j094
$$ 163254 163508 164134 164636 164986 165185 165084 164858 164966 165407 165685 165710 166049 166948 167774 167836 167233 166440 165547 164453
54090A64453j021m87N1J29j09k05K4M16P29Q42Q21P98P56N42J85n2qJ67L63O81
$$ 164453 163432 162945 162996 163125 163016 162811 162835 163251 163980 164822 165643 166441 167197 167739 167924 167872 167864 168031 168394 169075
54070A69075J057J101O73K71L75P43P82M22J13Q2J47J87L59P58J227J546J582
$$ 169075 170132 171233 171906 172177 172552 173295 174077 174499 174612 174694 174841 175028 175387 176145 177372 178918 180500
54053A80500J275P15K24J33M46R56J564K301L052L503L469L158L092L626M541
$$ 180500 181775 182490 182714 182847 183293 184249 185813 188114 191166 194669 198138 201296 204388 208014 212555
54038B12555N118M866M155L917M688O115P443Q227Q528Q717R134R762J0236J0419
$$ 212555 217673 222539 226694 230611 235299 241414 248857 257084 265612 274329 283463 293225 303461 313880
54024C13880J0779J1708J2592J2205J0126P091L802J28m030p873j0332j1213j1162
$$ 313880 324659 336367 348959 361164 371290 378381 382183 382311 378281 370408 360076 348863 337701
54011C37701j0800j0424j0283j0442j0432r603p862n833m335l883m470n479n921
$$ 337701 326901 316477 306194 295752 285320 275717 267855 262022 257687 253804 249334 243855 237934
53998B37934n226l771k492j930j872j768j323p18m34p83j547k118k069j536j052
$$ 237934 232708 228937 226445 224515 222643 220875 219552 218834 218400 217617 216070 213952 211883 210347 209295
53983B09295j149j906k694k591j476m66o64j653j967j055J16N19K71L2P3M20J139
$$ 209295 208146 206240 203546 200955 199479 199013 198349 196696 194729 193674 193790 194309 194580 194612 194685 195105 196244
53966A96244J841J655M08p69p88n4K31j64l69J40R17J385J577J774J964J940J677
$$ 196244 198085 199740 200148 199379 198591 198537 198768 198604 198235 198375 199292 200677 202254 204028 205992 207932 209609
53949B09609J421J495K029K778L304L416L263L048K923L217M147N297N844N633
$$ 209609 211030 212525 214554 217332 220636 224052 227315 230363 233286 236503 240650 245947 251791 257424
53935B57424N380N551N697N346M837M681M672M290L569K899K316J744J520K004
$$ 257424 262804 268355 274052 279398 284235 288916 293588 297878 301447 304346 306662 308406 309926 311930
53921C11930K891L615M176M897N619N910N911O242P009P606P525O832N873N017
$$ 311930 314821 318436 322612 327509 333128 339038 344949 351191 358200 365806 373331 380163 386036 391053
53907C91053M623M708M673L849K284O46o04j495k184k740l182l393l174k747k852
$$ 391053 395676 400384 405057 408906 411190 411836 411232 409737 407553 404813 401631 398238 395064 392317 389465
53892C89465l851n110n801o042o498p146p341o984o737o932o989o175m466k483
$$ 389465 385614 380504 374703 368661 362163 355017 347676 340692 333955 327023 320034 313859 309393 306910
53878C06910r61k57M9R51K860M809N438M783M343N271P200R132J0637J1705J1764
$$ 306910 305949 305692 305741 306692 309552 314361 319799 324582 328925 334196 341396 350528 361165 372870 384634
53863C84634R633M606k567r877j5294j8026j8582j7762j6017j3757j1693j0270
$$ 384634 394267 398873 396306 386429 371135 353109 334527 316765 300748 286991 275298 265028
53851B65028r128p700o121m990m437l983l287k440j621r50o29p53j083j329j522
$$ 265028 255900 248200 242079 237089 232652 228669 225382 222942 221321 220371 219742 218989 217906 216577 215055
53836B15055j666j397n56K21K08l52o12m15l51n89n62L9P72J155J188R73M56j42
$$ 215055 213389 211992 211436 211657 211865 211513 210901 210486 210135 209546 208984 209023 209795 210950 212138 213111 213567 213425
53818B13425k57L30J141J615J712J734J922K256K420J996J102O80J568L321M543
$$ 213425 213168 213498 214639 216254 217966 219700 221622 223878 226298 228294 229396 230076 231644 234965 239508
53803B39508M520L886L618L925M378M601M560M459M541M745M621L864K774J890
$$ 239508 244028 247914 251532 255457 259835 264436 268996 273455 277996 282741 287362 291226 294000 295890
53789B95890J369J147J356J991K473K287J785J564J351M49r02j758k029k600l732
$$ 295890 297259 298406 299762 301753 304226 306513 308298 309862 311213 311662 310760 309002 306973 304373 300641
53774C00641m596m753m921n665o368o176n158l894k716j982k279l505m432m029
$$ 300641 296045 291292 286371 280706 274338 268162 263004 259110 256394 254412 252133 248628 244196 240167
53760B40167k775j878j711j763j745j814j935j867j734j913k310k346j710p36
$$ 240167 237392 235514 233803 232040 230295 228481 226546 224679 222945 221032 218722 216376 214666 213930
53746B13930J9K46j7m43o19m02r4m1k00k89j81mJ21K07L76P38J183J414J347J389
$$ 213930 213949 214195 214178 213735 213116 212714 212620 212579 212379 212090 211909 211905 212026 212233 212609 213347 214530 215944 217291 218680
53726B18680J916K603K706K069J304R10Q18R50J530K503L198L058K328J624J231
$$ 218680 220596 223199 225905 227974 229278 230188 231006 231956 233486 235989 239187 242245 244573 246197 247428
53711B47428J168J548K333L019L112K782K610K810L038K974K749K675K779K774
$$ 247428 248596 250144 252477 255496 258608 261390 264000 266810 269848 272822 275571 278246 281025 283799
53697B83799K508K335K770L649M096L617K872K741K981K608J521P62R66J411J103
$$ 283799 286307 288642 291412 295061 299157 302774 305646 308387 311368 313976 315497 316259 317225 318636 319739
53682C19739R1q22j167j091r04q63j139j645j983j813j138j57Q27J393J283P42
$$ 319739 319830 319008 317841 316750 315846 314983 313844 312199 310216 308403 307265 307108 307935 309328 310611 311353
53666C11353J84m19j262j931j728q59m14q72j400j150m10J1n2j81j03K28P85J279
$$ 311353 311537 311118 309856 307925 306197 305338 304924 304052 302652 301502 301092 301103 301051 300870 300767 300995 301780 303059
53648C03059J235O65J77L9k74j101j828j663p61J26O37R37J156J326J540J738
$$ 303059 304294 304959 305136 305175 304901 303800 301972 300309 299548 299674 300311 301248 302404 303730 305270 307008
53632C07008J619J187J002J428K043K233K009J846K056K712L709M542M537L792
$$ 307008 308627 309814 310816 312244 314287 316520 318529 320375 322431 325143 328852 333394 337931 341723
53618C41723L281L671M514N072N247N166M636L710L109L260L603L544L436L736
$$ 341723 345004 348675 353189 358261 363508 368674 373310 377020 380129 383389 386992 390536 393972 397708
53604C97708L968L604L235L619M157L737K680K241K414J887L55p69n13K15R1q35
$$ 397708 401676 405280 408515 412134 416291 420028 422708 424949 427363 429250 429605 428836 428323 428538 428629 427794
53588D27794j615j845j785j659j598j816k230k269j592p07l51n58q27q73q15p05
$$ 427794 426179 424334 422549 420890 419292 417476 415246 412977 411385 410678 410327 409769 408942 408069 407254 406549
53572D06549l95J69Q41J474J903J819R51m61j640j993j785j838k448k967k671
$$ 406549 406154 406323 407164 408638 410541 412360 413311 412850 411210 409217 407432 405594 403146 400179 397508
53557C97508j745r43n50k40J08K82M38J114K208K761K282J552J456J751J718J486
$$ 397508 395763 394820 394270 394030 394138 394420 394858 395972 398180 400941 403223 404775 406231 407982 409700 411186
53541D11186J808K845M051N047N826O293O374O488P191Q391R462J0083J0401J0611
$$ 411186 412994 415839 419890 424937 430763 437056 443430 449918 457109 465500 474962 485045 495446 506057
53527E06057J0936J1765J3166J4511J5238J5716J6639J7810J8403J8288J8229
$$ 506057 516993 528758 541924 556435 571673 587389 604028 621838 640241 658529 676758
53516F76758J8752J9694K0833K2205K3744K5261K6799K8416K9756L0516L1048
$$ 676758 695510 715204 736037 758242 781986 807247 834046 862462 892218 922734 953782
53505I53782L1763L2176L1577L0349K9497K9017K8028K6631K6084K6744K7211
$$ 953782 985545 1017721 1049298 1079647 1109144 1138161 1166189 1192820 1218904 1245648 1272859
53494A272859K6270K4587K3610K3690K4190K4673K5049K4986K4098K2607K1187
$$ 1272859 1299129 1323716 1347326 1371016 1395206 1419879 1444928 1469914 1494012 1516619 1537806
53483A537806K0315K0063K0220K0295J9835J9000J8376J7932J6696J3980J0380
$$ 1537806 1558121 1578184 1598404 1618699 1638534 1657534 1675910 1693842 1710538 1724518 1734898
53472A734898P074M506K173n52l877p518j0845j3332j5152j6966j8931k0379k0709
$$ 1734898 1741972 1746478 1748651 1748099 1744222 1736704 1725859 1712527 1697375 1680409 1661478 1641099 1620390
53459A620390k0240j9874k0321k1852k4237k6571k7745k7602k7139k7171k7302
$$ 1620390 1600150 1580276 1559955 1538103 1513866 1487295 1459550 1431948 1404809 1377638 1350336
53448A350336k6715k5444k4231k3530k3206k2932k2221k0410j7311j3780j0997
$$ 1350336 1323621 1298177 1273946 1250416 1227210 1204278 1182057 1161647 1144336 1130556 1119559
53437A119559r251p920o504n148m155l473k800j812k76J824M203O515Q594J0399
$$ 1119559 1110308 1102388 1095884 1090736 1086581 1083108 1080308 1078496 1078220 1080044 1084247 1090762 1099356 1109755
53423A109755J1872J3087J4316J5804J7577J9609K1869K4075K5787K6948K8035
$$ 1109755 1121627 1134714 1149030 1164834 1182411 1202020 1223889 1247964 1273751 1300699 1328734
53412A328734K9426L0992L2565L4324L6395L8514M0546M2896M5852M8939N1595
$$ 1328734 1358160 1389152 1421717 1456041 1492436 1530950 1571496 1614392 1660244 1709183 1760778
53401A760778N4127N7226O0655O3306O4632O5290O6133O7189O7966O8317O8564
$$ 1760778 1814905 1872131 1932786 1996092 2060724 2126014 2192147 2259336 2327302 2395619 2464183
53390B464183O9058O9811P0444P0346O9090O6724O3535N9606N5036N0491M6888
$$ 2464183 2533241 2603052 2673496 2743842 2812932 2879656 2943191 3002797 3057833 3108324 3155212
53379C155212M4250M1413L7358L2444K7755K3580J9279J4507R696M944p56q428
$$ 3155212 3199462 3240875 3278233 3310677 3338432 3362012 3381291 3395798 3405494 3410438 3409682 3401254
53367C401254j7749k7475l6979m6435n5506o2905o7688p0239p1396p1406p0425
$$ 3401254 3383505 3356030 3319051 3272616 3217110 3154205 3086517 3016278 2944882 2873476 2803051
53356B803051o9382o9192o9339o8346o5709o2402n9470n7082n5303n4668n5278
$$ 2803051 2733669 2664477 2595138 2526792 2461083 2398681 2339211 2282129 2226826 2172158 2116880
53345B116880n6107n6048n5158n4164n3087n1252m8478m5448m2720m0024l6805
$$ 2116880 2060773 2004725 1949567 1895403 1842316 1791064 1742586 1697138 1654418 1614394 1577589
53334A577589l3058k9340k6163k3603k1415j9349j7402j5898j5306j5849j7118
$$ 1577589 1544531 1515191 1489028 1465425 1444010 1424661 1407259 1391361 1376055 1360206 1343088
53323A343088j8123j7982j6659j4872j3191j1572r944q716q136p550o046l721
$$ 1343088 1324965 1306983 1290324 1275452 1262261 1250689 1240745 1232029 1223893 1216343 1210297 1206576
53311A206576j578j10J183K779M463N985P598R488J1325J2915J4739J7211J9979
$$ 1206576 1204998 1204888 1206071 1208850 1213313 1219298 1226896 1236384 1247709 1260624 1275363 1292574 1312553
53298A312553K2506K4859K7253K9297L0509L1292L2558L4405L5955L6484L6073
$$ 1312553 1335059 1359918 1387171 1416468 1446977 1478269 1510827 1545232 1581187 1617671 1653744
53287A653744L5104L3709L1942K9911K7623K5014K2263J9717J7356J4722J1445
$$ 1653744 1688848 1722557 1754499 1784410 1812033 1837047 1859310 1879027 1896383 1911105 1922550
53276A922550P537L199j313n519q887j1426j3758j6405j9241k1885k4346k6948
$$ 1922550 1930087 1933286 1931973 1926454 1917567 1906141 1892383 1875978 1856737 1834852 1810506 1783558
53264A783558k9714l2192l3901l4802l5207l5477l5849l6484l7379l8227l8503
$$ 1783558 1753844 1721652 1687751 1652949 1617742 1582265 1546416 1509932 1472553 1434326 1395823
53253A395823l7874l6543l5031l3638l2277l0842k9578k8933k9057k9589l0013
$$ 1395823 1357949 1321406 1286375 1252737 1220460 1189618 1160040 1131107 1102050 1072461 1042448
53242A042448l0174l0297l0418l0041k8743k7029k5902k5399k4191k1268j7441
$$ 1042448 1012274 981977 951559 921518 892775 865746 839844 814445 790254 768986 751545
53231G51545j4468j2947j2021j0936r896r287r092r380j0440j1953j2915j2949
$$ 751545 737077 724130 712109 701173 691277 681990 672898 663518 653078 641125 628210 615261
53219F15261j2948j3798j5093j5828j5740j5207j4395j3338j2478j2164j1887
$$ 615261 602313 588515 573422 557594 541854 526647 512252 498914 486436 474272 462385
53208D62385j0878r269p899p092o566o387o997q158q849q533p756p168o708o159
$$ 462385 451507 442238 434339 427247 420681 414294 407297 399139 390290 381757 374001 366833 360125 353966
53194C53966n811o025o578o975p050o835o148m905l613k958k905k726k014j249
$$ 353966 348155 342130 335552 328577 321527 314692 308544 303639 300026 297068 294163 291437 289423 288174
53180B88174j137j675k199k258k038j842j525p72K30Q15O39kp00j373j879j752
$$ 288174 287037 285362 283163 280905 278867 277025 275500 274728 274958 275773 276412 276410 275710 274337 272458 270706
53164B70706q51M8Qq18j389j151o59n61p20p18o51q86j317j471j249j013r12o23
$$ 270706 269855 269903 269911 269093 267704 266553 265894 265333 264613 263895 263244 262358 261041 259570 258321 257308 256396 255773
53146B55773QM73J33r05j806j867j194m07M9K28M03O87R69J091J032Q98P19M11
$$ 255773 255781 256254 256387 255482 253676 251809 250615 250208 250257 250485 250888 251575 252544 253635 254667 255565 256284 256695
53128B56695q9o33r99j119j039o76J5P04Q42L99k5j6J02j24n17o22m36k25O6N45
$$ 256695 256606 255973 254974 253855 252816 252140 252155 252859 253701 254100 254075 254059 254161 254037 253520 252898 252462 252237 252303 252848
53108B52848P71K53n96r06p04q90j728k412k443k318k382j979o17R23J530J216
$$ 252848 253619 253872 253276 252370 251666 250776 249048 246636 244193 241875 239493 237514 236897 237820 239350 240566
53092B40566P33K85l93j082j266j108j214j482j197k88M38N54O01J145J892K180
$$ 240566 241299 241584 241191 240109 238843 237735 236521 235039 233842 233554 233992 234546 235147 236292 238184 240364
53076B40364J787R24q4p63n91L93J355J368L19j118k087k097j206p6L86j65j061
$$ 240364 242151 243075 242991 242228 241637 242030 243385 244753 245072 243954 241867 239770 238564 238488 238874 238709 237648
53059B37648j283n43M67R52Q02M03l8n14p06j03J091J747J079j77o07J03R62J242
$$ 237648 236365 235822 236289 237241 238043 238446 238408 237894 237188 237085 238176 239923 241002 240825 240218 240321 241283 242525
53041B42525J182R80J41j464k775k722j689q77o11k73L23N57J77j58J72R05J386
$$ 242525 243707 244687 244828 243364 240589 237867 236178 235301 234690 234417 234740 235297 235474 235316 235488 236393 237779
53024B37779J399J129P12J92k38l15K1N14P56M67k45r27j207j142j036j067j154
$$ 237779 239178 240307 241019 241211 240973 240658 240679 241193 241949 242416 242171 241244 240037 238895 237859 236792 235638
53007B35638j086o46J73R96J341J229J167J347J293O45j67m88l40j97j72j9K31
$$ 235638 234552 233906 234079 235075 236416 237645 238812 240159 241452 242097 241930 241442 241102 240905 240733 240714 240945
52990B40945K74R0k9J6J20M06J123K064K562K211J269L99J43O16J351J611J140
$$ 240945 241219 241309 241280 241296 241416 241822 242945 245009 247571 249782 251051 251450 251593 252209 253560 255171 256311
52973B56311N11M25R01J489J903K045J723R91N05R08J934K748K953K772K318J424
$$ 256311 256822 257247 258148 259637 261540 263585 265308 266299 266804 267712 269646 272394 275347 278119 280437 281861
52957B81861J88r07j519j653j459j261j589k560l372l120k020j112q62q29p12
$$ 281861 282049 281142 279623 277970 276511 275250 273661 271101 267729 264609 262589 261477 260615 259786 259074
52942B59074q00j225j532j408j134j002q00k62M12P96P44M34J39Lq8l62o86n82
$$ 259074 258274 257049 255517 254109 252975 251973 251173 250911 251323 252119 252863 253297 253436 253439 253351 252989 252303 251721
52924B51721k1K54k18p44m99N1j80j075j479j100r00j313j463p01K47M30K2k53
$$ 251721 251700 251954 251736 250992 250493 250544 250364 249289 247810 246710 245810 244497 243034 242333 242580 243010 243032 242779
52906B42779k47j89k9K72K96k00p07n98j6M30N04L79K03K5j03l29q63j406j267
$$ 242779 242532 242343 242314 242586 242882 242682 241975 241377 241361 241791 242295 242674 242877 242902 242799 242470 241607 240201 238934
52887B38934l87L75M16J90K84L62k14j166j554j014q0O10Q35O84L88K62L98N97
$$ 238934 238547 238922 239338 239528 239812 240174 239960 238794 237240 236226 236146 236756 237591 238275 238663 238925 239323 239920
52869B39920P17Q93J165J304J275J430J901K256K128J760J452R94J41p62j193
$$ 239920 240637 241530 242695 243999 245274 246704 248605 250861 252989 254749 256201 257195 257336 256574 255381
52854B55381j165j045r10o70n05o10p76p44p04r47j277j297j131j248j730k197
$$ 255381 254216 253171 252261 251591 251086 250476 249700 248956 248252 247305 246028 244731 243600 242352 240622 238425
52838B38425k396k377k153j695j196j012j212j478j402q22%M70J58o23j069q08
$$ 238425 236029 233652 231499 229804 228608 227596 226384 224906 223504 222682 222682 223152 223310 222687 221618 220810
52822B20810k15K23M27M12J07k90k93J62N87P40Q61Q64J87r92j365k05J387J992
$$ 220810 220595 220818 221245 221657 221764 221474 221181 221343 221930 222670 223531 224395 224582 223590 222225 222020 223407 225399
52804B25399J853K194K998K978J590j99j372j905k169k235k159k155k132j688
$$ 225399 227252 229446 232444 235422 237012 236813 235441 233536 231367 229132 226973 224818 222686 220998
52790B20998q87m18p10j293j435r70l07Q4Nl66n60j89O60J540K054K022J469P24
$$ 220998 220111 219693 218983 217690 216255 215285 214978 215062 215067 214701 214141 213952 214612 216152 218206 220228 221697 222421
52772B22421K70K00J21q7R4R15J582J153o0q88q95p12p93p87k99M06Q24P28J84
$$ 222421 222691 222891 223012 222925 223019 223934 225516 226669 226609 225721 224826 224114 223321 222534 222235 222641 223465 224193 224377
52753B24377m69o13M8Q30O79m29j371j310n53J90P06J042J055O86L34M53J034
$$ 224377 223908 223295 223343 224173 224852 224423 223052 221742 221189 221379 222085 223127 224182 224868 225202 225655 226689
52736B26689J702K124K177K002J958K180K208J523M96J59Q97J938K419K298J948
$$ 226689 228391 230515 232692 234694 236652 238832 241040 242563 243059 243218 244115 246053 248472 250770 252718
52721B52718J410N88k88q79j148j188r76o81p98j518k264k312j716j094p40m57
$$ 252718 254128 254716 254428 253549 252401 251213 250237 249556 248758 247240 244976 242664 240948 239854 239114 238657
52705B38657j64j18m24p87q92p98p33o86m24J78R44J564J854J819J520J018M62
$$ 238657 238493 238375 237951 237164 236272 235474 234741 234055 233631 233809 234753 236317 238171 239990 241510 242528 242990
52688B42990J06J46N29J042J468J620J370P90K28L3J94L56J99l25r86j471j587
$$ 242990 243096 243242 243771 244813 246281 247901 249271 250061 250289 250322 250516 250872 251071 250746 249760 248289 246702
52671B46702j412j142q28m39j54k14m41l12K16M59l8p12o91M9P79J102J277J534
$$ 246702 245290 244148 243320 242881 242727 242513 242072 241760 241976 242435 242397 241685 240994 241043 241822 242924 244201 245735
52653B45735J758J956K436L270L949L870K932J537J18j150k294l227l568k999
$$ 245735 247493 249449 251885 255155 259104 262974 265906 267443 267561 266411 264117 260890 257322 254323
52639B54323j857j005r09j173j240j084q90n63j26j02p52j272n94J152K781L526
$$ 254323 252466 251461 250552 249379 248139 247055 246165 245602 245476 245374 244622 243350 242756 243908 246689 250215
52623B50215L594L331K704J757Q10l2r37j783k149j970j627j314r47p09r18j308
$$ 250215 253809 257140 259844 261601 262411 262379 261442 259659 257510 255540 253913 252599 251652 250943 250025 248717
52607B48717j186n10K4J62M29J019J295Q97N14Q64J548J673J127M79M0k87m74
$$ 248717 247531 247021 247045 247207 247636 248655 249950 250847 251361 252225 253773 255446 256573 257052 257092 256805 256331
52590B56331l20J63P44J232J435J172O10L00N33R47J103J064J067R38L74m72j059
$$ 256331 256011 256174 256918 258150 259585 260757 261367 261667 262200 263147 264250 265314 266381 267319 267693 267221 266162
52573B66162j027m31L77Q46N21m48j332j609j448j232r92o38l33k56l07l66n77
$$ 266162 265135 264704 265081 265927 266448 266000 264668 263059 261611 260379 259387 258749 258416 258160 257853 257487 256910
52556B56910r52j087o73L2N43P57P88N54j4n97p63n06j43O2ol67p38o50p9L76
$$ 256910 255958 254871 254198 254230 254773 255530 256318 256872 256858 256261 255498 254992 254849 254911 254905 254538 253800 253150 253071 253447
52536B53447K94N2J78N14N40K14j22l77o60q01n91k62j84j44L27J034J199N96
$$ 253447 253741 253793 253971 254485 255025 255239 255117 254740 254080 253279 252688 252426 252242 252098 252425 253459 254658 255254
52518B55254q6j94R0J77n2j76K17J084K005K607K920L221L523L546L291L199L337
$$ 255254 255168 254974 255064 255241 255189 255013 255230 256314 258319 260926 263846 267067 270590 274136 277427 280626 283963
52501B83963K920J222j268l287m203m337m026l190k000j184j257j863k249k043
$$ 283963 286883 288105 286837 283550 279347 275010 270984 267794 265794 264610 263353 261490 259241 257198
52487B57198j376o46l66q34j586j528o1K056L359L115J847N53k02l89r8N90J406
$$ 257198 255822 255176 254810 253976 252390 250862 250801 252857 256216 259331 261178 261731 261529 261140 261042 261632 263038
52470B63038J856J644J068Q13J283K187K852K804K088J206Q26J258K086K489K095
$$ 263038 264894 266538 267606 268419 269702 271889 274741 277545 279633 280839 281665 282923 285009 287498 289593
52455B89593J310O47L4q59j883k504k562k512k769l130l070k459j815j775k318
$$ 289593 290903 291550 291584 290725 288842 286338 283776 281264 278495 275365 272295 269836 268021 266246 263928
52440B63928k640j992o35M07O26N31O31N13m26j722k189j478m81k7O3K65M32J75
$$ 263928 261288 259296 258661 259068 259694 260225 260856 261369 260943 259221 257032 255554 255073 255046 255109 255374 255806 255981
52422B55981k53j43O85J638K053J746R33L8l88J8R89J873K415L039M057N016N306
$$ 255981 255728 255585 256270 257908 259961 261707 262640 262678 262290 262308 263297 265170 267585 270624 274681 279697 285003
52405B85003N219N806P616J0033J1915J2413J1056P684K886j925n455p447q307
$$ 285003 290222 296028 303644 313677 325592 338005 349061 356745 359631 357706 352251 344804 336497
52392C36497q243p394o414o006n855m953l144j489p58m00L99J376J662J142N68
$$ 336497 328254 320860 314446 308440 302585 297632 294488 292999 292241 291841 292240 293616 295278 296420 296988
52377B96988N62J144K066L037L645L637L283L166L561M314N142N778N932N450
$$ 296988 297550 298694 300760 303797 307442 311079 314362 317528 321089 325403 330545 336323 342255 347705
52363C47705M493L338K149J064K73k45p41j189j119l19O72J193J232J113Q12K23
$$ 347705 352198 355536 357685 358749 359022 358777 358036 356847 355728 355409 356081 357274 358506 359619 360431 360654
52347C60654k19N4Q80J594K073K746L660M336M683N261O311P264P569P563Q015
$$ 360654 360435 360489 361369 362963 365036 367782 371442 375778 380461 385722 392033 399297 406866 414429 422444
52332D22444R138J0403J1153J1204J1043J1582J3397J6054J8452J9974K0970K2042
$$ 422444 431582 441985 453138 464342 475385 486967 500364 516418 534870 554844 575814 597856
52320E97856K3196K3998K4215K4056K3821K3521K2852K1547J9846J8483J8014
$$ 597856 621052 645050 669265 693321 717142 740663 763515 785062 804908 823391 841405
52309H41405J8189J8355J8267J8137J7914J7136J5629J3867J2377J1144R872Q466
$$ 841405 859594 877949 896216 914353 932267 949403 965032 978899 991276 1002420 1012292 1020758
52297A020758P055N746M626L692K607Q48j674m401o763q671j0188j1039j0937
$$ 1020758 1027813 1033559 1038185 1041877 1044484 1045332 1043658 1039257 1032494 1023823 1013635 1002596 991659
52284I91659j0111r086q011o672n127l809k852j686L13L002N565P399Q634R728
$$ 991659 981548 972462 964451 957779 952652 948843 945991 944305 944618 947620 953185 960584 969218 978946
52270I78946J0826J1782J2630J3699J5164J6724J7861J8237J7827J6849J5733
$$ 978946 989772 1001554 1014184 1027883 1043047 1059771 1077632 1095869 1113696 1130545 1146278
52259A146278J4879J4270J3537J2561J1707J1279J0999J0393R400Q262P026N606
$$ 1146278 1161157 1175427 1188964 1201525 1213232 1224511 1235510 1245903 1255303 1263565 1270591 1276197
52247A276197M124K648P64k000n305q078r536r800r528r424r994j1185j2137j1918
$$ 1276197 1280321 1282969 1283733 1281733 1276428 1268350 1258814 1249014 1239486 1230062 1220068 1208883 1196746 1184828
52233A184828j0651r436q960q754q040o758n404m328l522k829k038j090l42k45
$$ 1184828 1174177 1164741 1155781 1147027 1138987 1132229 1126825 1122497 1118975 1116146 1114108 1113018 1112676 1112431
52219A112431n15j78J260L088M264M642M863N390O110O705O925O738O537O953
$$ 1112431 1111916 1111738 1112998 1116086 1120350 1124992 1129855 1135245 1141355 1148060 1154985 1161723 1168260 1175213
52205A175213Q051Q997Q950Q073P152O495N831N131M754M774M789M659M776N298
$$ 1175213 1183264 1192261 1201211 1209284 1216436 1222931 1228762 1233893 1238647 1243421 1248210 1252869 1257645 1262943
52191A262943N706N419M598L789L106K249J160K16l16o36j081j769k709m036n830
$$ 1262943 1268649 1274068 1278666 1282455 1285561 1287810 1288970 1289186 1288870 1288234 1287153 1285384 1282675 1278639 1272809
52176A272809p788r401j0397j0832j0718r900q440o884n780n144m576l901l260
$$ 1272809 1265021 1255620 1245223 1234391 1223673 1213773 1205333 1198449 1192669 1187525 1182949 1179048 1175788
52163A175788k651j731l04J243K245K473K362K522L088L580L442K668J724Q86
$$ 1175788 1173137 1171406 1171102 1172345 1174590 1177063 1179425 1181947 1185035 1188615 1192057 1194725 1196449 1197335
52149A197335n8j249k261k482j892j013k57L43Q05J091J307J483J248K43j026
$$ 1197335 1197277 1196028 1193767 1191285 1189393 1188380 1188123 1188466 1189271 1190362 1191669 1193152 1194400 1194643 1193617
52134A193617j428n69P39J731K764M633P285R966J2360J4874J7829K0974K3892
$$ 1193617 1192189 1191620 1192359 1194090 1196854 1201487 1208772 1218738 1231098 1245972 1263801 1284775 1308667
52121A308667K6420K8590L0425L1968L3177L3806L3579L2513L0958K9228K7339
$$ 1308667 1335087 1363677 1394102 1426070 1459247 1493053 1526632 1559145 1590103 1619331 1646670
52110A646670K5114K2394J9232J5906J2708R642O577L702J530K06q39k218l790
$$ 1646670 1671784 1694178 1713410 1729316 1742024 1751666 1758243 1761945 1763475 1763681 1762842 1760624 1756834
52097A756834m910n280n163m943m918n411o583q109r451j0572j1976j3912j5836
$$ 1756834 1751924 1746644 1741481 1736538 1731620 1726209 1719626 1711517 1702066 1691494 1679518 1665606 1649770
52084A649770j6874j6615j5360j3693j1901r760o876l305L77L686O554Q884J0241
$$ 1649770 1632896 1616281 1600921 1587228 1575327 1565567 1558691 1555386 1555763 1559449 1566003 1574887 1585128
52071A585128J0610J1022J2602J5054J6952J7637J7998J8966K0133K0379J9314
$$ 1585128 1595738 1606760 1619362 1634416 1651368 1669005 1687003 1705969 1726102 1746481 1765795
52060A765795J7442J5273J2997J0744Q564O265L784J508k26j769l735o068q226
$$ 1765795 1783237 1798510 1811507 1822251 1830815 1837080 1840864 1842372 1842146 1840377 1836642 1830574 1822348
52047A822348j0133j2234j4568j6536j7867j9153k1046k3425k5676k7329k8049
$$ 1822348 1812215 1799981 1785413 1768877 1751010 1731857 1710811 1687386 1661710 1634381 1606332
52036A606332k7521k5859k3741k1719j9705j7565j5755j4674j3772j2103r652
$$ 1606332 1578811 1552952 1529211 1507492 1487787 1470222 1454467 1439793 1426021 1413918 1404266
52025A404266p344n768m749m237m704o225p919q883r163r279r300r026q644q569
$$ 1404266 1396922 1391154 1386405 1382168 1377464 1371239 1363320 1354437 1345274 1335995 1326695 1317669 1309025 1300456
52011A300456q816r192r923j1430j3570j5747j7790k0065k2552k4449k5034k4554
$$ 1300456 1291640 1282448 1272525 1261095 1247525 1231778 1213988 1193923 1171371 1146922 1121888 1097334
51999A097334k3953k3947k4565k5312k5624k5287k4591k3854k2863k1069j8416
$$ 1097334 1073381 1049434 1024869 999557 973933 948646 924055 900201 877338 856269 837853
51988H37853j5624j3559j2563j2422j2549j2150j0821r294r014j0483j2407j3103
$$ 837853 822229 808670 796107 783685 771136 758986 748165 738871 729857 719374 706967 693864
51976F93864j2423j1662j1776j2469j3063j3363j3327j2571j0823q492o244m207
$$ 693864 681441 669779 658003 645534 632471 619108 605781 593210 582387 573895 567651 563444
51964E63444k164l42O54R07J515L387O038Q009Q388P441N933M308K692J139m31
$$ 563444 561280 560938 561592 562499 564014 567401 573439 581448 589836 597277 603210 607518 610210 611349 610918
51949F10918k207m079n486n989n806n369m622l238j421J73J437L154N978R441
$$ 610918 608711 604632 599146 593157 587351 581982 577360 574122 572701 572874 574311 577465 583443 592884
51935E92884J2316J3812J4073J3735J3317J2952J2311J0665P314K230l607q731
$$ 592884 605200 619012 633085 646820 660137 673089 685400 696065 703379 705609 702002 693271
51923F93271j2204j4294j5972j7682j8818j8664j7575j6656j6313j5767j4320
$$ 693271 681067 666773 650801 633119 614301 595637 578062 561406 545093 529326 515006
51912E15006j2473j1198j0508r460p534n347l798k965k162q78O88K024K990M055
$$ 515006 502533 491335 480827 471367 463833 458486 454688 451723 449561 448683 449371 451395 454385 458440
51898D58440N704P727R211R466Q786Q047P519O484M125O36k742m670m553k724
$$ 458440 464144 471871 481082 490548 499334 507381 514900 521384 525509 526145 523403 518733 514180 511456
51884E11456n3K593M735O276P096O784M990K085q53k874l810l946l388k142o76
$$ 511456 511403 513996 518731 525007 532103 538887 543877 545962 545109 542235 538425 534479 531091 528949 528273
51869E28273J73L5o26j148j408j653k032k668l867n747p736q956r076q432p357
$$ 528273 528446 528481 527855 526707 525299 523646 521614 518946 515079 509332 501596 492640 483564 475132 467775
51854D67775n861m010k078k04J647L163L665L009K048J733J986J919R62p04k671
$$ 467775 461914 457904 455826 455622 457269 460432 464097 467106 469154 470887 472873 474792 475754 475050 472379
51839D72379m615o062o499n973n201m750m431l804k851j753l13J692L696M581
$$ 472379 467764 461702 455203 449230 444029 439279 434848 431044 428193 426440 426127 427819 431515 436096
51825D36096L976K756J880J322N02o41j766k872m140n072m779l307j905j528j706
$$ 436096 440072 442828 444708 446030 446532 445891 444125 441253 437113 432041 427262 423955 422050 420522 418816
51810D18816j372k46J092K115K721L023L279L688L829K748K09k467l584k914j670
$$ 418816 417444 417198 418290 420405 423126 426149 429428 433116 436945 439693 439902 437435 433851 430937 429267
51795D29267r03o68p18j066j665k202k586l114l922m629m688l858k339p65R8L9
$$ 429267 428364 427696 426978 425912 424247 422045 419459 416345 412423 407794 403106 399248 396909 396144 396242 396281
51779C96281l04l17k43n41p82j63J035J564R22m7m76l31K69J574L494N359O864
$$ 396281 395977 395660 395417 394876 394094 393931 394966 396530 397452 397405 396929 396598 396867 398441 401935 407294 414158
51762D14158Q450J0110J0839R982Q346P045N985M290J720j193l978o361q015q855
$$ 414158 422608 432718 443557 453539 461885 468930 474915 479205 480925 479732 475754 469393 461378 452523
51748D52523r176r015p915o031m605m466m748m183k971k051j148Q91L970O619
$$ 452523 443347 434332 426417 420386 415781 411315 406567 402384 399413 397362 396214 397105 401075 407694
51734D07694Q182R639J1772J3780J4305J2974J0324P111M210K602K727M223O398
$$ 407694 415876 425515 437287 451067 465372 478346 488670 495781 499991 502593 505320 509543 515941
51721E15941Q393Q833O442J565l650p164q642q760p847o037m133l256l685m799
$$ 515941 524334 533167 539609 541174 537524 530360 521718 512958 505111 499074 494941 491685 488000 483201
51707D83201n983p030p655p396o190m554k906j067J236L453M267K841p3k575l313
$$ 483201 477218 470188 462533 455137 448947 444393 441487 440420 441656 445109 449376 452217 452144 449569 446256
51692D46256k477j019O16K458M075M515L276P62k371n625q259r264q369o640n397
$$ 446256 443779 442760 443376 445834 449909 454424 457700 458462 456091 450466 442207 432943 424574 417934 412537
51677D12537m795l935k250j98J469K629L767N276O964Q303R053R605J0577J2164
$$ 412537 407742 403807 401557 401359 402828 405457 409224 414500 421464 429767 438820 448425 459002 471166
51663D71166J3962J5386J5888J4791J1337N377k056r161j4399j7156j7585j6160
$$ 471166 485128 500514 516402 531193 542530 547907 545851 536690 522291 505135 487550 471390
51651D71390j3386r725n590j346K562N465O523N275K217j379m414o622q201r144
$$ 471390 458004 448279 442689 441343 443905 449370 455893 461168 463385 462006 457592 450970 442769 433625
51637D33625r325q993q617q182p177n478l777k862k686k500j790q50l26m13o08
$$ 433625 424300 415307 406690 398508 391331 385853 382076 379214 376528 374028 372238 371388 371062 370649 370041
51622C70041l87J32M29M61Q14J722K493K365J637J263J497J633J076M8r13j642
$$ 370041 369654 369786 370215 370676 371490 373212 375705 378070 379707 380970 382467 384100 385176 385224 384311 382669
51606C82669k220k667k931k925k441j342k6P67P90O69J235K726M744O741Q429
$$ 382669 380449 377782 374851 371926 369485 368143 368117 368884 369674 370343 371578 374304 379048 385789 394218
51591C94218R968J1648J3079J2885R948N012L27k519l755m225l965k672p97Q15
$$ 394218 404186 415834 428913 441798 451746 456758 457085 454566 450811 446586 442621 439949 439152 439967
51577D39967K085L592N480P285Q899J0827J3285J5572J6778J6807J6503J6899
$$ 439967 442052 445644 451124 458409 467308 478135 491420 506992 523770 540577 557080 573979
51565E73979J8354K0141K0823J9429J6508J3875J3217J5022J8796K3819K9440
$$ 573979 592333 612474 633297 652726 669234 683109 696326 711348 730144 753963 783403
51554G83403L4936L9469M2107M1741L7276K8450J6544L918p441j6895k4742l1275
$$ 783403 818339 857808 899915 941656 978932 1007382 1023926 1027844 1020403 1003508 978766 947491
51542I47491l6459m0166m2298m2789m1885m0223l8222l5458l1270k6050k1284
$$ 947491 911032 870866 828568 785779 743894 703671 665449 629991 598721 572671 551387
51531E51387j8015j5859j3872j1837j0120q782p541o374n478m776m054l440l241
$$ 551387 533372 517513 503641 491804 481684 472902 465361 458987 453509 448733 444679 441239 437998
51518D37998l381l571l877m443m850m507l633l011k776k235j123j69l8n10j109
$$ 437998 434617 431046 427169 422726 417876 413369 409736 406725 403949 401714 400591 400422 400384 399874 398765
51503C98765j863k901l825m007l232j699J28J412J333O3j104j086q0J106K144
$$ 398765 396902 394001 390176 386169 382937 381238 381366 382778 384111 384174 383070 381984 381904 383010 385154
51488C85154L055L548L325K727K431K617L050L606M090L881K581Q08m31j124k080
$$ 385154 388209 391757 395082 397809 400240 402857 405907 409513 413603 417484 420065 420873 420442 419318 417238
51473D17238l467m453m604m621n239o107o489o356o127n697m638l235k385k378
$$ 417238 413771 409318 404714 400093 394854 388747 382258 375902 369775 364078 359440 356205 353820 351442
51459C51442k488k164j872k222k766k493j407o78r64j347n28J477L427M462M881
$$ 351442 348954 346790 344918 342696 339930 337437 336030 335352 334388 333041 332513 333990 337417 341879 346760
51444C46760N418O448Q035J0170J2687J5260J7595J9167J8794J5252Q848J917
$$ 346760 352178 358626 366661 376831 389518 404778 422373 441540 460334 475586 484434 486351
51432D86351k827m331l413j462M35J375O09j930n386q533j0544j1161j0481q827
$$ 486351 483524 479193 475780 474318 474753 476128 476737 474807 469421 460888 450344 439183 428702 419875
51418D19875o843n368m946n320n594n033l680k092p16K94Q51R76J001J290J716
$$ 419875 413032 407664 402718 397398 391804 386771 383091 380999 380283 380577 381428 382404 383405 384695 386411
51403C86411J864J729J731J926J806J171O55R25J687K036J644J157J419K666M466
$$ 386411 388275 390004 391735 393661 395467 396638 397293 398218 399905 401941 403585 404742 406161 408827 413293
51388D13293O205P583Q778J0149J1836J3745J5915J8693K2483K7394L3126L9008
$$ 413293 419498 427081 435859 446008 457844 471589 487504 506197 528680 556074 589200 628208
51376F28208M4289M8652N2454N6104N9123O0057N7344N0211L9100K5754J2608
$$ 628208 672497 721149 773603 829707 888830 948887 1006231 1056442 1095542 1121296 1133904
51365A133904J269q599j8364k8429l7713m5063n0268n3487n4679n4049n2307m9899
$$ 1133904 1135173 1126574 1108210 1079781 1042068 997005 946737 893250 838571 784522 732215 682316
51353F82316m6527m1985l6842l1798k6933k2180j7993j4885j2707j0995r595q406
$$ 682316 635789 593804 556962 525164 498231 476051 458058 443173 430466 419471 409876 401470
51341D01470p016n288l919l593l915l870l118k125j214l25M13N37j67j369k491
$$ 401470 394454 389166 385247 381654 377739 373869 370751 368626 367412 367087 367500 368037 367870 366501 364010
51326C64010l012k682j847j243j117r09j80N44M73l53j277j957k372k298j572
$$ 364010 360998 358316 356469 355226 354109 353200 353020 353564 354037 353684 352407 350450 348078 345780 344208
51311C44208p29n12q72j123r30m82M7N16M35m48j352j142J54J341J612J290Q99
$$ 344208 343479 342967 342095 340972 340042 339560 339607 340123 340558 340110 338758 337616 337770 339111 340723 342013 342912
51294C42912M23k53r06j293j399j161m51M94J153J388J537J842K268K897L888
$$ 342912 343335 343082 342176 340883 339484 338323 337872 338366 339519 340907 342444 344286 346554 349451 353339
51279C53339N018N831O256O509O343N151K899L56j753l223m012m044l527k796
$$ 353339 358357 364188 370444 376953 383296 388447 391346 391702 389949 386726 382714 378670 375143 372347
51265C72347j782k80J283K091K024J710J376N97o88j788k268k511k864l057k877
$$ 372347 370565 370285 371568 373659 375683 377393 378769 379366 378678 376890 374622 372111 369247 366190 363313
51250C63313k633k492k089j322q14j071j713k136k240k063j358j51Q54J096R19
$$ 363313 360680 358188 356099 354777 353963 352892 351179 349043 346803 344740 343382 343231 344085 345181 346100
51235C46100R05J003Q75O32N48M92K47kp4k70q49j401j380q29JJ227K770L763
$$ 346100 347005 348008 348883 349515 350063 350555 350802 350800 350726 350456 349607 348206 346826 345997 345998 347225 349995 353758
51217C53758L410K236J470J414J276O00j00k59k1J56M9l14o53m09P10K039K454
$$ 353758 357168 359404 360874 362288 363564 364164 364064 363805 363784 363940 363989 363675 363022 362613 363323 365362 367816
51200C67816J747R50R67J466J506Q33J07j9L76P11N58N4l60m64m38m31l05P4N05
$$ 367816 369563 370513 371480 372946 374452 375285 375392 375373 375749 376460 377018 377072 376712 376248 375810 375379 375074 375148 375653
51181C75653P78J079J647K130J852P41n07j314j830k343k608k103q88K63N79m6
$$ 375653 376431 377510 379157 381287 383139 383880 383373 382059 380229 377886 375278 373175 372287 372550 373129 373083
51165C73083j048j703j630r65j71L89Q18J572K851M051M116K714R42K82Q97J405
$$ 373083 372035 370332 368702 367737 367566 367955 368773 370345 373196 377247 381363 384077 385019 385301 386198 387603
51149C87603O85o84j265o39K80O51N81M12o2j082k145k425j885j325j268j366
$$ 387603 388288 387604 386339 385700 385980 386631 387212 387624 387562 386480 384335 381910 380025 378700 377432 376066
51133C76066j137p29n18l56J66Q35R27K88k66m9O01R96J238J952L076L686L180
$$ 376066 374929 374200 373682 373326 373492 374327 375254 375542 375276 375227 375828 376824 378062 380014 383090 386776 389956
51116C89956J991R51M60N49J129J820J934J181K42P9Q16J649J858J525J307J749
$$ 389956 391947 392898 393358 393907 395036 396856 398790 399971 400213 400292 401108 402757 404615 406140 407447 409196
51100D09196K852M018M430L795K749K280K619K952K412J195L49N44J354J879J827
$$ 409196 412048 416066 420496 424291 427040 429320 431939 434891 437303 438498 438847 439391 440745 442624 444451
51085D44451J633J687J803J576R23M9r14j916k786l263l252k858k200j364m88
$$ 444451 446084 447771 449574 451150 452073 452122 451208 449292 446506 443243 439991 437133 434933 433569 433081
51070D33081K37O67P69P30R79J858L183M397N339O442Q004R751J1416J3221J5120
$$ 433081 433318 433985 434754 435484 436463 438321 441504 445901 451240 457682 465686 475437 486853 500074 515194
51055E15194J5974J4362J0243N297J588L73J863N327R301J2360J4022J4601J4395
$$ 515194 531168 545530 555773 561070 562658 563031 564894 570221 579522 591882 605904 620505 634900
51042F34900J3459J1911R725O394J754k859n348m991l086j391r50k591p047j3585
$$ 634900 648359 660270 669995 676389 678143 675284 669936 664945 661859 660468 659518 656927 649880 636295
51028F36295j9497k2265k1898k0270j8610j6557j3459r683o333m178k974j696
$$ 636295 616798 594533 572635 552365 533755 517198 503739 494056 487723 483545 480571 478875
51016D78875M03K876M514M802M465M394M710N189N901O773P225O977O750P344
$$ 478875 479278 482154 486668 491470 495935 500329 505039 510228 516129 522902 530127 537104 543854 551198
51002E51198Q381Q788Q268P565P397P882Q865J0050J0940J1309J1723J2935J4827
$$ 551198 559579 568367 576635 584200 591597 599479 608344 618394 629334 640643 652366 665301 680128
50989F80128J6481J7257J7157J6262J4558J2488J0941J0445J0737J1296J1903
$$ 680128 696609 713866 731023 747285 761843 774331 785272 795717 806454 817750 829653
50978H29653J2571J3249J3749J3674J2590J0581Q606P816Q629J0842J4460J9668
$$ 829653 842224 855473 869222 882896 895486 906067 914673 922489 931118 941960 956420 976088
50966I76088K6007L2328L7890M3040M8377N3732N8359O1911O4774O7456O9872
$$ 976088 1002095 1034423 1072313 1115353 1163730 1217462 1275821 1337732 1402506 1469962 1539834
50955A539834P1375P1407O9992O7539O4183N9646N3797M7179M0625L4580K9052
$$ 1539834 1611209 1682616 1752608 1820147 1884330 1943976 1997773 2044952 2085577 2120157 2149209
50944B149209K4013J9626J6126J3801J2963J3573J4833J5337J3834J0065N092
$$ 2149209 2173222 2192848 2208974 2222775 2235738 2249311 2264144 2279481 2293315 2303380 2308472
50933B308472P08j977l545n620r136j3675j8548k3745k9447l5340m1091m7021
$$ 2308472 2309180 2307203 2303658 2298038 2288902 2275227 2256679 2232934 2203487 2168147 2127056 2080035
50921B080035n3572o0342o6284p0638p3174p3870p2977p1155o8805o5524o0812
$$ 2080035 2026463 1966121 1899837 1829199 1756025 1682155 1609178 1538023 1469218 1403694 1342882
50910A342882n5157m9655m4769m0221l5962l2354k9393k6574k3730k1235j9241
$$ 1342882 1287725 1238070 1193301 1153080 1117118 1084764 1055371 1028797 1005067 983832 964591
50899I64591j7328j5218j3252j1886j1117j0614j0040r181q082p091o403n681
$$ 964591 947263 932045 918793 906907 895790 885176 875136 865955 857873 850782 844379 838698
50887H38698m516l167k229j692r40K79J578K670L675M565M946M741M534N008O349
$$ 838698 834182 831015 828786 827094 826154 826433 828011 830681 834356 838921 843867 848608 853142 858150 864499
50872H64499Q311J0419J1984J2506J2283J2240J3006J4459J6237J8178K0166K2059
$$ 864499 872810 883229 895213 907719 920002 932242 945248 959707 975944 994122 1014288 1036347
50860A036347K3940K6104K8706L1791L5543M0083M5049N0050N5443O2048P0038
$$ 1036347 1060287 1086391 1115097 1146888 1182431 1222514 1267563 1317613 1373056 1435104 1505142
50849A505142P8792Q7890R7456J07413J17205J26431J35075J42899J49483J55028
$$ 1505142 1583934 1671824 1769280 1876693 1993898 2120329 2255404 2398303 2547786 2702814
50839B702814J60178J64520J66197J63627J56877J46753J33329J16276R6218P4861
$$ 2702814 2862992 3027512 3193709 3357336 3514213 3660966 3794295 3910571 4006789 4081650
50829D081650N3958L4684J7684L190q711j7496k2190k2307j8385j1230j247J0785
$$ 4081650 4135608 4170292 4187976 4191166 4182455 4164959 4142769 4120462 4102077 4090847 4089600 4100385
50817D100385K2852L2446L7918L8470L3329K2067N622j3957l5069n7119p9575
$$ 4100385 4123237 4155683 4193601 4232071 4265400 4287467 4293089 4279132 4244063 4186944 4107369
50806D107369j01335j21440j39610j55552j68208j76288j79337j77815j72312
$$ 4107369 4006034 3884594 3744984 3589432 3421224 3244936 3065599 2887784 2715472
50797B715472j63271j51515j38440j25225j11986r8128q3599o9377n6564m5316
$$ 2715472 2552201 2400686 2262246 2137021 2025035 1926907 1843308 1773931 1717367 1672051
50787A672051l5073k5628j7378j0580m977m62K360K763R67j764m108n668o988
$$ 1672051 1636978 1611350 1593972 1583392 1578415 1577953 1580313 1583076 1584043 1582279 1578171 1572503 1565515
50774A565515q697j0693j2337j3446j4671j6569j8674k0104k0940k2222k4532
$$ 1565515 1556818 1546125 1533788 1520342 1505671 1489102 1470428 1450324 1429384 1407162 1382630
50763A382630k7315k9681l1222l1766l1148k9687k8198k6992k5432k2948j9986
$$ 1382630 1355315 1325634 1294412 1262646 1231498 1201811 1173613 1146621 1121189 1098241 1078255
50752A078255j7317j4916j2259r280o319l349j19L141N893Q188J0663J3540J6398
$$ 1078255 1060938 1046022 1033763 1024483 1018164 1014815 1014696 1017837 1023730 1031918 1042581 1056121 1072519
50739A072519J9054K2109K6211L1235L6473M1425M6125N0932N6243O2222O8628
$$ 1072519 1091573 1113682 1139893 1171128 1207601 1249026 1295151 1346083 1402326 1464548 1533176
50728A533176P4808Q0025Q3802Q6168Q7621Q8706Q9382Q8927Q6672Q2737P7762
$$ 1533176 1607984 1688009 1771811 1857979 1945600 2034306 2123688 2212615 2299287 2382024 2459786
50717B459786P1931O4600N4935M2688K8259J2439l590j8081k9178l5817l8146
$$ 2459786 2531717 2596317 2651252 2693940 2722199 2734638 2731048 2712967 2683789 2647972 2609826
50706B609826l6860l2358k4845j5158m887M593J2788J9597K4600K7247K7313K4448
$$ 2609826 2572966 2540608 2515763 2500605 2495718 2500311 2513099 2532696 2557296 2584543 2611856 2636304
50694B636304J7675O142r553k7399m5389o2237p6902q8314r5862r9517r9356r5583
$$ 2636304 2653979 2660121 2650568 2623169 2577780 2515543 2438641 2350327 2254465 2154948 2055592 1960009
50682A960009q9141q1326p2613o2619n1565m0699l0748k1029j0801n87Q832J7822
$$ 1960009 1870868 1789542 1716929 1654310 1602745 1562046 1531298 1510269 1499468 1498881 1507713 1525535
50670A525535K7073L5873M2675M7070M9934N1544N0874M7205M1451L5366L0040
$$ 1525535 1552608 1588481 1631156 1678226 1728160 1779704 1830578 1877783 1919234 1954600 1984640
50659A984640K5548K1539J7730J4189J1486J0278J0493J1116J0986R765Q119P087
$$ 1984640 2010188 2031727 2049457 2063646 2075132 2085410 2095903 2107019 2118005 2127770 2135889 2142976
50647B142976P216Q161R274J0689J3421J8052K3759K9176L3974L8916M4439M9929
$$ 2142976 2150192 2158353 2167627 2178316 2191737 2209789 2233548 2262724 2296698 2335614 2380053 2429982
50635B429982N4385N7261N8401N7771N5449N1701M6916M1718L6999L3454L0979
$$ 2429982 2484367 2541628 2600029 2657800 2713249 2764950 2811866 2853584 2890583 2924037 2955016
50624B955016K8551K4345J5697j0k2928m8895p1053q4163q7373q3106p4281o2864
$$ 2955016 2983567 3007912 3023609 3023599 3000671 2951776 2880723 2796560 2709187 2626081 2551800 2488936
50612B488936n0037l6611k3291j0931l91Q008J4553J9263K1263J9452J3559M247
$$ 2488936 2438899 2402288 2378997 2368066 2367675 2375683 2390236 2409499 2430762 2450214 2463773 2468020
50600B468020p589k1190l5693m9935o2651p2807p9920q4175q6099q5963q3775
$$ 2468020 2460431 2439241 2403548 2353613 2290962 2218155 2138235 2054060 1967961 1881998 1798223
50589A798223p9953p5595p1534o7353o1848n4641m6908m0197l4917l0214k5320
$$ 1798223 1718270 1642675 1571141 1503788 1441940 1387299 1340391 1300194 1265277 1235063 1209743
50578A209743k0562j6837j4419j2589j0530q159n918m026k389j027j45L45R65
$$ 1209743 1189181 1172344 1157925 1145336 1134806 1126647 1120729 1116703 1114314 1113287 1113142 1113487 1114452
50565A114452K101L565M997O550Q752J1784J5163J8343K1379K4725K8590L2774
$$ 1114452 1116553 1120118 1125115 1131665 1140417 1152201 1167364 1185707 1207086 1231811 1260401 1293175
50553A293175L7135M1762M6482N0566N3270N4522N4672N3778N1614M8329M4550
$$ 1293175 1330310 1372072 1418554 1469120 1522390 1576912 1631584 1685362 1736976 1785305 1829855
50542A829855M0756L7207L4557L3881L5649L9178M3540M8606N4698O1712O9107
$$ 1829855 1870611 1907818 1942375 1976256 2011905 2051083 2094623 2143229 2197927 2259639 2328746
50531B328746P6547Q3933R1092R8000J05158J13154J21969J31137J40367J49266
$$ 2328746 2405293 2489226 2580318 2678318 2783476 2896630 3018599 3149736 3290103 3439369
50521C439369J56681J61182J62344J60850J57100J50398J39787J25078J06705
$$ 3439369 3596050 3757232 3919576 4080426 4237526 4387924 4527711 4652789 4759494
50512D759494Q5093O0732L4509P435j9943m7434p4488r9751j21470j38346j50011
$$ 4759494 4844587 4905319 4939828 4947263 4927320 4879886 4805398 4705647 4584177 4445831 4295820
50501D295820j56626j58111j53985j44091j29103j09982q7306o1655l4452p711
$$ 4295820 4139194 3981083 3827098 3683007 3553904 3443922 3356616 3294961 3260509 3252798
50491C252798J6995L8779N6660O9228P5161P3440O3056M3468J5898j6359m9530
$$ 3252798 3269793 3308572 3365232 3434460 3509621 3583061 3646117 3689585 3705483 3689124 3639594
50480C639594q0936j08782j31290j46998j55791j58865j57650j53257j46756j39188
$$ 3639594 3558658 3449876 3318586 3171588 3015797 2856932 2699282 2546025 2399269 2260081
50470B260081j30995j21923j11831j01316r1277q2128p3690o5759n8445n1935
$$ 2260081 2129086 2007163 1895332 1794016 1702739 1620611 1546921 1481162 1422717 1370782
50460A370782m6176m0969l6268l2111k8252k4174j9700j5488j2480j0858r764
$$ 1370782 1324606 1283637 1247369 1215258 1187006 1162832 1143132 1127644 1115164 1104306 1094542
50449A094542q182n892l413j325K16J390K484L709N089O452P605Q484R122R530
$$ 1094542 1086360 1080468 1077055 1075730 1075946 1077336 1079820 1083529 1088618 1095070 1102675 1111159 1120281 1129811
50435A129811R704R723R828J0368J1601J3380J5102J6148J6437J6504J6977J8102
$$ 1129811 1139515 1149238 1159066 1169434 1181035 1194415 1209517 1225665 1242102 1258606 1275583 1293685
50423A293685J9739K1618K3515K5328K7152K9216L1710L4700L8344M2937M8580
$$ 1293685 1313424 1335042 1358557 1383885 1411037 1440253 1471963 1506663 1545007 1587944 1636524
50412A636524N4834O1019O6919P2984P9530Q5924R0891R3628R4289R3219R0300
$$ 1636524 1691358 1752377 1819296 1892280 1971810 2057734 2148625 2242253 2336542 2429761 2520061
50401B520061Q5381P9056P2267O5155N6921M6893L5153K1929P060r489k7044m4606
$$ 2520061 2605442 2684498 2756765 2821920 2878841 2925734 2960887 2982816 2989876 2980387 2953343 2908737
50389B908737o1473p6970q9914r8994j03608j03909j00241r3063q3400p2556o1097
$$ 2908737 2847264 2770294 2680380 2581386 2477778 2373869 2273628 2180565 2097165 2024609 1963512
50378A963512m8496l4149j8630l652R166J9384K7393L3106L5290L2617K5146J4288
$$ 1963512 1915016 1880867 1862237 1858585 1867751 1887135 1914528 1947634 1982924 2015541 2040687 2054975
50366B054975J392j2955k8063m2498n4823o4419p1058p4403p4583p2700o9835
$$ 2054975 2056367 2043412 2015349 1972851 1918028 1853609 1782551 1708148 1633565 1560865 1491030
50355A491030o6014o1057n5947n2165m9786m7408m4065m0200l6567l3260l0101
$$ 1491030 1425016 1363959 1308012 1255847 1206061 1158653 1114588 1074388 1037821 1004561 974460
50344I74460k7175k4467k1711j8924j6456j4223j1612q518n768m077l124k111
$$ 974460 947285 922818 901107 882183 865727 851504 839892 831374 825606 821529 818405 816294
50332H16294p43P31J953K625K659K480K725L433M013M215M493N216O184P281Q788
$$ 816294 815551 816282 818235 820860 823519 825999 828724 832157 836170 840385 844878 850094 856278 863559 872347
50317H72347J0635J2103J2940J4029J6206J8919K0858K1426K0729J8543J4372
$$ 872347 882982 895085 908025 922054 938260 957179 978037 999463 1020192 1038735 1053107
50306A053107Q587K732j558l608l777l004k250j962j945j800j290k24J523L599
$$ 1053107 1061694 1064426 1062868 1059260 1055483 1052479 1050229 1048267 1046322 1044522 1043232 1043008 1044531 1048130
50292A048130N335O705Q373J0302J1119R880P841P198Q440J0198J1709J3902J7781
$$ 1048130 1053465 1060170 1068543 1078845 1089964 1099844 1107685 1114883 1123323 1133521 1145230 1159132 1176913
50279A176913K3156K9481L6396M2061M2258L3219J5813m228k0609l0563l4816
$$ 1176913 1200069 1229550 1265946 1308007 1350265 1383484 1399297 1395069 1374460 1343897 1309081
50268A309081l5047l2442k8220k4037k1188j9650j8348j6400j3878j1524r832
$$ 1309081 1274034 1241592 1213372 1189335 1168147 1148497 1130149 1113749 1099871 1088347 1078515
50257A078515q581p143n190k969r13Q41K349L438L816L656L657M307N415O525
$$ 1078515 1069934 1062791 1057601 1054632 1053719 1054560 1056909 1060347 1064163 1067819 1071476 1075783 1081198 1087723
50243A087723P415P865P533O642O357P581R582J0728J0618J0530J1561J3311J4872
$$ 1087723 1095138 1103003 1110536 1117178 1123535 1131116 1140698 1151426 1162044 1172574 1184135 1197446 1212318
50230A212318J6184J7737J9522K1253K3237K6258L0543L5386L9817M3143M4914
$$ 1212318 1228502 1246239 1265761 1287014 1310251 1336509 1367052 1402438 1442255 1485398 1530312
50219A530312M4822M2804L9087L4123K8619K3609K0182J8988J9875K1899K3715
$$ 1530312 1575134 1617938 1657025 1691148 1719767 1743376 1763558 1782546 1802421 1824320 1848035
50208A848035K4126K2213J6985P554n771k0914l5398m8195n9417o8359p3236p3280
$$ 1848035 1872161 1894374 1911359 1918913 1913142 1892228 1856830 1808635 1749218 1680859 1607623 1534343
50196A534343o9842o4692n8287n0560m2414l5120k8950k3651j9939j9144k1414
$$ 1534343 1464501 1399809 1341522 1290962 1248548 1213428 1184478 1160827 1140888 1121744 1100330
50185A100330k5366k9532l3106l5338l5354l3090k9611k6107k3026k0315j7895
$$ 1100330 1074964 1045432 1012326 976988 941634 908544 878933 852826 829800 809485 791590
50174G91590j5670j3602j1914j0836j0098r182q098p301o860o321n433m410l374
$$ 791590 775920 762318 750404 739568 729470 720288 712190 704889 698029 691708 686275 681865 678491
50161F78491k210j003OJ004K366L795M535M697N472P502R876J1306J1703J1822
$$ 678491 676281 675278 675284 676288 678654 682449 686984 691681 697153 704655 714531 725837 737540 749362
50147G49362J1935J1619J0619R150P436N604L942K807K138J491O10k41n31J13
$$ 749362 761297 772916 783535 792685 800121 805725 809667 812474 814612 816103 816713 816472 815941 816054
50133H16054J707L891O175Q263J0078J1477J2247J2500J2728J3266J3938J4534
$$ 816054 817761 821652 827827 836090 846168 857645 869892 882392 895120 908386 922324 936858
50121I36858J5310J6671J8553K0561K2618K5087K8241L1977L6102M0602M5534
$$ 936858 952168 968839 987392 1007953 1030571 1055658 1083899 1115876 1151978 1192580 1238114
50110A238114N0927N7008O4329P3348Q3681R3921J02288J07516J09015J06552
$$ 1238114 1289041 1346049 1410378 1483726 1567407 1661328 1763616 1871132 1980147 2086699
50100B086699J00342R1790Q3546P8031P5768P5534P6045P6811P7131P5105O8326
$$ 2086699 2187041 2278831 2362377 2440408 2516176 2591710 2667755 2744566 2821697 2896802 2965128
50089B965128N5427L6666J3474j1952l6915n8988p7067r1353j02230j09483j12789
$$ 2965128 3020555 3057221 3070695 3058743 3021828 2962840 2885773 2794420 2692190 2582707 2469918
50078B469918j12582j09947j05735j00172r3340q5683p7817p0043o2369n5000
$$ 2469918 2357336 2247389 2141654 2041482 1948142 1862459 1784642 1714599 1652230 1597230
50068A597230m8533m3552m0179l8050l6543l5009l3124l1187k9735k8657k7055
$$ 1597230 1548697 1505145 1464966 1426916 1390373 1355364 1322240 1291053 1261318 1232661 1205606
50057A205606k4340k1171j8650j6841j4769j2012r448q050p543o888n648m232
$$ 1205606 1181266 1160095 1141445 1124604 1109835 1097823 1088375 1080325 1072782 1065894 1060246 1056014
50045A056014k976j641K7J830L452M928O443P834Q541Q138O846N496M930N258
$$ 1056014 1053038 1051397 1051424 1053254 1056706 1061634 1068077 1075911 1084452 1092590 1099436 1104932 1109862 1115120
50031A115120N676N173L553J712O94N80L93p82k790m648n696o282p176q531r716
$$ 1115120 1120796 1125969 1129522 1131234 1131928 1132508 1132901 1132119 1129329 1124681 1118985 1112703 1105527 1096996 1087280
50016A087280j0135r955r808j0034j0424j0764j1198j1814j2099j1277r302p093
$$ 1087280 1077145 1067190 1057382 1047348 1036924 1026160 1014962 1003148 991049 979772 970470 963377
50004I63377n587m798m133l254k101k70K883P341J2209J6816K1506K6874L2563
$$ 963377 957790 952992 948859 945605 943504 943234 946117 953458 965667 982483 1003989 1030863 1063426
49991A063426L7432M0877M3452M6173M9624N3788N8311O2549O5583O6439O4352
$$ 1063426 1100858 1141735 1185187 1231360 1280984 1334772 1393083 1455632 1521215 1587654 1652006
49980A652006N9008N0801M1014L1497K3937J9292J7767J8969K1846K4467K4379
$$ 1652006 1711014 1761815 1802829 1834326 1858263 1877555 1895322 1914291 1936137 1960604 1984983
49969A984983J9596R559m878k2325m1413o0423p6945q8664r4781r6118r3856q8598
$$ 1984983 2004579 2014138 2009260 1986935 1945522 1885099 1808154 1719490 1624709 1528591 1434735 1346137
49957A346137q0819p1563o2102n3236m5275l8365l2339k6623k0842j5406j0901
$$ 1346137 1265318 1193755 1131653 1078417 1033142 994777 962438 935815 914973 899567 888666
49946H88666p145l512j17K040K266R61r10k613l702l889l311k710k909m200o415
$$ 888666 881521 878009 877892 879932 882198 883159 882249 879636 875934 872045 868734 866024 863115 858915 852500
49931H52500r391j3120j7379k1395k3984k4297k2567k0035j7837j6012j3814j0919
$$ 852500 843109 829989 812610 791215 767231 742934 720367 700332 682495 666483 652669 641750
49919F41750q005o005n145m791m073k630q30O20J337J499J431J283J305K001L549
$$ 641750 633745 627740 622595 617804 613731 611101 610271 610891 612228 613727 615158 616441 617746 619747 623296
49904F23296N272O294O616O943P527P952Q211R163J1421J4243J6065J5895J3778
$$ 623296 628568 634862 641478 648421 655948 663900 672111 681274 692695 706938 723003 738898 752676
49891G52676J0347O450L016O38q65k115l393m514n433o567q272j0332j2226j3753
$$ 752676 763023 769473 772489 773127 772262 770147 766754 762240 756807 750240 741968 731636 719410 705657
$$ [...]
##END NTUPLES=NMR SPECTRUM
##END=
