
##TITLE=AC1410_ECUAH12219_7653105_wtmQEQFSva
##JCAMPDX= 6.0         $$ Bruker NMR JCAMP-DX V2.0
##DATA TYPE= NMR SPECTRUM
##DATA CLASS= NTUPLES
##ORIGIN= BRUKER
##OWNER= Administrator
$$ 1.72 TOPSPIN		Version 2.1
$$ 2013-03-19 19:03:28.460 -0500  Administrator@X
$$ Compression mode = diff/dup
##.OBSERVE FREQUENCY= 400.02188249412
##.OBSERVE NUCLEUS= ^1H
##.ACQUISITION MODE= SIMULTANEOUS (DQD)
##.ACQUISITION SCHEME= undefined
##.AVERAGES= 8
##.DIGITISER RES= 22
##SPECTROMETER/DATA SYSTEM= spect
##.PULSE SEQUENCE= zg30
##.SOLVENT NAME= COFFEE_meoh
##.SHIFT REFERENCE= INTERNAL, COFFEE_meoh, 1, 14.98509
##AUDIT TRAIL= $$ (NUMBER, WHEN, WHO, WHERE, PROCESS, VERSION, WHAT)
$$ ##TITLE= Audit trail, TOPSPIN		Version 2.1
$$ ##JCAMPDX= 5.01
$$ ##ORIGIN= Bruker BioSpin GmbH
$$ ##OWNER= Administrator
$$ $$ E:\/data/COFFEE/nmr/AC1410_ECUAH12219_7653105_wtmQEQFSva/20/pdata/1/auditp.txt
$$ ##AUDIT TRAIL=  $$ (NUMBER, WHEN, WHO, WHERE, PROCESS, VERSION, WHAT)
(   1,<2013-03-19 19:03:20.210 -0500>,<Administrator>,<X>,<go>,<TOPSPIN 2.1>,
      <created by zg
	started at 2013-03-19 19:02:13.647 -0500,
	POWCHK enabled, PULCHK disabled,
       configuration hash MD5:
       86 BA 57 50 F2 9D 5C 9B 26 00 A9 28 5F 66 2E 89
       data hash MD5: 64K
       05 BB 6E 2D 8F B3 EE C3 B7 1C 1A 6B 97 6A 67 DF>)
(   2,<2013-03-19 19:03:23.381 -0500>,<Administrator>,<X>,<proc1d>,<TOPSPIN 2.1>,
      <Start of raw data processing
       efp LB = 0 FT_mod = 6 PKNL = 1 PHC0 = 0 PHC1 = 0 SI = 32K 
       data hash MD5: 32K
       02 BC 1C 42 95 08 48 55 B3 E0 33 78 78 DB 9F 9B>)
(   3,<2013-03-19 19:03:23.819 -0500>,<Administrator>,<X>,<proc1d>,<TOPSPIN 2.1>,
      <pk PHC0 = 101.5961 PHC1 = 0 
       data hash MD5: 32K
       EE EF 7A C2 0F 14 3D 86 5C 9A 06 11 6D A5 34 21>)
(   4,<2013-03-19 19:03:24.053 -0500>,<Administrator>,<X>,<proc1d>,<TOPSPIN 2.1>,
      <abs ABSG = 1 
       data hash MD5: 32K
       40 FA C4 78 82 FE 10 B6 B5 4C FB F0 A5 5B B8 01>)
(   5,<2013-03-19 19:03:24.210 -0500>,<Administrator>,<X>,<proc1d>,<TOPSPIN 2.1>,
      <abs ABSG = 2 
       data hash MD5: 32K
       DC 41 2E C4 F7 A4 71 06 0D 6D 99 35 94 7A CA 18>)
(   6,<2013-03-19 19:03:24.350 -0500>,<Administrator>,<X>,<proc1d>,<TOPSPIN 2.1>,
      <abs ABSG = 3 
       data hash MD5: 32K
       AE 34 40 F4 BD 8B 5F 68 ED 82 E7 9C 1C 07 25 14>)
(   7,<2013-03-19 19:03:24.475 -0500>,<Administrator>,<X>,<proc1d>,<TOPSPIN 2.1>,
      <abs ABSG = 4 
       data hash MD5: 32K
       12 33 B0 9D 72 B0 63 53 A2 2D ED 70 0A B1 70 5C>)
(   8,<2013-03-19 19:03:24.600 -0500>,<Administrator>,<X>,<proc1d>,<TOPSPIN 2.1>,
      <abs ABSG = 5 
       data hash MD5: 32K
       51 D8 50 34 FF 22 0D 68 B5 EC 96 08 6E 88 93 EC>)
$$ ##END=
$$ 
$$ $$ hash MD5
$$ $$ AF CD 9D D5 FC E0 FD F3 BA 3E A7 56 8B 3C 10 BB
##$RELAX= 
##$RELAX= 
##$RELAX= 
##$RELAX= 
##$RELAX= 
##$RELAX= 
##$RELAX= 
$$ Bruker specific parameters
$$ --------------------------
##$DU= <E:\>
##$EXPNO= 20
##$NAME= <AC1410_ECUAH12219_7653105_wtmQEQFSva>
$$ [...]
150 150 150 150 150 150 150 150
##$TP07= 0
##$TPNAME0= <>
##$TPNAME1= <>
##$TPNAME2= <>
##$TPNAME3= <>
##$TPNAME4= <>
##$TPNAME5= <>
##$TPNAME6= <>
##$TPNAME7= <>
##$TPOAL= (0..7)
0.5 0.5 0.5 0.5 0.5 0.5 0.5 0.5
##$TPOFFS= (0..7)
0 0 0 0 0 0 0 0
##$TUNHIN= 0
##$TUNHOUT= 0
##$TUNXOUT= 0
##$USERA1= <user>
##$USERA2= <user>
##$USERA3= <user>
##$USERA4= <user>
##$USERA5= <user>
##$V9= 5
##$VALIST= <valist>
##$VCLIST= <CCCCCCCCCCCCCCC>
##$VD= 0
##$VDLIST= <DDDDDDDDDDDDDDD>
##$VPLIST= <PPPPPPPPPPPPPPP>
##$VTLIST= <TTTTTTTTTTTTTTT>
##$WBST= 2048
##$WBSW= 25
##$XGAIN= (0..3)
0 0 0 0
##$XL= 0
##$YL= 0
##$YMAX_a= 602928
##$YMIN_a= -516996
##$ZGOPTNS= <>
##$ZL1= 120
##$ZL2= 120
##$ZL3= 120
##$ZL4= 120
##$ABSF1= 14.98509
##$ABSF2= -5.573092
##$ABSG= 5
##$ABSL= 3
##$ALPHA= 0
##$AQORDER= 0
##$ASSFAC= 0
##$ASSFACI= 0
##$ASSFACX= 0
##$ASSWID= 0
##$AUNMP= <proc_prof1d_extract_pilot.lims>
##$AXLEFT= 0
##$AXNAME= <>
##$AXNUC= <1H>
##$AXRIGHT= 0
##$AXTYPE= 0
##$AXUNIT= <>
##$AZFE= 0.1
##$AZFW= 0.1
##$BCFW= 0
##$BC_mod= 0
##$BYTORDP= 0
##$COROFFS= 0
##$CY= 15
##$DATMOD= 1
##$DC= 0
##$DFILT= <>
##$DTYPP= 0
##$F1P= 0
##$F2P= 0
##$FCOR= 0.5
##$FTSIZE= 32768
##$FT_mod= 6
##$GAMMA= 0
##$GB= 0
##$INTBC= 1
##$INTSCL= 1
##$ISEN= 128
##$LB= 0
##$LEV0= 0
##$LPBIN= 0
##$MAXI= 10000
##$MC2= 0
##$MEAN= 0
##$ME_mod= 0
##$MI= 0
##$NCOEF= 0
##$NC_proc= -8
##$NLEV= 6
##$NOISF1= 0
##$NOISF2= 0
##$NSP= 0
##$NTH_PI= 0
##$NZP= 0
##$OFFSET= 14.98509
##$PC= 1
##$PHC0= 101.5961
##$PHC1= 0
##$PH_mod= 1
##$PKNL= yes
##$PPARMOD= 0
##$PPDIAG= 0
##$PPIPTYP= 0
##$PPMPNUM= 2147483647
##$PPRESOL= 1
##$PSCAL= 4
##$PSIGN= 0
##$PYNMP= <proc.py>
##$REVERSE= no
##$SF= 400.02
##$SI= 32768
##$SIGF1= 0
##$SIGF2= 0
##$SINO= 400
##$SIOLD= 32768
##$SPECTYP= <>
##$SREGLST= <1H.CDCl3>
##$SSB= 0
##$STSI= 32768
##$STSR= 0
##$SW_p= 8223.68421052631
##$SYMM= 0
##$S_DEV= 0
##$TDeff= 65536
##$TDoff= 0
##$TI= <>
##$TILT= no
##$TM1= 0
##$TM2= 0
##$TOPLEV= 0
##$USERP1= <user>
##$USERP2= <user>
##$USERP3= <user>
##$USERP4= <user>
##$USERP5= <user>
##$WDW= 1
##$XDIM= 32768
##$YMAX_p= 457330435
##$YMIN_p= -801665
##$CURPLOT= <Network HP LaserJet P1505>
##$CURPRIN= <$Network HP LaserJet P1505>
##$DFORMAT= <normdp>
##$LAYOUT= <+/1D_H.xwp>
##$LFORMAT= <normlp>
##$PFORMAT= <normpl>
##$SURQMSG= 1
$$ End of Bruker specific parameters
$$ ---------------------------------
##NTUPLES= NMR SPECTRUM
##VAR_NAME=  FREQUENCY,     SPECTRUM/REAL,   SPECTRUM/IMAG
##SYMBOL=    X,             R,               I
##VAR_TYPE=  INDEPENDENT,   DEPENDENT,       DEPENDENT
##VAR_FORM=  AFFN,          ASDF,            ASDF
##VAR_DIM=   32768,         32768,           32768
##UNITS=     HZ,            ARBITRARY UNITS, ARBITRARY UNITS
##FACTOR=    0.250966925370066, 1,           1
##FIRST=     8223.43324360094, -23423,       -266662
##LAST=      0,             228811,          -269797
##MIN=       0,             -801665,         0
##MAX=       8223.43324360094, 457330435,    0
$$ Real data points
##PAGE= N=1
##DATA TABLE= (X++(R..R)), XYDATA
$$ [...]
19560a06525A29700a42383P02K0436L2985r3462H3644a00752B27674f75313h0844
$$ -106525 129700 -142383 -141681 -121245 -88260 -181722 83644 -100752 227674 -675313 -80844
19548c65997A98257H9806J7731a85914j13007B66038c81619a24320N375B9988
$$ -365997 198257 89806 107537 -185914 -298921 266038 -381619 -124320 -118945 29988
19537D2172j4276a33216A50738g9557G897h4332A96748F602d5590j59555K6080
$$ 42172 27896 -133216 150738 -79557 7897 -84332 196748 6602 -45590 -205145 -179065
19526a79065B3238G583c81067J26585e1889B2107b73755c0624l11005e8160A70904
$$ -179065 23238 7583 -381067 -254482 -51889 22107 -273755 -30624 -341629 -58160 170904
19514d7543k13832R3657j4042L606C40018a29250l04577B36335b2088j45128d4863
$$ -47543 -261375 -167718 -181760 -178154 340018 -129250 -433827 236335 -22088 -167216 -44863
19502A89933G8909c48098a39745q6158a3001A59366Q9847D9726A2126f9565B57020
$$ 189933 78909 -348098 -139745 -225903 -13001 159366 249213 49726 12126 -69565 257020
19490a28077k57439h8187j46407N6234k17159A52266k8759J22201c47166A7114
$$ -128077 -385516 -88187 -234594 -178360 -395519 152266 123507 245708 -347166 17114
19479b21137o3806k57039a94600B86898i0014b5271j04100D8944k0955c5770k60750
$$ -221137 -284943 -541982 -194600 286898 -90014 -25271 -129371 48944 27989 -35770 -296520
19468b96520A18263j7438a3684j57906B00610a58077A7438a03289a4038j12693
$$ -296520 118263 100825 -13684 -171590 200610 -158077 17438 -103289 -14038 -126731
19458a26731A3392b60230A80748J04394h4911B9712c10468D3793a48053j4756
$$ -126731 13392 -260230 180748 285142 -84911 29712 -310468 43793 -148053 -162809
19448a62809D2578b62149K3841A1750P7131a31360a2623A00999C556a36164A66644
$$ -162809 42578 -262149 -238308 11750 88881 -131360 -12623 100999 3556 -136164 166644
19436a01420k8716e6215j8449f955L204C339a52272A00180a65703B59904a19207
$$ -101420 -130136 -56215 -74664 -6955 -3751 3339 -152272 100180 -165703 259904 -119207
19424f4033e602A0574d9747j25536j4973B9001d66026a51152p5884c4962J6673
$$ -64033 -5602 10574 -49747 -175283 -190256 29001 -466026 -151152 -227036 -34962 -18289
19413a8289I7122B499a22737N1002j5569D2828J42132a42689C38943a24576C01872
$$ -18289 97122 2499 -122737 -71735 -87304 42828 184960 -142689 338943 -124576 301872
19401C3648b56428B56959h1215k82188J35120J5978L5988C19018A26085J38057
$$ 33648 -256428 256959 -81215 -363403 -228283 -212305 -176317 319018 126085 264142
19391B64142G4595a31388q9295B64650I9645a82563E4634i1984d5782o9211a1612
$$ 264142 74595 -131388 -220683 264650 99645 -182563 54634 -91984 -45782 -114993 -11612
19379c5361B6867a04034j68564K8685a5410r0589q2623k0917R6969N4842b482
$$ -35361 26867 -104034 -272598 -243913 -15410 -105999 -188622 -209539 -112570 -57728 -2482
19367A00355b32848D12495c35561J10980P6065L5164o074j82289o9629f349m0923
$$ 100355 -232848 412495 -335561 -224581 -148516 -113352 -119426 -301715 -371344 -6349 -47272
19356d7272q4737b4529E0802i5849B6285a70649B49597C8079b79667A34425a11449
$$ -47272 -132009 -24529 50802 -95849 26285 -170649 249597 38079 -279667 134425 -111449
19344A03891J9838d233C166d74597a40817A726a8578p2897i048B2417J08613i6311
$$ 103891 123729 -4233 3166 -474597 -140817 1726 -18578 -91475 -9048 22417 131030 -96311
19331h5789D04064H9437c1370j97727a09380A37144a15095J8800M50j36645O7365
$$ -85789 404064 89437 -31370 -229097 -109380 137144 -115095 -96295 -95845 -232490 -165125
19320a65125d1996B52058a66989B9614K23569H4L4078a19234C79858b96360K9429
$$ -165125 -41996 252058 -166989 29614 253183 84 34162 -119234 379858 -296360 -266931
19309b66931m7406C13592a16423C1404d25807G0472M5884D4000i8358F5527a95636
$$ -266931 -314337 313592 -116423 31404 -425807 70472 116356 44000 -98358 65527 -195636
19297g0524H9941a1864B5476a62662A89757K1650K2518a04330D1740a27759A44324
$$ -70524 89941 -11864 25476 -162662 189757 211407 233925 -104330 41740 -127759 144324
19285c7134A53026a20862k51544h7157H6943c64098j0115E7294a18773j01999
$$ -37134 153026 -120862 -372406 -87157 86943 -364098 -374213 57294 -118773 -220772
19275b20772a7656A51265h9776j87718a22514j06176d3397k33984C4283K03526
$$ -220772 -17656 151265 -89776 -277494 -122514 -228690 -43397 -277381 34283 237809
19265B37809b09810D5280j4483a56177C02468b6985l05910D5384h2744o7365I7595
$$ 237809 -209810 45280 30797 -156177 302468 -26985 -332895 45384 -82744 -150109 97595
19253a0687j35812e1909b1494H2264j2341f9157k14210D0177J71314c05599k4181
$$ -10687 -146499 -51909 -21494 82264 69923 -69157 -283367 40177 211491 -305599 -329780
19242c29780O0213J30092A13396c0062q7F9843a64740P2161D9633a933F6460b67652
$$ -329780 -269567 -139475 113396 -30062 -30149 69843 -164740 -92579 49633 -1933 66460 -267652
19229b50669J01290C6275b14345Q2919B06233a31930c7043B15563N1012b92369
$$ -250669 -149379 36275 -214345 -131426 206233 -131930 -37043 215563 266575 -292369
19218d61333f3002l1762K630b9366A7143a2876o5658l37207H902J70621a13294
$$ -461333 -63002 -94764 -92134 -29366 17143 -12876 -78534 -415741 8902 179523 -113294
19206B73372a73185L6122n0171P3009h701k32492Q4245B468b13513h7592j46260
$$ 273372 -173185 -137063 -187234 -114225 -8701 -241193 -156948 2468 -213513 -87592 -233852
19195b33852N998B59183q124b01807B62700a78496A30199G389e9802A31433f9268
$$ -233852 -227854 259183 251059 -201807 262700 -178496 130199 7389 -59802 131433 -69268
19183A1383b02625c2765k06265A81103e7176d470k06781L659d4538j97996j68746
$$ 11383 -202625 -32765 -239030 181103 -57176 -4470 -211251 -207592 -44538 -242534 -411280
19172d11280b0524A34300a81731b3137b603E4928b55432k3045P5892R0453k1252
$$ -411280 -20524 134300 -181731 -23137 -2603 54928 -255432 -278477 -202585 -112132 -133384
19161a33384G4651b13020k91120E8327c13725I394J17458f5234c0127C4291c08936
$$ -133384 74651 -213020 -504140 58327 -313725 9394 126852 -65234 -30127 34291 -308936
19149d8058G1119b56823P157p2310E0201c67825i5175A1358g6227j98962A89652
$$ -48058 71119 -256823 -249666 -321976 50201 -367825 -95175 11358 -76227 -275189 189652
19137E397a19458j55826J29681d0210k6529j4441j20175k7392g3379B7993L03110
$$ 5397 -119458 -275284 -145603 -40210 -66739 -81180 -201355 -228747 -73379 27993 331103
19126C31103c8139m1496j06860H8132B6610Q6181l7930A5571h8964b1023F0028
$$ 331103 -38139 -79635 -186495 88132 26610 112791 74861 15571 -88964 -21023 60028
19114d66309G0970a36320B1201J34111M7037j1040N9536d8814j51108j5793A94317
$$ -466309 70970 -136320 21201 155312 202349 191309 250845 -48814 -199922 -215715 194317
19102f5561B33856a24114D92764h126j60360B3197J3141a5247A45950J4259n7898
$$ -65561 233856 -124114 492764 -8126 -168486 23197 36338 -15247 145950 160209 102311
19091A02311a52402B23801C5455f2132b9205j19134L4884C8600P0879d10679J50285
$$ 102311 -152402 223801 35455 -62132 -29205 -148339 -113455 38600 109479 -410679 -260394
19080b60394k31734a30092L4019A78129M3107A09377h5689j20186A08089h1365
$$ -260394 -492128 -130092 -96073 178129 221236 109377 -85689 -205875 108089 -81365
19069b48534A57294O9803g7379l5818A39329D7749b1835A4536a80079c6092A70157
$$ -248534 157294 227097 -77379 -113197 139329 47749 -21835 14536 -180079 -36092 170157
19057a39358B9050Q182J24119N8087i2980J7268l2653l1887A3278L8951b10255
$$ -139358 29050 37232 161351 219438 -92980 -75712 -108365 -140252 13278 52229 -210255
19045g1435C19077G2993d8510I5542a9547j1041k44003A06234J61781i6207A41845
$$ -71435 319077 72993 -48510 95542 -19547 -30588 -274591 106234 268015 -96207 141845
19033a44221I4894A8259a25153h969j8873I4916K44111q4600j07006m6283K55314
$$ -144221 94894 18259 -125153 -8969 -27842 94916 339027 254427 147421 101138 356452
19022C56452b68694N2488j33074g1590q1241b1863j81764d063I4978a37747d9451
$$ 356452 -268694 -216206 -349280 -71590 -152831 -21863 -203627 -4063 94978 -137747 -49451
19010B70827a58007k0203g8244o1299f5543l9168A25949k1022c30907a03879B14843
$$ 270827 -158007 -178210 -78244 -139543 -65543 -104711 125949 104927 -330907 -103879 214843
18998c2468l5305A62129a53794E8876O9662n4642G679Q2963C3136a79402B0396
$$ -32468 -67773 162129 -153794 58876 128538 73896 7679 90642 33136 -179402 20396
18986b13844R2224L9610A71652a72687f8407A8649b45010i0015k03332J10612
$$ -213844 -121620 -82010 171652 -172687 -68407 18649 -245010 -90015 -293347 -182735
18976a82735g9968k8336j10385J1339N9239A24292j9719a21521B4124a10892H3517
$$ -182735 -79968 -108304 -218689 -207350 -148111 124292 104573 -121521 24124 -110892 83517
18964H6176c9697j25355m967b3241j51287H4209a73529a9642D0411b50355l5993
$$ 86176 -39697 -165052 -170019 -23241 -174528 84209 -173529 -19642 40411 -250355 -286348
18953b86348G7806k6828g4403r9119C6178b90172B68060F4833l0919j2092a94309
$$ -286348 77806 50978 -74403 -173522 36178 -290172 268060 64833 33914 21822 -194309
18941a05014D421J78730c45724J27356J1699C5287b06460j29140h3510B69564
$$ -105014 4421 183151 -345724 -218368 -206669 35287 -206460 -335600 -83510 269564
18930e25m1354C3464P1482O0580p8286e2274H6338r781b61937A75345c589A40476
$$ -525 -41879 33464 104946 165526 87240 -52274 86338 76557 -261937 175345 -3589 140476
18917d09860c5269H30b91448J23165j6323B6622b76345a11368N4366j15396A49621
$$ -409860 -35269 830 -291448 -168283 -184606 26622 -276345 -111368 -57002 -172398 149621
18905c25029e0139Q375A1996M36352b09196L4113G2545M5587d0273B75999h5497
$$ -325029 -50139 -41764 11996 448348 -209196 -175083 72545 118132 -40273 275999 -85497
18893B591g3217k36461a16986L4126q1392P5383a4551p5865g870G916a70337A73309
$$ 2591 -73217 -309678 -116986 -82860 -164252 -88869 -14551 -90416 -7870 7916 -170337 173309
18880b88948A99155r5795c23171A57377a24310A76897a6844j0718l2560A01586
$$ -288948 199155 103360 -323171 157377 -124310 176897 -16844 -27562 -60122 101586
18869A35476R5261c48191J39850B33011a22234B28218K1508f7031A8240K44801
$$ 135476 230737 -348191 -208341 233011 -122234 228218 249726 -67031 18240 263041
18859B63041a32999k93919B19566b06551a3858p0979A38526B3097a28335J8377
$$ 263041 -132999 -426918 219566 -206551 -13858 -84837 138526 23097 -128335 -109958
18849a09958N2062j74964B39701c56333f5080o9592p772G3045b33366H5245a04395
$$ -109958 -57896 -232860 239701 -356333 -65080 -134672 -142444 73045 -233366 85245 -104395
18837h4127L6516j54169Q9197b466J063C6983Q6981B0748L22789a21283N261A29787
$$ -84127 -47611 -201780 -112583 -2466 -1403 36983 123964 20748 343537 -121283 -116022 129787
18824b41661g5684A68008B857c1334F4306h7028q9841C5726a44470E7939J3582
$$ -241661 -75684 168008 2857 -31334 64306 -87028 -176869 35726 -144470 57939 71521
18813G1521Q561k0199J24607n8027h4401G4903J83347a94034h2176C0911a40883
$$ 71521 80082 59883 184490 126463 -84401 74903 258250 -194034 -82176 30911 -140883
18801A04488P2346b47216g9724a2496j04789a4292l98137E0109a80107b3228q9355
$$ 104488 176834 -247216 -79724 -12496 -117285 -14292 -412429 50109 -180107 -23228 -112583
18790a12583k54007F0495A1085d34272b2166j43515n7673E2335J96993G0196g6066
$$ -112583 -366590 60495 11085 -434272 -22166 -165681 -223354 52335 249328 70196 -76066
18778h1506l26686a80643H4127l6522a85447A60299h8745A94642a62956c1950
$$ -81506 -408192 -180643 84127 47605 -185447 160299 -88745 194642 -162956 -31950
18767g9868B4176J3583J1335h8458k7556G6428e4285I3678J21699e5032j03255
$$ -79868 24176 37759 49094 -88458 -116014 76428 -54285 93678 215377 -55032 -158287
18756a58287a2312A16353B6724d2966A73128b9834p0354K1811A10655a85338j28592
$$ -158287 -12312 116353 26724 -42966 173128 -29834 -100188 -78377 110655 -185338 -313930
18745c13930a32440O0752j48289p8337M0031I58b27610P988f4999E9862a05401
$$ -313930 -132440 -71688 -219977 -298314 -258283 958 -227610 -219622 -64999 59862 -105401
18733c05831M8942m9033e6918j09610j8005A09824e1965B24784D7992i4186B97520
$$ -305831 -256889 -305922 -56918 -166528 -184533 109824 -51965 224784 47992 -94186 297520
18721d60k32781F711a5329j85905j76160i1449k38611B18995b5689B0086c69992
$$ -460 -233241 6711 -15329 -201234 -377394 -91449 -330060 218995 -25689 20086 -369992
18709b17505d5463A46875d1078j02826A59443G180K61164c77535R7333B4888K92243
$$ -217505 -45463 146875 -41078 -143904 159443 7180 268344 -377535 -280202 24888 317131
18698C17131E3358L05507a76410m7153a08257B30629n8910J85131b79136h0070
$$ 317131 53358 358865 -176410 -223563 -108257 230629 171719 356850 -279136 -80070
18687a94936E8743K420c5541B6648i155k20958Q8624j00385i8417A1952a57497
$$ -194936 58743 61163 -35541 26648 -9155 -230113 -141489 -241874 -98417 11952 -157497
18675a10496j8132k16394G868e00258a61686j69410G959b8759k31347j84684a13775
$$ -110496 -128628 -345022 7868 -500258 -161686 -331096 7959 -28759 -260106 -444790 -113775
18663A56716a22310o4032j99195a38643m3087C1133K99790d6545n6426J17j04040
$$ 156716 -122310 -186342 -385537 -138643 -181730 31133 330923 -46545 -102971 -102854 -206894
18652b06894A09768O7259K28376D2292F730i0848A14283a46115l5157q8632g6668
$$ -206894 109768 177027 405403 42292 6730 -90848 114283 -146115 -181272 -269904 -76668
18640a92247A7888i5987k37663P9374L5692i3699r0462A24405a27960p4986C0276
$$ -192247 17888 -95987 -333650 -254276 -218584 -93699 -184161 124405 -127960 -202946 30276
18628A63833h2840o2934A48713h7509l9104k5389B56307d1856j46163R917A51855
$$ 163833 -82840 -145774 148713 -87509 -126613 -152002 256307 -41856 -188019 -178102 151855
18616a7771k69676A25413a50509A03522a92703C8641J37781a19379H7286a90816
$$ -17771 -287447 125413 -150509 103522 -192703 38641 176422 -119379 87286 -190816
18605d5756F9565J17561e42454C08334f5854A78537a81139r3265B73442a7016
$$ -45756 69565 187126 -542454 308334 -65854 178537 -181139 -274404 273442 -17016
18594d3129A21709C2313b06852Q734B2908b78014C18293j48702P2922a58948p0510
$$ -43129 121709 32313 -206852 -198118 22908 -278014 318293 169591 242513 -158948 -229458
18583b29458C18641a0203j10255A09770M5412a00487j009g899A00778g2638Q512
$$ -229458 318641 -10203 -120458 109770 155182 -100487 -101496 -7899 100778 -72638 -64126
18572f4126A54422c5675n8973a0861j6641n9678I5137C0283c40965G1726A1504
$$ -64126 154422 -35675 -94648 -10861 -27502 -87180 95137 30283 -340965 71726 11504
18560b01163a2719l3028B36222f7760b7678j88300Q2056b7659j15886g780j7182
$$ -201163 -12719 -45747 236222 -67760 -27678 -215978 -133922 -27659 -143545 -7780 -24962
18549b4962C5250a01488D5183b61785A22153a75291J9137e3659G8883B9732L59778
$$ -24962 35250 -101488 45183 -261785 122153 -175291 -156154 -53659 78883 29732 389510
18538C89510a49570f4165H6849g6639A6550b869C0765b34968j89298J95136M1303
$$ 389510 -149570 -64165 86849 -76639 16550 -2869 30765 -234968 -424266 -229130 -187827
18527a87827j57082g5775a8625k03312A22601A6053R0988B5299M4861e6987B66502
$$ -187827 -344909 -75775 -18625 -221937 122601 16053 107041 25299 70160 -56987 266502
18515A34940b60072a18670a6546A46813b77333A9109g8356A54066b61801C64155
$$ 134940 -260072 -118670 -16546 146813 -277333 19109 -78356 154066 -261801 364155
18504i1562B340a32935A59021o0576J43798f9527m79120b21413f3718k83016A63872
$$ -91562 2340 -132935 159021 98445 242243 -69527 -548647 -221413 -63718 -346734 163872
18492a09982j86196P7587k2896j190C2871Q9227b1790l4916p2891Q36b556k3065
$$ -109982 -296178 -218591 -241487 -242677 32871 122098 -21790 -56706 -129597 -128761 -2556 -25621
18480b5621B5236a51822B23546a24431C13096F1466B5267c3906j983l5923k37959
$$ -25621 25236 -151822 223546 -124431 313096 61466 25267 -33906 -35889 -71812 -309771
18469c09771f4051A2496a05765q8597B6768a48116c6322A33944B9207a1416F2250
$$ -309771 -64051 12496 -105765 -194362 26768 -148116 -36322 133944 29207 -11416 62250
18457b02512h786A16221n7055L10212c02317A12459h2813j02257E444J83789B2111
$$ -202512 -8786 116221 59166 369378 -302317 112459 -82813 -185070 5444 189233 22111
18445c111I8333b5960k27928K840A0760a09849A4963N3518o463b30326k7056o8701
$$ -3111 98333 -25960 -253888 -251048 10760 -109849 14963 68481 62018 -230326 -257382 -326083
18433c26083a26693j744d1619B53035F8167a34384L9710d071o4182l30233a76054
$$ -326083 -126693 -128437 -41619 253035 68167 -134384 -94674 -4071 -68253 -398486 -176054
18421A64584o1222a24825N1931A38760a17624K1838B4841c0714j31796A29487
$$ 164584 103362 -124825 -72894 138760 -117624 -95786 24841 -30714 -162510 129487
18410h3582E818K96753h0262q772r7997G1210J67562a74827L0774j07724A6057
$$ -83582 5818 302571 -80262 -89034 -187031 71210 238772 -174827 -144053 -251777 16057
18398A01527a31589B40359d71017B694b78617l9587d3435j53313j46687C8703
$$ 101527 -131589 240359 -471017 2694 -278617 -318204 -43435 -196748 -343435 38703
18387A31884a6144j71720N4046M0313I8293O3315a78062E7241O2067l7498a15803
$$ 131884 -16144 -187864 -133818 -93505 98293 161608 -178062 57241 119308 81810 -115803
18375b47838f1066l22097A78337b96402b8714n834A05008D5751e99851A51354
$$ -247838 -61066 -383163 178337 -296402 -28714 -34548 105008 45751 -599851 151354
18364B2763M20683A74285K26991f1035j5583m9802J4826p1351J4446I9960a02482
$$ 22763 443446 174285 401276 -61035 -76618 -126420 -111594 -182945 -168499 99960 -102482
18352A58523D6282Q7709c23470O746g6424l2507k4091F4098b5420k01430A3833
$$ 158523 46282 133991 -323470 -316724 -76424 -108931 -133022 64098 -25420 -226850 13833
18340B15588g3741A4093f5360I6919b64904R914A4803d66848A84845b10299A40238
$$ 215588 -73741 14093 -65360 96919 -264904 -254990 14803 -466848 184845 -210299 140238
18328a30012j0215j63484Q2168B71184A33012J4642a00306p3918Q4140H232a25667
$$ -130012 -140227 -303711 -221543 271184 133012 147654 -100306 -174224 -90084 8232 -125667
18316a34691G0880i9797F4850N3431c26016b3887o5002j20580K3831P0233F2863
$$ -134691 70880 -99797 64850 118281 -326016 -23887 -88889 -209469 -185638 -115405 62863
18304H576J22875f9439j25228c5511B75736g0218l66713E1442A5975c05982Q6622
$$ 8576 131451 -69439 -194667 -35511 275736 -70218 -436931 51442 15975 -305982 -219360
18293b19360o6110A10470d5584H2211c98177j7555a98524B63942L2601a11146
$$ -219360 -285470 110470 -45584 82211 -398177 -415732 -198524 263942 296543 -111146
18282e3534E1684K66550a26963F8411O9297o0786j25h1668c6808A76987a29840
$$ -53534 51684 318234 -126963 68411 137708 76922 76797 -81668 -36808 176987 -129840
18270a91898N6836a2187E0768a21764q7028j9158B29610a81204o0599N9647J5183
$$ -191898 -135062 -12187 50768 -121764 -208792 -227950 229610 -181204 -241803 -182156 -166973
18259a66973j61139A48321a91873q8555A3913d2088R984j11910L3805D7980M6318
$$ -166973 -328112 148321 -191873 -280428 13913 -42088 -32104 -144014 -110209 47980 94298
18248I4298b72030d0410A81701a94848h1943A07339l7887K88907b01192F98K55223
$$ 94298 -272030 -40410 181701 -194848 -81943 107339 69452 358359 -201192 698 255921
18237B55921r9626a08735G4985J33496b92218n5709B12823a34263m8089B5892
$$ 255921 156295 -108735 74985 208481 -292218 -347927 212823 -134263 -182352 25892
18226i6231J1478r6211j02351a11451E7623a39171C6599J28375b16147j77674
$$ -96231 -84753 -180964 -283315 -111451 57623 -139171 36599 164974 -216147 -393821
18216c93821a7749k33411A01437a29277j75149A35769D8388J0961a73189n6345
$$ -393821 -17749 -251160 101437 -129277 -304426 135769 48388 59349 -173189 -229534
18206b29534H6754i4017q2666O8189D6149O8441m0243i8304E3884b40963f8067
$$ -229534 86754 -94017 -176683 -108494 46149 114590 74347 -98304 53884 -240963 -68067
18194d17909I2333d2116l4234K4270k7056j19529k7134j53327c9845B14778a04228
$$ -417909 92333 -42116 -76350 -52080 -79136 -198665 -225799 -379126 -39845 214778 -104228
18182c07387L7552a00397B6885K11941A4626a52639b447k18016e1319k27173c7998
$$ -307387 -269835 -100397 26885 238826 14626 -152639 -2447 -220463 -51319 -278492 -37998
18170b12608b004m1728A10381B6410a4010F6033M5045c04433P5259A3421d3341
$$ -212608 -2004 -43732 110381 26410 -14010 66033 111078 -304433 -229174 13421 -43341
18158B121b16694B24328r4948b07158Q5927g966q6299m61972F0430d42755D0534
$$ 2121 -216694 224328 129380 -207158 -121231 -7966 -94265 -556237 60430 -442755 40534
18146b8902A47047b2761A32712l4037b05809h421j02832L4912A57449n9626a45595
$$ -28902 147047 -22761 132712 98675 -205809 -8421 -111253 -76341 157449 97823 -145595
18134C17779E8749K42744f0715A06066c7443j3459F642N4020O4695a39801e6911
$$ 317779 58749 301493 -60715 106066 -37443 -50902 6642 60662 125357 -139801 -56911
18122E27739A48891d8720j79720A31268k8066b31136A81697b81824J16365F9251
$$ 527739 148891 -48720 -228440 131268 103202 -231136 181697 -281824 -165459 69251
18111B71246b45734H3464a15438j70113a03460D02845i9675k1404A23812a36202
$$ 271246 -245734 83464 -115438 -285551 -103460 402845 -99675 -121079 123812 -136202
18100a41854C68110A02075e6716a3827F9319c45187b2690l90734b02571l4536
$$ -141854 368110 102075 -56716 -13827 69319 -345187 -22690 -413424 -202571 -237107
18090b37107H2367a02663j85941P8062b4402B46343C3645K53416i706o7607F5322
$$ -237107 82367 -102663 -288604 -210542 -24402 246343 33645 287061 -9706 -77313 65322
18078b4964A72750m0742b43175A26764A4856Q3658a58752E9488M21416f0476A90393
$$ -24964 172750 132008 -243175 126764 14856 98514 -158752 59488 480904 -60476 190393
18066d6114K0364q3412n1919g4568o5359j37661L9536e8035I6541a66855j59498
$$ -46114 -25750 -109162 -161081 -74568 -139927 -277588 -238052 -58035 96541 -166855 -326353
18055c26353A09113a85893h362H0629M5659R0721e2028l4420a126F092b5749E3254
$$ -326353 109113 -185893 -8362 80629 126288 217009 -52028 -86448 -1126 6092 -25749 53254
18042a88968C8258b12018K5681P8193L2800C58150A20085c67853B68725k6798
$$ -188968 38258 -212018 -186337 -108144 -75344 358150 120085 -367853 268725 241927
18032B41927B1973a36163j65779i9365k33128a52711A9701L5504b63927A18765
$$ 241927 21973 -136163 -301942 -99365 -332493 -152711 19701 55205 -263927 118765
18021D2922J030a95040C64283b05597g4446A84742o7623h9159j1600J0993j78518
$$ 42922 43952 -195040 364283 -205597 -74446 184742 117119 -89159 -100759 -89766 -268284
18010b68284a07728l6853B39220A8386k348J96048a34692r8875J00895A55803
$$ -268284 -107728 -144581 239220 18386 16038 212086 -134692 -233567 -132672 155803
17999g9548o8501e8847I6515J18769a96065j04439J22699e9415B30580i6236B4814
$$ -79548 -148049 -58847 96515 215284 -196065 -300504 -177805 -59415 230580 -96236 24814
17987A61459a0814A18985b7446j69443A30378a17847o5644c7184j80180A2337
$$ 161459 -10814 118985 -27446 -196889 130378 -117847 -183491 -37184 -217364 12337
17976B13426f3503L1061R749l669j04155H4195k6769p09a61294A1358b00353Q6888
$$ 213426 -63503 -32442 -22693 -26362 -130517 84195 57426 56717 -161294 11358 -200353 -113465
17964a13465B55484b99538a26028D6600H665O8026n690a49820B48053I4991f9505
$$ -113465 255484 -299538 -126028 46600 8665 76691 71001 -149820 248053 94991 -69505
17952a81009A22269H343b27411k4837J17598c851A93268e3903A07443k2692B3043
$$ -181009 122269 8343 -227411 -252248 -134650 -3851 193268 -53903 107443 84751 23043
17940G5804O3749N1386p9545K25932E8038A8759a83082C8496k582i2893r036C9825
$$ 75804 139553 190939 111394 337326 58038 18759 -183082 38496 35914 -92893 -101929 39825
17927b13073G4916b38398B40559a46372r3430J18936D3422a11034C22132h4783
$$ -213073 74916 -238398 240559 -146372 -239802 -120866 43422 -111034 322132 -84783
17916g5399K2356F6065b64310j06876N6296A29479F0615k5584K38038g3087A03407
$$ -75399 -53043 66065 -264310 -371186 -314890 129479 60615 35031 273069 -73087 103407
17904A61057a25094j58871j28805M8155i2261D6687d56691d7529A0911c6038A67780
$$ 161057 -125094 -283965 -412770 -364615 -92261 46687 -456691 -47529 10911 -36038 167780
17892a3273B2719b14012a0246A83405R83i6893A21807g7120L8303F8137J47787
$$ -13273 22719 -214012 -10246 183405 184388 -96893 121807 -77120 -38817 68137 215924
17881B15924j04433h2533j82489M4828f5308r8571k3268e5367A1829K12093a67190
$$ 215924 111491 -82533 -265022 -220194 -65308 -163879 -187147 -55367 11829 223922 -167190
17869E7260a75380b4673A16991E7070b47093O0504F8085a40588E5182a0641j59440
$$ 57260 -175380 -24673 116991 57070 -247093 -186589 68085 -140588 55182 -10641 -170081
17858a70081B74662b11838f9732m9197a9824B9608Q3522b91680k1097A59674D3977
$$ -170081 274662 -211838 -69732 -118929 -19824 29608 113130 -291680 -312777 159674 43977
17846B8901a22035j06094A01076a54945p8647L6249A90358M0735b33579J10484
$$ 28901 -122035 -228129 101076 -154945 -233592 -197343 190358 231093 -233579 -123095
17836a23095A74153d5880M314J6003C37061a07766B81509b83015k579a07395K8035
$$ -123095 174153 -45880 -41566 -25563 337061 -107766 281509 -283015 -285594 -107395 -79360
17825g9360D4116d65484B37783d77189F9979J73699g6919j15478A7661J25424
$$ -79360 44116 -465484 237783 -477189 69979 243678 -76919 -192397 17661 143085
17815A43085a45831I8591A6941b7619D4540g0677A45022E8640J49903a5777A90046
$$ 143085 -145831 98591 16941 -27619 44540 -70677 145022 58640 208543 -15777 190046
17803B73510a6694l2465C1688a1047H2283J78353I0697f1997H8379E196J28554
$$ 273510 -16694 -49159 31688 -11047 82283 260636 90697 -61997 88379 5196 133750
17792A33750C7652a47270r9893d3590E8080a489k53638F691b99869a01390j24010
$$ 133750 37652 -147270 -247163 -43590 58080 -1489 -255127 6691 -299869 -101390 -225400
17781b25400A62130f067l13487a00214D5875b97399R0260C5063N0113J06871b8766
$$ -225400 162130 -6067 -319554 -100214 45875 -297399 -207139 35063 85176 192047 -28766
17769c4616N198k40830B40400E9932i1970J7791I127J58202G7483a28879N5651
$$ -34616 -29418 -270248 240400 59932 -91970 -74179 9127 167329 77483 -128879 -73228
17758g3228A22022a37775A53663E7645Q5627F2855J4856C5294J06369c7311l28592
$$ -73228 122022 -137775 153663 57645 143272 62855 77711 35294 141663 -37311 -365903
17747c65903F2552L07145j51788b7746B40256h3449G9405J6761b37227B8571a76611
$$ -365903 62552 369697 217909 -27746 240256 -83449 79405 96166 -237227 28571 -176611
17735F7523b34608J9077l6322A47030b19688m4611I0751h2487c5332k09835F1006
$$ 67523 -234608 -215531 -251853 147030 -219688 -264299 90751 -82487 -35332 -245167 61006
17723A62355L6231a1481k21655h0750j40743C46780o7813r3124e20677b57817
$$ 162355 198586 -11481 -233136 -80750 -221493 346780 278967 185843 -520677 -257817
17712B05730J51827A77277d1576A42937A097J5389h7629d0380q0091o2450A6367
$$ 205730 357557 177277 -41576 142937 1097 16486 -87629 -40380 -120471 -182921 16367
17700C02702b782n8500A57572b2094l0289B55485c72804E685a55552F3612c11119
$$ 302702 -2782 -61282 157572 -22094 -52383 255485 -372804 5685 -155552 63612 -311119
17688A5821L8599b79393a75q4365a4560M267j01900b4950o6555j52436a19013
$$ 15821 54420 -279393 -175 -84540 -14560 -10293 -112193 -24950 -91505 -243941 -119013
17676i8857i551k38768b7394j93479e2157m4400D9817N9753N5087Q1789P7957
$$ -98857 -9551 -248319 -27394 -220873 -52157 -96557 49817 109570 164657 246446 324403
17665C24403j30602J16271e4750A82661a49168E871J98112i6052q422A26239j344
$$ 324403 193801 310072 -54750 182661 -149168 5871 203983 -96052 -104474 126239 124895
17654A24895l8222j3327b7129G4281J46814p6005a29579B00084a21336A25651
$$ 124895 86673 73346 -27129 74281 221095 145090 -129579 200084 -121336 125651
17643H9846l4885d80954F0924a0414A62229b24051C7057c7331m9260J2146L5144
$$ 89846 54961 -480954 60924 -10414 162229 -224051 37057 -37331 -86591 -74445 -39301
17632c9301A41600o3078l7998d06395B14873h308l7522A59619p0812m2285b46679
$$ -39301 141600 78522 40524 -406395 214873 -8308 -45830 159619 88807 46522 -246679
17620b75928A58665F0405h2024A07409Q0593a84089C2963b02280e8430A81730
$$ -275928 158665 60405 -82024 107409 188002 -184089 32963 -202280 -58430 181730
17609a8638p5658a0183A70957f4094k2088j53801A61074j9671c5955O205k51540
$$ -18638 -94296 -10183 170957 -64094 -86182 -239983 161074 141403 -35955 -29750 -281290
17598b81290A0941N7441a03665C37778J4842g5577l343k1578A20082n4015D667
$$ -281290 10941 68382 -103665 337778 352620 -75577 -78920 -100498 120082 66067 4667
17586C57457C7981K91183A54775J46112g8069C61900d6687D8662P2471a61654
$$ 357457 37981 329164 154775 300887 -78069 361900 -46687 48662 121133 -161654
17575F8661b07549c4997B33416b15575G1752M5411a42267K3083M5090A61719a47493
$$ 68661 -207549 -34997 233416 -215575 71752 117163 -142267 -119184 -74094 161719 -147493
17563C14935h3190j30328C5931J3036h4177C68768d31075J17153d5524K2125j23418
$$ 314935 -83190 -213518 35931 48967 -84177 368768 -431075 -313922 -45524 -23399 -146817
17552a46817L0912p110B00734d1901G8778b61439m4368a40963M5304G6734J98436
$$ -146817 -115905 -123015 200734 -41901 78778 -261439 -305807 -140963 -95659 76734 275170
17541B75170a9939N92B9369a57149B51062b4818A61248g0216m1486I863a68086
$$ 275170 -19939 -19347 29369 -157149 251062 -24818 161248 -70216 -111702 9863 -168086
17529g1459F3191K51995I4373b18149B83248A38817J11417Q2604k5735N9400j69250
$$ -71459 63191 315186 94373 -218149 283248 138817 250234 332838 307103 366503 197253
17518A97253D5031a51746D6023J00150B7315f1578l916j13832B65866f4628k0518
$$ 197253 45031 -151746 46023 146173 27315 -61578 -65494 -179326 265866 -64628 -85146
17507h5146a3481j16631B0337J01913L897C7544Q2731g8977A4703c86114H9125
$$ -85146 -13481 -130112 20337 122250 126147 37544 120275 -78977 14703 -386114 89125
17495B04311d8329B7539J68297a01678A97357j7719m7593B9561f3490A71180p1207
$$ 204311 -48329 27539 195836 -101678 197357 179638 132045 29561 -63490 171180 99973
17484I9973C5441N2835N9594g4278B21881b49270M9443B50241d6681D19527R0862
$$ 99973 35441 88276 147870 -74278 221881 -249270 -199827 250241 -46681 419527 510389
17473E10389B02695o3749k6557J75270c5457B29278j08872J22367a41127I3054
$$ 510389 202695 138946 112389 287659 -35457 229278 120406 242773 -141127 93054
17462B25605K10794A2636a18627B7692J30436J51531C4910j160R4218K7779P2894
$$ 225605 436399 12636 -118627 27692 158128 309659 34910 33750 127968 155747 228641
17451B28641M5654r4662J37440n5637p6546R7694L0964j51640m7225J2455L2787
$$ 228641 274295 179633 317073 261436 184890 282584 313548 161908 114683 127138 159925
17440A59925o6933L03314b9592D09474j31943n2193a51570I1745J19780m2057
$$ 159925 92992 396306 -29592 409474 277531 225338 -151570 91745 211525 169468
17430A69468M653J77259b1830n5613l6240A77809p2884O7247J94257J27753B14840
$$ 169468 174121 351380 -21830 -77443 -113683 177809 104925 172172 366429 494182 214840
17418d5474l197A75592l6356J18351J79822j80001R9909j8245b40991B12985J09858
$$ -45474 -48671 175592 139236 257587 437409 257408 357317 339072 -240991 212985 322843
17407C22843b69726F59N5532J31340K03404g8374A0358K7422L28824e6197l6614
$$ 322843 -269726 659 56191 187531 390935 -78374 10358 37780 366604 -56197 -92811
17396i2811H8225J00215q2061K90389j17673o8972m3410c5001f977A26804K88011
$$ -92811 88225 188440 106379 396768 279095 210123 166713 -35001 -6977 126804 414815
17385D14815j28445f5758A24967i1468A15222J04338G3902J76458a62099f4116
$$ 414815 286370 -65758 124967 -91468 115222 219560 73902 250360 -162099 -64116
17374a64589H524J77910b71617R1897B95204r8751R2440G2037M9558M13690k30677
$$ -164589 8524 186434 -271617 -179720 295204 196453 288893 72037 121595 535285 304608
17363C04608a59502A68531b5216I9358B2884g2525F9831g7276A68207e4546j18301
$$ 304608 -159502 168531 -25216 99358 22884 -72525 69831 -77276 168207 -54546 -172847
17352a72847J6328c719C68023j49918D6431b06681G3215J02441b93429A97720
$$ -172847 -156519 -3719 368023 218105 46431 -206681 73215 175656 -293429 197720
17341A76222N212r229e6003C68515j09672c2594B53111b9007k1494k15470D7983
$$ 176222 181434 172205 -56003 368515 258843 -32594 253111 -29007 -50501 -265971 47983
17329e1714C4478R1455c33566D74370A91894n3490R5556a59146C41442g815A75532
$$ -51714 34478 125933 -333566 474370 191894 138404 233960 -159146 341442 -7815 175532
17317E7156P2678b16592C8119a20234B04770a18156G127J69466Q7409f5887p1545
$$ 57156 129834 -216592 38119 -120234 204770 -118156 7127 176593 264002 -65887 -137432
17306a37432C27043Q7079a29700m344A53368c4227B65993A2084J28004B0768a39855
$$ -137432 327043 414122 -129700 -134044 153368 -34227 265993 12084 140088 20768 -139855
17294C94g6082k4122C36231A44158Q5979p9596k3547J27789a11262B66594J34827
$$ 394 -76082 -100204 336231 144158 230137 150541 126994 254783 -111262 266594 401421
17283D01421A71733J37213M2047r8449E8981K19578a96641h9909A78269J29323
$$ 401421 171733 308946 350993 252544 58981 278559 -196641 -89909 178269 307592
17273C07592h1750B54661j16280a98659j21723C27916A30217N6853A5436L50468
$$ 307592 -81750 254661 138381 -198659 -320382 327916 130217 187070 15436 365904
17263C65904A68344P9382j4593b75058J16880C79798P5465i4883D66261j62212
$$ 365904 168344 247726 233133 -275058 -158178 379798 455263 -94883 466261 304049
17253C04049j25851L7730K71J57473c1760G7830F985K06249Q298p9245J90907
$$ 304049 178198 215928 216199 373672 -31760 77830 6985 213234 221532 142287 333194
17242C33194O5088A48350Q6471a77778B35757D9390Q3641a01824A04653K1779
$$ 333194 398282 148350 234821 -177778 235757 49390 133031 -101824 104653 126432
17232A26432e0090C37995A07593O9131P9147o2128M2670n6828b07877A33835A6002
$$ 126432 -50090 337995 107593 176724 255871 193743 236413 179585 -207877 133835 16002
17220B59304a3183B1613K37214j25256E7209e420B33055F5605L01109d3987I7259
$$ 259304 -13183 21613 258827 133571 57209 -5420 233055 65605 366714 -43987 97259
17208A32383i7527E96830A49309d5216B81826p8098p9398a72837A38836J27319
$$ 132383 -97527 596830 149309 -45216 281826 203728 124330 -172837 138836 266155
17198B66155n6586J73111j71071K2029G7688N4888a9989o541D41539j78536a3030
$$ 266155 209569 382680 211609 233638 77688 132576 -19989 -26530 441539 263003 -13030
17186a39794E2821J26163j2225o3936K23692A29145M36975j97201a74684D07360
$$ -139794 52821 178984 166759 102823 326515 129145 566120 368919 -174684 407360
17175A63645K35762j83321C8718O1500K28565C6258L9524P3397b3563D85372j22319
$$ 163645 399407 216086 38718 100218 328783 36258 75782 149179 -23563 485372 363053
17164C63053b1997B05399L675c478A74337K3593P4048g4863C54245A35339m7603
$$ 363053 -21997 205399 209074 -3478 174337 197930 271978 -74863 354245 135339 87736
17153H7736J10378P8717k6336M4172j30198D6814L54834K1582O7752B06619I2536
$$ 87736 198114 276831 250495 294667 164469 46814 401648 423230 490982 206619 92536
17141A39761K07097A06417L25710B00001K80179A27835F494J66126K23234A63009
$$ 139761 346858 106417 432127 200001 480180 127835 6494 172620 395854 163009
17130B14748J1872m9196M01979k30718L1087G5799L80415A66389N6166J54099
$$ 214748 226620 177424 579403 348685 379772 75799 456214 166389 222555 376654
17120C76654m9168G5960K94352j64826K85310j76901K9285j04894P5805A16761
$$ 376654 327486 75960 370312 205486 490796 313895 343180 238286 314091 116761
17109D33526B09160o7872J29739N0625A07617M13201k53731L8461K43137k61702
$$ 433526 209160 141288 271027 321652 107617 520818 267087 305548 548685 286983
17099B86983N6580j13929B4796J95796B4156I918M81658A45246J6957K06958l2677
$$ 286983 343563 229634 24796 220592 24156 9918 491576 145246 162203 369161 336484
17088C36484P0196H0212K22207K25938J0377k62984j01190J43441k5526J22105
$$ 336484 406680 80212 302419 528357 538734 275750 174560 318001 292475 414580
17078D14580j58394K53261R232j60734N3387j72841K4690K3217A28743J93271
$$ 414580 256186 509447 518679 357945 411332 238491 263181 286398 128743 322014
17068C22014j15204J68087j65462M73964l23542n3518m1566J93919k19357J300
$$ 322014 206810 374897 209435 683399 359857 306339 264773 458692 239335 240635
17058B40635K86798k49685j06814Q5529J45893r8194K14120j45418j08837p2355
$$ 240635 527433 277748 170934 256463 402356 304162 518282 372864 264027 191672
17048A91672n4375L52747J33585A01729K23240J6702J5941L69288j63475j74094
$$ 191672 137297 490044 623629 101729 324969 341671 357612 726900 563425 389331
17038C89331K40773A64314J13547P7721j06187R1123K88982B51666K51580j57932
$$ 389331 630104 164314 277861 355582 249395 340518 629500 251666 503246 345314
17028C45314K08947j42239M49087A27107M14611j29851M8180j10127m7578O4397
$$ 345314 554261 412022 861109 127107 541718 411867 460047 349920 302342 366739
17018C66739J32249J21249m2816A82144j6680K54978Q6416L05116j36314m6667
$$ 366739 498988 620237 577421 182144 165464 420442 506858 811974 675660 628993
17008F28993o0783B19220L93286B98083L37307l1117A13754N32128M764k82290
$$ 628993 568210 219220 612506 298083 635390 604273 113754 645882 650646 368356
16998C68356J73161J87291k09732J76251l281r8436H4305K12295N51151k64682
$$ 368356 541517 728808 519076 695327 692046 593610 84305 296600 847751 583069
16988E83069j18355j20529J09532J16581J57641l35709J43059K58544C93912K93934
$$ 583069 464714 344185 453717 570298 727939 392230 535289 793833 393912 687846
16978F87846k14032K80561l34032M19168k93236o0496J10057o205J98972l23226
$$ 687846 473814 754375 420343 839511 546275 485779 595836 589631 788603 465377
16968D65377J63607K79028k13040J38784k27334J28345J11240k25152J23896O490
$$ 465377 628984 908012 694972 833756 606422 734767 846007 620855 744751 751241
16958G51241K18296k33302J57350k95638P7140J42487L521m9053J05526l52567
$$ 751241 969537 736235 893585 597947 675087 817574 821095 772042 877568 525001
16948E25001L90699j93054n3096Q5008K97592j68641k04998K74301p9149o9012
$$ 525001 915700 722646 669550 754558 1052150 883509 678511 952812 873663 804651
16938H04651K62372m0489o6610o9051m0021l9686J55774K17436J74323j50586
$$ 804651 1067023 1026534 959924 890873 850852 811166 966940 1184376 1358699 1208113
16928A208113q0354R7342l74882R2853J92422Q0185l00337M07632n60170M02893
$$ 1208113 1127759 1225101 850219 943072 1135494 1215679 915342 1322974 762804 1165697
16918A165697j38946M46468k38831k23326J00729J42718k21149J05136j8444j53334
$$ 1165697 1026751 1473219 1234388 1011062 1111791 1254509 1033360 1138496 1120052 966718
16908I66718J81257J6566r6366K31536l7294q8961O5840J82957j29058O0909j38842
$$ 966718 1147975 1164541 1068175 1299711 1262417 1173456 1239296 1422253 1293195 1354104 1215262
16897A215262J84503O1036j0190q2620M0158P1637Q7059j70557j66487N00724
$$ 1215262 1399765 1460801 1450611 1367991 1408149 1479786 1566845 1396288 1229801 1730525
16887A730525k84064K27723O6709M0036l75440J54402J65053K9720j53217K6709
$$ 1730525 1446461 1674184 1740893 1780929 1405489 1559891 1724944 1754664 1601447 1628156
16877A628156J36824Q6355k28809K41193j28783k76356K50181K43726j5045J68908
$$ 1628156 1764980 1851335 1622526 1863719 1734936 1458580 1708761 1952487 1937442 2106350
16867B106350p8041p7293J66796j18890k02723J07804N82453m16334M37222l83543
$$ 2106350 2028309 1951016 2117812 1998922 1796199 1904003 2486456 2070122 2507344 2123801
16857B123801j8842N0223J33162L33311L5774k38505J6123k70529M72159k30248
$$ 2123801 2104959 2155182 2288344 2621655 2657429 2418924 2435047 2164518 2636677 2406429
16847B406429M87388l15182L7537J70757K57455k56447J2715K87909k57906j9282
$$ 2406429 2893817 2578635 2616172 2786929 3044384 2787937 2800652 3088561 2830655 2811373
16837B811373K57983L2736K22456j261J09509l5069K20172j08634K926K89067
$$ 2811373 3069356 3102092 3324548 3323287 3432796 3397727 3617899 3509265 3512191 3801258
16827C801258k39561O50644j21450k64613K44681j82335K35537Q4101o6748o5169
$$ 3801258 3561697 4212341 4090891 3826278 4070959 3888624 4124161 4208262 4141514 4076345
16817D076345L52924M36649M7625l73747M81400k19659L56708p5926k9318M90709
$$ 4076345 4429269 4865918 4913543 4539796 5021196 4801537 5158245 5082319 5053001 5543710
16807E543710j45048k9149N22546o2625K42609J58748l1501j06973M18305K03894
$$ 5543710 5398662 5369513 5892059 5829434 6072043 6230791 6199290 6092317 6510622 6714516
16797F714516M89663j16909P8725K2753L80333L34648r4329J64253L12312J67511
$$ 6714516 7204179 7087270 7165995 7188748 7569081 7903729 7809400 7973653 8285965 8453476
16787H453476P46187k62607N07061N31633l0871L21767N8563k9498O94304K84647
$$ 8453476 9199663 8937056 9444117 9975750 9944879 10266646 10325209 10295711 10990015 11274662
16777A1274662P44372L40109N52899R1772N23780L32601P29270O7450Q98087L53035
$$ 11274662 12019034 12359143 12912042 13003814 13527594 13860195 14589465 14656915 15555002 15908037
16767A5908037N81195R66357O50221O65198O56270Q79910P82814P61980J643230
$$ 15908037 16489232 17455589 18105810 18771008 19427278 20307188 21090002 21851982 23495212
16758B3495212M62182J180027J289471J215440J354633Q11693K125170J469812
$$ 23495212 23957394 25137421 26426892 27642332 28996965 29808658 31933828 33403640
16750C3403640J704706J788305J986761J907234K175864K525183K577036K935916
$$ 33403640 35108346 36896651 38883412 40790646 42966510 45491693 48068729 51004645
16742E1004645K908579L450398L641627L995517M087327M663231N125147N170292
$$ 51004645 53913224 57363622 61005249 65000766 69088093 73751324 78876471 84046763
16734H4046763N760031O143542O889854P206971P526847P930480Q184747Q683562
$$ 84046763 89806794 95950336 102840190 110047161 117574008 125504488 133689235 142372797
16726A42372797Q485575R238640Q363970Q169476P193953O343830N746397L683725
$$ 142372797 150858372 160097012 168460982 176630458 183824411 190168241 195914638 199598363
16718A99598363K365316O38430j456657l354566m219051n903877o681051q385808
$$ 199598363 201963679 202602109 201145452 197790886 193571835 187667958 180986907 172601099
16710A72601099q149696q534962r188186q706704r023268p876834q454018p076382
$$ 172601099 164451403 155916441 146728255 138021551 128998283 121121449 112667431 105591049
16702A05591049o934994o607490o342139n217067n132086m968326m558673m119779
$$ 105591049 98656055 92048565 85706426 80489359 75357273 70388947 65830274 61710495
16694F1710495l577803l424259l240493l085051k995991k070959k448459k361257
$$ 61710495 58132692 54708433 51467940 48382889 45386898 43315939 40867480 38506223
16686C8506223k542217j216555k000773j449977j937831j124499j219343j404292
$$ 38506223 35964006 34747451 32746678 31296701 29358870 28234371 27015028 25610736
16678B5610736j007668j307818r75775j211854n84834n27037j090501p43100o81514
$$ 25610736 24603068 23295250 22319475 21107621 20522787 19995750 18905249 18162149 17480635
16669A7480635p21837o54322m02203l41137j055752k44767n14140n81247m05550
$$ 17480635 16758798 16104476 15702273 15361136 14305384 14060617 13546477 12965230 12559680
16660A2559680k75877n48359j24452m83016o89831J73344l86088m66748j69397
$$ 12559680 12283803 11735444 11610992 11127976 10438145 10611489 10225401 9758653 9589256
16651I589256o46071K0785l27567k73540k22650l71381J4878n58187k87578J97363
$$ 9589256 8943185 8963970 8636403 8362863 8140213 7768832 7783710 7225523 6937945 7135308
16641G135308j60067l01460k05485j90561n37523L26177o880j67412j98109O8004
$$ 7135308 6975241 6673781 6468296 6277735 5740212 6066389 6059509 5892097 5693988 5761992
16631E761992m35781j63521n8615j95410m8660m71911O14169p23724K3643l63429
$$ 5761992 5326211 5162690 5104075 4908665 4860005 4388094 5002263 4278539 4302182 3938753
16621C938753Q5571J40709j0521N3715p31453K20575n5918J82805l41585o4198
$$ 3938753 4024324 4165033 4154512 4208227 3476774 3697349 3641431 3824236 3482651 3418453
16611C418453J77071k65386j320k11748P7880J12180m16813J8537p6796j77116
$$ 3418453 3595524 3330138 3328818 3117070 3194950 3307130 2890317 2908854 2832058 2654942
16601B654942m1057k54184N28719j68176O4019k14061K24772j28364l8319K51219
$$ 2654942 2613885 2359701 2888420 2720244 2784263 2570202 2794974 2666610 2628291 2879510
16591B879510l71148j13408J86367j64794j91744R4113L8399l57864K54322K87282
$$ 2879510 2508362 2394954 2581321 2416527 2224783 2318896 2357295 1999431 2253753 2541035
16581B541035o70379J33823j81795J39444k30732L47711k72292J87607l77093
$$ 2541035 1870656 2004479 1822684 1962128 1731396 2079107 1806815 1994422 1617329
16572A617329J00777o9380M1744J10345p428N8978l52325J89376K91304o5097
$$ 1617329 1718106 1648726 1690470 1800815 1793387 1852365 1500040 1689416 1980720 1915623
16562A915623m84163J19844M0054k36891j05757N33721l17253J7550L60166m79448
$$ 1915623 1431460 1551304 1591358 1354467 1248710 1782431 1465178 1482728 1842894 1363446
16552A363446j38671Q2870K67012m92390J91657p9938K19565o0657J36486m41462
$$ 1363446 1224775 1307645 1574657 1082267 1273924 1193986 1413551 1352894 1489380 1047918
16542A047918P1473K46993l35319J68154j27053K32195k99416J70645K18686n02906
$$ 1047918 1119391 1366384 1031065 1199219 1072166 1304361 1004945 1175590 1394276 891370
16532H91370O74475p73940K54261o0337l41376J44687N23496l45335Q405r5733
$$ 891370 1565845 791905 1046166 985829 644453 789140 1312636 967301 975706 879973
16522H79973J49328J0841p3894M24757m76826m1263n7727R3362l49814r4150K83376
$$ 879973 1029301 1040142 966248 1391005 914179 872916 815189 908551 558737 464587 747963
16511G47963L381K86618k98496j35408P4461J19863L2580C81530J71395M64394
$$ 747963 751344 1037962 739466 604058 678519 798382 830962 381530 552925 1017319
16501A017319j15520K880l32158N06864m04499J47556K14053l53589j89966L68436
$$ 1017319 901799 904679 572521 1079385 674886 822442 1036495 682906 492940 861376
16491H61376k42350K80447C74541Q4720N4700J75982K4759k72383M32281l59862
$$ 861376 619026 899473 374541 459261 513961 689943 714702 442319 874600 514738
16481E14738L44128C77713M71949B99079K24839P2202N5552j62050K20132R4790
$$ 514738 858866 377713 849662 299079 523918 596120 651672 489622 709754 804544
16471H04544k67680M0652L21464C85443J83401J2950L74016D43288j60231K71331
$$ 804544 536864 577516 898980 385443 568844 581794 955810 443288 283057 554388
16461E54388B43607K18700K19570A94373N70469C42421j5066L62284q8135j53475
$$ 554388 243607 462307 681877 194373 764842 342421 327355 689639 601504 448029
16451D48029R3491r2983B19411M7931C5302R16468B99584N18744B28606N4481
$$ 448029 541520 448537 219411 267342 35302 951770 299584 818328 228606 283087
16441B83087P8098J05639O0824l2290R2756j61237J53078A99858M41736B22792
$$ 283087 361185 466824 527648 495358 588114 426877 579955 199858 641594 222792
16430F59811B43754J25101Q5043J82720j46231j00169Q329l116k8619O8555J4725
$$ 659811 243754 368855 453898 636618 490387 390218 398547 395431 366812 435367 450092
16419D50092n201Q6078J03835A94456J41623J51690j57397K13854j12419J10730
$$ 450092 444891 530969 634804 194456 336079 487769 330372 544226 431807 542537
16409E42537n2322A42929C437J60492L10462p9004J62691B40138O2118A48892
$$ 542537 490215 142929 3437 163929 474391 395387 558078 240138 302256 148892
16398B2441K75632K20752b4494D48374R9481A76499L69660C7961M4220K75099
$$ 22441 298073 518825 -24494 448374 547855 176499 546159 37961 82181 357280
16388C57280j35194Q211J54462F68L52149J41488A64608K00005K1636D4103J1926
$$ 357280 222086 230297 384759 668 352817 494305 164608 364613 386249 44103 56029
16377E6029K26506K16252E3563o112K34099b37286A80452R2305e236B98516k6878
$$ 56029 282535 498787 53563 47451 281550 -237286 180452 272757 -5236 298516 271638
16366B71638J61759b8266C49632j62506J03520a39308C07275f2179A89996P8801
$$ 271638 433397 -28266 349632 187126 290646 -139308 307275 -62179 189996 268797
16356B68797M193A15722P0931m33R5995Q1253q314M8623a41853C17597n9367A09658
$$ 268797 272990 115722 186653 186220 282215 363468 355154 403777 -141853 317597 258230 109658
16343A28689K21581n5037k395J32492a47384C1436N33697B65232d6967B89280
$$ 128689 350270 295233 292838 425330 -147384 31436 565133 265232 -46967 289280
16332C4503N58016B38336K12694n1535q9058j42429J26474E2594J47473G2565
$$ 34503 592519 238336 451030 399495 310437 168008 294482 52594 200067 72565
16321C10073K7497J9707A13085P9124J34422A28964R0100C900K29506c4273C35061
$$ 310073 337570 357277 113085 192209 326631 128964 219064 3900 233406 -34273 335061
16309A06405J87616g1613A9066J83145M9495K58976k23506C0801P9421K09355
$$ 106405 294021 -71613 19066 202211 251706 510682 287176 30801 110222 319577
16299C19577A58143J61870j58360g5020j55263C844a21922D42302A78915N9873
$$ 319577 158143 320013 161653 -75020 -230283 3844 -121922 442302 178915 238788
16289B38788q4020J48424O7507j53421d3528D2289A6201K24329b43631D4263Q0151
$$ 238788 154768 303192 370699 217278 -43528 42289 16201 240530 -243631 44263 124414
16278A24414L45515A4887b9344A16168K44360A13807b10045A59498Q6395d1654
$$ 124414 469929 14887 -29344 116168 360528 113807 -210045 159498 245893 -41654
16267H3570K66358j67462q7239P0615L5107C0858a63626b3529B18416G7067J69629
$$ 83570 349928 182466 95227 165842 200949 30858 -163626 -23529 218416 77067 246696
16256B46696A05280a7504j4496C78738a80385E690J1275l779N3597K41340d8168
$$ 246696 105280 -17504 -32000 378738 -180385 5690 16965 13186 66783 308123 -48168
16244A01761d02580G2433a15437A45872L189a0041C83876A15707g3391A50704
$$ 101761 -402580 72433 -115437 145872 149061 -10041 383876 115707 -73391 150704
16233B60243G2611L06986a22363A82424J1550N9640j17068O8046b2033B63346
$$ 260243 72611 379597 -122363 182424 193974 253614 136546 204592 -22033 263346
16222a00922K7079A97198I0875J35439H5155d6596E6187K38361A05666Q656M5972
$$ -100922 -73843 197198 90875 226314 85155 -46596 56187 294548 105666 114322 160294
16211A60294g4551D08866I9762m7534f7162C8238f2418A84217n6634b14342A85094
$$ 160294 -74551 408866 99762 52228 -67162 38238 -62418 184217 127583 -214342 185094
16199D96373a23568A22868J34053a29658A31058l9066K92318b07787L5383j4253
$$ 496373 -123568 122868 256921 -129658 131058 91992 384310 -207787 -172404 -186657
16189a86657E1392k3893K03315a61032A00735a34097N4292A24711K66412j85553
$$ -186657 51392 27499 230814 -161032 100735 -134097 -79805 124711 391123 205570
16179B05570b74671b4341C58589E3104j6926N0993J64677p3941B4376i898m0728
$$ 205570 -274671 -24341 358589 53104 36178 87171 251848 177907 24376 -9898 -50626
16168e0626A68176B9428a31194A52966a22885F3131f8978C8637k233d1288n8088
$$ -50626 168176 29428 -131194 152966 -122885 63131 -68978 38637 36404 -41288 -99376
16157i9376E9137N7853a4555g031p2328I3896a73478D84094a52039L3304f228
$$ -99376 59137 116990 -14555 -7031 -79359 93896 -173478 484094 -152039 -118735 -6228
16145f8508l0571B62800c0022C54715A37087Q2362i0530A95653g4814k04831B119
$$ -68508 -99079 262800 -30022 354715 137087 219449 -90530 195653 -74814 -279645 2119
16133A34363K1996k7270L2026M4556I1130a12973A11859N8983O2628d4978B13229
$$ 134363 156359 129089 161115 205671 91130 -112973 111859 170842 233470 -44978 213229
16121A05069b24328d0725B3586K0117b91426e1112r20A18432a11369B10373R9107
$$ 105069 -224328 -40725 23586 43703 -291426 -51112 -52032 118432 -111369 210373 309480
16110C09480a07474L0404A17350E0964J38211a81055A67204p9395J68623j08760
$$ 309480 -107474 -77070 117350 50964 189175 -181055 167204 87809 256432 147672
16100A47672b46075A24714n3374P3048m0102J4640L6139a67574h2440L2999n9761
$$ 147672 -246075 124714 71340 144388 104286 118926 155065 -167574 -82440 -49441 -109202
16089a09202B93308E401c77328J36176H417J62649b12896N8150K351M5758E3931
$$ -109202 293308 5401 -377328 -241152 8417 171066 -212896 -154746 -152395 -106637 53931
16077a48272C36724b0485A47543a20037M7779B42184I8720a01945j62365C3623
$$ -148272 336724 -20485 147543 -120037 -72258 242184 98720 -101945 -264310 33623
16066A18516c37787B04509b6855H3107i6155j14006b7605l91737J83358K9681
$$ 118516 -337787 204509 -26855 83107 -96155 -210161 -27605 -419342 -235984 -206303
16056b06303C36110a17607D2383a35994a5775A17851b22870E7490b88635C9730
$$ -206303 336110 -117607 42383 -135994 -15775 117851 -222870 57490 -288635 39730
16045b60007B41171I9703C4687P433J38689b4684j73608B11805m4647m1644b64255
$$ -260007 241171 99703 34687 42120 180809 -24684 -198292 211805 167158 125514 -264255
16033B8869K28889r0064g4785J5992k09586C02534a43383F2203L1151a78180J2663
$$ 28869 257758 167694 -74785 -58793 -268379 302534 -143383 62203 93354 -178180 -165517
16022a65517d0134A63181i1257B25098a05119j25509i9579D8857b16422P4490
$$ -165517 -40134 163181 -91257 225098 -105119 -230628 -99579 48857 -216422 -141932
16012a41932E4461K134K4737a6388j69732a6073A07211b7620m9970j8581b8101
$$ -141932 54461 56595 81332 -16388 -186120 -16073 107211 -27620 -77590 -96171 -28101
16000B29686A14647h0556C17148i8331A43848A9633a22541M194K1648G3991O6578
$$ 229686 114647 -80556 317148 -98331 143848 19633 -122541 -118347 -96699 73991 140569
15989A40569R28K54021b03467i6317n4472D44J55856a58286D29884A83318K04162
$$ 140569 141497 395518 -203467 -96317 -150789 444 156300 -158286 429884 183318 387480
15978C87480F9595d6546O676F4409a16891A2763b55521A7058c10259A38170f6880
$$ 387480 69595 -46546 -39870 64409 -116891 12763 -255521 17058 -310259 138170 -66880
15966b39592A06800K83958b10281B6632K05298a70141D2947b04906a3953A92513
$$ -239592 106800 390758 -210281 26632 231930 -170141 42947 -204906 -13953 192513
15955A42172b90507g5012B8315b19829A02082d6041l86061a66857C8094b5943
$$ 142172 -290507 -75012 28315 -219829 102082 -46041 -432102 -166857 38094 -25943
15944b92678c9091a3654j35556r3486p0101j1274I8260c31871f9729A31213B1391
$$ -292678 -39091 -13654 -149210 -242696 -312797 -324071 98260 -331871 -69729 131213 21391
15932a25039p9405I0731a00022j46123i9765Q781n8345b3224q0041B22349h1538
$$ -125039 -204444 90731 -100022 -246145 -99765 -90984 -149329 -23224 -103265 222349 -81538
15920a8733A42586a85428k04364J78227A08821K18039d50089A05392J0934K74682
$$ -18733 142586 -185428 -389792 -211565 108821 326860 -450089 105392 116326 391008
15910C91008H9120a84505B55592b67094a22724I58J89309a46631b7755n10595
$$ 391008 89120 -184505 255592 -267094 -122724 958 190267 -146631 -27755 -538350
15900e38350a10001m5341B4825a24101A49848c003k06930A60936O2941c9513B56108
$$ -538350 -110001 -155342 24825 -124101 149848 -3003 -209933 160936 223877 -39513 256108
15888a56060M9548F5919A0691L09206A24989l5682M5623K5988l8364l1488a21273
$$ -156060 -106512 65919 10691 319897 124989 89307 134930 160918 122554 91066 -121273
15876f4191o0329m2306A56106o2677P6187b23247B16628e9988I4823a87324e6727
$$ -64191 -124520 -166826 156106 93429 169616 -223247 216628 -59988 94823 -187324 -56727
15864B62378r3480A9909a38574E9787a27284e8885j8497I2520a62404A40430c05539
$$ 262378 168898 19909 -138574 59787 -127284 -58885 -77382 92520 -162404 140430 -305539
15852h7021a593A19297A2248a00195l0312A91353c45629c9905B64524a753j33686
$$ -87021 -1593 119297 12248 -100195 -130507 191353 -345629 -39905 264524 -1753 -135439
15841a35439k8057l25115d7856a4965A36726I525N2216N5106m4114k7455e18138
$$ -135439 -163496 -488611 -47856 -14965 136726 9525 61741 116847 72733 45278 -518138
15829A78106K02282A11075D5208g580F556a31298n8589e338A78579g5307r1190
$$ 178106 380388 111075 45208 -7580 6556 -131298 -189887 -5338 178579 -75307 -166497
15818a66497p9459N741B62318b55462A09697b7006k81967i9949p407j14623B2960
$$ -166497 -245956 -240215 262318 -255462 109697 -27006 -308973 -99949 -107356 -221979 22960
15806H6476b00609E4456j5050c08432C3302K12905a99282e8414A68946h2428C9704
$$ 86476 -200609 54456 39406 -308432 33302 246207 -199282 -58414 168946 -82428 39704
15794a15392O395B64513A17534d30009G5171l987c4162j76286j6297J07775k60708
$$ -115392 -108997 264513 117534 -430009 75171 71184 -34162 -210448 -226745 -118970 -379678
15783c79678h0372l1927F1946F011a52619k04066a34447d17I5484A691g1647j70610
$$ -379678 -80372 -112299 61946 6011 -152619 -356685 -134447 -417 95484 1691 -71647 -242257
15771b42257e9757j19958B12995C5437a09637k18126J42589d0202M670q5753j56895
$$ -242257 -59757 -179715 212995 35437 -109637 -327763 -185174 -40202 -35532 -121285 -278180
15760b78180A22050C9601b3124A12148L5549J15518G3915J41153E3135L5832a64709
$$ -278180 122050 39601 -23124 112148 147697 263215 73915 215068 53135 88967 -164709
15748G252Q0134J04325E2472k4701P633L892j746J9391J26631a19737B14116c3088
$$ 7252 87386 191711 52472 27771 35404 39296 37550 56941 183572 -119737 214116 -33088
15735b21044M1760b6597m0202k8923k4941E4036a6142G2600g3904p6042f8806
$$ -221044 -179284 -26597 -66799 -95722 -120663 54036 -16142 72600 -73904 -149946 -68806
15723C39728f057l6897k08144e6777B9754N3974Q1131i3886L3738H8139a2902
$$ 339728 -6057 -42954 -251098 -56777 29754 83728 164859 -93886 -60148 88139 -12902
15711D2423M7751J67761A7213c62885R8516O4156I1814h9500c1907B39374g3792
$$ 42423 90174 257935 17213 -362885 -264369 -200213 91814 -89500 -31907 239374 -73792
15699A65885a29087j38891d8920A47568a46655A39314L9184K188c1647B1165J44518
$$ 165885 -129087 -267978 -48920 147568 -146655 139314 178498 180686 -31647 21165 165683
15688A65683E9094F462J35913a07917k86994f1172p0081B87549a99985d9537J5204
$$ 165683 59094 6462 142375 -107917 -394911 -61172 -131253 287549 -199985 -49537 -34333
15677c4333l07502a20175j46554e4777E8098K705K5621c58459C20199a28364d1777
$$ -34333 -341835 -120175 -266729 -54777 58098 60803 86424 -358459 320199 -128364 -41777
15665a86348B5948f3210B670g8725j83889B44388a83488G1616a51255a5959p5934
$$ -186348 25948 -63210 2670 -78725 -262614 244388 -183488 71616 -151255 -15959 -91893
15654i1893a6136k98847G8421g2511A08743N009g4891B88406a77468k8324A14410
$$ -91893 -16136 -314983 78421 -72511 108743 113752 -74891 288406 -177468 -205792 114410
15642c01437D389K09607p4534a26959e7066I4646f1430k4884I316a89893N3928
$$ -301437 4389 213996 139462 -126959 -57066 94646 -61430 -86314 9316 -189893 -135965
15631a35965A9125a28129K8293A40386b65711O6794A50341c62581B04928n829
$$ -135965 19125 -128129 -99836 140386 -265711 -198917 150341 -362581 204928 199099
15621A99099a06257E2852A5763J6752f0628C67272E0580c44452i3116J344p8640
$$ 199099 -106257 52852 15763 32515 -60628 367272 50580 -344452 -93116 -91772 -170412
15610a70412N5286r6082F3691b91528B14769D7704h4243L4249q2189B02567i6926
$$ -170412 -115126 -211208 63691 -291528 214769 47704 -84243 -49994 -132183 202567 -96926
15598h9967A42195b08375D2001d3821j14602A02438m2521a7314n9859I8244a71487
$$ -89967 142195 -208375 42001 -43821 -158423 102438 59917 -17314 -77173 98244 -171487
15586b01332F2945b7822l3839F890f3080L0792J2693k35025m7426J26610B8730
$$ -201332 62945 -27822 -61661 6890 -63080 -32288 -19595 -254620 -302046 -175436 28730
15574d4731j19814l3340j27802A38151F7999J65678A09177g9898j41784l3668
$$ -44731 -164545 -197885 -325687 138151 67999 233677 109177 -79898 -221682 -255350
15564b55350O5207j27183E2970J46620b03954B85522a43381a5464D9862b6289
$$ -255350 -190143 -317326 52970 199590 -203954 285522 -143381 -15464 49862 -26289
15553i2630B63923n1716b19336A75810N2206B3954K54890r8660n4819J24532b2228
$$ -92630 263923 212207 -219336 175810 228016 23954 278844 180184 125365 249897 -22228
15541b04058A11171e0951A5666J29156A8301K51809c1910o9758K0119m0597C32396
$$ -204058 111171 -50951 15666 144822 18301 270110 -31910 -101668 -81549 -122146 332396
15529b33365G6535g1506a7912B92250G8319N091A0790L73528j68541b36638O2433
$$ -233365 76535 -71506 -17912 292250 78319 83410 10790 384318 215777 -236638 -174205
15518a74205D0225J12627f5774j13419D08564r4269E2767K32419a54818c5563
$$ -174205 40225 152852 -65774 -179193 408564 314295 52767 285186 -154818 -35563
15507c15028a17868A43813j3033b77355c8781B55507a21873k00666C4083H088
$$ -315028 -117868 143813 130780 -277355 -38781 255507 -121873 -322539 34083 8088
15496A62628D9500i3835j2430B78598b75111A90812I1997c32719a04070B357K583
$$ 162628 49500 -93835 -106265 278598 -275111 190812 91997 -332719 -104070 2357 4940
15485D940c641l38753h1753b4757B59206a05179L3204D0054J78312F9105J11931
$$ 4940 -3641 -342394 -81753 -24757 259206 -105179 -71975 40054 218366 69105 181036
15474A81036d5063A89212i3519j78098J04112g5487A40353a46745I148L35359
$$ 181036 -45063 189212 -93519 -271617 -167505 -75487 140353 -146745 9148 344507
15464C44507d2398A5786J20412d39506L4021B4419b04735i9789B18763i0136n9496
$$ 344507 -42398 15786 136198 -439506 -405485 24419 -204735 -99789 218763 -90136 -149632
15453a49632j2771A69662E3727J57608H9750b03614b6906A96633N1025m9151h8918
$$ -149632 -162403 169662 53727 211335 89750 -203614 -26906 196633 247658 198507 -88918
15441A71795b16728e0999D8313i7575A07757K45224b06852Q3187J0623F2013c1924
$$ 171795 -216728 -50999 48313 -97575 107757 352981 -206852 -123665 -113042 62013 -31924
15429d37j12805m1297b163G9221J36307a39933A3703B194J88086C1697b96270
$$ -437 -113242 -154539 -2163 79221 215528 -139933 13703 2194 190280 31697 -296270
15417b3352H2533h8055L7658B16805J4634b18894M9188k7366f5589l15922J62918
$$ -23352 82533 -88055 -50397 216805 231439 -218894 -169706 -197072 -65589 -381511 -218593
15406b18593f3141A09734D674K73453a7854k08490b5671C11675a83816c2080D9931
$$ -218593 -63141 109734 4674 278127 -17854 -226344 -25671 311675 -183816 -32080 49931
15394B0877b39694B00013j5197H3064c05372a23390c1360j62489E8547N8121h7648
$$ 20877 -239694 200013 184816 83064 -305372 -123390 -31360 -193849 58547 116668 -87648
15382A15952a9767p8749F6967b41058B0739P3099d1655H480L19133l15A40001
$$ 115952 -19767 -98516 66967 -241058 20739 93838 -41655 8480 327613 327298 140001
15370B0158i2354B5727a06319o7612a6771A9472K06368i8772N153A23542a80272
$$ 20158 -92354 25727 -106319 -173931 -16771 19472 225840 -98772 -93619 123542 -180272
15358b3613D2334P7291d1803l04807C4145b95143J24174A67569A2036f3936C42639
$$ -23613 42334 119625 -41803 -346610 34145 -295143 -170969 167569 12036 -63936 342639
15346I7736b92901A26765b331l35314B8822i9539d1366j00366a63l5735A54942
$$ 97736 -292901 126765 -2331 -337645 28822 -99539 -41366 -141732 -163 -35898 154942
15334A07687C8418a53137M3631M1318A800M4469d6694m9284C032K6630a62611
$$ 107687 38418 -153137 -109506 -68188 1800 46269 -46694 -95978 3032 29662 -162611
15322c3303l8430j93866b5640E9795m833K22096j25915b32897a4236m3793I0227
$$ -33303 -71733 -265599 -25640 59795 54962 277058 151143 -232897 -14236 -58029 90227
15310a41916J7303C3889e1785j49315B1320L02332l6676A28249h895C3905d30548
$$ -141916 -124613 33889 -51785 -201100 21320 323652 286976 128249 -8895 33905 -430548
15298c02141E0585J11437E4750B1124a21250K9319E3994A1887J20588R8060H3560
$$ -302141 50585 162022 54750 21124 -121250 -91931 53994 11887 132475 230535 83560
15286b05063A50216b03091h2964N871D2704a15611f948k34984G9454J65719a86743
$$ -205063 150216 -203091 -82964 -77093 42704 -115611 -6948 -241932 79454 245173 -186743
15274E8585a32528L1084I6142I093K5369b4631A18759a25979j72984a46301A42717
$$ 58585 -132528 -101444 96142 9093 34462 -24631 118759 -125979 -298963 -146301 142717
15262F3264J0025L1917e0022C2732K4657J81746p544b22364j5888N4663A01842
$$ 63264 73289 105206 -50022 32732 57389 239135 231591 -222364 -238252 -183589 101842
15250D42089K38126M91147L19859q2014n2022E76382j65310a79191o4416O1707
$$ 442089 680215 1171362 1491221 1409207 1357185 576382 411072 -179191 -243607 -181900
15240a81900C15145A48109o7276a75017I4844a38175K6848B4881K83797A48514
$$ -181900 315145 148109 80833 -175017 94844 -138175 -111327 24881 308678 148514
15229A62551a60102B22862k0965H4817a31583m1839P8872F8907b76319B64511
$$ 162551 -160102 222862 201897 84817 -131583 -173422 -94550 68907 -276319 264511
15218A67031j5606n8468i1902G2336B4680L22026G9162A2797P1427a28797L2748
$$ 167031 151425 92957 -91902 72336 24680 346706 79162 12797 84224 -128797 -96049
15207i6049B13662q456J84482G7532d5835A51668b48545B14908B7069e7257A09221
$$ -96049 213662 205206 389688 77532 -45835 151668 -248545 214908 27069 -57257 109221
15195B56683a1447k0106A89407f7579A12184a4600n0847B54465f7774i907j83413
$$ 256683 -11447 -31553 189407 -67579 112184 -14600 -65447 254465 -67774 -9907 -193320
15184a93320D93647b0604p7003j54732A05459M9757h5795q0765A8043J64018b05303
$$ -193320 493647 -20604 -97607 -252339 105459 155216 -85795 -166560 18043 182061 -205303
15172D7388k0523L46369b03182m9927D59982a25970m03801A88290a83681b5914
$$ 47388 26865 373234 -203182 -253109 459982 -125970 -529771 188290 -183681 -25914
15161B29680f3869c1805l0794A48699b496A37741H579K8827a32573c3782j1735
$$ 229680 -63869 -31805 -62599 148699 -2496 137741 8579 37406 -132573 -33782 -45517
15150d5517l9857A46831b30366a13774C83335o2504j8984a1165A60496g602A11575
$$ -45517 -85374 146831 -230366 -113774 383335 320831 301847 -11165 160496 -7602 111575
15138A25651J86037d7831D73806B12897L732a9282A90619F7345K34665a51319
$$ 125651 311688 -47831 473806 212897 216629 -19282 190619 67345 302010 -151319
15127a58997A60407f9869D21997A94808k5815o9457a017B70595F7683a50731B09079
$$ -158997 160407 -69869 421997 194808 168993 99536 -1017 270595 67683 -150731 209079
15115B11312o5577g7634C94445A28107a52226C58209A31179K6225L05646a7275
$$ 211312 145735 -77634 394445 128107 -152226 358209 131179 157404 463050 -17275
15104A1834l839h0894A92018n0342J99989A49525a87998K9495A03960B2234J98777
$$ 11834 7995 -80894 192018 141676 341665 149525 -187998 -158503 103960 22234 221011
15093B21011b780l10045A25751J33664C7905J39320L34022A52920J86839C4827
$$ 221011 -2780 -312825 125751 259415 37905 177225 511247 152920 339759 34827
15082A29904J55209a00809A34204e7916a3056A36391B2089m254e0642A58013L97
$$ 129904 285113 -100809 134204 -57916 -13056 136391 22089 17835 -50642 158013 158410
15071A58410p0547i1143o7455B335Q9235C5188L02975d5296C1779b91726C04649
$$ 158410 87863 -91143 -158598 2335 91570 35188 338163 -45296 31779 -291726 304649
15059d64512a76703A54806K0839R0312n4288i396j5424C86519A41228J53313I2242
$$ -464512 -176703 154806 175645 265957 211669 -9396 -24820 386519 141228 294541 92242
15047D40065b02041C7920J09177d746A22121D7197L32306j31218j3199k2019N6773
$$ 440065 -202041 37920 147097 -4746 122121 47197 379503 248285 235086 213067 269840
15036B69840j32368a16162A2414K40755a13782G9614c0472C38521D4657J17759
$$ 269840 137472 -116162 12414 253169 -113782 79614 -30472 338521 44657 162416
15026A62416K21608q9157A24766K35075E2159L1225H077K51240C0301R2529Q0704
$$ 162416 384024 294867 124766 359841 52159 83384 8077 259317 30301 122830 203534
15015B03534R5033A29245B2886K75969P9200L0565A96973J50013f2032G9117K8617
$$ 203534 298567 129245 22886 298855 378055 408620 196973 346986 -62032 79117 107734
15004A07734K31733G9387K5106J58506J41727a29109b8133B47612d5954A33893
$$ 107734 339467 79387 104493 262999 404726 -129109 -28133 247612 -45954 133893
14993G2092K10330e5816E11523a23280B07455o3967J37844G8056R7258K0503G9207
$$ 72092 282422 -55816 511523 -123280 207455 143488 281332 78056 175314 195817 79207
14981B13848B9776K21183G7207K93382A61043J83357J13288A88574q2075D9342
$$ 213848 29776 250959 77207 370589 161043 344400 457688 188574 106499 49342
14970A02230J06743H4057J84027J43338k03429M7896o9734A8334J02607J06551
$$ 102230 208973 84057 268084 411422 207993 255889 186155 18334 120941 227492
14960B27492E0589K17750f2771N852C76363h9113E05303H2934L66907j7820B1338
$$ 227492 50589 268339 -62771 -56919 376363 -89113 505303 82934 449841 432021 21338
14948C01824j50180L71331j61107E7202K14835r3840R9857F6258K01288j00995
$$ 301824 151644 522975 361868 57202 272037 178197 278054 66258 267546 166551
14938A66551O1645K44984j86061b1015j35892I9995J75880e8750B62081H3097
$$ 166551 228196 473180 287119 -21015 -156907 99995 275875 -58750 262081 83097
14927C79129K71284C02160m0957b4687B99863J40476C6909J33962M0841k6822
$$ 379129 650413 302160 261203 -24687 299863 440339 36909 170871 211712 184890
14917A84890J47584p8820N5231m7324K9235k2574K7630R6497J05834k37874K78947
$$ 184890 332474 253654 308885 261561 290796 268222 295852 392349 498183 260309 539256
14906E39256A84522J58531O5843J53704B17848n1949F4321K7678K54144D5634
$$ 539256 184522 343053 408896 562600 217848 165899 64321 91999 346143 45634
14895B93552N6919G2945K69693I275J33081M6889L41483B57136K50941B08513
$$ 293552 350471 72945 342638 9275 142356 189245 530728 257136 508077 208513
14884A11404J52844J1114E4335L78395j05287A34849a07542D51068A69267K35759
$$ 111404 264248 275362 54335 432730 327443 134849 -107542 451068 169267 405026
14874D05026J08463k05783K2192a27835C11226o5618K84728A66689K27800R8176
$$ 405026 513489 307706 329898 -127835 311226 245608 530336 166689 394489 492665
14864D92665J3120k00940A13818K03656A01749K68328A67331K06125A40411b692
$$ 492665 505785 304845 113818 317474 101749 370077 167331 373456 140411 -2692
14853B85121l4310I5785D5617K95345D1861K76819R3260A1004J635O47452B88496
$$ 285121 250811 95785 45617 340962 41861 318680 411940 11004 12639 660091 288496
14841C60178L29156j11129j75814o4174l592j14242K93811j28469n6882j07576
$$ 360178 689334 578205 402391 338217 334625 220383 514194 385725 328843 221267
14831B21267p6435K45691l9401A65972N0478N13801a5658G34774B29383A10089
$$ 221267 144832 390523 351122 165972 216450 730251 -15658 734774 229383 110089
14820D08883j65251K69607M464j55696K7408J08954p9891J36372j44793j9478
$$ 408883 243632 513239 517703 362007 389415 498369 418478 554850 410057 390579
14810C90579j57817J81371j32061J43657O256J73470A80666K37035A20681N67356
$$ 390579 232762 414133 282072 425729 431985 605455 180666 417701 120681 688037
14800F88037j0732l8694p6935j03875q323J46185A1569N56114A24528J2964K03855
$$ 688037 677305 638611 561676 457801 449478 595663 11569 567683 124528 137492 341347
14789C41347M42313A26675L98906J14658C16765J51387M1622N3795A92910M34549
$$ 341347 783660 126675 525581 640239 316765 468152 509774 563569 192910 627459
14779F27459j15587J51578k42098j7557J83004M9197k30041M7309j10282M02230
$$ 627459 511872 663450 421352 403795 586799 635996 405955 453264 342982 745212
14769G45212l01019J88758r2462J11995j96820A61065K30054K27491B92505L15668
$$ 745212 444193 632951 540489 652484 455664 161065 391119 618610 292505 608173
14759F08173O0439Q3743B12641L25232J03111k70956q8490O8169K24454A99906
$$ 608173 668612 752355 212641 537873 640984 370028 281538 349707 574161 199906
14748H12894m6172o3538C01462J61043Q7682k70344J16174K46199j72375j40847
$$ 812894 766722 703184 301462 462505 550187 279843 396017 642216 469841 328994
14738C28994M00183q1907j97268L98033k32910r8738m4916K24816j46363J32249
$$ 328994 729177 647270 450002 848035 615125 516387 471471 696287 549924 682173
14728F82173j80168J39502j35117j41021J67013J0360L09189l36415J66792j17702
$$ 682173 502005 641507 506390 365369 532382 542742 851931 515516 682308 564606
14718E64606N6817O5093p7181q7581J44757J8825L6673Q6780k96229J21048l9734
$$ 564606 621423 686516 609335 521754 666511 685336 722009 808789 512560 633608 593874
14707E93874Q8941J91580L7665q4055l56498J86887q8163L25221n9410j17573
$$ 593874 682815 874395 912060 828005 471507 658394 570231 895452 836042 718469
14697G18469J96618l02713J73085j64193J71769k22523N5062K85106J62776l99303
$$ 718469 915087 612374 785459 621266 793035 570512 625574 910680 1073456 674153
14687F74153J5781K83880k44199K07215m46770J61133k4692k87118P20603l01949
$$ 674153 689934 973814 729615 936830 490060 651193 626501 339383 1059986 758037
14677G58037J87355j68723J47996k30537J65919K33309k15954L15815k03706O6912
$$ 758037 945392 776669 924665 694128 860047 1093356 877402 1193217 989511 1056423
14667A056423j50821K1711L6923k70920J47018J986n11J02434l47707M45592j3839
$$ 1056423 905602 927313 964236 693316 840334 842320 841809 944243 596536 1042128 1028289
14656A028289l37495L17229l09658K63209P2194j17951K39160r3465O3574q0576
$$ 1028289 690794 1008023 698365 961574 1033768 915817 1154977 1061512 1125086 1044510
14646A044510j4085r4864J04121J94551l68425K22518m2287K53477j13029L0856
$$ 1044510 1030425 935561 1039682 1234233 865808 1088326 1046039 1299516 1186487 1217343
14636A217343j02556k78052M02680l58721J55088K21469m67362L01954J2506j75935
$$ 1217343 1114787 836735 1239415 880694 1035782 1257251 789889 1091843 1104349 928414
14626I28414J85006m849P1741J39575r4306m2937J09900J85622l02092K44362
$$ 928414 1113420 1108571 1180312 1319887 1225581 1182644 1292544 1478166 1176074 1420436
14616A420436k38784L46670j90878k54171J39355J53614O6724j02976J09883q9594
$$ 1420436 1181652 1528322 1337444 1083273 1222628 1376242 1442966 1339990 1449873 1360279
14606A360279l98666Q9900M55888j34012K0191O0089j55259r9157j0673M01312
$$ 1360279 961613 1051513 1507401 1373389 1393580 1453669 1298410 1199253 1188580 1589892
14596A589892k42474J25994j59152K51004k63819O7641L7234j5942O2436k39321
$$ 1589892 1347418 1473412 1314260 1565264 1301445 1369086 1406320 1390378 1452814 1213493
14586A213493K41591j69781K29659K61251l42516N20400k96020k68113K55069
$$ 1213493 1455084 1285303 1514962 1776213 1433697 1954097 1658077 1389964 1645033
14577A645033N8172m1951j05057n458n2636K82652l7822L69574j72859q3320J19551
$$ 1645033 1703205 1661254 1556197 1550739 1498103 1780755 1742933 2112507 1939648 1856328 1975879
14566A975879J39638L2203l1419j33212K10176K05477j84350J32407j35038K78718
$$ 1975879 2115517 2147720 2116301 1983089 2193265 2398742 2214392 2346799 2211761 2490479
14556B490479M40026k62006L69305J31410N21938N14986J368301J913351L792245
$$ 2490479 2930505 2668499 3037804 3169214 3691152 4206138 5574439 7487790 11280035
14547A1280035P826212J5178822P953512B0592977G650891l507410j591228n90335
$$ 11280035 19106247 34285069 42238581 20592977 7650891 4143481 2552253 1961918
14539A961918k35045L00969q1005j84025R0215J11148k92677O1201O4673j1495
$$ 1961918 1726873 2027842 1946837 1762812 1853027 1964175 1671498 1732699 1797372 1785877
14529A785877j0045O3765M831J10460J00898p5682k92036O9738Q9964j40896K63858
$$ 1785877 1775832 1839597 1844428 1954888 2055786 1980104 1688068 1757806 1847770 1706874 1970732
14518A970732K07305K21247Q5706j26707q6681j94262M94383N6611n38164K26248
$$ 1970732 2178037 2399284 2484990 2358283 2271602 2077340 2571723 2628334 2090170 2316418
14508B316418n4846L97089m17259M99811m31184q9126J24706J15681L56095l35549
$$ 2316418 2261572 2658661 2241402 2741213 2310029 2220903 2345609 2461290 2817385 2481836
14498B481836R556J68202K32442j28094M7779P6675J36379l51919M12497k02286
$$ 2481836 2491392 2659594 2892036 2763942 2811721 2888396 3024775 2672856 3085353 2883067
14488B883067K28810J87397k72002n4301J77412K23615j25472J37470M5057l00231
$$ 2883067 3111877 3299274 3027272 2972971 3150383 3373998 3248526 3385996 3431053 3130822
14478C130822m8919K94596P8584l82138M17757K11957j11297P5369L46314l02076
$$ 3130822 3081903 3376499 3455083 3072945 3490702 3702659 3591362 3666731 4013045 3710969
14468C710969j21504J63244L64509j26125r1352o4663L00025j72021K96285k75063
$$ 3710969 3589465 3752709 4117218 3991093 3899741 3835078 4135103 3963082 4259367 3984304
14458C984304j5187O3514L83937k16102m5020J91262J78165k86811L24868J11686
$$ 3984304 3969117 4032631 4416568 4200466 4155446 4346708 4524873 4238062 4562930 4674616
14448D674616K5887Q5396O044k54828M15730r4310J62352k56358N9121m6306L73641
$$ 4674616 4700503 4785899 4791943 4537115 4952845 4858535 5020887 4764529 4823650 4777344 5150985
14437E150985j4434j41446L71789J86533P8316J03378J66256p720k60048M76872
$$ 5150985 5136551 4995105 5366894 5553427 5631743 5735121 5901377 5893657 5633609 6110481
14427F110481m46211J9575N54602K3188q2569M26283N5567j38581J94769K42542
$$ 6110481 5664270 5683845 6238447 6261635 6179066 6605349 6660916 6522335 6717104 6959646
14417F959646J813L82217k42918l5248M66961J59637j20696L22707m79811M26480
$$ 6959646 6961459 7343676 7100758 7065510 7532471 7692108 7571412 7894119 7414308 7840788
14407G840788Q7501L41785o4638n8047N81691p0112q9314P76135k77913K31707
$$ 7840788 7928289 8270074 8205436 8147389 8729080 8658968 8569654 9345789 9067876 9299583
14397I299583K03754r434L62856K84454J69988J07924R5706K03845r6459K82121
$$ 9299583 9503337 9493903 9856759 10141213 10311201 10419125 10514831 10718676 10622217 10904338
14387A0904338N8998O8322O11830Q5099j18501N11047L66092J65442N59525q8583
$$ 10904338 10963336 11031658 11643488 11728587 11610086 12121133 12487225 12652667 13212192 13123609
14377A3123609N36909j88901Q34579j6256J26166K95527N84467Q1942J96125M61016
$$ 13123609 13660518 13471617 14306196 14289940 14416106 14711633 15296100 15378042 15574167 16035183
14367A6035183M14767J70606L44076M41207J63085L22259O66837J61458K77065
$$ 16035183 16449950 16620556 16964632 17405839 17568924 17891183 18558020 18719478 18996543
14358A8996543N18431N81320M89501L57667K43686Q62594M50010N96595J92958
$$ 18996543 19514974 20096294 20585795 20943462 21187148 22049742 22499752 23096347 23289305
14349B3289305N68127R70311M61002R13837L96758R74457P46838M69427J067853
$$ 23289305 23857432 24827743 25288745 26202582 26599340 27573797 28320635 28790062 29857915
14340B9857915J83490J054818J034989M75354J246563J271738J001836Q99182
$$ 29857915 30041405 31096223 32131212 32606566 33853129 35124867 36126703 37025885
14332C7025885J220305J055976J176913J294977J095820J605088J634646J338362
$$ 37025885 38246190 39302166 40479079 41774056 42869876 44474964 46109610 47447972
14324D7447972J677355K066332J246558K052766J755097K278597J816377K473872
$$ 47447972 49125327 51191659 52438217 54490983 56246080 58524677 60341054 62814926
14316F2814926K434170K432120K854416K989171K520746L476330L163595L663117
$$ 62814926 65249096 67681216 70535632 73524803 76045549 79521879 82685474 86348591
14308H6348591L956184L898049M057386M544060M499439N109959N449508N623221
$$ 86348591 90304775 94202824 98260210 102804270 107303709 112413668 117863176 123486397
14300A23486397O018977O907582P219971P262738P500572Q529259Q925232R433623
$$ 123486397 129505374 136412956 143632927 150895665 158396237 166925496 175850728 185284351
14292A85284351R697146J0873356J1235660J1892130J2896019J3201157J4237245
$$ 185284351 194981497 205854853 217090513 228982643 241878662 255079819 269317064
14285B69317064J4521177J4780457J5801331J5863739J6503344J6439834J6081335
$$ 269317064 283838241 298618698 314420029 330283768 346787112 363226946 379308281
14278C79308281J5679263J5057945J3811822J2180912R715987N170602K939643
$$ 379308281 394987544 410045489 423857311 436038223 445754210 450924812 453864455
14271D53864455J029461J451321R85198m04291l215002p102732r946483j1855865
$$ 453864455 454893916 456345237 457330435 456926144 453711142 446608410 436661927 424806062
14263D24806062j3570641j4526694j5604264j6401042j6291361j6547114j6415254
$$ 424806062 411235421 396708727 381104463 364703421 348412060 331864946 315449692
14256C15449692j5609091j4439575j5046704j4084880j3790886j2600597j2328087
$$ 315449692 299840601 285401026 270354322 256269442 242478556 229877959 217549872
14249B17549872j1142551j0956883j0072947r671636q812989p833752p855068
$$ 217549872 206407321 195450438 185377491 175705855 166892866 159059114 151204046
14242A51204046p937843p127968o261923n924348n812792n193255n267572m821235
$$ 151204046 143266203 136138235 129876312 123951964 118139172 112945917 107678345 102857110
14234A02857110m640777m102002l845091l292688l775006l630915l049453l029878
$$ 102857110 98216333 94114331 90269240 86976552 83201546 79570631 76521178 73491300
14226G3491300k698887k963367k297324k697906k422750j782379j880069j780271
$$ 73491300 70792413 67829046 65531722 62833816 60411066 58628687 56748618 54968347
14218E4968347k171693j712083j752124j587024j114612j294138j638121j235958
$$ 54968347 52796654 51084571 49332447 47745423 46630811 45336673 43698552 42462594
14210D2462594j477622j273951q96089o40135j132805j250257j143759j164000
$$ 42462594 40984972 39711021 38814932 38174797 37041992 35791735 34647976 33483976
14202C3483976j180008m54559m98828j135730j130827m66995j095249l91876m68109
$$ 33483976 32303968 31849409 31350581 30214851 29084024 28617029 27521780 27129904 26661795
14193B6661795m66264r34618o40628q26198q63505j33849p97474m94185n20589
$$ 26661795 26195531 25260913 24620285 23794087 22930582 22796733 21999259 21505074 20984485
14184B0984485M440j54388j016361l59040o29894n42071l15096k93500l18579
$$ 20984485 20988925 20834537 19818176 19459136 18829242 18287171 17972075 17678575 17359996
14175A7359996n40830l67228j9045m09455k63614k69390o07376L307m62050k30762
$$ 17359996 16819166 16451938 16432893 16023438 15759824 15490434 14883058 14886365 14424315 14193553
14165A4193553r2717l77173j10855n32652J40673m10348l97534j15922l67627
$$ 14193553 14100836 13723663 13612808 13080156 13220829 12810481 12412947 12297025 11929398
14156A1929398k04762K0372j59640l77088p7823k53087j03599k12715j16689k1714
$$ 11929398 11724636 11745008 11585368 11208280 11130457 10877370 10773771 10561056 10444367 10422653
14146A0422653n72701j10473K0785k38769j03176l45839K5171J84236n13664P8911
$$ 10422653 9849952 9739479 9760264 9521495 9418319 9072480 9097651 9281887 8768223 8847134
14136H847134n7387j96406k15036P2305R028j56947l09972J06729l78174j71600
$$ 8847134 8789747 8593341 8378305 8450610 8459638 8302691 7992719 8099448 7721274 7549674
14126G549674j40132N56182o18103l31586L57121k46239J07713j34321j29426
$$ 7549674 7409542 7965724 7347621 7016035 7373156 7126917 7234630 7100309 6970883
14117F970883Q8780m54953J10663j53918m56555J61428j00179M05346n25519k24461
$$ 6970883 7059663 6604710 6715373 6561455 6104900 6266328 6166149 6571495 6045976 5821515
14107E821515J65507j28610O0004m51510J8928J73850l6540l76231M9205P3282
$$ 5821515 5987022 5858412 5918416 5466906 5485834 5659684 5623144 5246913 5296118 5369400
14097E369400j68489J07553j95529Q4995m50829L03532J73094k83022j66791j7706
$$ 5369400 5200911 5308464 5112935 5197930 4747101 5050633 5223727 4940705 4773914 4756208
14087D756208m5186j1391k75168K54905J63912m20231j49267r6038R1265J07630
$$ 4756208 4711022 4699631 4424463 4679368 4843280 4423049 4273782 4177744 4269009 4376639
14077D376639n28505P9537M12698k97058q5427J51546j65428k359J46655r6557
$$ 4376639 3848134 3927671 4340369 4043311 3957884 4109430 3944002 3941643 4088298 3991741
14067C991741l76364N316J71057q0546k65848L32193k03585j24422Q0006r6719
$$ 3991741 3615377 3620693 3791750 3711204 3445356 3777549 3573964 3449542 3529548 3432829
14057C432829N052r6882K67224k11052j01285J96096k96336k73079n3962K34347
$$ 3432829 3437881 3340999 3608223 3397171 3295886 3491982 3195646 2922567 2868605 3102952
14047C102952k51713k83441M10971O3015j98087j9811J14226L6624l15231o7882
$$ 3102952 2851239 2567798 2978769 3041784 2843697 2823886 2938112 2974736 2659505 2591623
14037B591623n6291J42978K0497K37326J88261l04237j54554J72152o6014k00302
$$ 2591623 2535332 2678310 2698807 2936133 3124394 2820157 2665603 2837755 2771741 2571439
14027B571439J41255k15640J92383p58984L41159J93968j06620j64181O3450l38733
$$ 2571439 2712694 2497054 2689437 1930453 2271612 2465580 2358960 2194779 2258229 1919496
14017A919496N41902J8909k72555q4068j24488Q1087O7530q9592K5703j83197
$$ 1919496 2461398 2480307 2207752 2123684 1999196 2080283 2147813 2058221 2083924 1900727
14007A900727J45219J9423j17851p9257J40429p4518q7914K13754l33864M21369
$$ 1900727 2045946 2065369 1947518 1868261 2008690 1934172 1846258 2060012 1726148 2147517
13997B147517m06166j58924K49320l39698N09617J15661K97300L88604J091917
$$ 2147517 1741351 1582427 1831747 1492049 2001666 2117327 2414627 2803231 3895148
13988C895148K841796O955051J4663445J3444397j7090687A2165738m899122j832946
$$ 3895148 6736944 13691995 28355440 41799837 24709150 12165738 7266616 5433670
13980E433670j313383o34024j41175k81744j33660k72435m3034J78506m7845o00265
$$ 5433670 4120287 3486263 3345088 3063344 2929684 2657249 2614215 2792721 2744876 2144611
13970B144611Q0791J14307n0313j45202R3053k97945K23855l6566l31040K13275
$$ 2144611 2225402 2339709 2289396 2144194 2237247 1939302 2163157 2126591 1795551 2008826
13960B008826k49621K788j73084L61065j7419j40817q0068l082P1892r5225L93971
$$ 2008826 1759205 1761993 1588909 1949974 1932555 1791738 1711670 1708588 1780480 1685255 2079226
13949B079226l47351j10432l52557N04506j68525K41786m61078M34885Q9647k16255
$$ 2079226 1731875 1621443 1268886 1773392 1604867 1846653 1385575 1820460 1910107 1693852
13939A693852k51177r9145N18738j14323m1216m14204K40426J50048l61079J4152
$$ 1693852 1442675 1343530 1862268 1747945 1706729 1292525 1532951 1682999 1321920 1336072
13929A336072P8464J67832N0535m43926L52080k39170L33676n8562K3542l22495
$$ 1336072 1414536 1582368 1632903 1188977 1541057 1301887 1635563 1577001 1600543 1278048
13919A278048m0170L34742j10266k87064J97796l55499O3834K29289K7547k16665
$$ 1278048 1237878 1572620 1462354 1175290 1373086 1017587 1081421 1310710 1338257 1121592
13909A121592j52265O46464o22542R8079j5060K29099l54770N35151l83779J31427
$$ 1121592 969327 1615791 993249 1091328 1076268 1305367 950597 1485748 1101969 1233396
13899A233396J4459k46435K65607q9966j93738J62089P5456p9582K0669j40849
$$ 1233396 1247855 1001420 1267027 1177061 983323 1145412 1220868 1141286 1161955 1021106
13889A021106K38682j5618r842j79630j35942M62691k45072k1670r3150j8126
$$ 1021106 1259788 1244170 1234328 1054698 918756 1381447 1136375 1114705 1021555 1003429
13879A003429L12249m15762j13900P45474F83488J46748J40316J42885Q1466j40972
$$ 1003429 1315678 899916 786016 1531490 683488 830236 970552 1113437 1194903 1053931
13869A053931Q8907l19236K46175L70151n06485K48290O6184l71458n3163L67089
$$ 1053931 1142838 823602 1069777 1439928 933443 1181733 1247917 876459 823296 1190385
13859A190385j59121k31599M9073K28197P9525n0061k82492J67286j89184L0496
$$ 1190385 1031264 799665 848738 1076935 1156460 1106399 823907 991193 802009 832505
13849H32505j60886J23414K66316k94236J62718L22899k66816q3306M1414J32743
$$ 832505 671619 795033 1061349 767113 929831 1252730 985914 902608 944022 1076765
13839A076765o7102k64322n2462O9513L22661m20101L80164k53413r6815j16518
$$ 1076765 1009663 745341 692879 762392 1085053 664952 1045116 791703 694888 578370
13829E78370K17695J20171l49064L83317J73672J3005k25515m11246K94841Q7759
$$ 578370 796065 916236 567172 950489 1124161 1137166 911651 500405 795246 883005
13819H83005j94021J31434K1131K00836j75600l04943K9978j99214P9347K21218
$$ 883005 688984 820418 841549 1042385 866785 561842 591820 392606 471953 693171
13809F93171n8793K16303J08806k64690N780k59449K61213l3419P7203M5141k88675
$$ 693171 634378 850681 959487 694797 700577 441128 702341 668922 746125 791266 502591
13798E02591J87016O5900K65084j90123l01343L03256l06144L12928p9122C35080
$$ 502591 689607 755507 1020591 830468 529125 832381 526237 839165 760043 335080
13787G17410l4245J46866l5640k19650K76882l17596J46597J96038k50985j02742
$$ 717410 683165 830031 794391 574741 851623 534027 680624 876662 625677 522935
13777E22935J51983o2568L49690j12455k03517P9502J6092j2995l22183L62754
$$ 522935 674918 612350 962040 849585 646068 725570 741662 728667 406484 769238
13767G69238q7603K2630j45180l5366M8880j94882M08966l21182K27194l30227
$$ 769238 681635 704265 559085 523719 572599 377717 786683 465501 692695 362468
13757C62468J59780B30527N07749p2952n6028m2674j66498j46929M35795k91953
$$ 362468 522248 230527 738276 665324 609296 566622 400124 253195 688990 397037
13747C97037L38024J76550k56935q539j90293J92300j46537K42950k0232C32950
$$ 397037 735061 911611 654676 646137 455844 648144 501607 744557 724325 332950
13736C25728R1710K31480k77417J14897L385M0684J06804J27232k60686L11839
$$ 325728 417438 648918 371501 486398 489783 530467 637271 764503 503817 815656
13726H15656D03827N6564j24958M81978l30219M7647L03491j68303J9313l35938
$$ 815656 403827 460391 335433 817411 487192 534839 838330 670027 689340 353402
13716C53402K06622R8708o0036J9080Q0490p9662k28792q3109N72286C97913j15718
$$ 353402 560024 658732 598696 617776 698266 618604 389812 306703 878989 397913 282195
13705B82195k2932M91447l13014k18580K90634k8381J74147j36046J95195B76421
$$ 282195 259263 750710 437696 219116 509750 481369 655516 519470 714665 276421
13694B79927L25487r1184j80198J43397p1877p4530P8457J58048B03728M68723
$$ 279927 605414 514230 334032 477429 405552 331022 409479 567527 203728 672451
13684F72451l08597K82915k36343Q3826J68476j89997K08153j06829j08309j21097
$$ 672451 363854 646769 410426 494252 662728 472731 680884 574055 465746 344649
13674C44649C3729K30960J61510G8753M21447o5439p3309j78826q6847L51903
$$ 344649 33729 264689 426199 78753 500200 434761 361452 182626 95779 447682
13664D47682j06185Q9971j98114K8226J55950J1226O6715m4106j69945Q1849F5533
$$ 447682 341497 431468 233354 261580 417530 428756 495471 451365 281420 363269 65533
13652E87884B62756m7827J10693K97682k07567q0535L1740R2300l2545q387A60849
$$ 587884 262756 214929 325622 623304 415737 335202 366942 459242 426697 418310 160849
13640D97614A46989L36925B26865L69019G4385L35327l3610H4500L51818L5918
$$ 497614 146989 483914 226865 595884 74385 409712 376102 84500 436318 472236
13630D72236j96689M1223K96666k90596L00213A99115C9637M1240Q3988K58804
$$ 472236 275547 316770 613436 322840 623053 199115 39637 80877 164865 423669
13620D23669n5467A19578K43710j14792P173j6699Q8895M00194A79656M22358
$$ 423669 368202 119578 363288 248496 255669 238970 327865 728059 179656 602014
13610F02014O3520B88580A05888J42393K12231l1956m9510j4567A51950m9667
$$ 602014 665534 288580 105888 248281 460512 428556 379046 364479 151950 102283
13600A02283Q8767L07938o0824j62920J78697j06186J43660A08788M00748j68754
$$ 102283 191050 498988 438164 275244 453941 347755 491415 108788 509536 340782
13590C40782j24895F3476J73062r1319K89871G3711L14637j20832P6378J17682
$$ 340782 215887 63476 236538 145219 435090 73711 388348 267516 343894 461576
13580D61576j84007A12073K86632q6926A48114J32734p170K14233A40701K71357
$$ 461576 277569 112073 398705 311779 148114 280848 273678 487911 140701 412058
13570D12058j2917k1023o0160A2831K55267L09579B77910O0529N4416O6469j52965
$$ 412058 399141 378118 317958 12831 268098 577677 277910 338439 392855 459324 306359
13559C06359A28982L22061n9335L8654N340j86392A16328J99068J43510B11082
$$ 306359 128982 451043 391708 430362 435702 249310 116328 315396 458906 211082
13548C69955K11399A01457P0291c6940C01751j36561f309A07851J64918n3948
$$ 369955 581354 101457 171748 -36940 301751 165190 -6309 107851 272769 218821
13538B18821N5896J09373A05342K32596K1181k1418n8539r4721K3272M18117k73586
$$ 218821 274717 384090 105342 337938 359119 337701 279162 184441 207713 625830 352244
13527C52244J17331a36241D52503j84274M2140r7555K5834e237C16859K97337
$$ 352244 469575 -136241 452503 268229 310369 212814 238648 -5237 316859 614196
13517F14196C00545j18672M95204l14325r4972l2764F5825M66151j77933A70704
$$ 614196 300545 181873 677077 362752 267780 235016 65825 531976 354043 170704
13506b4611A91858J57536I9333J63987J46589j09280M7286j4644n6908J21358
$$ -24611 191858 349394 99333 263320 409909 300629 347915 333271 276363 397721
13496C97721A20471J2894g8792F23451A38394J48434L5119J63400j71557A02277
$$ 397721 120471 133365 -78792 623451 138394 286828 321947 485347 313790 102277
13485C10673b88215F4669J51528r2638K11181j33158G9988R0470K27447j08463
$$ 310673 -288215 64669 216197 123559 334740 201582 79988 170458 397905 289442
13475B89442K28632A34062N6620N5028R4584J97443a62922C88050A77590P1254
$$ 289442 518074 134062 190682 245710 340294 537737 -162922 388050 177590 248844
13465B48844K79856f431C03839J54955I5913B2259b06823B83684r5790l6594j7074
$$ 248844 528700 -6431 303839 458794 95913 22259 -206823 283684 187894 151300 134226
13454A34226K66848j84590N7437J0618J53061j73522a89266A03658N4062R6299
$$ 134226 401074 216484 273921 284539 437600 264078 -189266 103658 157720 254019
13444B54019J16216A61813a33606B46089J38042a21789C44865k9999a16127C75196
$$ 254019 370235 161813 -133606 246089 384131 -121789 344865 314866 -116127 375196
13433b2256k7310D56610l8950D1494Q4816R9888o6703J95292P4968K8553B14834
$$ -22256 -49566 456610 417660 41494 126310 226198 159495 354787 429755 458308 214834
13421B58289K39950A08399Q8241p5627M4986d3571C77342j14241r809I0334C9361
$$ 258289 498239 108399 196640 121013 165999 -43571 377342 263101 253292 90334 39361
13409B03005P8162E8670L54232m9113J2886p6296j05315m4831n2949J04215r3567
$$ 203005 281167 58670 412902 363789 376675 300379 195064 150233 97284 201499 107932
13398A07932B2080a33531A14989J22244q4822r90J97568l391O5024H5323J01126
$$ 107932 22080 -133531 114989 237233 152411 151421 348989 345598 410622 85323 186449
13387A86449D5655J05102j896E856J24256m3806b14250D05293a86235D5465j9457
$$ 186449 45655 150757 148861 5856 130112 86306 -214250 405293 -186235 45465 26008
13376B6008K89195m4510j8227G7461M187R1970H3937M8017a19731A70808n1262
$$ 26008 315203 270693 252466 77461 81648 173618 83937 131954 -119731 170808 119546
13365A19546K24385D7121L42721a7410I936O8318K45545j13979J74274b05585
$$ 119546 343931 47121 389842 -17410 9936 78254 323799 209820 384094 -205585
13354A79690P2356M0541n8493J47118a098C94454M4351a61124B56531P8604j5138
$$ 179690 252046 292587 234094 381212 -1098 394454 438805 -161124 256531 335135 319997
13343C19997q0980N8076A32668N0669n2911J79098o5339A01229J65172a23442
$$ 319997 239017 297093 132668 183337 130426 309524 244185 101229 266401 -123442
13332D12602J240j06467K7664k8084H6418J82988l401K47409E4696K20297R437
$$ 412602 413842 307375 335039 306955 86418 269406 266005 513414 54696 274993 284430
13321B84430A26057m1546J56346a91248D02624F0872J40728K14905d2901D39620
$$ 284430 126057 84511 240857 -191248 402624 60872 201600 416505 -42901 439620
13310B98758C0160K65384H9037Q3562O2867B955K03417b1767D05464A97349a5934
$$ 298758 30160 295544 89037 172599 235466 2955 206372 -21767 405464 197349 -15934
13298I3966l765a00992B83562L930j17476K90127A84099A9515K09243r3843J44873
$$ 93966 90201 -100992 283562 287492 170016 460143 184099 19515 228758 134915 279788
13287B79788A12564b23910H1446b39143J19070C06056I699J34284B3458J47466
$$ 279788 112564 -223910 81446 -239143 -120073 306056 9699 143983 23458 170924
13277A70924d8894D62229i0805G6115k743D691K13246I5609n191J09679G5967
$$ 170924 -48894 462229 -90805 76115 73372 4691 217937 95609 90418 200097 75967
13265a8554B62170a35108G482J20783J57751d6372A55217g7238A07625a33988
$$ -18554 262170 -135108 7482 128265 286016 -46372 155217 -77238 107625 -133988
13254C1949J99935o3776G5331K35338o0515F633a27642E3147K95061B6576f0780
$$ 31949 231884 168108 75331 310669 250154 6633 -127642 53147 348208 26576 -60780
13242C66634A38094a5258I7587B5115J1960K89427e9048A87997L709r4581J5088
$$ 366634 138094 -15258 97587 25115 37075 326502 -59048 187997 191706 97125 112213
13231A12213C6075J17633j7952M7692q6564K35101E9200f3006k14483i9743A02822
$$ 112213 36075 153708 135756 183448 96884 331985 59200 -63006 -277489 -99743 102822
13219A39514N8511a21343H1899B3721K73889L878A04278f4881A08356b30968d2687
$$ 139514 198025 -121343 81899 23721 297610 301488 104278 -64881 108356 -230968 -42687
13207C79779a98390b8525N945A17676K9346M57966A47581o943L8908l4117J45581
$$ 379779 -198390 -28525 -22580 117676 147022 604988 147581 140638 179546 145429 291010
13196B91010i1657j20533m7301J8559A58176a62800A64416E008K42621A1798e82918
$$ 291010 -91657 -212190 -259491 -240932 158176 -162800 164416 5008 247629 11798 -582918
13184E12784k31336a03692L9186B97301D0429L36158r9739j07474R0067q4166
$$ 512784 281448 -103692 -64506 297301 40429 376587 276848 169374 259441 175275
13174A75275n5758h3131G6718g7292B98997a69814A63171i931K949A92914k4991
$$ 175275 119517 -83131 76718 -77292 298997 -169814 163171 -9931 -6982 192914 167923
13163A67923g7786C07044g2355B50438M0481D2906R2299b9067C45850I6435A1745
$$ 167923 -77786 307044 -72355 250438 290919 42906 135205 -29067 345850 96435 11745
13151A54670M7266r9971J82764a44980A95378a21213A5096g8161A41358c6018
$$ 154670 201936 101965 284729 -144980 195378 -121213 15096 -78161 141358 -36018
13140B82749A6120K48122H2720J75716E393R6995O7816K41470b48491G9642K91486
$$ 282749 16120 264242 82720 258436 5393 102388 170204 411674 -248491 79642 371128
13129C71128A60311n8932L58045b42481f1775j25909B12171b0243C2291K76864
$$ 371128 160311 101379 459424 -242481 -61775 -187684 212171 -20243 32291 309155
13119C09155A31841J99741E4884a36684B44246a19203k5752A38895D4041J01398
$$ 309155 131841 331582 54884 -136684 244246 -119203 -144955 138895 44041 145439
13109A45439a29708J9118A41688B1972b81350d5860Q197C4934a02358M4928B49131
$$ 145439 -129708 -110590 141688 21972 -281350 -45860 -37663 34934 -102358 -57430 249131
13097a35953C0746d4241k12572A32031L4286m4206a89284B71023I0895k0103M1598
$$ -135953 30746 -44241 -256813 132031 166317 122111 -189284 271023 90895 70792 112390
13086A12390a28148B60504j8588K5140a07581J7298B98252g6580A47027l6175
$$ 112390 -128148 260504 241916 267056 -107581 -90283 298252 -76580 147027 110852
13076A10852J89084b6907B18050P0447A8257L48470C2489g5544B53444a697k21455
$$ 110852 299936 -26907 218050 288497 18257 366727 32489 -75544 253444 -1697 -223152
13065b23152A03413a49249C08912A39010a16168B1789a4420B79207A25275L7040
$$ -223152 103413 -149249 308912 139010 -116168 21789 -14420 279207 125275 162315
13055A62315d7282A36476E7164J33582C8736M24774D4322M0186R2498C7109K62689
$$ 162315 -47282 136476 57164 190746 38736 463510 44322 84508 177006 37109 299798
13044B99798j45568a51028B65320i7036k2218E0613e7586D3134J52455p3912K7130
$$ 299798 154230 -151028 265320 -97036 -119254 50613 -57586 43134 195589 121677 148807
13033A48807c53666C58128a81667C28476a41561n370A32182e344G1979b00243
$$ 148807 -353666 358128 -181667 328476 -141561 -146931 132182 -5344 71979 -200243
13022E0600K8455R2067J32215j48403O3862a38864B81721i0259G2585Q7775l0249
$$ 50600 79055 171122 303337 154934 218796 -138864 281721 -90259 72585 160360 130111
13011A30111J38022F4610N6502h914B6033L27540j59558I0562J0125J4515K6620
$$ 130111 268133 64610 121112 -8914 26033 353573 194015 90562 100687 115202 141822
13000A41822a45134C8056n203h4014A50070K10336p2440A22712d3290A89590e4328
$$ 141822 -145134 38056 32853 -84014 150070 360406 287966 122712 -43290 189590 -54328
12988C89379I9089a193j19238C273J67519J43505I529b63130o4709A75009b7754
$$ 389379 99089 -1193 -120431 3273 170792 314297 9529 -263130 -327839 175009 -27754
12976f9002A42612a85944B52620A628K00280g4906D69577b2171j19015k55896
$$ -69002 142612 -185944 252620 1628 201908 -74906 469577 -22171 -141186 -397082
12966c97082E7778j0990L073b24203A611i5788k44776B9791M0044N6756d9372
$$ -397082 57778 46788 49861 -224203 1611 -95788 -340564 29791 69835 126591 -49372
12954H9624J58203a40824j13178A04697J59774a20040d0212n5346q6548C2552
$$ 89624 247827 -140824 -254002 104697 264471 -120040 -40212 -95558 -182106 32552
12943A29211a33105A97897M794I9115i0186j08705A17530b33835c0603q2113d1986
$$ 129211 -133105 197897 202691 99115 -90186 -198891 117530 -233835 -30603 -112716 -41986
12931C22762j25537c5816E71126h3099D5205d2249o7436m9580N4029d3433o3939
$$ 322762 197225 -35816 571126 -83099 45205 -42249 -109685 -159265 -105236 -43433 -107372
12920a07372A04174J3864a45837F007L7402c6634B16244b8417l4010h638A51366
$$ -107372 104174 118038 -145837 6007 43409 -36634 216244 -28417 -62427 -8638 151366
12908a33317F1715A9430L30400a84107I4138l9491J51004a28969j07673Q5870
$$ -133317 61715 19430 349830 -184107 94138 54647 205651 -128969 -236642 -150772
12898a50772D550e5023j21838A27710l1228o191L46724A37115a95468B52593a97421
$$ -150772 4550 -55023 -176861 127710 96482 90291 437015 137115 -195468 252593 -197421
12886C25126A35491a06405F3966d0208m0558C48666e4189J5472E1512b2306A72025
$$ 325126 135491 -106405 63966 -40208 -80766 348666 -54189 -38717 51512 -22306 172025
12874B4926l430J65726a66349B8389J88991I626i8615l4034N2201G317a87038
$$ 24926 21496 187222 -166349 28389 217380 9626 -98615 -132649 -80448 7317 -187038
12862f8847B83801e010A24649c23961G1919e2470C15992C0563g1670n295B198
$$ -68847 283801 -5010 124649 -323961 71919 -52470 315992 30563 -71670 -76965 2198
12850a10137J8716B62006J75445a18048C7767J4750O409J83982b44541B7199a20460
$$ -110137 -91421 262006 437451 -118048 37767 52517 58926 242908 -244541 27199 -120460
12838C130J26376d1342H2914J11223a1707A02396N5058m8201a83921A31270i1401
$$ 3130 129506 -41342 82914 194137 -11707 102396 157454 109253 -183921 131270 -91401
12826a06621H9083R9836I0739C4139e5624A01194K9253Q5131A07543P0067b190
$$ -106621 89083 188919 90739 34139 -55624 101194 130447 215578 107543 177610 -2190
12814B42884c88218h9643A35815d0683f273k1805A6387b7496E9433Q1350e4926
$$ 242884 -388218 -89643 135815 -40683 -6273 -28078 16387 -27496 59433 140783 -54926
12802F931i5037B08196a51955G5273b07465j12075P5854C78059a25739O0599G282
$$ 6931 -95037 208196 -151955 75273 -207465 -319540 -243686 378059 -125739 -65140 7282
12790A25027i6053r6551b7685A39715J22255i948A63815b18961H2467h7267r1837
$$ 125027 -96053 -192604 -27685 139715 261970 -9948 163815 -218961 82467 -87267 -179104
12779a79104Q2545A95167a18240E5657b79085e7487j90075f5157B95106b49846
$$ -179104 -96559 195167 -118240 55657 -279085 -57487 -247562 -65157 295106 -249846
12768A37889b4529A30213b51538A11358n0434J28349c50840J72529m2071g8531
$$ 137889 -24529 130213 -251538 111358 60924 189273 -350840 -178311 -220382 -78531
12757A28459J76960o7344o8259a06044G5723L01332c3947A17917a29622H5410
$$ 128459 305419 238075 169816 -106044 75723 377055 -33947 117917 -129622 85410
12746A69425b70209e8152H0756b747A20202D7939P2753J68522A04870L2129a34712
$$ 169425 -270209 -58152 80756 -2747 120202 47939 120692 289214 104870 136999 -134712
12734e3537a3135C79192j72424d6021A56674c6466B15948q8999D2204J35016o5982
$$ -53537 -13135 379192 206768 -46021 156674 -36466 215948 126949 42204 177220 111238
12723A11238b06959Q6945A86086N6696j9627h428A05502D1646J41320A0439J8844
$$ 111238 -206959 -120014 186086 242782 223155 -8428 105502 41646 182966 10439 29283
12712B9283Q149J69720c2361B52670l3758b94343D36875H6518K1327Q0768k4157
$$ 29283 37432 207152 -32361 252670 218912 -294343 436875 86518 107845 188613 164456
12701A64456j7892J41976d9265j94767e4205g306I9652J7455a04174A7697K24679
$$ 164456 146564 288540 -49265 -244032 -54205 -7306 99652 117107 -104174 17697 242376
12690B42376c5313j75751B0881J70446m4575J53127a67900f9212j12697B21803
$$ 242376 -35313 -211064 20881 191327 146752 299879 -167900 -69212 -181909 221803
12679C05592a44477A23462a68281B16633b09937A78647D2930J29480M0631K33556
$$ 305592 -144477 123462 -168281 216633 -209937 178647 42930 172410 213041 446597
12669D46597A19275E6480a82462H0772Q2402l0549a10027E6122J67524P4117H7010
$$ 446597 119275 56480 -182462 80772 163174 132625 -110027 56122 223646 297763 87010
12657G1178c4939B68820A5329J69336J19186B9276L86269b7305k8643C17612e3513
$$ 71178 -34939 268820 15329 184665 303851 29276 415545 -27305 -55948 317612 -53513
12645B78259h2899I429K2512c859k03860E3986a2766E75193A49449R242b9333
$$ 278259 -82899 9429 31941 -3859 -207719 53986 -12766 575193 149449 158691 -29333
12633B1303P7986Q2056b1800B26759N3084j9767Q8243j66970a52019N6638A90661
$$ 21303 99289 181345 -21800 226759 279843 260076 348319 181349 -152019 -95381 190661
12621a07062D39755A12339J47061b53182A2956h9398j16199G1152A2388D566K96742
$$ -107062 439755 112339 259400 -253182 12956 -89398 -205597 71152 12388 4566 301308
12610C01308b61149d3422j2041j8918b0798n3457C60328b15635H4432J61286I8285
$$ 301308 -261149 -43422 -55463 -74381 -20798 -74255 360328 -215635 84432 245718 98285
12598a30139A71234J77268e4649A34551l8495D0987O161r470a52381A49387p4393
$$ -130139 171234 348502 -54649 134551 96056 40987 47148 37678 -152381 149387 74994
12587G4994M5095C648a66084n6809E2007Q912N1414d6193k49442c9573A21516
$$ 74994 120089 3648 -166084 -222893 52007 60919 112333 -46193 -295635 -39573 121516
12575A3876P6827l7668a65456C12447a13254A0758M3071K3882a5672j25618N9984
$$ 13876 90703 53035 -165456 312447 -113254 10758 53829 77711 -15672 -141290 -81306
12564h1306E99N7253J32195b54619J01405B25901P7971B6796O6493l1674a52359
$$ -81306 599 57852 190047 -254619 -153214 225901 303872 26796 93289 61615 -152359
12552A68934B764L33711D1199b20414C9576f8798I347J88752a01681L4072b2732
$$ 168934 2764 336475 41199 -220414 39576 -68798 9347 198099 -101681 -67609 -22732
12540a819n1809j93945A17789J12434d8773o7606L6319i090j33221D45214a14882
$$ -1819 -53628 -247573 117789 230223 -48773 -116379 -80060 -9090 -142311 445214 -114882
12528d2639A0817b54152D6732O8467n1743b4450I3963O2480e0597A19005J92673
$$ -42639 10817 -254152 46732 115199 63456 -24450 93963 156443 -50597 119005 311678
12517C11678A39520a59795O1582A91497J01270o1846i3769I0842J29744a31568
$$ 311678 139520 -159795 -98213 191497 292767 230921 -93769 90842 220586 -131568
12506e5096A5d28486H5403C0919J52451e8922B44294h2980B47541G1305i9017
$$ -55096 15 -428486 85403 30919 183370 -58922 244294 -82980 247541 71305 -99017
12494A15893b5524j1545q5297F6357B1939K63106i5588j6441A12576a63090f5960
$$ 115893 -25524 -37069 -122366 66357 21939 285045 -95588 -112029 112576 -163090 -65960
12482a15469j04079A81713c1580E406a84939B60525o3486a0486D57670C5412g4976
$$ -115469 -219548 181713 -31580 5406 -184939 260525 197039 -10486 457670 35412 -74976
12470I7545O739h4487D4949a74958A88005l0451F8439B1674c7409l9011L3912
$$ 97545 104284 -84487 44949 -174958 188005 157554 68439 21674 -37409 -76420 -42508
12459d2508C06285j30528J49856i0801J9216A20053c7636a4703o2465p927b2558
$$ -42508 306285 175757 325613 -90801 -71585 120053 -37636 -14703 -77168 -85095 -22558
12447E8854M2081a26076r4513l6523A27301i5616C01467c04419i2034M1434A68302
$$ 58854 100935 -126076 -220589 -257112 127301 -95616 301467 -304419 -92034 -50600 168302
12435b57826A19660K1356P5704b2495G9260J52863H542a2269k68327J01821A1552
$$ -257826 119660 141016 216720 -22495 79260 232123 8542 -12269 -280596 -178775 11552
12423b36518a06153B10347p5099e9844m7806m15646H4459b49812B76379C6983
$$ -236518 -106153 210347 135248 -59844 -107650 -523296 84459 -249812 276379 36983
12412A37731a34190B79815I8808N7634a12880N5975n0262I9448f474l7231H58
$$ 137731 -134190 279815 98808 156442 -112880 -56905 -107167 99448 -6474 -43705 858
12400b392j22788B3353a37036j75054B95604e199G0869J30223b49546B52748a02385
$$ -2392 -125180 23353 -137036 -312090 295604 -5199 70869 201092 -249546 252748 -102385
12388a74211h6152j16666r588j38609e1687E4445a26484A85884H3001a80388A14456
$$ -174211 -86152 -202818 -212406 -351015 -51687 54445 -126484 185884 83001 -180388 114456
12376a0680j11571A72597G0874J88498H3954A0048K2493P8228b38537E0821K90720
$$ -10680 -122251 172597 70874 259372 83954 10048 32541 110769 -238537 50821 341541
12365C41541B5641g634q3639l7502d475A27713e8891l0195L5446A72393b8633
$$ 341541 25641 -7634 -91273 -128775 -4475 127713 -58891 -89086 -53640 172393 -28633
12353D1929a01350B56788G4772A4629c2742D0591k68K62846G3170N124K8360K9641
$$ 41929 -101350 256788 74772 14629 -32742 40591 40323 303169 73170 78294 106654 136295
12341A36295a94364A90184B2312H356M5948K1545O0057a297j54451B57993b4029
$$ 136295 -194364 190184 22312 8356 54304 75849 135906 -1297 -155748 257993 -24029
12329C15678A05881a64940B70164c39870a62179A98343a23204c2651k29994a7530
$$ 315678 105881 -164940 270164 -339870 -162179 198343 -123204 -32651 -262645 -17530
12318A08426a63365C04971C5775b3657I9983b02821G4701C5967N6551c49219A99053
$$ 108426 -163365 304971 35775 -23657 99983 -202821 74701 35967 92518 -349219 199053
12306A88305a72046c9106C0963f6112C6923b6024B16048A00104b01188B59177
$$ 188305 -172046 -39106 30963 -66112 36923 -26024 216048 100104 -201188 259177
12295D7774L01389c7277C53100a64413J7824C12762a5811A42862a8619A34047
$$ 47774 349163 -37277 353100 -164413 -146589 312762 -15811 142862 -18619 134047
12284B38436h7698A4134O9758K35919h5516F8494Q1620a29657A67725n6892P2995
$$ 238436 -87698 14134 83892 319811 -85516 68494 150114 -129657 167725 110833 183828
12273A83828a44705B73121J21381A53885J01638k0069A11693n3236K03331I6068
$$ 183828 -144705 273121 394502 153885 255523 235454 111693 58457 261788 96068
12262h486n2750k11487g3719A00902K71838G5482b49881H3898K49749J69574B2166
$$ -8486 -61236 -272723 -73719 100902 372740 75482 -249881 83898 333647 503221 22166
12250B42991b70389h8094A53723B3660a3022C8175Q5367b49904H5147b51694G3886
$$ 242991 -270389 -88094 153723 23660 -13022 38175 123542 -249904 85147 -251694 73886
12238H2730B0407L47738a25591A65705a25609B18328R871C6551K60845G0722O8879
$$ 82730 20407 368145 -125591 165705 -125609 218328 228199 36551 297396 70722 139601
12227A39601B9729K40797k2710A01122J19203j5575K814d0587B88445G1888K95602
$$ 139601 29729 270526 247816 101122 220325 204750 207564 -40587 288445 71888 367490
12216C67490E6647j4000N73397C6602K75318J45507B11043A6828K010J70371m0281
$$ 367490 56647 42647 616044 36602 311920 457427 211043 16828 18838 189209 148928
12205A48928J2962d8575B25450F8187R2057a00246B15610a3520B17040o8446J10901
$$ 148928 161890 -48575 225450 68187 160244 -100246 215610 -13520 217040 148594 259495
12194B59495O4311o0225j03124J1701a9479m7712B8415J52357D4446L87382o9393
$$ 259495 323806 263581 160457 172158 -19479 -67191 28415 180772 44446 431828 362435
12183C62435j71825b54550A81514K50353A70824K20096C1785O068b81914A36116
$$ 362435 190610 -254550 181514 431867 170824 390920 31785 37853 -281914 136116
12172b0993F6692B6841L3826B652b29829A90709C4546M1738a18395m2329q067
$$ -20993 66692 26841 60667 2652 -229829 190709 34546 76284 -118395 -160724 -168791
12161a68791G1397l1602j8738d71401E8628K82480A07592A3655c31817B32085
$$ -168791 71397 39795 21057 -471401 58628 341108 107592 13655 -331817 232085
12150d15016C42072D4558J01854a30863E1757q039a30679M7430E3497a43918A0691
$$ -415016 342072 44558 146412 -130863 51757 43718 -130679 -83249 53497 -143918 10691
12138a26901F2003b20792h0793c4140k20914J11271N8988B02912d6468A95394
$$ -126901 62003 -220792 -80793 -34140 -255054 -143783 -84795 202912 -46468 195394
12127C01571F7087a6416j14213c4725A93428M9249C5875A4265L65726A66696k34
$$ 301571 67087 -16416 -130629 -34725 193428 242677 35875 14265 379991 166696 166462
12116A66462b39674d6941k56447A01140m3474J48377d7376p256m0838k72052A37605
$$ 166462 -239674 -46941 -303388 101140 57666 206043 -47376 -54632 -95470 -367522 137605
12104A7682e0911A25796C412L7379K2232a11610N3609G4112A9776a14997K3760
$$ 17682 -50911 125796 3412 40791 63023 -111610 -58001 74112 19776 -114997 -91237
12093i1237J4058C12238A4640J93469F6972a76039P7168f084m3162F9335J2202
$$ -91237 -77179 312238 14640 208109 66972 -176039 -98871 -6084 -49246 69335 81537
12082H1537J23852r3749J4824a80684j26691A05687J57219a15442A23008J34070
$$ 81537 205389 111640 126464 -180684 -307375 105687 262906 -115442 123008 257078
12072B57078G8281e4489B93256p9609a07639M5311j19551C88578M21889P46890
$$ 257078 78281 -54489 293256 213647 -107639 -62328 -181879 388578 810467 1557357
12062A557357E62053b11240D2688M0605J44216a3080l3612J8105A89626E2474
$$ 1557357 562053 -211240 42688 83293 227509 -13080 -46692 -28587 189626 52474
12051A36020I477a01000j62220c8656k8443a1533k69443M7333m3522D8538A2703
$$ 136020 9477 -101000 -263220 -38656 -67099 -11533 -280976 -233643 -277165 48538 12703
12039b55519a09927C7479K43332e9651J3761A56143a74130C7703A1710a74251
$$ -255519 -109927 37479 280811 -59651 -45890 156143 -174130 37703 11710 -174251
12028G2493b34447B92980j36283a9588m2328A66974m7476J33452j18195b60598
$$ 72493 -234447 292980 156697 -19588 -61916 166974 119498 252950 134755 -260598
12017a97821d3977A67482m6042J969f2629B07597b34906B11938d24702a43690
$$ -197821 -43977 167482 121440 123409 -62629 207597 -234906 211938 -424702 -143690
12006b3201j8020B59305A00430h3956L3883k23725D9640d52333A58458P4101g0105
$$ -23201 -41221 259305 100430 -83956 -50073 -273798 49640 -452333 158458 232559 -70105
11994A64854e9231A56534K31885f3732C4413a07290j47116G8810K31355g7003
$$ 164854 -59231 156534 388419 -63732 34413 -107290 -254406 78810 310165 -77003
11983A38040a34772L8717A80737l5052N1785k0483l5568q65n0162i8839k4285
$$ 138040 -134772 -96055 180737 145685 197470 176987 141419 140554 90392 -98839 -123124
11972a23124j16672p7629J19182h6415k45403g9404l1904A34902a46608A40303
$$ -123124 -239796 -317425 -198243 -86415 -331818 -79404 -111308 134902 -146608 140303
11961a7232m935A02615l4375c33853C47098a32696p7977r0854c4345q0272E2180
$$ -17232 -22167 102615 68240 -333853 347098 -132696 -210673 -301527 -34345 -114617 52180
11949A09303b08052b1660H8640l5121d6556m7530D7679h6495F5484Q1494a33934
$$ 109303 -208052 -21660 88640 53519 -46556 -94086 47679 -86495 65484 146978 -133934
11937c51111D23715F3557a9557k97244C99446j58585g6174I7315g5513I3174Q9669
$$ -351111 423715 63557 -19557 -316801 399446 240861 -76174 97315 -75513 93174 182843
11926A82843a53062J4732A44264o9468J41537N9552a83756J9638M4672j0159p4871
$$ 182843 -153062 -138330 144264 74796 216333 275885 -183756 -164118 -119446 -129605 -204476
11915b04476B3645K48089e2409B84779G8798A2264O0521a05104B4917i275m7665
$$ -204476 23645 271734 -52409 284779 78798 12264 72785 -105104 24917 -9275 -56940
11904e6940a8882L385B4963J65945h9249B17366d33953N0955h0243I2982A0442
$$ -56940 -18882 -15497 24963 190908 -89249 217366 -433953 -382998 -80243 92982 10442
11892e122A10885a59722e4317b2516A23041a13696A69285b6366a2163B04071h0310
$$ -5122 110885 -159722 -54317 -22516 123041 -113696 169285 -26366 -12163 204071 -80310
11880E0453J02721e8172D8460a50076M8011M9620B4221R9039Q0950B9382a42097
$$ 50453 153174 -58172 48460 -150076 -102065 -52445 24221 123260 204210 29382 -142097
11868A01302b34157A60182D2647e5879k24642G9649b36257d9754A74218N9047
$$ 101302 -234157 160182 42647 -55879 -280521 79649 -236257 -49754 174218 233265
11858B33265a90396D2303R407J47632b6760B77517M8684C5579K4955b52578a4032
$$ 233265 -190396 42303 51710 199342 -26760 277517 326201 35579 60534 -252578 -14032
11846C7289a451r4683A91731G4515A5269i3218k63323A78580b13422G0393J25705
$$ 37289 -1451 -96134 191731 74515 15269 -93218 -356541 178580 -213422 70393 196098
11835A96098d1360l2702j35587A16249b60491Q7641L5236m12415A62425b87511
$$ 196098 -41360 -74062 -209649 116249 -260491 -172850 -137614 -550029 162425 -287511
11824i9079A19424a66803F5340d0531G3411g3269c967B02114a84847A9597J1829
$$ -99079 119424 -166803 65340 -40531 73411 -73269 -3967 202114 -184847 19597 31426
11813C1426f4022A51307f9376J9706E8432k7529b72051b2370C60587a5758D00623
$$ 31426 -64022 151307 -69376 -49670 58432 30903 -272051 -22370 360587 -15758 400623
11801b10427C428a85645f8614p3576N6530A68694Q9314k3545i0479k36360a24689
$$ -210427 3428 -185645 -68614 -142190 -85660 168694 258008 234463 -90479 -326839 -124689
11789f235G7052b80310H3596J40821B4979K77006A1474K73821H2371P9501G4722
$$ -6235 77052 -280310 83596 224417 24979 301985 11474 285295 82371 161872 74722
11777A70081d123H8730b64309N8982a1817A86156B9259p204a02546L4492j3789
$$ 170081 -4123 88730 -264309 -205327 -11817 186156 29259 22055 -102546 -68054 -81843
11766h1843a6258B1578M5343i6139j79041B29583E8250A7648J58774J6337d3221
$$ -81843 -16258 21578 66921 -96139 -275180 229583 58250 17648 176422 192759 -43221
11754a52401A10975P3948j2091a80592e0642r6655B79780g0214l6044d5752K1388
$$ -152401 110975 184923 172832 -180592 -50642 -147297 279780 -70214 -106258 -45752 -24364
11743b4364A02068f5645k1324I7658i6719J9829A02773a05294A24830C9794A6425
$$ -24364 102068 -65645 -86969 97658 -96719 -76890 102773 -105294 124830 39794 16425
11731g1122a0887r0178C23923b62417A4474c69415C5979M18854A54737L134k9686
$$ -71122 -10887 -101065 323923 -262417 14474 -369415 35979 454833 154737 157871 128185
11720A28185L02254j36284p8030o9891b85166D807b1641f062G2800N2177Q3018
$$ 128185 430439 294155 216125 146234 -285166 4807 -21641 -6062 72800 124977 207995
11709B07995I5269J48724b21364k452R0267l4107p4833B5322L3077K66175j12109
$$ 207995 95269 243993 -221364 -223816 -133549 -167656 -242489 25322 58399 324574 212465
11698B12465f0885p8527B07990a82858A46953L7117b12741h4856A34023i4138
$$ 212465 -60885 -139412 207990 -182858 146953 184070 -212741 -84856 134023 -94138
11687A98435o8055J85412a3983o3545j48617J465F6423K99050a23762A68215a08119
$$ 198435 130380 315792 -13983 -77528 -226145 -224680 66423 365473 -123762 168215 -108119
11675A84261l1023J50794C6036K49474a12059j70236g4264j57321i287D2474a87032
$$ 184261 153238 304032 36036 285510 -112059 -282295 -74264 -231585 -9287 42474 -187032
11663H1397J36077a7419I715L0879N523K95091b39167L7336O1882B34957M9640
$$ 81397 217474 -17419 9715 40594 46117 341208 -239167 -201831 -139949 234957 284597
11652B84597E023L05128b38261D3813J61582G2568J13607b42776J10238A09395
$$ 284597 5023 310151 -238261 43813 205395 72568 186175 -242776 -132538 109395
11641c8807j62007I8206D6093a21900K1925j10634B1260J3996a35656b6831j34558
$$ -38807 -200814 98206 46093 -121900 -99975 -210609 21260 35256 -135656 -26831 -161389
11630a61389O3213A36726K74724G5098c8501r735j37000A21811l4604K49263E5
$$ -161389 -98176 136726 411450 75098 -38501 -48236 -185236 121811 87207 336470 55
11618e6593H7619R5725g7841A83090E0114K9991a18377E8502a08659e0291B13080
$$ -56593 87619 183344 -77841 183090 50114 80105 -118377 58502 -108659 -50291 213080
11606c3944o7890H4461a37416L0333L6151j68905J16000b4782c829n3843R083
$$ -33944 -101834 84461 -137416 -107083 -70932 -239837 -123837 -24782 -3829 -57672 -48589
11595d8589A44235L5889F1156b16917A70787R6622a06199C04432O3667M3267A04170
$$ -48589 144235 180124 61156 -216917 170787 267409 -106199 304432 368099 411366 104170
11583B29114G1057a68808k1606I9161A5906K86481a20539D929P42a69084C1199
$$ 229114 71057 -168808 -190414 99161 15906 302387 -120539 4929 5671 -169084 31199
11571c5824B2307P2705L34014H2775a03802A40310J2018D0651R155a09160F2286
$$ -35824 22307 95012 429026 82775 -103802 140310 152328 40651 49806 -109160 62286
11559D74593a25512N5782k9328C48395A32981C1012i2441c0102I9827O7448M4098
$$ 474593 -125512 -69730 -99058 348395 132981 31012 -92441 -30102 99827 167275 211373
11548B11373D1907a48522D1848J18098K28217b63066A82138c4324J1427j60722
$$ 211373 41907 -148522 41848 159946 388163 -263066 182138 -34324 -22897 -183619
11538a83619A04600e0795n8039D5728a88104B38261C2914b730j1506o2740m7468
$$ -183619 104600 -50795 -108834 45728 -188104 238261 32914 -2730 -14236 -76976 -124444
11527a24444K4595A65183L8617k1000K6183M9897k3057L5681l2033Q0419l1766
$$ -124444 -99849 165183 203800 182800 208983 258880 235823 271504 239471 319890 288124
11516B88124o1803R8155e2452A11841i517B04526I7828R970L149k4260h4722D04904
$$ 288124 226321 324476 -52452 111841 -9517 204526 97828 107798 110947 86687 -84722 404904
11503a36053G4253L59939B09847a0892B74856H0067K79775j37467d6315B55838
$$ -136053 74253 434192 209847 -10892 274856 80067 359842 222375 -46315 255838
11492g4609B23394i1353p749D16790j56556K09561j85561A3654K52148a7310G4899
$$ -74609 223394 -91353 -99102 416790 260234 469795 284234 13654 265802 -17310 74899
11480a20957e7232A42102J04358K56J94058a18729b6413C73959j56126j04630
$$ -120957 -57232 142102 246460 246716 440774 -118729 -26413 373959 217833 113203
11470A13203o808A5527J26752B3430J58385p5174d532A24482J81421a22322N6152
$$ 113203 106395 15527 142279 23430 181815 106641 -4532 124482 305903 -122322 -66170
11459f6170b2482B85517P7735d2896N326A52324f1751B71269d6893B12636C7255
$$ -66170 -22482 285517 363252 -42896 -37570 152324 -61751 271269 -46893 212636 37255
11447b45848B23249a22074a0406A02424k1947J37292A8211K43631I7278l4133
$$ -245848 223249 -122074 -10406 102424 80477 217769 18211 261842 97278 63145
11437F3145K44459J00530b08996i3010j48491J17752r4682a04909L621A5853J38916
$$ 63145 307604 408134 -208996 -93010 -241501 -123749 -218431 -104909 -101288 15853 154769
11426A54769r92J3205b55859J25010A2922J87813c195m7448a6931l54255a80530
$$ 154769 153777 166982 -255859 -130849 12922 200735 -3195 -50643 -16931 -371186 -180530
11414D8275k0751i2368C49474i5315b3023j7191f425A70543g1618I8205a13965
$$ 48275 27524 -92368 349474 -95315 -23023 -40214 -6425 170543 -71618 98205 -113965
11402A47817a43276j6662B67329a22396J2660A4890b93111A67573P0332b2723
$$ 147817 -143276 -159938 267329 -122396 -109736 14890 -293111 167573 237905 -22723
11391e9037j24556P9575A02719d64822B35972G4308P7325h0690o2245A44610L9330
$$ -59037 -183593 -104018 102719 -464822 235972 74308 151633 -80690 -142935 144610 183940
11380A83940e6407B62975m2637f6358B75948a0699p1628D3971K16251R3230b67719
$$ 183940 -56407 262975 220338 -66358 275948 -10699 -82327 43971 260222 353452 -267719
11368H3471K9668a93816B19277H7128a51307j87778k2243a75764C17198a90990
$$ 83471 113139 -193816 219277 87128 -151307 -339085 -361328 -175764 317198 -190990
11357C41436j09411a93733J1928d0977A34566a00147b549A82842K5858o4459k1991
$$ 341436 232025 -193733 -181805 -40977 134566 -100147 -2549 182842 208700 144241 122250
11346A22250O166a581n3996B14018a27814A15820b89147f5242B4888J63811a59706
$$ 122250 128416 -1581 -55577 214018 -127814 115820 -289147 -65242 24888 188699 -159706
11334A0686a4097A39417J87301A5258h8464c5434k63850a30398j6654p8786a6974
$$ 10686 -14097 139417 326718 15258 -88464 -35434 -299284 -130398 -147052 -225838 -16974
11322A52553M4306f5103r9532d2396k30921A12762N7833J23236A39211h2832k42054
$$ 152553 196859 -65103 -164635 -42396 -273317 112762 170595 293831 139211 -82832 -324886
11311c24886c1743m6760K6108B9692i1318k16050D1744J1360K11560K8676f2534
$$ -324886 -31743 -78503 -52395 29692 -91318 -307368 41744 53104 264664 293340 -62534
11299B309b85077i8372C30211a71158A80310l8126a14296M2739C9407J39743a05532
$$ 2309 -285077 -98372 330211 -171158 180310 142184 -114296 -71557 39407 179150 -105532
11287A72663a10873I0455a40182L1994q6904j19346B18118b33068o2591C1844
$$ 172663 -110873 90455 -140182 -108188 -195092 -314438 218118 -233068 -295659 31844
11276a37625d4840a2862n32A82128b96631E6787J1136b8640F0828L2839c7869
$$ -137625 -44840 -12862 -13394 182128 -296631 56787 67923 -28640 60828 93667 -37869
11264B39674J34644g4056J2276m5385J7789k7518A82959H6130a36481d7210j3959
$$ 239674 374318 -74056 -61780 -107165 -89376 -116894 182959 86130 -136481 -47210 -61169
11253f1169A78009l2637M1359q4750K24044H3403b46366B56564b0188p3917m2510
$$ -61169 178009 145372 186731 101981 326025 83403 -246366 256564 -20188 -94105 -136615
11242a36615A0312c2112C7635b51767J5820j0604J00087a4465j77843H5466c26480
$$ -136615 10312 -32112 37635 -251767 -235947 -246551 -146464 -14465 -192308 85466 -326480
11230A96293I552d9952D2218D080b50909C32019a94987R2122m1222L1808k0920
$$ 196293 9552 -49952 42218 4080 -250909 332019 -194987 -102865 -144087 -112279 -133199
11219a33199j46193N8268C25052j28021C8695e2904n54F8537K54338a1605k4382
$$ -133199 -279392 -221124 325052 197031 38695 -52904 -53458 68537 322875 -11605 -35987
11208c5987C25542e7956B91357j07895b18518q2513D6750h2147j90734A12776
$$ -35987 325542 -57956 291357 183462 -218518 -301031 46750 -82147 -272881 112776
11197d4176j52979n8493A94046a58819A16843a86832P3217A6892b42562m7941
$$ -44176 -197155 -255648 194046 -158819 116843 -186832 -113615 16892 -242562 -290503
11187b90503A66039b68403J18578A93719J61776b40404A86324n2825F4374a9790
$$ -290503 166039 -268403 -149825 193719 355495 -240404 186324 133499 64374 -19790
11176A11446k8747g0747l78287G106J76711C3935b1769j13345j10991B68125c3362
$$ 111446 82699 -70747 -449034 7106 183817 33935 -21769 -135114 -246105 268125 -33362
11164g3960j21505A10001g20G8581a83351n0085A84067f7958j18508e7516A06097
$$ -73960 -195465 110001 -720 78581 -183351 -233436 184067 -67958 -186466 -57516 106097
11152G1306J61767a37641N3884n8197e2731j44620d7371j49864C49380a04622
$$ 71306 233073 -137641 -83757 -141954 -52731 -197351 -47371 -197235 349380 -104622
11141A20627b47649F4086B0905K42790A8152a53045J8296e5243C20418c2379p3221
$$ 120627 -247649 64086 20905 263695 18152 -153045 -134749 -55243 320418 -32379 -105600
11130a05600A17744B227K01080o5334c07616B19106K0329E8021O4362J42239b74741
$$ -105600 117744 2227 203307 137973 -307616 219106 239435 58021 122383 264622 -274741
11118b93063N3885O5455A93920n3224a33977c4970A44391b12669N4996A05066
$$ -293063 -239178 -173723 193920 140696 -133977 -34970 144391 -212669 -157673 105066
11107e0172J9198a5139B70769b39643D9409j5643L0518N3829a87007D15199A27117
$$ -50172 -30974 -15139 270769 -239643 49409 33766 64284 118113 -187007 415199 127117
11095I1360M7444b3808B84055m0497M036d8870A44195J96757a25323D68227B32730
$$ 91360 138804 -23808 284055 243558 247594 -48870 144195 340952 -125323 468227 232730
11083H9572K23203o1915Q2057j58583J58058G6266J32541J31486o9069D4452N56584
$$ 89572 312775 250860 332917 174334 332392 76266 208807 340293 271224 44452 601036
11072F01036k00249J63823k74192j695A11453O951L10833q7794K4423L04495j80954
$$ 601036 400787 564610 290418 288723 111453 118404 429237 341443 365866 670361 489407
11061D89407J5875a19200D04864L90468j20061L59484l28096j23108j86362L74580
$$ 489407 505282 -119200 404864 795332 675271 1034755 706659 583551 397189 771769
11051G71769k97867M67379D24804K78328J09332K21668j18712j79039J72792o2917
$$ 771769 473902 941281 424804 703132 812464 1034132 915420 736381 909173 846256
11041H46256J84149l66964l5468M51267l33804k99174k4441J15765L80091j34484
$$ 846256 1030405 663441 627973 1079240 745436 446262 421821 537586 917677 783193
11031G83193j60681q1710J29914L68076j90307l10938L14483j73314L6862j93442
$$ 783193 622512 540802 670716 1038792 848485 537547 852030 678716 715578 522136
11021E22136K30802C49397K98473J30425A69139M63868k85377M68496A98331L33093
$$ 522136 752938 349397 647870 778295 169139 633007 347630 816126 198331 531424
11011E31424B58707L31311J89445C45680Q16040D96990m0089K98941M0049k13181
$$ 531424 258707 590018 779463 345680 1161720 496990 456901 755842 795891 582710
11001E82710M5536K86059j18270k79900J25862K73823j65585k63958M7807N03808
$$ 582710 628246 914305 796035 516135 641997 915820 750235 486277 534084 1037892
10991A037892j24767j7507j22103K04561k16868k61567R44090m14530J41142M970
$$ 1037892 913125 895618 773515 978076 761208 499641 1443731 1029201 1170343 1175313
10981A175313j88948J17440N14729j72076K40054N37481J8859R7259L01792P33414
$$ 1175313 986365 1103805 1618534 1446458 1686512 2223993 2242852 2340111 2641903 3375317
10971C375317o60588J23080k99388K3930n35242r3058m57535J46590J54j65307
$$ 3375317 2714729 2837809 2538421 2562351 2027109 1934051 1476516 1623106 1623260 1457953
10961A457953K9797J81912L13942m63447J15618J66470m87233J1167m51768J765
$$ 1457953 1487750 1669662 1983604 1520157 1635775 1802245 1315012 1326179 874411 876176
10951H76176N7884D27468J10372k26349J28920j66460K44928j7035A89329d264
$$ 876176 934060 427468 537840 311491 440411 273951 518879 501844 189329 -4264
10940A77076P0648c9115A38013a86736I5865O7620A0746a79294c4746A14303a41500
$$ 177076 247724 -39115 138013 -186736 95865 163485 10746 -179294 -34746 114303 -141500
10928b29506e4119r5660l7506B14013D5404f4890O826A68022a42600p9002F0491
$$ -229506 -54119 -149779 -187285 214013 45404 -64890 -58064 168022 -142600 -221602 60491
10916A05849h0653A9835M48288c90476P5872B9224e1070C661a4993l39659A00265
$$ 105849 -80653 19835 468123 -390476 -314604 29224 -51070 3661 -14993 -354652 100265
10904f6443b9858n5218C34311B5684L0383a02395o9302f3578A81358n8818a82903
$$ -66443 -29858 -85076 334311 25684 56067 -102395 -171697 -63578 181358 122540 -182903
10892a2962B12907N3409b507p9354A86788d29249a5611A98736e5603k49410A06368
$$ -12962 212907 266316 -2507 -81861 186788 -429249 -15611 198736 -55603 -305013 106368
10880a81022F2849a02100q6793j59148B9363e574r1387I5104e4569B23139g3727
$$ -181022 62849 -102100 -188893 -348041 29363 -5574 -96961 95104 -54569 223139 -73727
10868a565B1483a05805J5593k09511f7043j851j14768N8185N4317F8217J39915
$$ -1565 21483 -105805 -90212 -299723 -67043 -68894 -183662 -125477 -71160 68217 208132
10857B08132H3447C2223J14690p0120h5965G1734b19912f976A10882b56689e9128
$$ 208132 83447 32223 146913 76793 -85965 71734 -219912 -6976 110882 -256689 -59128
10845D65L67408a98383D0473a60565B42366I5988f8721A16865L8000o7936B2195
$$ 465 367873 -198383 40473 -160565 242366 95988 -68721 116865 154865 86929 22195
10833a72162h5146j41511A95307a876B13521a26430b0676k80742B63974a04793
$$ -172162 -85146 -226657 195307 -1876 213521 -126430 -20676 -301418 263974 -104793
10822F6604K22311c1092J2090q980I9396D8435c1614j18442k5578B44302a1078
$$ 66604 288915 -31092 -19002 -27982 99396 48435 -31614 -150056 -175634 244302 -11078
10810b5367j13056c3652o9571L5047q4836K7959C70919g6600j10400B92198P3764
$$ -25367 -138423 -33652 -103223 -68176 -153012 -125053 370919 -76600 -187000 292198 365962
10799C65962a72472M7390g947C09684f9879H3649O9225R7172f9595k39746B94271
$$ 365962 -172472 -125082 -7947 309684 -69879 83649 152874 250046 -69595 -309341 294271
10787B65998b68862Q7491a000D5148i8954B9775a3984F1797Q9764m7553Q1418
$$ 265998 -268862 -181371 -1000 45148 -98954 29775 -13984 61797 151561 104008 185426
10776A85426a34200D21162c1629j57957L0052A08857E2583K71684a94972A60766
$$ 185426 -134200 421162 -31629 -189586 -159534 108857 52583 324267 -194972 160766
10765d35306D183J9773c40588B12019b48488A10295m9668b0681G3227a29733F003
$$ -435306 4183 23956 -340588 212019 -248488 110295 60627 -20681 73227 -129733 6003
10753F772J48590B9798R7608b6405j58635m8245h2079L6175G5795a73113k7493
$$ 6772 155362 29798 127406 -26405 -185040 -233285 -82079 -45904 75795 -173113 -200606
10742b00606B16350a88851o9415F6996j4689h2480A83506C0427c80219g3825C298
$$ -200606 216350 -188851 -258266 66996 52307 -82480 183506 30427 -380219 -73825 3298
10730d69796B09159E741a13481A50285a94305A23282D8328b43685A33743i5796
$$ -469796 209159 5741 -113481 150285 -194305 123282 48328 -243685 133743 -95796
10719F9064a02018q0555A23910P1651I4168a18662F1526h9340D115O2455b4121
$$ 69064 -102018 -182573 123910 195561 94168 -118662 61526 -89340 4115 66570 -24121
10707c70125B2714b18541j56116A48448a78527A36443J0995b4485k07516Q8117
$$ -370125 22714 -218541 -374657 148448 -178527 136443 147438 -24485 -232001 -143884
10697a43884I9990d262k36995Q9403D3958Q4796h8592k58802B06595b12855Q7794
$$ -143884 99990 -4262 -241257 -151854 43958 128754 -88592 -347394 206595 -212855 -125061
10686a25061A29536a1401A2402b30831j9336d4030I2837a32681G3974c6452A7440
$$ -125061 129536 -11401 12402 -230831 -250167 -44030 92837 -132681 73974 -36452 17440
10674B16895a53525b4535p9215E55907e1335j92449g5936K4333B8135g9463K8310
$$ 216895 -153525 -24535 -103750 555907 -51335 -243784 -75936 -51603 28135 -79463 -51153
10663e1153j60581N8569B9221L8488a81091e3751A669J03610J5642R551h6508
$$ -51153 -211734 -153165 29221 67709 -181091 -53751 1669 105279 120921 130472 -86508
10651b1971k66249g9491o8622N3138k05688J41434G9293a223k46148a10239H1287
$$ -21971 -288220 -79491 -148113 -94975 -300663 -159229 79293 -1223 -247371 -110239 81287
10639b77800c723j09258l3580A20223m2661e7399p6475F0856a13111j12778e6557
$$ -277800 -3723 -112981 -146561 120223 77562 -57399 -133874 60856 -113111 -225889 -56557
10627e46681a18283A7614K3900Q3783b86089C21257g8068j51311D6467M9609K6488
$$ -546681 -118283 17614 41514 125297 -286089 321257 -78068 -229379 46467 96076 122564
10616A22564a27413E3217J2783M9932J46160j11312a92316A80112b8704q9481
$$ 122564 -127413 53217 66000 115932 262092 150780 -192316 180112 -28704 -118185
10606a18185B00133a71703H0068d09362a59932B11585a27386l79109J25620D20821
$$ -118185 200133 -171703 80068 -409362 -159932 211585 -127386 -506495 -380875 420821
10595H616e8317j63279b6368D27113g2378F9645D85N0437P4750F467c21911a33727
$$ 8616 -58317 -221596 -26368 427113 -72378 69645 485 50922 125672 6467 -321911 -133727
10582A79517a95683B52496I9699a7383j09934A05499a13471A57634b5673m9111
$$ 179517 -195683 252496 99699 -17383 -127317 105499 -113471 157634 -25673 -74784
10572g4784q2291j34615n8708B12951d3147k43498i4713E9832B4157a75193g0009
$$ -74784 -157075 -291690 -350398 212951 -43147 -286645 -94713 59832 24157 -175193 -70009
10560h4904D023b796k23359A41330j0943b25122A57048b19009P7779A6481Q5370
$$ -84904 4023 -2796 -226155 141330 130387 -225122 157048 -219009 -141230 16481 101851
10549A01851f8407j22378g3958i866j01820I6567L7527b7146A20551b43243a0011
$$ 101851 -68407 -190785 -73958 -9866 -111686 96567 134094 -27146 120551 -243243 -10011
10537b95414a32886f1118D4922a255m20197J57945i9384b1085A23369P9582b16663
$$ -295414 -132886 -61118 44922 -1255 -421452 -263507 -99384 -21085 123369 202951 -216663
10525d7598j60148l8580i1288j0074j80161n1376h2272B47537H6124a25895A09385
$$ -47598 -207746 -246326 -91288 -101362 -281523 -332899 -82272 247537 86124 -125895 109385
10513b21841A84489c7221B71345G149a6892A18149a50654A53036b69071C9143
$$ -221841 184489 -37221 271345 7149 -16892 118149 -150654 153036 -269071 39143
10502b94442A24319R3738E6184a60894N4728c8704k7298j1587L6687A17125a35383
$$ -294442 124319 218057 56184 -160894 -106166 -38704 -66002 -77589 -40902 117125 -135383
10490A6097M8524J21008d3727C3402a75298N8343C46667j63597M06086B43026
$$ 16097 64621 185629 -43727 33402 -175298 -116955 346667 183070 589156 243026
10479C34384J39582j89403d55042B65582A586c0585j6832E1510J60638b58770
$$ 334384 473966 284563 -455042 265582 1586 -30585 -47417 51510 212148 -258770
10468a87855f8642n945j46198I7690p691a72198g6383C54787b05059B10357c1642
$$ -187855 -68642 -74587 -220785 97690 89999 -172198 -76383 354787 -205059 210357 -31642
10456b73764E0278b31448A69152b47839i5080A44362f2813A53592J58Q502a45826
$$ -273764 50278 -231448 169152 -247839 -95080 144362 -62813 153592 153750 162252 -145826
10444B596a79769L0836L2922M2306j27815B30671a17354K9657m132F0582N3499
$$ 2596 -179769 -148933 -116011 -73705 -201520 230671 -117354 -87697 -91829 60582 114081
10433A14081a14794L3912L9358j94608B778J425f7090A15185J14041A2971E037
$$ 114081 -114794 -80882 -41524 -236132 2778 4203 -67090 115185 229226 12971 5037
10421B24167K89258i8598A93206a50705Q552J9059N138A45450J82905I4269K39914
$$ 224167 513425 -98598 193206 -150705 -142153 -123094 -117956 145450 328355 94269 334183
10410C34183f8267A88693e8823j3971A60561m8478E2733b40716C2139a01615j11326
$$ 334183 -68267 188693 -58823 -72794 160561 112083 52733 -240716 32139 -101615 -212941
10399b12941A8151o405J59357A7429L5373L01347I4161e3097G3654h6152l8530
$$ -212941 18151 11746 171103 17429 52802 354149 94161 -53097 73654 -86152 -124682
10388a24682c3356E9752P9016K7683L1754q7840k39K53865J51823G6271O8662
$$ -124682 -33356 59752 138768 166451 198205 110365 110126 363991 515814 76271 144933
10377A44933J8908Q747J55535H7974K72504A20810J73784J54172j99086J64816
$$ 144933 163841 172588 328123 87974 360478 120810 294594 448766 249680 414496
10367D14496N5979I5047L61950L4899r1608j17570I2037J72718o3751I6500O1668
$$ 414496 470475 95047 456997 491896 400288 282718 92037 264755 201004 96500 158168
10356A58168d4649A63259M8833J901J38480L51103l02892J61323j9544P142j45685
$$ 158168 -44649 163259 212092 213993 352473 703576 400684 562007 542463 549605 403920
10345D03920A78328M49469A70161K50334j40253A30617a88334h2522c6241k6025
$$ 403920 178328 627797 170161 420495 280242 130617 -188334 -82522 -36241 -62266
10335f2266E7704M2810R9260K38513H8217M4577a9520B94499a51267G9700J26844
$$ -62266 57704 100514 199774 438287 88217 132794 -19520 294499 -151267 79700 206544
10324B06544r5211L0132g4956H7418g5091A55761J76083b1129C1423L284N3399
$$ 206544 111333 141465 -74956 87418 -75091 155761 331844 -21129 31423 34707 88106
10313H8106K15627b08359G977g3011L1411j49357K9772g7723B34560h6237I9449
$$ 88106 303733 -208359 7977 -73011 -41600 -190957 -161185 -77723 234560 -86237 99449
10301B1228e3305A95425G0945a62911A59282a40778A61224N4958a11251M7987
$$ 21228 -53305 195425 70945 -162911 159282 -140778 161224 216182 -111251 -63264
10291f3264I6665a20369O0085A20036d3771m9579D8073J4081a38651J4532B47307
$$ -63264 96665 -120369 -60284 120036 -43771 -93350 48073 62154 -138651 -124119 247307
10279A08665E493a48672J916O882n678f3036f052F9351a15605j6321C0893K80083
$$ 108665 5493 -148672 -146756 -139874 -145552 -63036 -6052 69351 -115605 -131926 30893 310976
10267C10976b43508e813I0502J48399c6932A55129r310J19808r7363m4865J45064
$$ 310976 -243508 -5813 90502 238901 -36932 155129 145819 265627 168264 123399 268463
10256B68463I7242a04004C2257R9188n8287J5754c24250J18992c0602m6475G260
$$ 268463 97242 -104004 32257 131445 73158 88912 -324250 -205258 -30602 -77077 7260
10244i0113d0825a5325j7887q4282q1575P2821A67335c89052f1378o191k00314
$$ -90113 -40825 -15325 -33212 -117494 -199069 -126248 167335 -389052 -61378 -67569 -267883
10233b67883A3126f267k07101a2147D1320d5253k41872H9916b45678B55214e7375
$$ -267883 13126 -6267 -213368 -12147 41320 -45253 -287125 89916 -245678 255214 -57375
10221A51093b891A61519l5839F219L62677q7707a75066M5258H1480a35090j15296
$$ 151093 -2891 161519 125680 6219 368896 281189 -175066 -129808 81480 -135090 -250386
10210b50386j8526A3458J13747c75125a47247j1710a3962B25239b05697i8362
$$ -250386 -268912 13458 127205 -375125 -147247 -158957 -13962 225239 -205697 -98362
10199a59663r5778J18126M8499b1162k77382B23095a77093A03172g8426I4496
$$ -159663 -255441 -137315 -88816 -21162 -298544 223095 -177093 103172 -78426 94496
10188f3219K4307Q957k28651d0414a2051E4111N179f8507R616H271d1424l27722
$$ -63219 -38912 -29955 -258606 -40414 -12051 54111 59290 -68507 -58891 8271 -41424 -369146
10176c69146C2676a04677F8064k2894a09086o108b7288A24146P5380d889r6060
$$ -369146 32676 -104677 68064 45170 -109086 -115194 -27288 124146 199526 -4889 -100949
10165a00949l7181p0694N8268k57267O4122a65488M8237c3288h605k5629B46643
$$ -100949 -138130 -208824 -150556 -407823 -343701 -165488 -117251 -33288 -8605 -34234 246643
10153a51577M6811j53681J3239g4468j11114O941b4618k29718A8329a44149D2490
$$ -151577 -104766 -258447 -245208 -74468 -185582 -178641 -24618 -254336 18329 -144149 42490
10141a01372k00891B51085a05887E8333m537c4873G8293P7014b1083o8970K0197
$$ -101372 -302263 251085 -105887 58333 53796 -34873 78293 155307 -21083 -90053 -69856
10130f9856C3025d5860J7079n90995D5366b12057D1663b28661b4582l8712D6074
$$ -69856 33025 -45860 -28781 -619776 45366 -212057 41663 -228661 -24582 -63294 46074
10118a94756j43080a64811g1931N217q3699b7994L263k5658j7789F5885c4994
$$ -194756 -337836 -164811 -71931 -66714 -150413 -27994 -24731 -50389 -68178 65885 -34994
10106B86389g198E8298K65803I7275a40541A8108J68803a58604B31833b66438
$$ 286389 -7198 58298 324101 97275 -140541 18108 186911 -158604 231833 -266438
10095I494a70913A67155D0239d22205J78047C4742J62712b82559C1291a94623
$$ 9494 -170913 167155 40239 -422205 -244158 34742 197454 -282559 31291 -194623
10084b54558a9721n4802A81409q1344K47227D5607J43014I0796i2800G8957b99858
$$ -254558 -19721 -74523 181409 100065 347292 45607 188621 90796 -92800 78957 -299858
10072c0649k88423j04384Q3513M5272J24814k9561Q1952A57357b7160j57813G8049
$$ -30649 -319072 -423456 -339943 -294671 -169857 -199418 -117466 157357 -27160 -184973 78049
10060e6832J7754A88625A9130J24483A8605b21022B19035h5437l5138b2088p5688
$$ -56832 -39078 188625 19130 143613 18605 -221022 219035 -85437 -120575 -22088 -97776
10049i7776A94758f0603j26674G8416c4523A57139a36704C51218g1987k65923
$$ -97776 194758 -60603 -187277 78416 -34523 157139 -136704 351218 -71987 -337910
10039c37910a43500E834Q07c60319D3587a58795g1877j08237q2330K0025J16934
$$ -337910 -143500 5834 6641 -360319 43587 -158795 -71877 -180114 -262444 -242419 -125485
10028a25485A59517D8421P7939L9256c62609L5859F7431J7960N1499b86806l9854
$$ -125485 159517 48421 126360 165616 -362609 -326750 67431 85391 136890 -286806 -326660
10017c26660C5929b05131B17525q9123m5025a55894n3935A07355a61476A27495
$$ -326660 35929 -205131 217525 128402 83377 -155894 -209829 107355 -161476 127495
10006E4338a56933f4843k12623J8886P1952M6221m8179E05436a60041j1434N6547
$$ 54338 -156933 -64843 -277466 -258580 -186628 -140407 -188586 505436 -160041 -171475 -114928
9995a14928A24377a63876p9527M8025L5414G4587b14570a4112j19089D5104J36037
$$ -114928 124377 -163876 -243403 -195378 -159964 74587 -214570 -14112 -133201 45104 181141
9984A81141a6377m01280d6853k55615f5065B35846a19175A53590a70960G1426
$$ 181141 -16377 -417657 -46853 -302468 -65065 235846 -119175 153590 -170960 71426
9973A30523b02304l469j732h1219b9998C00757b81959a39337C323pb43115A39548
$$ 130523 -202304 -205773 -207505 -81219 -29998 300757 -281959 -139337 3323 3316 -243115 139548
9960a63103D7725c55384A14430g3867G174a86043d840j76449k0293A5015c67239
$$ -163103 47725 -355384 114430 -73867 7174 -186043 -4840 -181289 -201582 15015 -367239
9948A29826a82951r7217A11285e3966p077b2070q6194m7960f5289q2969c1393
$$ 129826 -182951 -280168 111285 -53966 -61043 -22070 -108264 -156224 -65289 -148258 -31393
9936a51581d4114D4785a74443h0795r0769g2370l08455B45367a98374G2922b19527
$$ -151581 -44114 44785 -174443 -80795 -171564 -72370 -380825 245367 -198374 72922 -219527
9924a14205c671k15440c7315j85103b4455F7630M3897J46267e5074J0878m1378
$$ -114205 -3671 -219111 -37315 -222418 -24455 67630 111527 257794 -55074 -44196 -85574
9913h5574K0391G7575J65828a52648B19374b36665j58061h4306p3542m8468F0210
$$ -85574 -65183 77575 243403 -152648 219374 -236665 -394726 -84306 -157848 -206316 60210
9901c48580H7831A3608a44724A16385a11426I8151l6037e6542k60169D1543c9991
$$ -348580 87831 13608 -144724 116385 -111426 98151 62114 -56542 -316711 41543 -39991
9889G5130d5545k9539A07108a08923A28587a19543q328M4114B32146b1662F0018
$$ 75130 -45545 -75084 107108 -108923 128587 -119543 -127871 -83757 232146 -21662 60018
9877b00242J7390C3502c6n6275B96085A5854a38122k5274c3889j23727A97832
$$ -200242 -182852 33502 -36 -56311 296085 15854 -138122 -163396 -33889 -157616 197832
9865a62202A33435B935e9087r3177k83421a47344l4093f5810m0816K1094P569
$$ -162202 133435 2935 -59087 -152264 -435685 -147344 -181437 -65810 -106626 -85532 -77963
9854g7963k74323J02647R1045d791r6794r8033C09231d80522f1794H2469L17646
$$ -77963 -352286 -249639 -158594 -4791 -101585 -199618 309231 -480522 -61794 82469 400115
9843D00115c86293J18185b7511j66846A3664a81025e3479o5213K2986E5179b84466
$$ 400115 -386293 -268108 -27511 -194357 13664 -181025 -53479 -118692 -95706 55179 -284466
9831f5131q4568K3580N8661j22795I874b23323g3706L5220j79491R9706j2066
$$ -65131 -149699 -126119 -67458 -190253 9874 -223323 -73706 -38486 -217977 -118271 -130337
9820a30337A21828C5062M8499k8451g4947B5580h4783A24851B8683a8053F8494
$$ -130337 121828 35062 83561 55110 -74947 25580 -84783 124851 28683 -18053 68494
9808H2199i7061A62917e3404j91373A8526P7598j7999a5302l49822J55950h8887
$$ 82199 -97061 162917 -53404 -244777 18526 96124 78125 -15302 -365124 -209174 -88887
9796G7256b1952C37843I2921E174R5366g9170G717R4174b00070N3799D8981e4745
$$ 77256 -21952 337843 92921 5174 100540 -79170 7717 101891 -200070 -146271 48981 -54745
9783a64507A12062Q5609D4468J3800b19140M7618f6446J3822E6456h3048l869
$$ -164507 112062 197671 44468 58268 -219140 -171522 -66446 -52624 56456 -83048 -86917
9772h6917l0624A68305c06424J48666f0343k83206A17023C615a38159B1220a00475
$$ -86917 -117541 168305 -306424 -157758 -60343 -343549 117023 3615 -138159 21220 -100475
9760C04308a04507j28563h1270f77r2022M035B7503E564a02602J9366j54579f9743
$$ 304308 -104507 -233070 -81270 -677 -92699 -88664 27503 5564 -102602 -83236 -237815 -69743
9747A60516c12527D2043e8172k121A81438h1838j34853i8472A02360a65857k01379
$$ 160516 -312527 42043 -58172 -60293 181438 -81838 -216691 -98472 102360 -165857 -367236
9736c67236j7285a3979q0298j47128O03l7095B55470j4233f5627J108a663k93819
$$ -367236 -384521 -13979 -94277 -241405 -240802 -277897 255470 241237 -65627 -64519 -1663 -295482
9724b95482R0807B9620L3186h147p4199E0947a34836A5622L7126J16710R2921
$$ -295482 -204675 29620 62806 -8147 -82346 50947 -134836 15622 52748 169458 262379
9713B62379l432A02773a78471b9873j37692j4714L2304F3427f7481P326l4613
$$ 262379 258947 102773 -178471 -29873 -167565 -182279 -149975 63427 -67481 -60155 -94768
9702i4768l2646I4563c35039G6876A4001i323r076m4043k84661L5258c5392k41594
$$ -94768 -127414 94563 -335039 76876 14001 -9323 -18399 -62442 -347103 -311845 -35392 -276986
9690b76986A98057E3862J27358e5392B13591b33444E7413J72887a13172J9461
$$ -276986 198057 53862 181220 -55392 213591 -233444 57413 230300 -113172 -93711
9680i3711j51318C2166J1514K05160e5203C4005L1950a47410e0847k4700b5248
$$ -93711 -245029 32166 43680 248840 -55203 34005 65955 -147410 -50847 -75547 -25248
9668i0467B51752f003A12898c26108J21723r5439A52102c48388R9462L1328B10485
$$ -90467 251752 -6003 112898 -326108 -204385 -299824 152102 -348388 -248926 -217598 210485
9656b8356A17259E7133h3623H5695a48151D3360L052c981r0563k25900A39858
$$ -28356 117259 57133 -83623 85695 -148151 43360 46412 -3981 -94544 -320444 139858
9644F1504a33388E6092d46957A55050c07531F0921R2782c1575A5352a51489k08104
$$ 61504 -133388 56092 -446957 155050 -307531 60921 153703 -31575 15352 -151489 -359593
9633c59593J57224B03900C5106g8905l3985N5190H084J67040H3516J68215b20152
$$ -359593 -202369 203900 35106 -78905 -112890 -57700 8084 175124 83516 251731 -220152
9621a31933j87079j29180a63460C4865a0375m2437A37796C5348a600j7309m7172
$$ -131933 -319012 -448192 -163460 34865 -10375 -52812 137796 35348 -1600 -18909 -66081
9610f6081E9461a63715J3824j0903j44535J21866B40498F112J20830b55278k14735
$$ -66081 59461 -163715 -149891 -160794 -305329 -183463 240498 6112 126942 -255278 -470013
9599d70013e2476k236k13300H0197b06616D9153f5374b9757j29132O7929p0944
$$ -470013 -52476 -54712 -268012 80197 -206616 49153 -65374 -29757 -158889 -90960 -161904
9588a61904D3602a19831K7642A5262K3583K45944E4347h3265G1435a87133G5032
$$ -161904 43602 -119831 -92189 15262 38845 284789 54347 -83265 71435 -187133 75032
9576a77220B82473d19363a63033N9615D9107d3271C00053a84419A36948O0503
$$ -177220 282473 -419363 -163033 -103418 49107 -43271 300053 -184419 136948 197451
9566A97451h111j92046D67384h5195j4494L0337j62900B55928E2002a02187c5312
$$ 197451 -8111 -200157 467384 -85195 -99689 -69352 -232252 255928 52002 -102187 -35312
9554h9039J2983k63740a37894m22553F6829k2292M5828i2316C0437c78441B02054
$$ -89039 -76056 -339796 -137894 -560447 66829 44537 90365 -92316 30437 -378441 202054
9542a05654b4784q8513j53545M3757P9659A67105c6428k23944a05018n466E6050
$$ -105654 -24784 -113297 -266842 -223085 -143426 167105 -36428 -260372 -105018 -110484 56050
9530a78281r0168H5888a46978b0868B31132D346N1369h7086m0638q4093O1405
$$ -178281 -268449 85888 -146978 -20868 231132 4346 55715 -87086 -127724 -211817 -150412
9519a50412B14300d92465b8814B8591c06221a0047l76629A49355b30496J00108
$$ -150412 214300 -492465 -28814 28591 -306221 -10047 -386676 149355 -230496 -130388
9509a30388a8960R433r9810K6409r2687Q5930k70896H350a64404g3424A44513
$$ -130388 -18960 -9527 -109337 -82928 -175615 -89685 -360581 8350 -164404 -73424 144513
9497B26077c02336A61540a22290o2212C64811D2814f2179a2626k04314e2654l67872
$$ 226077 -302336 161540 -122290 -184502 364811 42814 -62179 -12626 -216940 -52654 -420526
9486d20526D68698i8331k54817G4253a25637B69484g3070o8107j46553n9242J52043
$$ -420526 468698 -98331 -353148 74253 -125637 269484 -73070 -141177 -287730 -346972 -194929
9475a94929I7578i6298E4229a13557e2354P38p6109A04042a13989o7135J7667
$$ -194929 97578 -96298 54229 -113557 -52354 -51616 -127725 104042 -113989 -181124 -163457
9464a63457l4751g1560B5150J30897b45774B08152g8940F5466f7610p792A17963
$$ -163457 -198208 -71560 25150 156047 -245774 208152 -78940 65466 -67610 -75402 117963
9452a4627A37488f5233l37021a45759c0351j72697A82784a85060k55747h0540
$$ -14627 137488 -65233 -402254 -145759 -30351 -203048 182784 -185060 -440807 -80540
9441A06767b21740O6805f5524h319D3926J16039B1723a74659A20731a11013c6118
$$ 106767 -221740 -154935 -65524 -8319 43926 159965 21723 -174659 120731 -111013 -36118
9429b16503J04277D3318i5375E4143c11001J42185N6849A89989b97593a1077o9020
$$ -216503 -112226 43318 -95375 54143 -311001 -168816 -111967 189989 -297593 -11077 -80097
9418h0097b5759A34121p225a43546I4252b91712J32884A47857a12923l5405j0096
$$ -80097 -25759 134121 126896 -143546 94252 -291712 -158828 147857 -112923 -148328 -158424
9407a58424B4027Q3578c98001E9726e8456k40672M1241L9976B55420H6231J33912
$$ -158424 24027 107605 -398001 59726 -58456 -299128 -257887 -217911 255420 86231 220143
9396B20143j9430q8718f8632N179J0171A97736R9204b45093d2D874a32697n6826
$$ 220143 200713 111995 -68632 -63453 -53282 197736 296940 -245093 -42 4874 -132697 -189523
9384a89523j47319C84588A77605d6283H4429a94378A4555c0120j18735E021Q0893
$$ -189523 -336842 384588 177605 -46283 84429 -194378 14555 -30120 -148855 5021 85914
9373H5914a12578k05337C6446a59250N2708D697K97356B0860a4622A07033d77351
$$ 85914 -112578 -317915 36446 -159250 -106542 4697 302053 20860 -14622 107033 -477351
9361a92937P5803l72626A36238A9916a01855a7785B30012a81405D00604E5879
$$ -192937 -117134 -489760 136238 19916 -101855 -17785 230012 -181405 400604 55879
9350c26731J52796c8966b52G5273O9420C1123M5122F069c6513A90426O3112p4875
$$ -326731 -173935 -38966 -252 75273 144693 31123 76245 6069 -36513 190426 253538 178663
9338A78663h8895B7045b58651B39771g7879R099j88646a09800A8447h9826p9256
$$ 178663 -88895 27045 -258651 239771 -77879 -68780 -257426 -109800 18447 -89826 -169082
9327a69082l7897A14920a40948Q923A8657R4373b72500a30722O4617k08987H9480
$$ -169082 -206979 114920 -140948 -132025 18657 113030 -272500 -130722 -66105 -275092 89480
9315G0572p049b92875R1603G1834a30412N9503l49670J70131j148a23140k71520
$$ 70572 63523 -292875 -201272 71834 -130412 -70909 -420579 -250448 -251596 -123140 -394660
9304c94660f8401A30691B2603a77539g1331j60375l9257a31050j8063g600A82505
$$ -394660 -68401 130691 22603 -177539 -71331 -231706 -270963 -131050 -149113 -7600 182505
9292G0272a0700A25713i0253D7576c19585C1336b90205a08303B8059K9631a56429
$$ 70272 -10700 125713 -90253 47576 -319585 31336 -290205 -108303 28059 57690 -156429
9280A89568a53751N0313j2867k38240C8592J52048h6443K3322e746m2758p711
$$ 189568 -153751 -103438 -116305 -354545 38592 190640 -86443 -63121 -5746 -48504 -56215
9269e6215G8376a5360k04423j2316C4346K25432B9243b34966B9604c16895J45854
$$ -56215 78376 -15360 -219783 -232099 34346 259778 29243 -234966 29604 -316895 -171041
9258a71041F0934J0091O7868N2808G9474a6535A16969c99524f6093K3236h022
$$ -171041 60934 71025 138893 191701 79474 -16535 116969 -399524 -66093 -42857 -8022
9246G0781b18768N3200L4840A87619K05865b61529c7524a728q8132d3933f583
$$ 70781 -218768 -165568 -130728 187619 393484 -261529 -37524 -1728 -89860 -43933 -6583
9234a66688D533A563L33682a61966e1869j62261A11463b18600E3243a29636A03448
$$ -166688 4533 1563 335245 -161966 -51869 -214130 111463 -218600 53243 -129636 103448
9222c05830B7506J13099j4899J51904c01309B3606c54543A07325h3688r1381A32018
$$ -305830 27506 140605 125706 277610 -301309 23606 -354543 107325 -83688 -175069 132018
9210b46918H7110O5708j026c96089d53j19276d6626B816d34291A02647p727A1717
$$ -246918 87110 152818 151792 -396089 -453 -119729 -46626 2816 -434291 102647 94920 11717
9197a10109j15072J9729B17b34461B2558r310P9873R057P5312e5527j53804Q4215
$$ -110109 -225181 -205452 217 -234461 22558 13248 93121 102178 177490 -55527 -209331 -125116
9185a25116c3343J1249A44702a0193j29068N3110A53854J87309M494A02643b42070
$$ -125116 -33343 -22094 144702 -10193 -139261 -86151 153854 341163 345657 102643 -242070
9173A63228a99231R5393A23313J6616c19136a45579k2193O9419F4941a37540a9271
$$ 163228 -199231 -103838 123313 139929 -319136 -145579 -167772 -98353 64941 -137540 -19271
9161b08447D0486b06024g2329l0524A0469L8542J43284p9241i1448A07788c49449
$$ -208447 40486 -206024 -72329 -102853 10469 49011 192295 113054 -91448 107788 -349449
9149I9290L06135D728g0693F7919C305a05846p0363O7390A72509c03136A08110
$$ 99290 405425 4728 -70693 67919 3305 -105846 -176209 -108819 172509 -303136 108110
9137d8556A595J99092a55658c8124l15899A99926b69512a6852k05543D966a51588
$$ -48556 1595 200687 -155658 -38124 -354023 199926 -269512 -16852 -222395 4966 -151588
9125b39335Q771P996g6398B54900F4878h8170A03701b65550J4839J10602E9492
$$ -239335 -230564 -222568 -76398 254900 64878 -88170 103701 -265550 -250711 -140109 59492
9113a8648H6162b84974O6357A03290J08504b33500A52654J16019a64363N2227
$$ -18648 86162 -284974 -218617 103290 211794 -233500 152654 268673 -164363 -112136
9103a12136m2052J8442j38394C6984a50525O0102E5006a08154A58618P344g2029
$$ -112136 -154188 -135746 -274140 36984 -150525 -90423 55006 -108154 158618 165962 -72029
9091c77936J29932A71226a29942A47195e31854B57946b38405K9557b8759D9813
$$ -377936 -248004 171226 -129942 147195 -531854 257946 -238405 -208848 -28759 49813
9080E3650d27672a88803C00908F28e4675j7814J8965A41978o6571b09514B53229
$$ 53650 -427672 -188803 300908 628 -54675 -72489 -53524 141978 75407 -209514 253229
9068g8129r8561k77o4555B55244g9687l2271c4088A8362K24245m3765a97759K3577
$$ -78129 -176690 -176967 -241522 255244 -79687 -111958 -34088 18362 242607 198842 -197759 -174182
9056a74182j13156G6680A5352K4501c11853f6761G5955j0860e0956q9498j8439
$$ -174182 -287338 76680 15352 39853 -311853 -66761 75955 65095 -50956 -140454 -158893
9045a58893j49696R0293L1147f427l46881Q478L7719A72020F6535R954g1213F7636
$$ -158893 -308589 -218296 -187149 -6427 -353308 -344830 -307111 172020 66535 76489 -71213 67636
9032a12781H407c43579A9657b25284E5637A4711a70828m1591A78702J61809A06819
$$ -112781 8407 -343579 19657 -225284 55637 14711 -170828 -212419 178702 340511 106819
9020E2549a11654M8370A44697a96300f6354A29919j1778D5332a33353M3465A01818
$$ 52549 -111654 -63284 144697 -196300 -66354 129919 118141 45332 -133353 -89888 101818
9008A27011k7761k4186a5042H452J84442a27247P633I5013n196a35954a4669A29108
$$ 127011 99250 75064 -15042 8452 192894 -127247 -119614 95013 89817 -135954 -14669 129108
8995h3506I0391M9391l6631D225b36312a08433o8777O0471A72643q0737C929d13106
$$ -83506 90391 139782 103151 4225 -236312 -108433 -177210 -116739 172643 91906 3929 -413106
8982b68763j31848A977b06800c0879B34109a43087j2812J60j79981F8986b14063
$$ -268763 -400611 1977 -206800 -30879 234109 -143087 -155899 -155739 -335720 68986 -214063
8970B43301b36633E927K17417A06845i3966J3651H8675p072L1803a13201d1920
$$ 243301 -236633 5927 223344 106845 -93966 -80315 88675 81603 113406 -113201 -41920
8958e09188a37826q3574B05332J32680i3807B11731n4014L068m6939a84277c7248
$$ -509188 -137826 -221400 205332 338012 -93807 211731 157717 160785 113846 -184277 -37248
8946a50377f4813A84632P0607b11554K8310c8308r5583b7595o9293j37767i7495
$$ -150377 -64813 184632 255239 -211554 -183244 -38308 -133891 -27595 -96888 -234655 -97495
8934a024k64771H5663a92662C0569q562a36154j19464B40477J90292O6924Q70157
$$ -1024 -265795 85663 -192662 30569 22007 -136154 -255618 240477 430769 497693 1367850
8923A367850K662289Q617861D463093E91011b1150B49702A13806n3302N6939A7721
$$ 1367850 4030139 12648000 4463093 591011 -21150 249702 113806 60504 117443 17721
8912B89056Q8476A9897e1034E42167B45081c21998f0053J0562C4187a5970j92451
$$ 289056 377532 19897 -51034 542167 245081 -321998 -60053 -49491 34187 -15970 -208421
8901b08421k54017a4920C4891E159a8259j32187d1334j61321a9617h189A66042
$$ -208421 -462438 -14920 34891 5159 -18259 -150446 -41334 -202655 -19617 -8189 166042
8889D156a46374H8630c1281k49435Q800i7878D0949L3549a96961h7494J4820j73688
$$ 4156 -146374 88630 -31281 -280716 -271916 -97878 40949 74498 -196961 -87494 -72674 -246362
8877b46362R5835a2927D4545L6196a50141o061j969d1223k29519c5751k41236
$$ -246362 -150527 -12927 44545 80741 -150141 -156202 -158171 -41223 -270742 -35751 -276987
8866b76987a04020K7927k38541P4054D2964f9953K2987J5918k78816B71612b1858
$$ -276987 -104020 -76093 -314634 -240580 42964 -69953 -46966 -31048 -309864 271612 -21858
$$ [...]
##END NTUPLES=NMR SPECTRUM
##END=
