
##TITLE=AC1411_PERAH12220_7653061_aPTsmxzTha
##JCAMPDX= 6.0         $$ Bruker NMR JCAMP-DX V2.0
##DATA TYPE= NMR SPECTRUM
##DATA CLASS= NTUPLES
##ORIGIN= BRUKER
##OWNER= Administrator
$$ 1.72 TOPSPIN		Version 2.1
$$ 2013-03-20 02:17:12.064 -0500  Administrator@X
$$ Compression mode = diff/dup
##.OBSERVE FREQUENCY= 400.02188249412
##.OBSERVE NUCLEUS= ^1H
##.ACQUISITION MODE= SIMULTANEOUS (DQD)
##.ACQUISITION SCHEME= undefined
##.AVERAGES= 8
##.DIGITISER RES= 22
##SPECTROMETER/DATA SYSTEM= spect
##.PULSE SEQUENCE= zg30
##.SOLVENT NAME= COFFEE_meoh
##.SHIFT REFERENCE= INTERNAL, COFFEE_meoh, 1, 14.98509
##AUDIT TRAIL= $$ (NUMBER, WHEN, WHO, WHERE, PROCESS, VERSION, WHAT)
$$ ##TITLE= Audit trail, TOPSPIN		Version 2.1
$$ ##JCAMPDX= 5.01
$$ ##ORIGIN= Bruker BioSpin GmbH
$$ ##OWNER= Administrator
$$ $$ E:\/data/COFFEE/nmr/AC1411_PERAH12220_7653061_aPTsmxzTha/10/pdata/1/auditp.txt
$$ ##AUDIT TRAIL=  $$ (NUMBER, WHEN, WHO, WHERE, PROCESS, VERSION, WHAT)
(   1,<2013-03-20 02:17:03.814 -0500>,<Administrator>,<X>,<go>,<TOPSPIN 2.1>,
      <created by zg
	started at 2013-03-20 02:15:57.392 -0500,
	POWCHK enabled, PULCHK disabled,
       configuration hash MD5:
       86 BA 57 50 F2 9D 5C 9B 26 00 A9 28 5F 66 2E 89
       data hash MD5: 64K
       05 C4 67 77 14 15 33 62 A3 7E DD FA C7 68 5C 65>)
(   2,<2013-03-20 02:17:06.892 -0500>,<Administrator>,<X>,<proc1d>,<TOPSPIN 2.1>,
      <Start of raw data processing
       efp LB = 0 FT_mod = 6 PKNL = 1 PHC0 = 0 PHC1 = 0 SI = 32K 
       data hash MD5: 32K
       39 C7 B8 33 2C F5 C5 C1 3B 3F B8 86 92 FE 60 63>)
(   3,<2013-03-20 02:17:07.376 -0500>,<Administrator>,<X>,<proc1d>,<TOPSPIN 2.1>,
      <pk PHC0 = 99.39331 PHC1 = 0 
       data hash MD5: 32K
       E9 B6 FF C4 1D F9 26 37 52 69 75 88 CA 86 7F 11>)
(   4,<2013-03-20 02:17:07.626 -0500>,<Administrator>,<X>,<proc1d>,<TOPSPIN 2.1>,
      <abs ABSG = 1 
       data hash MD5: 32K
       92 7D 9C A9 CF 5F 21 C7 B5 C0 71 63 26 FC D9 6B>)
(   5,<2013-03-20 02:17:07.767 -0500>,<Administrator>,<X>,<proc1d>,<TOPSPIN 2.1>,
      <abs ABSG = 2 
       data hash MD5: 32K
       3F AF 72 86 16 A5 1D 8A 57 DB 20 5E 02 CB 38 19>)
(   6,<2013-03-20 02:17:07.907 -0500>,<Administrator>,<X>,<proc1d>,<TOPSPIN 2.1>,
      <abs ABSG = 3 
       data hash MD5: 32K
       95 E0 7C BE 62 FD E7 DB 33 DF F4 D0 7C F8 3D 3A>)
(   7,<2013-03-20 02:17:08.064 -0500>,<Administrator>,<X>,<proc1d>,<TOPSPIN 2.1>,
      <abs ABSG = 4 
       data hash MD5: 32K
       FD 02 DB A2 45 3F 91 7E F3 42 6C 80 4C 38 3E 99>)
(   8,<2013-03-20 02:17:08.204 -0500>,<Administrator>,<X>,<proc1d>,<TOPSPIN 2.1>,
      <abs ABSG = 5 
       data hash MD5: 32K
       DD C8 FE EC 3E 43 25 32 CB 50 25 01 7A F2 18 AF>)
$$ ##END=
$$ 
$$ $$ hash MD5
$$ $$ A1 59 AD 3C 59 76 67 99 33 7F F3 21 95 3B 85 23
##$RELAX= 
##$RELAX= 
##$RELAX= 
##$RELAX= 
##$RELAX= 
##$RELAX= 
##$RELAX= 
$$ Bruker specific parameters
$$ --------------------------
##$DU= <E:\>
##$EXPNO= 10
##$NAME= <AC1411_PERAH12220_7653061_aPTsmxzTha>
$$ [...]
##$TP= (0..7)
150 150 150 150 150 150 150 150
##$TP07= 0
##$TPNAME0= <>
##$TPNAME1= <>
##$TPNAME2= <>
##$TPNAME3= <>
##$TPNAME4= <>
##$TPNAME5= <>
##$TPNAME6= <>
##$TPNAME7= <>
##$TPOAL= (0..7)
0.5 0.5 0.5 0.5 0.5 0.5 0.5 0.5
##$TPOFFS= (0..7)
0 0 0 0 0 0 0 0
##$TUNHIN= 0
##$TUNHOUT= 0
##$TUNXOUT= 0
##$USERA1= <user>
##$USERA2= <user>
##$USERA3= <user>
##$USERA4= <user>
##$USERA5= <user>
##$V9= 5
##$VALIST= <valist>
##$VCLIST= <CCCCCCCCCCCCCCC>
##$VD= 0
##$VDLIST= <DDDDDDDDDDDDDDD>
##$VPLIST= <PPPPPPPPPPPPPPP>
##$VTLIST= <TTTTTTTTTTTTTTT>
##$WBST= 2048
##$WBSW= 25
##$XGAIN= (0..3)
0 0 0 0
##$XL= 0
##$YL= 0
##$YMAX_a= 562828
##$YMIN_a= -480781
##$ZGOPTNS= <>
##$ZL1= 120
##$ZL2= 120
##$ZL3= 120
##$ZL4= 120
##$ABSF1= 14.98509
##$ABSF2= -5.573092
##$ABSG= 5
##$ABSL= 3
##$ALPHA= 0
##$AQORDER= 0
##$ASSFAC= 0
##$ASSFACI= 0
##$ASSFACX= 0
##$ASSWID= 0
##$AUNMP= <proc_prof1d_extract_pilot.lims>
##$AXLEFT= 0
##$AXNAME= <>
##$AXNUC= <1H>
##$AXRIGHT= 0
##$AXTYPE= 0
##$AXUNIT= <>
##$AZFE= 0.1
##$AZFW= 0.1
##$BCFW= 0
##$BC_mod= 0
##$BYTORDP= 0
##$COROFFS= 0
##$CY= 15
##$DATMOD= 1
##$DC= 0
##$DFILT= <>
##$DTYPP= 0
##$F1P= 0
##$F2P= 0
##$FCOR= 0.5
##$FTSIZE= 32768
##$FT_mod= 6
##$GAMMA= 0
##$GB= 0
##$INTBC= 1
##$INTSCL= 1
##$ISEN= 128
##$LB= 0
##$LEV0= 0
##$LPBIN= 0
##$MAXI= 10000
##$MC2= 0
##$MEAN= 0
##$ME_mod= 0
##$MI= 0
##$NCOEF= 0
##$NC_proc= -8
##$NLEV= 6
##$NOISF1= 0
##$NOISF2= 0
##$NSP= 0
##$NTH_PI= 0
##$NZP= 0
##$OFFSET= 14.98509
##$PC= 1
##$PHC0= 99.39331
##$PHC1= 0
##$PH_mod= 1
##$PKNL= yes
##$PPARMOD= 0
##$PPDIAG= 0
##$PPIPTYP= 0
##$PPMPNUM= 2147483647
##$PPRESOL= 1
##$PSCAL= 4
##$PSIGN= 0
##$PYNMP= <proc.py>
##$REVERSE= no
##$SF= 400.02
##$SI= 32768
##$SIGF1= 0
##$SIGF2= 0
##$SINO= 400
##$SIOLD= 32768
##$SPECTYP= <>
##$SREGLST= <1H.CDCl3>
##$SSB= 0
##$STSI= 32768
##$STSR= 0
##$SW_p= 8223.68421052631
##$SYMM= 0
##$S_DEV= 0
##$TDeff= 65536
##$TDoff= 0
##$TI= <>
##$TILT= no
##$TM1= 0
##$TM2= 0
##$TOPLEV= 0
##$USERP1= <user>
##$USERP2= <user>
##$USERP3= <user>
##$USERP4= <user>
##$USERP5= <user>
##$WDW= 1
##$XDIM= 32768
##$YMAX_p= 424452256
##$YMIN_p= -757616
##$CURPLOT= <Network HP LaserJet P1505>
##$CURPRIN= <$Network HP LaserJet P1505>
##$DFORMAT= <normdp>
##$LAYOUT= <+/1D_H.xwp>
##$LFORMAT= <normlp>
##$PFORMAT= <normpl>
##$SURQMSG= 1
$$ End of Bruker specific parameters
$$ ---------------------------------
##NTUPLES= NMR SPECTRUM
##VAR_NAME=  FREQUENCY,     SPECTRUM/REAL,   SPECTRUM/IMAG
##SYMBOL=    X,             R,               I
##VAR_TYPE=  INDEPENDENT,   DEPENDENT,       DEPENDENT
##VAR_FORM=  AFFN,          ASDF,            ASDF
##VAR_DIM=   32768,         32768,           32768
##UNITS=     HZ,            ARBITRARY UNITS, ARBITRARY UNITS
##FACTOR=    0.250966925370066, 1,           1
##FIRST=     8223.43324360094, -91099,       38229
##LAST=      0,             28875,           102149
##MIN=       0,             -757616,         0
##MAX=       8223.43324360094, 424452256,    0
$$ Real data points
##PAGE= N=1
##DATA TABLE= (X++(R..R)), XYDATA
$$ [...]
19553b10666B54372C840a07715d7387K1321k08838J06963A28014D9660j2517e1608
$$ -210666 254372 3840 -107715 -47387 -26066 -234904 -127941 128014 49660 37143 -51608
19541f1006B781J08306a85500d5099k11m81149A899b86777J5255J33329j91873
$$ -61006 2781 111087 -185500 -45099 -45310 -526459 1899 -286777 -271522 -138193 -330066
19530c30066A10129h3889l01325A1644J08891d464j22423F1317d6758j67994g4331
$$ -330066 110129 -83889 -385214 11644 120535 -4464 -126887 61317 -46758 -214752 -74331
19518A13702K05785f5822A03739h312A72156F9418J68982f6373l51229a50377
$$ 113702 319487 -65822 103739 -8312 172156 69418 238400 -66373 -417602 -150377
19507b06207a0748j590j11526L1280j66515A46476a22604j78452a9349p7413q4365
$$ -206207 -10748 -12338 -123864 -92584 -259099 146476 -122604 -301056 -19349 -96762 -181127
19496a81127h1619l8022J5903E4053a46302A55117a6484p2500j37131a1802j17184
$$ -181127 -81619 -119641 -103738 54053 -146302 155117 -16484 -88984 -226115 -11802 -128986
19485a28986L4279a1268m62826A8963c17334L4125a12616h849A70563a8500p7990
$$ -128986 -94707 -11268 -474094 18963 -317334 -283209 -112616 -8849 170563 -18500 -96490
19474i6490j28404A77288N8409a22435r7684f2773j52875D54217B4204J9179J64046
$$ -96490 -224894 177288 235697 -122435 -220119 -62773 -215648 454217 24204 43383 207429
19463B07429a72373O984A15675L2412R4070b8131n099j86422B10243g5636A14681
$$ 207429 -172373 -165389 115675 148087 242157 -28131 -33230 -219652 210243 -75636 114681
19451c10678A58889g3956A30549m0332a3030A07425c07779N9731J23813D4070
$$ -310678 158889 -73956 130549 90217 -13030 107425 -307779 -248048 -124235 44070
19440C55145E3312R1387o5268b75207a5580l68760A1350a75126H5635J2536a48553
$$ 355145 53312 144699 79431 -275207 -15580 -384340 11350 -175126 85635 98171 -148553
19428a67085A23325c4733j11328m7526h2585H167K8440J4939A1325c6277E174
$$ -167085 123325 -34733 -146061 -193587 -82585 8167 36607 51546 11325 -36277 5174
19416h7223k7202H8178c6174C04165a14543j4429F91J19946c68727i8007o8751
$$ -87223 -114425 88178 -36174 304165 -114543 -128972 691 120637 -368727 -98007 -166758
19405a66758A89025a2051p4453b6213A90475B7732a2764p5131j65226A45225l0827
$$ -166758 189025 -12051 -86504 -26213 190475 27732 -12764 -87895 -253121 145225 114398
19394A14398a54349r3707Q3486A12423J802J13835f6712j41285K5831N7344k22252
$$ 114398 -154349 -248056 -164570 112423 114225 228060 -66712 -207997 -182166 -124822 -347074
19383c47074a54338e0119j36550R0377B78617a7204j8656j11110a8070k64114
$$ -347074 -154338 -50119 -186669 -96292 278617 -17204 -35860 -146970 -18070 -282184
19373b82184A21814a04046C95705A77001p2449a856H5913b8243k40515a11631
$$ -282184 121814 -104046 395705 177001 104552 -1856 85913 -28243 -268758 -111631
19362a34374m5445e0552A14535g3954L918j40035J0376L3521C2653b32043A25719
$$ -134374 -179819 -50552 114535 -73954 -70036 -210071 -199695 -166174 32653 -232043 125719
19350b2504A74415d7312j27734A14987P9562b38600C66566b45018j54299a12874
$$ -22504 174415 -47312 -175046 114987 194549 -238600 366566 -245018 -399317 -112874
19339d9393j29830d3028B11807a73875O2531A52895b73006A12587Q2054b5348
$$ -49393 -179223 -43028 211807 -173875 -111344 152895 -273006 112587 194641 -25348
19328a61528D5413L3095O2229c48105c628k12416D6829b07451A88009c5505E8567
$$ -161528 45413 78508 140737 -348105 -3628 -216044 46829 -207451 188009 -35505 58567
19316a33153B91455j22530a98729A1682J6197J270L7415a18446o1890j3334h3599
$$ -133153 291455 168925 -198729 11682 27879 29149 66564 -118446 -180336 -193670 -83599
19304f532m4074l04361A10214K2970R0477a61160A40931m5403J09255e0487j14518
$$ -6532 -50606 -354967 110214 133184 223661 -161160 140931 95528 204783 -50487 -165005
19293a65005j28801F8871f8729K7476j71989h4275c0504A89177f40231h5417B78529
$$ -165005 -293806 68871 -68729 -41253 -213242 -84275 -30504 189177 -640231 -85417 278529
19281d14771b1875q6708B33822b5281j93267j51298a25102B68026g2969H7513
$$ -414771 -21875 -108583 233822 -25281 -218548 -369846 -125102 268026 -72969 87513
19270B50257K0669i8814A02882q764b32108B84849a850j84997A89935L7926g5941
$$ 250257 270926 -98814 102882 94118 -232108 284849 -1850 -186847 189935 227861 -75941
19258h2256A0756a28168A65044b20019B95776b00128D8453a36303A47322c24387
$$ -82256 10756 -128168 165044 -220019 295776 -200128 48453 -136303 147322 -324387
19247a10132C4506a45490a6811m38090a96389h6463k3825A18700J14415a90786
$$ -110132 34506 -145490 -16811 -454901 -196389 -86463 -110288 118700 233115 -190786
19236a31891L6483k92093A00378a47847A14130g1253A84371d51287I4912J43675
$$ -131891 -95408 -387501 100378 -147847 114130 -71253 184371 -451287 94912 238587
19226B38587D646R493N7287A0661a72270I7207i7045G2654d5763a753j24950B7481
$$ 238587 4646 14139 71426 10661 -172270 97207 -97045 72654 -45763 -1753 -126703 27481
19213c31808J62736b5457N061B67247J30848d81510a76240g4119k81677a52216
$$ -331808 -169072 -25457 -20396 267247 398095 -481510 -176240 -74119 -355796 -152216
19202B33047G5569E218a30851c9337G605b187j83742I2694a96331q2723a05784
$$ 233047 75569 5218 -130851 -39337 7605 -2187 -185929 92694 -196331 -279054 -105784
19190c39905I7053h5640j75692P0063e1783l54951a03162c1253k80230c6927E7724
$$ -339905 97053 -85640 -261332 -191269 -51783 -406734 -103162 -31253 -311483 -36927 57724
19178c3734o1036I382N7484c61872a57703m6939a4962k35910a00266C2516M8955
$$ -33734 -94770 9382 66866 -361872 -157703 -204642 -14962 -250872 -100266 32516 81471
19167H1471a75446N9439E8609J49950m7207c706B6494d19727A71179i4676a5927
$$ 81471 -175446 -116007 58609 208559 161352 -3706 26494 -419727 171179 -94676 -15927
19155a01942j83600r7795B44917a27222c3313D05890I7567J0561b06068G9635
$$ -101942 -285542 -383337 244917 -127222 -33313 405890 97567 108128 -206068 79635
19144A55450n2321m2238K28648q3575f8376n4936L3106b0625k24240q176a955
$$ 155450 103129 60891 289539 205964 -68376 -123312 -90206 -20625 -244865 -253041 -1955
19132a19921k1101p771N1677j97603B7422a69A8013h0264C44096a89764R4385
$$ -119921 -141022 -148793 -97116 -294719 27422 -169 18013 -80264 344096 -189764 -95379
19121i5379A01343a38250a7587j56579g9033k06135O7792d9389A78317j5184c6955
$$ -95379 101343 -138250 -17587 -174166 -79033 -285168 -217376 -49389 178317 163133 -36955
19109B0293a51544d4524A793b29089I9701C3112c09652f7524B2389O5188P1266
$$ 20293 -151544 -44524 1793 -229089 99701 33112 -309652 -67524 22389 87577 158843
19098A58843Q387k1263J10344b58246a03701A68452a94255C48639B0609a2864
$$ 158843 167230 145967 256311 -258246 -103701 168452 -194255 348639 20609 -12864
19087C9111i0757B78229c635o6048B3696a27181A09739a60050E3203b28029B30979
$$ 39111 -90757 278229 -3635 -69683 23696 -127181 109739 -160050 53203 -228029 230979
19075c02235g6847j34015j28536B08903l8757H2143c1666l083Q71k6190j18867
$$ -302235 -76847 -210862 -339398 208903 170146 82143 -31666 -34749 -33878 -60068 -178935
19064a78935L7846H9449D3934a64897A23977m7121a49121A1022J69431b8738m168
$$ -178935 -141089 89449 43934 -164897 123977 76856 -149121 11022 180453 -28738 -32906
19053c2906j61826a3970l47610C4529j3827d3183G9873b20964E8634e5473j20420
$$ -32906 -194732 -13970 -361580 34529 20702 -43183 79873 -220964 58634 -55473 -175893
19042a75893o5136F7504g7656C026P169b20079A26148a08541q6643M0645B95541
$$ -175893 -241029 67504 -77656 3026 10195 -220079 126148 -108541 -195184 -154539 295541
19030a55979C21328C5987N0231b88228c0305A52660J9773K19316A45581L4628
$$ -155979 321328 35987 86218 -288228 -30305 152660 172433 391749 145581 180209
19020A80209a09497j2140e1053C65256c25176C06316A09864L450K11681G0909
$$ 180209 -109497 -121637 -51053 365256 -325176 306316 109864 113314 324995 70909
19009g2868k13104h6001a3964j41711j24279a27852j63813e1186j05405a9301
$$ -72868 -285972 -86001 -13964 -155675 -279954 -127852 -291665 -51186 -156591 -19301
18998C1027a63786B1036J4556h7969B43484F1076b78202O9722F7315c13997C36962
$$ 31027 -163786 21036 35592 -87969 243484 61076 -278202 -208480 67315 -313997 336962
18986B9583J85064j07278l8024B1365a8341j99952c721q2789k1576C35868b69711
$$ 29583 214647 107369 69345 21365 -18341 -218293 -3721 -86510 -108086 335868 -269711
18974f516l00081F3832N5587a86472M3624C35961A8698J80963C0284a7185j94315
$$ -6516 -306597 63832 119419 -186472 -142848 335961 18698 199661 30284 -17185 -211500
18963b11500g8661H7966e1150A94018b811j54973A15683i3284K6520A0205R0845
$$ -211500 -78661 87966 -51150 194018 -2811 -157784 115683 -93284 -66764 10205 101050
18952A01050M0614b16624Q2622J10B40279C9891i376A13639c07728B29471b9183
$$ 101050 141664 -216624 -134002 -133892 240279 39891 -9376 113639 -307728 229471 -29183
18940A00902A0244c1562n2061q3497a554k7543l71087a68640e6556A10283P7782
$$ 100902 10244 -31562 -83623 -167120 -1554 -29097 -400184 -168640 -56556 110283 188065
18929A88065b11005A87859a26502K4484l8299d5209l7340A83801c04633L0580
$$ 188065 -211005 187859 -126502 -102018 -140317 -45209 -82549 183801 -304633 -274053
18919b74053G2992L15026a03558L7743J4842l1069A33664a31828f4239j45145
$$ -274053 72992 388018 -103558 -65815 -50973 -82042 133664 -131828 -64239 -209384
18909b09384q8648a6342I8237a63344E050K3253N9666J96927a06110b7562B10262
$$ -209384 -298032 -16342 98237 -163344 5050 28303 87969 284896 -106110 -27562 210262
18897B93979d2249A4644J02216e846q128m2671Q378l70E7992J47676D0147J40390
$$ 293979 -42249 14644 116860 -5846 -13974 -56645 -48267 -48637 57992 205668 40147 180537
18885A80537l8854K71085a33007j6758A66697g5262l29072H925K58899p6425a39116
$$ 180537 141683 412768 -133007 -149765 166697 -75262 -404334 8925 267824 191399 -139116
18873c02098f0328E1852h1989k8403B02427B4998a58418o357I8976a03920o0935
$$ -302098 -60328 51852 -81989 -110392 202427 24998 -158418 -164775 98976 -103920 -164855
18862a64855j55767K9778r909I7719c278j92312H5054d01393D3603b13017A01001
$$ -164855 -320622 -290844 -300753 97719 -3278 -195590 85054 -401393 43603 -213017 101001
18850B2720a52986j3219A3349b06281j8508p2642J34948D6512b70764A65126b65850
$$ 22720 -152986 -166205 13349 -206281 -224789 -297431 -162483 46512 -270764 165126 -265850
18838a75552C2299b82068O4527l3861B90106a89258B96587F0122c7600k43236
$$ -175552 32299 -282068 -217541 -251402 290106 -189258 296587 60122 -37600 -280836
18828b80836J11329c7746k36992c7014F833h7356p1620p4143E5570a70419A2378
$$ -280836 -169507 -37746 -274738 -37014 6833 -87356 -158976 -233119 55570 -170419 12378
18816B3460b22768H4499J03499d26829A35148J99785b9797B07569J32786D3639
$$ 23460 -222768 84499 187998 -426829 135148 334933 -29797 207569 340355 43639
18805A66215J23253a86174H012d0330A45910b39677A24261a3938j20271O4833
$$ 166215 289468 -186174 8012 -40330 145910 -239677 124261 -13938 -134209 -69376
18795f9376j94491a8383B8916c88341A59528g8335o7689j2234A73036a03061A01824
$$ -69376 -263867 -18383 28916 -388341 159528 -78335 -146024 -158258 173036 -103061 101824
18783A46973K74b39356b5926a1754k02333H5952i5932A49100J11846A25367a7075
$$ 146973 147247 -239356 -25926 -11754 -214087 85952 -95932 149100 260946 125367 -17075
18771G0620i8896A65950h8535J3012j52457L0702j13137K9867B46508a60185o1411
$$ 70620 -98896 165950 -88535 -75523 -227980 -197278 -310415 -280548 246508 -160185 -221596
18760b21596A50098k1225i8198C0459a39555H5759d32262A51438b80604J13024
$$ -221596 150098 128873 -98198 30459 -139555 85759 -432262 151438 -280604 -167580
18750a67580g9726k980K051J7259E6300M3111R6703a77908g4486E240a03914A30982
$$ -167580 -79726 -82706 -80655 -63396 56300 99411 196114 -177908 -74486 5240 -103914 130982
18737A92277N6185e3077A50308a073A03671k0346K08581j01829b61400g5768j30246
$$ 192277 248462 -53077 150308 -1073 103671 83325 291906 190077 -261400 -75768 -206014
18726b06014f2542K2913k35912C35427A8851g8023j7252k61595B17016h6547F3380
$$ -206014 -62542 -39629 -275541 335427 18851 -78023 -95275 -356870 217016 -86547 63380
18714C3144a31221B83449a59740C1574J929j1455g8575a6942O518j19763A69982
$$ 33144 -131221 283449 -159740 31574 33503 22048 -78575 -16942 -10424 -130187 169982
18702b24921o9870B07466h6804j26763L2528a5819E2502P634b00874i7537J2025
$$ -224921 -294791 207466 -86804 -213567 -181039 -15819 52502 60136 -200874 -97537 -85512
18691h5512j50883b9601j06779j08955m9892e3387A7679a14128E8666i0681j01632
$$ -85512 -236395 -29601 -136380 -245335 -295227 -53387 17679 -114128 58666 -90681 -192313
18680a92313b8201B52441J2430E3389a64881B26097a67057I3158d7095F1418k2220
$$ -192313 -28201 252441 264871 53389 -164881 226097 -167057 93158 -47095 61418 39198
18669C9198a67111b9493a4712q1210j71858Q4785c8450B2489L3566b46491h006
$$ 39198 -167111 -29493 -14712 -95922 -267780 -182995 -38450 22489 56055 -246491 -8006
18657c09180P8949I4732e27778C38737a2386A0864h9893A03311K01340p9530e7935
$$ -309180 -230231 94732 -527778 338737 -12386 10864 -89893 103311 304651 225121 -57935
18645H8514L9799b36358j03155A42360B9745Q5489n5338N1421m8432C450a20324
$$ 88514 128313 -236358 -339513 142360 29745 115234 59896 111317 62885 3450 -120324
18633d72177a20376A2110R93a43447j77630c4519q3552j16603o0098a29865p6192
$$ -472177 -120376 12110 13103 -143447 -321077 -34519 -118071 -234674 -294772 -129865 -206057
18622b06057A40042n4119i1924a9835B05263m623n8662m1794a65130j08427G0067
$$ -206057 140042 85923 -91924 -19835 205263 200640 141978 100184 -165130 -273557 70067
18610a78263P0003d9589m5149d520I0532h1045n3327B11056O8915a33307a6815
$$ -178263 -108260 -49589 -94738 -4520 90532 -81045 -134372 211056 279971 -133307 -16815
18598b34869l5733D0482K3266c1184M137o4578K0291B0938a44416a465o8029r3141
$$ -234869 -270602 40482 63748 -31184 -27047 -91625 -71334 20938 -144416 -1465 -69494 -162635
18586a62635q4221G4038L0979K77763B4329b5254i654j42021I7072c45309M6706
$$ -162635 -246856 74038 105017 382780 24329 -25254 -9654 -151675 97072 -345309 -298603
18575b98603H8356a13960M2630j42688l6347P0784B14049F0761b17779j84109
$$ -298603 88356 -113960 -71330 -214018 -250365 -179581 214049 60761 -217779 -401888
18565d01888N1538B93167q6740c4561A17059g8356L973C69740j27160b75526h1021
$$ -401888 -350350 293167 206427 -34561 117059 -78356 -74383 369740 242580 -275526 -81021
18553h8587E5738b02412k67422c5009C336b33121P7349N6102B5600O3874c21629
$$ -88587 55738 -202412 -469834 -35009 3336 -233121 -155772 -99670 25600 89474 -321629
18541D2761P0541h1422A09073a07843m12301a06384j6665C09230Q404H2531k2291
$$ 42761 113302 -81422 109073 -107843 -520144 -106384 -123049 309230 317634 82531 60240
18530F0240b4421A2252b81201B91050a76343A172a70288A2714a06304B09374R0317
$$ 60240 -24421 12252 -281201 291050 -176343 1172 -170288 12714 -106304 209374 299691
18519B99691O6577g1487G390b7234j06145N2557j00855e7722G4740c4377m7219
$$ 299691 366268 -71487 7390 -27234 -133379 -80822 -181677 -57722 74740 -34377 -81596
18508h1596q1519H7334J91642a57684b1003A81973k0167c17351i9143j01871A07829
$$ -81596 -163115 87334 278976 -157684 -21003 181973 161806 -317351 -99143 -201014 107829
18496A9999R7459c06170D86819A20697e6703j51403H8674a80615e7011H9241L3825
$$ 19999 117458 -306170 486819 120697 -56703 -208106 88674 -180615 -57011 89241 123066
18485A23066b6574q9268a1168l23924J13544j1985i3049J3938l4584k22124A22107
$$ 123066 -26574 -115842 -11168 -335092 -221548 -233533 -93049 -79111 -113695 -335819 122107
18473G412L5297J83675a53536A44917B6408b24542a9588j07616I7774A6055a60222
$$ 7412 42709 226384 -153536 144917 26408 -224542 -19588 -127204 97774 16055 -160222
18461g358G986J68351b61093A25902L2908A3212J49013a15592j34063d97m332
$$ -7358 7986 176337 -261093 125902 158810 13212 162225 -115592 -249655 -497 -4829
18450d829C63532a9678k6768j14182d3816q8461J3895c5182j11913K7260j82826
$$ -4829 363532 -19678 -46446 -160628 -43816 -132277 -118382 -35182 -147095 -119835 -302661
18439c02661D130a29430I8446c29706h6042J025A6574J49493a12338j19683d9582
$$ -302661 4130 -129430 98446 -329706 -86042 -85017 16574 166067 -112338 -232021 -49582
18427c5889C3322a09123A81641c74233A01046a03065E9942K22749E1905J37281
$$ -35889 33322 -109123 181641 -374233 101046 -103065 59942 282691 51905 189186
18417A89186F0597i4405J4646H1786J71578A20519b12906A4411a818D617R157
$$ 189186 60597 -94405 -79759 81786 253364 120519 -212906 14411 -1818 4617 13774
18406A3774a11180F3123a720D7078b70714M8872A75866Q0351D1908e8070j53275
$$ 13774 -111180 63123 -1720 47078 -270714 -221842 175866 256217 41908 -58070 -211345
18395b11345n261P0111a2683A2132M8910k1052f7995J1862n3268q828b3300A39858
$$ -211345 -216606 -146495 -12683 12132 61042 39990 -67995 -56133 -109401 -118229 -23300 139858
18382b83598f0326B70214h214j47992H7889J121b60607F5365a5546r7476a9681
$$ -283598 -60326 270214 -8214 -156206 87889 89010 -260607 65365 -15546 -113022 -19681
18370A07777i2247D3621b28591A31319D6401e2551n5532D4242K47857g6754B5238
$$ 107777 -92247 43621 -228591 131319 46401 -52551 -108083 44242 292099 -76754 25238
18358G1950c05078I7335c29513d3424g510j83732l083A43858a82957j3567A8018
$$ 71950 -305078 97335 -329513 -43424 -7510 -191242 -194325 143858 -182957 -196524 18018
18346A17870i7878l5967A52630E0717J3088a40228K7175k28480A71388b38106
$$ 117870 -97878 -133845 152630 50717 63805 -140228 -113053 -341533 171388 -238106
18335C13012b57501Q4414j67812B80648p1152r2700g6724A17764b09753O5235
$$ 313012 -257501 -173087 -340899 280648 209496 116796 -76724 117764 -209753 -144518
18325a44518j69521A78514h691B5033h4895E8169J08318a50052G2099k1253h470
$$ -144518 -314039 178514 -8691 25033 -84895 58169 166487 -150052 72099 50846 -8470
18313d1317B39588C0629J83636C1319R4442h364j80439b9166k30953a25448K3258
$$ -41317 239588 30629 214265 31319 125761 -8364 -188803 -29166 -260119 -125448 -102190
18302a02190k9162d4200C70538a97357h7424A81368d7724n7783D33303a4046B0299
$$ -102190 -131352 -44200 370538 -197357 -87424 181368 -47724 -105507 433303 -14046 20299
18290a04086A71289D1735e8676g972m7365j53942P6308F5306K4191a04669E1588
$$ -104086 171289 41735 -58676 -7972 -55337 -209279 -132971 65306 89497 -104669 51588
18278a56771j49657B5771a36294I7970O714c13486h7611A48368m4437c57660e3888
$$ -156771 -306428 25771 -136294 97970 104684 -313486 -87611 148368 103931 -357660 -53888
18266H4673c94663A45671L6890E4561c39022B58075b98127d5888m4477l3195r9627
$$ 84673 -394663 145671 182561 54561 -339022 258075 -298127 -45888 -90365 -123560 -223187
18255b23187G0318K2786K71502I2003a51246j72292D4298b15967R3911A04839
$$ -223187 70318 93104 364606 92003 -151246 -323538 44298 -215967 -122056 104839
18244D15596c3777N478I3703a95423h5161R193C59742N7393i499I0383B4580a03339
$$ 415596 -33777 -28299 93703 -195423 -85161 -75968 359742 417135 -9499 90383 24580 -103339
18231c8326j69240r252B46706c09309d2854j4629A6275M378h5297j54684l0535
$$ -38326 -207566 -216818 246706 -309309 -42854 -57483 16275 20653 -85297 -239981 -270516
18220b70516a24179q8155i9627D29700c42986F0763J8458a81013M478K3784J3923
$$ -270516 -124179 -212334 -99627 429700 -342986 60763 79221 -181013 -176535 -152751 -138828
18209a38828j26634D6996A7418b7210C595b6331j14659d6082B8313I568b39935
$$ -138828 -265462 46996 17418 -27210 3595 -26331 -140990 -46082 28313 9568 -239935
18197b9021k17326e9150D3948c450j79894N3891A3765a18890l752o5369P5815
$$ -29021 -246347 -59150 43948 -3450 -183344 -129453 13765 -118890 -122642 -188011 -112196
18186a12196C4700d4251C34075j58296a28573F3305J19168a66305A70973b09133
$$ -112196 34700 -44251 334075 175779 -128573 63305 182473 -166305 170973 -209133
18175b99123m5566a49317N9909H3133f8876n0952j85694D5809d48818D297R7818
$$ -299123 -344689 -149317 -89408 83133 -68876 -119828 -305522 45809 -448818 4297 102115
18164A02115a97085C3375d3838A45277a47605A091N6860K67779b47397e2493B0546
$$ 102115 -197085 33375 -43838 145277 -147605 1091 57951 325730 -247397 -52493 20546
18152D1677j5301b67557E1473A255a2750l61191a16303d5085b0996j53720P4656
$$ 41677 26376 -267557 51473 1255 -12750 -373941 -116303 -45085 -20996 -174716 -100060
18141a00060q3504k61791C70777e5108k16520Q0936i3025a5106A22193a40022
$$ -100060 -183564 -445355 370777 -55108 -271628 -190692 -93025 -15106 122193 -140022
18130A00797a8708H2940c65509g5462D02788b62467B07182d0371r8202G1624a40803
$$ 100797 -18708 82940 -365509 -75462 402788 -262467 207182 -40371 -138573 71624 -140803
18118b35440K7599G947M0698b29512A91719H3736b94504d4898B27136A00606K66349
$$ -235440 -207841 7947 48645 -229512 191719 83736 -294504 -44898 227136 100606 366955
18107C66955c29071D2158L7136a23629o5351B9061O0823a86329f6513j84491k8810
$$ 366955 -329071 42158 79294 -123629 -188980 29061 89884 -186329 -66513 -251004 -279814
18096b79814J05285e2959B04432e7288Q650p3889J0657A90528r1079a66155b9136
$$ -279814 -174529 -52959 204432 -57288 -48638 -122527 -111870 190528 99449 -166155 -29136
18084h3457m18019a91293l39584A56251h523m28546A03850b90048a9687B52638
$$ -83457 -501476 -191293 -530877 156251 -8523 -437069 103850 -290048 -19687 252638
18073C9237a89503m4640g4660K584E8659L6158a08827e3202j75295J819i8706
$$ 39237 -189503 -234143 -74660 -72076 58659 94817 -108827 -53202 -228497 -226678 -98706
18061B55584a29052c5669q5007n8505C05612c4087C8661K6029J80672e0102A70646
$$ 255584 -129052 -35669 -120676 -179181 305612 -34087 38661 64690 245362 -50102 170646
18049a38644N4407E3355K51385b22603a3520D1129Q4222a9759C5662f6387j01432
$$ -138644 -84237 53355 304740 -222603 -13520 41129 125351 -19759 35662 -66387 -167819
18038a67819I8033K4103a06929F3661b07783q199m7941J29240C0791a22143J5186
$$ -167819 98033 122136 -106929 63661 -207783 -215982 -263923 -134683 30791 -122143 -106957
18027a06957G0951c00614D7703a62816j04393b4116b099j3888C5709K51307C7605
$$ -106957 70951 -300614 47703 -162816 -267209 -24116 -2099 -15987 35709 287016 37605
18015b47758P5071d0298B79042E1981b31866J09678E1595a74815b7875B78045
$$ -247758 -172687 -40298 279042 51981 -231866 -122188 51595 -174815 -27875 278045
18004h620p6805j4394n218k44591K3083e8451k98282b8582j25084b054j0329m55616
$$ -8620 -85425 -99819 -105037 -349628 -326545 -58451 -356733 -28582 -153666 -2054 -12383 -467999
17992d67999A68381p2717a13512J42D1233J88255h8184M241L2248c606m3511j46079
$$ -467999 168381 95664 -113512 -113370 41233 229488 -88184 -83943 -51695 -3606 -47117 -193196
17980a93196A36354a97644O7201C00251a22555j82556C15466q4763G7475b19423
$$ -193196 136354 -197644 -130443 300251 -122555 -305111 315466 230703 77475 -219423
17969a9792k9235j19704k2694F6564J86461A09776E0861m985R0750N0181o7225
$$ -19792 -49027 -168731 -191425 66564 253025 109776 50861 45876 136626 186807 119582
17958A19582b59645h4600A73623a31660j19297a05690j74891B94253M404I3552
$$ 119582 -259645 -84600 173623 -131660 -250957 -105690 -280581 294253 298657 93552
17947d1327A59945b68137a0332B97754k6906j13784p2707e5028A0118l651a87371
$$ -41327 159945 -268137 -10332 297754 270848 157064 84357 -55028 10118 6467 -187371
17935e81969b08156E0016J49641R9163D9837f5066B5451a38389e0470D93794A3414
$$ -581969 -208156 50016 199657 298820 49837 -65066 25451 -138389 -50470 493794 13414
17923b27051a07937b003A81705q3334l3783R6118p1078a10576c3336j93902A9319
$$ -227051 -107937 -2003 181705 98371 64588 160706 89628 -110576 -33336 -227238 19319
17911C29659e2295j9749l47550b3227l56119E9193J27747b5063o0844A66507a50401
$$ 329659 -52295 -72044 -419594 -23227 -379346 59193 186940 -25063 -85907 166507 -150401
17899C82771j76470c34606B45345O9773d82C842K76846F9886c87327a12690k22423
$$ 382771 206301 -334606 245345 315118 -482 3842 280688 69886 -387327 -112690 -335113
17888c35113f7280I6974K51784a10740M5255a4054A45442a96449g0265j04307
$$ -335113 -67280 96974 348758 -110740 -65485 -14054 145442 -196449 -70265 -174572
17878a74572p4566H4153c49802a19964c4548B8869c8936B55185c63293m8404J49811
$$ -174572 -249138 84153 -349802 -119964 -34548 28869 -38936 255185 -363293 -411697 -261886
17867b61886i457C57133G4577Q6760D6291e1734A18453l6880b28796H5854K9594
$$ -261886 -9457 357133 74577 161337 46291 -51734 118453 81573 -228796 85854 115448
17856A15448a67536m5714B8858J81938c1412j94942j57773a07178o5620c1058
$$ 115448 -167536 -213250 28858 210796 -31412 -226354 -384127 -107178 -172798 -31058
17845D67287a56740A24569J6209c14830f8296j18023d1790j14240f8074C0037
$$ 467287 -156740 124569 140778 -314830 -68296 -186319 -41790 -156030 -68074 30037
17834c72192J85248O5761k4163p305A75852J38892I2417d9384o3760j18844B38184
$$ -372192 -186944 -121183 -145346 -152651 175852 314744 92417 -49384 -113144 -231988 238184
17822A66653b84585h7663b6088A64416D2508a37435A7277c01518a43537A36840
$$ 166653 -284585 -87663 -26088 164416 42508 -137435 17277 -301518 -143537 136840
17811A00357a03444k7358k01691g2432K8056H8198a43004H6551a01869A17969
$$ 100357 -103444 -130802 -332493 -72432 -44376 88198 -143004 86551 -101869 117969
17800a32245D0497P1614c2643B20234a46297A03169J3874f3616D66240d39915
$$ -132245 40497 112111 -32643 220234 -146297 103169 117043 -63616 466240 -439915
17789c09295C04098j07823B8101a12979C22883B0540i4017D7016K94372B5500
$$ -309295 304098 196275 28101 -112979 322883 20540 -94017 47016 341388 25500
17778a59110m9217j3702d4042A6821b26681q6502a54067A14248b2579i474j13345
$$ -159110 -208327 -222029 -44042 16821 -226681 -313183 -154067 114248 -22579 -9474 -122819
17767a22819l4655A10647K7346A8170J06150a33492B03426a10872d9397a4428
$$ -122819 -157474 110647 137993 18170 124320 -133492 203426 -110872 -49397 -14428
17756a27917r0791H2967o750J1108O8914D2339N5874L5108c5409G508a87901E2276
$$ -127917 -218708 82967 76217 87325 156239 42339 98213 133321 -35409 7508 -187901 52276
17743G23J11740a9362m7331C9653a43196k69492c4585F1334G869J21473J07479
$$ 723 112463 -19362 -66693 39653 -143196 -412688 -34585 61334 7869 129342 236821
17732B36821g3709b0147I3466J22243a76893A14159h906A8069c37883O3042D50367
$$ 236821 -73709 -20147 93466 215709 -176893 114159 -8906 18069 -337883 -274841 450367
17720A25545O6576B2845d6734p6103n7749A09621K94067A10873B8396i0451j7784
$$ 125545 192121 22845 -46734 -122837 -180586 109621 403688 110873 28396 -90451 -108235
17709a08235j43913a07313L9523g304k884A17754K35430H4323K4076D7f3481n8366
$$ -108235 -252148 -107313 -67790 -7304 -10188 117754 353184 84323 108399 47 -63481 -121847
17697a21847b5933A06297e7704J7377C25374r181D5400P4926a91983H7027b3313
$$ -121847 -25933 106297 -57704 -40327 325374 316193 45400 120326 -191983 87027 -23313
17685b86160e1020A17255h8646c5508n0935A43002k3910a25418e0487A08180i5133
$$ -286160 -51020 117255 -88646 -35508 -86443 143002 119092 -125418 -50487 108180 -95133
17673A25193L0302L2124a20385e1816a2345B15511a31849A52381A2411L18722
$$ 125193 155495 187619 -120385 -51816 -12345 215511 -131849 152381 12411 331133
17663C31133b8593j26010g5901a0178G8691C6733b86549B57004i5916E433a78614
$$ 331133 -28593 -154603 -75901 -10178 78691 36733 -286549 257004 -95916 5433 -178614
17651c47013A38471J29636b4001G5680L02199a28501A13354a10221A77729F5595
$$ -347013 138471 268107 -24001 75680 377879 -128501 113354 -110221 177729 65595
17640f5248K8810p6899B33401A2714J9795K52649c9900A29336J6275b29102c55
$$ -65248 -36438 -113337 233401 12714 32509 285158 -39900 129336 145611 -229102 -355
17628a06730a4345G4475k7675D107c0711D5681N2767O2437p9109J1905K10718
$$ -106730 -14345 74475 46800 4107 -30711 45681 98448 160885 81776 93681 304399
17617C04399h3434B0595e760A45843g8700A88251R1630a90164B61621B2258J09470
$$ 304399 -83434 20595 -5760 145843 -78700 188251 279881 -190164 261621 22258 131728
17606A31728h163C00934b1588a604B21057a42861I0868R347j3460h2110B53700
$$ 131728 -8163 300934 -21588 -1604 221057 -142861 90868 100215 86755 -82110 253700
17594c9370q5633h172E1639j4808Q4718o356E0912b39186g6574A09857D19a85987
$$ -39370 -125003 -8172 51639 36831 121549 115193 50912 -239186 -76574 109857 419 -185987
17581A49362I102O1606J25538p1627l9975c29127B66835C5140P0443a10807D1648
$$ 149362 9102 70708 196246 124619 84644 -329127 266835 35140 105583 -110807 41648
17569I8467i458j0586l357k85289i9160A74695D433a23375d4095B57323E9424
$$ 98467 -9458 -20044 -23401 -308690 -99160 174695 4433 -123375 -44095 257323 59424
17557H6531k8852J28212J83706h4205C544K91484a31450C15161a74330h5355B46580
$$ 86531 57679 185891 369597 -84205 3544 295028 -131450 315161 -174330 -85355 246580
17545a69729H8389d7444k31213B03410K21876n2168h2263q2960H1125f816j9697
$$ -169729 88389 -47444 -278657 203410 425286 373118 -82263 -165223 81125 -6816 -26513
17534b6513A21162b42163E8048J70117i0430F6371a53560n2526G2089c8142k56415
$$ -26513 121162 -242163 58048 228165 -90430 66371 -153560 -206086 72089 -38142 -294557
17523b94557h3519a7525B88383c24699B60512a51577b8654A75311f6465I0926
$$ -294557 -83519 -17525 288383 -324699 260512 -151577 -28654 175311 -66465 90926
17512C6657c4001B69609J18285I5633j4979Q9079a9702l37251I7587a37007K8841
$$ 36657 -34001 269609 387894 95633 80654 169733 -19702 -356953 97587 -137007 -108166
17501a08166A07918L09009j5144A40112K10173m9406A3468P2857J36168p0784
$$ -108166 107918 416927 401783 140112 350285 300879 13468 86325 222493 151709
17491A51709a23812J5855B00308e6819a3852A88708J54327h8020k8336C26212
$$ 151709 -123812 -107957 200308 -56819 -13852 188708 343035 -88020 -116356 326212
17480b6366Q379j4654A63061Q8427A10870a70186C46769a03635B37509a72202
$$ -26366 -17987 -32641 163061 251488 110870 -170186 346769 -103635 237509 -172202
17469e10842A11556J60824a39748b932C5308Q0273E5171h6629G6111K28845B1901
$$ -510842 111556 272380 -139748 -2932 35308 115581 55171 -86629 76111 304956 21901
17457B28165P6433C4165a7383A37543K33306q3386G3446N0414Q9475n6819j7068
$$ 228165 304598 34165 -17383 137543 370849 287463 73446 123860 213335 156516 139448
17446A39448J58113j21804B3219J85302A4796J66251j5498E8741J85266p8179
$$ 139448 297561 175757 23219 208521 14796 181047 165549 58741 244007 165828
17436A65828O4015H0571Q4682r343d16551A93212E7113L24273a61612A66846g2111
$$ 165828 229843 80571 165253 155910 -416551 193212 57113 381386 -161612 166846 -72111
17424d2979C19408O9486D3350J57298o512i7274B44732J5866P7125j36422J80012
$$ -42979 319408 388894 43350 200648 194136 -97274 244732 260598 337723 201301 381313
17413C81313A30288K50100a41710B87959j33905K60323h7412C7850J74325m5347
$$ 381313 130288 380388 -141710 287959 154054 414377 -87412 37850 212175 166828
17403A66828B024K25526a4132H6352J88250I2322m1106a65867A93208K86729B35882
$$ 166828 2024 227550 -14132 86352 274602 92322 51216 -165867 193208 479937 235882
17391C2708R7097J84981e3329B91369b10225A52447b012B23579R2883j0897r6799
$$ 32708 129805 314786 -53329 291369 -210225 152447 -2012 223579 316462 305565 208766
17380B08766b4527n879B61181c8997C59518R8811I8719K8178J45811c1072B27239
$$ 208766 -24527 -30406 261181 -38997 359518 458329 98719 126897 272708 -31072 227239
17368i1247A02070f3044B16825d1827D5156L62149A92280J80266b07330B8675
$$ -91247 102070 -63044 216825 -41827 45156 407305 192280 372546 -207330 28675
17357B88207K69985a25566I6801l502A4165K19132g2454B7102R9087J00046L2023
$$ 288207 558192 -125566 96801 93299 14165 233297 -72454 27102 126189 226235 258258
17346B58258l8833j06210b56018B4186K64108a38244C8611J88180h9803B13976
$$ 258258 219425 113215 -256018 24186 288294 -138244 38611 226791 -89803 213976
17335B06301A4789a82404c9148A22113M5275J05148j28900J23011e0690H8586
$$ 206301 14789 -182404 -39148 122113 167388 272536 143636 266647 -50690 88586
17324a48040H2221J0087A3851a51956B48614L5374a41515A25241K11052b9081
$$ -148040 82221 92308 13851 -151956 248614 283988 -141515 125241 336293 -29081
17313A13626M3930J29753j9376h4507k724L0541A52625b99297A00547c4528L693
$$ 113626 157556 287309 267933 -84507 -87231 -56690 152625 -299297 100547 -34528 -30835
17302c0835P910j575C03226G1284c0464j87468A93800H4453a89156C03605l3894
$$ -30835 -22925 -24500 303226 71284 -30464 -217932 193800 84453 -189156 303605 269711
17291B69711p0381J1357K42292j83215q042J19439j35231J61321c8747A39392
$$ 269711 199330 210687 452979 269764 261722 381161 245930 407251 -38747 139392
17280C1010J77605R3720I6778a45353A35699O761h1708A53549O5122Q572a63257
$$ 31010 208615 302335 96778 -145353 135699 142460 -81708 153549 218671 227243 -163257
17268C11183p9286E8627r779Q1946a017C41132e505A51713A2441J00210B5600
$$ 311183 231897 58627 48848 130794 -1017 341132 -5505 151713 12441 112651 25600
17256F3781P9108J48868R6664c9354D67079a33137C36156G5355o533e5477A03743
$$ 63781 142889 291757 388421 -39354 467079 -133137 336156 75355 68822 -55477 103743
17244g0202C65445j0619A10242J3435J34021K05388I4646J65610r618b0317A30509
$$ -70202 365445 354826 110242 123677 257698 463086 94646 260256 250638 -20317 130509
17232D24606A27845E6070K31854b7374B24673J15600l584A19855O7497E6782J96539
$$ 424606 127845 56070 287924 -27374 224673 340273 336689 119855 187352 56782 253321
17221B53321m0937o0728k2599O7132J51507j62355P7668K9756F3103i492D45731
$$ 253321 212384 151656 129057 196189 347696 185341 263009 292765 63103 -9492 445731
17209H2337C5737e7966j13458A00278M6527d5848A95790K50327A47328J46332
$$ 82337 35737 -57966 -171424 100278 146805 -45848 195790 446117 147328 293660
17199B93660A03007D0034J11054o2251J24096L2501K11661a73753B18854J8322
$$ 293660 103007 40034 151088 88837 212933 245434 457095 -173753 218854 237176
17189B37176r230b01763B58998n2378I7829p636L2452J54583n4212R0386p5084
$$ 237176 227946 -201763 258998 206620 97829 90193 122645 277228 223016 313402 238318
17178B38318P7224i8349F5154M28332c971G2625P7823a40393B85838n4899k8466
$$ 238318 315542 -98349 65154 493486 -3971 72625 150448 -140393 285838 230939 202473
17167B02473K18181r3468F9360j9476J2333Q6557L07541C5145N5060N0548J85158
$$ 202473 420654 327186 69360 49884 62217 148774 456315 35145 90205 140753 325911
17156C25911p5272q9591O7693r1471K09770j9933G8729C1844K01919L5547J95906
$$ 325911 250639 161048 228741 137270 347040 327107 78729 31844 233763 269310 465216
17145D65216k0728j82492K7581j28051o9071j0644K38201n0240O9012j62535q4964
$$ 465216 444488 261996 289577 161526 92455 81811 320012 269772 338784 176249 91285
17134I1285J42006j9743J13452A42292J94286H7142L19389A05166L34790k01654
$$ 91285 233291 213548 327000 142292 336578 87142 406531 105166 439956 238302
17124B38302J71589A74513J0823K7794L2671K81665k39070D7154Q3149M5357C1188
$$ 238302 409891 174513 185336 213130 245801 527466 288396 47154 130303 175660 31188
17112C96739A76744J89198j77023M61481A79645J03282M09526k71111p1288j023
$$ 396739 176744 365942 188919 650400 179645 282927 692453 421342 350054 349031
17102C49031J29009G2818N25920F0904J50148J82440j21333p0997J53463P3874
$$ 349031 478040 72818 598738 60904 211052 393492 272159 201162 354625 428499
17092D28499L12745B86235J4938K13046j06827j61719m6514J50798j53379N3400
$$ 428499 741244 286235 301173 514219 407392 245673 199159 349957 196578 249978
17082B49978B9945L18106j68968M81488A83675J56751J09617l5755A90045H9166
$$ 249978 29945 348051 179083 660571 183675 340426 450043 414288 190045 89166
17071C47877K6958o2645J01411R0137j12012j30402k5270G4731M20923j39485
$$ 347877 374835 312190 413601 503738 391726 261324 236054 74731 495654 356169
17061C56169o4677k1842K0859r6257q3579J18170K75822A41701K30156L7012J30950
$$ 356169 291492 269650 290509 194252 110673 228843 504665 141701 371857 408869 539819
17050E39819k37837K73636B50828J37724K91244j10089B11819L80067k79996L98352
$$ 539819 301982 575618 250828 388552 679796 569707 211819 591886 311890 710242
17040G10242k76105J2369B15157Q9138L46820k99400r9307M17725C33657M86694
$$ 710242 434137 446506 215157 304295 651115 351715 252408 670133 333657 820351
17030H20351C46385L48893j63496q3464j01177A33855K12679M7849L3446L00676
$$ 820351 346385 695278 531782 448318 347141 133855 346534 394383 427829 728505
17020G28505B32039K71202M9812j7236L7950r2448K04602l26044j36595J43116
$$ 728505 232039 503241 553053 535817 573767 481319 685921 359877 223282 366398
17010C66398K41029j96207L62051j23380o5562J42247l15217J84477o0017n4713
$$ 366398 607427 411220 773271 649891 584329 726576 411359 595836 535819 481106
17000D81106J52096p7458j25790J40142O4715N6230j03757j56692L9061J51987
$$ 481106 633202 555744 429954 570096 634811 691041 587284 430592 469653 621640
16990F21640n0947l1895k573Q7548j35078M22037C45091K17110L01269R070C88136
$$ 621640 570693 538798 536225 623773 488695 910732 345091 562201 863470 872540 388136
16978D59400L23249O7113p5677j23421Q6910J26900l93256J24788o137O1850j39550
$$ 459400 782649 849762 774085 650664 737574 864474 471218 596006 589869 651719 512169
16967E12169N39276k98184k30617J23795M504K11703j65624L2707j22246M72935
$$ 512169 1051445 753261 522644 646439 650943 862646 697022 729729 607483 1080418
16957A080418J00056m20679j22511J94834o162L7008j31107K49379j69900L24239
$$ 1080418 1180474 759795 637284 832118 825956 862964 731857 981236 811336 1135575
16947A135575k70968J1054K18536j40716L37020m42090M2060l27977Q49678n58806
$$ 1135575 864607 875661 1094197 953481 1290501 848411 890471 562494 1412172 853366
16937H53366n049K90147k16061K6995J50869M9607O0719m23130J278j0803J89446
$$ 853366 848317 1138464 922403 949398 1100267 1149874 1210593 787463 788741 777938 967384
16926I67384L37888J090j67751n5382K71388j57644L4907K15492m07857J51910
$$ 967384 1305272 1306362 1138611 1083229 1354617 1196973 1231880 1447372 1039515 1191425
16916A191425j89663l483K01727r5949K2824n6839J6884N4105k47086O70781l43616
$$ 1191425 1001762 998279 1200006 1104057 1126881 1070042 1086926 1141031 893945 1564726 1221110
16905A221110K74698j95002Q9921k62625M08569k43333J29876j20113P3815J70632
$$ 1221110 1495808 1300806 1390727 1128102 1536671 1293338 1423214 1303101 1376916 1547548
16895A547548P3808k47436L1738j12104P7666M93587k90061K05463k63861M7491
$$ 1547548 1621356 1373920 1405658 1293554 1371220 1864807 1574746 1780209 1516348 1563839
16885A563839J29360J31477m01292N99436k90013k60290R3545k94002O38740q8460
$$ 1563839 1693199 1824676 1423384 2022820 1732807 1472517 1566062 1272060 1910800 1822340
16875A822340l27570K67116M04218j69155k8093j35062K70891l2612J45970j32634
$$ 1822340 1494770 1761886 2166104 1996949 1968856 1833794 2104685 2072073 2218043 2085409
16865B085409j18156L05761o1094O3704L22055l23980N247L07805K07628o38032
$$ 2085409 1967253 2273014 2211920 2275624 2597679 2273699 2278946 2586751 2794379 2156347
16855B156347L99302j86532J77404J46844k46400L9833J84328K44605j61755n0301
$$ 2156347 2555649 2369117 2546521 2693365 2446965 2486798 2671126 2915731 2753976 2703675
16845B703675O2346Q9380N30748m82505l05745N16508Q6450k63624J50299m6063
$$ 2703675 2766021 2855401 3386149 2903644 2597899 3114407 3200857 2937233 3087532 3041469
16835C041469K30518p7053M71312m59105K62712M18637k12391J26225j4639L97317
$$ 3041469 3271987 3194934 3666246 3207141 3469853 3888490 3676099 3802324 3787685 4185002
16825D185002n70248L44662r6665M50612N394j33852R432K8232K23464J71159
$$ 4185002 3614754 3959416 3862751 4313363 4318757 4184905 4194337 4222569 4446033 4617192
16815D617192N8675J98039P7468r9648K88574q3553O70788J02623m98110M12278
$$ 4617192 4675867 4873906 4951374 4851726 5140300 5056747 5727535 5830158 5332048 5744326
16805E744326J86669K58182j58533J0074M62968L14597J07625M9691j21417J70701
$$ 5744326 5930995 6189177 6030644 6040718 6503686 6818283 6925908 6975599 6854182 7024883
16795G024883K81600N37743K61660j39554J94562K50550J66884L89370K33971
$$ 7024883 7306483 7844226 8105886 7966332 8160894 8411444 8578328 8967698 9201669
16786I201669p2765N12795M87576N64298j68186L12339O52984R6536M57846P0459
$$ 9201669 9128904 9641699 10129275 10693573 10525387 10837726 11490710 11587246 12045092 12115551
16776A2115551M20225N73635L12317L52056Q64932L67549P83776O0132P67799
$$ 12115551 12535776 13109411 13421728 13773784 14638716 15006265 15790041 15850173 16617972
16767A6617972K17009R44738Q30580O07108P84389M49673R30097J203065J021779
$$ 16617972 16834981 17779719 18610299 19217407 20001796 20451469 21381566 22584631 23606410
16758B3606410P81271J303145R84352J050029J415735J346229J305229K067080
$$ 23606410 24387681 25690826 26675178 27725207 29140942 30487171 31792400 33859480
16750C3859480J537438J664923J973237K390209J796862K671588K362783K894034
$$ 33859480 35396918 37061841 39035078 41425287 43222149 45893737 48256520 51150554
16742E1150554L008732L114112L615984L302198M127155M785558M863460M997656
$$ 51150554 54159286 57273398 60889382 64191580 68318735 73104293 77967753 82965409
16734H2965409N297201N309813O103400O735065O614975O463178P297721P077481
$$ 82965409 88262610 93572423 99675823 106410888 113025863 119489041 126786762 133864243
16726A33864243P205421P263370O415420N948009N413204M428870L558247J947579
$$ 133864243 141069664 148333034 154748454 160696463 166109667 170538537 174096784 176044363
16718A76044363J255303m07936j321885l406130l738500n070425o004669o295958
$$ 176044363 177299666 176891730 175569845 172163715 168425215 163354790 157350121 151054163
16710A51054163o935817p360630p113290p555095o965463o744031o547726o321898
$$ 151054163 144118346 136757716 129644426 122089331 115123868 108379837 101832111 95510213
16702I5510213o182289n510883n409592m827284m472306m080265l740069m066143
$$ 95510213 89327924 83817041 78407449 73580165 69107859 65027594 61287525 57221382
16694E7221382l138475l330535l027835k385749k117818k210363k473091k215904
$$ 57221382 54082907 50752372 47724537 45338788 43220970 41010607 38537516 36321612
16686C6321612j619873j994381j589944j390597j184904j359226j356659j180459
$$ 36321612 34701739 32707358 31117414 29726817 28541913 27182687 25826028 24645569
16678B4645569j253399r07871q58356p61561p51061j416980m31426r58729l47515
$$ 24645569 23392170 22484299 21625943 20864382 20113321 18696341 18264915 17306186 16958671
16669A6958671p19537q41617m53359p16691m23739m19890n65398l84254l95644
$$ 16958671 16239134 15397517 14944158 14227467 13803728 13383838 12818440 12434186 12038542
16660A2038542q520p11552l97504k01990n82348R9349o03454l79452l71402K2798
$$ 12038542 12030022 11318470 10920966 10718976 10136628 10235977 9632523 9253071 8881669 8904467
16650H904467m62025j55392J4868o57808K38775n95044k58729M6048j57495k73234
$$ 8904467 8442442 8287050 8301918 7644110 7882885 7287841 7029112 7075160 6917665 6644431
16640F644431k87219j1240j56982j69070j99765j75745l23537P5384k0079m04704
$$ 6644431 6357212 6345972 6188990 6019920 5820155 5644410 5320873 5396257 5376178 4971474
16630D971474R2749k75674j36847N9025J47697l37802k03123O2581Q572q1331
$$ 4971474 5064223 4788549 4651702 4710727 4858424 4520622 4317499 4380080 4388652 4307321
16620D307321m48481L46536m34659J68388k62841j16159J77852j10137J22965
$$ 4307321 3858840 4205376 3770717 3939105 3676264 3560105 3737957 3627820 3750785
16611C750785l47572K1528k23541m7061l3672J79113k04854J07681k48877r8644
$$ 3750785 3403213 3424741 3201200 3154139 3120467 3299580 3094726 3202407 2953530 2854886
16601B854886k60523M33569l68907r8231J66744j17860n0430J35075k27755K3286
$$ 2854886 2594363 3027932 2659025 2560794 2727538 2609678 2559248 2694323 2466568 2489854
16591B489854j6866j33535P0771j96534k44655N08117l42379q5039Q3564p2933
$$ 2489854 2472988 2339453 2410224 2213690 1969035 2477152 2134773 2049734 2133298 2060365
16581B060365L7377j09280k35848M7504L54029l82746n0372j9811L5330J34146
$$ 2060365 2097742 1988462 1752614 1800118 2154147 1771401 1721029 1701218 1736548 1870694
16571A870694j4719l10332M49294l10725j00716K74514m36320K72626l62422M406
$$ 1870694 1855975 1545643 1994937 1684212 1583496 1858010 1421690 1694316 1331894 1336300
16561A336300m1027m8202M07703j92646J13399m5834j69935J40703R4370k72762
$$ 1336300 1295273 1247071 1654774 1462128 1575527 1529693 1359758 1500461 1594831 1322069
16551A322069K94034k43661K7777j92106J45735p8917j46492K13167J35784k63326
$$ 1322069 1616103 1372442 1400219 1208113 1353848 1274931 1128439 1341606 1477390 1214064
16541A214064j9792L17771k67577J45754j38239j21645j53827P0979n8069J5342
$$ 1214064 1194272 1512043 1244466 1390220 1251981 1130336 976509 1047488 989419 1004761
16531A004761r9466K06388n4722J15969k46487j40431k006K65252N9822k97848
$$ 1004761 905295 1111683 1056961 1172930 926443 786012 784006 1049258 1109080 811232
16521H11232J34672K6595K70512E57343K2835M04189j13525J6830j33035J38478
$$ 811232 945904 972499 1243011 557343 580178 984367 870842 887672 754637 893115
16511H93115L9373l31805M90919l07926L5744j00165R1249q9218O5544K31896
$$ 893115 932488 600683 1091602 783676 819420 719255 810504 721286 786830 1018726
16501A018726D01971L1029M15279J20443k54603l5366l7587J9547j24309J20671
$$ 1018726 401971 433000 848279 968722 714119 678753 641166 660713 536404 657075
16491F57075l4226j9443K86603l54410O2601k90847L44509j41478N5821Q8874
$$ 657075 622849 603406 890009 535599 598200 307353 651862 510384 566205 655079
16481F55079C26133L05496q7213J1417o0513j56078R7709p0994J42731J25854
$$ 655079 326133 631629 544416 555833 495320 339242 436951 365957 508688 634542
16471F34542M6280k49897J43721J31514k72880o8591J07890j66359J81547J69418
$$ 634542 680822 430925 574646 706160 433280 364689 472579 306220 487767 657185
16461F57185j12564j34824K71687C00676J21874J06125J50984j71459K00028k67647
$$ 657185 544621 409797 681484 300676 422550 528675 679659 508200 708228 440581
16451D40581J14440j04099m9969R9936R3404o5208k52815K09344J95718k46839
$$ 440581 555021 450922 400953 500889 594293 529085 276270 485614 681332 434493
16441D34493l1029J70958L0487A57928L70641J64669B27214J16457K07370n8997
$$ 434493 403464 574422 604909 157928 528569 693238 227214 343671 551041 492044
16431D92044k05740R4092J04028A53938D2222L69079m4309r2470J00868j53457
$$ 492044 286304 380396 484424 153938 42222 411301 366992 274522 375390 221933
16421B21933L06646q4780A77054J23436K62585G9094O5393J38605J13158M4669
$$ 221933 528579 443799 177054 300490 563075 79094 144487 283092 396250 440919
16411D40919j51945K81272j40009p3451p9482K4992K87806j29581j48157J80976
$$ 440919 288974 570246 430237 356786 277304 302296 590102 460521 312364 493340
16401D93340A44290K76377A16208M582P1706K51085A76329E6295J46616L6809
$$ 493340 144290 420667 116208 120790 192496 443581 176329 56295 202911 239720
16391B39720L36893j36144n9904m7535j19978P4768j26898R3274L28457k32469
$$ 239720 576613 440469 380565 333030 213052 287820 160922 254196 582653 350184
16381C50184b25143A79030J06183K00245k29092k9304H8730J60693M708K75227
$$ 350184 -225143 179030 285213 485458 256366 227062 88730 249423 254131 529358
16371E29358A74027m7928K26881j28962J5445r3967J64353A06906n1953L19663
$$ 529358 174027 126099 352980 224018 239463 145496 309849 106906 54953 374616
16361C74616P919d4727H3585J55754L04151k12989A17807m557J1872K96149A80282
$$ 374616 382535 -44727 83585 239339 543490 330501 117807 113250 125122 421271 180282
16349A73222H351M1954N0058K48995j58215B5708K05086K6243J20869K5117A20241
$$ 173222 8351 50305 100363 349358 191143 25708 230794 257037 377906 403023 120241
16337C19291k302R0916A51603K51641B3465L24817j3177N7406j39285E6563L6420
$$ 319291 316989 407905 151603 403244 23465 348282 335105 392511 253226 56563 92983
16326I2983K64472F0538a88976A90939K42667A82678A8957b8927D01758h0921
$$ 92983 357455 60538 -188976 190939 433606 182678 18957 -28927 401758 -80921
16315B63798A16962A0845L90919K2985a39183G3693N4219n0567M04409a97059
$$ 263798 116962 10845 401764 424749 -139183 73693 127912 77345 481754 -197059
16304B15448a04284N761b9440n9585C80576M0077I4736K41923F0759M2432b52777
$$ 215448 -104284 -98523 -29440 -89025 380576 420653 94736 336659 60759 103191 -252777
16292E7503R4981P837N318k7783K81390A1471J04979e8184F30202a15741B74659
$$ 57503 152484 160321 165639 137856 419246 11471 116450 -58184 630202 -115741 274659
16280F4495K72282D7173J67586B4429L8468A90M08456A32421j9744A1728K51409
$$ 64495 336777 47173 214759 24429 62897 190 408646 132421 112677 11728 263137
16269B63137K1578D156L40480j03740p2600G8145a0302l7464A79270H1863J70929
$$ 263137 284715 4156 344636 240896 168296 78145 -10302 -47766 179270 81863 252792
16258B52792G423K07961I0885N2110a29705A19244f8185C36906e7557h621m3019
$$ 252792 7423 215384 90885 142995 -129705 119244 -68185 336906 -57557 -8621 -51640
16247e1640n913A06538i6917D5694c8436A11818C5166a92533A0967O4579K8102
$$ -51640 -57553 106538 -96917 45694 -38436 111818 35166 -192533 10967 75546 103648
16236A03648C6466a6192j40988o3329B11792a60464g7059N01I3057a64533P2684
$$ 103648 36466 -16192 -157180 -220509 211792 -160464 -77059 -76558 93057 -164533 -91849
16225i1849A01895b0601D9006b00414B69732f5518B47357D1673K69476A08412
$$ -91849 101895 -20601 49006 -200414 269732 -65518 247357 41673 311149 108412
16214a8225l06030g0975m8826B30606A07844L04305A29731f4680A3200R9796J6456
$$ -18225 -324255 -70975 -119801 230606 107844 412149 129731 -64680 13200 112996 129452
16203A29452c38232H9406K17906I4744K27244A55730B3069J16624J37651r9932
$$ 129452 -338232 89406 307312 94744 321988 155730 23069 139693 277344 177412
16193A77412C1942f5397m507A65440a7123n74B34285B6730n559a54292A19644
$$ 177412 31942 -65397 -69904 165440 -17123 -17697 234285 26730 21171 -154292 119644
16181a56743H9922k3270K19489j06977a39495B03421J6214h766A76402O9881E5979
$$ -156743 89922 66652 286141 179164 -139495 203421 219635 -8766 176402 246283 55979
16169b7385A42317o9592K08737k4115g4667B82380A23646b6673A01784e3397r445
$$ -27385 142317 72725 281462 257347 -74667 282380 123646 -26673 101784 -53397 -62842
16158f2842q8791E5749J02423p3453l8980a767I864N340a36222q2540i5374A97740
$$ -62842 -151633 55749 158172 84719 45739 -1767 9864 15204 -136222 -218762 -95374 197740
16145a10588k18984d3979A44242Q0291a75439j67029f9811B5587J72035b06369
$$ -110588 -329572 -43979 144242 224533 -175439 -342468 -69811 25587 197622 -206369
16134F3074J24013J70741a83534k7290C13519a16312e2967j84364R2471d6339
$$ 63074 187087 357828 -183534 -210824 313519 -116312 -52967 -237331 -144860 -46339
16123A45821A6770D963c1919B60852A12585H034R218c71343D93440f1196o9772
$$ 145821 16770 4963 -31919 260852 112585 8034 17252 -371343 493440 -61196 -130968
16112a30968b0558C9539J61787J7691a01818G7595a316k91635D2818L4535O6335
$$ -130968 -20558 39539 201326 219017 -101818 77595 -1316 -292951 42818 77353 143688
16101A43688B7589K67685A16324n3564c20435d2373J4683G6771k7496J77378o1232
$$ 143688 27589 295274 116324 62760 -320435 -42373 -27690 76771 49275 226653 165421
16090A65421E7939F149L05504m5046c21813J55379B3024c30298l2535a08951G7020
$$ 165421 57939 6149 311653 266607 -321813 -166434 23024 -330298 -362833 -108951 77020
16078b53092J05386K342j43554a15406o3681Q2438B17850c64817a07872A3745
$$ -253092 -147706 -145364 -288918 -115406 -179087 -96649 217850 -364817 -107872 13745
16067a64252N596P5368J3758o2896a8365H6385k5329J25690F7148a24927a4643
$$ -164252 -158656 -83288 -69530 -132426 -18365 86385 61056 186746 67148 -124927 -14643
16055a81205N3906o4160H146J39994K1969I820M0128b2854j66232g6444J4832
$$ -181205 -127299 -191459 8146 148140 170109 9820 49948 -22854 -189086 -76444 -61612
16044f1612F5090a2231C92733b55091r2430A06800k9467b45092c4587B29656j11486
$$ -61612 65090 -12231 392733 -255091 -347521 106800 77333 -245092 -34587 229656 118170
16033A18170a21392A9341K92567a46154N4165K8016A48855A6545M9537A790a81314
$$ 118170 -121392 19341 311908 -146154 -91989 -63973 148855 16545 66082 1790 -181314
16021f1725C0349a18998B8295L0746J3948b07762E1432K28511a27031N4765A72409
$$ -61725 30349 -118998 28295 59041 72989 -207762 51432 279943 -127031 -72266 172409
16009a31971A64539e490n8682k8714G213b54134J4938R7094j17411g022j40450
$$ -131971 164539 -5490 -64172 -92886 7213 -254134 -239196 -142102 -259513 -7022 -147472
15998a47472N1945C36873a78931C34613a6777j1628l8504l6344j69129A02273
$$ -147472 -95527 336873 -178931 334613 -16777 -28405 -66909 -103253 -272382 102273
15987D9419b8489B62024a26138B01485J12128Q5144A28822J2668e959B47267c68777
$$ 49419 -28489 262024 -126138 201485 313613 398757 128822 141490 -5959 247267 -368777
15975A86748a74015D9579K95900a74952H1403L4608b19951c8884A28485j3683
$$ 186748 -174015 49579 345479 -174952 81403 116011 -219951 -38884 128485 114802
15965A14802c33840a32606J4185j45480q7314G3255P9886D3779a42317e9806J8152
$$ 114802 -333840 -132606 -118421 -263901 -351215 73255 153141 43779 -142317 -59806 -41654
15954d1654k67975J8265G2115J41428G0216i3599G4119J8632k9293f4565C59557
$$ -41654 -309629 -291364 72115 213543 70216 -93599 74119 92751 63458 -64565 359557
15942b65870A64884a27320k77713J14006a39324G0501f4919a9472H6526a2357
$$ -265870 164884 -127320 -405033 -291027 -139324 70501 -64919 -19472 86526 -12357
15931c15327J02241F4716O5154b71385J27732C712a95381F7845b58484g8261a2306
$$ -315327 -213086 64716 129870 -271385 -143653 3712 -195381 67845 -258484 -78261 -12306
15919B54968A13043a84487C9858J41493a70720d1760n7747B13887a30495r3473
$$ 254968 113043 -184487 39858 181351 -170720 -41760 -99507 213887 -130495 -223968
15909b23968A645a20740o363i866m9161A49431g1352n6507G4826b5189C75714
$$ -223968 1645 -120740 -127103 -9866 -59027 149431 -71352 -127859 74826 -25189 375714
15897A34009c8283j4533p6668c4220l1378k72522A9373b48974d841l41482B34749
$$ 134009 -38283 -52816 -129484 -34220 -65598 -338120 19373 -248974 -4841 -346323 234749
15885C2049L4369i7793B10328d9216M850F5898a8682A8498a83039Q8568B9072
$$ 32049 66418 -97793 210328 -49216 -44366 65898 -18682 18498 -183039 -94471 29072
15873F1378O9501a92942A60862a0422k26235b6025B55259a63834C928a03411G7878
$$ 61378 130879 -192942 160862 -10422 -236657 -26025 255259 -163834 3928 -103411 77878
15861A13830c62598A8496N243D143i7810B1507a27760A68436G6233e0824A98886
$$ 113830 -362598 18496 23739 4143 -97810 21507 -127760 168436 76233 -50824 198886
15849B12535a6836j5627j14094j1962d8866k59501j53883K24716h1551A01463
$$ 212535 -16836 -32463 -146557 -158519 -48866 -308367 -462250 -237534 -81551 101463
15838a70406H4696c6118C4803J92647J69839b67042g3602J6815A05889b1565o7729
$$ -170406 84696 -36118 34803 227450 397289 -267042 -73602 -56787 105889 -21565 -89294
15827h9294L5221i34n5957p2433j37185B7641b56544l6801A34446a26244r5729
$$ -89294 -54073 -934 -56891 -129324 -266509 27641 -256544 -293345 134446 -126244 -221973
15816b21973J06476A12464b63002D4771a20079K9650G0977L2205f8130C38621
$$ -221973 -115497 112464 -263002 44771 -120079 -90429 70977 103182 -68130 338621
15805e4567D1142J82168a24427A1453a27790H4415j9143a09826j8158j17194R6170
$$ -54567 41142 223310 -124427 11453 -127790 84415 65272 -109826 -127984 -245178 -149008
15794a49008p7094h9991k63958h0386B05056I2863K84906a14662j58097a30843
$$ -149008 -226102 -89991 -353949 -80386 205056 92863 377769 -114662 -272759 -130843
15783B4898a51540L1820k72937B50119F5554P3905c9645p3670B50499b16252A39866
$$ 24898 -151540 -119720 -392657 250119 65554 139459 -39645 -113315 250499 -216252 139866
15771a50895e8443b096H9913g0082A29037b46429J16462d0007g907j78709A15513
$$ -150895 -58443 -2096 89913 -70082 129037 -246429 -129967 -40007 -7907 -186616 115513
15759a7266j38296L9906B01758o4351J64260d6683A72707h1495A2215a04040D3015
$$ -17266 -155562 -115656 201758 137407 301667 -46683 172707 -81495 12215 -104040 43015
15747D6764b46539A75983L8277b60832N457E5428O3059b08947d0652r6210j50701
$$ 46764 -246539 175983 214260 -260832 -255375 55428 118487 -208947 -40652 -136862 -287563
15736b87563D17932c21386B49465g6902k30418B1328i1552j8851I1599c62424
$$ -287563 417932 -321386 249465 -76902 -307320 21328 -91552 -110403 91599 -362424
15725A65034c61741i0191o8912N5390I695J15413b1990m7891j63623H5809J41965
$$ 165034 -361741 -90191 -159103 -103713 9695 125108 -21990 -69881 -233504 85809 227774
15714B27774a07784B42104a46787A724a06696A83004D5158d96998b4k76402h4595
$$ 227774 -107784 242104 -146787 1724 -106696 183004 45158 -496998 -24 -276426 -84595
15702A4174i1349j04440B21409a73030L4362A78955a57694e4649j19459a7375
$$ 14174 -91349 -195789 221409 -173030 -138668 178955 -157694 -54649 -174108 -17375
15691B63508I9698a89856N2308C1502J81711a63623G9212b8284l63550G1948K9678
$$ 263508 99698 -189856 -137548 31502 213213 -163623 79212 -28284 -391834 71948 101626
15680A01626C2796a72972j49278A42290a13633A59447F5215a49981B83508F19
$$ 101626 32796 -172972 -322250 142290 -113633 159447 65215 -149981 283508 619
15669a45497H607M5328g6493k4629j2549k0554d6766F5998a31167j36881n2291
$$ -145497 8607 53935 -76493 -101122 -113671 -134225 -46766 65998 -131167 -268048 -320339
15658c20339c3208B0833J01101m4752d1440B08221f7966R055C7932f6654b6551
$$ -320339 -33208 20833 121934 77182 -41440 208221 -67966 -58911 37932 -66654 -26551
15646b14941C01485b88918J3682A22835L0566d0821B60646A5158a43776A22973
$$ -214941 301485 -288918 -275236 122835 153401 -40821 260646 15158 -143776 122973
15635b07440A75063a92303B32802d2584j2350l9004J2695n8952e1051C22926d6424
$$ -207440 175063 -192303 232802 -42584 -54934 -93938 -81243 -140195 -51051 322926 -46424
15623A41786f2246j57094A42660B906a39481l9504A12272J21525c2176q9923B830
$$ 141786 -62246 -219340 142660 2906 -139481 -178985 112272 233797 -32176 -122099 2830
15611E4655b21456a3312A76791b76739I3704c8406A91536a7512C56032c53012
$$ 54655 -221456 -13312 176791 -276739 93704 -38406 191536 -17512 356032 -353012
15600B12078g6404j16518h7498I8011a98978A68621a29487N9673j01237O8712
$$ 212078 -76404 -192922 -87498 98011 -198978 168621 -129487 -69814 -171051 -102339
15590a02339A12249a13378H2333b07534A6203J82150I7695A882h2923j0802B16400
$$ -102339 112249 -113378 82333 -207534 16203 198353 97695 1882 -82923 -93725 216400
15578b51766L9391i2972c9649j06557o058A76352K6834b68043a11325k01112D7359
$$ -251766 -212375 -92972 -39649 -146206 -152264 176352 203186 -268043 -111325 -312437 47359
15566A90774q4828d1129p6161H8636P2409l1421a47089Q000A09188H430f0618
$$ 190774 105946 -41129 -117290 88636 161045 129624 -147089 -139089 109188 8430 -60618
15554A49824c54444a18714M269K2934A43763a96367C58762j37649j07332d2496
$$ 149824 -354444 -118714 -114445 -91511 143763 -196367 358762 221113 113781 -42496
15543E5662a77130F2267D728a45127B18890K3728a85206I582b11580H645L3874
$$ 55662 -177130 62267 4728 -145127 218890 242618 -185206 9582 -211580 8645 42519
15532D2519P6917c3309n3177k4324B7336M4995A3228L1775b14674A8755a44831
$$ 42519 119436 -33309 -86486 -110810 27336 72331 13228 45003 -214674 18755 -144831
15520a02712J9554l5108F3325K56785j50892j4632a55070D21604E4233K69172
$$ -102712 -83158 -118266 63325 320110 169218 154586 -155070 421604 54233 323405
15510C23405a59225j8717C60347A13671i2884c3083k62100A45184a60615A07095
$$ 323405 -159225 -177942 360347 113671 -92884 -33083 -295183 145184 -160615 107095
15499B74649B0654a04037E9444N122b66065b670j44800M1027M7460K5176A32469
$$ 274649 20654 -104037 59444 64566 -266065 -2670 -147470 -106443 -58983 -33807 132469
15487b19636m7101N0899e0749B56483q5431b20696J09473D0182d2800A90373C7462
$$ -219636 -266737 -215838 -50749 256483 171052 -220696 -111223 40182 -42800 190373 37462
15475A17568J29756a84868A7836M00375a35483G3346a4624d17l41627H6744b18476
$$ 117568 247324 -184868 17836 418211 -135483 73346 -14624 -417 -342044 86744 -218476
15463B0750i7686L0856k82263a2384G6576N25252I9149b66786l285A82937a4388
$$ 20750 -97686 -66830 -349093 -12384 76576 601828 99149 -266786 -270071 182937 -14388
15451b91209L3457e377j42577N1906j12963A9117f0854E0066k1048b44202B06194
$$ -291209 -257752 -5377 -147954 -96048 -209011 19117 -60854 50066 29018 -244202 206194
15439A35393a38938E5949a61760A24425j7617a86122A80337B5531R9393h5067
$$ 135393 -138938 55949 -161760 124425 106808 -186122 180337 25531 124924 -85067
15428b7642B48915b10496a02205e0265H7213a63817M7517L3622A17017h7290B26357
$$ -27642 248915 -210496 -102205 -50265 87213 -163817 -116300 -82678 117017 -87290 226357
15416A08531b0266n5539J9186B92213A28165J25682d7374A57061p2084b22025
$$ 108531 -20266 -75805 -56619 292213 128165 253847 -47374 157061 84977 -222025
15405A96822N4852E9719M3739M04a02210C33938b37432A80681j7772d49277E6630
$$ 196822 251674 59719 103458 103862 -102210 333938 -237432 180681 162909 -449277 56630
15393b60868I1783J87193h75m1242j43534H9996L2226J22054c9205E3718f8188
$$ -260868 91783 278976 -875 -42117 -185651 89996 122222 244276 -39205 53718 -68188
15381A61328h2947B3912l365K7295J51220A1504a5559j65961C3962K37088a41362
$$ 161328 -82947 23912 20547 47842 199062 11504 -15559 -181520 33962 271050 -141362
15369D306a1075p6701k43631c3768n5526G4710J27058c04683a28902A07851M3672
$$ 4306 -11075 -87776 -331407 -33768 -89294 74710 201768 -304683 -128902 107851 151523
15358A51523l7094J19593B2542f2887l85965a73415B90311a03609D01015H9963
$$ 151523 114429 234022 22542 -62887 -448852 -173415 290311 -103609 401015 89963
15347G6958a7659B98558b48083a9055r8425l4137A09839b96860A9723L07577b63821
$$ 76958 -17659 298558 -248083 -19055 -117480 -151617 109839 -296860 19723 327300 -263821
15335E3747d14001g9519E1702a78260D709J3057c87870a3173A67206J33299a04789
$$ 53747 -414001 -79519 51702 -178260 4709 17766 -387870 -13173 167206 300505 -104789
15323B02891B9189L7878A562J21425M3263l9790D3164a72175J8440B50042D4281
$$ 202891 29189 67067 1562 122987 166250 126460 43164 -172175 -153735 250042 44281
15311A84689G5003Q1716b00759c1575B28377p9863b13496a9945H5384e846A52403
$$ 184689 75003 156719 -200759 -31575 228377 148514 -213496 -19945 85384 -5846 152403
15299B96077q4646j6609B9061e8238D472b10081a03946B2916i6818l616E4729
$$ 296077 211431 194822 29061 -58238 4472 -210081 -103946 22916 -96818 -100434 54729
15287c63436A50842b82367Q4518L0748F6034b26096A37179a21746A04510e1732
$$ -363436 150842 -282367 -197849 -167101 66034 -226096 137179 -121746 104510 -51732
15276A72931C5363M4555J18529M4325a29512E2566R5791K45197a16962N7745k17340
$$ 172931 35363 79918 198447 242772 -129512 52566 148357 393554 -116962 -59217 -276557
15265b76557c5123p9148A38929F2470b0463A4376J47163D0527b05178a4410j40025
$$ -276557 -35123 -114271 138929 62470 -20463 14376 161539 40527 -205178 -14410 -154435
15254a54435N5715F6130J20264J76853M0194M19602K25782j39581l00265O83436
$$ -154435 -98720 66130 186394 363247 403441 823043 1048825 909244 608979 1292415
15244A292415E90745k62365h2360E7704b9016A61832g1994A02339J27187j4493
$$ 1292415 590745 328380 -82360 57704 -29016 161832 -71994 102339 229526 215033
15234B15033a46638A64233l2634J84287j47440N5762j08342n4799a7943B0821
$$ 215033 -146638 164233 131599 315886 168446 224208 115866 61067 -17943 20821
15223C35029j62756G8119L1011D6729L242H821J51564R674G876J11049m995c3766
$$ 335029 172273 78119 109130 46729 49971 8821 160385 170059 7876 118925 113930 -33766
15210a24840A25931L7993q1696J22965r3919J77913F9295a5000C0929j1826b34259
$$ -124840 125931 163924 82228 205193 111274 289187 69295 -15000 30929 19103 -234259
15198a141A9089O534b4655C74657d8936o3587B92649p9418m5292P4189a50642
$$ -1141 19089 25623 -24655 374657 -48936 -112523 292649 213231 167939 242128 -150642
15186a96717K3571N3193c3632q736l23577P5015e526l3594o443A633K08031H3892
$$ -196717 -173146 -119953 -33632 -42368 -365945 -290930 -5526 -39120 -45563 1633 209664 83892
15173I9049C8406f3349A66247a32437F3743J23500a12177C96500f5291C1105N6545
$$ 99049 38406 -63349 166247 -132437 63743 187243 -112177 396500 -65291 31105 87650
15162H7650J05274J8134G2754j4632J29631e4077A27967c5400A35946N6936o8378
$$ 87650 192924 211058 72754 58122 187753 -54077 127967 -35400 135946 192882 124504
15151A24504b08807A55759E7590Q8872a64482C7158K8459d238G7734a0828k4569
$$ 124504 -208807 155759 57590 146462 -164482 37158 65617 -4238 77734 -10828 -35397
15140c5397A20937k3138a49750d661C15175k7254a0245B66515a8912A44163F1013
$$ -35397 120937 97799 -149750 -4661 315175 287921 -10245 266515 -18912 144163 61013
15128C3050K486J33605Q5232a1690l7603B78189L1963a28275A95228p0389J3319
$$ 33050 35536 169141 254373 -11690 -49293 278189 310152 -128275 195228 124839 138158
15117A38158J33196R9093j55157F4646L53J7612K89464a54196E35923E5015P7343
$$ 138158 271354 370447 215290 64646 64999 82611 372075 -154196 535923 55015 132358
15106A32358a91722C7529K51406j34926J13812f4041E0864P8849d7175F5350R8278
$$ 132358 -191722 37529 288935 154009 267821 -64041 50864 129713 -47175 65350 163628
15095A63628B0036J54673a3657R97A83364r1185c0510F5337a45695m1059G9565
$$ 163628 20036 174709 -13657 -12660 183364 92179 -30510 65337 -145695 -186754 79565
15083D16132l5697b71877a05262G0780d5334E4830L52580I1302J22542j00707
$$ 416132 380435 -271877 -105262 70780 -45334 54830 407410 91302 213844 113137
15073A13137g533A78723J3991N525K95583a56801B30331c8188j16715b2991q8261
$$ 113137 -7533 178723 192714 198239 493822 -156801 230331 -38188 -154903 -22991 -111252
15062a11252j27666B50887j14096k8852J14518j7123a62115A71319l7005a48535
$$ -111252 -238918 250887 136791 107939 222457 205334 -162115 171319 134314 -148535
15051c1567B67360d6764A50708M15227A80335J82069A38188a15624a6615F2112
$$ -31567 267360 -46764 150708 565935 180335 362404 138188 -115624 -16615 62112
15040i3732B07383J82540A03877J6381D6280h477A96310J3413I8657K39141j43686
$$ -93732 207383 389923 103877 120258 46280 -8477 196310 209723 98657 337798 194112
15029A94112K10648r5958j31937l1211o3674K19636A06936N4021o1063J51508
$$ 194112 404760 308802 176865 145654 81980 301616 106936 160957 99894 251402
15019B51402O406j730j10128f5968A29396p525l4251K1860J36772N3549J27901
$$ 251402 257808 256078 145950 -65968 129396 121871 87620 109480 246252 299801 427702
15008D27702F1931M18596p1683j66206a94134d2250A03115d6120B86427O2316
$$ 427702 61931 480527 408844 242638 -194134 -42250 103115 -46120 286427 348743
14998C48743J17238A54776M4330J33065a86200B63058a52007C64652a5391D74254
$$ 348743 465981 154776 199106 332171 -186200 263058 -152007 364652 -15391 474254
14987A13472N850M4801N7424G9734J55242F2672e7253A28394n6256M10802k12075
$$ 113472 119322 164123 221547 79734 234976 62672 -57253 128394 72138 482940 270865
14976B70865q3700L95103k29536J61849q0401a98291Q7307B70535e5691A91407
$$ 270865 187165 582268 352732 514581 434180 -198291 -110984 270535 -55691 191407
14965A22162J70450j36035K04670a40467A84722o4083a62477B4455M49068A21426
$$ 122162 292612 156577 361247 -140467 184722 120639 -162477 24455 473523 121426
14954D10363J6602r7756A13158P1565l6100K3079K86260k03051k5550l9978J2856
$$ 410363 426965 329209 113158 184723 148623 171702 457962 254911 229361 189383 202239
14943B02239J07843O9869A56247J7930R731b2930F8075b895B83746j35650O1259
$$ 202239 310082 379951 156247 174177 183908 -22930 68075 -2895 283746 148096 209355
14932B09355b33996M1734M7050B55209R4479a6494B58553K40577A62786N8948
$$ 209355 -233996 -192262 -145212 255209 349688 -16494 258553 499130 162786 221734
14922B21734K14914b0164A54015m5863m2661K58724k6600j9659O9666R34A42988
$$ 221734 436648 -20164 154015 108152 65491 324215 297615 277956 347622 348556 142988
14910B80930A37983D1145O05888A72996K3523J8692K76674A84241L2938k0930
$$ 280930 137983 41145 647033 172996 196519 215211 491885 184241 217179 196249
14900A96249K38604I0650M43377j38604c5629B16940q9439J62995m5421J37586
$$ 196249 434853 90650 534027 395423 -35629 216940 127501 290496 245075 382661
14890C82661n0153g1608C97276A69770n267p441K4104Q5888J70678o6351B0917
$$ 382661 332508 -71608 397276 169770 164503 157062 181166 267054 437732 371381 20917
14878E54526k05267c58671A58122J00539J56674E7272L46906A14703M2427J94509
$$ 554526 349259 -358671 158122 258661 415335 57272 404178 114703 157130 351639
14868C51639r060J20716j68485J69865j20663r8613J08164D7779L95886L2420
$$ 351639 342579 463295 294810 464675 344012 245399 353563 47779 443665 476085
14858D76085A72570M76643C21679A29190a0275D10884j13241J19312p7819L44941
$$ 476085 172570 649213 321679 129190 -10275 410884 297643 416955 339136 684077
14848F84077A96289K70969I8804K05956K91222j81277r3680j19194K29026J1095
$$ 684077 196289 467258 98804 304760 595982 414705 321025 201831 430857 441952
14838D41952K22657k90776R7883j38715L38597j80307r080J23655A37507M02640
$$ 441952 664609 373833 471716 333001 671598 491291 482211 605866 137507 540147
14828E40147j96096Q3373M4725A60591J05664J6386L38230j59955A07314N06623
$$ 540147 344051 427424 472149 160591 266255 282641 620871 460916 107314 613937
14818F13937j60305A77073O2562J92866K11469j55231D7491K07507j137j00866
$$ 613937 453632 177073 239635 432501 643970 488739 47491 254998 253861 152995
14808A52995K07538A21922K27213L39847A90181J00061o8290K45533o7226J46076
$$ 152995 360533 121922 349135 688982 190181 290242 221952 467485 400259 546335
14798E46335l9624m9966j97098j9671J67271K88027l17505J04368K42991j65844
$$ 546335 506711 456745 259647 239976 407247 695274 377769 482137 725128 559284
14788E59284K3428J33322A77316J01289L2347J21114J97337k06706l8918J02355
$$ 559284 582712 716034 177316 278605 310952 432066 629403 422697 383779 486134
14778D86134k7506M08377k34039Q0093C26255j6356N8041K2325J03006q3225J57392
$$ 486134 458628 867005 632966 713059 326255 309899 367940 390265 493271 410046 567438
14767E67438j67779N5945O1353k02015L20529C03798K27670K30268j12245B06960
$$ 567438 399659 455604 516957 314942 635471 303798 531468 761736 649491 206960
14756F27619K17567k63091J46732l03694L77094k03069P9236j17034j02960j11269
$$ 627619 845186 582095 728827 425133 802227 599158 678394 561360 458400 347131
14746C47131J71761j85342J35052J21103k04304J4969L51552k90746j18956J61578
$$ 347131 518892 333550 468602 589705 385401 400370 751922 461176 342220 503798
14736E03798J23929N7668j38065P9016K03082m11836J42882J0203R0777K77330
$$ 503798 627727 685395 547330 626346 829428 417592 560474 570677 661454 938784
14726I38784l65663o8459K00779j09304k11952J69435O2221K5687P4065J0058
$$ 938784 573121 504662 705441 596137 384185 553620 615841 641528 715593 725651
14716G25651k57211M06948D14628j20052K90260J19637J11354q6853q1988N8139
$$ 725651 468440 875388 414628 294576 584836 704473 815827 728974 646986 705125
14706G05125k43478k03547M54758l09073N18901k37433J18821o8693J14326l09524
$$ 705125 461647 258100 712858 403785 922686 685253 804074 735381 849707 540183
14696E40183J47722O480j88791K72551l30052O46170m16506L96190j45882l44126
$$ 540183 687905 694385 505594 778145 448093 1094263 677757 1073947 928065 583939
14686E83939K15374O2325Q322J1962J81026l59911K57944l21260L58290j75504
$$ 583939 799313 861638 869960 881922 1062948 703037 960981 639721 998011 822507
14676H22507J59887k50512K90219l07017L1378k54390L80377J5464O4444k28743
$$ 822507 982394 731882 1022101 715084 746462 492072 872449 887913 952357 723614
14666G23614M44819m0767k47636r0998J50644m3825J86959m13428L05538j56608
$$ 723614 1168433 1127666 880030 789032 939676 895851 1082810 669382 974920 818312
14656H18312M49227k63902k84306K04193J85215m43215n0542L22183j41989j95665
$$ 818312 1267539 1003637 719331 923524 1108739 665524 614982 937165 795176 599511
14646E99511M49544m494J23109l74953K80001j19867K44201O3293n82919L59567
$$ 599511 1049055 1044561 1167670 792717 1072718 952851 1197052 1260345 677426 1036993
14636A036993j29874M36847k61672O8471k34823o1930K84930K05763o549k81448
$$ 1036993 907119 1343966 1082294 1150765 915942 854012 1138942 1344705 1338156 1056708
14626A056708J78541j91764l2692R2379l22116O48397k37861k71185J43245K0085
$$ 1056708 1235249 1043485 1010793 1103172 781056 1429453 1191592 920407 1063652 1083737
14616A083737J01832j1795J87772j16951J09076l87057R6468N2572j35383L84232
$$ 1083737 1185569 1173774 1361546 1244595 1353671 966614 1063082 1115654 980271 1364503
14606A364503j74345O36673l24191J84823o44039L05289j87759L72231k03594
$$ 1364503 1190158 1826831 1502640 1687463 1043424 1348713 1160954 1533185 1329591
14597A329591K36041k23648k3014K6660k4105j3972L05831k49996M92184l05075
$$ 1329591 1565632 1341984 1318970 1345630 1321525 1307553 1613384 1363388 1855572 1550497
14587A550497o5949M3535j49822J19959L60003l25074K6850k68947K88542k25883
$$ 1550497 1484548 1528083 1378261 1498220 1858223 1533149 1559999 1291052 1579594 1353711
14577A353711N57460k47714J03060k9858J96937k87487L15271j39090m6233k45528
$$ 1353711 1911171 1663457 1766517 1736659 1933596 1646109 1961380 1822290 1776057 1530529
14567A530529L40626J00022N0730r3217p967L76951K82460k13536j22056j0331
$$ 1530529 1871155 1971177 2021907 1928690 1920723 2297674 2580134 2366598 2244542 2234211
14557B234211J35039K05470J36567J05577M89823L84234O04920J096487J919598
$$ 2234211 2369250 2574720 2711287 2816864 3306687 3690921 4295841 5392328 7311926
14548G311926L290712Q833209J0968658M454797j2881187I321556D279028j552295
$$ 7311926 10602638 19435847 30404505 34859302 21978115 9321556 4279028 2726733
14540B726733p97454R9436r04430K69378K98386O9239Q6576j66936j16055O0770
$$ 2726733 1929279 2028715 1124285 1393663 1692049 1761288 1847864 1680928 1564873 1625643
14530A625643M6039L66631l97763J32195N3392Q2622O7442J49323m9004J29646
$$ 1625643 1671682 2038313 1640550 1772745 1826137 1908759 1976201 2125524 2076520 2206166
14520B206166N3927j765J66991m08594l2130J73196J09315k10086J21378M6343
$$ 2206166 2260093 2258328 2425319 2016725 1984595 2157791 2267106 2057020 2178398 2224741
14510B224741J26072M607Q0622l5390j64345K76221K5466j20919m687J87671O9543
$$ 2224741 2350813 2355420 2436042 2400652 2236307 2512528 2537994 2417075 2412388 2600059 2669602
14499B669602K27350j89500R3375k60016L11074L8885O3509j19568j32919K02014
$$ 2669602 2896952 2707452 2800827 2540811 2851885 2890770 2954279 2834711 2701792 2903806
14489B903806k42675M63901k27394O1303R9025j15414J19771J69865l44817K80660
$$ 2903806 2661131 3125032 2897638 2958941 3057966 2942552 3062323 3232188 2887371 3168031
14479C168031L09046j88730J58124j74432L18113j24410L08330j75472j37919
$$ 3168031 3477077 3288347 3446471 3272039 3590152 3465742 3774072 3598600 3460681
14470C460681m1695J48827N6268L3884J93317k7557j1248K80706m02746O89952
$$ 3460681 3418986 3567813 3624081 3657965 3851282 3823725 3812477 4093183 3690437 4380389
14460D380389m50710k59714L88431O1890p3252K22728r7849J80050j76534j16679
$$ 4380389 3929679 3669965 4058396 4120286 4047034 4269762 4171913 4351963 4175429 4058750
14450D058750M70463j46724K67233j40010L11903l9916k45806K45094k9130R9338
$$ 4058750 4529213 4382489 4649722 4509712 4821615 4781699 4535893 4780987 4751857 4851195
14440D851195m9448J17007K23299k53377K44435J10724K60900j23922K28369R2664
$$ 4851195 4801747 4918754 5142053 4888676 5133111 5243835 5504735 5380813 5609182 5701846
14430E701846r2371P1124N7313N19094l65904L9224K63928J56956j10108K58368
$$ 5701846 5609475 5680599 5737912 6257006 5891102 5930326 6194254 6351210 6241102 6499470
14420F499470J72012k54401k5777M78500J73493j34631K59277k07332J80612P3299
$$ 6499470 6671482 6417081 6391304 6869804 7043297 6908666 7167943 6960611 7141223 7214522
14410G214522J80855J28550K02133M7685l1920L18888j74095L67166J20341K29312
$$ 7214522 7395377 7523927 7726060 7773745 7741825 8060713 7886618 8253784 8374125 8603437
14400H603437k10517M86332j43489L33973j7439L57239J66908J14955J04812L22291
$$ 8603437 8392920 8879252 8735763 9069736 9052297 9409536 9576444 9691399 9796211 10118502
14390A0118502Q4972k36024O21004J13496n6659L33141J72993J30609K44245k92752
$$ 10118502 10203474 9967450 10588454 10701950 10645291 10978432 11151425 11282034 11526279 11233527
14380A1233527Q51535n3344J20697J26325N84756K75396K56491P8792M97101Q4576
$$ 11233527 12085062 12031718 12152415 12278740 12863496 13138892 13395383 13474175 13971276 14055852
14370A4055852N18937m2863P27400N19841K0361N52429J88628M68277O3775K34853
$$ 14055852 14574789 14531926 15259326 15779167 15799528 16351957 16540585 17008862 17072637 17307490
14360A7307490N14452M84061L42655K23456R26349m3259K79019J103280J79611
$$ 17307490 17821942 18306003 18648658 18872114 19798463 19755204 20034223 21137503 21317114
14351B1317114P43093N15933M14992P46538O62643N69002P38707M93548P91818
$$ 21317114 22060207 22576140 22991132 23737670 24400313 24969315 25708022 26201570 26993388
14342B6993388O47004M82907J099525Q45142P61816O62009J033157R14945R15334
$$ 26993388 27640392 28123299 29222824 30067966 30829782 31491791 32524948 33439893 34355227
14333C4355227J109106Q67702J400888J004714J254293J296879J599309J475829
$$ 34355227 35464333 36332035 37732923 38737637 39991930 41288809 42888118 44363947
14325D4363947J324057J303054J553020J703040J783958J808618J819230K201767
$$ 44363947 45688004 46991058 48544078 50247118 52031076 53839694 55658924 57860691
14317E7860691K020590K536148K356082K515109K831036K708058L324681K992763
$$ 57860691 59881281 62417429 64773511 67288620 70119656 72827714 76152395 79145158
14309G9145158L279706L374915L649014M267168M306997M332059M904584N220547
$$ 79145158 82424864 85799779 89448793 93715961 98022958 102355017 107259601 112480148
14301A12480148N466783N767320O728355O345721P074922P411820P900193Q546324
$$ 112480148 117946931 123714251 130442606 136788327 143863249 151275069 159175262 167721586
14293A67721586Q944681R754602R856891J1011030J1079024J2012501J2690827
$$ 167721586 176666267 186420869 196277760 207288790 218367814 230380315 243071142
14286B43071142J3319222J3687359J4442759J4647571J4750235J5167465J5136884
$$ 243071142 256390364 270077723 284520482 299168053 313918288 329085753 344222637
14279C44222637J5079464J4343260J3746191J2701957J0312731P132734M296616
$$ 344222637 359302101 373645361 387391552 400093509 410406240 417538974 421835590
14272D21835590K616666n69120j653230J74715j256180l548186m522426p916965
$$ 421835590 424452256 423883136 422229906 422404621 421148441 417600255 413077829 405160864
14264D05160864j1114382j3075442j4400672j4940193j5527176j5477517j5903555
$$ 405160864 394046482 380971040 366570368 351630175 336102999 320625482 304721927
14257C04721927j4942606j4740280j3632194j3469352j3081794j2817195j1427776
$$ 304721927 289779321 275039041 261406847 247937495 234855701 222038506 210610730
14250B10610730j1311136j0225974r872320r532981q726412q208336p463655p181862
$$ 210610730 199299594 189073620 179201300 169668319 160941907 152733571 145269916 138088054
14242A38088054o638515o592622o527663m638458n197748n057059m735420m497315
$$ 138088054 131449539 124856917 118329254 113690796 108493048 103435989 98700569 94203254
14234I4203254m046800m017618l514888l118630l339005l213950k782010k700839
$$ 94203254 90156454 86138836 82623948 79505318 76166313 72952363 70170353 67469514
14226F7469514k902923k440477k379182k332285j899480j916315k290949j393466
$$ 67469514 64566591 62126114 59746932 57414647 55515167 53598852 51307903 49914437
14218D9914437j894129j477424j600333j489657j259976j188781j055301j734970
$$ 49914437 48020308 46542884 44942551 43452894 42192918 41004137 39948836 38213866
14210C8213866j286900o34192j244134m57409j294876r27407j180047q30342q19345
$$ 38213866 36926966 36292774 35048640 34591231 33296355 32368948 31188901 30358559 29539214
14201B9539214p44090r51233m70220n40804j127770n22683q28908n34636j85078
$$ 29539214 28795124 27843891 27373671 26832867 25705097 25182414 24353506 23818870 23633792
14192B3633792q47593n41806o13601n16203l69561o24885m45739m58109o32867
$$ 23633792 22786199 22244393 21630792 21114589 20745028 20120143 19674404 19216295 18583428
14183A8583428p1611k87626n18495p33645J28936m67080n15229l40950l77189
$$ 18583428 18511817 18224191 17705696 16972051 17100987 16633907 16118678 15777728 15400539
14174A5400539J7504l75736j61829l68598n27103k50346j41653k02970k97701
$$ 15400539 15418043 15042307 14880478 14511880 13984777 13734431 13592778 13389808 13092107
14165A3092107k40970r208o02549k54789K79206o18342k718m85628k12694P0605
$$ 13092107 12851137 12841929 12239380 11984591 12263797 11645455 11642737 11157109 10944415 11015020
14155A1015020r6251l85938R2493l77138o6114l25188k93145l76952L70331m24437
$$ 11015020 10918769 10532831 10625324 10248186 10182072 9856884 9563739 9186787 9557118 9132681
14145I132681J07426m28228O529j92032j48932j18319k16850n352l36923J58521
$$ 9132681 9240107 8811879 8818408 8626376 8477444 8359125 8142275 8136923 7800000 7958521
14135G958521j59140j99059l18218l4403J13214J7384k17065k41327j79086N4627
$$ 7958521 7799381 7600322 7282104 7247701 7360915 7378299 7161234 6919907 6740821 6795448
14125F795448J74359n85112L00663j95996m44168J3822P2406J29883k44458j8083
$$ 6795448 6969807 6384695 6685358 6489362 6045194 6059016 6131422 6261305 6016847 5998764
14115E998764j36845r7028j63465L00959l32498j64088J11960k37876k2176P9453
$$ 5998764 5861919 5764891 5601426 5902385 5569887 5405799 5517759 5279883 5257707 5337160
14105E337160k97012O0640P1178k55460m1447J24540j63595k74777L43175m72698
$$ 5337160 5040148 5100788 5171966 4916506 4875059 4999599 4836004 4561227 4904402 4431704
14095D431704K64758k40066O1498j03879q9458J20072j79499j85461J02343q0337
$$ 4431704 4696462 4456396 4517894 4414015 4324557 4444629 4265130 4079669 4182012 4101675
14085D101675j4717k14852M0037j41530p9804N09939j78443J68687m92565j57523
$$ 4101675 4086958 3872106 3912143 3770613 3690809 4200748 4022305 4190992 3698427 3540904
14075C540904K64602p1290l67191M1364Q3905O0836l89104R7707j11253M32383
$$ 3540904 3805506 3734216 3367025 3408389 3492294 3553130 3164026 3261733 3150480 3582863
14065C582863j16868l63490J14576R6128k02671J10068k62779P5971J66002L828
$$ 3582863 3465995 3102505 3217081 3313209 3110538 3220606 2957827 3033798 3199800 3203628
14055C203628k92558j32161M74823o79864J69320J88592r4267j5659k9783q6090
$$ 3203628 2911070 2778909 3253732 2573868 2743188 2931780 2837513 2821854 2792071 2705981
14045B705981j67750J73613J65680n06047O7307K69669k01254J36316m08272J46977
$$ 2705981 2538231 2711844 2877524 2371477 2438784 2708453 2507199 2643515 2235243 2382220
14035B382220J37530k19029P0749r8135M82325m46116r3271K89028k40107L5584
$$ 2382220 2519750 2300721 2371470 2273335 2755660 2309544 2216273 2505301 2265194 2300778
14025B300778r5907J86965O67k67665l52241J34362J21690J07649k18083L94650
$$ 2300778 2204871 2391836 2392503 2124838 1772597 1906959 2028649 2136298 1918215 2312865
14015B312865n05803K35563k3042j43129o596K8001k42327L55038J99913l80497
$$ 2312865 1807062 2042625 2019583 1876454 1869858 1897859 1655532 2010570 2210483 1829986
14005A829986K17016j86993O1939m50270K57591J5673l45109L11254j37983o5364
$$ 1829986 2047002 1860009 1921948 1471678 1729269 1744942 1399833 1711087 1573104 1507740
13995A507740k26948K41183R2953L02273L72180K32041Q99314K711769P869183
$$ 1507740 1280792 1521975 1614928 1917201 2289381 2521422 3420736 6132505 14001688
13986A4001688J1727143Q023434q946555j1953193n331440k606095r85727q01064
$$ 14001688 25728831 33752265 24805710 12852517 7521077 4914982 3929255 3128191
13978C128191k19207l95996j20773L7759j98480q5927J52234j47449k17455j18878
$$ 3128191 2908984 2512988 2392215 2429974 2231494 2145567 2297801 2150352 1932897 1814019
13968A814019K85916l97728K28194r4022L8732k85459J34206L75469o02580K41542
$$ 1814019 2099935 1702207 1930401 1836379 1875111 1589652 1723858 2099327 1496747 1738289
13958A738289Q0372j59263k32065k77835L67789r3062J52719l82860J13805J28580
$$ 1738289 1818661 1659398 1427333 1149498 1517287 1424225 1576944 1194084 1307889 1436469
13948A436469O4200J53934P8270j77177l1838M6615J7028k95039Q0161p8190M9999
$$ 1436469 1500669 1654603 1732873 1555696 1523858 1570473 1587501 1292462 1372623 1294433 1344432
13937A344432J28926j9458l92397K25973j31535l3195J78041J70146p0293l2071
$$ 1344432 1473358 1453900 1061503 1287476 1155941 1122746 1300787 1470933 1400640 1368569
13927A368569k57687J09098J82260j79842q8269o7182J76107k09106L4701M30006
$$ 1368569 1110882 1219980 1402240 1222398 1134129 1066947 1243054 1033948 1068649 1498655
13917A498655m7646k27716j53556m8524J286j31452J25151K41603r6180O9233
$$ 1498655 1451009 1223293 1069737 1021213 1022499 891047 1016198 1257801 1161621 1230854
13907A230854l4462l32434J60733K04284R0877O0149k35261j35930j29309K25671
$$ 1230854 1196392 863958 1024691 1228975 1319852 1380001 1144740 1008810 879501 1105172
13897A105172k00261Q3139L9892Q8091Q1591m5746l86179J89807J66138m4968
$$ 1105172 904911 988050 1027942 1116033 1197624 1151878 765699 955506 1121644 1076676
13887A076676j74906o7852P8060J06107K639m3461J12628j61041M9602j52226
$$ 1076676 901770 833918 911978 1018085 1020724 977263 1089891 928850 978452 826226
13877H26226M07829k49640k83451M47501l58579K44411k30406j91610K96480j65399
$$ 826226 1234055 984415 700964 1148465 789886 1034297 803891 612281 908761 743362
13867G43362K87615l1107n1503j31761R1094L46977o5732k39574J17919j33858
$$ 743362 1030977 999870 948367 816606 907700 1254677 1188945 949371 1067290 933432
13857I33432K27941k09831j85653J94429k87817j9769o1467K80431l08717J37317
$$ 933432 1161373 951542 765889 960318 672501 652732 591265 871696 562979 700296
13847G00296Q9028R2292q9594M990o5235J09527k81288L93058m53593K31301k4674
$$ 700296 789324 881616 792022 797012 731777 841304 560016 953074 499481 730782 706108
13836G06108k05820M9707M27999l62639n212K01903j79183P1063K63707k36989
$$ 706108 500288 549995 977994 615355 610143 812046 632863 703926 967633 730644
13826G30644j86902K49299j43779J92134j82143J95719k50557r9878J97792L34730
$$ 730644 543742 793041 649262 841396 659253 854972 604415 504537 702329 1037059
13816A037059l62477P9065J28106l1472r6617Q9534p2028r4997q5631A58215L45666
$$ 1037059 674582 753647 881753 850281 753664 843198 771170 676173 590542 158215 503881
13805E03881p3876m2287J83658K62542j92657p4699J61583M4242j83939j3610
$$ 503881 430005 387718 571376 833918 641261 566562 728145 772387 588448 574838
13795E74838k17701K28284n6418k4145K94091k13812K34374l44412J21462q242
$$ 574838 357137 585421 529003 504858 798949 585137 819511 475099 596561 588319
13785E88319k58512J2813K05342O8776K08124B58418M17944k23680J35183l287
$$ 588319 329807 342620 547962 616738 824862 258418 676362 452682 587865 584578
13775E84578o3567P4172j12729j05184L04431m3753J87319m6267C05666J43245
$$ 584578 521011 595183 482454 377270 681701 637948 825267 779000 305666 448911
13765D48911K74480k17198K99975C53946J09409K83781j40883q2629J15898p7161
$$ 448911 723391 506193 806168 353946 463355 747136 606253 523624 639522 562361
13755E62361p1273J61270j70268j86995J96051J23941K7375A36130K40840A84324
$$ 562361 491088 652358 482090 295095 491146 615087 642462 136130 376970 184324
13744B89849k2831J82136A72891J22563n3772M56499l35911K79780J40263k94461
$$ 289849 267018 449154 172891 295454 241682 698181 362270 642050 782313 487852
13734D87852r1642n8805j2513M1016M4433m7055p5987M58148B55574L61955D3214
$$ 487852 396210 337405 324892 365908 410341 363286 287299 745447 255574 617529 43214
13722D70223J37786B60000L62918j24602J1188c889D96357k3822m4839n1624A14140
$$ 470223 608009 260000 622918 498316 509504 -3889 496357 472535 427696 376072 114140
13710C60752L2775K13571M2286g0589F36939j51296J40622j95099n415M03534
$$ 360752 393527 607098 649384 -70589 636939 485643 626265 431166 425751 829285
13700H29285B39064P7164K78784B22553a89021A20836L95296p9980O2866B18740
$$ 829285 239064 316228 595012 222553 -189021 120836 516132 436152 499018 218740
13689B90285J15021p3601N4302j53869e3016A41896M07838j97183Q4856p4140
$$ 290285 405306 331705 386007 232138 -53016 141896 549734 352551 437407 363267
13679C63267E6551J98508J61319r4146J198n4758L31026B46529m2862j6413Q1581
$$ 363267 56551 255059 416378 322232 323430 268672 599698 246529 203667 187254 268835
13668B68835J3644J36146q2814j10064R4416R0537k6880l2811I2473l3482J78379
$$ 268835 282479 418625 335811 225747 320163 410700 383820 351009 92473 58991 237370
13657B37370K77630B53124N6319r0093K14333J07513K5815B64230q300q6985M36815
$$ 237370 515000 253124 309443 219350 433683 541196 567011 264230 255930 168945 605760
13646F05760k12684A07558K91008Q3958j6863R1450p3232J2651F9265J07847L45885
$$ 605760 393076 107558 398566 482524 465661 557111 483879 496530 69265 177112 522997
13635E22997B24706A12308J73892J68693r4236q5229A13791J57922J35968I0420
$$ 522997 224706 112308 286200 454893 360657 275428 113791 271713 407681 90420
13624A52252K13346A14835C5422M82613k5184A31808o2534J48977K19984H8281
$$ 152252 365598 114835 35422 518035 492851 131808 69274 218251 438235 88281
13613A29520J89421p9758n3345M8631O1526I9412K00016j31899O1069J18645j56296
$$ 129520 318941 239183 185838 234469 295995 99412 299428 167529 228598 347243 190947
13602A90947J879K04112n5638j42086L5720J48044j24683r4736K48478j37416
$$ 190947 192826 396938 341300 199214 234934 382978 258295 163559 412037 274621
13592B74621J05468r3175N1797m0160j46347k2951L05401A33084J36542a8034
$$ 274621 380089 286914 338711 298551 152204 129253 434654 133084 269626 -18034
13581E01421B08791J22256a00611D58470j10154J9863B362L05465J11635a16774
$$ 501421 208791 331047 -100611 458470 348316 368179 2362 307827 419462 -116774
13570a30354C07673q8341q9495L9989j6085k4067L63149A37903a02300j3909C26432
$$ -130354 307673 219332 129837 169826 153741 129674 492823 137903 -102300 -116209 326432
13558D57447k25746J07514M6767j49760N18867B20600Q0154o742J46825C6196
$$ 457447 231701 339215 385982 236222 755089 220600 300754 294012 440837 36196
13547E8229J51913J54118g4646B98602j47080J0280E5909M41482b9380D8906K25441
$$ 58229 210142 364260 -74646 298602 151522 161802 55909 497391 -29380 48906 274347
13536B74347Q5468j58041I4494L20689A25139P4987M5587L24274G9105M78603
$$ 274347 359815 201774 94494 415183 125139 200126 245713 569987 79105 557708
13526E57708j37711I241K64155J95053B20161l421L1184R6130e7121F6280K77548
$$ 557708 419997 9241 273396 468449 220161 216740 247924 344054 -57121 66280 343828
13515C43828j03304L092j5927J5471J1307M8577g3336C37918k8379G4555K23423
$$ 343828 240524 243616 227689 243160 254467 303044 -73336 337918 309539 74555 297978
13504B97978j19040J98992j45685r9515O0037R8859A40285K9895O1993B7091c3626
$$ 297978 178938 377930 232245 132730 192767 291626 140285 170180 232173 27091 -33626
13492C88192A48511J21705L8980F3134a06939i686G4569e2111C31244A50014K02700
$$ 388192 148511 270216 309196 63134 -106939 -9686 74569 -52111 331244 150014 352714
13481C52714A09306a75098b7206A92389L6960Q0322a31225c9544A61846A9186
$$ 352714 109306 -175098 -27206 192389 229349 309671 -131225 -39544 161846 19186
13470E39422A33683D3591P4330J32258r10D4367a80485A22674M8116C2713R523
$$ 539422 133683 43591 117921 250179 249269 44367 -180485 122674 170790 32713 42236
13459D2236d1166B46149F1409a03886D87097j52437L6113J13638d2263B78398
$$ 42236 -41166 246149 61409 -103886 487097 334660 370773 484411 -42263 278398
13448A91398Q8593j10760N5018j05656L85762B37496G7446K51768f2986A09412
$$ 191398 279991 169231 224249 118593 504355 237496 77446 329214 -62986 109412
13437D26512j39056l0011j1709h5163j54932A33089J1258E0839K38882C1626J803
$$ 426512 287456 257445 245736 -85163 -240095 133089 144347 50839 289721 31626 33429
13426C3429b5706E328a59838A0643J84463g9939A25123L3110e3070B87537f852
$$ 33429 -25706 5328 -159838 10643 195106 -79939 125123 158233 -53070 287537 -6852
13414B09079r1940J12983m3013l6263g4619j47515K5101A8957J55349J76392E6237
$$ 209079 117139 230122 187109 150846 -74619 -222134 -197033 18957 174306 350698 56237
13402D0603L50185a2402H5189b1115A83957f9468C06238N6705E9759h82A83707
$$ 40603 390788 -12402 85189 -21115 183957 -69468 306238 362943 59759 -882 183707
13390E559J90661d1548A51330G3542Q0545l3080J07208H6852h9513H1800C396
$$ 5559 196220 -41548 151330 73542 154087 121007 228215 86852 -89513 81800 3396
13378E5419K84271q8352j9946o3865J49097H2325J4279B9655K63354j00508o257
$$ 55419 339690 251338 231392 167527 316624 82325 96604 29655 293009 192501 186244
13367A86244F3660L0750J18839M5879a29056q8645D97231A78671m6693C8206J55175
$$ 186244 63660 94410 213249 259128 -129056 -217701 497231 178671 131978 38206 193381
13356A93381q7392a50871B76988m0628j13989J0735J12176b42186B06797o0889
$$ 193381 105989 -150871 276988 236360 122371 133106 245282 -242186 206797 145908
13346A45908J24423M269A16203O7277M21105a40333B77910j06419K57449m7760
$$ 145908 270331 274600 116203 183480 604585 -140333 277910 171491 428940 381180
13336C81180j08043K5222J58193k03370P5387k6417j48871a02649C70922A69916
$$ 381180 273137 298359 456552 253182 328569 302152 153281 -102649 370922 169916
13325g1481F9230J82630k3219p3402K77043A25394m3392L1748R4313G2497L34537
$$ -71481 69230 251860 228641 155239 432282 125394 82002 113750 208063 72497 407034
13314D07034j04710A25774a44722D05167A07486A7338L478a4137A09622g7303
$$ 407034 302324 125774 -144722 405167 107486 17338 20816 -14137 109622 -77303
13303E0467M7215J13711N7269a50437A65566K67643j33105H3216J63361D0743
$$ 50467 97682 211393 268662 -150437 165566 433209 300104 83216 246577 40743
13292h958k7760E6140R088j8921Q919J73779a2017D03760j63611B0961J80373
$$ -8958 -36718 56140 65228 46307 55226 229005 -12017 403760 240149 20961 201334
13281B01334r6496f9140B32600b95456F7971J29757j8011k017C7867a792j17628
$$ 201334 104838 -69140 232600 -295456 67971 197728 179717 177700 37867 -1792 -119420
13270a19420e9547A69723C7385Q1567a20055A38028F1047J05786c6116G1398J64779
$$ -119420 -59547 169723 37385 118952 -120055 138028 61047 166833 -36116 71398 236177
13259B36177q3113K28637C8831J00810a50914e3811B65321a57454L3781A35987
$$ 236177 153064 381701 38831 139641 -150914 -53811 265321 -157454 -123673 135987
13248B3633M23290A27978N2408E9810l610M5040e5210q7432q2547B4041a62144
$$ 23633 446923 127978 180386 59810 56200 101240 -55210 -142642 -225189 24041 -162144
13236C67895o6490c6349E0325K51949b87629B94496A34613C6215N651J55446b34601
$$ 367895 301405 -36349 50325 302274 -287629 294496 134613 36215 41866 197312 -234601
13224C34992b8949F5896K56195A3947J39407o3698g2048B36308A14286g6104j36661
$$ 334992 -28949 65896 322091 13947 153354 89656 -72048 236308 114286 -76104 -212765
13213b12765f3931j3419j31287b0354C1804J17124a61615l56306H7450A3009N5318
$$ -212765 -63931 -77350 -208637 -20354 31804 148928 -161615 -517921 87450 13009 68327
13202F8327d9122G8649K16961j7026o1277c2563D2096a02263H1551M631Q464J56933
$$ 68327 -49122 78649 295610 278584 217307 -32563 42096 -102263 81551 86182 94646 251579
13190B51579E9817d2833j26447B4251b2442o7323A2611h8463H8618J31634J3234
$$ 251579 59817 -42833 -169280 24251 -22442 -89765 12611 -88463 88618 220252 233486
13179B33486J08937A43936J42972G2407l5804c3047m0617B54810j24877o0949
$$ 233486 342423 143936 286908 72407 36603 -33047 -73664 254810 129933 68984
13169F8984a3680C05572C5965K04355a48352B81756m1221L76465a55646p2690
$$ 68984 -13680 305572 35965 240320 -148352 281756 240535 617000 -155646 -228336
13159b28336N6372F3500J25132a63699A24151F0750O3958a51024E8934N4089C7063
$$ -228336 -171964 63500 188632 -163699 124151 60750 124708 -151024 58934 113023 37063
13147d0156o0042I6009K28663f6894A11190a9616B60090N0575i8039C70763A81728
$$ -40156 -100198 96009 324672 -66894 111190 -19616 260090 310665 -98039 370763 181728
13135h3482r3619C1300K1050N3691m3223a62142F3827J09025b29415B87454j36178
$$ -83482 -177101 31300 52350 106041 62818 -162142 63827 172852 -229415 287454 151276
13124A51276a98712O7423G4437e8341A23602B8393J12881J0223a91181A63618
$$ 151276 -198712 -131289 74437 -58341 123602 28393 141274 151497 -191181 163618
13113B0609h4482j08370P2761A60255o1829b66290M2499C34866c19968A75503
$$ 20609 -84482 -192852 -120091 160255 98426 -266290 -223791 334866 -319968 175503
13102A47353J44751A17728k92d2680E0743K21140C896g8418J7487O68H7J04014
$$ 147353 292104 117728 117436 -42680 50743 271883 3896 -78418 -60931 -60263 87 104101
13090A04101c9432E7929b94653d9810G8613j1306b2387E9653L6851b5522o266
$$ 104101 -39432 57929 -294653 -49810 78613 67307 -22387 59653 96504 -25522 -31788
13079c1788C16893a59175A53438n3660J32286O3104A18408m8630L30667A37556
$$ -31788 316893 -159175 153438 99778 232064 295168 118408 69778 400445 137556
13068d02430a50074C96927H5101a25126A86659o5632O4769Q2706r3669a77019
$$ -402430 -150074 396927 85101 -125126 186659 121027 185796 268502 174833 -177019
13057A10442B7594f6226E3096J75083j06857A7917L43826A03269a24766A00289
$$ 110442 27594 -66226 53096 228179 121322 17917 361743 103269 -124766 100289
13046E630L055J31561n0592b14613k9546F3446A8603a08286d4636k09557A08737
$$ 5630 8685 140246 89654 -214613 -244159 63446 18603 -108286 -44636 -254193 108737
13034G1097R9387q2124J49645n4469K3091a22563E8801a1141D0955a12151B77058
$$ 71097 170484 88360 238005 183536 206627 -122563 58801 -11141 40955 -112151 277058
13022B98216A19794G996a1210p6383A05786m5833b04556g9582B28536F4076J16779
$$ 298216 119794 7996 -11210 -87593 105786 59953 -204556 -79582 228536 64076 180855
13011A80855J9151a36968H1288b41725A49006k0677L0526a66349n3330m8267h463
$$ 180855 200006 -136968 81288 -241725 149006 128329 158855 -166349 -219679 -267946 -8463
12999h0367A9026b2865A44551a08184A62728F2042a15577E11293a18399a3355
$$ -80367 19026 -22865 144551 -108184 162728 62042 -115577 511293 -118399 -13355
12988B90588A9658J53369a994B19051j5080f1081D6213J63074j03819f4992J1506
$$ 290588 19658 173027 -1994 219051 203971 -61081 46213 209287 105468 -64992 -53486
12977e3486I6549K0942n5740J0153P5584D3535K6910K0389c68908a72651H1905
$$ -53486 96549 117491 61751 71904 147488 43535 70445 90834 -368908 -172651 81905
12965b3858l8391B98742j26854b05333h6098j4431E5786a69160H8094J00312e1344
$$ -23858 -62249 298742 171888 -205333 -86098 -100529 55786 -169160 88094 188406 -51344
12953d58644C37218D5884b48140A83611b31210K4315b7575B55155J53833A37974
$$ -458644 337218 45884 -248140 183611 -231210 -206895 -27575 255155 408988 137974
12942B70176b9071a1771j3129E3106b35005A50963F2717N4843j4995e3674F3499
$$ 270176 -29071 -11771 -24900 53106 -235005 150963 62717 117560 102565 -53674 63499
12930c62058B59676b4042n7931a8715k61955B66021A24809E6475P7487J81896
$$ -362058 259676 -24042 -81973 -18715 -280670 266021 124809 56475 133962 315858
12920C15858C2235J64453g7889o3586B81504H4403A213J95497R5886F2776K28752
$$ 315858 32235 196688 -77889 -141475 281504 84403 1213 196710 292596 62776 291528
12909B91528b6434A93781f6665A54219m9217h7971k08109A19543n1087j1952f5318
$$ 291528 -26434 193781 -66665 154219 105002 -87971 -296080 119543 68456 56504 -65318
12897a06933j21459c8829A23298h1090J6144k97074B4077a33424j4983k7998p0675
$$ -106933 -228392 -38829 123298 -81090 -64946 -362020 24077 -133424 -148407 -176405 -247080
12886b47080B57126A07335K82291b48174Q0259B22771q8391Q4665b09385g1142
$$ -247080 257126 107335 389626 -248174 -167915 222771 134380 219045 -209385 -71142
12875G2774K56392f0023o464D11393a52916j0234M608A02964c5498j4078B5135
$$ 72774 329166 -60023 -66487 411393 -152916 -163150 -158542 102964 -35498 -49576 25135
12863a93288A23357b2274B2422e4460j05182C4507a20076k22340d2192p5704C24668
$$ -193288 123357 -22274 22422 -54460 -159642 34507 -120076 -342416 -42192 -117896 324668
12851A2519b64955b6900B46585j02946g8424A02272D8938B4398J47763L8796C5596
$$ 12519 -264955 -26900 246585 143639 -78424 102272 48938 24398 172161 210957 35596
12839a62220A17960h5067A14803g5702C40966A05735m5768b81650R0161B03465
$$ -162220 117960 -85067 114803 -75702 340966 105735 59967 -281650 -191489 203465
12828a1102j28318q2789a04728L8268D2279F023L85665b53794C5190K72807h5921
$$ -11102 -139420 -222209 -104728 -66460 42279 6023 391688 -253794 35190 307997 -85921
12816G2708a13241j08086B69110a13891C06875e3353D3379F349a21919b7026j09022
$$ 72708 -113241 -221327 269110 -113891 306875 -53353 43379 6349 -121919 -27026 -136048
12805a36048A63220n0895a23375d4319A13273c1901j64889G2584c7677C03312
$$ -136048 163220 112325 -123375 -44319 113273 -31901 -196790 72584 -37677 303312
12794a01916j24321A36472a28328A70970m6008b32834J12544n8912p075A20602
$$ -101916 -226237 136472 -128328 170970 124962 -232834 -120290 -179202 -186277 120602
12783b6231A54538d3742A99796b38117h4030k60720a28938N8140j66862B58527
$$ -26231 154538 -43742 199796 -238117 -84030 -344750 -128938 -70798 -237660 258527
12772D00227b12560D23910F5543J40012I6960a36708J496A15300b74172M3824
$$ 400227 -212560 423910 65543 205555 96960 -136708 -135212 115300 -274172 -230348
12762b30348A52855e2377k5286C10569a63864j19330p838B52804q4200n2650b61627
$$ -230348 152855 -52377 -77663 310569 -163864 -283194 -291032 252804 168604 115954 -261627
12750i3731J3085D9383e1069m769k33128G5116o048L90051b7834k22263F7536
$$ -93731 -80646 49383 -51069 -55838 -288966 75116 69068 459119 -27834 -250097 67536
12738A6972J0243Q855b2036B40601r7041i4865B48883J45818f5910D0166K40367
$$ 16972 27215 36070 -22036 240601 143560 -94865 248883 394701 -65910 40166 280533
12727B80533N4695j36430I4486e8377A47217o9203a31950J9265k1733A47775J8692
$$ 280533 335228 198798 94486 -58377 147217 78014 -131950 -112685 -134418 147775 166467
12716A66467j5693E8431J88152b09253C3303Q2978J55178j09491M5806M4038d5090
$$ 166467 150774 58431 246583 -209253 33303 116281 271459 161968 207774 251812 -45090
12704A68719J14898l0482K7150A05364K54880H0446K45792F7921d332A649L01065
$$ 168719 283617 253135 280285 105364 360244 80446 326238 67921 -4332 1649 302714
12693C02714b56276f2200C02945c0600k11952A96432i073j1762r7172d5063C39298
$$ 302714 -256276 -62200 302945 -30600 -242552 196432 -9073 -20835 -118007 -45063 339298
12681A37688j9682D2245c33577C23323A8840L2446O32623b13176D40529A91721
$$ 137688 118006 42245 -333577 323323 18840 51286 683909 -213176 440529 191721
12670A50210a43833a9718B8189J29122B2838a60299A25427b0534A71433L85063
$$ 150210 -143833 -19718 28189 157311 22838 -160299 125427 -20534 171433 556496
12660E56496i6518B81499a59533a238B92136M57560A9067J55815h9758C03978
$$ 556496 -96518 281499 -159533 -1238 292136 749696 19067 174882 -89758 303978
12649i1612D1935O6442R3644b33959e9343j5236j52420B09425m7816l3242a14054
$$ -91612 41935 108377 202021 -233959 -59343 -74579 -226999 209425 161609 128367 -114054
12637b4148C0821b97700F3729a81365a6244C3531K53278J29265b7445C58222G6398
$$ -24148 30821 -297700 63729 -181365 -16244 33531 286809 416074 -27445 358222 76398
12625C25600H3410b5835B43024G9864R2496A011K41365J8521e5088H4427R8552
$$ 325600 83410 -25835 243024 79864 172360 1011 242376 260897 -55088 84427 182979
12614A82979h6431A01302a2297M975k80759D5157O746j9019a41981b9186j24197
$$ 182979 -86431 101302 -12297 -7322 -288081 45157 51903 32884 -141981 -29186 -153383
12603a53383A24582C4075a17247D32949k06424J8969J2775c3456C20809b91311
$$ -153383 124582 34075 -117247 432949 226525 245494 258269 -33456 320809 -291311
12592i1332C17131H3379i3591d6223H5005a69931L7851C3134K0438K25118a43887
$$ -91332 317131 83379 -93591 -46223 85005 -169931 -132080 33134 53572 278690 -143887
12580c6513o5079b1879A78444C754K75804A8185a34329n4853h2271B10492h3245
$$ -36513 -101592 -21879 178444 3754 279558 18185 -134329 -189182 -82271 210492 -83245
12568E0523b014j13177B82115r0674a67543e0443j98070b4558B1832c41409a61863
$$ 50523 -2014 -115191 282115 191441 -167543 -50443 -248513 -24558 21832 -341409 -161863
12556I0884J31590j03874N231c07012i4186l5478C4085J2875J20833F0193b53611
$$ 90884 222474 118600 123831 -307012 -94186 -129664 34085 46960 167793 60193 -253611
12544f7658j14933C79690a04235B45319b8877j13020I227a119C7085a27610K1378
$$ -67658 -182591 379690 -104235 245319 -28877 -141897 9227 -1119 37085 -127610 -106232
12533a06232a9068j58148k67328A79237O6746K8355L3603b9398l2403a9302C80540
$$ -106232 -19068 -177216 -444544 179237 245983 274338 307941 -29398 -61801 -19302 380540
12521e9687l80014a000A22168k5690L29428b65418A36277n9542b80325a00456
$$ -59687 -439701 -1000 122168 96478 425906 -265418 136277 76735 -280325 -100456
12510f3192k7595A68350C0165E29c47663A747K33292J88472i387D0931a59048
$$ -63192 -90787 168350 30165 529 -347663 1747 235039 423511 -9387 40931 -159048
12498a02831A19896f9243H5912A734d4655o373n5003k51968g5667C20850D7435
$$ -102831 119896 -69243 85912 1734 -44655 -51028 -106031 -357999 -75667 320850 47435
12486A01817C0015a31885j05292l9563Q2729g4191B97744b67845B6931h8415j87960
$$ 101817 30015 -131885 -237177 -276740 -194011 -74191 297744 -267845 26931 -88415 -276375
12475b76375g6927A11647J03494c6457G8746a50136A2232R6304b6359a1308K27
$$ -276375 -76927 111647 215141 -36457 78746 -150136 12232 108536 -26359 -11308 -11081
12464a1081B38249a96827O2105c92k52513C8639c5957q6084N8280b90j46821j76874
$$ -11081 238249 -196827 -134722 -392 -252905 38639 -35957 -122041 -63761 -290 -147111 -323985
12452c23985l9329B00332R7576a29836C6155J22870a96801c7940j88057e1148
$$ -323985 -363314 200332 297908 -129836 36155 159025 -196801 -37940 -225997 -51148
12441C11794q7175a07351j6914r0060H0846a09490d7312r5141I123K38612A5577
$$ 311794 224619 -107351 -124265 -214325 80846 -109490 -47312 -142453 9123 247735 15577
12429a07505A46885r552a2377A46838h6674C89454j66565c9736C4634b74786a17789
$$ -107505 146885 137333 -12377 146838 -86674 389454 222889 -39736 34634 -274786 -117789
12417a25394O095c8095A69960n3119j3229j4897f160E5980b10905h4704A05304
$$ -125394 -119299 -38095 169960 116841 103612 88715 -6160 55980 -210905 -84704 105304
12405c04330A33305J27366e0182a6810B66801H4363i8560n4818b0368r9186H687
$$ -304330 133305 260671 -50182 -16810 266801 84363 -98560 -153378 -20368 -119554 8687
12393a73719A24900b52242P197A7280b35612b8658r1812k17558J56215A74864
$$ -173719 124900 -252242 -245045 17280 -235612 -28658 -120470 -338028 -181813 174864
12382C73168H857b95004d8424n1196A33734a06480M340E5794a70339C9600K43515
$$ 373168 8857 -295004 -48424 -99620 133734 -106480 -102140 55794 -170339 39600 283115
12371B83115h5846a8460L953q2291A80132a94945Q5845D8283a41247A0753f83486
$$ 283115 -85846 -18460 -14507 -96798 180132 -194945 -109100 48283 -141247 10753 -683486
12359a8998j33752O2494b6341B36618b40321A64934J28201J0910E4596j5823K23438
$$ -18998 -152750 -90256 -26341 236618 -240321 164934 293135 304045 54596 38773 262211
12348B62211b4050C76345A13604a59963f7766q1066A23739i4040n903B55046C9628
$$ 262211 -24050 376345 113604 -159963 -67766 -148832 123739 -94040 -99943 255046 39628
12336E4041b13987f7345j97195A83862H7J48871l5203m0987c41234b7591F3354
$$ 54041 -213987 -67345 -264540 183862 87 148958 113755 72768 -341234 -27591 63354
12324f2870A811N1050b52876j76244I0092a81508j03325H485J25399j7587n3789
$$ -62870 1811 52861 -252876 -429120 90092 -181508 -284833 8485 133884 116297 62508
12313F2508a99958k69435A22651h6896A81298g2883A39593a10139B6372K84017
$$ 62508 -199958 -469393 122651 -86896 181298 -72883 139593 -110139 26372 310389
12303C10389i2825o3763D5443K12749j25456P3967G9341b26920g4747j350l8323
$$ 310389 -92825 -156588 45443 258192 132736 206703 79341 -226920 -74747 -76097 -114420
12292a14420A78866f9729A59671o3059i0781q6340j50303A75647b9635j58968
$$ -114420 178866 -69729 159671 96612 -90781 -177121 -327424 175647 -29635 -188603
12282a88603E8876J80198C4595L7391b94648f0011n3863A18442e0473C31472L0
$$ -188603 58876 239074 34595 71986 -294648 -60011 -113874 118442 -50473 331472 331502
12271C31502r5721A885J34475Q0393p9744a35180D9313d7663A33128h4347A62131
$$ 331502 235781 1885 136360 216753 137009 -135180 49313 -47663 133128 -84347 162131
12259E8542J7931J48577G0713e7667A33462A2242O224Q4308k7422q306J7897M37527
$$ 58542 76473 225050 70713 -57667 133462 12242 18466 102774 75352 67046 84943 522470
12247E22470E8068P0031c52812A90062m0538q099b5567B0679b01094e531A32650
$$ 522470 58068 128099 -352812 190062 149524 141425 -25567 20679 -201094 -5531 132650
12235B79698g7449k95987A08287b3301r6132I4035Q7988J84887h6096D31621j65455
$$ 279698 -77449 -373436 108287 -23301 -119433 94035 182023 366910 -86096 431621 266166
12224B66166E2879j4173K81779q4177d1120G4184J90522a94087c5179C8224h9414
$$ 266166 52879 38706 320485 236308 -41120 74184 264706 -194087 -35179 38224 -89414
12212D27418a4261E7433K16386p4765I8741f4348A66281J60955A57880J44118
$$ 427418 -14261 57433 273819 199054 98741 -64348 166281 327236 157880 301998
12202C01998A17810J85986G5821R892B4811Q4076J57578o1277j02552L48453r2637
$$ 301998 117810 303796 75821 85713 24811 108887 266465 205188 102636 451089 358452
12191C58452j77895M4846e9888n1445l7318B30807l9505n9854Q3232b52746A43842
$$ 358452 180557 225403 -59888 -111333 -148651 230807 191302 131448 214680 -252746 143842
12179D39041G6310K39962n6619C8603K43449N1121G1916J5414Q3558F4893a28873
$$ 439041 76310 316272 259653 38603 282052 333173 71916 87330 170888 64893 -128873
12167B16777I9253Q924e5163F8296O5092m0082h8544K673j73386B40607c5424
$$ 216777 99253 108177 -55163 68296 133388 93306 -88544 -85871 -259257 240607 -35424
12155d4501j24907I7679d04440B7628M1226a41344L7288c0339G7476h5112M1711
$$ -44501 -169408 97679 -404440 27628 68854 -141344 -104056 -30339 77476 -85112 -43401
12144d3401j07809l7705A38644a04347j76085g8430B76121i6481j70253G9329
$$ -43401 -151210 -188915 138644 -104347 -280432 -78430 276121 -96481 -266734 79329
12133a94280M8916j9786m1838B02093J65247A17816h5415j53134j48806B80946
$$ -194280 -145364 -165150 -206988 202093 367340 117816 -85415 -238549 -387355 280946
12122G5014D043L2744c7324A13521d2540J38O519j01779A81898b6898m1742j27865
$$ 75014 4043 36787 -37324 113521 -42540 -42402 -35883 -137662 181898 -26898 -68640 -196505
12110a96505A4021M0536J4781O7675a18500A81367a14754B65356j02928K8389
$$ -196505 14021 54557 69338 137013 -118500 181367 -114754 265356 162428 190817
12100A90817M0060j6095o3846h5063p0103C4080i9574B08499F0167L6168a00524
$$ 190817 230877 214782 150936 -85063 -155166 34080 -99574 208499 60167 96335 -100524
12088B65553f2118G485b66035A66537b36343I140O0307b24854j65394a4481G0540
$$ 265553 -62118 7485 -266035 166537 -236343 9140 69447 -224854 -390248 -14481 70540
12076A7928a25102m05918a98886A53923a1669E20866M61484K96732m26450l14836
$$ 17928 -125102 -531020 -198886 153923 -11669 520866 982350 1279082 852632 537796
12066E37796G4699a36957B40605Q0048a06325o0377e4792J7359j96042p2813A23148
$$ 537796 74699 -136957 240605 320653 -106325 -166702 -54792 -37433 -233475 -306288 123148
12054C02222A34712a87429A71085j8723b7685H5203a26978E7771J31922a44190
$$ 302222 134712 -187429 171085 152362 -27685 85203 -126978 57771 189693 -144190
12043a04604B50539E0796J32803H5933N636a46479A80202o355Q9211G9690B1777
$$ -104604 250539 50796 183599 85933 91569 -146479 180202 173847 263058 79690 21777
12031i3256j91364Q2337R0392A15516h7525M085L396I5820a31512k88544B28053
$$ -93256 -284620 -202283 -111891 115516 -87525 -83440 -80044 95820 -131512 -420056 228053
12019A33941l9754B1157J39674j5748a57311A02437m5801N0380A6387J52756J53695
$$ 133941 94187 21157 160831 145083 -157311 102437 56636 107016 16387 169143 322838
12008C22838f5660E6877J94214I2642b20158e8376A27265L8195b5153l16197J37598
$$ 322838 -65660 56877 251091 92642 -220158 -58376 127265 165460 -25153 -341350 -203752
11997b03752e8686R320H3523R2415f0G5142b39957A45729B7645a64350D6103c53524
$$ -203752 -58686 -49366 83523 175938 -60 75142 -239957 145729 27645 -164350 46103 -353524
11984c1001A80202b7912n4175Q07H2795J8975a53878F9855D308J22277J91112
$$ -31001 180202 -27912 -82087 -81280 82795 101770 -153878 69855 4308 126585 317697
11973C17697F6789b78069a19565e0303k68571J11136P9197c3415l5626j61404
$$ 317697 66789 -278069 -119565 -50303 -318874 -207738 -128541 -33415 -69041 -230445
11963b30445Q8985c5432k5024j6572I4729a42819K0300j51769C5170N9816C6508
$$ -230445 -141460 -35432 -60456 -77028 94729 -142819 -122519 -274288 35170 94986 36508
11951a25789C6713c9051B30879K8212g2963L701B95651E1658b0041D63b81444
$$ -125789 36713 -39051 230879 259091 -72963 -69262 295651 51658 -20041 463 -281444
11939a52059a2834C1419O5109a72645f538A02063Q3748b19007O6209D7965b68446
$$ -152059 -12834 31419 96528 -172645 -6538 102063 185811 -219007 -152798 47965 -268446
11927A6236J65137q1473l1897j6560a72865c1342a0907E0127e3345k25869a3316
$$ 16236 181373 99900 68003 51443 -172865 -31342 -10907 50127 -53345 -279214 -13316
11915A1010a3523k03053c2585l2192l3222d7262k95378a56025L7195A33282d05334
$$ 11010 -13523 -216576 -32585 -64777 -97999 -47262 -342640 -156025 -118830 133282 -405334
11903D5196J06792M9667I3941h2766j5500j06106K6532j21120B142a35490e2554
$$ 45196 151988 201655 93941 -82766 -98266 -204372 -177840 -298960 2142 -135490 -52554
11891b38558B9846b16640G1626Q7460a64266C7629q985e3575A48995a39852A14285
$$ -238558 29846 -216640 71626 159086 -164266 37629 28644 -53575 148995 -139852 114285
11879C27K9414M9226a98763C341d5596A34501J25843d93098A0645a91673d4581
$$ 327 29741 78967 -198763 3341 -45596 134501 260344 -493098 10645 -191673 -44581
11867A63342l6160c6870k33123A48141a02537o3814l41458a74727c4562k58153
$$ 163342 127182 -36870 -269993 148141 -102537 -166351 -507809 -174727 -34562 -292715
11857b92715K7143B27995c64067A29826b3263G8136b0935A3402a73425g8131a8558
$$ -292715 -265572 227995 -364067 129826 -23263 78136 -20935 13402 -173425 -78131 -18558
11845A89405a27647O1078m7152A06971g4431E0457c97694J72630P7113j00744
$$ 189405 -127647 -66569 -113721 106971 -74431 50457 -397694 -225064 -147951 -248695
11835b48695i2561a3112k33890A73316b78654G9592A2603b01854A66766C787L5383
$$ -248695 -92561 -13112 -247002 173316 -278654 79592 12603 -201854 166766 3787 39170
11824C9170a23618A38224D9029J40586a8048A05223a30020n2186A1074b25879
$$ 39170 -123618 138224 49029 189615 -18048 105223 -130020 -182206 11074 -225879
11813b93775D633K01046a62339g4525C26122A38192L7677b31883a9442j62061
$$ -293775 4633 205679 -162339 -74525 326122 138192 175869 -231883 -19442 -181503
11803a81503B77178j08200G3696g719j04357C24654c32563i277E9080J48964E6993
$$ -181503 277178 168978 73696 -7719 -112076 324654 -332563 -9277 59080 208044 56993
11791A79269B7262Q3789c9113B95762a49456E9803B3950g7288A55513l8662P7270
$$ 179269 27262 111051 -39113 295762 -149456 59803 23950 -77288 155513 116851 194121
11780A94121b09703j09446C88736A64880a66249g8863I5350L02616b28046c3310
$$ 194121 -209703 -319149 388736 164880 -166249 -78863 95350 397966 -228046 -33310
11769c44607a32253C1088a40540a3201F5925a01298H0150c05486D980b5013j24554
$$ -344607 -132253 31088 -140540 -13201 65925 -101298 80150 -305486 4980 -25013 -149567
11758a49567C86440J6207G5999J50977a28212H5920f3794n9644b8295I814M38652
$$ -149567 386440 402647 75999 226976 -128212 85920 -63794 -123438 -28295 9814 448466
11747D48466C4920a01728b6068A67787b02781A93090b02145A97741d23547b3163
$$ 448466 34920 -101728 -26068 167787 -202781 193090 -202145 197741 -423547 -23163
11736A29458i3974c123C4053L50077g0m9450H3964D1502q301b43509F9614d7212
$$ 129458 -93974 -3123 34053 384130 -70 -49520 83964 41502 33201 -243509 69614 -47212
11723H1643a42571d1079A61694J4077J31773I2109j2370c1326l4122A9276a34218
$$ 81643 -142571 -41079 161694 175771 307544 92109 79739 -31326 -65448 19276 -134218
11711A78374D9759K5101c8484l32631h5126j05914K4366B37799f9649H6596J08251
$$ 178374 49759 74860 -38484 -371115 -85126 -191040 -166674 237799 -69649 86596 194847
11700A94847n4496E0641h388B76793A28324E4933f9286j3837i331l0863o6633
$$ 194847 140351 50641 -8388 276793 128324 54933 -69286 -83123 -9331 -40194 -106827
11689a06827B69914a33678D2491a26306D9391A8841e7863B73660d46110K14709
$$ -106827 269914 -133678 42491 -126306 49391 18841 -57863 273660 -446110 -231401
11679b31401e9606A83317M2635g5235A1590J675J75734J55576e4629q737q6630
$$ -231401 -59606 183317 225952 -75235 11590 13265 188999 344575 -54629 -63366 -149996
11668a49996N9161a2634l79231B6739J19821n5935B3022J11687c967A38544J42871
$$ -149996 -90835 -12634 -391865 26739 146560 90625 23022 134709 -3967 138544 281415
11657B81415q915D9955b10640k68518K13851J15982l6586M4946A19023a50817
$$ 281415 272500 49955 -210640 -479158 -265307 -149325 -185911 -140965 119023 -150817
11646B25737a05073A27777D8942a9085D5286h2285k27530J16081P2786J7305A81189
$$ 225737 -105073 127777 48942 -19085 45286 -82285 -309815 -193734 -120948 -103643 181189
11634e0680A2740AJ93251a67869g4073E38638a88823A28098g2111J5383A38692
$$ -50680 12740 1 193252 -167869 -74073 538638 -188823 128098 -72111 -56728 138692
11622D99114b38204A32807C607b54460A60968k1921a79046B7172b4845a0690k64147
$$ 499114 -238204 132807 3607 -254460 160968 139047 -179046 27172 -24845 -10690 -274837
11611b74837g9626G2011K31231a11688j08901G9449f7377K9456D53225G1435f8735
$$ -274837 -79626 72011 303242 -111688 -220589 79449 -67377 -37921 453225 71435 -68735
11599i1747l2250G9384a36880B63087e8533A21457a40745O7758C15133a01167
$$ -91747 -123997 79384 -136880 263087 -58533 121457 -140745 -72987 315133 -101167
11588A53109a45239A14613J38284P1365f3154B4375n446C107P1452b90242O5026
$$ 153109 -145239 114613 252897 324262 -63154 24375 18929 3107 74559 -290242 -225216
11577b25216B05832o8595d3524j05151A30234l4686d7739B2406P0825d15203A5778
$$ -225216 205832 137237 -43524 -148675 130234 95548 -47739 22406 93231 -415203 15778
11565B41099B5661a06070E16569h068C14129j44578c74116a59689I9576a73649
$$ 241099 25661 -106070 516569 -8068 314129 169551 -374116 -159689 99576 -173649
11554a8425B20580a71306B43136E8022q262a53043c5653j71021f4430q160B05567
$$ -18425 220580 -171306 243136 58022 49760 -153043 -35653 -206674 -64430 -72590 205567
11542d8322B89200b9687H5335K02262A24969E1244a8755j18485B12780D2626J35429
$$ -48322 289200 -29687 85335 287597 124969 51244 -18755 -137240 212780 42626 178055
11531A78055J13098j1593e6242G0805I6K5433a98383k9392H082a82680a7485B95808
$$ 178055 291153 279560 -56242 70805 96 25529 -198383 -227775 8082 -182680 -17485 295808
11518a28526B44946j15809E7415R058K57297A697K2643N8863K2865e8307j5921
$$ -128526 244946 129137 57415 66473 323770 1697 24340 83203 106068 -58307 -74228
11507g4228q840B26665b2758G9465J41510a02590b8941C8969h4651B60313c0748
$$ -74228 -83068 226665 -22758 79465 220975 -102590 -28941 38969 -84651 260313 -30748
11495B48669C7346L5762L05715B884M9617J6406J99648j20711k5818d72B54646
$$ 248669 37346 73108 378823 2884 52501 68907 268555 147844 122026 -472 254646
11483B62989a76675B48773j2160L7802A8523J33079k6867J35697J9438f2606m1924
$$ 262989 -176675 248773 236613 274415 18523 151602 124735 260432 279870 -62606 -104530
11472a04530A88313J5193Q4590a41752E7642K21550E85a1682A6134e527k63221
$$ -104530 188313 203506 288096 -141752 57642 279192 585 -11682 16134 -5527 -268748
11461b68748H1452N324J6239K7924J64278C7561f6077K2173A96675m9857D8563
$$ -268748 81452 86776 103015 130939 295217 37561 -66077 -43904 196675 146818 48563
11449B82117B7439b5904k1374A9783l812a41962A86244d6535A01027O9342f919
$$ 282117 27439 -25904 -47278 19783 15971 -141962 186244 -46535 101027 170369 -6919
11437d2343A90021I316J5919J10759b08382A17854P132e7393I6507c8720j5899
$$ -42343 190021 9316 25235 135994 -208382 117854 124986 -57393 96507 -38720 -54619
11426e4619p7196B55991P7396a10481A10504m6309J35756B3347b26696F863d7633
$$ -54619 -131815 255991 333387 -110481 110504 64195 199951 23347 -226696 6863 -47633
11414A05254m6814g2484I5549a06308O818K8736B5153O765R961L6655c161k6162
$$ 105254 58440 -72484 95549 -106308 -99490 -70754 25153 31918 41879 78534 -3161 -29323
11402b9323A59599c12520c0829H5574h8843r8082A27322d5260k84812a15187G6126
$$ -29323 159599 -312520 -30829 85574 -88843 -186925 127322 -45260 -330072 -115187 76126
11390A69498J45652g251n2488I8778b00455K8707C27664I9709a7526D1627P10
$$ 169498 315150 -7251 -59739 98778 -200455 -171748 327664 99709 -17526 41627 42337
11379D2337f6345A01728L62955b98335A84894a41577f5724a6691g254E5961J00987
$$ 42337 -66345 101728 464683 -298335 184894 -141577 -65724 -16691 -7254 55961 156948
11368A56948F3136K7471B9453K34327j03832b03274A99331g9705r6337O9059k21716
$$ 156948 63136 90607 29453 263780 159948 -203274 199331 -79705 -176042 -106983 -328699
11357c28699J43739P5050F9890k4628d21403g2494c5539D8260L4579L5776K48035
$$ -328699 -184960 -109910 69890 45262 -421403 -72494 -35539 48260 82839 118615 366650
11346C66650A3726L3921a8606c251H7225K13540b51427a12343A4822a90142r8297
$$ 366650 13726 47647 -18606 -3251 87225 300765 -251427 -112343 14822 -190142 -288439
11335b88439A1880a2757j65070Q6831M928o4409a1641n7715P154j43524A1487
$$ -288439 11880 -12757 -177827 -90996 -86068 -150477 -11641 -69356 -62202 -205726 11487
11323c48562a61718M9373B74664a15534d2334G0618b95739H9620l9347L00096
$$ -348562 -161718 -112345 274664 -115534 -42334 70618 -295739 89620 50273 350369
11313C50369b16820o2602E0897J8905b00526c8298l45957D7776d75006h857B89448
$$ 350369 -216820 -279422 50897 69802 -200526 -38298 -384255 47776 -475006 -8857 289448
11301D538L15647A0146c0329j21783j04791A91928a40279B36748r0841i9471E7660
$$ 4538 320185 10146 -30329 -152112 -256903 191928 -140279 236748 145907 -99471 57660
11289b73163c3078k36356k5025a8072A62972b23129g9931b1874j76568q4914a07829
$$ -273163 -33078 -269434 -294459 -18072 162972 -223129 -79931 -21874 -198442 -283356 -107829
11277b30240m6334R3928f2240B01947J6924D0140h4454C7428J33881q0653d851
$$ -230240 -276574 -182646 -62240 201947 218871 40140 -84454 37428 171309 90656 -4851
11265C76022a1568m8549k2393A29615a33126b7885j56134I3042b40039J01902
$$ 376022 -11568 -60117 -82510 129615 -133126 -27885 -184019 93042 -240039 -138137
11255a38137c6330A81689k0390l3277a49732I2842a29639l43281h0021r7687b4043
$$ -138137 -36330 181689 161299 128022 -149732 92842 -129639 -472920 -80021 -177708 -24043
11243I1205O7816l1860c962k34454m1089E9039P0662d2636l4890o9217r1676c3679
$$ 91205 159021 127161 -3962 -238416 -279505 59039 129701 -42636 -77526 -146743 -238419 -33679
11230I2004i9305B19924j7591E1528L11544a93624G8425k3314K01012j12815c45815
$$ 92004 -99305 219924 202333 51528 363072 -193624 78425 55111 256123 143308 -345815
11218d1438E4413a57197D1889b35030O939j10017a14253L7284A87635k8004b9822
$$ -41438 54413 -157197 41889 -235030 -228091 -338108 -114253 -76969 187635 159631 -29822
11206b9570A53848B0505b49099c5678l92467A91381b53186B20537c04080d0856
$$ -29570 153848 20505 -249099 -35678 -428145 191381 -253186 220537 -304080 -40856
11195G8974J9391b85261J06262A32368b18934b4759A82053b9997B02008a51651
$$ 78974 98365 -285261 -178999 132368 -218934 -24759 182053 -29997 202008 -151651
11184G8794k1350g0494k07125b4065l74180p2933a97477g4084C2296J00833b67601
$$ 78794 57444 -70494 -277619 -24065 -398245 -471178 -197477 -74084 32296 133129 -267601
11172i1811H0033C4860e98454B246h0078l11140G40O1937h8969A9635a29955B7146
$$ -91811 80033 34860 -598454 2246 -80078 -391218 740 62677 -88969 19635 -129955 27146
11159h2739k24938G9136N5396b51993c6938j55173M4364d6727j01534M7902A55015
$$ -82739 -307677 79136 134532 -251993 -36938 -192111 -147747 -46727 -148261 -100359 155015
11147B68168P0077a32208A33970a6987A84281b84940j04455A62021L8729n8427
$$ 268168 338245 -132208 133970 -16987 184281 -284940 -389395 162021 200750 142323
11137A42323b75764A7347P1152a51403d30o1929q1401B11634O2275r4129H2678
$$ 142323 -275764 17347 88499 -151403 -430 -62359 -143760 211634 273909 179780 82678
11125B0624O006K20963G3819c20697A71995a33156A76255F2386a98683G0501j5714
$$ 20624 26630 247593 73819 -320697 171995 -133156 176255 62386 -198683 70501 54787
11114E4787J13066a2852E5881K20400j02803D9058M910J17472K00680i7981C3531
$$ 54787 167853 -12852 55881 276281 173478 49058 53968 171440 372120 -97981 33531
11102B40661a6461A50370C1812J212N04652j80885k4722j50350J15835j22417
$$ 240661 -16461 150370 31812 33024 537676 356791 332069 181719 297554 175137
11092A75137J54019L4440o6007E4669P8260l7144c3926B99660A13094k6235L43971
$$ 175137 329156 363596 297589 54669 132929 95785 -33926 299660 113094 86859 430830
11081D30830A30541L32797j71858p2358i7095D06165p6398j2235p7564J6917j00390
$$ 430830 130541 463338 291480 219122 -97095 406165 329767 317532 239968 256885 156495
11070A56495o8304J55228J16055K59744o0544f2107D27758j85170L50114j00509
$$ 156495 88191 243419 359474 619218 558674 -62107 427758 242588 592702 492193
11060D92193A74112L32883o0995J94135n1268j23702M09411J10133l96451J28183
$$ 492193 174112 506995 446000 640135 588867 465165 874576 984709 588258 716441
11050G16441l31451J66546P5004j01096j07987M10084C34386K98049j69195K09223
$$ 716441 384990 551536 626540 525444 417457 827541 334386 632435 463240 672463
11040F72463j9904N192k34046L22500j57933L37629D49726K58825l45045O4846
$$ 672463 652559 657751 423705 746205 588272 925901 449726 708551 363506 428352
11030D28352L77919J73540m65026J55174k50389M35507C84239L11315J6862J7879
$$ 428352 806271 979811 514785 669959 419570 855077 384239 695554 712416 730295
11020G30295k90914K12531q4399j58688j8548M3587J24114K1053J03521J03903
$$ 730295 439381 651912 567513 408825 390277 433864 557978 579031 682552 786455
11010G86455j84857J64839k66474K72953j38034k92900L18339j9344l9169K14019
$$ 786455 601598 766437 499963 772916 634882 341982 660321 640977 601808 815827
11000H15827D07543Q3738M9368J7535j03265K42526L4118l06921J92186K0285
$$ 815827 407543 491281 540649 558184 454919 697445 731563 424642 616828 637113
10990F37113K3145L71640k58713k62669N12408n7026j0773p4096N89193j77877
$$ 637113 660258 1031898 773185 510516 1022924 965898 955125 881029 1470222 1292345
10980A292345k14524j22121K63584L62338K78854K01996K26394J85415K70220
$$ 1292345 1077821 955700 1219284 1581622 1860476 2062472 2288866 2474281 2744501
10971B744501P4156l26041m20405L5470m821Q2796n94558P5199r9358K14035p4795
$$ 2744501 2818657 2492616 2072211 2107681 2102860 2185656 1591098 1666297 1566939 1780974 1706179
10960A706179k13589K75363j88449M4654r9969R3547m09147Q3555k73394k03105
$$ 1706179 1492590 1767953 1579504 1624158 1524189 1617736 1208589 1292144 1018750 815645
10950H15645J29179l81271m6004k9730J3808N8199C7754L33470J40426d0318A91874
$$ 815645 944824 563553 517549 487819 501627 559826 37754 371224 511650 -40318 191874
10938A73544O7283J32136c09783G2J66881l6760c83776A51733K7341n9724e0076
$$ 173544 240827 372963 -309783 72 166953 130193 -383776 151733 179074 119350 -50076
10926a4251q7292A51518l060l2735a6598l3075m8184A01413i6517a3207j69457
$$ -14251 -101543 151518 148458 115723 -16598 -49673 -97857 101413 -96517 -13207 -182664
10915a82664L3397A46236o9555a49104D0793d25345E9114a48553e660j34417A62839
$$ -182664 -149267 146236 76681 -149104 40793 -425345 59114 -148553 -5660 -140077 162839
10903e766F0866A9483c79964f8662A56129K0193a05148A46478f549l42380J09811
$$ -5766 60866 19483 -379964 -68662 156129 176322 -105148 146478 -6549 -348929 -239118
10892b39118A13700a82608F1218k4474A6864f5251B47412F2775a02457J4394r7704
$$ -239118 113700 -182608 61218 36744 16864 -65251 247412 62775 -102457 -88063 -185767
10881a85767G1387a31972A35811d5068H1485c61841g8602n9870j09250C31987
$$ -185767 71387 -131972 135811 -45068 81485 -361841 -78602 -138472 -247722 331987
10870A2278b24577Q4643F8377k9216D662P7741a00992A70238g1935J5832k85551
$$ 12278 -224577 -139934 68377 39161 4662 82403 -100992 170238 -71935 -56103 -341654
10859c41654a23554L6858A83971b41303R0831B54056a40334C2643Q1778E1033
$$ -341654 -123554 -86696 183971 -241303 -150472 254056 -140334 32643 114421 51033
10848b09493A39048a33197j92664F6978c1135A59307E1011a47450e426l9082j66169
$$ -209493 139048 -133197 -325861 66978 -31135 159307 51011 -147450 -5426 -44508 -210677
10837b10677J03246C0181a19912j14224f9036C6188a23399F6781a57733M9495
$$ -210677 -107431 30181 -119912 -234136 -69036 36188 -123399 66781 -157733 -108238
10827a08238L3411j88555A71107d2331A49372D3903J58448a56246A74150q6205
$$ -108238 -74827 -263382 171107 -42331 149372 43903 202351 -156246 174150 87945
10817H7945i1101j75569C1710a72429A27160a19610I3648D1971b790n6468j54110
$$ 87945 -91101 -266670 31710 -172429 127160 -119610 93648 41971 -2790 -59258 -213368
10806b13368b5678A40100L0507A3985K40960a69410O8468A66568g2769r9983H9753
$$ -213368 -25678 140100 170607 13985 254945 -169410 -100942 166568 -72769 -172752 89753
10794D9110L9325a904p0298k44313d7789F0301k9083a32305b2572k25404j64140
$$ 49110 88435 -1904 -72202 -316515 -47789 60301 31218 -132305 -22572 -247976 -412116
10783d12116A09544g57616a46482q4861R1696m8199p3189b2999j47867c3060p3079
$$ -412116 109544 -757616 -146482 -231343 -139647 -187846 -261035 -22999 -170866 -33060 -106139
10772a06139R631D0741Q4782l6354i5695j45679C68942F142e1339B60997C0405
$$ -106139 -96508 40741 125523 89169 -95695 -241374 368942 6142 -51339 260997 30405
10760f1270D2797c04832l949B06300a35735j2335j93370e7379n673k22052B9075
$$ -61270 42797 -304832 -308781 206300 -135735 -148070 -341440 -57379 -63052 -285104 29075
10748d0568o8941G3551J48053a13961C5678g0449A00411J67892A02729D9050O2255
$$ -40568 -109509 73551 221604 -113961 35678 -70449 100411 268303 102729 49050 111305
10737A11305b28098j0112J12481c3821j58460A26294a3692I2013a7860n4536K2748
$$ 111305 -228098 -238210 -125729 -33821 -192281 126294 -13692 92013 -17860 -72396 -49648
10726d9648E249a39678A03034b22374A96901b16905C1003J13694B4716i1343B60787
$$ -49648 5249 -139678 103034 -222374 196901 -216905 31003 144697 24716 -91343 260787
10714F00a04616n8101g272I6596j6924q074a24260o5021n047A56776b0632j72222
$$ 600 -104616 -162717 -7272 96596 79672 71598 -124260 -189281 -194328 156776 -20632 -192854
10702a92854A02577C3942d74529A38656h9726B06109N8292b47442B6562h2755
$$ -192854 102577 33942 -474529 138656 -89726 206109 264401 -247442 26562 -82755
10691b57694a27180j34246B03393b14131h9003A62645b81138F3760M8961g1636
$$ -257694 -127180 -261426 203393 -214131 -89003 162645 -281138 63760 112721 -71636
10680a36621p577p9113P2220m9298F7459C2904I625a2276j37347D7612c30238
$$ -136621 -144198 -223311 -151091 -200389 67459 32904 9625 -12276 -149623 47612 -330238
10668i1075j84942h557A62050a69638j30762D22658b67082d3700j10821k26643
$$ -91075 -276017 -8557 162050 -169638 -300400 422658 -267082 -43700 -154521 -381164
10658c81164B25998b67627J7209B4827K8807c83592b789C1041b09709M4175e5522
$$ -381164 225998 -267627 -250418 24827 53634 -383592 -2789 31041 -209709 -165534 -55522
10646a50224e3320H3005c66272A23760K37320I1658a26518f0180a2890F7610k9295
$$ -150224 -53320 83005 -366272 123760 361080 91658 -126518 -60180 -12890 67610 38315
10635C8315d9222k794F7181i8908I5812A3931b89048A63358c43681k0493g0936
$$ 38315 -49222 -52016 67181 -98908 95812 13931 -289048 163358 -343681 -364174 -70936
10623B64712a71070D64313b55289B38127a4856l41331F2414K574c09375J13352
$$ 264712 -171070 464313 -255289 238127 -14856 -356187 62414 64988 -309375 -196023
10613a96023N9768d5839G1342b22286d8566j6667B8643J6912J698Q5643a59282
$$ -196023 -136255 -45839 71342 -222286 -48566 -65233 28643 45555 47253 132896 -159282
10601a09020j33058k2158K3230d4225E2357f6357m8668d6351m0183j4349A45301
$$ -109020 -242078 -264236 -241006 -44225 52357 -66357 -115025 -46351 -86534 -100883 145301
10589C2370J20973F0168a26245d9105C34302c70708A22806a26870A46570a04246
$$ 32370 153343 60168 -126245 -49105 334302 -370708 122806 -126870 146570 -104246
10578A88340b75509A78030e2931A66520D7923e3822B5081a91505o8966B67989
$$ 188340 -275509 178030 -52931 166520 47923 -53822 25081 -191505 -260471 267989
10567A96253a35760j72971h7379r9493B07972d37067A65044H2453K1540b1462
$$ 196253 -135760 -308731 -87379 -186872 207972 -437067 165044 82453 103993 -21462
10556a63759B70716j22709C3357b43542c109k6488j64877k26662K04547g7836
$$ -163759 270716 148007 33357 -243542 -3109 -29597 -194474 -421136 -216589 -77836
10545a43217A24343h2359q4815N3688D9068q186i014A30542d4252B45706e3368
$$ -143217 124343 -82359 -167174 -113486 49068 40882 -9014 130542 -44252 245706 -53368
10533B93094c09832K2653n4640C1472N5890a93994a8694B36656E3466e00205a57835
$$ 293094 -309832 -287179 -341819 31472 87362 -193994 -18694 236656 53466 -500205 -157835
10521B3915n510a69808C13382c24123R4681I0371e68912g9782l3925A64388c56391
$$ 23915 18405 -169808 313382 -324123 -229442 90371 -568912 -79782 -113707 164388 -356391
10509a27320C0311J11116P1212L0260D9009i2619J428p2669O7193q5663B8353
$$ -127320 30311 141427 212639 242899 49009 -92619 -91191 -163860 -96667 -182330 28353
10497E2293h4912o7692n1181B37832c10100B0926L24596F6756J44111D3116h5832
$$ 52293 -84912 -152604 -203785 237832 -310100 20926 345522 66756 210867 43116 -85832
10485a97805j67799e4040B37205R1476o6296J96747Q7768A16211N3546a46781
$$ -197805 -365604 -54040 237205 328681 262385 459132 546900 116211 169757 -146781
10474a86490c0854A85162a56777c7381e926j58539J222N7093j83057A41820C0147
$$ -186490 -30854 185162 -156777 -37381 -5926 -164465 -163243 -106150 -289207 141820 30147
10462A24906J38056o4604B0074P3295a57504c7018B53188f670A46998c17753J18372
$$ 124906 262962 198358 20074 93369 -157504 -37018 253188 -6670 146998 -317753 -199381
10451a99381g5126m2499c3735A41333i5045A9250J60335c17133h5656m2667H9091
$$ -199381 -75126 -117625 -33735 141333 -95045 19250 179585 -317133 -85656 -128323 89091
10439A39935D7176M2767b31679B23655m6196J77290c68471E1888g8151k4390i14
$$ 139935 47176 89943 -231679 223655 177459 354749 -368471 51888 -78151 -102541 -914
10427b62133a9917G4286K00434g5006J7212H4599g7835r1700e4727j90102A50926
$$ -262133 -19917 74286 274720 -75006 -57794 84599 -77835 -169535 -54727 -244829 150926
10415a79665A43929F1464e07742a78119f7662A62178e9887J2911C02883i4444
$$ -179665 143929 61464 -507742 -178119 -67662 162178 -59887 -46976 302883 -94444
10404c32579A89055b3575m6653C3503a37165j77271e6076A27548B9365A032J30188
$$ -332579 189055 -23575 -70228 33503 -137165 -314436 -56076 127548 29365 1032 131220
10393A31220a27848A75851J39911b48633F9335R0391O0289b085B25916C6621a09101
$$ 131220 -127848 175851 315762 -248633 69335 159726 220015 -2085 225916 36621 -109101
10381a47728B8121f0818A65004b9862j3944C39524L7345A76502b26204C37510
$$ -147728 28121 -60818 165004 -29862 -43806 339524 376869 176502 -226204 337510
10370b0738C77479N633J42750j69435j45979G8773K01028e0323B55637K2271K67749
$$ -20738 377479 383112 525862 356427 210448 78773 279801 -50323 255637 277908 545657
10359E45657k33023j36394q4676L1378m7264l7676J06129J72778M15498k73840
$$ 545657 312634 176240 91564 122942 75678 38002 144131 316909 732407 458567
10349D58567j12027K48108k14203G3793J85146J27645j1243G5648L40985i904
$$ 458567 346540 594648 380445 73793 258939 386584 375341 75648 416633 -9904
10338f7345A02327p84B2550K23134k8719J29623j41054R4594j41361E7139i2676
$$ -67345 102327 101543 22550 245684 216965 346588 205534 300128 158767 57139 -92676
10326e1651q3548C09894A06088J60457J25004E8311a17491C79295j51564M7505
$$ -51651 -135199 309894 106088 266545 391549 58311 -117491 379295 227731 275236
10316B75236j27720R4077k2746a32280D2408k0910n965N193i3438A82657C0550
$$ 275236 147516 241593 218847 -132280 42408 21498 15533 20726 -93438 182657 30550
10304C47255j27945d34571f8252C1135a38359j43596A36979e2553A16506Q5031
$$ 347255 219310 -434571 -68252 31135 -138359 -281955 136979 -52553 116506 201537
10294B01537I717c63536J45916A90430b33508R6399A60688g9431K5392j92691
$$ 201537 9717 -363536 -217620 190430 -233508 -137109 160688 -79431 -54039 -246730
10284b46730J16597A09545l4270B8238O2134c64309C0335c1395a4583I5684J1516
$$ -246730 -130133 109545 75275 28238 90372 -364309 30335 -31395 -14583 95684 107200
10273A07200d4116F2988a29559E5938a76220b8670I0346L04267a01104B19051
$$ 107200 -44116 62988 -129559 55938 -176220 -28670 90346 394613 -101104 219051
10262A59812d2763D09645j99248A0866K41023J50439A58172a73879d6612q2417
$$ 159812 -42763 409645 210397 10866 251889 402328 158172 -173879 -46612 -129029
10252a29029B9855K3966A8796M5206J96719d18057A59845c7070k2190A36219l6173
$$ -129029 29855 53821 18796 64002 260721 -418057 159845 -37070 -59260 136219 100046
10241A00046N3493g8806q2771M6518B75532f6602A82743a60610p6929C39602h2001
$$ 100046 153539 -78806 -161577 -115059 275532 -66602 182743 -160610 -237539 339602 -82001
10229c6142A21503a1484j33298B04109e4837H0311J69463F424e8273m12918B4866
$$ -36142 121503 -11484 -144782 204109 -54837 80311 249774 6424 -58273 -471191 24866
10217a87946O0548H8423a36744l1938B1608b13869A12350l0938d3303a853j82861
$$ -187946 -127398 88423 -136744 -168682 21608 -213869 112350 81412 -43303 -1853 -184714
10206a84714A84362a19180d6907F85a13628M2385e208n3098j12899N1873p6000
$$ -184714 184362 -119180 -46907 685 -113628 -71243 -5208 -58306 -171205 -119332 -195332
10195a95332c4137B10742a15463m7811f565j48162p2793R5716E4721a55204A94709
$$ -195332 -34137 210742 -115463 -163274 -6565 -154727 -227520 -131804 54721 -155204 194709
10183A04198k5726b12777Q5940e5777q9253C74187A21968a6701C01735a37346
$$ 104198 78472 -212777 -126837 -55777 -145030 374187 121968 -16701 301735 -137346
10172B2086b8931k39196a32489A8119o262i372C27814H8390b25243d8552A66793
$$ 22086 -28931 -268127 -132489 18119 11857 -9372 327814 88390 -225243 -48552 166793
10160C1378P9487b86395j0093J42902N2943k17615g3203q7660K8314E5182a33732
$$ 31378 110865 -286395 -296488 -153586 -100643 -318258 -73203 -160863 -132549 55182 -133732
10148i7060a1683j6512k42526N6432F8647a63629B1532J19594c51236P1600j27985
$$ -97060 -11683 -28195 -270721 -214289 68647 -163629 21532 141126 -351236 -279636 -407621
10137d07621c70A10789D3533c26521J49135M8787j6986j341L867k09938h0382
$$ -407621 -370 110789 43533 -326521 -177386 -128599 -145585 -146926 -143059 -352997 -80382
10125B60364a13124j7997A51244Q5108c0201B2460R9621R7095J3377D2284b07646
$$ 260364 -113124 -131121 151244 236352 -30201 22460 122081 219176 232553 42284 -207646
10113A0685a86076j20298a5134I879a1689G1641K24293I7761c00391A30493b04269
$$ 10685 -186076 -306374 -15134 9879 -11689 71641 295934 97761 -300391 130493 -204269
10101E829b48991A79486L0089c6605m0911j30025i6160K3374B89101a47559b6005
$$ 5829 -248991 179486 209575 -36605 -77516 -207541 -96160 -72786 289101 -147559 -26005
10089D7770J15985i3773A54581e51042a47438a683n9620j71982i937p9070A171
$$ 47770 163755 -93773 154581 -551042 -147438 -1683 -61303 -233285 -9937 -89007 1171
10077a50287e3707H6869J63892g3153H4155k5557c5810D4596L6497a20834j49242
$$ -150287 -53707 86869 250761 -73153 84155 58598 -35810 44596 81093 -120834 -270076
10066b70076H4345c48658a42539A01611a98452K1843N8599j30169B14414a10025
$$ -270076 84345 -348658 -142539 101611 -198452 -176609 -118010 -248179 214414 -110025
10055a20555F8459d8037A14885C2116a40851O4554k76458O7929c0833A38404A7260
$$ -120555 68459 -48037 114885 32116 -140851 -76297 -352755 -284826 -30833 138404 17260
10043c65338a73344n882g7438E7169a02945l9738A0420P1249R5741f8455m26959
$$ -365338 -173344 -179226 -77438 57169 -102945 -142683 10420 81669 177410 -68455 -495414
10032d95414f4089q322D8926h4852K8486k17745J32508A2118c23800H9739d61000
$$ -495414 -64089 -72411 48926 -84852 -56366 -274111 -141603 12118 -323800 89739 -461000
10020a52099B49456C9384O6861d3146p5066A0039i1210q2248e7965A4280e34863
$$ -152099 249456 39384 106245 -43146 -118212 10039 -91210 -173458 -57965 14280 -534863
10008h2968j10861b8436p6661C3767J48371a7503B38594g3020j5838j2516B18047
$$ -82968 -193829 -28436 -105097 33767 182138 -17503 238594 -73020 -88858 -101374 218047
9996i7154a3180j07992B95425F094L6810R2549i4551j42514P3798O0125A63943
$$ -97154 -13180 -121172 295425 6094 42904 135453 -94551 -237065 -163267 -103142 163943
9984c59189A97436b01528L4965A58485c24323i5257B9476Q5458A7727g0967N11
$$ -359189 197436 -201528 -166563 158485 -324323 -95257 29476 114934 17727 -70967 -70456
9973g0456C64757a67587B82025j31937J14443D6126a9481j11379a8270B21323
$$ -70456 364757 -167587 282025 150088 264531 46126 -19481 -130860 -18270 221323
9962A56608b8793j27346B0694a74395o1808j3518O0838l13334C02310a9178D29
$$ 156608 -28793 -156139 20694 -174395 -236203 -249721 -188883 -502217 302310 -19178 429
9950c45081F5406o900a77491O7771d8814j55684K1206g1786I9310a83939f3085
$$ -345081 65406 58506 -177491 -109720 -48814 -204498 -183292 -71786 99310 -183939 -63085
9938I5513l4279a88477B3179g611q4517m7501M7371C9015N7688a40688C3493a79374
$$ 95513 61234 -188477 23179 -7611 -92128 -139629 -92258 39015 96703 -140688 33493 -179374
9925a62471C0737c39935d686k46632J25558f0400B11571a62241G1547h5523B81342
$$ -162471 30737 -339935 -4686 -251318 -125760 -60400 211571 -162241 71547 -85523 281342
9913e6767n1274A66844c1095A95745g1529q0580o372N9399B4404h1402J4035A00979
$$ -56767 -108041 166844 -31095 195745 -71529 -152109 -158481 -99082 24404 -81402 -67367 100979
9900a54047C51843j67758q8760b12067E6911f3687j69915q4354a26196b6643I0058
$$ -154047 351843 184085 95325 -212067 56911 -63687 -233602 -317956 -126196 -26643 90058
9888A06260g5365H9496b91041J01937I2945b29358j63166a06316C0889K2324K4009
$$ 106260 -75365 89496 -291041 -189104 92945 -229358 -392524 -106316 30889 53213 77222
9877G7222a06340k6531J9435G5346d2113A7667b29136K779C4953a59262E4075
$$ 77222 -106340 -132871 -113436 75346 -42113 17667 -229136 -226357 34953 -159262 54075
9865b90884J00287Q3177l93923I3598B9855c48081C8797b50450a08077B34340
$$ -290884 -190597 -107420 -501343 93598 29855 -348081 38797 -250450 -108077 234340
9854d56250e2225j8752B04666D3785J82564a13895j88706P8215D6741J06301b70057
$$ -456250 -52225 -70977 204666 43785 226349 -113895 -302601 -224386 46741 153042 -270057
9842E241c93765a0771A31727b12044A87003f9181A16309A4510a10999K9683J9405
$$ 5241 -393765 -10771 131727 -212044 187003 -69181 116309 14510 -110999 -81316 -61911
9831f1911B503K16407a23015E2072R444Q9306g227j75884j58916R2639g1725B3769
$$ -61911 2503 218910 -123015 52072 61516 150822 -7227 -183111 -342027 -249388 -71725 23769
9818E4474b40679E2245c3222A41226a4283k38146B5076N5092a9569C07942a40163
$$ 54474 -240679 52245 -33222 141226 -14283 -252429 25076 80168 -19569 307942 -140163
9806a71770A64091f2620j4045o5397A6981a30589k19926a42916A55524c06993
$$ -171770 164091 -62620 -76665 -142062 16981 -130589 -350515 -142916 155524 -306993
9795b55343g6177E4123b6184j03462e4858C3880c33732a01622Q930N35o6473A47363
$$ -255343 -76177 54123 -26184 -129646 -54858 33880 -333732 -101622 -92692 -92157 -158630 147363
9782g7796n0678D9478a66021N6991q8926j3773k82709a79362A47062o3096J58102
$$ -77796 -128474 49478 -166021 -109030 -197956 -211729 -494438 -179362 147062 83966 242068
9771B42068a87916d3374B26636l3702a95979q7446J29655k3993m0171i6738j3488
$$ 242068 -187916 -43374 226636 192934 -195979 -283425 -153770 -177763 -217934 -96738 -110226
9760a10226o2229h1168C07071c9622A36895E6805d25412d1204A31426k5766g2303
$$ -110226 -172455 -81168 307071 -39622 136895 56805 -425412 -41204 131426 105660 -72303
9748c76818A39217g324D2615f6890B47767a18031q6265K3863j35199H0660B432
$$ -376818 139217 -7324 42615 -66890 247767 -118031 -204296 -180433 -315632 80660 2432
9736b45339A66087k1841a52369n9954C493b17832J3130B0215a85457M9177j9454
$$ -245339 166087 144246 -152369 -212323 3493 -217832 -204702 20215 -185457 -136280 -155734
9725a55734B11241a46731M9j23263a12260p0345p179C762J16385b05718O7133
$$ -155734 211241 -146731 -146682 -269945 -112260 -182605 -189784 3762 120147 -205718 -138585
9714a38585J452A80473a92979G1943L353C315R0615a42631C07129a93685r886
$$ -138585 -137133 180473 -192979 71943 75296 3315 93930 -142631 307129 -193685 -203571
9703b03571i2690j8644l54027I0446J49904B6599M2081M3846a10327n5473e8673
$$ -203571 -92690 -111334 -465361 90446 240350 26599 68680 112526 -110327 -165800 -58673
9691b85593J18944j73417j19858a00913k59794J30416P0589B5214H522N2548j9377
$$ -285593 -166649 -340066 -459924 -100913 -360707 -230291 -159702 25214 8522 61070 41693
9680D1693L45304F8282a6923A87860K37723c58452a30082j36094A80014b52404
$$ 41693 386997 68282 -16923 187860 425583 -358452 -130082 -266176 180014 -252404
9669a46978l2429M823Q4203p4472B57083b16498d9739j61460D6525a93802K5899
$$ -146978 -179407 -174584 -90381 -164853 257083 -216498 -49739 -211199 46525 -193802 -167903
9658a67903D6641e2739I276f1859A45984d25463a98860N8956B1205a12447E4926
$$ -167903 46641 -52739 9276 -61859 145984 -425463 -198860 -139904 21205 -112447 54926
9646A60919A8425a13342m7523A35840b94259a42833H5057c9099k3982a7021k07983
$$ 160919 18425 -113342 -160865 135840 -294259 -142833 85057 -39099 -63081 -17021 -225004
9635b25004I7891c16512a352j91501Q9378q2637e0448k16367Q5768a9658k38448
$$ -225004 97891 -316512 -1352 -192853 -103475 -186112 -50448 -266815 -181047 -19658 -258106
9624b58106A84910b33166C2177c6027k04620f2266A14925R5731a39083i785m6273
$$ -258106 184910 -233166 32177 -36027 -240647 -62266 114925 210656 -139083 -9785 -56058
9613e6058n6905k35240a30824m0116F8904c2195l6425k13486H6137J19964b03992
$$ -56058 -112963 -348203 -130824 -170940 68904 -32195 -68620 -282106 86137 206101 -203992
9601g7241i523k46691f2813j26493A3938J63543a60256C81767e9525n6253c4772
$$ -77241 -9523 -256214 -62813 -189306 13938 177481 -160256 381767 -59525 -115778 -34772
9589a97300d4861j26646H3901B5796d41405c0136A3922b86788J42462A99292b10422
$$ -197300 -44861 -171507 83901 25796 -441405 -30136 13922 -286788 -144326 199292 -210422
9577b13956R1025j66567I313R6278l2715l5701J01153m0557J04409b7043C7072
$$ -213956 -122931 -289498 9313 105591 72876 37175 138328 97771 202180 -27043 37072
9565a10977Q810c2184D8699b2524j66906B31696J18685B0866K48163b46351O7841
$$ -110977 -102167 -32184 48699 -22524 -189430 231696 350381 20866 269029 -246351 -178510
9554a78510h5186A43809K2662a15338p4076g855A04542c6205l12047e0651A31210
$$ -178510 -85186 143809 166471 -115338 -189414 -7855 104542 -36205 -348252 -50651 131210
9542b07940k2887A06038f5640k67016c0119A43999n9591a09537p9669F443J38543
$$ -207940 -230827 106038 -65640 -332656 -30119 143999 84408 -109537 -189206 6443 144986
9531A44986a42653D8282a21012D5971b56310a09851D7816h4236k29964G798c61648
$$ 144986 -142653 48282 -121012 45971 -256310 -109851 47816 -84236 -314200 7798 -361648
9519c3133j51749j55836C4900J27800m8059b75103A40639d1288A52145c56260
$$ -33133 -184882 -340718 34900 162700 114641 -275103 140639 -41288 152145 -356260
9508C19693c55613a3785C16759e43562b39044A03841K2850a65929l36767f9011
$$ 319693 -355613 -13785 316759 -543562 -239044 103841 126691 -165929 -502696 -69011
9497b52675J22173o9026R5846l2792j51895A44543e15665G3492b16931F2526K17482
$$ -252675 -130502 -199528 -103682 -136474 -288369 144543 -515665 73492 -216931 62526 280008
9486B80008e265j04318j87372B96788e0129k83664f1968K3478B09110a70876H6319
$$ 280008 -5265 -109583 -296955 296788 -50129 -333793 -61968 -38490 209110 -170876 86319
9474D8989N9678c92910a63720j22397F8964a29375H4440f0167A87234a1873j32964
$$ 48989 108667 -392910 -163720 -286117 68964 -129375 84440 -60167 187234 -11873 -144837
9463a44837f078F3045d1019o279J5806D3532q900h145m11783C3759b8256j98061
$$ -144837 -6078 63045 -41019 -47298 -31492 43532 34632 -8145 -419928 33759 -28256 -226317
9451b26317A53125K0337a17285e1846H244K16428D4268g2702q7956C785d64036
$$ -226317 153125 173462 -117285 -51846 8244 224672 44268 -72702 -160658 3785 -464036
9439A12299m8606p984J38841N768a47187N3114A24498a0012j576C9096j1128G464
$$ 112299 63693 55709 194550 200318 -147187 -94073 124498 -10012 -11588 39096 27968 7464
9426g2202l2358a0679k40126Q9901C1487Q7635b09797j9176k03558D3856b38225
$$ -72202 -104560 -10679 -250805 -160904 31487 119122 -209797 -228973 -432531 43856 -238225
9414A08591b55457C3382b51506J21993l9220D9812a75065c7185m0327J0280k70274
$$ 108591 -255457 33382 -251506 -129513 -168733 49812 -175065 -37185 -77512 -67232 -337506
9403c37506a22893A66573a41037j31947A17317b31129F2559i2532l49322b5357
$$ -337506 -122893 166573 -141037 -272984 117317 -231129 62559 -92532 -441854 -25357
9392b3256k6742B13309n0365c43664P0401g2493B80L28260A23377i9332j72763
$$ -23256 -49998 213309 162944 -343664 -273263 -72493 280 328540 123377 -99332 -272095
9381b72095a9893C195b25760L2950l4096a01028B6764g2493I9242a23434r0840
$$ -272095 -19893 3195 -225760 -192810 -226906 -101028 26764 -72493 99242 -123434 -214274
9370b14274Q5466A73371a43103B1096J12939a03j09720m470A18533J55212l4524
$$ -214274 -128808 173371 -143103 21096 134035 -103 -109823 -114293 118533 273745 239221
9359B39221c9784j14539k73927J70761B52206D9087a89691H8086Q3861c7200k414
$$ 239221 -39784 -154323 -428250 -257489 252206 49087 -189691 88086 171947 -37200 -39614
9348c9614B7557a43401c9907B1064J568K25385C0802Q575a58844N7733M1896B57339
$$ -39614 27557 -143401 -39907 21064 22632 248017 30802 39377 -158844 -101111 -59215 257339
9335c15358f5935B07175a92906A68774d9006j03588k11387A45706a60030C19174
$$ -315358 -65935 207175 -192906 168774 -49006 -152594 -363981 145706 -160030 319174
9324d6290k26018h0894c0938j56254A60178a9034l72739E610M5307N5609R2889
$$ -46290 -272308 -80894 -30938 -187192 160178 -19034 -391773 5610 50917 106526 199415
9313A99415b91691r2929Q7984J12335K1261I2977k7746f2600b3676k6306j08940
$$ 199415 -291691 -384620 -296636 -184301 -163040 92977 65231 -62600 -23676 -49982 -158922
9302a58922A13798a36066j67869J18231I1648l9876K06859j10124b6627k0161
$$ -158922 113798 -136066 -303935 -185704 91648 51772 258631 148507 -26627 -46788
9292d6788q0048k873m36391C3805a11201A05670a69907e7751h153j84778g693
$$ -46788 -126836 -129709 -566100 33805 -111201 105670 -169907 -57751 -8153 -192931 -7693
9280e7441k4270A93793f7437j28179A85347a08642L3675b8688r45B2142b71999
$$ -57441 -81711 193793 -67437 -195616 185347 -108642 -74967 -28688 -29633 22142 -271999
9268e2804j2389f981q7089n4293D7217N9849d76123b02713A29620B0654b05746
$$ -52804 -65193 -6981 -94070 -148363 47217 107066 -476123 -202713 129620 20654 -205746
9256e7113B61333b0987J157k50826M1762j85824P6226A39727b19966e0257J463
$$ -57113 261333 -20987 -19830 -270656 -228894 -414718 -338492 139727 -219966 -50257 -48794
9245d8794G4423a2755k82825A09985B9866J0897a46010p8939J06865J6423b1691
$$ -48794 74423 -12755 -295580 109985 29866 40763 -146010 -224949 -118084 -101661 -21691
9233a2715A98277E3901c8592k46738D03903a43210f2198p9956f2195A25796J64153
$$ -12715 198277 53901 -38592 -285330 403903 -143210 -62198 -142154 -62195 125796 289949
9222B89949b44515H013a63826p6264K0054J01599B00246G4208K9879a11364B1023
$$ 289949 -244515 8013 -163826 -240090 -220036 -118437 200246 74208 104087 -111364 21023
9210b38269h249j55175j37745J9110a20710k5312L6524A70211h3385k87720B84839
$$ -238269 -8249 -163424 -301169 -282059 -120710 -146022 -109498 170211 -83385 -371105 284839
9198A36220o4735c2864n3784J9215a1603F4641a59162A04344g5852o0193C97747
$$ 136220 71485 -32864 -86648 -67433 -11603 64641 -159162 104344 -75852 -136045 397747
9186d0515j61033q20o4337a21176A2685M9876o34e4373q1617m9203C14697k1044
$$ -40515 -201548 -202368 -266705 -121176 12685 62561 61927 -54373 -135990 -185193 314697 293653
9174B93653b8693k23379a319G7608k4308K19449I1854b71493J34583A8349b32526
$$ 293653 -28693 -252072 -1319 77608 53300 272749 91854 -271493 -136910 18349 -232526
9162A61966b01117e8133k09135A14523c9105F6947R3705a72779A7626a56619E6570
$$ 161966 -201117 -58133 -267268 114523 -39105 66947 160652 -172779 17626 -156619 56570
9150C0518R4203c32242a63150o2696E741a3171B93771A34513F5972B5260L628
$$ 30518 124721 -332242 -163150 -225846 5741 -13171 293771 134513 65972 25260 28888
9139B8888b35231g963l6452n999A5118b12360j09493Q9270G4516a3512B269K6825
$$ 28888 -235231 -7963 -44415 -50414 15118 -212360 -321853 -232583 74516 -13512 2269 29094
9127B9094L39492i5285k0086k8069J8098B10214a57249G8431h399q7100A20263
$$ 29094 368586 -95285 -115371 -143440 -125342 210214 -157249 78431 -8399 -95499 120263
9115a96404C5375b48952J09759c1383k63180J16846j9128N3248o9870E0203O9557
$$ -196404 35375 -248952 -139193 -31383 -294563 -177717 -196845 -143597 -213467 50203 119760
9104A19760g8047k53328C9770a39953M3372j24137o5793A27200b33249C4106h4182
$$ 119760 -78047 -331375 39770 -139953 -96581 -220718 -286511 127200 -233249 34106 -84182
9092e7572A95748a40465k1393d0855j88503j54662A71791e9240q54j47997f1452
$$ -57572 195748 -140465 -161858 -40855 -229358 -384020 171791 -59240 -60094 -208091 -61452
9080A26818j240P8645b08566l70978a05838k08418h888j3558E8750b17224A6280
$$ 126818 125578 204223 -208566 -579544 -105838 -314256 -8888 -22446 58750 -217224 16280
9068A14324f851n9170n5325A02446N0793a61018A01518c5720j58056C557b29640
$$ 114324 -6851 -66021 -121346 102446 153239 -161018 101518 -35720 -193776 3557 -229640
9056a82496F2521P9439M0529h8642L7155r46A93788F8877d52285a1369H0328A8001
$$ -182496 62521 141960 182489 -88642 -51487 -52433 193788 68877 -452285 -11369 80328 18001
9043A01831d189p0130A65707H430P1338l2765d3703A65509e0278D7771b85295
$$ 101831 -4189 -74319 165707 8430 79768 47003 -43703 165509 -50278 47771 -285295
9031a91186A71126e3283J1954a7472q7950A82725A6949J15172f1679r9822K8247
$$ -191186 171126 -53283 -41329 -17472 -105422 182725 16949 132121 -61679 -161501 -133254
9020a33254J684o2809e94j88014A74247a4266k27106e4436C4357b23749g5106
$$ -133254 -131570 -194379 -594 -188608 174247 -14266 -241372 -54436 34357 -223749 -75106
9008a8272j65365a7526l5222G5688a21847f669j14013k6292r169b1220D84761
$$ -18272 -183637 -17526 -52748 75688 -121847 -6669 -120682 -146974 -156143 -21220 484761
8996G0652J08633a01841p826A8782J68104K2434F3500d34A15453m2714K5756b55539
$$ 70652 179285 -101841 -109667 18782 186886 209320 63500 -434 115453 72739 98495 -255539
8983b68403c4053p147a0609j77242P0045k24287a17443A66696N0853a35382A41615
$$ -268403 -34053 -41200 -10609 -187851 -117806 -342093 -117443 166696 217549 -135382 141615
8971a46737c0740G5074a4942m81326a8160I1575d6709l4978b8019A78252A9435
$$ -146737 -30740 75074 -14942 -496268 -18160 91575 -46709 -81687 -28019 178252 19435
8959b80271A2892J10131j1064J48383q7374a83989B488b78538D7951J47963F8743
$$ -280271 12892 123023 111959 260342 172968 -183989 2488 -278538 47951 195914 68743
8947B36075i1694o6208N7924C4243a14103B0352a44438O6717n6190C6943J23190
$$ 236075 -91694 -157902 -99978 34243 -114103 20352 -144438 -77721 -133911 36943 160133
8936A60133f415A81812p369B3021a29154A13950n2614K14403a2669G82325C48285
$$ 160133 -6415 181812 174443 23021 -129154 113950 61336 275739 -12669 782325 348285
8924F80220N18796K639936L481922n78317B187546D97554j82626o9990q5548J73679
$$ 680220 1199016 3838952 7320874 6742557 2187546 497554 314928 244938 159390 333069
8914C33069b03892B08159C690d5620p1561J8101A34429F0520C913i7824I6366
$$ 333069 -203892 208159 3690 -45620 -117181 -99080 134429 60520 3913 -97824 96366
8902F9788d00814C5210f4673G6974J49462i0485A12641h3474a1965j84773B33873
$$ 69788 -400814 35210 -64673 76974 226436 -90485 112641 -83474 -11965 -196738 233873
8890D6164g6700A07152b742B43534D2891P826b08367A69273d8252I9237O7220
$$ 46164 -76700 107152 -2742 243534 42891 50717 -208367 169273 -48252 99237 166457
8879A66457g6296G301J36618b02384c7281k8512H3502M3508e2938B64742A4913
$$ 166457 -76296 7301 143919 -202384 -37281 -65793 83502 127010 -52938 264742 14913
8867a01207r6374j92620a31874K7710k87668a50568p0951D1665a37990f8369o8005
$$ -101207 -197581 -390201 -131874 -104164 -391832 -150568 -221519 41665 -137990 -68369 -136374
8856a36374f4422H4991f0694m1754K7651j82853a5188G3601b37411o4702a37197
$$ -136374 -64422 84991 -60694 -102448 -74797 -257650 -15188 73601 -237411 -302113 -137197
8844A56335a07434A38327d5341j95423A64273b56135I601J22965A4046b46993
$$ 156335 -107434 138327 -45341 -240764 164273 -256135 9601 132566 14046 -246993
$$ [...]
##END NTUPLES=NMR SPECTRUM
##END=
