
##TITLE=AC1412_PERAH12221_7652973_ZHIX2eC7ob
##JCAMPDX= 6.0         $$ Bruker NMR JCAMP-DX V2.0
##DATA TYPE= NMR SPECTRUM
##DATA CLASS= NTUPLES
##ORIGIN= BRUKER
##OWNER= Administrator
$$ 1.72 TOPSPIN		Version 2.1
$$ 2013-03-20 03:06:21.970 -0500  Administrator@X
$$ Compression mode = diff/dup
##.OBSERVE FREQUENCY= 400.02188249412
##.OBSERVE NUCLEUS= ^1H
##.ACQUISITION MODE= SIMULTANEOUS (DQD)
##.ACQUISITION SCHEME= undefined
##.AVERAGES= 64
##.DIGITISER RES= 22
##SPECTROMETER/DATA SYSTEM= spect
##.PULSE SEQUENCE= noesygpps1d.comp
##.SOLVENT NAME= COFFEE_meoh
##.SHIFT REFERENCE= INTERNAL, COFFEE_meoh, 1, 14.96095
##AUDIT TRAIL= $$ (NUMBER, WHEN, WHO, WHERE, PROCESS, VERSION, WHAT)
$$ ##TITLE= Audit trail, TOPSPIN		Version 2.1
$$ ##JCAMPDX= 5.01
$$ ##ORIGIN= Bruker BioSpin GmbH
$$ ##OWNER= Administrator
$$ $$ E:\/data/COFFEE/nmr/AC1412_PERAH12221_7652973_ZHIX2eC7ob/12/pdata/1/auditp.txt
$$ ##AUDIT TRAIL=  $$ (NUMBER, WHEN, WHO, WHERE, PROCESS, VERSION, WHAT)
(   1,<2013-03-20 03:06:16.111 -0500>,<Administrator>,<X>,<go>,<TOPSPIN 2.1>,
      <created by zg
	started at 2013-03-20 02:54:46.095 -0500,
	POWCHK enabled, PULCHK disabled,
       configuration hash MD5:
       86 BA 57 50 F2 9D 5C 9B 26 00 A9 28 5F 66 2E 89
       data hash MD5: 64K
       41 B3 F7 29 53 DB AD A1 B8 84 CF 6B 45 95 49 A0>)
(   2,<2013-03-20 03:06:19.267 -0500>,<Administrator>,<X>,<proc1d>,<TOPSPIN 2.1>,
      <Start of raw data processing
       efp LB = 0.3 FT_mod = 6 PKNL = 1 PHC0 = 0 PHC1 = 0 SI = 128K 
       data hash MD5: 128K
       94 AA F8 F2 78 AF 4E 82 35 C1 83 8B 0E AA 9E C1>)
(   3,<2013-03-20 03:06:20.329 -0500>,<Administrator>,<X>,<proc1d>,<TOPSPIN 2.1>,
      <pk PHC0 = -80.10132 PHC1 = 0 
       data hash MD5: 128K
       5C E8 D1 1C D3 4A 2D 31 84 03 4E 73 C4 CC 6A A9>)
(   4,<2013-03-20 03:06:20.954 -0500>,<Administrator>,<X>,<proc1d>,<TOPSPIN 2.1>,
      <abs ABSG = 1 
       data hash MD5: 128K
       33 EC C8 8C 08 C2 07 D0 B5 28 66 50 F2 59 10 3A>)
(   5,<2013-03-20 03:06:21.157 -0500>,<Administrator>,<X>,<proc1d>,<TOPSPIN 2.1>,
      <abs ABSG = 2 
       data hash MD5: 128K
       4E C2 84 53 7D D8 41 9D D8 46 8A 94 1F 7A 55 3B>)
(   6,<2013-03-20 03:06:21.345 -0500>,<Administrator>,<X>,<proc1d>,<TOPSPIN 2.1>,
      <abs ABSG = 3 
       data hash MD5: 128K
       A8 63 98 B8 D8 7C E6 F1 4C 28 5E 63 5B C8 44 34>)
(   7,<2013-03-20 03:06:21.517 -0500>,<Administrator>,<X>,<proc1d>,<TOPSPIN 2.1>,
      <abs ABSG = 4 
       data hash MD5: 128K
       0B D7 FD AA 2A DD B2 1E AE 1A 89 7C DA 49 15 48>)
(   8,<2013-03-20 03:06:21.689 -0500>,<Administrator>,<X>,<proc1d>,<TOPSPIN 2.1>,
      <abs ABSG = 5 
       data hash MD5: 128K
       36 24 38 DB 0C EF 17 4E 70 13 D8 FA 2B B1 9D 6F>)
$$ ##END=
$$ 
$$ $$ hash MD5
$$ $$ 6C D4 99 93 58 2F 31 59 F8 31 ED E7 88 CF 32 4D
##$RELAX= 
##$RELAX= 
##$RELAX= 
##$RELAX= 
##$RELAX= 
##$RELAX= 
##$RELAX= 
##$RELAX= 
$$ Bruker specific parameters
$$ --------------------------
##$DU= <E:\>
##$EXPNO= 12
$$ [...]
##$TP07= 0
##$TPNAME0= <>
##$TPNAME1= <>
##$TPNAME2= <>
##$TPNAME3= <>
##$TPNAME4= <>
##$TPNAME5= <>
##$TPNAME6= <>
##$TPNAME7= <>
##$TPOAL= (0..7)
0.5 0.5 0.5 0.5 0.5 0.5 0.5 0.5
##$TPOFFS= (0..7)
0 0 0 0 0 0 0 0
##$TUNHIN= 0
##$TUNHOUT= 0
##$TUNXOUT= 0
##$USERA1= <user>
##$USERA2= <user>
##$USERA3= <user>
##$USERA4= <user>
##$USERA5= <user>
##$V9= 5
##$VALIST= <valist>
##$VCLIST= <CCCCCCCCCCCCCCC>
##$VD= 0
##$VDLIST= <DDDDDDDDDDDDDDD>
##$VPLIST= <PPPPPPPPPPPPPPP>
##$VTLIST= <TTTTTTTTTTTTTTT>
##$WBST= 2048
##$WBSW= 25
##$XGAIN= (0..3)
0 0 0 0
##$XL= 0
##$YL= 0
##$YMAX_a= 6196298
##$YMIN_a= -12510299
##$ZGOPTNS= <>
##$ZL1= 120
##$ZL2= 120
##$ZL3= 120
##$ZL4= 120
##$ABSF1= 14.96095
##$ABSF2= -5.597232
##$ABSG= 5
##$ABSL= 3
##$ALPHA= 0
##$AQORDER= 0
##$ASSFAC= 0
##$ASSFACI= 0
##$ASSFACX= 0
##$ASSWID= 0
##$AUNMP= <proc_prof1d_extract.lims>
##$AXLEFT= 0
##$AXNAME= <>
##$AXNUC= <1H>
##$AXRIGHT= 0
##$AXTYPE= 0
##$AXUNIT= <>
##$AZFE= 0.1
##$AZFW= 0.1
##$BCFW= 0
##$BC_mod= 0
##$BYTORDP= 0
##$COROFFS= 0
##$CY= 15
##$DATMOD= 1
##$DC= 0
##$DFILT= <>
##$DTYPP= 0
##$F1P= 0
##$F2P= 0
##$FCOR= 0.5
##$FTSIZE= 131072
##$FT_mod= 6
##$GAMMA= 0
##$GB= 0
##$INTBC= 1
##$INTSCL= 1
##$ISEN= 128
##$LB= 0.3
##$LEV0= 0
##$LPBIN= 0
##$MAXI= 10000
##$MC2= 0
##$MEAN= 0
##$ME_mod= 0
##$MI= 0
##$NCOEF= 0
##$NC_proc= -2
##$NLEV= 6
##$NOISF1= 0
##$NOISF2= 0
##$NSP= 0
##$NTH_PI= 0
##$NZP= 0
##$OFFSET= 14.96095
##$PC= 1
##$PHC0= -80.10132
##$PHC1= 0
##$PH_mod= 1
##$PKNL= yes
##$PPARMOD= 0
##$PPDIAG= 0
##$PPIPTYP= 0
##$PPMPNUM= 2147483647
##$PPRESOL= 1
##$PSCAL= 4
##$PSIGN= 0
##$PYNMP= <proc.py>
##$REVERSE= no
##$SF= 400.02000965536
##$SI= 131072
##$SIGF1= 0
##$SIGF2= 0
##$SINO= 400
##$SIOLD= 131072
##$SPECTYP= <>
##$SREGLST= <1H.CDCl3>
##$SSB= 0
##$STSI= 131072
##$STSR= 0
##$SW_p= 8223.68421052631
##$SYMM= 0
##$S_DEV= 0
##$TDeff= 65536
##$TDoff= 0
##$TI= <>
##$TILT= no
##$TM1= 0
##$TM2= 0
##$TOPLEV= 0
##$USERP1= <user>
##$USERP2= <user>
##$USERP3= <user>
##$USERP4= <user>
##$USERP5= <user>
##$WDW= 1
##$XDIM= 131072
##$YMAX_p= 388435291
##$YMIN_p= -12285
##$CURPLOT= <Network HP LaserJet P1505>
##$CURPRIN= <$Network HP LaserJet P1505>
##$DFORMAT= <normdp>
##$LAYOUT= <+/1D_H.xwp>
##$LFORMAT= <normlp>
##$PFORMAT= <normpl>
##$SURQMSG= 1
$$ End of Bruker specific parameters
$$ ---------------------------------
##NTUPLES= NMR SPECTRUM
##VAR_NAME=  FREQUENCY,     SPECTRUM/REAL,   SPECTRUM/IMAG
##SYMBOL=    X,             R,               I
##VAR_TYPE=  INDEPENDENT,   DEPENDENT,       DEPENDENT
##VAR_FORM=  AFFN,          ASDF,            ASDF
##VAR_DIM=   131072,        131072,          131072
##UNITS=     HZ,            ARBITRARY UNITS, ARBITRARY UNITS
##FACTOR=    0.0627417313425164, 1,          1
##FIRST=     8223.62146879497, 222,          -59651
##LAST=      0,             2314,            -60714
##MIN=       0,             -12285,          0
##MAX=       8223.62146879497, 388435291,    0
$$ Real data points
##PAGE= N=1
##DATA TABLE= (X++(R..R)), XYDATA
$$ [...]
63914C144885j94767j95488j92590j86877j78995j69241j57960j45668j32779
63905A590520j19701j07115r5655q5319p5656o6512n8104n0446m3238l6432l0363
63894H21979k5323k1406j8705j7091j5785j3869j1401r417q592q425q022p144
63882F56799o165n464n200n325n378m614k754m25J594L329N467Q313J1368J3959
63868F65504J5977J7796J9668K1391K2577K3128K3293K3309K3102K2467K1371
63857H99583J9914J8140J6026J3635J1027Q112M767J054k759o333r324j1587j3512
63844I48743j5793j8534k0993k2599k3846k5521k7456k8864k9613l0168l0314
63833F75042k9205k7010k5308k5155k5628k5158k3472k1394j9382j7380j5709
$$ y = [3144885, 2950118, 2754630, 2562040, 2375163, 2196168, 2026927, 1868967, 1723299, 1590520, 1470819, 1363704, 1268049, 1182730, 1107074, 1040562, 982458, 932012, 888774, 852342, 821979, 796656, 775250, 756545, 739454, 723669, 709800, 698399, 688982, 680390, 671965, 663943, 656799, 650634, 645170, 639970, 634645, 629267, 624653, 621899, 621474, 623068, 626397, 631864, 640177, 651545, 665504, 681481, 699277, 718945, 740336, 762913, 786041, 809334, 832643, 855745, 878212, 899583, 919497, 937637, 953663, 967298, 978325, 986437, 991204, 992258, 989499, 983166, 973842, 962255, 948743, 932950, 914416, 893423, 870824, 846978, 821457, 794001, 765137, 735524, 705356, 675042, 645837, 618827, 593519, 568364, 542736, 517578, 494106, 472712, 453330, 435950, 420241]
63822D20241j4841j4375j3342j1728j0637j0649j0861j0110q433o744n560m774
63810B98187m338m421m817m909m378l592l060k769k387j919j742j940k016j537
63796B54362q44o99j297k026k315k294k356k463k274j779j319j062r15r26j321
63781B30472j958k238j821j154r24j154j199n69M11R25M54p44j861k281k039j594
63765B12726j180o81j28M8m33j143j355q74j13N49J079J392J232O17rl07l48k02
63747B10870L52J286J925J662Q22K75L65P57J210J759K197K085J495J110J364
63732B29534J981K543K994L294L208K756K358K175J814J157Q45J427K547L551
63718B62184M448N501O355O361N533M449L413K422J653J157L64j203k845l332
$$ y = [420241, 405400, 391025, 377683, 365955, 355318, 344669, 333808, 323698, 315265, 308521, 302961, 298187, 293849, 289428, 284611, 279702, 275324, 271732, 268672, 265903, 263516, 261597, 259855, 257915, 255899, 254362, 253518, 252819, 251522, 249496, 247181, 244887, 242531, 240068, 237794, 236015, 234696, 233634, 232719, 231793, 230472, 228514, 226276, 224455, 223301, 222377, 221223, 220024, 219455, 219866, 220791, 221245, 220501, 218640, 216359, 214320, 212726, 211546, 210865, 210737, 210785, 210352, 209209, 207854, 206980, 206867, 207416, 208495, 209887, 211119, 211736, 211727, 211420, 211072, 210870, 211222, 212508, 214433, 216095, 216917, 217192, 217557, 218314, 219524, 221283, 223480, 225565, 227060, 228170, 229534, 231515, 234058, 237052, 240346, 243554, 246310, 248668, 250843, 252657, 253814, 254659, 256086, 258633, 262184, 266632, 272133, 278488, 284849, 290382, 294831, 298244, 300666, 302319, 303476, 303840, 302637, 299792, 296460]
63704B96460k607j843j743j845j676j468j384j019k34L79M21K98M37P15J136K124
63688B88151L507M126L340K132J764K089K229K194K534K868K259R08O0J39K09
63673C18509l68r51p53J4O46Q73Q28O77P42J315K013J979J090L20L22L89m57j930
63655C25258k871k891k734l109l862m443m613m450m042l362k378j185j07M44M55
63640B86110M76J073K176L196L672L585L174K779K835L634M945O115O598O373
63626C36741N826N388N308N588O134O947Q148R701J1280J2575J3617J4594J5543
63613D57390J6481J7725J9699K2380K5280K7987L0404L2433L3927L5079L6438
63602G55223L8055L9035L8378L6055L2737K8574K2932J5572P537M62m777q392
$$ y = [296460, 293853, 292010, 290267, 288422, 286746, 285278, 283894, 282875, 282641, 283020, 283441, 283739, 284176, 284891, 286027, 288151, 291658, 295784, 299124, 301256, 303020, 305109, 307338, 309532, 312066, 314934, 317193, 318101, 318161, 318300, 318509, 318141, 317190, 316437, 316451, 317097, 317970, 318798, 319475, 320217, 321532, 323545, 325524, 326614, 326934, 327256, 327645, 327188, 325258, 322387, 319496, 316762, 313653, 309791, 305348, 300735, 296285, 292243, 288881, 286503, 285318, 285211, 285655, 286110, 286586, 287659, 289835, 293031, 296703, 300288, 303462, 306241, 309076, 312710, 317655, 323770, 330368, 336741, 342567, 347955, 353263, 358851, 364985, 371932, 380080, 389781, 401061, 413636, 427253, 441847, 457390, 473871, 491596, 511295, 533675, 558955, 586942, 617346, 649779, 683706, 718785, 755223, 793278, 832313, 870691, 906746, 939483, 968057, 990989, 1006561, 1014098, 1014560, 1009783, 1001391]
63590A001391j0918j2566j3390j3712j4125j5147j6925j9284k2008k5014k8094
63579H10208l0565l1528l0735k8918k6952k4926k2480j9821j7697j6236j4524
63568E45826j1786q445n489l240j360K85J564K792M558O724Q396R216R923J1187
63554E70151J2597J3459J4053J5236J7252J9788K2966K7197L2027L6254L9441
63543H20421M2334M5307M7415M7662M6284M3703L8988L0716J9232O911l902j2197
63531A172874j7621j9914j9606j8225j7030j6183j5660j6083j7934k0665k3573
63520I70380k6959l1363l6009l9275m0544m0587m0061l8745l6472l3737l0897
63509E75731k7693k4050k0644j8113j6289j4776j3634j2911j2070j0616q900p623
$$ y = [1001391, 990473, 977907, 964517, 950805, 936680, 921533, 904608, 885324, 863316, 838302, 810208, 779643, 748115, 717380, 688462, 661510, 636584, 614104, 594283, 576586, 560350, 545826, 534040, 525595, 520106, 516866, 515506, 515791, 517355, 520147, 524705, 531429, 539825, 549041, 558964, 570151, 582748, 596207, 610260, 625496, 642748, 662536, 685502, 712699, 744726, 780980, 820421, 862755, 908062, 955477, 1003139, 1049423, 1093126, 1132114, 1162830, 1182062, 1188973, 1185071, 1172874, 1155253, 1135339, 1115733, 1097508, 1080478, 1064295, 1048635, 1032552, 1014618, 993953, 970380, 943421, 912058, 876049, 836774, 796230, 755643, 715582, 676837, 640365, 606628, 575731, 548038, 523988, 503344, 485231, 468942, 454166, 440532, 427621, 415551, 404935, 396035, 388412]
63497C88412o784n899m911m209l833l383k742k167j720j181o54n39q15r72q18
63482C47785p57r26p09M09J920K840K889K694K885L487M073M174L506K239J049
63467C77558N10L95r3j252k389k683k267k031k465l067l070k386j581j058o37
63452C53484J6Q64J541J826J891K107K721L705M858O012P182Q484R922J1299J2422
63437D28334J3397J4657J6658J9497K2771K5876K8524L0936L3388L5587L6540
63426G06165L5129L0864K4288J6888J0563O767N894P424J0574J4745J9467K4342
63414I13110K9207L4085L8730M2459M4602M4977M3596M0167L4270K6130J6879
63403A308212P892jo570j1730j5397j7743j9317k0647k1831k2840k4089k6380
$$ y = [388412, 381628, 375729, 370818, 366609, 362776, 359393, 356651, 354484, 352764, 351583, 350929, 350390, 349575, 348603, 347785, 347028, 346102, 345393, 345802, 347722, 350562, 353451, 356145, 359030, 362517, 366590, 370764, 374270, 376509, 377558, 378068, 378463, 378370, 377118, 374729, 372046, 369779, 367748, 365283, 362216, 359146, 356760, 355179, 354121, 353484, 353500, 354364, 355905, 357731, 359622, 361729, 364450, 368155, 373013, 379025, 386207, 394691, 404613, 415912, 428334, 441731, 456388, 473046, 492543, 515314, 541190, 569714, 600650, 634038, 669625, 706165, 741294, 772158, 796446, 813334, 823897, 830664, 836558, 843982, 854556, 869301, 888768, 913110, 942317, 976402, 1015132, 1057591, 1102193, 1147170, 1190766, 1230933, 1265203, 1291333, 1308212, 1316104, 1316103, 1309533, 1297803, 1282406, 1264663, 1245346, 1224699, 1202868, 1180028, 1155939, 1129559]
63391A129559k9998l4232l8070m1128m3460m4710m4162m1728l8279l4733l1313
63380G07746k7954k4905k2454k0261j7564j4052j0277p165n244m157k781j85L354
63367E54101O547Q595J0109J2154J4777J7115J8748K0311K2660K5958K9685L3199
63355G73959L6135L8581M0957M3565M6130M7897M8156M6533M2959L7647L0980
63344A233499K3245J4653N782k310q769j3547j6900j8730j9033j8730j9137k0645
63332A139378k2691k5055k8254l2281l5936l8043l8747l8864l8405l6604l3264
63321G71234k9281k5602k2244j8640j4620j0675p365m980l951n185r261j5153
63309F04277k0390k3093k3520k3106k2369k0712j8080j5590j4050j2860j1119
$$ y = [1129559, 1099561, 1065329, 1027259, 986131, 942671, 897961, 853799, 812071, 773792, 739059, 707746, 679792, 654887, 632433, 612172, 594608, 580556, 570279, 563114, 557870, 553713, 550932, 550747, 554101, 560648, 569243, 579352, 591506, 606283, 623398, 642146, 662457, 685117, 711075, 740760, 773959, 810094, 848675, 889632, 933197, 979327, 1027224, 1075380, 1121913, 1164872, 1202519, 1233499, 1256744, 1271397, 1277179, 1274869, 1266100, 1252553, 1235653, 1216923, 1197890, 1179160, 1160023, 1139378, 1116687, 1091632, 1063378, 1031097, 995161, 957118, 918371, 879507, 841102, 804498, 771234, 741953, 716351, 694107, 675467, 660847, 650172, 642807, 637827, 633876, 628691, 619430, 604277, 583887, 560794, 537274, 514168, 491799, 471087, 453007, 437417, 423367, 410507, 399388]
63298C99388r084p670o981o312n380m624m264l865l126k354j923j735j641j918
63284C38511k817l879m236l624k668k104j989j865j480r85n89l46l33o65j142
63269C09789j190m98M96J140J438J916K670L038K458J215J73j5O82J691K235K072
63253C29310J929K769M444N670N665N140N230N920O403O506O865P772Q782R660
63239D12065J0821J2465J4006J4906J5534J6574J7926J8909J9398K0064K1357
63228E94025K2896K4079K4795K5175K5045K4166K2873K1924K1668K1809K2032
63217H50487K2435K3077K3540K3359K2584K1538K0094J7665J3881Q976L453k291
63205A048798p969j3372j8389k2915k6685k9454l1264l2251l2211l0815k8245
$$ y = [399388, 390304, 382634, 375653, 369341, 363961, 359337, 355073, 351208, 348082, 345728, 343805, 342070, 340429, 338511, 335694, 331815, 327579, 323955, 321287, 319183, 317194, 315329, 313849, 312864, 312275, 311929, 311596, 310931, 309789, 308599, 308101, 308597, 309737, 311175, 313091, 315761, 318799, 321257, 322472, 322645, 322630, 323312, 325003, 327238, 329310, 331239, 334008, 338452, 344122, 349787, 354927, 360157, 366077, 372480, 378986, 385851, 393623, 402405, 412065, 422886, 435351, 449357, 464263, 479797, 496371, 514297, 533206, 552604, 572668, 594025, 616921, 641000, 665795, 690970, 716015, 740181, 763054, 784978, 806646, 828455, 850487, 872922, 895999, 919539, 942898, 965482, 987020, 1007114, 1024779, 1038660, 1047636, 1051089, 1048798, 1040829, 1027457, 1009068, 986153, 959468, 930014, 898750, 866499, 834288, 803473, 775228]
63194G75228k5204k2114j8816j5192j1611q359n114j511K071M932P114R500J2584
63181G03508J5685J7673J8321J8517J9165K0189K0870K0926K0787K0759K0508
63170I16908J9721J8781J8071J6999J4604J1156Q090N976L502q51o790j2654j7433
63157I96080k1465k5292k8779l1537l3477l4666l4979l4286l2768l0827k8783
63146F59221k6784k4888k3094k1298j9258j6764j4009j1590r940q783p561o317
63134D68935n643n570n173l698j543K98J376J794J494L68r95j450l92J579L241
63119D54621L724L031J956J497K054L120L886M021L694L184K759K720L113L507
63105D96887L459L073K777K729K774K756K519J879J062Q11J500K408K512J820
$$ y = [775228, 750024, 727910, 709094, 693902, 682291, 673932, 668818, 667307, 669378, 674310, 681424, 690924, 703508, 719193, 736866, 755187, 773704, 792869, 813058, 833928, 854854, 875641, 896400, 916908, 936629, 955410, 973481, 990480, 1005084, 1016240, 1024330, 1030306, 1033808, 1032957, 1026167, 1013513, 996080, 974615, 949323, 920544, 889007, 855530, 820864, 785885, 751599, 718831, 688004, 659221, 632437, 607549, 584455, 563157, 543899, 527135, 513126, 501536, 491596, 482813, 475252, 468935, 463292, 457722, 452549, 448851, 447308, 447606, 448982, 450776, 452270, 452638, 451643, 450193, 449801, 451380, 454621, 458345, 461376, 463332, 464829, 466883, 470003, 473889, 477910, 481604, 484788, 487547, 490267, 493380, 496887, 500346, 503419, 506196, 508925, 511699, 514455, 516974, 518853, 519915, 520726, 522226, 524634, 527146, 528966]
63091E28966J221J123J082P51M11M30P63J195J502J344O43P2N18J880L176L909
63075E48986M529N338N846N730N603O141P071P764Q322R363J0962J2573J3841
63062F52069J4901J5926J6965J8234K0099K2579K5185K7433K9433L1839L5146
63051I09809L9054M2669M5434M7732N0179N2631N4330N5062N5455N6033N6578
63040A464966N6722N6581N6438N6321N6266N6560N7186N7495N6806N5061N2448
63029B082850M8772M3682L7207K9515K0452R907j591j3204k4653l6124m7316n7145
63017B092352o4570o9390p2086p3139p2616p0247o5847n9701n2512m4943l7340
63006A409961k9864k2590j5368p971n73O242J2140J7333K2017K5996K9242L2243
$$ y = [528966, 530187, 531310, 532392, 533143, 533554, 533984, 534747, 535942, 537444, 538788, 539431, 539503, 540021, 541901, 545077, 548986, 553515, 558853, 564699, 570429, 576032, 582173, 589244, 597008, 605330, 614693, 625655, 638228, 652069, 666970, 682896, 699861, 718095, 738194, 760773, 785958, 813391, 842824, 874663, 909809, 948863, 991532, 1036966, 1084698, 1134877, 1187508, 1241838, 1296900, 1352355, 1408388, 1464966, 1521688, 1578269, 1634707, 1691028, 1747294, 1803854, 1861040, 1918535, 1975341, 2030402, 2082850, 2131622, 2175304, 2212511, 2242026, 2262478, 2272385, 2270794, 2257590, 2232937, 2196813, 2149497, 2092352, 2027782, 1958392, 1886306, 1813167, 1740551, 1670304, 1604457, 1544756, 1492244, 1447301, 1409961, 1380097, 1357507, 1342139, 1334168, 1333595, 1339837, 1351977, 1369310, 1391327, 1417323, 1446565, 1478808]
62994A478808L5196L7326L7764L6916L6193L6301L6539L5874L4168L2033K9885
62983A867003K7440K3989J8970J2288M222m928j4771k4530l3266m0706m7422n3850
62971A734439n9492o3582o6088o7425o7543o5995o2850n8843n4598n0324m6167
62960A071532m2283l8547l4820l1507k9109k7275k5057k2337k0136j9212j8986
62949G62263j8433j7403j6596j6483j6810j6939j6333j4975j3517j2759j2745
62938E89270j2667j1909j0800r956r336q410p115o045n692n852n884n307m182
62925D86115l011k298k124k164k085j787j344r40q58j193j551j440j025j031j702
62910D61562k347k246j653j380j728k286k675k882k939k749k374k131k200k314
$$ y = [1478808, 1514004, 1551330, 1589094, 1626010, 1662203, 1698504, 1735043, 1770917, 1805085, 1837118, 1867003, 1894443, 1918432, 1937402, 1949690, 1953912, 1948984, 1934213, 1909683, 1876417, 1835711, 1788289, 1734439, 1674947, 1611365, 1545277, 1477852, 1410309, 1344314, 1281464, 1222621, 1168023, 1117699, 1071532, 1029249, 990702, 955882, 924375, 895266, 867991, 842934, 820597, 800461, 781249, 762263, 743830, 726427, 709831, 693348, 676538, 659599, 643266, 628291, 614774, 602015, 589270, 576603, 564694, 553894, 543938, 534602, 526192, 519077, 513032, 507340, 501488, 495604, 490297, 486115, 483104, 480806, 478682, 476518, 474433, 472646, 471302, 470362, 469504, 468311, 466760, 465320, 464295, 463264, 461562, 459215, 456969, 455316, 453936, 452208, 449922, 447247, 444365, 441426, 438677, 436303, 434172, 431972, 429658]
62896D29658k072j439q06n56o07n34j03L49L21j26l40J15Q18R39J98q25j335j109
62878D22546n65j32L04J137K261K913K537J555P91L80k02j128j869k011j723j210
62862D25584l85N29P41j63j453k063j853j410r43j46R27J669J723J408J148R20
62846D26233M99n3l86k46J97L83r6q63r99k15N10L5j425k479k203j023L2L86J08
62827D18395m05o48l86P6K68K81O51J487K296K797L256L777L905L402K852K903
62811D44907L404L859M366N312O410O829O403N972O261O939P190O893O783P498
62797E29026Q838J0126J1112J2284J4119J6276J7844J8422J8654J9528K1464K4250
62785G21943K7537L1105L4861L8932M3671M9281N5533O2030O8529P4735Q0042
$$ y = [429658, 427586, 426147, 425341, 424785, 424178, 423644, 423541, 423890, 424211, 424085, 423745, 423860, 424678, 425617, 425815, 424990, 423655, 422546, 421981, 421849, 422153, 423290, 425551, 428464, 431001, 432556, 433347, 433727, 433525, 432397, 430528, 428517, 426794, 425584, 425199, 425728, 426469, 426306, 424853, 422790, 420937, 419527, 418584, 418438, 419365, 421034, 422757, 424165, 425313, 426233, 426732, 426679, 426293, 426047, 426244, 426627, 426531, 425668, 424669, 424454, 424964, 424999, 423574, 421095, 418892, 417869, 417901, 418287, 418395, 417990, 417342, 416956, 417032, 417300, 417581, 418232, 419719, 422015, 424812, 428068, 431845, 435750, 439152, 442004, 444907, 448311, 452170, 456536, 461848, 468258, 475087, 481490, 487462, 493723, 500662, 507852, 514745, 521528, 529026, 537864, 547990, 559102, 571386, 585505, 601781, 619625, 638047, 656701, 676229, 697693, 721943, 749480, 780585, 815446, 854378, 898049, 947330, 1002863, 1064893, 1133422, 1208157, 1288199]
62774A288199Q3949Q6628Q8662R0152R0477Q8905Q5060P8806P0017N8691M5163
62763B154709L0075J4292j360j6494l1161m5191n7710o7753p5238q0855q5026
62752A738288q7510q8043q6790q4082q0257p5934p1819o7986o3863n9131n4043
62741I18830m8680m2776l6773l2108k9572k8008k5707k2622k0047j8376j6515
62730E97646j3724j0782q765p618o607n477m458l579k711j951j354n21R97K986
62716E34082M795O155P273Q269R044R718J0708J2256J4225J6461J9014K1929K5118
62703F99047K8567L2408L6635M0981M5238M9519N4026N8722O3382O7809P1839
62692A248173P5204P7512P8400P7624P5048P0600O4274N6096M6161L4655K1835
$$ y = [1288199, 1372148, 1458776, 1547438, 1637590, 1728067, 1816972, 1902032, 1980838, 2050855, 2109546, 2154709, 2184784, 2199076, 2197716, 2181222, 2150061, 2104870, 2047160, 1979407, 1904169, 1823314, 1738288, 1650778, 1562735, 1475945, 1391863, 1311606, 1235672, 1163853, 1095867, 1032004, 972873, 918830, 870150, 827374, 790601, 758493, 728921, 700913, 675206, 652584, 632537, 614161, 597646, 583922, 573140, 564375, 556757, 550150, 544673, 540215, 536636, 533925, 531974, 530620, 530099, 531096, 534082, 538877, 545032, 552305, 560574, 569618, 579336, 590044, 602300, 616525, 632986, 652000, 673929, 699047, 727614, 760022, 796657, 837638, 882876, 932395, 986421, 1045143, 1108525, 1176334, 1248173, 1323377, 1400889, 1479289, 1556913, 1631961, 1702561, 1766835, 1822931, 1869092, 1903747, 1925582]
62681A925582Q055o185k0228l3473m5591n6399o5487p2206p6194p7859p8060p7331
62669A324624p5593p2652o8767o4478o0074n5498n0817m6372m2409l8787l5308
62658G13869l2057k9129k6249k3119k0021j7578j5890j4343j2532j0883j0087
62647E01981j0178j0498j0372r575q273o861n739n058m670m406m187l798k960
62634D15406j838j099j058j120o14J87M88J74j28j36k89q42j373j514j521j705
62618D03018j753j122K21J806L119L767L606L173L488M906O439O841O256O092
62604D49857P319R497J1582J3083J4193J5249J6587J8592K1470K4929K8346L1376
62592F62080L4247L7370M0630M3244M4492M4505M3982M3066M0956L6888L1144
$$ y = [1925582, 1933637, 1927452, 1907224, 1873751, 1828160, 1771761, 1706274, 1634068, 1557874, 1480015, 1401955, 1324624, 1249031, 1176379, 1107612, 1043134, 983060, 927562, 876745, 830373, 787964, 749177, 713869, 681812, 652683, 626434, 603315, 583294, 565716, 549826, 535483, 522951, 512068, 501981, 491803, 481305, 470933, 461358, 453085, 446224, 440485, 435427, 430757, 426351, 422164, 418366, 415406, 413568, 412469, 411411, 410291, 409677, 409864, 410352, 410526, 410398, 410262, 409973, 409131, 407758, 406244, 404723, 403018, 401265, 400143, 400364, 402170, 405289, 409056, 412662, 415835, 419323, 424229, 430668, 437509, 443765, 449857, 457176, 466673, 478255, 491338, 505531, 520780, 537367, 555959, 577429, 602358, 630704, 662080, 696327, 733697, 774327, 817571, 862063, 906568, 950550, 993616, 1034572, 1071460, 1102604]
62581A102604K4575J7479R620J217o820j3886k0251k6319l1837l6223l9322m1394
62569I39443m2572m2724m1797l9976l7576l4946l2264k9422k6305k3321k1162
62558E67378j9787j8205j5752j3121j1375j0351q985p090n723n485n519m780l490
62545D37715k546k096j598r73o81p29m75L47J192J571J739K078K390K285J903
62530D42122J743J958K330K771L378M081M695N378O615Q597J0967J3274J5467
62517E23376J7733K0174K2809K5701K8817L1881L4619L7170L9917M2866M5317
62506H70380M6347M5617M3596M0962L7801L3526K7569K0087J1965M257k378p857
62494A171872j2564j6943k1005k4179k5763k5575k4019k1537j8253j4152r415
$$ y = [1102604, 1127179, 1144658, 1154278, 1155495, 1148675, 1134789, 1114538, 1088219, 1056382, 1020159, 980837, 939443, 896871, 854147, 812350, 772374, 734798, 699852, 667588, 638166, 611861, 588540, 567378, 547591, 529386, 513634, 500513, 489138, 478787, 469802, 462712, 456989, 451504, 445985, 441205, 437715, 435169, 433073, 431475, 430502, 429821, 429092, 428617, 428964, 430156, 431727, 433466, 435544, 437934, 440219, 442122, 443865, 445823, 448153, 450924, 454302, 458383, 463078, 468456, 475071, 483668, 494635, 507909, 523376, 541109, 561283, 584092, 609793, 638610, 670491, 705110, 742280, 782197, 825063, 870380, 916727, 962344, 1005940, 1046902, 1084703, 1118229, 1145798, 1165885, 1177850, 1182107, 1179729, 1171872, 1159308, 1142365, 1121360, 1097181, 1071418, 1045843, 1021824, 1000287, 982034, 967882, 958467]
62483I58467m338R02O214J1400J6189K0423K4107K7225K9631L1091L1404L0475
62471A183190K8330K4995K0366J4298O974q84q333j4802k0484k6129l2387l9049
62459A136085m4941m8783n0297n0335m9804m8797m6924m4166m0850l7068l2695
62448F41425k8086k4066k0964j8161j5041j1985r847q580p086m566j522Q53K010
62435D94384K437K893L549L924L456K121N53m48p27r81k021l800n409o181o472
62420D87278p075q107q880q927q572q256p772o678n271m484m694n108m724l544
62406C95186k511k374k925l336k941j705j79R21J229R69O23M31L07J93K99Q46
62390C85033J738K661L420M027M408M207L126J535M75Q03K334M065N252N946O462
$$ y = [958467, 954129, 955031, 961245, 972645, 988834, 1009257, 1033364, 1060589, 1090220, 1121311, 1152715, 1183190, 1211520, 1236515, 1256881, 1271179, 1278153, 1277269, 1268936, 1254134, 1233650, 1207521, 1175134, 1136085, 1091144, 1042361, 992064, 941729, 891925, 843128, 796204, 752038, 711188, 674120, 641425, 613339, 589273, 568309, 550148, 535107, 523122, 513275, 504695, 497609, 493043, 491521, 492374, 494384, 496821, 499714, 503263, 507187, 510643, 512764, 513317, 512869, 512142, 511161, 509140, 505340, 499931, 493750, 487278, 480203, 472096, 463216, 454289, 445717, 437461, 429689, 423011, 417740, 413256, 408562, 403454, 398730, 395186, 392675, 390301, 387376, 384040, 381099, 379394, 379215, 380136, 381365, 382334, 382957, 383388, 383695, 383888, 384187, 385033, 386771, 389432, 392852, 396879, 401287, 405494, 408620, 410155, 410630, 411433, 413767, 417832, 423084, 429030, 435492]
62375D35492O809O937P196P982R100R938J0285J0520J0974J1624J2512J3973J6219
62362E69561J9022K2096K5407K8926L2453L6011M0033M4787M9893N4791N9371
62351I82351O3658O7172O9147O9286O7731O4351N8640N0334L9830K7938J5662
62340A576100M072o143j5031k2943k9915l5948m1601m7325n2295n4958n5043n3966
62328A165004n2802n0922m7474m3130l9259l5995l2446k8513k5128k2785k1065
62317G65485j9807j9544k0316k1062k0824j9819j8812j8061j7409j6824j6218
62306E56789j5172j3491j1686j0336r298q083o748n720n002m212l332k787k699
62293D58223k592k001r82N4P07Q10O22P09J259J672J381R41J491L102M427M458
$$ y = [435492, 442301, 449238, 456434, 464416, 473516, 483454, 493739, 504259, 515233, 526857, 539369, 553342, 569561, 588583, 610679, 636086, 665012, 697465, 733476, 773509, 818296, 868189, 922980, 982351, 1046009, 1113181, 1182328, 1251614, 1319345, 1383696, 1442336, 1492670, 1532500, 1560438, 1576100, 1580172, 1574029, 1558998, 1536055, 1506140, 1470192, 1428591, 1381266, 1328971, 1274013, 1218970, 1165004, 1112202, 1061280, 1013806, 970676, 931417, 895422, 862976, 834463, 809335, 786550, 765485, 745678, 726134, 705818, 684756, 663932, 644113, 625301, 607240, 589831, 573007, 556789, 541617, 528126, 516440, 506104, 496806, 488723, 481975, 476255, 471253, 467041, 463709, 460922, 458223, 455631, 453630, 452648, 452702, 453409, 454219, 454841, 455550, 456809, 458481, 459862, 460803, 462294, 465396, 469823, 474281]
62277D74281L829L797M572N392N862O252O661O824O947P764R417J1003J1793J2345
62263E76739J3727J6022J8436K0718K3602K7664L2520L7537M2741M8411N4211
62252I12328N9400O3779O7725P1240P3485P3542P1114O6265N8878M8888L6888
62241A603532K4023J1261q87j2001k1621k9717l6981m4222n1561n8374o3944o7877
62229A251631o9925o9875o7786o4180n9667n4535m8951m3423l8641l4785l1262
62218F68601k7403k3250j9537j6921j5397j4322j2968j1111r190p810p062o515
62206D97115n830n054m184k935j279J47P49Q71J446K859M687O497Q235R746J0668
62191E23738J1081J1608J2512J3254J3437J3561J4198J4855J4578J3397J2334
$$ y = [474281, 478110, 481907, 486479, 491871, 497733, 503985, 510646, 517470, 524417, 532181, 541598, 552601, 564394, 576739, 590466, 606488, 624924, 645642, 669244, 696908, 729428, 766965, 809706, 858117, 912328, 971728, 1035507, 1103232, 1174472, 1247957, 1321499, 1392613, 1458878, 1517756, 1566644, 1603532, 1627555, 1638816, 1637929, 1625928, 1604307, 1574590, 1537609, 1493387, 1441826, 1383452, 1319508, 1251631, 1181706, 1111831, 1044045, 979865, 920198, 865663, 816712, 773289, 734648, 699863, 668601, 641198, 617948, 598411, 581490, 566093, 551771, 538803, 527692, 518502, 510692, 503630, 497115, 491285, 486231, 482047, 479112, 477833, 477980, 478729, 479600, 481046, 483905, 488592, 495089, 503324, 513070, 523738, 534819, 546427, 558939, 572193, 585630, 599191, 613389, 628244, 642822, 656219, 668553]
62180F68553J1885J1423J0331Q925P768O698N227L583K633K842L890N348P260
62167G56366R823J2972J6628K1071K6573L2719L8448M2963M6317M8915N0693N1021
62155A154509M9311M5357L9205L1070K1592J1836K739n353j2517j8785k4100k8656
62143A266208l2913l7181m1236m4402m5943m5510m3353m0140l6550l2955k9461
62132H36564k6057k2652j9089j5319j1522p969m830k226l28P91J430K109L117
62119G34019M284N281N995O483O695O428N605M449L211J836O7k075m101n451n938
62104G66788n721n111m621m936o375q348r717r745q442o154l339p00J134K319
62090F97032L627N316O697P239P396P806Q169P809P002O892Q030R799J1330J2370
$$ y = [668553, 680438, 691861, 702192, 711117, 718885, 725583, 730810, 734393, 737026, 739868, 743758, 749106, 756366, 766189, 779161, 795789, 816860, 843433, 876152, 914600, 957563, 1003880, 1052795, 1103488, 1154509, 1203820, 1249177, 1288382, 1319452, 1341044, 1352880, 1355619, 1350266, 1337749, 1318964, 1294864, 1266208, 1233295, 1196114, 1154878, 1110476, 1064533, 1019023, 975670, 935530, 898980, 866025, 836564, 810507, 787855, 768766, 753447, 741925, 733956, 729126, 726900, 726572, 727363, 728793, 730902, 734019, 738303, 743584, 749579, 756062, 762757, 769185, 774790, 779239, 782450, 784286, 784353, 782278, 778177, 772726, 766788, 761067, 755956, 751335, 746399, 740024, 731676, 721959, 712214, 703772, 697618, 694279, 693579, 694713, 697032, 700659, 705975, 712672, 719911, 727307, 735113, 743282, 751091, 758093, 764985, 773015, 782814, 794144, 806514]
62076H06514J3119J3891J5127J7171J9707K1807K2931K3474K4089K4919K5770
62065A028519K6764K8284L0342L2401L3939L5001L6177L7940L9977M1241M0762
62054A411347L8327L4266K8793K2000J4293O398j206q403j5087k1141k6837l2661
62042A450089l8548m3727m7604n0300n2129n3061n3066n2511n1653n0114m7352
62031I10024m3511l9352l5479l2013k8834k5725k2463j9137j6334j4591j3749
62020F18836j3138j2386j1640j1096j0634j0010r123q097p258o982p280p586p254
62007D96352o215n000m102l491k758j580j02J176J904K264K636K959K841K330
61993D89214J981J975J779J004Nq52j836l105m016m079m083n134o886p959q024
$$ y = [806514, 819633, 833524, 848651, 865822, 885529, 907336, 930267, 953741, 977830, 1002749, 1028519, 1055283, 1083567, 1113909, 1146310, 1180249, 1215250, 1251427, 1289367, 1329344, 1370585, 1411347, 1449674, 1483940, 1512733, 1534733, 1549026, 1555424, 1554218, 1545815, 1530728, 1509587, 1482750, 1450089, 1411541, 1367814, 1320210, 1269910, 1217781, 1164720, 1111654, 1059143, 1007490, 957376, 910024, 866513, 827161, 791682, 759669, 730835, 705110, 682647, 663510, 647176, 632585, 618836, 605698, 593312, 581672, 570576, 559942, 549932, 540809, 532712, 525454, 518472, 511192, 503606, 496352, 490137, 485137, 481035, 477544, 474786, 473206, 473104, 474280, 476184, 478448, 481084, 484043, 486884, 489214, 491195, 493170, 494949, 495953, 495958, 495106, 493270, 490165, 486149, 482070, 477987, 472853, 465967, 458008, 449984]
61978D49984q115q710q811p560n588m052l173k556k192k292k540k402j815r90
61964C89188N6J164J675J197L35m3P2K00M89J389K445K561J674J092J790L148
61948D08432L865L513K737K420L090M690O538P833Q576R625J1535J3700J5127
61935E01681J5643J5865J6183J6367J6122J5535J4922J4500J4215J3756J2764
61924F67553J1295R858Q765P586N680L165Q99o29j871l505n407o689o643n389
61910F84668l654k015m55J426L845O555R118J1269J2854J3554J3036J1446R411
61897G71058P383N142K207j399n007p969j0200j2060j3836j5465j6646j7164j7063
61884F68981j6566j5840j4892j3737j2600j1767j1247j0766j0210r887j0127j0750
$$ y = [449984, 441869, 433159, 424348, 416788, 411200, 407148, 403975, 401419, 399227, 396935, 394395, 391993, 390178, 389188, 389244, 390408, 392083, 393280, 393615, 393572, 393644, 393844, 394333, 395722, 398167, 400728, 402402, 403494, 405284, 408432, 412297, 415810, 418547, 420967, 424057, 428747, 435285, 443118, 451694, 461319, 472854, 486554, 501681, 517324, 533189, 549372, 565739, 581861, 597396, 612318, 626818, 641033, 654789, 667553, 678848, 688706, 697471, 705057, 710737, 713902, 714801, 714172, 712301, 708796, 703389, 696700, 690057, 684668, 681014, 678999, 678544, 679970, 683815, 690370, 699488, 710757, 723611, 737165, 750201, 761647, 771058, 778441, 783583, 785790, 784391, 779384, 771415, 761215, 749155, 735319, 719854, 703208, 686044, 668981, 652415, 636575, 621683, 607946, 595346, 583579, 572332, 561566, 551356, 541469, 531342, 520592]
61872E20592j1160j0931j0096q873p412n892m595l614k754j896j242q77l33R92
61858D51909L040N097O654P870R208J0936J3088J5533J7891J9812K1465K3417
61846F05920K5730K7607K8304K8017K7467K6914K6056K4609K2454J9362J5226
61835H77666J0595O324K615j048m867q178j0150j0533r444p005l641k71K429M739
61821H49231P329J0103J2184J3020J2858J2038J0320P284L021j898o989j2035
61809I16466j6781k0823k3879k5922k7116k7743k8269k9008k9488k8523k5453
61798F33461k1265j7907j6344j5748j4795j3194j1553j0191q920p720o872o377
61786D82575n959n716o092o972p449o911n836n051m691m297l605k702j737r43
$$ y = [520592, 509432, 498501, 488405, 479532, 472120, 466228, 461633, 458019, 455265, 453369, 452127, 451250, 450917, 451909, 454949, 460046, 466700, 474570, 483778, 494714, 507802, 523335, 541226, 561038, 582503, 605920, 631650, 659257, 687561, 715578, 743045, 769959, 796015, 820624, 843078, 862440, 877666, 888261, 894585, 897200, 896152, 891285, 883107, 872957, 862424, 852980, 845975, 842334, 842063, 844492, 849231, 856560, 866663, 878847, 891867, 904725, 916763, 927083, 934367, 937388, 935490, 928501, 916466, 899685, 878862, 854983, 829061, 801945, 774202, 745933, 716925, 687437, 658914, 633461, 612196, 594289, 577945, 562197, 547402, 534208, 522655, 512464, 503544, 495824, 488952, 482575, 476616, 470900, 464808, 457836, 450387, 443476, 437640, 432589, 427898, 423601, 419996, 417294, 415557, 414614]
61772D14614o62q95j096r04p51j187j813j719q13K8J90K8J26N06Q93J234J613
61755D09392J947K136K230K270K173J951J769J705J646J454J000J13j059j753
61741D26974j328l48j50j020j698j171k09k05j110j614j075j25O20J293J925J975
61725D22734J330R12J501K439K486J622J076J570K457K871K911L132L450L262
61711D53753K528J987K160K575K324J090n19j574j599r58n26r36k001k994l509
61696D51801l786m092m213l826l121k591k343k106j900k144k946l715l796l225
61682D07997k562k207k145k164j995j339j27J192J819J269k10j778k584k281j221
61667C91664j35M55O19P29Q94Q28K85n08j014r61o12l54j63L32J189J864J776
$$ y = [414614, 413952, 413057, 411961, 411057, 410306, 409119, 407306, 405587, 404774, 404802, 404992, 405020, 405146, 405652, 406545, 407779, 409392, 411339, 413475, 415705, 417975, 420148, 422099, 423868, 425573, 427219, 428673, 429673, 429786, 428727, 426974, 425646, 425298, 425148, 424128, 422430, 421259, 421050, 420845, 419735, 418121, 417046, 416921, 417541, 418834, 420759, 422734, 424064, 424976, 426477, 428916, 431402, 433024, 434100, 435670, 438127, 440998, 443909, 447041, 450491, 453753, 456281, 458268, 460428, 463003, 465327, 466417, 465898, 464324, 462725, 461767, 461241, 460305, 458304, 455310, 451801, 448015, 443923, 439710, 435884, 432763, 430172, 427829, 425723, 423823, 421679, 418733, 415018, 411222, 407997, 405435, 403228, 401083, 398919, 396924, 395585, 395458, 396650, 398469, 399738, 399528, 397750, 395166, 392885, 391664, 391529, 391984, 392603, 393332, 394226, 395054, 395339, 394831, 393817, 392856, 392244, 391890, 391727, 392059, 393248, 395112, 396888]
61650C96888J026K60j13k16j97J16Q55J667K015J837J608J706K033K258K233K039
61634D16015J765J420J008N33o5q54j684k190k164j900j964k568l304l577l198
61619C97273k494j948j816j925j805j158k48L32M10L65L91J5j199k774l744l840
61603C75835l714l925m298m429m331m250m196l964l503k969k591k498k647k837
61589C25683k939l053l219l151k618k012k006k606l041k790k194j890k061k482
61575B89621k839k766k046j118q79j625k565k795k256j382m11M20N12l66j308
61560B68197j132M4R15P25J01j4M40R03J071J077J060J013R67J050J350J803K087
61543B81657J795Q29l49j034q79q9Q41J412J332P33J34j36l23p58j163r50j47
$$ y = [396888, 397914, 398174, 398061, 397845, 397648, 397764, 398619, 400286, 402301, 404138, 405746, 407452, 409485, 411743, 413976, 416015, 417780, 419200, 420208, 420741, 420676, 419822, 418138, 415948, 413784, 411884, 409920, 407352, 404048, 400471, 397273, 394779, 392831, 391015, 389090, 387285, 386127, 385879, 386211, 386621, 386986, 387377, 387392, 386193, 383419, 379675, 375835, 372121, 368196, 363898, 359469, 355138, 350888, 346692, 342728, 339225, 336256, 333665, 331167, 328520, 325683, 322744, 319691, 316472, 313321, 310703, 308691, 306685, 304079, 301038, 298248, 296054, 294164, 292103, 289621, 286782, 284016, 281970, 280852, 279973, 278348, 275783, 272988, 270732, 269350, 268939, 269359, 269871, 269505, 268197, 267065, 267109, 268024, 268749, 268850, 268836, 269276, 270179, 271250, 272327, 273387, 274400, 275367, 276417, 277767, 279570, 281657, 283452, 284281, 283932, 282898, 282019, 281930, 282771, 284183, 285515, 286248, 286382, 286246, 285923, 285165, 284002, 283052, 282905]
61526B82905N17N52K55J18J20j38q50j816k582k620j724l94L97K30k30n5P32J183
61508B76600O96j49l70J58N54J40o84r93n35O2J78j46n38q39j041j076r23p32
61490B70362n13m5O20R16M63k66m95j51J94K97M32P29R17R07R81J260J472J509
61472B79589J670K104K427K284J837J364P38k22j130j331p39N9N27O43O14N08
61456B90942L44K57K97K50q0m35k75M92J268J428J079P80O80M70J67K88R49J433
61438C00334J174O88Q52J604K143K228K409K928L273L078K677K398J917R21j45
61423C28479n72l41JK20N59J113J585J716J594J361J024P37R35J801K728K686
61407C45626J346m18j348j091m00j66n73j252j850k156k031j584j212j129j028
$$ y = [282905, 283422, 283974, 284229, 284347, 284467, 284329, 283479, 281663, 279081, 276461, 274737, 274343, 274740, 274970, 274740, 274685, 275417, 276600, 277296, 277147, 276777, 276935, 277489, 277629, 276945, 275952, 275417, 275479, 275657, 275511, 274973, 274134, 273093, 272017, 271094, 270362, 269849, 269804, 270424, 271340, 271803, 271537, 271042, 270891, 271085, 271382, 271814, 272543, 273460, 274367, 275348, 276608, 278080, 279589, 281259, 283363, 285790, 288074, 289911, 291275, 292013, 291791, 290661, 289330, 288591, 288650, 289177, 289820, 290434, 290942, 291286, 291543, 291840, 292090, 292010, 291575, 291300, 291792, 293060, 294488, 295567, 296347, 297027, 297497, 297664, 297952, 298901, 300334, 301508, 302196, 303048, 304652, 306795, 309023, 311432, 314360, 317633, 320711, 323388, 325786, 327703, 328624, 328479, 327907, 327566, 327567, 327787, 328346, 329459, 331044, 332760, 334354, 335715, 336739, 337476, 338411, 340212, 342940, 345626, 346972, 346554, 345206, 344115, 343715, 343549, 342976, 341724, 339874, 337718, 335687, 334103, 332891, 331762, 330734]
61392C30734n67K5K50P5j07j42j67j21K19O29N08k32q22n42L69J034R39L46j47
61373C32281k39j15j8J89Q22J685K104J872J702K147K602K162J149P32J158J426
61357C51659R52N01R47J993K735K891K928L383M482O023P281P450O612N749N548
61342D11134N696N642N411N216M860M171L570L563M055M581M904M901M341L267
61328D75312K204J494P70l54j544k197k244j977j547j203j407k016j894k58K007
61313D65146L336L355K911K610K547L163M989P374Q789Q824Q737R537J0592J0821
61299E52731J0309R870R612Q874P287N134K797M82j544l004l982m889o034p364
61285E80279q542r132q912q244p893q182q496p975o580n065l925k906j672m78
$$ y = [330734, 330167, 330192, 330442, 330517, 330410, 330268, 330101, 329980, 330199, 330828, 331336, 331104, 330282, 329740, 330109, 331143, 332082, 332428, 332281, 332042, 331927, 331909, 332098, 332920, 334605, 336709, 338581, 340283, 342430, 345032, 347194, 348343, 349075, 350233, 351659, 352611, 353112, 354059, 356052, 358787, 361678, 364606, 367989, 372471, 378494, 385775, 393225, 399837, 405586, 411134, 416830, 422472, 427883, 433099, 437959, 442130, 445700, 449263, 453318, 457899, 462803, 467704, 472045, 475312, 477516, 479010, 479780, 479426, 477882, 475685, 473441, 471464, 469917, 468714, 467307, 465291, 463397, 463139, 465146, 468482, 471837, 474748, 477358, 479905, 483068, 488057, 495431, 504220, 513044, 521781, 531318, 541910, 552731, 563040, 572910, 582522, 591396, 598683, 603817, 606614, 607096, 605552, 602548, 598566, 593677, 587643, 580279, 571737, 562605, 553693, 545449, 537556, 529374, 520878, 512903, 506323, 501258, 497333, 494427, 492755, 492277]
61271D92277J88L42M40O22N64J85MM59J316K110K905L982N024N351M991M845N440
61254E31045O216O383N986N581N327M954M395L906L620L393K991K236J106l7o00
61239E86502m83l89j058k378l591m099l732k592j118n2K40K42O42J455K214K764
61223E74567L257L621L679L687M102M818N243N205N176N564O264O949P329P089
61209F46550O129M920M162L962L768L142K163J145M02L14J055K176L038L742N039
61194F91707P196R451J0886J1406J1584J1849J2104J1859J0683Q710O659N101
61182H09195L827K307O43n25r96j224j507j688j852k580m060n471n843n219m534
61167G80473m526n176o037o752p250p607p881q094q395q999r814j0390j0545j0739
$$ y = [492277, 492465, 492807, 493247, 493869, 494433, 494618, 494622, 495081, 496397, 498507, 501412, 505394, 510418, 515769, 520760, 525605, 531045, 537261, 543644, 549630, 555211, 560538, 565492, 569887, 573793, 577413, 580806, 583797, 586033, 587139, 587102, 586502, 586019, 585630, 584572, 582194, 578603, 574504, 570772, 568180, 567062, 567010, 567250, 567492, 568134, 569589, 571803, 574567, 577824, 581445, 585124, 588811, 592913, 597731, 602974, 608179, 613355, 618919, 625183, 632132, 639461, 646550, 652679, 657599, 661761, 665723, 669491, 672633, 674796, 675941, 676343, 676657, 677712, 679888, 682926, 686668, 691707, 698903, 708354, 719240, 730646, 742230, 754079, 766183, 778042, 788725, 797435, 804094, 809195, 813022, 815329, 815972, 815447, 814451, 813227, 811720, 810032, 808180, 805600, 801540, 796069, 790226, 785007, 780473, 775947, 770771, 764734, 757982, 750732, 743125, 735244, 727150, 718755, 709756, 699942, 689552, 679007, 668268]
61153F68268j1295j1575j0598q492o559n716n508m910l569j955q34q41k125m063
61139E90228n679o596p233p880q074p264n628l863k407j287m70Q8O65J631L032
61124E39263M516N739O762P924R345J0684J1642J2586J4223J6553J8654J9915
61112F77806K0882K2270K3651K4040K3525K3299K3994K4886K4932K3911K2269
61101I35465K0435J8543J6390J3614J0337P438N508L752P93l444p594j0695j3078
61088I97464j5189j6729j7496j8108j9163k0386k1223k1635k1718k1183j9842
61077G84792j8208j6999j6372j5977j5362j4164j2406j0815j0097r766q583o402
61065F29641m567l969l819l042j792o69N49K258L871M582M769N392O442P126P395
$$ y = [668268, 656973, 645398, 634800, 626308, 619749, 614033, 608525, 603615, 600046, 598091, 597257, 596416, 594291, 590228, 584549, 577953, 570720, 562840, 554766, 547502, 541874, 538011, 535604, 534317, 533847, 533935, 534600, 536231, 539263, 543779, 549518, 556280, 564204, 573549, 584233, 595875, 608461, 622684, 639237, 657891, 677806, 698688, 720958, 744609, 768649, 792174, 815473, 839467, 864353, 889285, 913196, 935465, 955900, 974443, 990833, 1004447, 1014784, 1022222, 1027730, 1031482, 1032275, 1028831, 1021237, 1010542, 997464, 982275, 965546, 948050, 929942, 910779, 890393, 869170, 847535, 825817, 804634, 784792, 766584, 749585, 733213, 717236, 701874, 687710, 675304, 664489, 654392, 644626, 636043, 629641, 625074, 621105, 617286, 614244, 612452, 611783, 612332, 614590, 618461, 623043, 627812, 633204, 639646, 646772, 654167]
61050F54167Q081R507J1020J2051J2780J3626J4699J5961J7432J9087K0831K2620
61038H31862K4365K5953K7530K9375L1409L3269L5145L7736M1008M3810M5386
61027A206848M6512M8326N0727N2795N4267N5669N7440N9858O3438O8536P4884
61016A839300Q2239R1063J01810J14135J27775J43754J64008J90439K25170K70941
61006C350634L30206M04600M96188O07975P41528Q94731J062238J235214J398634
60997A0521948J533541J628278J683869J696266J630685J430458J073056O21319
60989B1819420K04189o7670j70507j56625r2882k7864j2962j20599m06046q43384
60979B0125070j315209j681128j862108j866109j750413j573518j375668j181634
$$ y = [654167, 662248, 671755, 682775, 694826, 707606, 721232, 735931, 751892, 769324, 788411, 809242, 831862, 856227, 882180, 909710, 939085, 970494, 1003763, 1038908, 1076644, 1117652, 1161462, 1206848, 1253360, 1301686, 1352413, 1405208, 1459475, 1515144, 1572584, 1632442, 1695880, 1764416, 1839300, 1921539, 2012602, 2114412, 2228547, 2356322, 2500076, 2664084, 2854523, 3079693, 3350634, 3680840, 4085440, 4581628, 5189603, 5931131, 6825862, 7888100, 9123314, 10521948, 12055489, 13683767, 15367636, 17063902, 18694587, 20125045, 21198101, 21819420, 22023609, 21955939, 21785432, 21628807, 21535925, 21508061, 21495099, 21374500, 20968454, 20125070, 18809861, 17128733, 15266625, 13400516, 11650103, 10076585, 8700917, 7519283]
60971G519283j004922q49308p13266n95413m95412m11954l42754k86136k40939
60962B579179k05404j77401j55184j37029j21091j06545r3955q3616p4510o5764
60952A358680n7878n1388m5550l9717l4955l2694l2459l2398l1524l0053k8059
60941I42005k5308k2219j9678j7938j6646j5677j4974j4025j2584j1555j1895
60930G59506j2972j3247j2422j1599j1368j1087j0292r508r234r105q594p824
60918F32254p263p081p105o994o392n317m332l862l514k681j546p25j19R30K395
60903E78648L471L844M073M536M936N218N962P410Q901R833J0455J1138J1582
60890F70007J1460J1295J1876J3075J4008J4203J3984J3821J3876J4168J4706
$$ y = [7519283, 6514361, 5665053, 4951787, 4356374, 3860962, 3449008, 3106254, 2820118, 2579179, 2373775, 2196374, 2041190, 1904161, 1783070, 1676525, 1582570, 1498954, 1424444, 1358680, 1300802, 1249414, 1203864, 1164147, 1129192, 1096498, 1064039, 1031641, 1000117, 970064, 942005, 916697, 894478, 874800, 856862, 840216, 824539, 809565, 795540, 782956, 771401, 759506, 746534, 733287, 720865, 709266, 697898, 686811, 676519, 667011, 657777, 648672, 640078, 632254, 624991, 617910, 610805, 603811, 597419, 592102, 587770, 583908, 580394, 577713, 576167, 575442, 575323, 576253, 578648, 582119, 585963, 590036, 594572, 599508, 604726, 610688, 618098, 626999, 636832, 647287, 658425, 670007, 681467, 692762, 704638, 717713, 731721, 745924, 759908, 773729, 787605, 801773, 816479]
60879H16479J5348J5904J6378J6789J6839J6130J4775J3347J2121J0764Q949O936
60867I80759N142L413J222j465l968n791p268r063j1252j3283j4670j5415j5825
60854H92536j6297j7161j8352j9278j9402j8914j8401j7939j7123j6020j5408
60843F98241j5727j6328j6241j5265j3979j3017j2672j2858j3100j2855j2172
60832E44027j1703j1776j1896j1469j0544r458q279p076o232n875n432m442l419
60819D36426l170l555l800l704l670l695l252k277j383r23o01j96K9o5j83j15
60803D05866n1p2J46P89J482J705J348O59L8n9N95J603K185J996J345N87k18r71
60785D18973j385j407j344j387j402j436j870k788l617l827l586l351l184k858
$$ y = [816479, 831827, 847731, 864109, 880898, 897737, 913867, 928642, 941989, 954110, 964874, 973823, 980759, 985901, 989314, 990536, 989071, 985103, 979312, 972044, 962981, 951729, 938446, 923776, 908361, 892536, 876239, 859078, 840726, 821448, 802046, 783132, 764731, 746792, 729669, 713649, 698241, 682514, 666186, 649945, 634680, 620701, 607684, 595012, 582154, 569054, 556199, 544027, 532324, 520548, 508652, 497183, 486639, 477181, 468902, 461826, 455594, 449719, 444287, 439845, 436426, 433256, 429701, 425901, 422197, 418527, 414832, 411580, 409303, 407920, 406997, 406396, 406200, 406229, 406164, 405981, 405866, 405815, 405743, 405889, 406678, 408160, 409865, 411213, 411872, 411910, 411851, 412446, 414049, 416234, 418230, 419575, 420162, 419944, 418973, 417588, 416181, 414837, 413450, 412048, 410612, 408742, 405954, 402337, 398510, 394924, 391573, 388389, 385531]
60771C85531k379j972j690j412j103q31o26n73q72j549k268k561k210j276o6P97
60755C64940O57m80j710k022j262j06O96Q42M57n7k09K45J111K066K983L753M000
60738C75904L274J675l4j014j080p95q89j511k064j903j159o87j121k180l043
60723C63373l205k854k538k650l098l397l244k937l061l653m092l912l385l052
60709C18295l018k986k736k220j492q46p71j303j698j224j78M68K84k97q34j278
60693B98166j403o48R53K245K066O90m24k63Q86K096K814K996K760K249J693J323
60677C18199J290J713K612L694M409M495M361M555M961M820L756K473K077K766
60663C66181L500L142J745M82K95Q76J174P54K60M18R85J129O21J81N09J402K109
$$ y = [385531, 383152, 381180, 379490, 378078, 376975, 376144, 375518, 374945, 374073, 372524, 370256, 367695, 365485, 364209, 364143, 364940, 365597, 365117, 363407, 361385, 360123, 360017, 360713, 361555, 362012, 361955, 361746, 361991, 363102, 365168, 368151, 371904, 375904, 379178, 380853, 380819, 379805, 378725, 377930, 377041, 375530, 373466, 371563, 370404, 369717, 368596, 366416, 363373, 360168, 357314, 354776, 352126, 349028, 345631, 342387, 339450, 336389, 332736, 328644, 324732, 321347, 318295, 315277, 312291, 309555, 307335, 305843, 304997, 304226, 302923, 301225, 300001, 299823, 300291, 300575, 300278, 299444, 298166, 296763, 296115, 297068, 299313, 301379, 302069, 301645, 301382, 302268, 304364, 307178, 310174, 312934, 315183, 316876, 318199, 319489, 321202, 323814, 327508, 331917, 336412, 340773, 345328, 350289, 355109, 358865, 361338, 363415, 366181, 369681, 372823, 374568, 375050, 375345, 376221, 377395, 378149, 378409, 378827, 379812, 380941, 381562, 381743, 382252, 383654, 385763]
60646C85763K184J679P37n28j773k549k794k901l162l368l237k934k950l503m306
60631C56358m888m974m520l627k542j597j025q02p06n00p2N21J018J050M81l47
60615C33828q43p03j61L55O43P24O66N37M97O37Q47R60R68R02O50K25K2L57P98
60596C41909N41l59p45J88J656K132J201m0m26KM16L80K26M01Q09R32M41l74q60
60577C48430o25J64J068J851K581L390M297N155N756O042O257O832P956R408J0820
60562D19382J1899J2286J1528R548O954M567K646Q66j042k924m487n541n917n458
60548D54307m276k832j501j82J486L568N641P267Q470R586J0697J1496J1825J1990
60534E27542J2242J2158J1102R236P454O105M424J637j797m596o000o241n882
$$ y = [385763, 387947, 389626, 390363, 389835, 388062, 385513, 382719, 379818, 376656, 373288, 370051, 367117, 364167, 360664, 356358, 351470, 346496, 341976, 338349, 335807, 334210, 333185, 332383, 331677, 331177, 331105, 331626, 332644, 333694, 334175, 333828, 332985, 332282, 332121, 332476, 333119, 333843, 334509, 335046, 335543, 336180, 337027, 337987, 338955, 339857, 340507, 340732, 340754, 341111, 341909, 342450, 342091, 341346, 341534, 343190, 345322, 346523, 346483, 346057, 346059, 346475, 346855, 347081, 347482, 348291, 349223, 349664, 349290, 348430, 347805, 347969, 349037, 350888, 353469, 356859, 361156, 366311, 372067, 378109, 384366, 391198, 399154, 408562, 419382, 431281, 443567, 455095, 464643, 471597, 476164, 478810, 479676, 478634, 475710, 471223, 465682, 459765, 454307, 450031, 447199, 445698, 445516, 447002, 450570, 456211, 463478, 471948, 481534, 492231, 503727, 515552, 527542, 539784, 551942, 563044, 572280, 579734, 585839, 590263, 591900, 590103, 585507, 579507, 573266, 567384]
60521E67384n294m683m146l653l259l219l539l626k852j402o0P91J428K049K448
60506E38367K581K953M086N918Q018J0173J2545J5409J8925K2985K7188L1095
60494G00243L4548L7634M0364M2538M3851M3901M2139L8155L2013K4077J4607
60483A094070L895p404j8388k8404l6960m3383m7119m8421m8139m6707m3964m0067
60471F89009l5863l1997k8306k4542k1147j8663j6854j5023j2992j1102r459p861
60459D55200o444n702n666n633n001m013l405l476l840l947l628l056k440j859
60445C97090j329q80o12p23j432k610l564l499k407j200p28q69r04n65j90m2l
60428C75533K3j34n44r78j178j098q10m75l97o65p83j39J045J839J798J470J391
$$ y = [567384, 562090, 557407, 553261, 549608, 546349, 543130, 539591, 535965, 533113, 531711, 531651, 532442, 533870, 535919, 538367, 540948, 543901, 547987, 553905, 561923, 572096, 584641, 600050, 618975, 641960, 669148, 700243, 734791, 772425, 812789, 855327, 899178, 943079, 985218, 1023373, 1055386, 1079463, 1094070, 1097965, 1090561, 1072173, 1043769, 1006809, 963426, 916307, 867886, 819747, 773040, 729076, 689009, 653146, 621149, 592843, 568301, 547154, 528491, 511637, 496614, 483622, 472520, 463061, 455200, 448756, 443054, 437388, 431755, 426754, 422741, 419336, 415860, 412020, 408073, 404445, 401389, 398949, 397090, 395761, 394881, 394269, 393546, 392114, 389504, 385940, 382441, 380034, 378834, 378106, 377237, 376333, 375768, 375578, 375536, 375533, 375556, 375422, 374878, 373900, 372722, 371624, 370814, 370339, 369942, 369277, 368494, 368355, 369400, 371239, 373037, 374507, 375898]
60411C75898J262O21k39o06l85q3R3M57J172J856K074J870J588J352J018N82M52
60394C88982J052K166K971K954K525K382K470K157J349P93J041J694J960J525
60380D16021O46j24j23R55K459L161K648J843J769K294K609K394J895J329R34
60365D40710J227K365L497L546K552J547J170J196J407K054L179M250M826N155
60351D78681N729O607P467Q053Q333Q422Q487Q564Q350P471N911M023K068K6k151
60336E66041m355o389p985q751q527p781p288p294p249o539n238m042l573l829
60322D77201m180l967l246k695k654k542j690l88M77P03R39J531K047K247K812
60307D66595M536P231J0001J2331J4327J6077J7394J8261J9095K0112K0565J9000
$$ y = [375898, 377160, 377781, 377542, 376936, 376551, 376468, 376561, 377018, 378190, 380046, 382120, 383990, 385578, 386930, 387948, 388530, 388982, 390034, 392200, 395171, 398125, 400650, 403032, 405502, 407659, 409008, 409801, 410842, 412536, 414496, 416021, 416667, 416543, 416420, 417375, 419834, 422995, 425643, 427486, 429255, 431549, 434158, 436552, 438447, 439776, 440710, 441937, 444302, 447799, 451345, 453897, 455444, 456614, 457810, 459217, 461271, 464450, 468700, 473526, 478681, 484410, 491017, 498484, 506537, 514870, 523292, 531779, 540343, 548693, 556164, 562075, 566098, 568166, 568192, 566041, 561686, 555297, 547312, 538561, 530034, 522253, 514965, 507671, 500422, 493883, 488645, 484603, 481030, 477201, 473021, 469054, 465808, 463113, 460459, 457917, 456227, 455839, 456316, 457019, 457958, 459489, 461536, 463783, 466595, 471131, 478362, 488363, 500694, 515021, 531098, 548492, 566753, 585848, 605960, 626525, 645525]
60295F45525J4596Q244J905l260p800j2709j7609k0885k1552k0315j8554j6864
60283E30722j4999j2731j0285q059o313n092m200l363k557k024j881j949k104
60270D55165k488l152l776m044m086m202m317m107l537k954k604k353j983j561
60256D10001j391j585j778j376k33J017J514J094L89L9J30N06J121J814K081J553
60240D14896N25l37o19l27L23R65J201J072J155J744K229J863R27M28O59Q66N29
60223D28099J69M31J028J226R76R24J444K212K713K764K601K693L389M450N115
60208D60234M978M622M914N845O660P012P263P531P231N988M460L663L832M440
60194E38673M977N181M768L680K510K017K115J932R78l01j298j993k636l232l724
$$ y = [645525, 660121, 668365, 670270, 667010, 659210, 646501, 628892, 608007, 586455, 566140, 547586, 530722, 515723, 502992, 492707, 484648, 478335, 473243, 469043, 465680, 463123, 461099, 459218, 457269, 455165, 452677, 449525, 445749, 441705, 437619, 433417, 429100, 424993, 421456, 418502, 415898, 413545, 411562, 410001, 408610, 407025, 405247, 403871, 403638, 404655, 406169, 407263, 407652, 407691, 407821, 408327, 409448, 411262, 413343, 414896, 415421, 415084, 414465, 414138, 414461, 415426, 416627, 417699, 418854, 420598, 422827, 424690, 425617, 426045, 426704, 427570, 428099, 428268, 428699, 429727, 430953, 431929, 432853, 434297, 436509, 439222, 441986, 444587, 447280, 450669, 455119, 460234, 465212, 469834, 474748, 480593, 487253, 494265, 501528, 509059, 516290, 522278, 526738, 530401, 534233, 538673, 543650, 548831, 553599, 557279, 559789, 561806, 563921, 565853, 566831, 566530, 565232, 563239, 560603, 557371, 553647]
60179E53647m320n042n351m788l817l425l803m052l423k356j857k178k570k360
60165E04305j802j625j996k340k204j863j853k112k060j460p94o04q13r17o06
60150D81256L8O91R58N79j67m98J13J238J955J998K000K577L540M276M596M795
60134E09945N044N124M888M649M820N212N138M308L335L068L499L762L171J916
60120E67879O30l16q63r51n78M1O93J459K439L313L555L122K541K205J863J075
60104E88107p3r89j337j513k130l118l657l234k470k447l296l999l710k725j812
60089E51597j125l25O06J280J585J785K015K144K260K737L606M232L881K467O10
60074E79355r09j698k015k486l440m499n053n074n180n864o955p876q143p623
$$ y = [553647, 549327, 544285, 538934, 534146, 530329, 526904, 523101, 519049, 515626, 513270, 511413, 509235, 506665, 504305, 502503, 500878, 498882, 496542, 494338, 492475, 490622, 488510, 486450, 484990, 484196, 483592, 482779, 481862, 481256, 481294, 481985, 482943, 483522, 483355, 482857, 482970, 484208, 486163, 488161, 490161, 492738, 496278, 500554, 505150, 509945, 514989, 520113, 525001, 529650, 534470, 539682, 544820, 549128, 552463, 555531, 559030, 562792, 565963, 567879, 568509, 568193, 567330, 566379, 565801, 565842, 566535, 567994, 570433, 573746, 577301, 580423, 582964, 585169, 587032, 588107, 588034, 587045, 585708, 584195, 582065, 578947, 575290, 572056, 569586, 567139, 563843, 559844, 556134, 553409, 551597, 550472, 550147, 550753, 552033, 553618, 555403, 557418, 559562, 561822, 564559, 568165, 572397, 576278, 578745, 579355, 578446, 576748, 574733, 572247, 568807, 564308, 559255, 554181, 549001, 543137, 536182, 528306, 520163, 512540]
60060E12540o614n740n520n876o225o105n511m694l958l583l599l533k787j384
60046D47411M1J069J917K839L529L521K938K420K476L172M275N392O045N920N129
60031D98094M088L116K304J599Q66r5j341k599l421l666l720m167n213o373o864
60016D72608o388n487m988n070n136m610l642k872k729l054l378l312k766k006
60002D17170j406j135r77o29j00K13l7o88j083o85L57J323J689J563J340J138
59986D18053Q74P36J140K145L193L649L401K868K502K355K078J341K56p13j311
59971D42567j814k547l290l516l154k666k350j937j065J96J452K348K646K281
59957D29151J600J319J831K634K764J894P54L18O90J053P78K33J97O71Q52L54
$$ y = [512540, 505926, 500186, 494666, 488790, 482565, 476460, 470949, 466255, 462297, 458714, 455115, 451582, 448795, 447411, 447452, 448521, 450438, 453277, 456806, 460327, 463265, 465685, 468161, 471333, 475608, 481000, 487045, 492965, 498094, 502182, 505298, 507602, 509201, 510067, 509972, 508631, 506032, 502611, 498945, 495225, 491058, 485845, 479472, 472608, 466220, 460733, 455745, 450675, 445539, 440929, 437287, 434415, 431686, 428632, 425254, 421942, 419176, 417170, 415764, 414629, 413652, 413023, 412923, 413136, 413099, 412411, 411328, 410643, 411000, 412323, 414012, 415575, 416915, 418053, 418927, 419663, 420803, 422948, 426141, 429790, 433191, 436059, 438561, 440916, 442994, 444335, 444591, 443878, 442567, 440753, 438206, 434916, 431400, 428246, 425580, 423230, 421293, 420228, 420424, 421876, 424224, 426870, 429151, 430751, 432070, 433901, 436535, 439299, 441193, 441947, 442265, 442955, 444008, 444786, 445019, 445216, 445887, 446739, 447093]
59941D47093j66k9M87P35Q19J241J737J435K46q62j246j340j678j958j715j246
59925D43553j137j277j069l80M09J101J777K333K468K270K229K620L231L797M318
59910D66243M843N183N072M465L643L040K910K997K667J580J64p68r30p91r55
59895D99363j488j938j860j255m66K69J037J957K797L212L307L583M214M738M719
59880E22189M293L803L280K722K571L294M571N444N337M477L265J703k59k221
59866E64469l552m002l919l846m066m531m986n114m631l438j822l69N02R74J569
59851E23238K488L443M221N038O101P170P850Q090P975P241N453K742oj830k385
59836E86829j941j043k94j70p80j832k945l934m804n560o107o296o053n455m707
$$ y = [447093, 446927, 446898, 447385, 448120, 448939, 450180, 451917, 453352, 453598, 452736, 451490, 450150, 448472, 446514, 444799, 443553, 442416, 441139, 440070, 439690, 440099, 441200, 442977, 445310, 447778, 450048, 452277, 454897, 458128, 461925, 466243, 471086, 476269, 481341, 485806, 489449, 492489, 495399, 498396, 501063, 502643, 502807, 502039, 501109, 500318, 499363, 497875, 495937, 494077, 492822, 492356, 492625, 493662, 495619, 498416, 501628, 504935, 508518, 512732, 517470, 522189, 526482, 530285, 533565, 536287, 538858, 542152, 546723, 552167, 557504, 561981, 565246, 566949, 566690, 564469, 560917, 556915, 552996, 549150, 545084, 540553, 535567, 530453, 525822, 522384, 520562, 520193, 520695, 521669, 523238, 525726, 529169, 533390, 538428, 544529, 551699, 559549, 567639, 575614, 582855, 588308, 591050, 591044, 589214, 586829, 584888, 583845, 583551, 583381, 582601, 580769, 577824, 573890, 569086, 563526, 557419, 551123, 545070, 539615, 534908]
59821E34908m025l573l490l807m367m909n268n415n271m719l819k798j763p09
59807D80975R8J31p14j772k266k158j918j741j463j140j045j105q85l89l10j112
59791D63186k265k813k423j502n26K42N59K90j97k58K07N31J28p39j346j395j163
59774D50516r15o50l46m2L40Q59J142O66l60r20l40Q46J640J803J823J970K056
59757D60088K053K281K773L082K916K560K472K744L215L760M327M862N366N803
59743E08302N951N649N123M733M373L649K681K169K419K861K858K454J939J252
59729E56413L57k00J01Q48J009K26p70j146q79n56n84q47j006r62r79j284j657
59712E48084j622j140p27q20j254j602j650j301l92R79K115K243J374L17q6M17
$$ y = [534908, 530883, 527310, 523820, 520013, 515646, 510737, 505469, 500054, 494783, 490064, 486245, 483447, 481684, 480975, 481073, 481204, 480490, 478718, 476452, 474294, 472376, 470635, 469172, 468032, 466987, 465882, 464997, 464608, 464298, 463186, 460921, 458108, 455685, 454183, 453657, 453899, 454458, 454748, 454551, 454293, 454500, 455031, 455159, 454420, 453074, 451679, 450516, 449601, 448951, 448605, 448563, 448903, 449762, 450904, 451570, 451210, 450290, 449950, 450796, 452436, 454239, 456062, 458032, 460088, 462141, 464422, 467195, 470277, 473193, 475753, 478225, 480969, 484184, 487944, 492271, 497133, 502499, 508302, 514253, 519902, 525025, 529758, 534131, 537780, 540461, 542630, 545049, 547910, 550768, 553222, 555161, 556413, 556770, 556570, 556671, 557519, 558528, 558754, 557984, 556838, 555959, 555403, 554819, 553972, 552966, 552004, 551025, 549741, 548084, 546462, 545322, 544595, 543775, 542521, 540919, 539269, 537968, 537576, 538555, 540670, 542913, 544287, 544604, 544518, 544935]
59696E44935J463K325K375J707J207J626K652L314L190K727K334J730N30r35j885
59681E69295j962j495q84k37K75J46r18k391l373l669l924m518m982m828m374
59666E32161m165m082l772l531l793m063l495k435k212l028l418k230r7J717K834
59651D96391L345K948J683P29J207K545L202K684J753R06r6j229j904j975k044
59636E10145k484k943l071l031k958k568j710q39n20p96j255j533j554j471j453
59621D81959j487j448j460j845k457k571j858j084j135j738j959j709j796k455
59607D56957k862k342j287m42L4M09P32Q19O46M39M51O73P02J00q83j258m24R27
59589D53391J601J373R79Q68P71M87J98o6n27j040j143q86r47j591k251k383k207
$$ y = [544935, 546398, 548723, 551098, 552805, 554012, 555638, 558290, 561604, 564794, 567521, 569855, 571585, 572115, 571180, 569295, 567333, 565838, 564954, 564717, 564992, 565138, 564220, 561829, 558456, 554787, 550863, 546345, 541363, 536535, 532161, 527996, 523914, 520142, 516611, 512818, 508755, 505260, 502825, 500613, 497585, 494167, 491937, 491840, 493557, 496391, 499736, 502684, 504367, 505096, 506303, 508848, 512050, 514734, 516487, 517393, 517297, 516068, 514164, 512189, 510145, 507661, 504718, 501647, 498616, 495658, 493090, 491380, 490541, 490021, 489225, 487970, 486437, 484883, 483412, 481959, 480472, 479024, 477564, 475719, 473262, 470691, 468833, 467749, 466614, 464876, 462917, 461208, 459412, 456957, 454095, 451753, 450466, 450024, 450058, 450467, 451199, 452018, 452664, 453103, 453554, 454227, 454929, 455029, 454146, 452888, 452464, 453391, 454992, 456365, 457344, 458212, 458983, 459470, 459668, 459602, 459075, 458035, 456892, 456006, 455059, 453468, 451217, 448834, 446627]
59572D46627k206k445k709k844k755k398j914j448q40RN64K01o66q47J2Q96Q23
59555D28060Q5l52p8N28Q30M34m27q47j13J347K438K869L350M277N267O210P648
59538D61526R594J1053J1442J1526J2154J3004J3423J3567J3462J1766P018P7
59526E89612o066r068r053p539n624l557j371O46K024K440K040J379Q81N30J41
59511E57415m09j347k942m968o666p643q308q963r006p765n809m536m534m983
59497D79536m789l812k815k515k774k690j658l02J47m61q48p9J034J145M23L30
59481D59872J562L189M090M306M627N381O200O726P093P595Q028P683O266M578
59467E37196L735L760L557K463J016n6q12j447j601r81q3O55J731L693N921P385
$$ y = [446627, 444421, 441976, 439267, 436423, 433668, 431270, 429356, 427908, 427068, 427077, 427641, 427842, 427176, 426329, 426341, 427237, 428060, 428145, 427793, 427715, 428243, 429073, 429507, 429080, 428233, 428120, 429467, 431905, 434774, 438124, 442401, 447668, 453878, 461526, 471120, 482173, 493615, 505141, 517295, 530299, 543722, 557289, 570751, 582517, 589535, 589612, 583546, 574478, 565425, 557886, 552262, 548705, 547334, 547980, 550004, 552444, 554484, 555863, 556744, 557274, 557415, 557006, 555659, 552717, 547749, 541083, 533440, 525132, 516169, 507163, 499398, 493589, 489053, 484519, 479536, 474747, 470935, 468120, 465605, 462831, 460141, 458483, 458181, 458328, 457867, 457019, 456940, 457974, 459119, 459542, 459872, 461434, 464623, 468713, 473019, 477646, 483027, 489227, 495953, 503046, 510641, 518669, 526352, 532618, 537196, 540931, 544691, 548248, 550711, 551727, 551671, 550859, 549412, 547811, 546830, 546747, 547402, 549133, 552826, 558747, 566132]
59451E66132Q148Q963R742R741R125Q911R254R159Q178P085O365N248K960q0l078
59436F65853n953q748j0706j0990r956q818q227p920p612p490p684p868p532o420
59422E49929m608k325K22K886N473P731R640J1603J3996J6619J8951K0840K2372
59409F73329K3206K2811K1452J9915J7844J3402N536l971j1733j5725j6255j4451
59397G35360j1051o770k599P72L154L926J703m294j2754k0751k5677k6593k4250
59384F10176k0410j6976j4929j3752j2182r659o820m557l026j834q34l11m31q34
59370E03621q51n6J392K893L837M066L838L447K992K589K527K999L805M540N046
59355E46685N480O054O840P789Q694R252R477R922J1123J2813J4062J4336J4139
$$ y = [566132, 574280, 583243, 592985, 602726, 611851, 620762, 630016, 639175, 647353, 654438, 660803, 666051, 669011, 668931, 665853, 659900, 651152, 640446, 629456, 619500, 610682, 602455, 594535, 586923, 579433, 571749, 563881, 556349, 549929, 545321, 542996, 543218, 546104, 551577, 559308, 568948, 580551, 594547, 611166, 630117, 650957, 673329, 696535, 719346, 740798, 760713, 778557, 791959, 797495, 793524, 781791, 766066, 749811, 735360, 724309, 717539, 714940, 715712, 718866, 722792, 724495, 720201, 707447, 686696, 661019, 634426, 610176, 589766, 572790, 557861, 544109, 531927, 522268, 515448, 510891, 507865, 506031, 505197, 504886, 504455, 503621, 502770, 502714, 504106, 506999, 510836, 514902, 518740, 522187, 525179, 527768, 530295, 533294, 537099, 541639, 546685, 552165, 558219, 565059, 572848, 581542, 590794, 600271, 610193, 621316, 634129, 648191, 662527, 676666]
59342F76666J4425J5532J6893J7593J7155J5782J4039J2194J0040P362M419J721
59330H23821n48k554m457o322q310j0425j2194j3094j3365j3815j4615j4936j4105
59317F95081j2632j1558j1136j0662r499p820o339n492n006m165k572o28R53K023
59303F10548L157M928P323R861J1916J2934J2817J2110J1279R701O095K61o114
59290G06816j0875j3200j3618j2834j1219r200p396o143n279m457l551k721k156
59277F04167j701q48O90K443L693M386N064N909O503O716P040P762Q434Q619Q459
59262F77336Q088P106N275L140J305m50k693n287p515q974r761r993r750r348
59248F38479r125r079r000q697p882o300m358l027k592k030l74J829L167L165
$$ y = [676666, 691091, 706623, 723516, 741109, 758264, 774046, 788085, 800279, 810319, 817681, 822100, 823821, 823273, 820719, 816262, 809940, 801630, 791205, 779011, 765917, 752552, 738737, 724122, 709186, 695081, 682449, 670891, 659755, 649093, 639594, 631774, 625435, 619943, 614937, 610772, 608200, 607572, 608525, 610548, 613705, 618633, 625956, 635817, 647733, 660667, 673484, 685594, 696873, 706574, 712669, 712930, 706816, 695941, 682741, 669123, 656289, 645070, 635870, 628474, 622331, 617052, 612595, 609044, 606323, 604167, 602466, 601618, 602308, 604751, 608444, 612830, 617894, 623803, 630306, 637022, 644062, 651824, 660258, 668877, 677336, 685424, 692530, 697805, 700945, 702250, 701800, 699107, 693820, 686305, 677331, 667570, 657577, 647827, 638479, 629354, 620275, 611275, 602578, 594696, 588396, 584038, 581011, 578419, 576389, 576015, 577844, 581011, 584176]
59234E84176K658K568L041L647L793L035J603M67L26P15N68n24k087l482m354
59219E96150m646m734n212o090o600o257n563n059m433l290k144j625j301l77
59205E38819Q75J566J624J596J426P24k5N7O44N90q8j81O28J172P96M35R95J965
59187E53618K488K711L166L623L601L365L531M036M236L831L086K359J824J503
59173E96978J294J115J089J358J746K001K325L113M223N081N520N835O069N957
59159F43704N630N615N896N751M667K842O68j549l342m328m835n498o221o369
59145F42631n997n846o002n762n007m512m456l984k873k322l132m242m194l189
59131E81113k490k463k382j816j069l93K73Q20R73Q44R08J452K328L252L981M414
$$ y = [584176, 586834, 589402, 592443, 596090, 599883, 602918, 604521, 604988, 605314, 606029, 606597, 606073, 603986, 600504, 596150, 591504, 586770, 581558, 575468, 568868, 562611, 557048, 551989, 547556, 544266, 542122, 540497, 539196, 538819, 539694, 541260, 542884, 544480, 545906, 546630, 546605, 546662, 547306, 547896, 547808, 547627, 548255, 549427, 550223, 550658, 551653, 553618, 556106, 558817, 561983, 565606, 569207, 572572, 576103, 580139, 584375, 588206, 591292, 593651, 595475, 596978, 598272, 599387, 600476, 601834, 603580, 605581, 607906, 611019, 615242, 620323, 625843, 631678, 637747, 643704, 649334, 654949, 660845, 666596, 671263, 674105, 674773, 673224, 669882, 665554, 660719, 655221, 649000, 642631, 636634, 630788, 624786, 619024, 614017, 609505, 605049, 601065, 598192, 595870, 592738, 588496, 584302, 581113, 578623, 576160, 573778, 571962, 570893, 570500, 570773, 571593, 572566, 573410, 574318, 575770, 578098, 581350, 585331, 589745]
59115E89745M677M945N081M854M522M678N325N768N633N333N219N041M612M271
59101F59704M183L936L310K779K645K356J408K31m85q42j345j972k329k343k116
59086F69120j576q88p55j592k763l377l390l334l396l557m196n623p261q098p912
59071F11402p343o946o784o769o749o371n487m549m098m020l823l436l161l056
59057E38810k994l049l207k936j830n29j73q77j536j316o56m99j009j541j606
59042E15052j429j461j634j384m53N72Q97M93j1k87n24o56j07J355L056M148M463
59025E22090M376M375M985O529Q559J0085J0753J1179J1764J1906J1027R681Q795
59012F36104Q303P352N545L271R96j016k434k975k802k364j926j506j024l10P70
$$ y = [589745, 594422, 599367, 604448, 609302, 613824, 618502, 623827, 629595, 635228, 640561, 645780, 650821, 655433, 659704, 663887, 667823, 671133, 673912, 676557, 678913, 680321, 680552, 680067, 679225, 677880, 675908, 673579, 671236, 669120, 667544, 666656, 665901, 664309, 661546, 658169, 654779, 651445, 648049, 644492, 640296, 634673, 627412, 619314, 611402, 604059, 597113, 590329, 583560, 576811, 570440, 564953, 560404, 556306, 552286, 548463, 545027, 541866, 538810, 535816, 532767, 529560, 526624, 524794, 524265, 524092, 523215, 521679, 520363, 519707, 519208, 518199, 516658, 515052, 513623, 512162, 510528, 509144, 508691, 509263, 510160, 510653, 510642, 510355, 509831, 509175, 509068, 510423, 513479, 517627, 522090, 526466, 530841, 535826, 542355, 550914, 560999, 571752, 582931, 594695, 606601, 617628, 627309, 636104, 644407, 651759, 657304, 660575, 661571, 660555, 658121, 655146, 652344, 649980, 648054, 646548, 645524, 645214, 645984]
58997F45984J935K682L026L490M121M200L327K093J188N80M7k34k57n99j479k209
58981F67895k256k154k463k658k078j217q83o92L61K220M002N513P283R210J0520
58966F92603J1084J1569J2192J2415J2006J1437J1004J0456R626Q602P197N121
58954H15312K756R35k82j767m094o840r290j1185j2552j3386j3721j3607j2993
58941G19286j1976j0997j0286r372p790o002m896m542m294l955l879l968l598
58928F33731k669j846j488j184n92l0J21q8n37j304k213k619k079r79k78o25j725
58911F13596k468j901l33R36J170J061J614K817M073N339O961Q740J0132J1133
58897F62870J2086J2837J2952J2535J2065J1593J0973J0558J0741J1116J1156
$$ y = [645984, 647919, 650601, 653627, 657117, 661238, 665438, 668765, 670858, 672046, 672626, 672673, 672439, 672182, 671583, 670104, 667895, 665639, 663485, 661022, 658364, 656286, 655069, 654186, 653494, 653855, 656075, 660077, 665590, 672873, 682083, 692603, 703687, 715256, 727448, 739863, 751869, 763306, 774310, 784766, 794392, 802994, 810191, 815312, 818068, 819003, 818721, 816954, 812860, 806020, 796730, 785545, 772993, 759607, 745886, 732279, 719286, 707310, 696313, 686027, 676655, 668865, 662863, 657967, 653425, 649131, 645176, 641297, 637329, 633731, 631062, 629216, 627728, 626544, 625952, 625922, 626043, 625955, 625418, 624114, 621901, 619282, 617203, 616224, 615946, 615321, 613596, 611128, 609227, 608894, 609830, 611000, 612061, 613675, 616492, 620565, 625904, 632865, 641605, 651737, 662870, 674956, 687793, 700745, 713280, 725345, 736938, 747911, 758469, 769210, 780326, 791482]
58886G91482J1346J2447J3946J4537J4094J3720J3789J3392J1970J0125Q360O265
58874I35473L544P28j759m279p063r523j1051j1908j2709j3566j4125j3950j2667
58861H27145j0353p936o579o471o920p459q104q549q368q084q813j0443j1429
58848G17637j0792r237p764o472n342m980n580o192o015n618n946o771p175o997
58834F22756o781o703o432n872n273m804m526m503m502l927k574j072r9M38R89
58819E67115J619K152K628L064L148K749K395K724L699M821N744O202N752M226
58805F18038K219O36j52l67k74l8Q3k24j069k350l812n069n774n970o039o171
58789E83667o202n977n499m688l436k031r97m27M3N56Q95J182J962L329M520M781
$$ y = [791482, 802828, 815275, 829221, 843758, 857852, 871572, 885361, 898753, 910723, 920848, 929208, 935473, 939017, 939745, 937986, 933707, 926644, 917121, 906070, 894162, 881453, 867887, 853762, 839812, 827145, 816792, 808856, 802277, 795806, 788886, 781427, 773323, 764774, 756406, 748322, 739509, 729066, 717637, 706845, 697608, 689844, 683372, 678030, 673050, 667470, 661278, 655263, 649645, 643699, 636928, 629753, 622756, 615975, 609272, 602840, 596968, 591695, 586891, 582365, 577862, 573360, 569433, 566859, 565787, 565688, 566126, 567115, 568734, 570886, 573514, 576578, 579726, 582475, 584870, 587594, 591293, 596114, 601858, 608060, 613812, 618038, 620257, 620893, 620741, 620374, 620100, 620062, 620145, 619921, 618852, 616502, 612690, 607621, 601847, 595877, 589838, 583667, 577465, 571488, 565989, 561301, 557865, 555834, 554837, 554410, 554453, 555009, 555904, 557086, 559048, 562377, 566897, 571678]
58773E71678M124K982J636K87q52j837l012m428n674o466o882o939o494n759n270
58758E27094n097m686l700k439j274l44P6k43o95j35J580L252L941M054M266M339
58742E29989L825L129K924L069K985K661K498K533K629L031M010N203O025O437
58728E80948O661O499N744M954M854N144M840L838L171L490M124M211L993M311
58714F46782N153N583N150M652N066O199P015P029O671O165M919K479n53l179
58700G09131n144o818q338r654j0999j2567j3887j4315j3983j3561j3252j2796
58688E73817j2223j1735j1029r704q192p275o767n791m339l432l484l673l240
58675D82933k415j760j432j375j395r50L12J740K375K462L054M229N018N288O075
$$ y = [571678, 575802, 578784, 580420, 580707, 579855, 578018, 575006, 570578, 564904, 558438, 551556, 544617, 538123, 532364, 527094, 521997, 517311, 513611, 511172, 509898, 509554, 509630, 509387, 508692, 508557, 510137, 513389, 517330, 521384, 525650, 529989, 533814, 536943, 539867, 542936, 545921, 548582, 551080, 553613, 556242, 559273, 563283, 568486, 574511, 580948, 587609, 594108, 599852, 604806, 609660, 614804, 619644, 623482, 626653, 630143, 634267, 638478, 642471, 646782, 651935, 657518, 662668, 667320, 672386, 678585, 685600, 692629, 699300, 705465, 710384, 712863, 712310, 709131, 703987, 697169, 688831, 679177, 668178, 655611, 641724, 627409, 613426, 599865, 586613, 573817, 561594, 549859, 538830, 529126, 520934, 513659, 506892, 501101, 496762, 493330, 489846, 486173, 482933, 480518, 478758, 477326, 475951, 474556, 473606, 473918, 475658, 478033, 480495, 483549, 487778, 492796, 498084, 504159]
58660E04159P642Q758Q505P436O207M448J908n77k203l217l935l912l008k237
58646E29974k466l130l264k933k723k579k163j703j546j547j535j749k126j984
58632D98526j055J7P77J510K095J613N3r91m63N06M28j81J13J249K002K163K650
58615E11012L784M967N875O666P148O905O189N640N293M759M100L609L090K249
58601E81286J444J107Q60J47o79r44q83j239j984k482k624k728k609j799n14N99
58585E66958J504K654M040N276O392P625Q647Q889Q528Q243Q180P997P724P745
58571F60402P974P879P335O794O716P345Q783J0748J2545J3860J5197J6991J8792
58558H01361J9969K0690K1422K1847K1173J9279J6760J4006J0900P308L411k62
$$ y = [504159, 511801, 520559, 529064, 536500, 542707, 547155, 549063, 548486, 546283, 543066, 539131, 535219, 532211, 529974, 527508, 524378, 521114, 518181, 515458, 512879, 510716, 509013, 507467, 505920, 504385, 502636, 500510, 498526, 497471, 497488, 498265, 499775, 501870, 503483, 503536, 502545, 502082, 502588, 503016, 502835, 502948, 504197, 506199, 508362, 511012, 514796, 519763, 525638, 532304, 539452, 546357, 552546, 558186, 563479, 568238, 572338, 575947, 579037, 581286, 582730, 583837, 584697, 584844, 584165, 583221, 582338, 581099, 579115, 576633, 574009, 571281, 568672, 566873, 566359, 566958, 568462, 571116, 575156, 580432, 586824, 594449, 603096, 611985, 620513, 628756, 636936, 644933, 652657, 660402, 668376, 676255, 683590, 690384, 697100, 704445, 713228, 723976, 736521, 750381, 765578, 782569, 801361, 821330, 842020, 863442, 885289, 906462, 925741, 942501, 956507, 967407, 974715, 978126, 977864]
58546I77864k944m238m751n594o891p728p791p979q903r928j0540j1542j3794
58533H75241j6644j8704j9482j9351j8569j7212j5518j3504j0964q370o817o395
58521G03711n798m311k907k376j834m62O87K20j262k029j651r90n59l64p65j906
58505F77404k896k853k193j759j399o48J18L90N14P53M39n68q40N71K284K465
58489F71782J430N68K8m98j0K288M835N649N612P021R561J0732J0056R810J1241
58474G50105J2889J3289J2896J2503J1800J0345Q375O012L037j76k898n225p571
58461H25381r162q709o598m621l485k357q39N39J941M306P381R473R694Q894P999
58446H39837O949N609M224K562ll253o117q046r191r404q411o870n804n053l713
$$ y = [977864, 974920, 970682, 965931, 960337, 953446, 945718, 937927, 929948, 921045, 911117, 900577, 889035, 875241, 858597, 839893, 820411, 801060, 782491, 765279, 749761, 736257, 725293, 716923, 710106, 703711, 697913, 693602, 690695, 688319, 686485, 686023, 686710, 686930, 685668, 683639, 681988, 680998, 680439, 680075, 679310, 677404, 674508, 671655, 669462, 667703, 666304, 665656, 665774, 666164, 666678, 667431, 667870, 667302, 666462, 667033, 669317, 671782, 673212, 673780, 673808, 673310, 673300, 675588, 680423, 686072, 691684, 698705, 708266, 718998, 729054, 738864, 750105, 762994, 776283, 789179, 801682, 813482, 823827, 832202, 838214, 841251, 841075, 838177, 832952, 825381, 816219, 807510, 800912, 796291, 792806, 790449, 789610, 790149, 792090, 796396, 803777, 813250, 822944, 831838, 839837, 846786, 852395, 856619, 859181, 859178, 855925, 849808, 841762, 832571, 823167, 814756, 807886, 802082, 797029, 793316]
58431G93316j856l00J035K800M496M936M438M705O394Q442R881J0778J1228J0973
58417H71266J0088Q821O910M267J835L87q67k899m938n745n940o932q321q628
58403H59304p961p505p053n582l734k911k410l56K763M472M211L844M284M566
58389H45932M456M908N577M926L312L003M445N417M615L316K716K376K091K661
58375H99751L865M166L256K605K821K913K694L307M785N685N779O488Q084R156
58361I65355R463J0449J2283J3250J2877J2820J3715J4077J3167J2172J1582J0315
58349A111525Q303P087O866N897L850K746L481M363M306M491N688O799P371Q642
58335A191415J0903J2606J3250J4255J5916J6546J5782J5601J6745J7277J6086
$$ y = [793316, 791460, 791160, 792195, 794995, 799491, 804427, 808865, 813570, 819964, 828406, 838287, 849065, 860293, 871266, 881354, 890175, 897085, 901352, 903187, 903574, 902707, 899808, 894870, 889125, 883185, 876253, 867932, 859304, 851343, 843838, 836785, 831203, 827469, 824558, 822148, 821792, 824555, 829027, 833238, 837082, 841366, 845932, 850388, 855296, 860873, 865799, 869111, 872114, 876559, 881976, 886591, 889907, 892623, 894999, 897090, 899751, 903616, 907782, 911038, 913643, 916464, 919377, 922071, 925378, 930163, 935848, 941627, 948115, 956199, 965355, 974818, 985267, 997550, 1010800, 1023677, 1036497, 1050212, 1064289, 1077456, 1089628, 1101210, 1111525, 1119828, 1126915, 1133781, 1139678, 1143528, 1146274, 1149755, 1154118, 1158424, 1162915, 1168603, 1175402, 1182773, 1191415, 1202318, 1214924, 1228174, 1242429, 1258345, 1274891, 1290673, 1306274, 1323019, 1340296, 1356382]
58324A356382J4695J4247J3681J2338J1220J0471Q700O199N465P150Q787Q862
58312A478197Q734R224R012P956Q271J0585J2497J2822J3559J5787J7451J7270
58300A621365J7113J8355J9469J9362J9478K0537K0905K0223K0796K3274K4970
58289A845847K4593K4543K6160K7133K6208K6087K8629L1382L1934L1787L2816
58278B157119L3786L3557L3896L6043L8176L9091M0609M3620M5822M6174M7296
58267B595189N0624N3582N4495N5711N8780O1333O2022O3649O7921P1941P3512
58256C268759P5011P8415Q1440Q2393Q3732Q7053Q9686R0112R1372R5313R9083
58245D222369J01263J05456J13539J21447J26250J31188J39137J47479J54264
$$ y = [1356382, 1371077, 1385324, 1399005, 1411343, 1422563, 1433034, 1441734, 1447933, 1453398, 1460548, 1469335, 1478197, 1486931, 1496155, 1505167, 1513123, 1521394, 1531979, 1544476, 1557298, 1570857, 1586644, 1604095, 1621365, 1638478, 1656833, 1676302, 1695664, 1715142, 1735679, 1756584, 1776807, 1797603, 1820877, 1845847, 1870440, 1894983, 1921143, 1948276, 1974484, 2000571, 2029200, 2060582, 2092516, 2124303, 2157119, 2190905, 2224462, 2258358, 2294401, 2332577, 2371668, 2412277, 2455897, 2501719, 2547893, 2595189, 2645813, 2699395, 2753890, 2809601, 2868381, 2929714, 2991736, 3055385, 3123306, 3195247, 3268759, 3343770, 3422185, 3503625, 3586018, 3669750, 3756803, 3846489, 3936601, 4027973, 4123286, 4222369, 4323632, 4429088, 4542627, 4664074, 4790324, 4921512, 5060649, 5208128, 5362392]
58236E362392J62713J74585J85892J94461K04696K19520K35004K48424K63814
58227G251501K83714L03790L21787L43180L71337M01115M29101M60629M99405
58218A0665559N40337N80578O26965O84106P46471Q11354Q87615R81728J088086
58209A7612799J203895J339992J505262J695097J908518K161681K470610K837514
58201C2735368L270283L798964M457581N269977O271827P523784R080749J0970380
58193H3378913J3219272J5859337J8861739K2076482K5254964K8094663L0248049
58186B36993419L1375633L1254607K9725253K6396619K0547157J1691091M51512
58179C88435291j1277363k1278867k8216722l1988613l3176042l2425815l0298867
$$ y = [5362392, 5525105, 5699690, 5885582, 6080043, 6284739, 6504259, 6739263, 6987687, 7251501, 7535215, 7839005, 8160792, 8503972, 8875309, 9276424, 9705525, 10166154, 10665559, 11205896, 11786474, 12413439, 13097545, 13844016, 14655370, 15542985, 16524713, 17612799, 18816694, 20156686, 21661948, 23357045, 25265563, 27427244, 29897854, 32735368, 36005651, 39804615, 44262196, 49532173, 55804000, 63327784, 72408533, 83378913, 96598185, 112457522, 131319261, 153395743, 178650707, 206745370, 236993419, 268369052, 299623659, 329348912, 355745531, 376292688, 387983779, 388435291, 377157928, 355879061, 327662339, 295673726, 262497684, 230071869, 199773002]
58172A99773002k7352223k4093873k0863132j7835397j5111625j2746308j0730043
58165G1040401r018766p582342o398631n424377m609996l930453l373820k914012
58157B7788004k521389k187408j914064j689439j495164j327623j191145j078711
58149A4383061r77811q87325q11557p45014o78837o15337n61465n14529m68012
58140H123174m24740l90930l63290l34913l08243k89821k77320k63555k48517
58131E221845k36428k25425k10937j95141j83047j73107j61097j49081j41274
58122C546308j35101j25608j14885j08263j04724r9746r4034r0927q8543q2949
58112B501528p6149p2708p1269o7340o1875n9190n8760n6712n3345n1861n1516
$$ y = [199773002, 172420779, 148326906, 127463774, 109628377, 94516752, 81770444, 71040401, 62021635, 54439293, 48040662, 42616285, 38006289, 34075836, 30702016, 27788004, 25266615, 23079207, 21165143, 19475704, 17980540, 16652917, 15461772, 14383061, 13405250, 12517925, 11706368, 10961354, 10282517, 9667180, 9105715, 8591186, 8123174, 7698434, 7307504, 6944214, 6609301, 6301058, 6011237, 5733917, 5470362, 5221845, 4985417, 4759992, 4549055, 4353914, 4170867, 3997760, 3836663, 3687582, 3546308, 3411207, 3285599, 3170714, 3062451, 2957727, 2857981, 2763947, 2673020, 2584477, 2501528, 2425379, 2352671, 2281402, 2214062, 2152187, 2092997, 2034237, 1977525, 1924180, 1872319, 1820803]
58101A820803m9049m5267m3546m3462m2021l9550l8401l7707l5132l1925l0673
58090A384070l0113k7744k5216k5450k6703k5299k2098k0433j9889j8042j6283
58079A126800j7619k0478k0855j9199j9151k0698k0642j8827j8052j8458j7696
58068I15125j6055j5991j7036j6445j4453j3811j4443j3586j1005r365r470r589
58056G53876r376j0110j1317j1282j0603j1166j2131j1101q741p986q982r052
58044F32029p502o312o123n545m514m506n354n376m703n026o254o694o329o615
58030E51176p370p248o791p619r053r031p978q132r375r383p801o633o520o057
58016D42185n002m705n212n004l915l344l490l205k523k588l150k938k304k706
$$ y = [1820803, 1771754, 1726487, 1682941, 1639479, 1597458, 1557908, 1519507, 1481800, 1446668, 1414743, 1384070, 1353957, 1326213, 1300997, 1275547, 1248844, 1223545, 1201447, 1181014, 1161125, 1143083, 1126800, 1109181, 1088703, 1067848, 1048649, 1029498, 1008800, 988158, 969331, 951279, 932821, 915125, 899070, 883079, 866043, 849598, 835145, 821334, 806891, 793305, 782300, 772935, 763465, 753876, 744500, 734390, 723073, 711791, 701188, 690022, 677891, 666790, 658049, 650063, 641081, 632029, 624527, 618215, 612092, 606547, 602033, 597527, 592173, 586797, 582094, 577068, 570814, 564120, 557791, 551176, 543806, 536558, 529767, 522148, 513095, 504064, 496086, 487954, 478579, 469196, 461395, 454762, 448242, 442185, 437183, 432478, 427266, 422262, 418347, 415003, 411513, 408308, 405785, 403197, 400047, 397109, 394805, 392099]
58002C92099l818l927k923k254k207j983j835k406k581r99R62Q85o17q82L35Q52
57986C68701K09J57J002R68m19j541j671j779k153k102k084l224m658m307k405
57971C44694j278j529j537q20o73j213r08L99R60K43k82O5K18k08k07M25O10R3
57953C39052l00o53j765l009k911j864j564j914j318k1J00q54n70J559L520M173
57937C31661M688N795O637P003P923R202R279Q150P673Q220P952O163M418L470
57923D28234K034l48k132k662l447n272o665o616o357p039p881p959p761p773
57909C58356p485o827o529o285m839k632j960l433m765m260l109k935l367l425
57895B96505l229k942k018o83k73r05q51O77K176K410K272K784L322L126K782
$$ y = [392099, 388281, 384354, 381431, 379177, 376970, 374987, 373152, 370746, 368165, 367166, 368128, 369013, 368396, 367514, 367849, 368701, 368910, 369067, 370069, 371037, 370618, 369077, 367406, 365627, 363474, 361372, 359288, 356064, 351406, 347099, 344694, 343416, 341887, 340350, 339530, 338857, 337644, 336736, 337135, 338095, 338338, 338056, 338121, 338339, 338131, 337924, 338349, 338959, 339052, 338752, 338099, 336334, 333325, 330414, 328550, 326986, 325072, 323754, 323733, 323833, 322979, 322409, 323968, 327488, 331661, 336349, 342144, 348781, 355784, 363707, 372909, 382188, 390338, 398011, 406231, 414183, 420346, 424764, 428234, 430268, 429920, 427788, 425126, 421679, 416407, 409742, 403126, 396769, 389730, 381849, 373890, 366129, 358356, 350871, 344044, 337515, 331230, 326391, 323759, 321799, 318366, 313601, 309341, 306232, 303297, 299930, 296505, 293276, 290334, 288316, 287633, 287360, 286455, 285604, 286281, 288457, 290867, 293139, 295923, 299245, 302371, 305153]
57880C05153K813K560J601O58R5o44j335p82O81P41j518l966m497l760l339l267
57864B91194k883k462k337j981j250j086j774k079j293l05K61J160K573L159K428
57849B83325J965K801L565K930J886J703J550J80j574k146j776j728k113k319
57835B88249k549l174l493k752j547q81o84n11n50p91m03P93J534J108P82J756
57819B76887L105L338K784K694L070L063K699K575K535J976Q14q82l262n728o748
57804B88920n834m566m451m922m704l884l250k696j750p65k97j67j92p60j726
57789B48956k022j366r89j488j640n66O06P85Q76J951L046K840K057K103K580
57774B57729K316J725J963K627K486J813J816K392K415J742J081M16o45j577j734
$$ y = [305153, 307966, 310526, 312127, 312785, 312880, 312236, 310901, 310119, 310800, 311541, 310023, 306057, 301560, 297800, 294461, 291194, 288311, 285849, 283512, 281531, 280281, 279195, 277421, 275342, 274049, 273744, 274005, 275165, 277738, 280897, 283325, 285290, 288091, 291656, 294586, 296472, 298175, 299725, 299905, 298331, 296185, 294409, 292681, 290568, 288249, 285700, 282526, 279033, 276281, 274734, 273853, 273169, 272658, 272108, 271317, 270914, 271707, 273241, 274349, 275131, 276887, 279992, 283330, 286114, 288808, 291878, 294941, 297640, 300215, 302750, 304726, 305540, 304658, 301396, 295668, 288920, 283086, 278520, 274069, 269147, 264443, 260559, 257309, 254613, 252863, 252098, 251801, 251634, 251442, 250682, 248956, 246934, 245568, 244579, 243091, 241451, 240885, 241491, 242276, 243152, 245103, 248149, 250989, 253046, 255149, 257729, 260045, 261770, 263733, 266360, 268846, 270659, 272475, 274867, 277282, 279024, 280105, 280521, 279876, 278299, 276565]
57759B76565j804k671l572l241k181j776j844j161P9N84L87P26J635J770P32m11
57743B63817j088j771k466k399j631j263j667k002j841j883k586l315l321k632
57729B33952j718j013q86j342j737j479p76j18M68R21O30n20j380r67pK28j18
57712B24138j55j83j157k653l188k468j720j711k051k378k794l014k497j596j280
57697A95293j633j789j382q27l23J87J94q84k321k625j535k43M90J085J846K271
57681A87804K076J840K214L272M730O174P147P895R724J3525J8313K2376K5697
57668C12787K9711L4767L9314M1862M2336M1083L7734L1513K1797Q344p924k4038
57656F09286l6188m2395m3490m1408l7546l2858k8250k4181k0537j7283j4724
$$ y = [276565, 274761, 272090, 268518, 265277, 263096, 261320, 259476, 258315, 258394, 258978, 259365, 260091, 261726, 263496, 264228, 263817, 262729, 260958, 258492, 256093, 254462, 253199, 251532, 249530, 247689, 245806, 243220, 239905, 236584, 233952, 232234, 231221, 230335, 228993, 227256, 225777, 225001, 224883, 225351, 226272, 226902, 226382, 225002, 224035, 224028, 224256, 224138, 223983, 223800, 222643, 219990, 216802, 214334, 212614, 210903, 208852, 206474, 203680, 200666, 198169, 196573, 195293, 193660, 191871, 190489, 189662, 189339, 189526, 189720, 188836, 186515, 183890, 182355, 182112, 182602, 183687, 185533, 187804, 189880, 191720, 193934, 197206, 201936, 208110, 215257, 223152, 232876, 246401, 264714, 287090, 312787, 342498, 377265, 416579, 458441, 500777, 541860, 579594, 611107, 632904, 641248, 633324, 609286, 573098, 530703, 487213, 445805, 408259, 375401, 347151, 322970, 302433, 285150, 270426]
57645B70426j2864j1211r413p541n724m105l109l000l207k811j766q43m34k21
57631B04177l5j86p50j274j341r56l36K03K81j45n42m91l03l98n76n78q74j977
57613A93899l311l763l154k250j564j013o01n05n79n39m74n76o92p71j241k164
57597A70702k669k153j376j320j618j374q24q02j083p74q2q1q89j563j697j791
57581A50606j988j823j312j020j006q31n56o00p58n19j69m05j033j314j318j620
57565A34334j937j533p45n38q13p14m05p66j485j293j82N17M39O55J525J988J464
57548A30511P52M12l4p64j057p24n77r29j091q18p32p94r9J353K291K242K201
57531A32143K552K206O96o63q92q78j541k076j469l98o0k49m9N03Q61J235K088
$$ y = [270426, 257562, 246351, 236938, 229397, 223673, 219568, 216459, 213459, 210252, 207441, 205675, 204832, 204398, 204177, 204142, 203956, 203206, 201932, 200591, 199635, 199299, 199502, 199783, 199638, 199096, 198605, 198302, 197904, 197328, 196750, 195876, 193899, 190588, 186825, 183671, 181421, 179857, 178844, 178243, 177738, 177159, 176620, 176146, 175570, 174878, 174107, 172866, 170702, 168033, 165880, 164504, 163184, 161566, 160192, 159368, 158566, 157483, 156709, 156627, 156546, 155657, 154094, 152397, 150606, 148618, 146795, 145483, 144463, 143457, 142626, 142070, 141470, 140712, 140193, 140024, 139619, 138586, 137272, 135954, 134334, 132397, 130864, 130119, 129581, 128768, 128054, 127649, 126883, 125398, 124105, 123923, 124440, 124879, 125534, 127059, 129047, 130511, 131263, 131675, 131641, 130877, 129820, 129096, 128519, 127590, 126499, 125681, 124949, 124155, 124056, 125409, 127700, 129942, 132143, 134695, 136901, 137597, 136934, 136042, 135164, 133623, 131547, 130078, 129680, 129620, 129371, 129322, 129825, 130686, 131921, 134009]
57514A34009L007L262K885K298J564R16J146K404L436L065J709N13k72j028j643
57499A57271j803j716j632j275o66p52k045l465l629k725j923j509q69N0O19P01
57483A34632P57Q84P35L35P6l8l40p30o90j29M01M10p8o93j036r21n75m22n17
57464A32061n60n26q05j445j879j659r50m8R00J460J041j09p91l61M09N31J01
57447A27370j86j53l5J53M42N77M38L45M54M07R7N5N27Q76N48Qm1K42L12K17L40
57426A32993N25L12k79q62j266j487j384r84o66o26m81Q8P27R16O45K26j46k75
57408A27976L2N18O41M44O23J354J873J644J099P33K85n25j296j600j612j462
57392A30727p71N14J586J850J727J721J573J104R67J631K438K677K730L093L106
$$ y = [134009, 137016, 140278, 143163, 145461, 147025, 147941, 149087, 151491, 154927, 157992, 159701, 160214, 159942, 158914, 157271, 155468, 153752, 152120, 150845, 150179, 149427, 147382, 143917, 140288, 137563, 135640, 134131, 133262, 133312, 133931, 134632, 135389, 136273, 137008, 137343, 137419, 137381, 137041, 136311, 135621, 135492, 135893, 136303, 136225, 135532, 134496, 133575, 133000, 132578, 132061, 131501, 130975, 130170, 128725, 126846, 125187, 124237, 124189, 125089, 126549, 127590, 127481, 126690, 126329, 126738, 127269, 127370, 127184, 127031, 126996, 127149, 127591, 128168, 128606, 128951, 129405, 129812, 129909, 129964, 130491, 131367, 131915, 131923, 131882, 132124, 132436, 132653, 132993, 133518, 133830, 133551, 132689, 131423, 129936, 128552, 127568, 126902, 126276, 125795, 125883, 126610, 127526, 128171, 128397, 128251, 127976, 128008, 128526, 129167, 129611, 130234, 131588, 133461, 135105, 136204, 136937, 137222, 136697, 135401, 133801, 132189, 130727, 129956, 130470, 132056, 133906, 135633, 137354, 138927, 140031, 140998, 142629, 145067, 147744, 150474, 153567, 156673]
57377A56673J940K57m54J35J028J392J128L21q34j725j925j874k141k326j695
57362A49900n70j0k57n14k20L17N67L58j87o98o73l3P01J138J517J965J917J035
57344A56253P2n2M45P28O97Q05R26N06l36q50p56m32q9M40J044J245Q00l6p51
57325A60659q15KJ108J435P99K71O25J194J002L45J59M11K79l72q17n98J2N65
57307A66264P10K41m87n92J71Q57O71K00L63Q65Q31L55J57K02j5k25J62P06M62
57288A71898l25n00J54P12Q07J032J561J755J467J450K050K592K542K286K342
57273A91823K562K546K210J744J466J777K630L221K959K491K851L813M109L254
57259B29456K087J441J327J513J882K096J859J635K250L572M552M586M014L300
$$ y = [156673, 158613, 158870, 158416, 158551, 159579, 160971, 162099, 162420, 161586, 159861, 157936, 156062, 153921, 151595, 149900, 149330, 149320, 149063, 148549, 148329, 148646, 149213, 149571, 149384, 148686, 148013, 147980, 148681, 149819, 151336, 153301, 155218, 156253, 156325, 156273, 156718, 157446, 158143, 158948, 159874, 160380, 160044, 159194, 158438, 158006, 157917, 158357, 159401, 160646, 161446, 161410, 160659, 159844, 159846, 160954, 162389, 163188, 163459, 164084, 165278, 166280, 166625, 166784, 167195, 167474, 167102, 166285, 165687, 165699, 166264, 166974, 167215, 166728, 166136, 166307, 167164, 167835, 168035, 168398, 169263, 170094, 170449, 170606, 170808, 170793, 170568, 170730, 171436, 171898, 171573, 171073, 171227, 171939, 172746, 173778, 175339, 177094, 178561, 180011, 182061, 184653, 187195, 189481, 191823, 194385, 196931, 199141, 200885, 202351, 204128, 206758, 209979, 212938, 215429, 218280, 222093, 226202, 229456, 231543, 232984, 234311, 235824, 237706, 239802, 241661, 243296, 245546, 249118, 253670, 258256, 262270, 265570]
57245B65570K637K408K929L697L904L710L980M694M902M405M120M476M715M337
57231C20484M032M451N132N342N250N446N983O534O970P277P405P510P875Q262
57217D07953Q002P058O298O414P150P885Q384Q636Q642Q677R211J0243J1197J1758
57203E27508J2190J2719J3190J3578J4158J4865J5179J4941J4757J5213J6245
57192F84543J7433J8518J9301J9582J9337J8711J7808J6857J6323J6316J6117
57181H80846J5099J3874J3557J4048J4127J3291J2317J1858J1610J1284J1219
57170A023130J1501J1463J0749J0058J0135J0656J0789J0381J0054J0456J1766
57159A141138J3670J5583J7104J8343J9450K0156K0326K0690K2082K4054K5316
$$ y = [265570, 268207, 270615, 273544, 277241, 281145, 284855, 288835, 293529, 298431, 302836, 306956, 311432, 316147, 320484, 324516, 328967, 334099, 339441, 344691, 350137, 356120, 362654, 369624, 376901, 384306, 391816, 399691, 407953, 415955, 423013, 429311, 435725, 442875, 450760, 459144, 467780, 476422, 485099, 494310, 504553, 515750, 527508, 539698, 552417, 565607, 579185, 593343, 608208, 623387, 638328, 653085, 668298, 684543, 701976, 720494, 739795, 759377, 778714, 797425, 815233, 832090, 848413, 864729, 880846, 895945, 909819, 923376, 937424, 951551, 964842, 977159, 989017, 1000627, 1011911, 1023130, 1034631, 1046094, 1056843, 1066901, 1077036, 1087692, 1098481, 1108862, 1118916, 1129372, 1141138, 1154808, 1170391, 1187495, 1205838, 1225288, 1245444, 1265770, 1286460, 1308542, 1332596, 1357912]
57148A357912K5585K5932K7163K8958L0850L2937L5138L6734L7214L6833L6011
57137A711267L4878L3661L2645L1551K9920K8313K8004K9149L0456L1150L2045
57126B053039L3933L6127L7581L8523L9945M2119M4582M7158N0127N3676N7769
57115B534579O2345O7280P2590P8886Q7021R7038J08225J20489J34792J51769
57105C515014J70840J91464K14604K42266K76195L17685L68237M29684N03849
57096F229838N92436O96836Q17554R53861J103830J264126J429835J595249J755193
57087A6438758J905568K043333K166965K276483K371586K448951K500415K510709
57079C4662768K454744K300854K025340J629288J140222N95343K4097n53393j116601
$$ y = [1357912, 1383497, 1409429, 1436592, 1465550, 1496400, 1529337, 1564475, 1601209, 1638423, 1675256, 1711267, 1746145, 1779806, 1812451, 1844002, 1873922, 1902235, 1930239, 1959388, 1989844, 2020994, 2053039, 2086972, 2123099, 2160680, 2199203, 2239148, 2281267, 2325849, 2373007, 2423134, 2476810, 2534579, 2596924, 2664204, 2736794, 2815680, 2902701, 2999739, 3107964, 3228453, 3363245, 3515014, 3685854, 3877318, 4091922, 4334188, 4610383, 4928068, 5296305, 5725989, 6229838, 6822274, 7519110, 8336664, 9290525, 10394355, 11658481, 13088316, 14683565, 16438758, 18344326, 20387659, 22554624, 24831107, 27202693, 29651644, 32152059, 34662768, 37117512, 39418366, 41443706, 43072994, 44213216, 44808559, 44832656, 44279263, 43162662]
57070D3162662j639369k094310k459155k719478k869621k913497k863480k737179
57062B2866573k554578k336243k100983j863487j634142j420463j227433j056826
57054H672418r07940p79508o70280n78189n00443m34800l79843l33958k95109
57045C792348k61730k33035k08254j86440j67062j50042j35065j21473j08896
57036B220351r7398q7070p7942o9947o2516n4554m5502l6076k7224j8938j0916
57025A632268l824J142L456K649l014j5485l3883n3637o9325p8053q0199p7875
57013A224220p3254o7720o1899n6221n1117m6549m1835l6561l1316k7028k3979
57002G06741k1907k0627j9813j8695j6888j5127j4289j3997j3171j1616j0109
$$ y = [43162662, 41523293, 39428983, 36969828, 34250350, 31380729, 28467232, 25603752, 22866573, 20311995, 17975752, 15874769, 14011282, 12377140, 10956677, 9729244, 8672418, 7764478, 6984970, 6314690, 5736501, 5236058, 4801258, 4421415, 4087457, 3792348, 3530618, 3297583, 3089329, 2902889, 2735827, 2585785, 2450720, 2329247, 2220351, 2122953, 2035883, 1957941, 1887994, 1825478, 1770924, 1725422, 1689346, 1662122, 1643184, 1632268, 1628444, 1629586, 1633042, 1635691, 1632677, 1617192, 1583309, 1529672, 1460347, 1382294, 1302095, 1224220, 1150966, 1083246, 1021347, 965126, 914009, 867460, 825625, 789064, 757748, 730720, 706741, 684834, 664207, 644394, 625699, 608811, 593684, 579395, 565398, 552227, 540611, 530502]
56991E30502r028p933o481m789k927q35J145K459L030L196L091K600J636j42l396
56976E12128q011j2414j5013j5915j6217j6040j4644j2224j0047q613p080m823
56964C71087k379m37J081K596M324O420Q820J0754J1331J0715R808Q634O121J798
56950D50673l356q100j1945j4653j5796j5486j4635j3819j2588j0454p826n345
56938C16670k904m0L204O417R417J2194J4514J6124J7077J7586J7568J6497J3568
56925D57892Q072J84q592j6185k1325k3923k4402k3266k1232j8966j6510j3663
56913B78084j0895r129q504q208p668p078o491n396l686k227j767j869j579o61
56899B02926L89J209J860K485L101L678M202M844O048P998J0048J1291J1756J2337
$$ y = [530502, 521474, 513541, 507060, 502271, 499344, 498509, 499654, 502113, 505143, 508339, 511430, 514030, 515666, 515524, 512128, 504117, 491703, 476690, 460775, 444558, 428518, 413874, 401650, 391603, 382990, 375910, 371087, 368708, 368271, 369352, 371948, 376272, 382692, 391512, 402266, 413597, 424312, 434120, 442754, 448875, 450673, 447317, 439217, 427272, 412619, 396823, 381337, 366702, 352883, 340295, 329841, 322015, 316670, 313766, 313726, 316930, 323347, 332764, 344958, 359472, 375596, 392673, 410259, 427827, 444324, 457892, 465964, 466148, 457556, 441371, 420046, 396123, 371721, 348455, 327223, 308257, 291747, 278084, 267189, 258060, 249556, 241348, 233680, 226602, 220111, 214715, 211029, 208802, 207035, 205166, 203587, 202926, 203315, 204524, 206384, 208869, 211970, 215648, 219850, 224694, 230742, 238740, 248788, 260079, 271835, 284172]
56885B84172J3349J3977J3568J2542J1352R206N019p08n919r045j0215j0344r727
56872C17227q117n609k771J38L424P243J1065J4383J7560K1354K5657K9446L2061
56859D63061L3764L4772L4509L2239K7670K0443J0057k771j5347k4720k9861l1396
56847E52420k9959k5993k0585j4930r041k325M718J0911J6485K3097L1353L9751
56835E75902M6652N1908N5755N7476N6178N1843M4370L2451J4907o850k8630m5949
56823I06013n6521o0681o0134n6342m9961m1628l2759k4753j7487r620p20P889
56811E03296J4872K0620K6350L2149L6787L9230L9479L7777L3506K5184J1794
56800H21044n510k3148l7143m5708m9572n0044m7637m2727l6456l0121k4216j8562
$$ y = [284172, 297521, 311498, 325066, 337608, 348960, 358166, 363185, 362477, 356558, 347513, 337298, 326954, 317227, 309110, 303501, 300730, 300868, 304292, 311535, 322600, 336983, 354543, 375897, 401554, 431000, 463061, 496825, 531597, 566106, 598345, 626015, 646458, 656515, 653744, 638397, 613677, 583816, 552420, 522461, 496468, 475883, 460953, 451912, 449587, 454305, 465216, 481701, 504798, 536151, 575902, 622554, 674462, 730217, 787693, 843871, 895714, 940084, 972535, 987442, 980592, 951962, 906013, 849492, 788811, 728677, 672335, 622374, 580746, 547987, 523234, 505747, 496127, 495407, 503296, 518168, 538788, 565138, 597287, 634074, 673304, 712783, 750560, 784066, 809250, 821044, 815534, 792386, 755243, 709535, 659963, 609919, 562282, 519555, 483099, 452978, 428762, 410200]
56788D10200j3029p592k221K809O950J0229J3520J7342K0762K2139K0794J7245
56776E19148J2026N041l740j3345k1971k8016l1020l1593l0557k8283k5021k1455
56764C01214j8470j6318j4515j2542j0393q449p202o967p417p514o484m772l493
56751A76678l055l014l100l463l806l271j631J38Q83M56m65j182j387j225j120
56736A51436j241j225p93l84m84o96l25L21L54j28j54M40P51M59L21P07R65P60
56718A51084P36J194J425J101R95J505J697Q40k23l32K76O42O43P64J011J112
56702A64470J174J242Q86P6l13J71N80K0q33q69m07m78r41p85j9L57N4k21j68
56683A63996k56o00p10m49k85m03n56p52j174j428q89J54O59L24o3J27O30J030
$$ y = [410200, 397171, 389579, 387358, 390167, 397117, 407346, 420866, 438208, 458970, 481109, 501903, 519148, 531174, 536215, 532475, 519130, 497159, 469143, 438123, 406530, 375973, 347690, 322669, 301214, 282744, 266426, 251911, 239369, 228976, 220527, 213325, 206358, 198941, 191427, 184943, 180171, 176678, 173623, 170609, 167509, 164046, 160240, 156969, 155338, 155476, 156359, 156815, 156350, 155168, 153781, 152556, 151436, 150195, 148970, 148177, 147793, 147309, 146613, 146288, 146609, 146963, 146835, 146681, 147121, 147872, 148331, 148652, 149359, 150324, 151084, 151820, 153014, 154439, 155540, 156535, 158040, 159737, 160577, 160354, 160022, 160298, 160940, 161583, 162347, 163358, 164470, 165644, 166886, 167772, 167848, 167535, 167706, 168286, 168306, 167473, 166604, 166197, 165719, 164778, 163993, 163974, 164331, 164385, 164164, 163996, 163740, 163140, 162430, 161981, 161696, 161293, 160737, 159985, 158811, 157383, 156494, 156648, 157307, 157631, 157568, 157695, 158325, 159355]
56665A59355J304J389J015L49N0M00R43J287J678K374L007K953K098R21O7j07
56649A79083K40N75N67M19L76J87n15j350j366j38J649K850K882K081J275R89
56633A89804R71N98k28r28j077r40q41o11j7O39Q41N00j89j094j978k440k455
56616A80555k525k817k691j683m05K42K94L76N82N33J68l35j143k314l084k569
56600A63184j097J23N71P42R74R21M36M7K14O92R78R41Q28R51J451K068K258J829
56582A78111J306J230J324R21N1n68n49k02J44N90J282J963K192J800J145R39
56566A91679J580K555K930K611K619L752N578P195Q370R279R730R499Q996Q701
56552B75074Q209O652L989J101j147k348k327j314k10L2o96j769k616k981k862
$$ y = [159355, 160659, 162048, 163063, 163412, 163462, 163862, 164805, 166092, 167770, 170144, 173151, 176104, 178202, 179123, 179190, 179083, 179323, 179898, 180465, 180884, 181260, 181447, 180932, 179582, 178216, 178078, 179727, 182577, 185459, 187540, 188815, 189804, 190775, 191373, 191145, 190217, 189140, 188200, 187359, 186748, 186731, 187370, 188211, 188711, 188522, 187428, 185450, 183010, 180555, 178030, 175213, 172522, 170839, 170434, 170676, 170970, 171346, 171928, 172461, 172629, 172294, 171151, 168837, 165753, 163184, 162087, 162210, 162781, 163523, 164497, 165418, 165854, 165901, 166115, 166807, 167785, 168726, 169554, 170505, 171956, 174024, 176282, 178111, 179417, 180647, 181971, 182892, 182943, 182375, 181826, 181624, 181768, 182358, 183640, 185603, 187795, 189595, 190740, 191679, 193259, 195814, 198744, 201355, 203974, 207726, 213304, 220499, 228869, 238148, 247878, 257377, 266373, 275074, 283283, 289935, 293924, 295025, 293878, 291530, 289203, 287889, 287679, 287711, 287015, 285246, 282630, 279649, 276787]
56537B76787k724l276m398m932m228l256l270l989m251l885l691l895l980l926
56523B23086m263m849m828l997l131k762k614k341k009j711j502j654k221k459
56509A82745j673m42J8l53m93j0L92M16P61J749K540K359J660J356J618J950J943
56492A96536J539R41N69P13J084J114P16K94Q1j8qJ95L93L63K76L92N14L63J76
56473B06233K40L01R6L5M53Q08O41O31J419K077J348m5k11R25J458N03o09o44
56455B15659j66j03k30J2L84M92N38O86N47k9m71l71p6P3K86P34J185J538J866
56436B22554J846J039p4m74j22P9j25j33k4o44j750j871o30M26K63l3P64J911
56418B23002K017J254Q54J138J452J459J325J093P96P25Q28M25o87j585j377m47
$$ y = [276787, 274063, 270787, 266389, 261457, 257229, 253973, 250703, 246714, 242463, 238578, 234887, 230992, 227012, 223086, 218823, 213974, 209146, 205149, 202018, 199256, 196642, 194301, 192292, 190581, 189079, 187425, 185204, 182745, 181072, 180630, 180648, 180295, 179802, 179792, 180184, 180600, 181361, 183110, 185650, 188009, 189669, 191025, 192643, 194593, 196536, 198075, 199016, 199585, 200298, 201382, 202496, 203212, 203506, 203587, 203569, 203561, 203756, 204149, 204512, 204788, 205180, 205694, 206057, 206233, 206473, 206774, 206870, 206905, 207358, 208166, 208807, 209438, 210857, 212934, 214282, 214237, 214026, 214951, 216409, 216912, 216303, 215659, 215493, 215390, 215160, 215172, 215556, 216048, 216586, 217272, 217819, 217790, 217319, 216948, 216872, 216945, 217231, 217965, 219150, 220688, 222554, 224400, 225439, 225365, 224891, 224769, 224848, 224723, 224590, 224566, 223922, 222172, 220301, 219671, 220097, 220360, 220327, 221091, 223002, 225019, 226273, 227127, 228265, 229717, 231176, 232501, 233594, 234390, 235115, 235943, 236368, 235681, 234096, 232719, 232272]
56402B32272K90O19P97P85N12L59N32N39m1p57r00m08L93J255J807J568P18J11
56384B40451O3p5o37r00k51Q21J570J922J952J465Q36J121K475L563L449L019
56368B60844L322L699K900J219nm02o25q33n77K2K57j1k28j67j35k08o1L84Q02
56349B70197R63R77J089J509K150K432J815O99J02L09O57Q73J460K370K584J776
56333B91962J190J832K907L111K550K188K191K040J642J247Q33M99Q11J808K413
56318C19224J934J292J583K190J705J75r99j050m69J94Q74J480J828K103K562
56303C34626K977L055L064L385L807M078M561N588O571O609N594M048K382J056
56289C91401Q08J793L031L518L456L609M071M487M936N675O497P092P576Q096
$$ y = [232272, 232562, 233181, 233978, 234763, 235275, 235634, 236166, 236705, 236664, 235907, 235007, 234599, 234992, 236247, 238054, 239622, 240340, 240451, 240514, 240439, 239802, 238902, 238651, 239472, 241042, 242964, 244916, 246381, 247217, 248338, 250813, 254376, 257825, 260844, 264166, 267865, 270765, 271984, 271979, 271577, 270952, 270119, 269542, 269564, 269821, 269810, 269582, 269415, 269280, 269072, 269011, 269395, 270197, 271160, 272137, 273226, 274735, 276885, 279317, 281132, 281831, 281933, 282242, 282899, 283772, 285232, 287602, 290186, 291962, 293152, 294984, 297891, 301002, 303552, 305740, 307931, 309971, 311613, 312860, 313693, 314192, 315003, 316811, 319224, 321158, 322450, 324033, 326223, 327928, 328103, 327104, 326054, 325585, 325779, 326653, 328133, 329961, 332064, 334626, 337603, 340658, 343722, 347107, 350914, 354992, 359553, 365141, 371712, 378321, 383915, 387963, 390345, 391401, 392209, 394002, 397033, 400551, 404007, 407616, 411687, 416174, 421110, 426785, 433282, 440374, 447950, 456046]
56275D56046Q472Q775R467J0457J0941J0754J0785J1453J2067J2479J3861J6682
56263E92239J9462K0873K1701K3272K5285K6980K9100L2745L7266M1319M5222
56252I15464N0289N6569O3186P0262P8474Q7257R5438J03179J11280J19012J24736
56241A875146J28347J30976J32450J31162J26582J19722J10844R8674Q2426O3135
56231B999464M2414K1177j38k1175m1704o1086p7820r0688j00151j07575j13412
56220B449306j17217j18885j18585j16016j11151j05236r9629r4153q8027q1699
56210A398708p6171p1155o5736o0188n5358n0843m5784m0833l7216l4443l1164
56199H29817k7787k5712k4396k1890j8234j5526j4369j2991j0512q423p897p939
$$ y = [456046, 464518, 473293, 482760, 493217, 504158, 514912, 525697, 537150, 549217, 561696, 575557, 592239, 611701, 632574, 654275, 677547, 702832, 729812, 758912, 791657, 828923, 870242, 915464, 965753, 1022322, 1085508, 1155770, 1234244, 1321501, 1416939, 1520118, 1631398, 1750410, 1875146, 2003493, 2134469, 2266919, 2398081, 2524663, 2644385, 2755229, 2853903, 2936329, 2999464, 3041878, 3063055, 3062917, 3041742, 3000038, 2938952, 2861132, 2770444, 2670293, 2562718, 2449306, 2332089, 2213204, 2094619, 1978603, 1867452, 1762216, 1662587, 1568434, 1480407, 1398708, 1322537, 1251382, 1185646, 1125458, 1070100, 1019257, 973473, 932640, 895424, 860981, 829817, 802030, 776318, 751922, 730032, 711798, 696272, 681903, 668912, 658400, 649977, 642080, 634141]
56187F34141p236n976m858l960l357l351l495k895j887j742k419k432j362n48
56173E88623p34r42l35N79J298K167L181L553L233L279M038M509M122L681L959
56158F24211M736N783P302Q956R883J0141J0776J2136J3552J4922J6968J9740
56146G59106K2454K5208K9088L4321L9950M5618N1892N8571O4498O9371P3862
56135A273939P7656P9275P8174P5184P0541O3559N4733M6100L9045L3481K9420
56124A921107K7156K5480K2078J6273R431K341n471j3406j9518k3461k7386l2982
56112A901642l9842m7379n5841o4362p0472p2798p2235o9603o4466n7194m9778
56101A237672m3296l6795k9788k3630j9207j5548j1916r142p613o116l942k077
$$ y = [634141, 626905, 620929, 616071, 612111, 608754, 605403, 601908, 599013, 597126, 595384, 592965, 590533, 589171, 588623, 587889, 586947, 586612, 587191, 588489, 590656, 593837, 597390, 600623, 603902, 607940, 612449, 616571, 620252, 624211, 628947, 634730, 642032, 650988, 660871, 671012, 681788, 693924, 707476, 722398, 739366, 759106, 781560, 806768, 835856, 870177, 910127, 955745, 1007637, 1066208, 1130706, 1200077, 1273939, 1351595, 1430870, 1509044, 1584228, 1654769, 1718328, 1773061, 1819161, 1858206, 1891687, 1921107, 1948263, 1973743, 1995821, 2012094, 2021525, 2023866, 2018395, 2004989, 1985471, 1962010, 1934624, 1901642, 1861800, 1814421, 1758580, 1694218, 1623746, 1550948, 1478713, 1409110, 1344644, 1287450, 1237672, 1194376, 1157581, 1127793, 1104163, 1084956, 1069408, 1057492, 1048350, 1040737, 1034621, 1030679, 1028602]
56089A028602j072J31K052L462L597L544M233N076N620O487P668Q063P692Q061
56075A093216R452J0294J0159J0630J2161J2898J1990J1220J1856J2690J2720
56064A219286J3011J4281J5313J5501J6222J8028J9239J9036J9148K0571K1584
56053A411220K0991K0459K1462K2643K2447K1774K1844K1928K1400K1561K3255
56042A650984K5028K5612K5907K6758K7404K7710K9135L1718L3188L2839L3106
56031A969389L5467L8145L9777M1760M4757M6686M6591M6849M8929N0783N1010
56020B460143N1690N4209N6310N6486N7297O0972O5457O8298P0662P4168P7485
56009C153177P9630Q2825Q8513R4245R8001J01698J07050J12136J15623J20045
$$ y = [1028602, 1027530, 1027661, 1029713, 1033175, 1036772, 1040316, 1044549, 1049625, 1055245, 1061732, 1069400, 1077463, 1085155, 1093216, 1102668, 1112962, 1123121, 1133751, 1145912, 1158810, 1170800, 1182020, 1193876, 1206566, 1219286, 1232297, 1246578, 1261891, 1277392, 1293614, 1311642, 1330881, 1349917, 1369065, 1389636, 1411220, 1432211, 1452670, 1474132, 1496775, 1519222, 1540996, 1562840, 1584768, 1606168, 1627729, 1650984, 1676012, 1701624, 1727531, 1754289, 1781693, 1809403, 1838538, 1870256, 1903444, 1936283, 1969389, 2004856, 2043001, 2082778, 2124538, 2169295, 2215981, 2262572, 2309421, 2358350, 2409133, 2460143, 2511833, 2566042, 2622352, 2678838, 2736135, 2797107, 2862564, 2930862, 3001524, 3075692, 3153177, 3232807, 3315632, 3404145, 3498390, 3596391, 3698089, 3805139, 3917275, 4032898, 4152943]
55999D152943J27154J34456J40095J46570J55776J65262J73334J82684J94956
55990E573230K07226K18166K31640K49647K68033K84241L02597L26499L52390
55981H013669L77438M05708M40274M76827N12310N52032O00727O54747P11260
55972A2744992P76657Q57037R49237J050628J168693J311015J475808J663258
55964B1997325J886031K157439K481174K865892L338077L927627M655593N551858
55956D8861016O668349Q055718R742683J1754129J4118891J6818463J9731050
55949A35750299K2638637K5259391K7259020K8303562K8169518K6724691K3671511
55942C17776629J8390700J0356725m6782j1180156k0828800k7385975l0497569
$$ y = [4152943, 4280097, 4414553, 4554648, 4701218, 4856994, 5022256, 5195590, 5378274, 5573230, 5780456, 5998622, 6230262, 6479909, 6747942, 7032183, 7334780, 7661279, 8013669, 8391107, 8796815, 9237089, 9713916, 10226226, 10778258, 11378985, 12033732, 12744992, 13521649, 14378686, 15327923, 16378551, 17547244, 18858259, 20334067, 21997325, 23883356, 26040795, 28521969, 31387861, 34725938, 38653565, 43309158, 48861016, 55529365, 63585083, 73327766, 85081895, 99200786, 116019249, 135750299, 158388936, 183648327, 210907347, 239210909, 267380427, 294105118, 317776629, 336167329, 346524054, 346477272, 335297116, 314468316, 287082341, 256584772]
55935B56584772l0789949k9208004k6585771k3541260k0477748j7601463j4991814
55928I3388763j2685879j0700823r017985p597189o408176n427915m620340l944914
55920C2985542l378869k911434k523867k193685j911523j676381j479559j308294
55912A5601930j159588j035990r32236q39072p55740o86405o28054n73332n21800
55903H469713m77883m40757m05878l73455l46438l23104k99840k78153k61110
55894E263095k46090k28719k10669j96150j83982j70449j56813j46634j38534
55885C585055j28870j18800j11769j06535r9605r2226q8254q7206q5860q4545
55875B581385q5410q6495q3935p8545p4163p1028o6670o1838n9474n9038n7480
$$ y = [256584772, 225794823, 196586819, 170001048, 146459788, 125982040, 108380577, 93388763, 80702884, 70002061, 60984076, 53386887, 46978711, 41550796, 36930456, 32985542, 29606673, 26695239, 24171372, 21977687, 20066164, 18389783, 16910224, 15601930, 14442342, 13406352, 12474116, 11635044, 10879304, 10192899, 9564845, 8991513, 8469713, 7991830, 7551073, 7145195, 6771740, 6425302, 6102198, 5802358, 5524205, 5263095, 5017005, 4788286, 4577617, 4381467, 4197485, 4027036, 3870223, 3723589, 3585055, 3456185, 3337385, 3225616, 3119081, 3019476, 2927250, 2838996, 2751790, 2665930, 2581385, 2495975, 2409480, 2325545, 2247000, 2172837, 2101809, 2035139, 1973301, 1913827, 1854789, 1797309]
55864A797309n4836n3400n2425m9116m4088m0559l8821l6484l3550l2275l2423
55853A329332l1421k8997k7276k6629k5532k4158k4052k4672k4150k3000k3202
55842A046243k4232k3801k2039k1096k1106k0321j8789j8175j8243j7196j5176
55831H26069j3973j3576j2455j0873j0527j1144j0852r679r396j0105j0299j0047
55819F93143j0897j2631j3294j2500j1796j1737j1383j0617j0253j0012q938p476
55807E61609o721o125m585l055l199m129l537j457J48R84K352L918M011K906K514
55792E45634K838K125N42K00J224J287l57j669j555j611l022m481m566l991m254
55777E28344n848q488j1429j3014j1784q446n096k457K57L005M741N562O448O678
$$ y = [1797309, 1742473, 1689073, 1636648, 1587532, 1543444, 1502885, 1464064, 1427580, 1394030, 1361755, 1329332, 1297911, 1268914, 1241638, 1215009, 1189477, 1165319, 1141267, 1116595, 1092445, 1069445, 1046243, 1022011, 998210, 976171, 955075, 933969, 913648, 894859, 876684, 858441, 841245, 826069, 812096, 798520, 786065, 775192, 764665, 753521, 742669, 732990, 723594, 713489, 703190, 693143, 682246, 669615, 656321, 643821, 632025, 620288, 608905, 598288, 588035, 578023, 569085, 561609, 554888, 548763, 544178, 541123, 537924, 533795, 530258, 528801, 528949, 529933, 532285, 536203, 540214, 543120, 545634, 548472, 550597, 551139, 551339, 552563, 553850, 553493, 551824, 550269, 548658, 545636, 541155, 536589, 532598, 528344, 522496, 514008, 502579, 489565, 477781, 469335, 464239, 461782, 462039, 465044, 469785, 475347, 481795, 488473]
55763D88473M034j741q062j2568j5042j5816j4733j2502j0859j0401r977q917
55751C71889q034p875p792p410p248p274o595n232m439m612m540l445k187j749
55737B93457j891j992j896j472n80J15l90j868l008l317l483l837l966m024m768
55722B57080o039o713o472o057n627m446k524r53k03M49J455K389L114M095N308
55707B34856O076O217O003N087K953L90j187j872l043m888o091o178o240o821
55693B25262o961n955m483l347k547k093k260k599k137r49j66j00K20J267K288
55678A95440K610K414J904J131O80J112J654J024m84j408j464j607j880j416n62
55663A99148o52j369r22O99J266o5j294q94q5k93p03m9J037J352J195J401J615
$$ y = [488473, 492507, 490766, 482704, 470136, 455094, 439278, 424545, 412043, 401184, 390783, 380806, 371889, 363855, 355980, 348188, 340778, 333530, 326256, 319661, 314429, 309990, 305378, 300838, 297393, 295206, 293457, 291566, 289574, 287678, 286206, 285626, 285741, 285351, 283483, 280475, 277158, 273675, 269838, 265872, 261848, 257080, 251041, 244328, 237856, 231799, 226172, 221726, 219202, 218249, 218046, 218495, 219950, 222339, 225453, 229548, 234856, 240932, 247149, 253152, 258239, 261192, 261582, 260395, 258523, 255480, 250592, 244501, 238323, 232083, 225262, 218301, 212346, 207863, 204516, 201969, 199876, 197616, 195017, 192880, 191931, 191765, 191665, 191885, 193152, 195440, 198050, 200464, 202368, 203499, 204179, 205291, 206945, 207969, 207485, 206077, 204613, 203006, 201126, 199710, 199148, 198496, 197127, 196205, 196904, 198170, 198105, 196811, 195917, 195832, 195539, 194836, 194787, 195824, 197176, 198371, 199772, 201387]
55646B01387J126L64J20K24K30L80P56O66j30o67m10l96j632l459m644n060n174
55629A83681m961m451m306m705m697l677k513k139k100j644j149j220j357q52
55615A43910k05l33j039j474j495j477j368r82p87j348k389l131l187k588j551
55600A20556p19q07j532j685q52l5m1l40k50r1l00m55j09L31M46N69Q73O78l35
55581A15902j227j042r3Q43J643K237K022R54K10N90J223J004L79M43J066J348
55565A27502J256J429J793J639Q04k64j317k252k646k212j443j071j225j652k219
55550A18122k663k490j757j188j018n80L69R96P90N18Q49J143O45j28l50k97n34
55533A12427n95J72J195J420R57O86P74P31N15M50M15J43j11n0qk96n60n36o88
$$ y = [201387, 202513, 202877, 202997, 203221, 203451, 203831, 204587, 205253, 205123, 204456, 204046, 203650, 202018, 198559, 193915, 188855, 183681, 178720, 174269, 169963, 165258, 160561, 156884, 154371, 152232, 150132, 148488, 147339, 146119, 144762, 143910, 143705, 143372, 142333, 140859, 139364, 137887, 136519, 135537, 134750, 133402, 131013, 127882, 124695, 122107, 120556, 119837, 119030, 117498, 115813, 114961, 114926, 114885, 114545, 114295, 114204, 113904, 113449, 113340, 113671, 114117, 114686, 115559, 116237, 115902, 114675, 113633, 113540, 114383, 116026, 118263, 120285, 121239, 121449, 122039, 123262, 124266, 124645, 125088, 126154, 127502, 128758, 130187, 131980, 133619, 134423, 134159, 132842, 130590, 127944, 125732, 124289, 123218, 121993, 120341, 118122, 115459, 112969, 111212, 110024, 109006, 108426, 108795, 109791, 110581, 111099, 111948, 113091, 113736, 113608, 113258, 112961, 112427, 111832, 112004, 113199, 114619, 115576, 116262, 117036, 117767, 118282, 118732, 119147, 119290, 119179, 119129, 119121, 118825, 118265, 117729, 117041]
55514A17041j186j232m06K67j96j138j487j620k401l252k912j672j049j481j935
55499I5341j694j126p26o24r64j592j607m44R20J117L80Q6N50P99L85m4j72n42
55481I0043j308j700j147j29N20N00J13j03K00P85J041R23J047J424J085k61j245
55464I1788p60J36k41j540j974j115k05Q7L85R74J153O26N6j29l01o48p67n67
55446H6958n35q42j071r87p35k28O68J427J321N83O8j42o52j332j257k61P03R18
55428H4604N77k6q18j280o65P63J777J837J605J633J541R61K28k67o13q02n43
55411I0512L9L30K04K84Q40J266J031M19p1m11p83j150j448j652j505o95N85J624
55393H9419J870J239oj218j507o91K77N35N29J038J553R89l22q77k73K81k6n37
$$ y = [117041, 115855, 114623, 114217, 114484, 114288, 113150, 111663, 110043, 107642, 104390, 101478, 99806, 98757, 97276, 95341, 93647, 92521, 91795, 91171, 90207, 88615, 87008, 86564, 87484, 88601, 88981, 89067, 89617, 90416, 90801, 90757, 90585, 90043, 88735, 87035, 85888, 85759, 86279, 86779, 86892, 86789, 86989, 87774, 88815, 89738, 90785, 92209, 93294, 93033, 91788, 91028, 91164, 90923, 89383, 87409, 86294, 86089, 86176, 86561, 87535, 88688, 89314, 89370, 89241, 88940, 88292, 87525, 86958, 86423, 85581, 84510, 83523, 82788, 82560, 83228, 84655, 85976, 86559, 86627, 86485, 85833, 84501, 83244, 82983, 83686, 84604, 85181, 85155, 84337, 83057, 82392, 83155, 84932, 86769, 88374, 90007, 91548, 92509, 92737, 92470, 91857, 91055, 90512, 90551, 90881, 91085, 91369, 92209, 93475, 94506, 94925, 94854, 94443, 93660, 92510, 91062, 89410, 87905, 87210, 87795, 89419, 91289, 92528, 92522, 91304, 89797, 89106, 89383, 89918, 90447, 91485, 93038, 94027, 93705, 92828, 92555, 92836, 92810, 92273]
55375I2273n17k69k49j98J75N80P67R61J240J227P88K90j30p81j594j997j840
55358I0726j610j493j165p42r37j825k450k097j143k22N32J071J120P57N58O75
55342H1755N80N9l30j78K28N73R10J100P51L0l46k83n12j226j605j141m23q1N2
55323G9913J22k46r60j055j40P17N14j28k0P05Q75Q5q47j059n16L02R02J077R86
55304H1227R32R08P19N13O30R15Q24L75J45K32R5l56n47m13o35j245j217j18R55
55285H3939R87N44O58J152J141N85K00K70N28Q05R50N29n44j475j481q31l27j28
55267H7502R8L13K25p3k79m17n88n07M2O96R76R34P54K98m22q72p86o46p91o51
55247H5806J86R66Q29K83M31J115J152K20p69j157j223j250r95m02P2J84K46M49
$$ y = [92273, 91756, 91487, 91238, 91040, 91215, 91795, 92562, 93523, 94763, 95990, 96778, 97068, 96938, 96157, 94563, 92566, 90726, 89116, 87623, 86458, 85716, 84779, 82954, 80504, 78407, 77264, 77042, 77574, 78645, 79765, 80522, 81080, 81755, 82335, 82394, 82064, 81886, 82114, 82687, 83597, 84697, 85448, 85478, 85132, 84849, 84337, 83111, 81506, 80365, 79942, 79861, 79913, 80035, 79789, 78829, 77774, 77634, 78351, 78865, 78737, 78717, 79422, 80297, 80382, 79535, 78476, 77960, 78262, 79164, 80241, 81227, 82159, 83067, 83786, 84299, 84929, 85844, 86668, 87043, 87188, 87420, 87515, 87159, 86612, 86199, 85564, 84319, 83102, 82984, 83939, 84926, 85470, 86128, 87280, 88421, 89006, 89206, 89476, 90004, 90809, 91759, 92288, 91744, 90269, 88788, 87957, 87630, 87502, 87600, 87913, 88138, 88065, 87786, 87369, 86781, 86274, 86316, 87012, 87988, 88922, 89676, 89974, 89552, 88680, 87894, 87248, 86457, 85806, 85992, 86958, 87787, 88070, 88501, 89616, 90768, 90988, 90219, 89062, 87839, 86589, 85594, 85192, 85264, 85448, 85694, 86143]
55229H6143M67P8l82m59j10L42N37K76k69n53k48K53L12n4j85K32P50P94L74p
55209H8291K7L32M09k7o35q11m66j08n1P4O88J564K015J643N81o54j393j208l90
55190H9881K73L36K0l58p30q97n39Q8J82m41r52p89n11p00q10k5J315K160K197
55171H9700J905J471P15p0k19L01Q12Q62N81J58l53o50l76K31N04K81P0K01L41
55152I6465Q2m88r54j050p58k20L28O67O85M14M7r9O5J37k66p20m11N43R79K41
55132I5687q80j364j217q94k53Q41J524Q41o47j321n99M86Q75O78N33O20P01O17
55114I6228L76L3l21o52r84j129o73L83J313J415R21N96O71P61O55O16Q68J275
55096A02352J501J278O46J05J73O18O36R0k09J19K35n40j430j358o95n55q68n11
$$ y = [86143, 86610, 86688, 86306, 85847, 85737, 86079, 86616, 86892, 86623, 86070, 85822, 86075, 86387, 86333, 86148, 86380, 87130, 87924, 88298, 88291, 88318, 88650, 89059, 89032, 88397, 87586, 87120, 87012, 86961, 87035, 87723, 89287, 91302, 92945, 93526, 92872, 91479, 90271, 89881, 90154, 90490, 90510, 90152, 89422, 88525, 87986, 88074, 88256, 87815, 86863, 86074, 85563, 84863, 84053, 84028, 85343, 87503, 89700, 91605, 93076, 93791, 93721, 93502, 93803, 94615, 95477, 96058, 96216, 95863, 95213, 94837, 95068, 95572, 95853, 95923, 96124, 96465, 96547, 96059, 95105, 94055, 93297, 93077, 93405, 94072, 94757, 95171, 95218, 95119, 95184, 95321, 95055, 94335, 93924, 94467, 95446, 95687, 94807, 93443, 92226, 91332, 91079, 91920, 93444, 94285, 93638, 92317, 91718, 92204, 93079, 93757, 94290, 94910, 95611, 96228, 96604, 96637, 96316, 95664, 94680, 93551, 92878, 93261, 94574, 95989, 96910, 97506, 98177, 98938, 99593, 100209, 101077, 102352, 103853, 105131, 105777, 105882, 106055, 106673, 107309, 107399, 107190, 107309, 107544, 107004, 105574, 104216, 103521, 102966, 102098, 101587]
55078A01587P98K110K685K633K104R89l19j056j152j246j493j376q00l77l45k36
55062A04506J08K16j2k7L28M77J82k0O8j65r96j697j735j613j769j611o66J72
55044I5746k03j222j256K1J140R47R8r3M67P47J96m94m76O7K76kO2R96K062K134
55024A01213J144Ko78j033j194r03j15O26Q16N52K19jj02m1J92M44N84N97M87
55005A02809K52j4j86j95N2O88J530K004J770J152O35K64JJ92R22J384P72l59
54987A13673o96QO97O25J37k61n31m61M00J676K029Q02r42j744j434q84o30n25
54969A11939m02l33l83n44p78q28l31O24J379J434R60L39k68o84n48J49Q23J062
54951A13610J199J633J996J610N70l01m93l97o47j286j748j555q66k33J06L85
$$ y = [101587, 102385, 104495, 107180, 109813, 111917, 112906, 112587, 111531, 110379, 109133, 107640, 106264, 105464, 105087, 104742, 104506, 104614, 104830, 104818, 104791, 105119, 105596, 105778, 105758, 105826, 105661, 104665, 102968, 101233, 99620, 97851, 96240, 95574, 95746, 95543, 94321, 93065, 93086, 94226, 95173, 95271, 95178, 95645, 96392, 96588, 96094, 95618, 95685, 95961, 95959, 96021, 97017, 99079, 101213, 102357, 102359, 101681, 100648, 99454, 98551, 98436, 99062, 99878, 100430, 100649, 100648, 100546, 100505, 100697, 101141, 101725, 102322, 102809, 103061, 103047, 102861, 102666, 102718, 103406, 104936, 106940, 108710, 109862, 110497, 110761, 110762, 110954, 111876, 113260, 114032, 113673, 112977, 112985, 113682, 114307, 114444, 114183, 113652, 113191, 113591, 115267, 117296, 118098, 117156, 115412, 113978, 113094, 112464, 111939, 111537, 111204, 110821, 110277, 109499, 108671, 108340, 108964, 110343, 111777, 112737, 113076, 112808, 112124, 111576, 111725, 112548, 113610, 114809, 116442, 118438, 120048, 120618, 120317, 119824, 119427, 118780, 117494, 115746, 114191, 113325, 113092, 113198, 113583]
54935A13583O61M75l71j152r90p8N96O73O84R80J280J410J554J616J224P13J093
54918A23951K504L670L537K677K301K612K980L180L530M049M273L860K820J291
54904A67235m85k090l192l763l875l631l421l669m107l929k950j988j640j464
54890A27031r19l41l28p51j175j591j973j734o03N26O59K05L46J224J921K075
54874A24572K263K695K781K302K039K670L830M680M853M477L757K914K090J076
54860A66999m29k168l416l900m125m501m751m464l800l174k656k142j843k063
54846A23567k590k755k205j353r51j243j637j284j3J378J876J247P7r31j448j403
54830A10332q57j37K78K39O7J06L12M56M89M69L86K09J8j50m16p90r55o72k39
$$ y = [113583, 114244, 114719, 114348, 113196, 112206, 112128, 112724, 113397, 114081, 115061, 116341, 117751, 119305, 120921, 122145, 122858, 123951, 126455, 130125, 133662, 136339, 138640, 141252, 144232, 147412, 150942, 154991, 159264, 163124, 165944, 167235, 166750, 164660, 161468, 157705, 153830, 150199, 146778, 143109, 139002, 135073, 132123, 130135, 128495, 127031, 126112, 125771, 125443, 124692, 123517, 121926, 119953, 118219, 117616, 118142, 118801, 119006, 119352, 120576, 122497, 124572, 126835, 129530, 132311, 134613, 136652, 139322, 143152, 147832, 152685, 157162, 160919, 163833, 165923, 166999, 166570, 164402, 160986, 157086, 152961, 148460, 143709, 139245, 135445, 132271, 129615, 127473, 125630, 123567, 120977, 118222, 116017, 114664, 113713, 112470, 110833, 109549, 109536, 110914, 112790, 114037, 114114, 113183, 111735, 110332, 109475, 109338, 109616, 109855, 109922, 110028, 110340, 110796, 111285, 111754, 112140, 112349, 112367, 112217, 111801, 111011, 110056, 109384, 109145]
54811A09145j95n14n87j23L79M05K00K94N40L63j40j27P20J582J588R74N88O64
54793A15756P25M85K54L96Q84J353J394Q58J25j63P2K00j64n16l24l8l57r17p16
54774A19307L57J409J943K300K594K350J534R20R71J283J543K155L306M321M633
54759A50926M640M866M934M265L198K530K295J823Q02m49j601k585l392m091m863
54744A63298n562n559m505l007j959j526j285j137j415k146k791k754j935q11
54730A26906j44l63r91j038j99P49J086J101J475K156K529K387K129K178K649
54715A42610L480M448N202N541N445M704L028Q17q20j344j484k199l429m462m955
54700A56582m901m228l203k692l083l397k508q54N8l37j186j614j572j302r17
$$ y = [109145, 108950, 108436, 107849, 107726, 108105, 108510, 108710, 109004, 109544, 109907, 109767, 109640, 110360, 111942, 113530, 114504, 115092, 115756, 116481, 116966, 117220, 117616, 118500, 119853, 121247, 122105, 122230, 122067, 122139, 122339, 122175, 121659, 121335, 121297, 120940, 120023, 119307, 119664, 121073, 123016, 125316, 127910, 130260, 131794, 132714, 133685, 134968, 136511, 138666, 141972, 146293, 150926, 155566, 160432, 165366, 169631, 172829, 175359, 177654, 179477, 180279, 179830, 178229, 175644, 172252, 168161, 163298, 157736, 152177, 147672, 144665, 142706, 141180, 139895, 138758, 137343, 135197, 132406, 129652, 127717, 126906, 126762, 126399, 125408, 124370, 124171, 124920, 126006, 127107, 128582, 130738, 133267, 135654, 137783, 139961, 142610, 146090, 150538, 155740, 161281, 166726, 171430, 174458, 175275, 174455, 173111, 171627, 169428, 165999, 161537, 156582, 151681, 147453, 144250, 141558, 138475, 135078, 132570, 131716, 131774, 131437, 130251, 128637, 127065, 125763, 124846]
54685A24846o33n46k07Q21J925J954Q07l82p99q12r83j172j060q17p31o27j65
54668A21419O04J305J625J445Q59J60m23r66j522j765j361n96j53k28m26m71n03
54651A19003p05j019j244j055j11J346K303K017J060N87P97R19O03K87J70k17
54635A24741j091j875j987j490p25J22P89R18N47J80J07J50J36J05k8m44r26j006
54617A18223o97m54l73j43J69P9l73n05n8L87L96K90M26O04N97N66N68L64Q0K58
54597A20404Q48R63K22m75k06O10R00M07k73p27r58r20n46j30q5m25q28j035q40
54578A16906r9Q83J349R41K05r4J20M44N80L47m25j434j815j103L9O32M84Q3j93
54559A17850j33M92J446J862J360R12J548K590K344N52j157j473r29o74p37l34
$$ y = [124846, 124213, 123667, 123460, 124281, 126206, 128160, 128967, 128585, 127786, 126974, 125991, 124819, 123759, 122942, 122211, 121584, 121419, 122023, 123328, 124953, 126398, 127257, 127417, 126994, 126028, 124506, 122741, 121380, 120784, 120631, 120403, 119977, 119506, 119003, 118298, 117279, 116035, 114980, 114869, 116215, 118518, 120535, 121595, 122182, 122979, 123898, 124501, 124788, 124958, 124741, 123650, 121775, 119788, 118298, 117573, 117695, 118484, 119402, 119949, 120129, 120236, 120386, 120522, 120627, 120599, 120155, 119229, 118223, 117526, 117072, 116699, 116556, 116725, 116804, 116431, 115926, 115868, 116255, 116651, 116941, 117367, 117971, 118568, 119134, 119702, 120066, 120146, 120404, 121252, 122215, 122437, 121962, 121756, 122366, 123266, 123673, 123400, 122673, 121715, 120795, 120249, 120119, 120034, 119609, 118781, 117746, 116906, 116807, 117690, 119039, 119980, 120185, 120091, 120211, 120655, 121235, 121582, 121157, 119723, 117908, 116805, 116844, 117476, 117960, 118043, 117850, 117717, 118209, 119655, 121517, 122877, 123789, 125337, 127927, 130271, 130823, 129666, 128193, 127264, 126590, 125853, 125519]
54543A25519O39J407J376P70K01J28P28J810K732K786J915R23O27R12Q59r8j416
54526A41818k094j860j355j227j417j441j034l30L41O24L68k06p06r87j155j159
54510A28180q01k13J45J97M40J098J562J175K94j08K50N71R0r08j395p88L74R91
54492A31154N96j27k27L36P69O12K32rl83j109j596j059L12J472J743J352Q01
54475A34869K88j05j48K83Q83J157R32N30M34Q04J325J551J336Q74L62j29m88
54458A44758n67m47m14n52o39n33l67j75K62R25J261P80k71j181j553j474j103
54441A38710m44M25J206J515J096K6j158j707j320m85Kj97p08q89m18M03R09P39
54423A37705K39J4K35O44J074J500J626J115L27J81R54J802J772Q58l23j320j927
$$ y = [125519, 126158, 127565, 128941, 129711, 129912, 130040, 130768, 132578, 135310, 138096, 140011, 140934, 141561, 142473, 143332, 143234, 141818, 139724, 137864, 136509, 135282, 133865, 132424, 131390, 131060, 131401, 132025, 132393, 132187, 131481, 130494, 129339, 128180, 127379, 127166, 127311, 127508, 127948, 129046, 130608, 131783, 132077, 131969, 132219, 132790, 132880, 131972, 130577, 129789, 130163, 131154, 131750, 131623, 131396, 131732, 132501, 133113, 133345, 133336, 132953, 131844, 130248, 129189, 129501, 130973, 132716, 134068, 134869, 135157, 135052, 134904, 135187, 136070, 137227, 138159, 138689, 139123, 139927, 141252, 142803, 144139, 145013, 145375, 145246, 144758, 144191, 143744, 143330, 142778, 142139, 141606, 141239, 141064, 141326, 142251, 143512, 144292, 144021, 142840, 141287, 139813, 138710, 138266, 138691, 139897, 141412, 142508, 142534, 141376, 139669, 138349, 137864, 137866, 137669, 136961, 136072, 135654, 136057, 136966, 137705, 137944, 137958, 138193, 138837, 139911, 141411, 143037, 144152, 144479, 144660, 145614, 147416, 149188, 150046, 149723, 148403, 146476]
54406A46476j974j578j169r23n13K09P70Q00P04J009J526J714J531J277R83O00
54390A51442M37P48J141J050N27j2m41o91l37P23J559J161j19j053j205j071p87
54373A53072J7J030J301P60M92J036J530J197N84M87N89J71n41p35l35ok7l3K36
54354A60825N97Q34R01P90O27P75J352J847J734J294J249J666J903J646J356J443
54338A80839J593J259M19n51j480k495l551m233m110l238k158j442j244j301j414
54323A56893j650k046k278j944j089j95L35N02M58K62rk01k90m72q68j264j352
54306A44792j125q40o34m11o5L51O82Q06O77M52M69Q55J278J258P78K60o0l46
54288A49177o62p21m13r5n1K4M74R94R91M83N2j2J12L70R66J749K113J699P99
$$ y = [146476, 144502, 142924, 141755, 140832, 140319, 140528, 141298, 142098, 142802, 143811, 145337, 147051, 148582, 149859, 150842, 151442, 151879, 152627, 153768, 154818, 155345, 155333, 154892, 154201, 153864, 154587, 156146, 157307, 157188, 156135, 154930, 153859, 153072, 153089, 154119, 155420, 156180, 156672, 157708, 159238, 160435, 161019, 161506, 162095, 162266, 161725, 160990, 160655, 160649, 160622, 160589, 160825, 161422, 162256, 163157, 163947, 164574, 165349, 166701, 168548, 170282, 171576, 172825, 174491, 176394, 178040, 179396, 180839, 182432, 183691, 184110, 183559, 182079, 179584, 176033, 171800, 167690, 164452, 162294, 160852, 159608, 158307, 156893, 155243, 153197, 150919, 148975, 147886, 147691, 148026, 148528, 148986, 149248, 149239, 149038, 148748, 148276, 147408, 146144, 144792, 143667, 142827, 142193, 141782, 141717, 142068, 142750, 143556, 144233, 144685, 145154, 146009, 147287, 148545, 149323, 149583, 149523, 149177, 148515, 147794, 147381, 147286, 147235, 147259, 147733, 148727, 149718, 150201, 150253, 150241, 150353, 150723, 151689, 153438, 155551, 157250, 158049]
54269A58049j58r47j319r65p1O45P85P03P30N42j86r30q56j9O33M50k10n69l02
54250A56005K99P74J004J220J577J772J335K95p48j360j637j717j366m66M66O94
54234A58147Q5q61j595j903j885j810j875j896j474n93K85R14J514K054J947R52
54218A52006m7L7J036J708J241%j128j539j144l44K12K13lmN3j85n65o30m14l50
54198A50153n29o54o65q08j058j082p86l98M5O83J336J554J281R10N95N3q07j543
54180A48280j672j159l64K31K71l0P7R36J741J483M38j01L13O61pj246j955j739
54162A46158r91j66N17Q97R15O85L15j45n06n26l25k71l86l64k50m80j052j268
54144A42757o73L54J250J911K287K033J167M89O34J078Q35j17q99r71n49J29J130
$$ y = [158049, 157891, 156944, 155625, 154660, 154589, 155234, 156019, 156722, 157452, 157994, 157808, 156878, 156022, 156003, 156636, 157086, 156876, 156307, 156005, 156304, 157078, 158082, 159302, 160879, 162651, 163986, 164281, 163533, 162173, 160536, 158819, 157453, 156987, 157453, 158147, 158232, 157371, 155776, 153873, 151988, 150178, 148303, 146407, 144933, 144340, 144625, 145539, 147053, 149107, 151054, 152006, 151959, 151996, 153032, 154740, 155981, 155981, 154853, 153314, 152170, 151826, 152038, 152251, 152248, 152244, 152297, 152112, 151547, 150917, 150503, 150153, 149624, 148970, 148305, 147497, 146439, 145357, 144571, 144173, 144218, 144901, 146237, 147791, 149072, 149982, 150577, 150630, 149823, 148280, 146608, 145449, 145085, 145316, 145587, 145557, 145634, 146570, 148311, 149794, 150232, 150131, 150444, 151105, 151098, 149852, 147897, 146158, 145167, 145001, 145518, 146415, 147330, 148015, 148330, 148185, 147679, 147153, 146828, 146557, 146171, 145807, 145557, 145077, 144025, 142757, 142084, 142438, 143688, 145599, 147886, 149919, 151086, 151575, 152209, 153287, 154122, 154005, 153106, 152135, 151586, 151715, 152845]
54127A52845K214K635J941N90n70j154j312j181p02O3P26Q61M48j13m04l39p7
54110A56471K18M35M47J79k59o49q45p69l30M00R83R25K35n31q31o29l30l60p22
54091A54038q82k94Q18J468J105L64K27O81R37P49O46Q90J014P30M35N08O63N37
54073A64634L20L33M16K93J83M65J002J285J198J118J304J556J573J388J307J474
54057A79849J664J613J547K017L073L981M185M209M927O192O926O596N734M900
54043B37413L987K805J579M11r95k602l650l530k579j521o12K14Q99J438K094
54028B35351K866L259L038K725K816K959K571J769J069M92k25r13j163j077j105
54013B54432j238j118q23r16j676k752l615l962l768l311k992k880k637k205k060
$$ y = [152845, 155059, 157694, 159635, 160225, 159655, 158501, 157189, 156008, 155306, 155369, 156095, 156956, 157404, 157291, 156887, 156548, 156471, 156689, 157124, 157571, 157750, 157491, 156842, 155997, 155228, 154898, 155298, 156281, 157206, 157441, 156910, 156079, 155450, 155120, 154760, 154038, 153156, 152862, 153680, 155148, 156253, 156617, 156844, 157525, 158462, 159211, 159857, 160747, 161761, 162491, 162926, 163434, 164097, 164634, 164954, 165287, 165703, 165996, 166179, 166644, 167646, 168931, 170129, 171247, 172551, 174107, 175680, 177068, 178375, 179849, 181513, 183126, 184673, 186690, 189763, 193744, 197929, 202138, 207065, 213257, 220183, 226779, 232513, 237413, 241400, 244205, 245784, 246195, 245200, 242598, 238948, 235418, 232839, 231318, 230706, 230920, 231819, 233257, 235351, 238217, 241476, 244514, 247239, 250055, 253014, 255585, 257354, 258423, 258915, 258690, 257777, 256614, 255537, 254432, 253194, 252076, 251253, 250337, 248661, 245909, 242294, 238332, 234564, 231253, 228261, 225381, 222744, 220539, 218479]
53998B18479k417k693k431k129k414k847k553j711j258j300j019k43J15m38j143
53983A93998j160p61o65q41o75K8P68R20K60q17j501j307p03n24p75o25J96Q66
53965A86682O89J52J18N62Q59Q69R47J095R77P18Q86J534J975J768J382J425J780
53948B04418J965K118K878M293N427N435M671M296M896N934O581O610O229N538
53934B71289M562L589K920K361J475L47m07n16m20n57p01l86L30R53J196J204
53918B87239J218J450K169L444M785N453N389N402O150P268P852P659P357P584
53904C60419Q249Q926R488J0060J0593J0845J0660J0004Q791O885M193N74m056
53891D55631r263j3904j6859j7928j7690j6698j5211j3589j2287j1365j0490r535
$$ y = [218479, 216062, 213369, 210938, 208809, 206395, 203548, 200995, 199284, 198026, 196726, 195707, 195464, 195579, 195141, 193998, 192838, 192077, 191412, 190571, 189896, 189924, 190692, 191612, 191872, 191055, 189554, 188247, 187544, 187020, 186245, 185620, 185816, 186682, 187371, 187523, 187641, 188203, 189062, 189931, 190878, 191973, 192950, 193668, 194554, 196088, 198063, 199831, 201213, 202638, 204418, 206383, 208501, 211379, 215672, 221099, 226534, 231205, 235501, 240397, 246331, 252912, 259522, 265751, 271289, 275851, 279440, 282360, 284721, 286196, 286543, 286136, 285620, 285200, 284643, 283942, 283556, 283886, 284839, 286035, 287239, 288457, 289907, 292076, 295520, 300305, 305758, 311147, 316549, 322699, 329967, 337819, 345478, 352835, 360419, 368668, 377594, 387082, 397142, 407735, 418580, 429240, 439244, 448035, 454920, 459113, 459687, 455631, 446368, 432464, 415605, 397677, 379987, 363289, 348078, 334489, 322202, 310837, 300347, 290812]
53879B90812q676p817o599n155m203m045m032l489k634k128k115k237k254k079
53865B33349j621j012p68j152j672j743j505j505j772j892j796j762j805j669
53851B11675j405j340j438j306r16p71j181j820k132j813r17J45O97L22o12j284
53835A95904j304q73k20O11J366J586J172N67J97R1J04J75K26J48J0J1K04M74
53817B00449P47Q96O35m2n00p5J004J888K255K516K939L290L483L748L988L730
53801B30951L055K750L121L402K928K176K009K458K922L103K995K422J418P12
53787B66422R30J529J421N43j05m1R2k59o98p58q24j469k413k910k914l084l716
53770B51746m351m510m212l614k747j908j732k364k961k609j551q72j029j419
$$ y = [290812, 282136, 274319, 267720, 262565, 258362, 254317, 250285, 246796, 244162, 242034, 239919, 237682, 235428, 233349, 231728, 230716, 229948, 228796, 227124, 225381, 223876, 222371, 220599, 218707, 216911, 215149, 213344, 211675, 210270, 208930, 207492, 206186, 205270, 204499, 203318, 201498, 199366, 197553, 196636, 196781, 197478, 197800, 197188, 195904, 194600, 193727, 193507, 194118, 195484, 197070, 198242, 198809, 199006, 199097, 199201, 199376, 199602, 199750, 199760, 199771, 199975, 200449, 201196, 202092, 202727, 202685, 202185, 202110, 203114, 205002, 207257, 209773, 212712, 216002, 219485, 223233, 227221, 230951, 234006, 236756, 239877, 243279, 246207, 248383, 250392, 252850, 255772, 258875, 261870, 264292, 265710, 266422, 267352, 268881, 270302, 270845, 270740, 270699, 270791, 270532, 269834, 269076, 268252, 266783, 264370, 261460, 258546, 255462, 251746, 247395, 242885, 238673, 235059, 232312, 230404, 228672, 226308, 223347, 220738, 219187, 218315, 217286, 215867]
53756B15867j503j600k053k298j533j00P13L11m75n90n2L74L56K40K78K68P6K3
53738B08302L95Q65Q59M14J93N24Q39M45m50r09m21O09J516K049K289K350K406
53721B22275K646K961K939K439J824J415J102P66O69R54J227J130J052J642K787
53706B47828L671L774L284K615K033J700J625J535J294J303K001L090L802L854
53692B83409L570L195K775K615K999L390K804J235j61o41p78j321j961j977j431
53677B97722r48o80l37Lo4m96p82p47p51r85j124q87m95l61n83r42j212j295j205
53658B83831j029q71p24n05k09N2K34M61Q16J093R78M65mrL32N71N69O19R21J232
53638B88823J284J198J196J204J105J103J473K059K473K612K643K623K558K609
$$ y = [215867, 214364, 212764, 210711, 208413, 206880, 206780, 207493, 207804, 207329, 206739, 206687, 207061, 207417, 207657, 207935, 208203, 208279, 208302, 208697, 209562, 210421, 210835, 211028, 211552, 212391, 212836, 212386, 211477, 211056, 211665, 213181, 215230, 217519, 219869, 222275, 224921, 227882, 230821, 233260, 235084, 236499, 237601, 238367, 239036, 239990, 241217, 242347, 243399, 245041, 247828, 251499, 255273, 258557, 261172, 263205, 264905, 266530, 268065, 269359, 270662, 272663, 275753, 279555, 283409, 286979, 290174, 292949, 295564, 298563, 301953, 304757, 305992, 305831, 305190, 304412, 303091, 301130, 299153, 297722, 296774, 296094, 295757, 295760, 295696, 295200, 294418, 293671, 292920, 291935, 290811, 289924, 289429, 289068, 288485, 287543, 286331, 285036, 283831, 282802, 281931, 281207, 280702, 280493, 280545, 280779, 281240, 282056, 283149, 284127, 284592, 284588, 284579, 284911, 285482, 286051, 286670, 287591, 288823, 290107, 291305, 292501, 293705, 294810, 295913, 297386, 299445, 301918, 304530, 307173, 309796, 312354, 314963]
53624C14963K771K609J900J349J862L184M140M234M146M365M334L558K683K715
53610C58813L613M481M853N009N163N079M637M221M221M424M204L296K177J590
53596D15781J745K224K659L107L492L199J836J41o70m34j90p37j781k665l155
53581D24552l228k896k621l168m474n333m875l787l355l731l946l403k500j805
53567C75430j264n02M65J054O63n51j502j145L01J542J769J449J304J219P42J77
53551C81151K74J103J932K245K300K545K962L141K863K517K886M282N919O608
53537D22728O187N719O093P030P857Q526R256R806R848R713J0013J0860J2050
53524E35686J3652J5610J7107J7250J6263J5339J5311J6108J7377J8768J9813
$$ y = [314963, 317734, 320343, 322243, 323592, 325454, 328638, 332778, 337012, 341158, 345523, 349857, 353415, 356098, 358813, 362426, 366907, 371760, 376769, 381932, 387011, 391648, 395869, 400090, 404514, 408718, 412014, 414191, 415781, 417526, 419750, 422409, 425516, 429008, 432207, 434043, 434184, 433514, 433080, 432890, 432153, 430372, 427707, 424552, 421324, 418428, 415807, 412639, 408165, 402832, 397957, 394170, 390815, 387084, 383138, 379735, 377235, 375430, 374166, 373664, 374129, 375183, 375846, 375295, 373793, 372648, 372949, 374491, 376260, 377709, 379013, 380232, 380974, 381151, 381425, 382528, 384460, 386705, 389005, 391550, 394512, 397653, 400516, 403033, 405919, 410201, 416120, 422728, 428915, 434634, 440727, 447757, 455614, 464140, 473396, 483202, 493050, 502763, 512776, 523636, 535686, 549338, 564948, 582055, 599305, 615568, 630907, 646218, 662326, 679703, 698471, 718284]
53513G18284K0326K0968K2647K5186K7298K8045K7709K7148K6903K7077K7449
53502I99040K7492K6776K5518K4311K3300K2213K1165K0678K0730K0573J9870
53491A251666J9320J9667K0624K1257K1096K0432J9766J9364J9222J9114J8725
53480A470253J7940J6941J5992J5254J4741J4185J2986J0646P281L466l54l907
53468A595424o761q554r624j0797j2406j4024j5332j6629j8206j9724k0613k0737
53456A422017k0438k0150k0301k1120k2329k3295k3680k3662k3358k2574k1405
53445A179705k0484k0138j9706j8282j5902j3418j1388r621p777n866m056k425
53433A030642j027P3R40J782K733L825N202P068R300J1303J2538J3162J3927J5282
$$ y = [718284, 738610, 759578, 782225, 807411, 834709, 862754, 890463, 917611, 944514, 971591, 999040, 1026532, 1053308, 1078826, 1103137, 1126437, 1148650, 1169815, 1190493, 1211223, 1231796, 1251666, 1270986, 1290653, 1311277, 1332534, 1353630, 1374062, 1393828, 1413192, 1432414, 1451528, 1470253, 1488193, 1505134, 1521126, 1536380, 1551121, 1565306, 1578292, 1588938, 1596219, 1599685, 1599331, 1595424, 1588663, 1580109, 1570485, 1559688, 1547282, 1533258, 1517926, 1501297, 1483091, 1463367, 1442754, 1422017, 1401579, 1381429, 1361128, 1340008, 1317679, 1294384, 1270704, 1247042, 1223684, 1201110, 1179705, 1159221, 1139083, 1119377, 1101095, 1085193, 1071775, 1060387, 1050766, 1042989, 1037123, 1033067, 1030642, 1029615, 1029688, 1030628, 1032410, 1035143, 1038968, 1044170, 1051238, 1060538, 1071841, 1084379, 1097541, 1111468, 1126750]
53419A126750J6838J7948J8708J9930K2034K4430K6309K7620K8898L0375L1933
53408A391773L3695L5993L8706M1286M3504M5654M7880M9870N1447N2883N4359
53397A887050N5726N7043N8774O0950O2725O3326O2993O2433O1757O0659N9301
53386B552737N8223N7388N6027N3593N0315M6759M3271L9918L6451L2333K7206
53375C054221K1479J5971J0875N629j29n995j1552j7102k3213k9864l6535m2838
53363B940947m8599n3576n7604o0873o3508o5034o4866o3342o1642o0498n9528
53352B281877n8092n6195n4169n2081m9948m8153m6975m6020m4754m3381m2486
53341A739623m1899m0745l8666l6256l4031l1709k8930k6052k3712k2003k0539
$$ y = [1126750, 1143588, 1161536, 1180244, 1200174, 1222208, 1246638, 1272947, 1300567, 1329465, 1359840, 1391773, 1425468, 1461461, 1500167, 1541453, 1584957, 1630611, 1678491, 1728361, 1779808, 1832691, 1887050, 1942776, 1999819, 2058593, 2119543, 2182268, 2245594, 2308587, 2371020, 2432777, 2493436, 2552737, 2610960, 2668348, 2724375, 2777968, 2828283, 2875042, 2918313, 2958231, 2994682, 3027015, 3054221, 3075700, 3091671, 3102546, 3108175, 3108046, 3102051, 3090499, 3073397, 3050184, 3020320, 2983785, 2940947, 2892348, 2838772, 2781168, 2720295, 2656787, 2591753, 2526887, 2463545, 2401903, 2341405, 2281877, 2223785, 2167590, 2113421, 2061340, 2011392, 1963239, 1916264, 1870244, 1825490, 1782109, 1739623, 1697724, 1656979, 1618313, 1582057, 1548026, 1516317, 1487387, 1461335, 1437623, 1415620, 1395081]
53330A395081j9025j7360j5525j3845j2982j3206j3908j4277j4164j3794j3018
53319A233977j1561r797q492p732o833n423l942k866j930m73J713M176O262P630
53305A194709Q481R321J0419J1630J2872J4455J6574J8769K0480K1926K3775K6005
53293A389416K7852K8948K9762L0656L1224L1001L0124K8904K7269K5171K3042
53282A703369K1211J9186J6196J2341Q588N678L416J080j901n660r858j3794j6858
53269A742994j9051k0948k3065k5371k7362k8572k9012k9202k9710l0598l1453
53258A448650l1963l2324l2846l3419l3631l3296l2618l1855l1117l0505l0139
53247A094937k9923k9470k8479k7063k5634k4506k3778k3400k3155k2617k1531
$$ y = [1395081, 1376056, 1358696, 1343171, 1329326, 1316344, 1303138, 1289230, 1274953, 1260789, 1246995, 1233977, 1222416, 1212619, 1204127, 1196395, 1189562, 1184139, 1180197, 1177331, 1175401, 1174928, 1176641, 1180817, 1187079, 1194709, 1203190, 1212511, 1222930, 1234560, 1247432, 1261887, 1278461, 1297230, 1317710, 1339636, 1363411, 1389416, 1417268, 1446216, 1475978, 1506634, 1537858, 1568859, 1598983, 1627887, 1655156, 1680327, 1703369, 1724580, 1743766, 1759962, 1772303, 1780891, 1786569, 1789985, 1791065, 1789164, 1783504, 1773646, 1759852, 1742994, 1723943, 1702995, 1679930, 1654559, 1627197, 1598625, 1569613, 1540411, 1510701, 1480103, 1448650, 1416687, 1384363, 1351517, 1318098, 1284467, 1251171, 1218553, 1186698, 1155581, 1125076, 1094937, 1065014, 1035544, 1007065, 980002, 954368, 929862, 906084, 882684, 859529, 836912, 815381]
53236H15381k0228j9313j8765j7741j5710j3346j1763j1075j0433r473q832r030
53224F49672r650j0123j0552j1153j1551j1483j1666j2935j4751j5608j4889j3447
53212E01864j2227j1299j0439r777r358q788p864p034o798o996p175p278p523
53199C89308p851p947p692p263o885o648o498o239n748n220m995n076n053m622
53185C01571l921l292k995l175l711m005l418k065q57m95q17j292j699k046k197
53170B65586k030j631j052j17J103J953J748O52m36q38p30p83j333k055k346k017
53154B55674j458j087q81o66n56p31r58q71o03n44o05l44J46K66o6j87K25O57
53136B47411O73N71O41M79k40r34p92J19J047J542J615J249M38m61j052j359j561
$$ y = [815381, 795153, 775840, 757075, 739334, 723624, 710278, 698515, 687440, 677007, 667534, 658702, 649672, 640022, 629899, 619347, 608194, 596643, 585160, 573494, 560559, 545808, 530200, 515311, 501864, 489637, 478338, 467899, 458122, 448764, 439976, 432112, 425078, 418280, 411284, 404109, 396831, 389308, 381457, 373510, 365818, 358555, 351670, 345022, 338524, 332285, 326537, 321317, 316322, 311246, 306193, 301571, 297650, 294358, 291363, 288188, 284477, 280472, 277054, 274989, 274132, 273637, 272820, 271528, 269829, 267783, 265586, 263556, 261925, 260873, 260756, 261859, 263812, 265560, 266212, 265776, 264938, 264208, 263425, 262092, 260037, 257691, 255674, 254216, 253129, 252248, 251582, 251026, 250295, 249337, 248466, 247863, 247319, 246714, 246370, 246516, 246782, 246716, 246529, 246754, 247411, 248084, 248655, 249296, 249775, 249535, 248601, 247809, 247928, 248975, 250517, 252132, 253381, 253819, 253358, 252306, 250947, 249386]
53119B49386j487r36k24J47J64J80K83L98P00J311J753J431N70k4r2j78o22j022
53101B51738q76k82K58L01l17j354k123k020j288q28j137j744j897j465q78n14
53085B35574l55j58K17O11O88L61k2o2J38J22k70p05q43o68k75L28J008J357J064
53066B38110L39k73n15o81j108j559j393m23O25Q10O7p94j114j031r63r30p32
53049B28435l95o0L86J127J925K222J722O95k71o89m16K35O91N49p4p57j114r87
53031B33224n18j32k65r25j640j875j404l53P95J324R40K27J0K19J04l92l60O38
53013B29617J677J796J351J311J743J899J461P90J52m49q42q34o68o43m71K23
52997B38113R41P77k13r65q57l53K1M36J123J665J513P71L1l16l12j50O2L42P19
$$ y = [249386, 247899, 246963, 246739, 246886, 247050, 247230, 247513, 247911, 248611, 249922, 251675, 253106, 253676, 253652, 253560, 253382, 252760, 251738, 250862, 250580, 250838, 251139, 250822, 249468, 247345, 245325, 244037, 243209, 242072, 240328, 238431, 236966, 236088, 235574, 235219, 235061, 235278, 235889, 236577, 236938, 236916, 236854, 236992, 237114, 236844, 236139, 235296, 234628, 234353, 234681, 235689, 237046, 238110, 238449, 238176, 237661, 236980, 235872, 234313, 232920, 232497, 233122, 233932, 233999, 233205, 232091, 231060, 230097, 229167, 228435, 228040, 227980, 228366, 229493, 231418, 233640, 235362, 236057, 235786, 235097, 234681, 234916, 235607, 236156, 236082, 235325, 234211, 233224, 232706, 232574, 232309, 231384, 229744, 227869, 226465, 226112, 226907, 228231, 229171, 229398, 229408, 229627, 229731, 229339, 228979, 229617, 231294, 233090, 234441, 235752, 237495, 239394, 240855, 241645, 241797, 241348, 240506, 239672, 239004, 238361, 237890, 238113, 239054, 239831, 239618, 238653, 237796, 237443, 237464, 237900, 239023, 240688, 242201, 242972, 243003, 242687, 242375, 242225, 242287, 242629, 243348]
52978B43348J037J038P76P00R94J155P17O0q2K80N21N24Q01J472J943J832J544
52961B58660J611K036K537K863K665J678K96o13p76q59j379j974k069j824j769
52946B61083j973k077j943j757j656j663j778j847j579r74m89m57n50k58L41P02
52930B43125N60J37l00o82q94p13j40M22N07O4n55r53j007q60p15o58n68j72O81
52911B37279J696K206J776P04l44j037j419j392q15j69l02j133j387l24R86J051
52895B37376N1n38j67J67l44j180j424r55j98N87J208J334Q95L44O6r1l90p23
52877B36018q75r02q58n10L01J211J632J358O80Q9k7L75Q60R04M93J43K31O20
52859B41743R87J147J051P61N10M30K06m95j307j451q47k81l00n91p34q87j288
$$ y = [243348, 244385, 245423, 246199, 246899, 247893, 249048, 249765, 249825, 249743, 250023, 250544, 251068, 251869, 253341, 255284, 257116, 258660, 260271, 262307, 264844, 267707, 270372, 272050, 272346, 271733, 270957, 270098, 268719, 266745, 264676, 262852, 261083, 259110, 257033, 255090, 253333, 251677, 250014, 248236, 246389, 244810, 243836, 243347, 242890, 242340, 242082, 242423, 243125, 243685, 243822, 243522, 242840, 241946, 241233, 241093, 241515, 242022, 242086, 241531, 240578, 239571, 238711, 237996, 237338, 236770, 236598, 237279, 238975, 241181, 242957, 243661, 243317, 242280, 240861, 239469, 238654, 238485, 238183, 237050, 235663, 235339, 236325, 237376, 237427, 236889, 236722, 236889, 236545, 235365, 233941, 232986, 232788, 233375, 234583, 235917, 236812, 237156, 237222, 237131, 236741, 236018, 235143, 234241, 233383, 232873, 233174, 234385, 236017, 237375, 238055, 238144, 238117, 238492, 239352, 240256, 240749, 240892, 241123, 241743, 242730, 243877, 244928, 245689, 246199, 246629, 246835, 246340, 245033, 243582, 242735, 242454, 242154, 241563, 240829, 239942, 238654]
52842B38654j683j790j881k325k865k872k166j183m77k69l77l57N2N62O40K52
52826B21915j38l40o13r20p09J40P69L71o70j259r13j28L60K94nN0P00J434J485
52807B21823Q65L98M58M85J04m6O47J536J445K85j003j894k673l357l276k073
52791B13724m70M50L38l52r86j172p86%P18Q92M77n9j89J20M40N53P85J419K086
52772B17988K155J603R09K37o28j489j756j406j119j175j010l32J44k44j042j366
52756B11469j107p00k42L67Q34Q56P42R01J055P34K28J99O27R46J028J164J305
52739B20406J234J305J988K750K505J265L23N42J461K304K922L255K878J708M53
52724B47299k69o21q94q22k58J01m77j561k043j687j368j674k049j642m94M99
$$ y = [238654, 236971, 235181, 233300, 230975, 228110, 225238, 223072, 221889, 221412, 221143, 220766, 220409, 220461, 221023, 221663, 221915, 221777, 221437, 220824, 219904, 219195, 219335, 220104, 220475, 219805, 218546, 217633, 217505, 217865, 218159, 218154, 218204, 218904, 220338, 221823, 222688, 223086, 223544, 224029, 224133, 224087, 224734, 226270, 227715, 228000, 226997, 225103, 222430, 219073, 215797, 213724, 213254, 213704, 214042, 213690, 212704, 211532, 210746, 210746, 211464, 212356, 212833, 212774, 212585, 212705, 213145, 213698, 214483, 215902, 217988, 220143, 221746, 222655, 222892, 222264, 220775, 219019, 217613, 216494, 215319, 214309, 213977, 214121, 213877, 212835, 211469, 210362, 209662, 209420, 209787, 210621, 211477, 212219, 213120, 214175, 214909, 215137, 215336, 215963, 216909, 217937, 219101, 220406, 221640, 222945, 224933, 227683, 230188, 231453, 231776, 232318, 233779, 236083, 239005, 242260, 245138, 246846, 247299, 247030, 246409, 245515, 244693, 244435, 244536, 244059, 242498, 240455, 238768, 237400, 235726, 233677, 232035, 231541, 232040]
52708B32040N92j43j001j315r20k28J72N4k16n9O07J177J013K20m52n01j11L52
52690B31281Q92J614K199K131J335L04l83m53M1P26J037O57j32p49r05p47n47
52673B38301n21q01j259j451j055l02K81M86M62L22R5J6L45Q92J114P71J97j42
52655B37751n8M22J169J892K268K258K108J961J714J256N58m60j780k894k989
52640B45176j829k62N18J66n64p69l60M2j7k92j76O02J802K935L514L279K513
52623B56278K033K388L077L014J789rj725l140l980l754k534j235n30j24L87O13
52607B52548Q5p39j048q95q47q43l55M38P50M81M21R11J295R89L78J74M52P87
52589B54982Q81P19M04J24Q8L11N85P06N29K9m79l59N67J521J543O41l58q85r96
$$ y = [232040, 232632, 232489, 231488, 230173, 229253, 229025, 229197, 229251, 229035, 228976, 229583, 230760, 231773, 231993, 231541, 231040, 230929, 231281, 232173, 233787, 235986, 238117, 239452, 239756, 239373, 238920, 238961, 239687, 240724, 241381, 241249, 240500, 239595, 238848, 238301, 237780, 236979, 235720, 234269, 233214, 232912, 233193, 233679, 234141, 234463, 234558, 234574, 234919, 235811, 236925, 237696, 237893, 237751, 237693, 238115, 239284, 241176, 243444, 245702, 247810, 249771, 251485, 252741, 253299, 252839, 251059, 248165, 245176, 243347, 243085, 243603, 243769, 243205, 242436, 242076, 242118, 242101, 241809, 241633, 242235, 244037, 246972, 250486, 253765, 256278, 258311, 260699, 263776, 266790, 268579, 268570, 266845, 263705, 259725, 255971, 253437, 252202, 251672, 251548, 251935, 252548, 252633, 251894, 250846, 249951, 249104, 248261, 247906, 248344, 249094, 249575, 249996, 250907, 252202, 253191, 253569, 253743, 254195, 254982, 255863, 256582, 256986, 257110, 257198, 257509, 258094, 258800, 259329, 259358, 258879, 258520, 259087, 260608, 262151, 262792, 262434, 261549, 260553]
52570B60553q70o69p27j113j176l77N85N16m14p60M4Q23M97l69o53l53k91o93
52552B54553j046j004p68o18o27o56l88L48J049R10n4q02o40j70k75p89r42n92
52534B47489k68j91p6K28N98J046J672K185K070J284L88j11j93j59k93o45r08
52517B54116o01K98J177J466J302J160J065P29L00M15J373K657L409L198K290
52502B74354J404J113J274J139K66q65j451j471j654k374l049k893j905q48m02
52487B62638o02j017j261j221r86o85m07j49J89O75J160J325J038N44J97J00K02
52470B61740N67J253K007K404K276J784J104L67j54j76K41Q07J410K088K621K622
52454B82961K052J237L13q54k119k898k826k198j550j118q68p81q99j292k001
$$ y = [260553, 259683, 259014, 258287, 257174, 255998, 255621, 256206, 256722, 256308, 255548, 255592, 256415, 256912, 256543, 255890, 255537, 255246, 254553, 253507, 252503, 251735, 251117, 250490, 249834, 249446, 249794, 250843, 251753, 251699, 250897, 250257, 250087, 249812, 249023, 248081, 247489, 247221, 247030, 246954, 247182, 247780, 248826, 250498, 252683, 254753, 256037, 256425, 256314, 256121, 255962, 255669, 255024, 254116, 253515, 253813, 254990, 256456, 257758, 258918, 259983, 260712, 261012, 261427, 262800, 265457, 268866, 272064, 274354, 275758, 276871, 278145, 279284, 279550, 278685, 277234, 275763, 274109, 271735, 268686, 265793, 263888, 263040, 262638, 262036, 261019, 259758, 258537, 257551, 256866, 256459, 256310, 256499, 257174, 258334, 259659, 260697, 261241, 261438, 261538, 261740, 262307, 263560, 265567, 267971, 270247, 272031, 273135, 273502, 273348, 273172, 273413, 274220, 275630, 277718, 280339, 282961, 285013, 286250, 286563, 285709, 283590, 280692, 277866, 275668, 274118, 273000, 272132, 271351, 270452, 269160, 267159]
52439B67159k755k939k203j063l37j30M2K24o1p50j066o80k45l46p12q50p85o08
52421B51895n7Q60J479J365J078J360K093K618K729K697K711K797L023L278L392
52406B83318L763N224P675R669J0033R252Q357P301N432K933M90j971m851p459
52392C39166q422p586o217n235m429l520k824k489k153j735j546j378n11R37J743
52377B93801J274M85N80J448K199K571K962L534M057M401M558M445M151M015M050
52362C38531L683K600J433R97J189J284J080R92J079Q31O4n63l28O60J655K166
52346C57353K313K377K346K101J868K171L195M450N318N767O172O627O867O904
52332D15829P236Q207R564J0863J2018J3187J4347J5304J5987J6525J7145J8038
$$ y = [267159, 264404, 261465, 259262, 258199, 257862, 257732, 257774, 257998, 257937, 257187, 256121, 255441, 255196, 254850, 254138, 253288, 252503, 251895, 251838, 252698, 254177, 255542, 256620, 257980, 260073, 262691, 265420, 268117, 270828, 273625, 276648, 279926, 283318, 287081, 292305, 299980, 309649, 319682, 328934, 337291, 344592, 350024, 352957, 353447, 351476, 346625, 339166, 330744, 323158, 316941, 311706, 307277, 303757, 300933, 298444, 296291, 294556, 293010, 291632, 291121, 292058, 293801, 295075, 295560, 296140, 297588, 299787, 302358, 305320, 308854, 312911, 317312, 321870, 326315, 330466, 334481, 338531, 342214, 344814, 346247, 347244, 348433, 349717, 350797, 351789, 352868, 353699, 353763, 353200, 352872, 353532, 355187, 357353, 359666, 362043, 364389, 366490, 368358, 370529, 373724, 378174, 383492, 389259, 395431, 402058, 408925, 415829, 423065, 431272, 440836, 451699, 463717, 476904, 491251, 506555, 522542, 539067, 556212, 574250]
52320E74250J9178K0240K0859K1079K1259K1475K1363K0739J9975J9538J9393
52309G99348J9136J8535J7665J6671J5647J4629J3510J2177J0845J0031R928R967
52297I68089R275P547N262L186J722O31p12k635m690o163p047q077r535j0579
52283I46274j0184q470o524n189m491m004l193j576P96L119M720O040Q000J0404
52269I35722J2006J2366J2588J3661J4982J5437J5122J4958J4983J4322J2802
52258A088949J1427J0969J1058J1019J0777J0461R829Q701P384O141M645K586
52246A193946L67j403k776m280o069p892r622j1213j2371j2841j2886j2915j2818
52233A087227j2304j1631j1214j0745r611q145p427p675p786o850n219l673k361
$$ y = [574250, 593428, 613668, 634527, 655606, 676865, 698340, 719703, 740442, 760417, 779955, 799348, 818484, 837019, 854684, 871355, 887002, 901631, 915141, 927318, 938163, 948194, 958122, 968089, 977364, 984911, 990173, 993359, 995081, 995712, 995000, 992365, 987675, 981512, 974465, 966388, 956853, 946274, 936090, 927620, 921096, 915907, 911416, 907412, 904219, 902643, 903439, 906558, 911278, 917318, 925318, 935722, 947728, 960094, 972682, 986343, 1001325, 1016762, 1031884, 1046842, 1061825, 1076147, 1088949, 1100376, 1111345, 1122403, 1133422, 1144199, 1154660, 1164489, 1173190, 1180574, 1186715, 1191360, 1193946, 1194313, 1192910, 1190134, 1185854, 1179785, 1171893, 1162271, 1151058, 1138687, 1125846, 1112960, 1100045, 1087227, 1074923, 1063292, 1052078, 1041333, 1031722, 1023577, 1016150, 1008475, 1000689, 993839, 988620, 984947, 982586]
52220I82586j146k42J02J68L78Q03J389K221L146L698L850M286N365O419O690
52205A019713O417O317O460O386N975N437M742L802L000K751K817K683K418K454
52191A081372K732K829K754K865L130L155K906K631K263J535O30p3p75k000l611
52176A102343m941n832o703p567p920p713p533p532p090n870m434l383k640j880
52162A021305j074k35O90J401J457J232J822L445M754M460L031J984J887J945
52148A048104J358K75n88p49k54M69R68J077R04N19Pj55O89K472M123M625M145
52131A067989L729M186N582P586R850J2146J4439J6847J9374K1813K4017K6059
52119A233617K7999K9697L0978L1746L1827L1003K9390K7552K6015K4749K3241
$$ y = [982586, 981440, 981198, 981300, 981468, 981846, 982649, 984038, 986259, 989405, 993103, 996953, 1001239, 1006604, 1013023, 1019713, 1026130, 1032447, 1038907, 1045293, 1051268, 1056705, 1061447, 1065249, 1068249, 1071000, 1073817, 1076500, 1078918, 1081372, 1084104, 1086933, 1089687, 1092552, 1095682, 1098837, 1101743, 1104374, 1106637, 1108172, 1108802, 1108729, 1107954, 1105954, 1102343, 1097402, 1091570, 1084867, 1077300, 1069380, 1061667, 1054134, 1046602, 1039512, 1033642, 1029208, 1025825, 1023185, 1021305, 1020231, 1019996, 1020686, 1022087, 1023544, 1024776, 1026598, 1030043, 1034797, 1039257, 1042288, 1044272, 1046159, 1048104, 1049462, 1049737, 1049149, 1048400, 1048146, 1048615, 1049583, 1050660, 1051564, 1052083, 1052090, 1051935, 1052624, 1055096, 1059219, 1063844, 1067989, 1071718, 1075904, 1081486, 1089072, 1098922, 1111068, 1125507, 1142354, 1161728, 1183541, 1207558, 1233617, 1261616, 1291313, 1322291, 1354037, 1385864, 1416867, 1446257, 1473809, 1499824, 1524573, 1547814]
52108A547814K0991J7880J4312J0923Q035N422K804L30j772l649n396o507o549
52095A604638o142o365p239p856q056q761j0329j1859j2629j3138j3917j4464
52083A483883j4256j3769j3452j2532j0202p233n028l476j275J821M591O305P671
52070A423048R448J1299J2630J3640J4805J5965J6542J6315J5569J4708J4021
52059A577990J3506J2720J1154Q925O748N085L673K062K31j525l044m434n941
52046A627150p795r978j2187j4201j6204j8396k0443k1840k2758k3850k5079k5413
52034A409006k4072k1633j9382j7924j6849j5558j3929j2262j0883r938r319q702
52022A228555p767o493n289m783n355o716p994q451q175p933q322r178r869j0023
$$ y = [1547814, 1568805, 1586685, 1600997, 1611920, 1619955, 1625377, 1628181, 1628511, 1626739, 1623090, 1617694, 1611187, 1604638, 1598496, 1592131, 1584892, 1577036, 1568980, 1560219, 1549890, 1538031, 1525402, 1512264, 1498347, 1483883, 1469627, 1455858, 1442406, 1429874, 1419672, 1412439, 1407411, 1403935, 1402660, 1404481, 1409072, 1415377, 1423048, 1432496, 1443795, 1456425, 1470065, 1484870, 1500835, 1517377, 1533692, 1549261, 1563969, 1577990, 1591496, 1604216, 1615370, 1624295, 1631043, 1636128, 1639801, 1641863, 1642094, 1640569, 1637525, 1633091, 1627150, 1619355, 1609377, 1597190, 1582989, 1566785, 1548389, 1527946, 1506106, 1483348, 1459498, 1434419, 1409006, 1384934, 1363301, 1343919, 1325995, 1309146, 1293588, 1279659, 1267397, 1256514, 1246576, 1237257, 1228555, 1220788, 1214295, 1209006, 1204223, 1198868, 1192152, 1184158, 1175707, 1167532, 1159599, 1151277, 1142099, 1132230, 1122207]
$$ [...]
##END NTUPLES=NMR SPECTRUM
##END=
