
##TITLE=AC1413_GUAAH12222_7653369_UeGlL0LtLT
##JCAMPDX= 6.0         $$ Bruker NMR JCAMP-DX V2.0
##DATA TYPE= NMR SPECTRUM
##DATA CLASS= NTUPLES
##ORIGIN= BRUKER
##OWNER= Administrator
$$ 1.72 TOPSPIN		Version 2.1
$$ 2013-03-19 20:51:49.779 -0500  Administrator@X
$$ Compression mode = diff/dup
##.OBSERVE FREQUENCY= 400.02188249412
##.OBSERVE NUCLEUS= ^1H
##.ACQUISITION MODE= SIMULTANEOUS (DQD)
##.ACQUISITION SCHEME= undefined
##.AVERAGES= 8
##.DIGITISER RES= 22
##SPECTROMETER/DATA SYSTEM= spect
##.PULSE SEQUENCE= zg30
##.SOLVENT NAME= COFFEE_meoh
##.SHIFT REFERENCE= INTERNAL, COFFEE_meoh, 1, 14.98509
##AUDIT TRAIL= $$ (NUMBER, WHEN, WHO, WHERE, PROCESS, VERSION, WHAT)
$$ ##TITLE= Audit trail, TOPSPIN		Version 2.1
$$ ##JCAMPDX= 5.01
$$ ##ORIGIN= Bruker BioSpin GmbH
$$ ##OWNER= Administrator
$$ $$ E:\/data/COFFEE/nmr/AC1413_GUAAH12222_7653369_UeGlL0LtLT/10/pdata/1/auditp.txt
$$ ##AUDIT TRAIL=  $$ (NUMBER, WHEN, WHO, WHERE, PROCESS, VERSION, WHAT)
(   1,<2013-03-19 20:51:41.529 -0500>,<Administrator>,<X>,<go>,<TOPSPIN 2.1>,
      <created by zg
	started at 2013-03-19 20:50:36.312 -0500,
	POWCHK enabled, PULCHK disabled,
       configuration hash MD5:
       86 BA 57 50 F2 9D 5C 9B 26 00 A9 28 5F 66 2E 89
       data hash MD5: 64K
       F3 B4 43 52 9E 79 DE E3 B5 36 1C 6A 57 02 7C A7>)
(   2,<2013-03-19 20:51:44.638 -0500>,<Administrator>,<X>,<proc1d>,<TOPSPIN 2.1>,
      <Start of raw data processing
       efp LB = 0 FT_mod = 6 PKNL = 1 PHC0 = 0 PHC1 = 0 SI = 32K 
       data hash MD5: 32K
       91 47 E5 EC A8 14 B2 3A CA E2 B9 D0 37 FE 87 0F>)
(   3,<2013-03-19 20:51:45.154 -0500>,<Administrator>,<X>,<proc1d>,<TOPSPIN 2.1>,
      <pk PHC0 = 100.5469 PHC1 = 0 
       data hash MD5: 32K
       55 23 39 00 79 EB 35 21 FF D6 74 9C F0 33 42 19>)
(   4,<2013-03-19 20:51:45.373 -0500>,<Administrator>,<X>,<proc1d>,<TOPSPIN 2.1>,
      <abs ABSG = 1 
       data hash MD5: 32K
       1C 72 4D AF 28 65 A3 97 18 DE 22 59 9B 23 6A 29>)
(   5,<2013-03-19 20:51:45.529 -0500>,<Administrator>,<X>,<proc1d>,<TOPSPIN 2.1>,
      <abs ABSG = 2 
       data hash MD5: 32K
       88 36 4C FF AD 62 88 B0 16 F0 94 3B 64 36 D2 A7>)
(   6,<2013-03-19 20:51:45.685 -0500>,<Administrator>,<X>,<proc1d>,<TOPSPIN 2.1>,
      <abs ABSG = 3 
       data hash MD5: 32K
       63 8C 70 45 0D 93 3B 8D D3 7B 8E 4B 96 0B 7C 9D>)
(   7,<2013-03-19 20:51:45.826 -0500>,<Administrator>,<X>,<proc1d>,<TOPSPIN 2.1>,
      <abs ABSG = 4 
       data hash MD5: 32K
       E5 F8 76 A2 F9 A6 0B CC C7 C0 4E 96 C7 18 A9 E7>)
(   8,<2013-03-19 20:51:45.982 -0500>,<Administrator>,<X>,<proc1d>,<TOPSPIN 2.1>,
      <abs ABSG = 5 
       data hash MD5: 32K
       4E 2B DA 9D 61 A6 61 F1 5D 5A 48 96 4D 87 3A 4C>)
$$ ##END=
$$ 
$$ $$ hash MD5
$$ $$ 11 4E 16 AA D8 2D B2 FF 41 B6 A1 53 8E CA 2F D6
##$RELAX= 
##$RELAX= 
##$RELAX= 
##$RELAX= 
##$RELAX= 
##$RELAX= 
##$RELAX= 
$$ Bruker specific parameters
$$ --------------------------
##$DU= <E:\>
##$EXPNO= 10
##$NAME= <AC1413_GUAAH12222_7653369_UeGlL0LtLT>
$$ [...]
##$TP= (0..7)
150 150 150 150 150 150 150 150
##$TP07= 0
##$TPNAME0= <>
##$TPNAME1= <>
##$TPNAME2= <>
##$TPNAME3= <>
##$TPNAME4= <>
##$TPNAME5= <>
##$TPNAME6= <>
##$TPNAME7= <>
##$TPOAL= (0..7)
0.5 0.5 0.5 0.5 0.5 0.5 0.5 0.5
##$TPOFFS= (0..7)
0 0 0 0 0 0 0 0
##$TUNHIN= 0
##$TUNHOUT= 0
##$TUNXOUT= 0
##$USERA1= <user>
##$USERA2= <user>
##$USERA3= <user>
##$USERA4= <user>
##$USERA5= <user>
##$V9= 5
##$VALIST= <valist>
##$VCLIST= <CCCCCCCCCCCCCCC>
##$VD= 0
##$VDLIST= <DDDDDDDDDDDDDDD>
##$VPLIST= <PPPPPPPPPPPPPPP>
##$VTLIST= <TTTTTTTTTTTTTTT>
##$WBST= 2048
##$WBSW= 25
##$XGAIN= (0..3)
0 0 0 0
##$XL= 0
##$YL= 0
##$YMAX_a= 664840
##$YMIN_a= -567778
##$ZGOPTNS= <>
##$ZL1= 120
##$ZL2= 120
##$ZL3= 120
##$ZL4= 120
##$ABSF1= 14.98509
##$ABSF2= -5.573092
##$ABSG= 5
##$ABSL= 3
##$ALPHA= 0
##$AQORDER= 0
##$ASSFAC= 0
##$ASSFACI= 0
##$ASSFACX= 0
##$ASSWID= 0
##$AUNMP= <proc_prof1d_extract_pilot.lims>
##$AXLEFT= 0
##$AXNAME= <>
##$AXNUC= <1H>
##$AXRIGHT= 0
##$AXTYPE= 0
##$AXUNIT= <>
##$AZFE= 0.1
##$AZFW= 0.1
##$BCFW= 0
##$BC_mod= 0
##$BYTORDP= 0
##$COROFFS= 0
##$CY= 15
##$DATMOD= 1
##$DC= 0
##$DFILT= <>
##$DTYPP= 0
##$F1P= 0
##$F2P= 0
##$FCOR= 0.5
##$FTSIZE= 32768
##$FT_mod= 6
##$GAMMA= 0
##$GB= 0
##$INTBC= 1
##$INTSCL= 1
##$ISEN= 128
##$LB= 0
##$LEV0= 0
##$LPBIN= 0
##$MAXI= 10000
##$MC2= 0
##$MEAN= 0
##$ME_mod= 0
##$MI= 0
##$NCOEF= 0
##$NC_proc= -8
##$NLEV= 6
##$NOISF1= 0
##$NOISF2= 0
##$NSP= 0
##$NTH_PI= 0
##$NZP= 0
##$OFFSET= 14.98509
##$PC= 1
##$PHC0= 100.5469
##$PHC1= 0
##$PH_mod= 1
##$PKNL= yes
##$PPARMOD= 0
##$PPDIAG= 0
##$PPIPTYP= 0
##$PPMPNUM= 2147483647
##$PPRESOL= 1
##$PSCAL= 4
##$PSIGN= 0
##$PYNMP= <proc.py>
##$REVERSE= no
##$SF= 400.02
##$SI= 32768
##$SIGF1= 0
##$SIGF2= 0
##$SINO= 400
##$SIOLD= 32768
##$SPECTYP= <>
##$SREGLST= <1H.CDCl3>
##$SSB= 0
##$STSI= 32768
##$STSR= 0
##$SW_p= 8223.68421052631
##$SYMM= 0
##$S_DEV= 0
##$TDeff= 65536
##$TDoff= 0
##$TI= <>
##$TILT= no
##$TM1= 0
##$TM2= 0
##$TOPLEV= 0
##$USERP1= <user>
##$USERP2= <user>
##$USERP3= <user>
##$USERP4= <user>
##$USERP5= <user>
##$WDW= 1
##$XDIM= 32768
##$YMAX_p= 462202446
##$YMIN_p= -743796
##$CURPLOT= <Network HP LaserJet P1505>
##$CURPRIN= <$Network HP LaserJet P1505>
##$DFORMAT= <normdp>
##$LAYOUT= <+/1D_H.xwp>
##$LFORMAT= <normlp>
##$PFORMAT= <normpl>
##$SURQMSG= 1
$$ End of Bruker specific parameters
$$ ---------------------------------
##NTUPLES= NMR SPECTRUM
##VAR_NAME=  FREQUENCY,     SPECTRUM/REAL,   SPECTRUM/IMAG
##SYMBOL=    X,             R,               I
##VAR_TYPE=  INDEPENDENT,   DEPENDENT,       DEPENDENT
##VAR_FORM=  AFFN,          ASDF,            ASDF
##VAR_DIM=   32768,         32768,           32768
##UNITS=     HZ,            ARBITRARY UNITS, ARBITRARY UNITS
##FACTOR=    0.250966925370066, 1,           1
##FIRST=     8223.43324360094, -147482,      55316
##LAST=      0,             164340,          -88213
##MIN=       0,             -743796,         0
##MAX=       8223.43324360094, 462202446,    0
$$ Real data points
##PAGE= N=1
##DATA TABLE= (X++(R..R)), XYDATA
$$ [...]
23834 -71734 -128029 -65621 47959 -33971 76440 -50214 -438285 74315 31618 -45513 273002
23822 -174219 -1500 -167824 254252 136727 -322662 113502 -167227 -85575 -66923 -209328
23812 -209328 -121956 183746 5542 -202159 -112685 97309 -65360 -125858 -20140 132631 318557
23801 318557 180487 -362781 144820 -57440 -85685 -46595 125887 102911 9586 -71504 -139813
23790 -139813 9454 -275347 -105522 -248812 -185393 -150685 -171320 -165404 202498 -158920 326915
23778 -8340 183707 157623 -142254 97823 67215 22120 -43741 -213050 -337350 -38148 -133849
23767 -133849 -118920 26494 94707 133513 -39138 162226 -385910 39672 383697 -28463 -25202
23756 -25202 -71013 -125304 191767 -366534 -169533 -334185 221010 -46088 60435 -152466
23745 84239 -305832 -133227 -150204 119591 172414 263768 -110063 312672 156191 -72806
23734 -38183 12530 -63621 60949 91179 -106662 -80804 -114162 37924 -202689 -140637 -37754
23722 217215 -133227 -280050 -73323 10955 -193683 152858 -165768 52611 4408 66215 114092
23711 114092 -323852 112028 -84209 -11699 11332 129205 -44757 319670 -174982 303104
23700 295123 -46846 -27724 128489 -20684 -222324 -31194 76219 -137376 162935 259629 -427228
23688 148550 202382 -136152 55141 259304 32523 -207571 44999 -51392 -226427 246384
23677 -348973 8910 231693 -250384 -82037 -287094 -118662 -53902 78504 -164681 -167582 -188926
23666 -188926 88194 37884 -248736 75157 -139181 -112301 -44448 183355 -61251 -44385 -271037
23655 -271037 115199 162269 39930 70404 -45241 -70410 -211813 -76123 -269893 137869 15864
23643 -128315 240432 -17256 102808 -106228 -146090 -172685 445255 36739 196298 59663
23632 59377 -133675 129638 282265 -256295 228590 5435 -214104 -127716 -95455 119022
23621 -84299 169490 -253313 -176067 -87149 16865 13577 -202758 -48965 309432 10377 183250
23610 183250 169358 155653 -267344 -246320 326156 -146747 -165284 -283357 104611 -117777
23599 395044 -488156 -63129 59481 167259 -225020 143313 -35440 85593 357242 1929 137503
23588 137503 -195917 56551 13694 -4706 60329 128163 -92780 -149670 465598 63148 90124
23577 90124 84793 -36034 -129448 126577 -45786 -136382 -161546 -148431 -186675 -186877 -117243 -41176
23564 -356394 161283 -235394 -15485 473370 -236386 171449 -248029 162840 -318990 -79638
23553 -308756 -105087 7028 107103 127849 11413 -354986 248382 82378 -157141 -78374 68968
23541 34530 290877 78693 -357946 -476668 181157 -86706 -233002 -34843 187247 -354847
23530 -115419 -178808 47624 -159592 -129920 40032 -45685 150554 86446 -253585 64521 -62615
23518 -105323 55949 -35821 -196344 20162 -104024 -294131 58396 -13273 -41897 165742 -246455
23506 -13868 301397 171437 -171365 -68767 -183227 275499 -223040 -214268 22992 96770 199168
23495 199168 -34668 -122272 -185529 -153341 338331 89957 45043 -86652 119144 89759 2381
23483 9597 115509 -193197 -161721 213740 147868 -293378 119290 52472 -55252 141238 -113499
23471 58011 -189382 -338896 -89286 -235890 244809 15297 67289 4102 199976 267905 -317576
23459 -82394 87868 -128312 -349246 -9859 -183141 284963 -69121 242314 -333101 71166 -166314
23447 -207489 -330461 -313993 -223452 -312439 -148622 -37673 91698 254503 -19049 220860 -62923
23435 121876 -155527 -10386 97161 41277 80834 41677 138619 193743 -383017 117082 42068
23423 -8338 -96648 -156129 -25928 131729 -56845 445 394693 6942 -103394 45416 -47202 -323004
23411 -323004 -252014 14516 123594 110185 -69169 -35686 230450 -265777 58988 22818 124520
23400 124520 194841 152989 -19924 -58216 241707 75084 -43606 39284 48881 -192389 191016
23388 -99570 -88023 -170293 153647 283625 -9862 -127054 156940 168142 69103 -48130 280298
23376 -237139 352440 109957 -3323 -111257 1801 -387787 -393920 167664 -169651 -116774 -140724
23365 -140724 123995 -60861 -87754 -78075 -122566 110858 4670 232780 172274 326211 -26137
23353 -24305 278180 -33067 -167964 -244372 254108 144903 20962 309626 3966 158390 99058
23342 99058 62138 -117427 -66868 103856 45053 -374764 -157688 -131671 -249703 -26626 -53839
23331 -53839 -920 297801 -309262 -175945 -135269 -53748 -8251 19127 -24351 20525 -39769 -113485
23319 -113485 232247 -268544 -25149 252119 135258 -125343 -73755 235802 -74955 -122027
23309 -122027 -167523 179541 -154768 -63202 -310745 -318617 191577 38333 -94054 -145708 -112924
23298 -112924 208196 -333610 233544 245960 58977 16007 -179537 -206368 169697 291867
23288 291867 -86777 -119182 -98560 17399 157140 -237194 -41982 -307130 46675 -258852 -33191
23276 -34715 -21610 -49749 -109170 256804 -11164 -14134 106316 -281677 -17890 -296451 6923
23264 -288825 -63187 -184646 79293 -265385 -178114 2057 -53742 -19934 220531 -125489 -158180
23253 -158180 123279 -57092 -395959 -114726 89753 -66227 139143 53085 -119572 4673 -37016
23241 85606 -78192 -50883 -27365 -482406 -236441 -246442 -323287 -97553 -79869 -71368 -202537
23230 -202537 -78113 181914 210543 183097 212304 -103714 -22773 9048 22108 1401 42202
23219 42202 -8409 240173 102289 190265 -195361 -92900 -212645 -237294 -414770 -258731 -156537
23208 -156537 -333594 110585 195797 -184380 82267 -354542 -4410 33045 -171913 -45081 -13492
23196 -2018 157647 -144883 43188 -16950 -141800 -50188 -66127 -130628 -157419 -28336 304906
23184 245708 77103 57480 61865 -99220 -82883 193414 -138810 72395 101040 40512 -96422
23172 23481 -116562 16492 91554 98447 -194489 -154715 -70886 -193449 -429354 -225283 -104819
23160 226177 -353469 -123087 -273370 -138794 -265584 -92137 75278 -145070 210767 352899
23150 352899 -360875 -40285 138508 361723 -71698 -210376 -334097 60977 -400848 150965
23139 -37035 15983 108863 338520 -153466 -52703 -131007 40735 221367 95411 -256615 -90098
23127 243792 103378 -71702 -41870 -143172 -1186 -297315 310206 -70079 -151440 -90547 233355
23115 58069 246716 -194116 -244699 9055 -158103 237698 -21020 75361 246862 173704 61783
23103 -180268 273254 -179728 12639 160953 88898 -374032 -18695 17684 74529 -68333 -130735
23092 -130735 -46940 -56817 102904 86510 30122 -95257 60954 -153160 -167455 -91182 133558
23080 195552 385472 57762 262987 32499 -181545 -12019 -373360 155552 376696 40687
23069 -184716 178744 -45162 6536 186726 38951 73023 -5042 -39546 -27493 25320 224115
23058 224115 3295 -145685 -228952 1335 -208001 128217 -204188 241785 -207814 -99208 211153
23046 -320942 -259281 -39105 -61340 -28720 189367 -49214 352057 -9794 -146699 -49083 -247523
23035 -247523 199764 -48674 58754 -181869 -4394 134011 -162726 64783 13667 -55502 -11137
23023 -150209 36341 173493 77206 40861 189726 -42528 96706 -115677 -187455 93501 -64613
23011 -25318 186732 -49498 229419 -140161 -140655 -832 -157017 -155048 271118 3905 -243095 -167912
22999 -167912 160104 140936 174867 -47390 92341 29719 100225 -73562 416941 -319123 159593
22987 -9748 231779 8175 269111 -213916 -104255 64229 -71732 -366630 102693 188469 -207136
22975 -47025 -106778 19399 114493 -94049 139849 -165111 245163 144551 89782 -211430 67436
22963 -187583 29809 -120008 -141680 -86957 -28977 117000 -117506 24427 -68409 45681 -418573
22951 20592 -153032 7602 -16589 -164517 -172788 42957 -7191 60802 -22232 -462497 -246117
22940 -246117 181540 -146219 90772 73477 -96413 -309748 57174 -91949 -132379 -240451 13860
22928 -71732 -188456 -171002 -24688 -149173 69894 80742 200061 -74833 -393715 -91800 113553
22916 30193 219591 -100167 203994 31844 -170457 139547 -26553 -37136 118012 -247346
22905 -142756 164375 44167 -87899 110133 65181 -120889 87784 -173906 -8603 36616 153098
22894 153098 -22675 -17230 -12678 218709 -72963 -230015 60080 -44340 163070 -73268 -146542
22883 -146542 191243 60175 -161527 60936 272448 -81294 154304 -197196 -347609 -202161
22873 -202161 183079 -431899 -301337 101495 -120901 -48018 -132428 -181171 -374120 106063
22862 109188 126437 149108 -346946 -48961 247520 33047 6495 -144243 -57608 -67265 61219
22850 -107360 -26837 -146963 -62610 -93468 249700 -362398 -91843 288026 -190689 -158804
22840 -158804 96499 47590 -48850 -66006 -4103 236513 -127383 -70797 -62207 -14669 1231 -255589
22827 -376428 -535569 5813 -230816 -49526 128520 -36221 117328 50837 -119215 37602 197309
22816 197309 106365 111596 -283967 -181448 1233 303885 -48785 -11465 -89998 337234 -31626
22804 63505 -145947 89365 -71143 51775 -48403 -237970 -204406 -172775 311511 136319 26804
22792 -2432 -186629 -486873 -42658 153898 -353212 22435 -157741 8118 -408358 -319927 -130970
22780 -184076 -290064 -24418 -287101 101807 -113747 309273 60842 7656 48767 -168241
22769 -341524 -341146 -34544 117299 -121520 -108059 266837 476610 -290820 -4887 -43615 -79802
22758 -79802 -167584 124193 202158 388957 -326310 -3659 -166566 29096 -9150 15943 63526
22747 63526 -22286 15271 159115 -36288 196062 -176403 -1387 -206884 -296174 124103 -242
22735 58957 44734 62056 -389194 -290613 138654 -104298 -336913 403620 126968 147400
22725 147400 -74093 146868 -206043 16476 -16705 -99812 -157460 -53907 -130509 -159177 -196831
22714 -196831 403720 276092 218395 -106089 273625 -148171 92042 -9628 142486 147480 -135193
22702 -95425 -100965 -320580 -101276 52083 -499472 245748 -1720 -161412 172610 45695 53285
22691 53285 -362759 -198242 -63411 -195727 431267 -272899 154353 -32439 191004 -50895
22680 -34667 155351 358878 149202 -77128 -102983 -232292 -63480 55910 -340139 -53571 -162238
22669 -162238 127044 213371 40807 213160 -241500 -273084 -83496 63337 -129740 -152170 -61216
22657 103804 -220593 34363 87331 138391 -193123 -47048 171865 198936 -121587 -228052
22647 -228052 -108183 105500 -159046 -123952 -31171 -55097 150248 -97881 -88054 233810 -344448
22635 -68034 -354294 -74201 -152017 60091 32222 -279990 -4600 -73449 -83242 -68909 -47495 245578
22622 290582 -207756 -14580 155603 -189019 196229 199928 -54305 -82646 -108930 -41887 -13161
22610 37479 -291354 -113242 208543 -264636 -7846 303191 116244 90758 -90321 -93686 206438
22598 -219621 206193 186188 159694 12106 -153648 204876 -128112 185327 -60546 109963
22587 -230395 -232107 108761 -294289 -86656 -119305 -47017 473516 -96019 160126 -81388 188593
22575 -358739 111875 215851 -287173 -30975 203179 -93641 226691 -142328 -74628 -36362
22564 43411 -171026 270094 139679 24655 -70832 67342 -103217 314489 -159514 61737
22553 -92567 -9676 -242205 -56622 -220524 -233835 95446 55406 198544 -126114 -220166 -277466
22542 -277466 -364724 13156 -158619 1518 127649 55501 259341 10699 -193277 128717 -345392
22530 129283 -18966 30801 -149296 37372 -22364 190274 118284 -46272 244991 -925 -321270
22519 -321270 -455471 -323923 -342433 109457 -183581 109782 -115663 186565 -384818 -71372
22508 -59533 -137970 -376211 127062 51298 119488 -183534 -228103 -386546 168391 103256 -57376
22496 -57026 -125626 -9383 -307627 -79900 -434538 -43078 85023 414360 -318758 -200028 175818
22484 259534 -115952 -291905 -32041 146665 -142251 82449 344502 -95249 -76808 -72932 -136257
22473 -136257 245883 -33372 16431 -88924 -12721 -21018 -57178 167629 71316 -161248 -220887
22462 -220887 315008 287267 -50099 -216734 -7408 35882 -110398 -387077 15243 -91815 -125014
22451 -125014 -128038 81077 -141104 475 -210045 -33184 -299454 156599 -37437 -120089 -154987
22440 -154987 149818 113512 -77495 66466 -143219 -50935 -157266 -51670 44089 -206499 -10401
22428 -23666 -15279 -115268 62359 -227127 -258464 88377 61374 2835 -141161 -8976 37206 -165782
22415 -226552 217518 -131931 -53260 -116009 -343888 222126 12107 -91605 -19259 -225589
22405 -225589 -253919 185982 106108 -301246 52038 -10415 193755 -276382 -443094 129549
22394 -28231 -46650 -165942 30696 -493900 -349349 247043 25711 -317724 -13256 -183085
22384 -183085 -100861 33564 407570 -406768 85524 80269 -234594 -325301 -133666 165278 197490
22373 197490 -271612 84321 -159473 67139 -390677 86342 -187811 -65097 109389 -220721
22362 -166646 -32772 -31102 -90337 -174653 -247098 126556 -197349 95228 286 32813 -285666
22350 264371 189634 -38665 -304328 39430 28774 -69246 27057 -107720 -294299 -26930 -48012
22339 -48012 -94842 106733 261317 -65466 -23866 -17888 459914 186408 160388 155587 -75071
22327 -57546 -308937 -108210 220637 -278800 42097 302409 114300 -53917 -40931 -102174
22317 -102174 44603 12030 -60096 7740 118508 81348 33628 89725 436927 208286 -73045
22305 -57496 -191719 51930 32734 4706 138632 38660 99527 110328 233578 191969 287714
22294 287714 165439 -413406 -135735 -55101 362009 38916 -7720 -174745 23327 -27890 -264840
22283 -264840 98597 43961 -266491 -42283 -206417 -123387 -20576 268505 79258 139516 -174576
22271 127918 -67906 131923 130531 -23564 -149192 -83481 -104039 261363 -89975 -69543 -130222
22260 -130222 157351 -99422 -359854 -54746 188799 -35689 278339 181325 -24072 -130259
22250 -130259 -21300 -8974 120939 36338 -1614 -229056 -198909 -110713 -96092 -193610 331724
22238 140005 231518 94462 248360 -110504 -57287 -75432 -45637 -306288 65998 114606 -180609
22226 147588 19647 -44482 -116642 -131995 -27642 -129806 110218 -359662 67298 188716 61373
22214 87170 -129797 44885 -245538 39676 -139492 -62908 16823 81804 5405 -70065 -236917
22203 -236917 -40612 146350 -196586 -579966 -37807 -62815 205336 81431 258394 226092
22193 226092 -171043 147808 1417 -195916 90653 -93765 71977 -118902 242669 -30642 -117857
22182 -117857 110595 -315262 59046 56792 -46345 -4930 -216100 -153295 -319550 -9908 218160
22170 -132085 -85783 36758 -327339 -99032 8159 -132172 235757 59421 79989 64517 -47443
22158 10301 50108 -274651 -187381 -166704 88644 181553 -62512 -174548 -294730 87143 -221667
22146 12065 10255 -163398 79273 -118977 324814 175446 -29239 -90777 -148389 -220526 -66412
22134 212547 31205 95265 -476128 -295635 -127351 84020 -62134 -102602 31761 116140 24154
22122 155637 -224181 208042 -236521 -5207 -351344 -59886 141294 139893 -149634 -517915
22112 -517915 -126793 9154 136129 36355 -465050 63431 -20193 -218468 232845 -328323
22101 13853 154344 92934 291255 -43167 123819 -46232 41566 -180963 -172005 -31407 45623
22089 -42748 -257199 2489 4015 89263 5958 -32242 194106 17012 370708 388523 -413584
22077 -139716 4417 -92637 -89966 -184615 -185596 58715 -235037 -183248 -137676 -75288 153703 168767
22065 168767 57529 151080 51596 49005 364863 62759 -94242 127121 509437 -15772 -1129
22053 -201184 -45123 -167483 181101 -207092 36480 -329914 27040 69174 -139589 267062
22042 -160311 -262874 47258 36467 14510 -36247 97203 99544 -257016 -209725 135391 -249937
22030 -169288 108082 -104199 -188508 -213212 86352 -183230 -244820 241092 -139219 -173371
22020 -173371 -66292 -95407 -184061 204435 -254568 65411 62851 41125 94336 -27368 -91690
22009 -91690 -176262 -116353 -306112 -145294 -71398 76163 -78152 10284 400355 -60573 52590
21997 -184021 -36365 195745 -105965 -126597 13011 -322972 170847 -140121 38347 -87812
21986 226261 -334863 142424 -104175 -258362 -107679 -184123 68013 272037 58682 -166881
21975 -94441 -115345 -121040 187720 221467 -348829 -67528 346302 60353 -74601 -69379 308484
21963 -93753 136981 33293 -163225 -247436 -48580 9750 104588 -75171 115365 -185644 66659
21951 -43287 -38760 21684 -378566 -278781 -50419 -145684 241911 33884 33782 32257 -253668 -237623
21939 -237623 166170 291690 194292 30079 -158212 12301 -204086 -150863 -67099 -186406
21929 -186406 -87311 -368961 211449 -122241 -108061 -1679 -99498 -91059 74738 -46038 -7318
21917 -133597 -100050 -118387 -327304 423194 -45685 71997 -134223 -136275 205453 93192 -19059
21905 -16230 100237 -104440 -136826 105256 101578 -204932 -1821 121616 158449 59869 -41257
21893 193165 82960 -310723 -362144 87986 -136061 69925 -74003 -72926 -60336 25498 -71717
21881 -93189 -211004 108142 -274654 -148003 -78566 274063 -226710 22562 251319 166111
21871 166111 -169869 153515 -40021 211669 55330 48743 -124276 -373335 -21009 -113265 -277186
21860 -277186 -50505 159328 173519 62697 -303788 233128 124968 -12785 87200 -238982
21849 -61101 -205965 -132260 -202853 88582 203879 170778 83354 -162944 67186 59105 -234141
21837 232950 -156842 67286 -117817 -5542 -3602 -360027 -154679 -1057 -197054 -81668 -113961
21826 -113961 -196338 109590 -30193 -226842 286776 209134 -24918 -223884 -338624 -258237
21816 -258237 -249314 18435 60881 51168 40670 -528984 -300688 227835 209555 -173318 50508
21804 -197361 71726 -408294 93981 -452130 -119463 103404 -131058 110044 -86149 -9029
21793 330582 243905 -104708 -72017 197418 -364429 -130511 39877 -111580 150188 -280087
21782 -126465 -73388 110554 54439 61480 -221697 -262025 29709 275755 24585 -189338 137246
21770 74094 386490 -44933 -49078 -97291 -125085 -37072 -5044 -171151 298847 134297 -347161
21758 -10671 -231050 -247921 -134801 -207186 -202046 -112858 -80175 -113358 18291 76810 139216
21747 139216 -6451 -116126 223900 -33333 -149738 15026 -41567 -381065 -378061 -3626 -901 201912
21734 -124274 119516 317713 -250772 -73625 -225339 -24281 -103624 158623 31469 101454
21724 101454 174050 14907 -219138 -184283 -152675 -153496 227516 39224 125466 -95131 194401
21712 -109445 -225940 98546 -467700 120588 -45171 -448123 -177805 -283293 173714 -76615
21701 -185062 92064 77623 -36808 315650 108166 9783 -55149 -31413 -301187 20696 -104371
21689 181942 -75278 -174029 19907 -45551 -157353 -6041 -68105 -42187 -222473 -276264 -291314
21678 -291314 17735 -27180 -323258 -37290 -225063 -10604 -85644 -198976 -18852 41694 -168926
21666 145340 77682 -146462 73933 -3557 -42057 138537 -167266 -245147 -247780 -341303 274911
21654 -8495 66609 -287917 -210617 86738 -144 139939 -169679 -215085 -9715 181380 29614 -247240
21641 -116843 -372756 -6093 -59720 -93981 -108454 -71568 -219659 -68339 -20185 104184 -129221
21629 212510 -210027 268139 40607 -18277 -79771 -231279 -120613 193406 -185704 91955
21618 32155 -167735 241363 146245 -37388 32069 -44273 -194309 -111702 11388 -28940 -270636
21607 -270636 117395 -70511 4570 -27628 -136276 21500 11526 -70634 -27110 -284268 -245772
21596 -245772 31859 -358042 156510 -49944 -4608 72872 -91274 -289995 -122394 22182 -32708
21584 -17165 1649 -40665 37982 -69940 -225737 -80026 -353640 151456 -63088 -202466 6395
21572 -281051 -161696 -158255 78299 9984 -271200 -201166 117098 40885 -43250 -78056 -120851
21561 -120851 -206536 -301752 -53473 -115659 -343426 -143398 -210769 -5637 -59058 -82113 -198018
21550 -198018 214633 -182388 125094 -224014 180772 50388 -77217 279738 61014 160207
21540 160207 -218748 75200 83812 -72416 8519 -282515 -289154 -212967 -273129 -233243 -45173 52634
21527 88452 -39116 84646 105805 66357 14686 7866 -103697 50746 141148 -119820 96197
21515 -224790 7052 -220623 84340 -38861 -283144 381623 -13093 -275692 52599 -240269 -7263
21503 82123 111580 206918 -19987 83224 -161380 126443 -127175 99905 -411769 -151877 -134186
21492 -134186 -44959 378678 -275457 170640 329245 -141423 105088 245898 -28735 -82235
21482 -82235 -88770 7231 169128 -29329 -291938 188508 187101 134718 349366 144557 7467
21470 -12312 92119 -321589 -32423 -339646 41211 7751 143520 84022 -73361 128363 -189303
21458 288596 16324 57279 248576 -82999 -273409 -32920 101023 -1601 242353 -161271 -100076
21447 -100076 157752 245910 79965 -245993 91109 173251 104146 112234 146147 183413 499964
21436 499964 28710 413938 40520 200853 382817 81425 12395 -180864 -39837 -72831 -369514
21425 -369514 -277896 -144476 -273575 -165400 -140107 -313814 -163189 -81779 409853 -51607
21414 181699 -234202 -225287 -143947 -125309 -241951 129895 -97093 -155858 -18148 22350 -58474
21402 -33406 -75352 55688 -20712 8820 1051 -170065 -90064 -335709 -241583 14328 172481
21391 172481 -80380 -226396 -350027 -80222 -354485 -341767 -302716 -194929 -162852 355411
21380 239854 -117745 -272474 101058 9832 -252465 22311 -142959 373866 -82568 238102
21369 22546 -249254 180593 -238879 93891 131847 103647 316131 90365 -123722 -120984 -248865
21358 -248865 -132417 -174763 -400495 33945 -226240 97598 160414 1312 -117236 84334 -263665
21346 183926 87658 236350 -259516 -249151 36823 -236438 -151078 -406115 44081 -100137
21335 -7465 -14841 -79198 -156888 -105411 -239868 -227838 -177603 -55611 -23866 202233 114597 -24284
21322 -154920 -65058 -274280 -192620 59539 -193256 -79351 -222595 -333297 213520 -100476
21311 -145103 -34808 -244681 -195854 -312 -45376 -172918 -29951 189443 66012 -3824 -32720
21300 -32720 10930 -95584 160390 117580 201788 -287540 -159879 -117453 -50131 -144120 -268656
21289 -268656 -155610 -156713 -103933 114723 -23923 -122429 -204562 -184975 -325259 -87467 -259782
21278 -259782 -213963 65304 5818 123882 -979 -47033 -154402 -76273 56642 -1934 342684 -105321
21265 237925 79586 208540 -48185 86382 18521 -85330 -459143 -469716 -159830 -75007 159167
21253 7892 -133016 107574 -123777 -12855 -33042 -4476 30959 -400421 128194 16866 -119473
21241 -471964 319584 -81515 189451 -28694 -2352 -71978 -194948 -338296 -467252 309323
21230 -27786 42911 256057 -45034 -69531 271109 -37209 20625 -111780 -182064 -177958 102850
21218 148859 -41455 -140235 -161114 -22957 -42720 121126 -347074 -17767 123794 -211973 -284718
21207 -284718 -167847 112992 440223 -105336 228272 -195498 159953 295 59225 -60231
21196 -133041 -54620 -76060 93440 -171936 83590 76793 284427 129439 159115 -182263 26918
21184 -189259 165248 -41563 -94965 156992 138571 -10135 60681 146672 10204 -154215 43864
21172 -248656 -117942 219961 5979 99657 22758 69621 -338252 29764 -21138 115495 -89499
21160 -224248 -372224 -138488 -202434 -117530 -267462 184662 -182152 42327 28805 -129246
21149 -96875 29880 -61460 52275 -250922 -73416 209606 -251925 186012 27871 -93406 -123619
21138 -123619 96485 -91304 155795 -411456 -192966 -213068 200852 -37124 106182 -106176
21127 1738 -24137 -275110 -5218 -91666 -256305 -180244 -333883 -15177 -223710 40574 -147504
21115 42557 -236847 125193 -247836 -166371 -164161 69566 -19007 45901 -210960 -83689 -2615
21103 -294017 -407564 -151318 -26437 20355 -71057 -167664 64209 82170 -187136 111065 27916
21091 -85836 23585 -75965 -155117 33275 167605 -161639 174919 191244 -315388 -28615 -74022
21080 -74022 184 -69108 -44244 -23063 -152448 -19694 32667 -304109 341587 -193434 -338304
21069 -338304 -86989 -232762 223465 49719 -107846 -88790 -26681 -137643 -3755 -247772 -127374
21058 -127374 -520643 207918 -146778 142225 -80847 -282012 63149 -100597 -60571 -344620
21048 -344620 300041 61323 -17343 -304977 -364651 -105757 -306610 35264 64862 -206174
21037 -48802 -281870 110389 -194316 -186233 26848 -274263 39201 20400 -114212 -436065 196731
21025 75138 -298900 445909 -115066 38160 -1075 -24658 13582 72478 119154 -294701 112147
21013 133246 -97619 -10135 -41140 -125129 26279 -12913 93072 -12133 -184266 281643 -113342
21001 30925 -330187 -95378 118501 245552 -306707 70166 -106923 122096 179545 -238094
20990 -132583 -71856 -92810 -312259 -34535 -270863 -192685 -56742 -40087 -20540 -102803 301320
20978 -91276 -5279 -59771 49938 50329 177244 -106711 -25714 100895 -316359 -76303 -159389
20967 -159389 -238870 34911 -308458 256221 -52878 -219300 59583 36408 32409 -167412 119901
20955 -24891 -222921 1157 -205755 -131642 23571 82011 -56755 -187240 154168 -271266 13638
20943 -27033 -78161 18806 92432 307413 74026 -149328 -57467 -176478 -22152 -18455 -23460
20932 -23460 98720 -311736 -59387 44032 -226701 -43713 -11493 97039 -74818 -169704 148682
20920 -34934 -217884 -381815 334529 -363151 -28225 -151041 37702 22218 58941 74884 303137
20909 303137 -460813 171016 -161247 -285952 10676 -141847 -152335 242802 188556 1956
20898 -45170 -13501 276393 -112416 -119399 221842 -13936 145240 151203 -238070 7627 -85050
20886 321651 -55306 98487 233279 83508 191320 26139 -25202 -64368 78209 -273973 6008
20874 -62220 47022 216163 53318 -272626 -84996 58956 84527 71357 232911 -276566 185098
20862 -68070 -9700 -27497 43394 -177625 -188115 -410319 -141806 -211574 -22006 306245 244994
20851 244994 163743 -125483 55147 199687 -323866 197822 230385 128501 -142737 -12343
20840 -139242 202869 -177551 79213 10283 -38859 38281 159784 153444 65405 -4859 198739
20828 -236431 -231201 -384964 -23526 27797 77729 37282 228910 143488 124912 49804 -150362
20816 -382484 94952 118081 -176689 -231123 -278692 -247347 -264480 -190607 247993 -375022 178843
20804 14838 -362618 -224217 -122618 -158615 -328039 -266041 84593 169689 -31635 -169740 -100418
20793 -100418 -223871 -316568 -205563 118866 -275030 -172008 -78150 -118240 191121 -227982
20782 -141504 -481655 244619 -72252 145527 231511 4964 375662 72623 -176239 333341
20771 51068 149331 -29245 202348 45606 28463 146251 -93489 -140788 -156411 -27793 -215386
20760 -215386 198700 -7912 -61527 71846 59798 -158356 -49085 109041 -51292 -115875 38004
20748 -172227 -206636 -89406 -110847 -238361 46626 -268294 -166445 -146023 74800 -338604 -23404
20736 279237 -167469 -188942 -166720 58275 -231631 -41408 60855 -262783 -990 -118560 -237201
20725 -237201 128596 -122714 69197 63003 330555 -221868 71049 147350 92367 -142408 -115184
20714 -115184 131586 -151001 -269581 -131952 -189609 -125159 2506 217133 -191483 30996
20703 -149865 45451 -147628 -157244 138415 -173240 54346 64169 290179 207903 3374 39775
20692 39775 134015 -19073 -314671 -175493 58543 -320997 18253 8341 -653261 -206604 -28078
20680 -21658 -222929 -225509 -413460 -106695 99047 -178604 96321 -38123 66152 193936 269326
20669 269326 150207 92034 21856 187874 -269220 118336 114024 -243552 -180563 -12623 151914
20657 -174219 -10057 92268 -132546 -36980 -97770 31323 54276 -134230 -137240 -18360 -74948
20646 -74948 -31864 130733 102506 86691 37408 -159176 158883 53097 69018 4565 55002
20635 55002 -219984 42583 479329 -126450 -144438 239433 -211330 148522 -370071 -123306
20624 55022 50341 53205 -226507 -93868 -94655 -242059 -94397 -105532 -303849 -235557 -232206 -113769
20611 -204015 -141146 -106207 50517 171837 -126523 106799 -188240 84240 39722 -146452
20600 -194697 -289062 200289 73162 -167316 72968 -178596 34575 -60525 -289365 -128186
20589 -306957 -298801 374535 80051 -29349 271603 -18400 4847 194277 23397 69474 -48131
20577 340932 -161232 -17917 -145143 238483 -212631 -87943 154536 -231536 153458 -90296
20566 -291113 -422153 64434 -132782 -201550 22714 137665 -232842 -216218 -62557 -186431
20556 -186431 77267 204040 133682 123676 -255573 74149 -249835 -196907 12054 -198091 -101328
20545 -101328 -31409 198459 102843 -394070 381437 -80489 -72087 -202060 13704 -135218 -128493
20534 -128493 -337249 129170 278033 -74992 -12333 701 176568 105222 42015 153322 -91024
20522 118214 180199 75343 -144177 213465 76877 -141663 -45778 -21496 -27526 15968 -100190
20510 194743 154768 -102148 -172027 19815 -154259 126374 240645 206310 -254107 323 -113544
20498 183089 218247 121553 -120671 34838 256648 159112 80226 69020 98018 84042 -219881
20486 150793 24393 163945 -40634 235618 -67336 -98428 -209920 42864 -130248 77008 146809
20475 146809 -273551 -165383 -107470 217653 131937 -186502 -23828 -56362 -281517 -21920
20464 138539 -129173 -67892 63262 82611 23700 -218230 13019 86934 18550 120957 -280564
20452 221752 510870 118011 158840 170915 -189609 83893 -123327 19556 -33643 78232 148351
20441 148351 -20414 43024 22100 -434032 -130481 476564 53572 -300779 -121256 -178107
20431 -178107 -196335 -81051 -53055 -174782 -175550 6974 -146930 83114 311413 -20701 127600
20419 198071 -125496 -77663 -97124 -50376 -154533 -145144 -58701 -68924 179327 -51995 -195138
20408 -195138 63884 11351 -39563 -158790 -168261 25047 12515 -79725 120643 -23917 -313585
20397 -313585 -105547 -148023 -226875 -448144 117136 24503 -184950 -14789 175849 -71037
20386 269212 -13336 -124453 -139796 250293 -217119 201380 -55434 -4892 228972 112885
20375 113802 111288 -10416 -33305 -112579 -50887 31668 -59045 55170 62132 -175197 -90967 -130484
20363 -130484 66702 -411658 11804 -40529 5983 109815 40506 -373353 -137210 176274 9901
20351 -27332 64974 -39783 -89764 -78499 -57686 -240923 70542 -33138 -143837 -348967 -196269
20340 -196269 -66431 -222090 -234150 -297645 -316735 18332 -107921 -234921 -264761 -55854 -36471
20329 -36471 211826 -269148 22702 -234976 -10212 -345676 369695 -55184 -126406 82750 306041
20318 306041 -317184 -56344 -92754 -215950 -61029 66009 -35790 194273 -250958 -206370 -104487
20307 -104487 115251 -136910 -435380 9732 -271060 -108885 -2514 139517 -34850 -151685
20297 -151685 -152959 -210696 -35999 206579 14873 -344040 -383163 -210143 177596 283693 125675
20285 -64602 103566 -500073 461480 58164 -230893 26566 43505 -35718 255390 73648 -62456
20273 -302587 -279620 71971 -358328 927 -122641 78083 -109209 -174718 243216 22998 49912
20262 49912 69475 -158637 -104193 -91750 47085 -27452 20894 -246826 188088 -129981 -119629
20251 -119629 -130 -190179 -15973 -139861 -310756 45316 175191 -366007 -2244 47753 -465749
20239 -193601 -34831 110608 -130405 135238 -568108 -76771 -187123 1828 -3871 22313 -202814
20227 111741 184331 -52069 -262969 -76548 -62326 200444 253932 -224931 71737 -94074 -105192
20216 -105192 -38769 -194483 -359818 -82050 51292 -153033 -249193 71523 -123354 -113182 -214735
20205 -214735 49399 -28439 -10720 -156402 -373365 -184380 -209267 209547 -85978 -182844 153448
20193 -281817 -151965 275217 -1773 -89484 38768 -23122 -38398 -153643 -291720 -311973 -12803
20181 -202835 305445 -190625 -502685 -483282 98394 175141 -61101 74935 -70630 242519 -13788
20169 -63168 62295 18932 163627 -80930 277181 -195047 -233439 145982 -139853 -204297 112315
20157 -181709 28256 -276487 38566 -65545 135530 -126574 -101620 254843 72891 -189173
20146 -167157 97360 -289579 -135797 -70748 -160181 -16614 348501 107223 -344378 -20899
20135 -178389 -57698 120986 276628 -131656 -29015 -23268 -81094 -41443 -256493 -134546 -219858
20124 -219858 -292871 20337 -285292 71217 458549 -144381 99723 26004 -194264 57472 -210232
20112 -7228 -125118 121803 78758 134606 28673 -151705 -55344 252858 212544 -216379 -308537
20101 -308537 -61451 153018 -163779 52439 -140313 -33939 -98142 135762 -296685 168772
20090 -92334 -50112 185328 61167 -210689 -97527 -291222 -427055 -84835 -86711 -69119 56182
20078 89127 -4948 241705 176120 22514 41510 130788 -260305 114667 36823 109950 118487
20067 118487 -266771 -285450 4052 -88671 -397624 -201787 -6265 262945 -253730 161957 156722
20056 156722 195483 276521 -324440 -220168 -301659 -369424 78088 206006 -184371 5765 -250056
20044 207335 6015 167145 -142137 59378 128077 149485 -173143 222887 -277739 -3558 251206
20032 130738 -26605 -268650 -7665 -8579 398695 -159244 -355097 66266 62605 97567 5617 -159428
20019 146229 93058 -184926 98435 147858 37113 29980 165206 141570 84677 -261527 -122924
20007 -334950 -19312 -2375 -40061 -154775 76488 12727 -87252 -216429 154050 -301639 104046
19995 -31448 156868 60564 -241608 -73351 -40349 -163406 -53688 238583 -489700 9634 56785
19984 56785 205981 -118615 -38790 112959 66790 138074 3706 -398009 157365 -48952 -25466
19973 -25466 114788 -192312 -183369 78457 -120066 318464 -77732 133186 -27596 143371 -234279
19961 63343 -467180 -170641 -66297 149971 -110884 290521 -226583 167278 270892 14937
19950 -97388 -154167 -151312 353680 254868 -244694 -246058 -15660 -135843 -112588 6328 111104
19939 111104 -62790 -13722 -188620 190751 54025 -220090 388149 -131780 246081 275970
19929 275970 -153804 -116263 -163083 -102162 99167 -88660 -491727 -85706 -247187 -309394 185994
19917 225905 -84687 -171491 -166767 -108816 -108460 -38483 -277079 -234072 -151408 -197990 150847 -39589
19904 50192 99869 4225 88910 229504 -77778 -18108 40060 51191 -5370 -85172 -233412 -138871
19892 -138871 -154039 -49369 188143 79336 -107964 50855 -60552 -145537 -237968 209285 -225440
19880 -303279 -56316 80186 93356 17283 -116372 -235443 -44541 -191269 122880 -91971 86308
19868 29507 118016 182294 -455189 244209 232201 -357611 -599236 -202944 -109388 154735
19857 -276909 64129 -52572 -260488 -131637 230521 137014 -249634 117419 -187179 -270669
19847 -270669 -127489 178826 270758 -16992 -80503 480812 -308042 -261261 -158926 -123994
19837 -123994 -58585 -350632 -104589 72887 75701 -106627 -47581 -35381 197131 -6407 -226799
19826 -226799 -62521 -20251 -306522 -120065 -233189 -132473 -336700 -167122 -92906 14938
19815 -2297 -168089 347500 -364634 220145 269044 45306 -94481 82595 -255600 85329 60263
19804 60263 -161106 -95123 -236806 -120353 -187461 -225208 -53178 -1913 80714 -278902 -352267
19793 -352267 118341 -87107 -11574 311485 377887 -25463 13438 -161831 -212983 -163432 -119119
19782 -119119 68324 -67381 17310 25370 -100894 50725 -7500 -454443 121325 -58175 1072
19770 -63543 -419244 218058 100694 -116653 -229033 -355416 -251832 -152072 -62202 -39170
19760 -39170 258183 156068 198120 42980 -91753 -10906 -229117 -192861 -1219 -171915 -49128
19748 73148 -99479 -278343 106460 126032 -194416 202555 77294 -242545 316845 -200732
19737 -87599 -162326 172741 -131903 -7461 98727 -160434 -58188 90596 -174438 -183654 -89486
19725 -67175 -121934 -43788 349429 -162446 149171 252274 48515 -117778 28053 57119 -119544
19713 -40873 185898 7160 -181096 142030 9968 -412946 -164108 -123666 71000 42416 -101256
19701 210419 -148745 74572 28685 79282 -123192 26398 -461302 352862 167784 -259457
19690 -135497 65054 67487 15209 155936 187281 -101812 109776 -60703 -208076 5849 28497
19679 28497 -153357 -33306 -193979 -21293 -424811 -299315 394978 -5662 -71605 47969 75869
19668 75869 508816 33277 -70419 -165406 231233 -38437 76680 285830 -75616 -214474 62487
19656 -142439 22728 16447 -341946 -10950 -126209 -198508 -69332 -47932 13116 -9411 374432
19644 -159358 -191706 -68591 -245123 -73269 94592 271290 161883 -78282 -225045 111574
19633 -212078 118540 -142126 6001 -49721 63227 -18329 79902 -245472 358952 -421069 16651
19621 -313337 -227451 227765 -134574 -126214 -138961 21167 372038 -56952 69738 -83257 48798
19609 -248652 -208236 54809 -51918 491 -117474 10840 -131304 16331 -84858 -134105 -423344
19598 -423344 -284896 360010 -616902 -222219 -417895 -370236 -175189 -3452 143049 -23064
19587 185640 131861 17099 23575 183612 -105876 110886 47621 967 219148 98585 -173045
19575 -55158 -44443 -371242 -72141 -30432 -128517 106251 -12731 -179855 362160 -34239 -100076
19564 -100076 -491018 175307 60011 -145690 -50537 135599 -135057 282671 -176633 454801
19553 -234412 49607 -500234 14337 27428 -193970 -31445 -114066 -246837 -287828 -4464 177166
19541 -134827 95317 -76383 -12085 -333613 -15579 81972 -155918 17820 -159218 60198 -15573
19529 -501062 -131945 64564 -23464 -119568 -157969 128482 -95944 -144970 86314 -163863 240193
19517 -28597 -22191 -20884 -108524 67959 -97469 -473321 -31505 145486 47541 -218123 -208695 -69244
19504 -43701 -218879 -70292 -64976 -39509 -190658 -126261 -184377 -342603 -268599 -295950 254448
19492 -127632 276443 -70039 122111 363908 135150 -62455 118757 -215243 -24178 -57248
19482 -57248 46468 -204403 134724 14915 206529 -83883 105278 -57415 10394 -154467 -124256
19471 -124256 128389 277271 -191073 -359085 59814 -168179 -77288 89855 -91128 -70166
19461 -70166 -355304 76848 -337179 -233484 -64934 -153539 14290 -106421 -86410 -80606 84336
19449 55770 -20064 110847 -157741 -152433 -64402 -438681 54394 11626 51368 -214079 24166
19437 -201580 63864 -104505 -227970 151473 -317800 -209569 20826 -255326 -77310 -9374
19426 -86125 -165262 154199 -248991 -193692 -117007 -270807 -3099 392253 35038 -349470 -275011
19415 -275011 -105632 94890 355883 16479 -78791 107226 98053 59166 -17126 -228809 13779
19403 9610 -2438 44242 28986 751 -408693 -432246 -160402 49442 -24457 -6816 -300358 -185474
19391 -185474 -42801 -101862 190990 180928 -212459 67928 318911 -284162 297929 -333374
19380 10586 279460 168649 -93892 7227 237156 84703 105525 -276639 -485874 103038 219428
19369 219428 -135293 122763 -131457 -47630 -161557 -68734 -68898 38765 -256839 -153041 -8504
19357 161978 -64233 100747 17903 26975 -334051 -473677 -219078 -248933 -328105 33681 -226244
19345 -61536 -215565 47542 -80549 29700 -5187 99686 -173759 247017 -34357 12071 -191779
19333 -140453 -23348 -198135 221816 -78988 88152 -16772 310513 31269 -142701 181602
19322 -101424 61446 128234 -176766 106155 16878 -25423 -82411 -242050 -291683 37510 -164660
19310 397663 -433579 -102968 -192180 -40035 38834 -55859 -47578 -132745 13681 125701 -344312
19298 -1611 -287851 105894 -201155 -268750 64207 -68121 -102360 -427817 331887 -156738 -235500
19287 -235500 138553 -85655 90815 155107 -5356 -221683 -250051 -122982 -254144 -102773 -116690
19276 -116690 -198469 134539 108011 8676 -296359 145173 -276097 -176666 55763 17090 281685
19265 281685 -153077 -44938 237607 -26022 -278168 -106997 -249050 10256 -261815 256447
19254 -271176 -344027 -218771 -58464 -293849 -320851 131429 -119426 -238908 174345 -63824
19243 -64272 61359 -27488 -254965 -321382 16770 196499 -21940 109248 18110 78084 47537
19232 47537 252504 41344 12204 -284032 -89524 -91102 -195378 -247941 122188 -141658 -77692
19221 -77692 -25585 56589 -297518 360702 77808 32685 -382431 -107029 -49137 -72416 -43856
19210 -43856 20757 -250047 5770 -82145 -94961 -42791 -55299 17226 -287520 -67618 -170479
19199 -170479 -260744 -173149 -52174 -124601 -237898 -65040 -1735 -556933 264064 -258593 -81317
19187 -114338 -134388 -35170 -120011 -1812 -75933 -213295 -318991 9827 -262039 -155830 -97582
19176 -97582 86413 166839 -312449 -240834 -14667 -79815 -577511 -944 290805 -125916 -163564
19165 -163564 -225468 27371 -160257 -228329 120039 -274339 150617 -105518 -350246 183093
19154 -216426 -287617 169325 -345043 71926 2962 269761 -161729 -227107 -162855 42377 -27875
19142 84846 -74799 112199 -29123 13309 -318621 -202682 117243 35504 7599 -279990 39502
19130 155053 -21629 -95373 129081 -277948 70063 155489 -174746 -232812 317237 -148204
19119 -200742 -138301 -163474 -10089 136173 -116806 266916 117662 -78098 197627 -153096
19108 -39213 -67756 12860 102952 256763 174520 -169672 30789 126099 -74048 104518 -298143
19096 -93255 -3640 -269607 -347840 60338 -65149 -15340 148172 4618 118447 7726 -302897
19084 -145351 -6799 243239 -174637 -180171 2818 -14684 -95855 -67752 320524 -30325 173323
19072 -75150 -68740 -82645 33886 -279208 15962 -44033 -93413 -58104 -169212 8337 -15290 66843
19059 8877 191952 -39529 -250135 153568 -219068 78606 155609 29026 99392 -102045 -207905
19048 -207905 -27940 54414 226988 -183370 345560 253258 -287024 -250501 -62157 164598
19037 182550 134189 82226 -213986 -341547 153371 21284 20021 -190772 14726 -142154 179592
19025 83483 107802 156829 156290 -10945 269676 285822 28153 9648 30895 -40026 -21294 -146842
19013 -146842 -61545 -100055 -272470 -197608 16606 -122706 -290241 -153726 -143345 -360335
19003 -360335 -235813 -177283 74110 186601 -25592 -114386 -135518 135444 -110979 -110965 -11160
18991 -119622 -38884 -138522 -43868 -327092 -23919 -233168 -112532 -1476 83403 -16442 278552
18979 -110666 60147 -11918 220785 -486046 -480733 -34782 -280676 -118610 -54893 -27199 36146
18967 -47166 -249967 -163463 119424 -133270 171962 32577 -268027 25833 -54713 36781 -155956
18955 54393 190224 9708 -105555 -38673 -210121 -222518 -33054 -62270 62196 -161644 47978
18943 -51468 38022 -18005 265369 -70315 -205683 -241370 -251169 13594 -155155 232015 20796
18931 -8477 -105453 -109286 222443 -26986 130197 -127835 4053 -286895 -158002 117168 -229551
18919 -78892 164105 -412795 -201437 13500 -23018 315707 36021 -291338 204390 -151 -337616
18908 -337616 -93302 71044 -95224 -127886 -497441 -147208 -141815 -92866 -75393 -15719 60370
18896 285284 44064 164300 27531 -113912 -498328 187787 -200554 76430 276649 42349
18885 35013 -155558 -238310 135465 205317 -30975 278348 -218251 336827 -81114 28092 -60424
18873 -173447 147322 195141 -30349 -40742 271839 116199 -179380 73672 1126 -46631 327564
18861 37598 92618 -304839 103513 -265374 -175108 -63454 1328 7701 14474 -245973 -239798 -107685
18848 216702 -18330 134048 200744 -33018 -53375 335165 2827 -109615 255794 130996 -36580
18836 -226615 1530 13476 -325725 -319403 -58661 16431 47263 309396 -452005 -177535 -333980
18825 -333980 -130684 323554 -24427 -27999 -97370 87525 162357 92575 -8934 -104672 -17684
18813 -111537 105769 306323 -127209 190158 -173847 247987 212420 -148170 95083 -121094
18802 -69048 -38058 -4655 -510701 59388 59570 37044 -103072 -113971 -201309 -152236 -87349 117524
18789 39543 -426491 143469 -246326 293354 -8471 128650 43153 -116037 350584 -21943
18778 -19673 221882 -1029 24056 25761 148759 -216963 270939 174395 207832 130529 167863
18767 167863 -336137 -52450 -9507 53897 -10036 8228 -157154 -230045 122039 -78316 -246708
18756 -246708 -198114 -140343 28657 24459 -67565 23313 -191856 -11956 -192506 84063 119589
18745 119589 -207440 -391640 27016 204959 -182184 -171243 88519 -220896 44149 197788
18735 197788 -171547 174636 -171039 114128 -83261 -270732 -375660 50722 -144693 -47577
18724 -24230 215420 48213 -131118 66380 -121008 -156931 93252 97965 -100173 148216 -88203
18712 -197762 108080 -56766 -102703 167287 -37762 -168692 -106550 -126593 -95375 275974 -32729
18700 12470 -169593 -316181 -69430 78388 -52017 -171242 47133 68146 -80466 -249406 83770
18688 11863 -168218 110318 -207012 -7704 -106615 -75112 60987 11631 -151580 69748 -205722
18676 52658 -151853 1866 -80269 -193272 -115069 174020 29415 -387775 36417 16230 91263
18665 91263 -124460 -337168 211375 -27585 -82366 -27961 -339659 81482 203170 -282118
18654 89192 -176455 -265665 80004 -31942 25617 -289085 -339385 -83540 -27779 88674 53862
18643 53862 -205677 -232379 -275337 -275982 -167262 -341593 -63692 119588 5616 195917 -1930
18631 -8941 64953 -13744 -154756 -231501 -202581 -315020 26113 -9836 -230780 25171 -183300
18619 60873 -182263 279808 -114032 -151146 114175 -124461 28539 -241996 -184152 -11104
18608 -121860 -384103 -126068 -16640 315889 -53917 -391022 96349 275969 60953 -342113
18597 101524 -276861 -411204 -48018 -128503 837 195470 111034 -20347 -164209 -80514 -2784
18585 -105599 -137888 -29294 38383 -200872 -41948 85670 -296887 -52263 169996 -171477 76453
18573 -155614 -69212 -40750 101716 385564 -25462 188311 118938 -23474 -248104 -69296 24286
18561 40896 4747 71007 52746 -166150 -56855 -98210 -239365 -95738 -167949 -154601 -147230 -2039
18548 -294262 -80824 -29509 331794 -230546 -175153 -60041 -26459 142227 -226474 -65590 -330480
18537 -330480 -185231 -229866 -103487 16717 -56209 -70149 -222225 -55401 112033 96595 -117304
18525 -187052 40799 -52130 78660 -63223 114974 296265 -152116 -24831 -238128 -331902 -119063
18513 76514 50714 -150379 -66684 208448 -189840 101084 137991 104340 127828 -117170 -60019
18502 -60019 -206509 204543 197846 100925 34909 -34468 -11633 -176908 90508 -53600 150467
18490 75588 -84998 -379908 -122007 -27233 211799 -60974 207056 -80009 -343934 -134951
18479 -14161 -78908 144747 -253643 -121341 49522 -243137 -242314 238346 -59390 -58010 108305
18467 -179143 -92646 21774 -195093 82366 377621 33369 -114470 -164681 -205774 203855 55209
18455 7144 -156030 136179 -316263 -169191 -284226 61710 -119641 -157436 -217184 -231857 50432
18443 38196 -11283 116818 -40917 -21905 5768 11549 98642 -32064 -37332 -230378 12590 -412970
18430 -302723 -116904 -102208 -165029 -157838 29840 -53119 267530 -286057 91256 -413389 35741
18418 -5381 148146 75541 -296237 -117940 -62337 79173 -133785 8672 63003 -61941 -59409
18407 -59409 83351 71590 -159285 -186563 6409 329113 -352266 166589 -19635 -230562 106638
18395 113402 296642 -128655 -5389 134125 104607 -176848 -195972 13824 -205127 -53395 -222156
18384 -222156 -299411 -251192 42836 73445 157552 245811 -14202 1402 401 23687 -172220 122195
18371 -4380 -243295 -12400 -97480 255628 -159774 -67799 197740 -5766 -275284 5181 -75125
18359 220819 66544 26296 -50896 -54426 -367701 -100037 -241174 -132462 -71592 -185205 -147423
18348 -147423 -76700 -163167 279128 -90549 -153106 137745 119299 -226973 250271 24848 -220348
18336 97738 298224 36533 -230282 -236809 -61238 137000 47869 -178592 -122035 49084 462627
18325 462627 -274351 -246771 -163831 8067 -47132 288234 240335 -239976 -245487 -53340 -33599
18314 -33599 163459 -33222 -129174 -380358 -396211 134194 -13898 88178 237504 236204 -144536
18302 66300 328764 -64225 32098 303978 -141881 -396877 84930 -142539 -34481 -147033
18292 -147033 -398903 -168947 -163807 -48856 85019 -240047 -73089 -76600 -23276 291062 -21612
18280 361860 -202348 37602 5090 11906 122498 210760 -259341 -43293 -55636 -5083 24526
18268 -44600 -345125 -248502 -229830 177040 -40140 -235907 -61598 -137040 153306 -178379 -339350
18257 -339350 -308846 -112755 65139 -59182 46315 123355 -45312 -13042 -106442 -36776 80269
18245 -118291 -493965 -133619 -262388 240660 -70330 -90630 -161983 -330767 399290 -175991
18234 -5610 -7197 -252755 -217764 -118292 -261804 41197 773 131613 255309 7238 -45338 -40325
18222 -40325 -67838 -34276 88263 156398 -72696 60311 -246990 -10693 172120 -126306 -121567
18211 -121567 118802 -488643 -335890 11635 125688 81579 112006 48771 -83713 -67526 -34858
18200 -34858 -167926 -136614 -53937 -270433 -36840 61243 343974 70779 11517 -33158 7895
18188 -224958 -180569 64263 -157767 -153304 48708 -74007 -9325 -174486 -178587 33345 -105944
18176 -186347 -277107 -9015 -150580 477218 -135551 -74567 318697 33351 123373 57201 -11977
18164 104185 72813 108356 16261 229125 264800 -283238 -26088 136859 -73188 -94444 -12278
18152 -120696 -47488 -317720 386131 164544 -208326 119769 337391 18253 -34962 55964
18141 -8632 143619 -324127 -94338 129941 -382635 25593 -200069 -243194 74652 -171326 -55054
18129 -47348 356415 -48301 -40810 154879 -129969 12940 15684 -211293 33671 -22137 -448834
18118 -448834 -180629 275926 -130058 84457 87656 75457 -278482 -122421 -237491 17624
18107 -119841 -87643 49487 268754 -145653 -93659 171218 -10323 103956 -8443 193799 -174032
18095 -146723 -261624 -43115 -33633 -354719 989 215110 22063 158404 -196490 13934 -20049
18083 -226812 -292560 -78944 -305088 -101907 101786 -112777 -34446 177070 160945 32451
18072 -264062 -319790 -222178 -150787 -54445 212577 352429 -58606 -280583 126657 -44406 -166203
18061 -166203 75494 41717 84479 12337 -236667 87486 -176972 -296452 34324 98110 97262
18050 97262 -485456 205791 71210 50012 23148 90520 -271576 106695 5800 77133 88219
18039 88219 -81043 -202250 -193951 -86514 13272 79239 -77632 -55009 -114390 -140554 -154860 -133642
18027 -133642 269492 -283321 155165 -49042 138176 177289 306987 -141760 -31225 -82440
18017 -82440 316137 190504 -27266 -354183 -159211 61410 38792 -170698 -237444 -175927 -284260
18006 -284260 -212372 -86618 -183345 -49337 19715 -282 5457 -260295 33163 51189 -213965 -173943
17994 -173943 178930 176574 -260939 29667 217572 -78739 -50209 92115 123040 95131 -372152
17982 -296900 4166 -47746 218422 39655 337052 282971 -6909 -38845 -106843 124393 -236286
17970 -29383 20994 -162841 322222 221821 -66518 65927 125972 -230305 -115173 -91460 78964
17958 -239146 -227440 -236379 -44592 94859 29159 -91623 263930 -81961 42246 -71673 -96407
17947 -96407 274384 76875 -43388 -221581 -9343 31216 -122867 370887 282253 92481 -183428
17935 157384 -105667 -71601 -116376 -133332 100184 -182043 234244 -332366 119847 -181404
17924 -39336 -277266 193567 135203 -6265 -26699 63558 -145742 -95168 247241 -155150 -89124
17913 -89124 118730 211692 -251129 -130159 -115520 -22331 287340 43187 -565632 -42293 105382
17901 -220467 -227763 -194302 99459 -88448 -306711 225954 -34488 114086 232558 101613 174960
17890 174960 -209373 -9434 130396 178665 283085 -266404 -252089 207463 -472793 63935
17879 136284 265847 22695 164536 -58782 81953 -129251 -297988 140975 17699 170256
17869 170256 -287236 62985 179450 -24585 -115599 83675 -102245 266528 -7717 13255 446066
17858 446066 -106937 -7668 314041 -52632 346675 20376 -204847 312443 -52539 75732 -283699
17846 352793 -27196 -325253 7422 -96972 -103527 180569 -127024 66399 -107433 29303 -39300
17834 240459 -17683 -14964 -24387 -146757 222784 150086 93594 47110 192976 71060 118154
17823 118154 -336550 45569 140181 -24784 -85382 -165833 -66495 -73799 32115 25964 -346899
17811 78045 7575 -46054 65010 -25362 -330023 -424733 275030 -30103 -32368 106321 -65218
17799 -208763 -313655 156190 -71792 -63745 151927 55158 -135918 139685 -30350 350445
17788 -103748 -5763 169480 318174 -175984 -370433 15438 10556 153181 -15656 315146 173042
17777 173042 345604 -164744 -16351 -143587 77922 -17913 -104684 -47567 -91051 221393 -229233
17765 -173201 -50886 -184699 -152434 96574 -140276 33713 223650 -127175 113728 -60440
17754 -43086 194751 -128849 -88515 85365 137102 -4214 171110 68995 109228 -10517 205201
17742 36022 -155057 236267 -59660 3686 -80979 63189 188282 -43512 -141399 50894 -216810
17730 -57217 -16094 53484 -20043 -115905 170511 254424 383493 -76880 -325736 29184 -98209
17718 142714 -140526 11586 -98097 -250010 49619 -109196 159931 183187 -297852 -268457
17708 -268457 97895 -185755 -93168 61369 310601 -15318 282095 212083 39908 56283 44103
17697 44103 -41777 177473 -191149 -174261 138172 -225060 106709 -142351 -267034 -2509
17686 -139076 219770 87852 121772 -93759 -108617 127941 -70987 109347 -7253 24313 43178
17675 43178 -232167 153634 -19943 -52821 101720 -74616 164392 -34814 72949 145079 -6138
17663 -47519 80146 283489 -402361 -97075 -283006 -26167 -9614 -4630 312652 -89987 62339
17651 -2954 -22830 270524 266907 51115 -344331 -2423 -267936 434816 -260546 286213 7398
17639 -12021 130110 240448 -18009 37759 -318026 -182912 -118763 91324 -132587 228207
17628 -4255 -40710 109729 -122980 310728 348111 -247963 131056 92587 97977 243547 -185673
17616 -102554 319543 -398852 12857 -96445 49971 5556 170322 161779 -101585 318623 126786
17604 265810 353035 58650 -29465 -31563 316124 92600 40457 460886 154596 10272 -23740
17592 254800 -79412 291542 -154586 -146212 160357 -48770 -38683 -147100 46512 -195267 73615
17580 -79639 -32872 100865 -5607 -184938 -273899 -227893 189706 247127 105438 125474 89948
17569 89948 -259267 54603 415342 139171 306843 246311 -90810 -135311 256172 6551 -102512
17557 -3223 -45338 -49547 60162 -389286 7037 -151507 115075 -139160 266113 -31338 108109
17545 -55001 406401 255995 312525 169271 283424 -149810 364271 -173950 309448 122312
17534 -42962 -178468 -150548 -79605 154617 364847 4064 95133 -167691 -183761 10150 216173
17523 216173 217794 298042 152736 107387 197360 224935 -93137 234538 356132 110455 24115
17511 -74240 39476 328120 345167 249813 93005 -115950 99455 -95243 31053 -138092 -63943
17499 164951 89452 265107 209795 -151201 -209240 169840 -20906 217551 410180 377497
17489 377497 -52238 141518 261907 80221 34045 259763 69049 -204379 131731 179693
17479 179693 273165 228219 -95783 255485 -17812 101286 289489 -251685 39644 227879
17469 227879 133728 307011 -286870 318281 -38541 -204947 -22779 528857 -13431 -211464
17459 -211464 257833 194085 238911 408354 256337 165341 288344 387031 407513 225523
17449 225523 295263 375411 343348 209771 207562 -87635 -176504 217533 96239 279728 323141
17438 323141 614579 72647 47440 374131 321608 179122 26662 247610 82834 112294 253766
17427 253766 9463 151087 28429 119003 212541 214406 158466 342159 265854 295957 348444
17416 348444 564605 138705 147048 430123 160548 274503 -154397 -54173 -162966 13497
17405 198446 67463 251827 164605 -50230 118133 94222 190491 315348 207802 274904 264715
17394 264715 103368 210681 268715 7628 544638 24382 313850 171790 58814 351753
17384 351753 304072 86085 43200 132777 271031 54408 98586 -296111 124340 240521 146565
17373 146565 82650 175636 -100176 11549 -24399 313175 -310377 168522 281414 245565
17363 245565 165033 81177 239269 114114 -13280 475216 -10733 -30529 -297966 338935
17352 187287 -6525 334604 -108011 84211 341695 -343719 135055 21962 469895 131275
17341 85625 163601 254164 313671 -9742 -21601 -46358 393515 134489 -74323 69660 125671
17330 125671 234526 206822 189321 -90405 -30314 66631 164368 304549 225335 -175902 72773
17318 498111 -22069 113053 56289 47310 35033 -194555 -5392 176611 132214 94239 73033
17307 73033 -273785 291094 176023 31137 -17949 335398 134393 151188 58110 311795
17297 311795 16102 182779 58766 175773 87428 78304 167995 -100290 -91 292072 331233
17286 331233 -217158 315480 -363302 103129 -9692 412293 588261 128745 231014 61811
17275 231506 70779 387565 134037 40361 167600 191476 380476 -86875 235596 315835
17265 315835 -34527 235079 -2166 224838 471855 256756 324823 341502 74053 272186 58007
17253 298453 447193 -141860 226794 245611 174267 48439 -81898 305487 10660 380494
17243 380494 154005 354536 78285 216618 237331 29734 269201 215116 -155585 341556
17232 81390 -41971 165853 -85100 332785 91016 229584 80409 125121 310916 140012 274764
17221 274764 -88217 -167789 466703 199386 492801 212960 125614 162835 567932 259660
17210 272719 389943 319685 322874 353738 378627 353012 140192 -30633 240385 17540 299478
17199 299478 72719 164073 148122 136074 246240 157533 179607 310475 759435 634642 149670
17187 -64497 364576 200011 314351 5399 245153 -49516 185183 275379 220451 317595 174730
17176 174730 278969 24114 26004 296241 437598 352931 302908 303112 105453 314236 414727
17165 414727 276225 422920 424607 229935 -17004 201888 401420 256942 139506 490586
17155 490586 205719 259736 412163 -79792 508721 589685 93248 114123 536175 220033
17144 467264 114446 41165 471079 282194 292185 656315 195312 334686 260451 262448 403751
17133 403751 439181 559133 301211 173888 489085 439428 271149 196101 265350 215319
17123 215319 219154 284788 473626 50640 341926 182086 -157231 152022 -12398 496202
17112 529908 106076 520926 165330 163228 195299 261949 575131 456922 621306 405819
17102 405819 235293 466034 448937 483017 463477 260276 691237 334045 586133 556064
17092 556064 423496 456335 389498 287803 300462 563244 196144 420116 440418 328394
17082 328394 361934 429926 290786 322872 365477 836608 585037 882573 280095 588709
17072 588709 750193 522339 766465 268113 413358 232560 290014 676516 273236 227060
17062 227060 611904 302543 25754 512349 661215 625715 495242 368228 378795 278019
17052 278019 405167 434105 535585 784868 494708 623578 504136 387003 676097 669623
17042 669623 300070 668156 706870 643194 315351 477264 387785 933371 754973 526393
17032 526393 426271 600136 692956 493144 672871 695147 508429 610258 503298 491504
17022 491504 485140 497433 755714 492165 417964 482192 745346 771777 826147 859755 690944
17011 690944 837208 513213 542869 674476 626874 646311 973713 483042 722555 919970
17001 919970 816068 703722 659967 965335 435392 790885 618309 786356 764051 651700
16991 651700 808392 842989 865509 820351 611222 803059 709372 813358 627627 748230
16981 748230 943661 776472 887399 854567 937285 1063642 761379 643625 755347 660036
16971 660036 934153 740371 1110833 692160 778678 924180 747982 1055496 760878 1116553
16961 1116553 1095264 907903 1027133 881951 982349 849385 1085157 1051486 1056484 1030642
16951 1030642 978762 1041401 1006978 800181 1180279 1248758 986507 1387040 1359685 1039659
16941 1039659 999788 1213219 732448 1088370 1230588 1258154 1160142 1276115 1316407 1467494
16931 1467494 1418250 1353735 1278522 1293670 1721939 1294904 1690593 1182045 1047953 1558122
16921 1558122 1225936 1561907 1023492 1545356 1431963 1383395 1284977 1476182 1888705 1509786
16911 1509786 1603079 1464468 1816621 1371641 1477351 1585321 1508396 1730190 1518773 1943800
16901 1943800 1762642 1539539 1836145 2209882 1785872 1927473 1961103 1259796 1874950 1784918
16891 1784918 1957160 1613679 2082103 2066333 2020127 1937671 1936327 2077720 2183661 2173397
16881 2173397 2065170 1929725 2464838 2204616 2094770 2150120 2428661 2218237 2560985 2540798
16871 2540798 2760253 2563300 2460113 2802116 2458486 2801887 2714746 2698040 2285455 2701897
16861 2701897 2530966 2761947 2586809 2952563 3131420 2847192 3092698 3278356 3153115
16852 3153115 3173556 3203348 2651826 3125127 3511935 3614085 3564474 3449392 3357461 3307101
16842 3307101 3618903 3704386 3863421 3546957 3793085 3916428 4017234 3787670 4170977 3843345
16832 3843345 4308779 4663274 4778229 4603807 4551406 4967040 4915196 4881227 4875666 4771453
16822 4771453 5014137 5280169 5761768 5169460 5668192 5633695 5822452 5899301 6116308 6458564
16812 6458564 6251519 6349840 6379223 6473366 7470128 7005618 7212235 7384838 7414762 7837480
16802 7837480 7991506 8090847 8372621 8637538 8916075 8771138 9046779 9100260 9595339 9793166
16792 9793166 10274044 10418514 10451595 11214759 11046667 11464631 12032452 12033408 12576619 12848253
16782 12848253 13018007 13816625 13875920 14649418 14972677 15879810 15955125 16306916 17384041
16773 17384041 17811496 18172162 18769544 19416834 20211293 20981114 21749354 22532315 23320622
16764 23320622 24068233 25541177 26828822 27757580 28957614 30049691 31056274 32432554
16756 32432554 34250727 36181271 37632558 39514435 41494437 43606697 45575646 48340167
16748 48340167 50861114 53451243 56273599 59964589 63343682 66652794 70710678 75129608
16740 75129608 79830230 84571964 89802468 95694624 101573665 108136900 114847576 122070670
16732 122070670 130001332 137267157 145611047 153790568 161934274 169890804 177622161 184950923
16724 184950923 191291195 196613624 200562829 203792059 205344831 205627102 204014781 201181958
16716 201181958 197269860 191600240 185177907 178143033 170209133 162330662 154128708 145487019
16708 145487019 137481628 129566327 121822780 114221454 107265414 100962472 94720351 89080563
16700 89080563 83456779 78643250 74174850 69711010 65557795 61764866 58357836 55438118
16692 55438118 52089599 49167936 46584268 44388878 42172576 40214377 38216317 36028278
16684 36028278 34743945 32695303 30965283 29925402 28603886 27527326 26170393 25096399
16676 25096399 24153311 22923125 21987972 21098291 20339661 19391851 19136083 18235544 17616390
16667 17616390 16922112 16327506 15740200 15267533 14514962 14084089 13634281 13488819 12867391
16658 12867391 12486719 12081413 11429926 11076805 10993279 10693473 10413956 10095772 9820527
16649 9820527 9850196 9393030 8849520 8629286 8398333 8237405 7857651 7740700 7524344 7290929
16639 7290929 7263278 7167492 6926990 6679018 6423071 6640893 5885366 6100432 6204376 5653441
16629 5653441 5904738 5808406 5640000 5383646 5473572 5139455 5053867 5007624 4754521 4550283
16619 4550283 4585602 4327247 4540537 4622342 4559804 4291662 4172669 4297466 4256962 3925232
16609 3925232 3662217 3616266 3585789 3859728 3241867 3674185 3641126 3308477 3473295 3659546
16599 3659546 3145548 3359721 3352960 3077785 2973637 2672618 2946265 2837915 2915617 2965172
16589 2965172 2513895 2746839 3106156 2545476 2747452 2566551 2431169 2584449 2388044
16580 2388044 2269289 2250787 2245046 2179016 2237572 1777524 2044755 2169257 2065994 1912944
16570 1912944 1947963 2087674 1772940 2104504 1884256 2243631 1677405 1738683 1806032 1782654
16560 1782654 1673565 1575394 1841218 1477330 1475454 1860322 1638347 1551035 1576938 1457806
16550 1457806 1186397 1510369 1455719 1419282 1585611 1414193 1271762 1717617 1068460 1353693
16540 1353693 1451567 970488 1312895 957193 822409 1059702 950754 1225500 1194402 1073108
16530 1073108 1303107 1112546 1171611 1493307 930273 1160777 840641 1050607 1074363 1024730
16520 1024730 1273119 872250 1292033 966395 1245894 1188435 1010595 872836 705149 864226
16510 864226 1045574 1206343 1028418 685661 455678 1067844 952129 1046350 424653 956114
16500 956114 898722 950542 521565 867790 724771 595437 540086 570076 1041928 1233213
16490 1233213 951686 1047117 910117 517214 515961 631932 945300 639618 512047 652283
16480 652283 574130 729446 696819 750443 882477 744019 826862 540886 460404 803685
16470 803685 685280 633969 571257 1020008 632225 536433 605834 552816 321591 380099 492783
16459 492783 668222 691924 310914 649103 735051 743314 639610 551328 388801 739426
16449 739426 603682 636664 498475 402947 341800 330788 451803 705843 248036 254189 503406
16438 503406 346524 638961 386726 535452 536766 479538 436294 187357 490512 316559
16428 316559 545385 516406 590617 576418 510643 558213 -26896 327036 406576 317949 259577
16417 259577 464806 604290 489915 573310 328798 240335 517963 640646 94172 45054
16406 201439 664452 332448 194321 356267 190469 517233 401471 215242 289395 254536
16396 254536 386707 195828 587018 564625 285213 546838 202197 431177 189927 694450
16386 694450 -29701 352923 -3567 505506 336131 321353 400905 361089 198695 157376 500346
16375 500346 457082 32298 296895 337446 95066 386261 186593 145832 448667 319232
16365 319232 218732 89370 162193 233705 369361 406242 451605 581082 479633 449008 250471
16354 250471 534816 271399 466440 124481 292286 402851 189596 171745 344153 -57438
16343 251780 158272 -74412 379367 315128 469436 427371 264779 488336 167949 563554
16333 563554 245164 100619 213714 116338 253989 200074 70473 122124 -29220 118077
16322 338383 -119012 546315 -3783 -104132 202686 93322 94363 126600 154068 376720 315238
16311 315238 386996 324935 185103 -128039 166069 -115108 66046 -221453 -265302 210143
16300 -249962 257361 158692 -253247 300094 27097 45871 205344 480904 595509 280920
16289 -160280 258145 197532 58075 207421 196563 359033 196463 107169 -129368 140005
16278 181690 92775 264913 47281 -133516 123054 191095 -42180 357934 -5565 -47962 324618
16266 70638 -50936 75583 54603 29554 -454012 118927 -171552 364441 140482 -32954 140680
16254 116693 -141909 164714 242732 -91330 212198 376842 13104 67222 -92589 62712 549425
16243 549425 -148807 290973 -51353 126024 685263 -28218 46720 149126 167300 216394
16233 216394 52163 217344 20832 281617 9958 152729 45224 54202 287644 -168764 -161519
16222 -161519 -134298 36101 222271 -147851 210055 90097 60966 87587 258505 -164586
16211 -52137 -178114 -122473 303270 -29948 173802 -63468 -35597 83224 101606 163269 -488989
16199 192203 -74097 -86006 233674 97931 393369 81756 100848 72705 369167 196632 105059
16188 105059 -133476 14038 -4490 149529 168631 -41063 -349965 241971 304605 -149112 53384
16176 129794 -19972 -133934 -119 55523 114599 34601 -65547 -60399 45780 34609 53377 -97971
16163 -148595 -275055 214660 -146493 -189313 -112396 290710 -33358 -57051 47186 -129789
16152 -21385 144709 -133452 264782 101891 -26648 175387 -122496 208583 223376 -117130
16141 -202461 -204274 -125581 -11317 -131834 -106609 124105 -28780 -143201 69920 -67402 143396
16129 -27838 -188996 -150542 -291266 -20713 106957 -18547 264658 -5608 -33303 -24405 -63164
16118 -63164 -30451 57782 221849 -373348 -38838 -221806 131032 32052 115544 174487 204582
16107 204582 51698 93682 66362 76721 -187855 -51397 -258299 -144788 273591 46480 -94472
16095 281786 -32530 -122270 3568 178430 -95173 116447 192261 -28943 -33523 -176063 -173213
16084 -173213 -139753 -389121 -4816 203853 -192562 -134767 64411 10620 115488 6523 86832
16073 86832 -164947 -37582 -32000 -14195 21388 -537 248923 -45429 174099 39419 -9765 -48750
16061 -48750 18964 169214 -106589 137022 -13502 -185894 118122 28070 15388 -61526 49599
16049 -235626 252895 124140 -31787 239819 -90488 230880 -59439 -215847 130285 -79534
16038 -387988 29338 -253123 -42036 -96339 -24572 64884 -160223 -1937 -238713 27365 -743796
16026 15880 29115 245690 -152367 95953 -438893 -114058 132592 -241041 -176429 -272365
16016 -272365 -285699 -12026 -329565 -338168 233805 -142488 218570 111314 -50369 -86637 -49695
16005 -49695 229075 207807 -338491 276155 186192 -293625 -221499 -237919 -133447 299544
15994 111408 46096 -195734 -135074 85267 -50809 -80837 -245002 186601 37253 95634 -139110
15982 241799 194356 57407 449690 18990 435914 14472 -197624 -101295 -66720 126620 95386
15971 95386 86586 277665 85352 139817 -172197 -45938 231235 113540 112642 -38710 -87024
15960 -87024 -123612 137832 -64063 48076 28319 71289 966 -163818 -6933 24962 -263481 -9874
15947 56628 -207 -256946 -150459 -81401 12998 -416393 240724 216274 -65924 59820 -29005
15935 -139132 -178518 44939 62640 -155710 16654 172858 -194037 -192053 157575 -37351 170369
15923 -48151 -353030 433794 157108 354750 -204211 9654 -77669 -315804 30744 -462129
15912 267215 -92659 61795 -1106 -335826 -139122 174956 169179 -259558 208677 -364078 74195
15900 -134774 98593 -296705 77668 -264293 297790 60614 -262181 -169256 -103889 -60722 316747
15888 185754 81532 -188975 39822 -224147 225627 47560 67188 -181688 2724 132697 -44376
15876 220807 -220177 95104 -17622 -189170 -84889 -233438 -255669 -265077 232599 188319 -298079
15864 -216506 87034 -124000 -328618 157420 -14859 18244 66778 -202049 -131298 -172710 -90066
15853 -90066 112672 -38490 -66474 -64299 345255 -345365 -89988 -112706 -142821 6288 99689
15842 99689 165590 36213 -99665 151718 -114278 -15875 -291339 -28578 -39448 -32399 29723
15830 -216364 269301 -246608 156074 -3591 132494 192430 -141423 -284421 -298704 85190
15819 -245624 301303 291441 -178026 -331312 -372118 -253948 55227 -34563 -6008 -74814 -13207
15807 -240136 -240374 -8128 -128041 -257260 145494 -58425 78141 165620 103524 42441 -25404
15795 56513 148578 -35060 5778 -83203 -235329 213737 21338 -271279 119115 -85691 59564
15783 -202825 -19112 65478 -33675 -300737 -92606 97094 -21462 76273 -398135 -54000 145056
15771 -30910 57945 -120473 -75320 139762 270205 102186 -283369 94664 -217214 -120075
15761 -120075 -87775 4846 313114 -293816 -44256 243666 77700 197749 120127 -22889 -29665
15750 -29665 57921 -371858 34906 123852 -62263 227059 -85244 64696 188451 -186308 -73192
15738 49175 -53396 -122911 39614 -168540 -98111 -216880 76107 -116700 32401 -22508 16334
15726 -68549 158274 -422157 72808 -444407 103180 104132 -191695 -274797 -443410 548 -350207
15714 69675 -128909 -70240 127748 -197336 337188 -7895 -164784 -31192 -114576 -154058 -149295
15703 -149295 122234 2116 244106 -218283 346965 117378 11847 -89823 -44360 85259 29779
15691 -20863 -120028 241250 191775 113978 -221456 75414 -415978 -283623 -78576 232495 -203414
15679 86554 25885 3731 -70820 -11749 192857 -13284 -149986 100644 -70410 -130930 118287
15667 25671 52857 12649 156235 139868 -14068 22546 27427 -185376 -5739 -109833 -13004
15655 162920 112311 10899 -99062 229555 146810 -160080 -67088 -20398 114999 23241 97474
15644 97474 235242 -14252 -104195 30281 -57748 46817 135264 3503 -281801 -184504 56640
15632 114783 75415 61963 -178880 -86038 -285827 -35596 -160306 -137606 39889 47797 260475
15621 260475 279159 -133417 -65090 -168617 -93569 -61751 -60026 53139 -53888 -357730 -286561
15610 -286561 -74061 -80061 -183359 23646 10554 -200529 41102 -185192 -90967 133969 85702
15599 85702 47568 29059 -84881 287194 -477313 -351678 -208178 -178736 44297 -98376 -354394
15588 -354394 -243643 24450 16687 46775 70820 -32047 -63838 186415 133402 -283273 -122354
15576 -160634 -214577 20581 -237288 -416695 31652 289717 243066 15147 87952 -100087 361613
15564 -206530 84251 98462 53127 64660 -61878 -52449 216868 -248974 14368 140268 44961
15552 116896 104365 -33575 252337 34367 436772 -285023 -29066 -115839 270983 -203928
15541 24861 -85012 -113658 25848 138447 -46572 34440 -34273 68210 112319 -121165 -517229
15530 -517229 164871 59328 -80271 -165610 207936 -260828 178857 59690 186603 -102234
15519 -173114 47506 -81200 188533 -182893 -163710 -328524 87840 -192842 -46189 -228908
15509 -228908 1945 -210303 100282 -225340 61980 -69663 309441 42757 43308 -16937 -25617
15498 -25617 -42649 -173818 126823 106749 73676 91204 -222359 -298697 -55417 171000 84065
15486 20786 17193 155039 21084 111041 -385525 -173234 -34789 -25917 -114448 190971 -132455
15474 113607 45008 156493 87023 -38691 -316035 211903 -163720 -50675 147654 97913
15464 97913 -83 626 -102354 93353 3097 148149 529564 -207802 161329 138504 -132292 76963
15451 -26972 -37317 -18624 42236 187988 -61189 -75595 139016 -173937 -81375 21583 -230260
15439 -31429 165821 245213 -65412 -14194 109496 -156000 -166450 -19521 -199925 -163199 23984
15427 345904 -29947 2693 -122925 -98963 -24821 36740 6340 484423 348373 -71095 -222955
15416 -222955 -11099 219099 234176 -25155 62719 239542 109739 -33968 385528 -47921 -60491
15405 -60491 -66119 28234 -166507 67650 -88555 28426 -74676 359565 -225570 -249340 -8985
15393 -222950 208777 105164 -95183 -29982 8104 -225584 21928 -214744 61258 202310 101430
15382 101430 232905 -258988 137693 17340 -513490 118409 -250639 -28730 29363 -82653
15371 11804 63873 -264075 -80076 -122539 -54584 -244216 -63189 99723 49305 -1142 -146677
15360 -146677 -39503 -108463 -153836 159203 -196873 1806 188687 128316 245826 123021 33098
15348 -151232 -42133 228361 236998 104629 211877 -238477 -128506 48833 384755 22154
15337 103842 -106460 144813 113773 -210884 297 -175028 -211667 241818 -99459 126803 2996
15325 17781 -169404 262407 180223 -227734 -188818 135991 -194211 -67636 70790 50475 2208
15313 188643 -52234 279221 -40770 -12538 -42376 -113377 -254370 60832 -20275 -134464 284771
15301 -2925 -22754 -107550 -131989 -68765 149521 41263 -216314 91189 -62035 136360 199452
15290 199452 -55240 114281 320768 -9880 -9503 -21740 306979 40628 205758 135175 -136531
15278 17090 163328 28256 192943 12873 7805 -30608 -41406 -21089 263314 108651 238839
15267 238839 -175059 -155520 -75153 -154000 130506 -28144 -155480 319654 45969 234208
15257 234208 -98454 -16581 231366 43757 107584 60692 736520 306595 318765 1335924
15247 1335924 1093374 737267 1504105 850459 401303 -61844 56326 28042 -5216 299845
15236 58798 -118688 103253 -59204 -186689 -330083 69650 59902 169483 111511 -191824 127808
15224 109544 -41696 209691 -116680 -128094 337486 -112204 278400 132644 -202557 -259455
15214 -259455 -123313 -98130 -133808 -149316 -310501 -156643 369073 -257195 114148 316214
15204 316214 65062 -133708 -92066 537843 55493 27022 48579 101436 -341850 205595 98458
15192 399332 -34298 -57214 129836 203184 172886 -95050 -197000 215695 110101 11145 -77117
15180 -194223 80532 118311 117721 141388 50536 -254787 -62622 -36527 -97267 278198 313354
15169 313354 236925 426615 -71957 -554 -159118 70180 -228807 169359 299456 255231 176713
15158 176713 195956 226872 355566 34798 224565 -23294 177707 -24976 326993 -106417
15147 202778 133736 511432 -237210 11289 102621 235322 55057 84530 59543 55304 201038
15136 201038 22643 271887 179205 -36405 378167 140098 100214 -218447 314508 116852
15125 388190 177022 -236903 314161 127408 126902 176034 287068 95165 6302 16115 -25002
15113 -33860 183169 251736 42845 -95654 -49442 118613 500649 40786 144885 319092 153049
15101 -4122 10433 -1661 -150002 119156 153099 42066 -35362 123706 119785 151627 -30586 -139429
15089 -139429 160926 246319 110537 -127984 223781 -30649 -86902 435022 -237061 -117317
15078 -45993 212299 45555 -13680 235849 282950 396490 313553 237703 215077 45986 112580
15067 112580 -64580 -26394 115580 22487 514177 249538 463121 38668 -151180 392755
15056 43757 162782 -21429 393834 -45686 106840 64707 231100 98641 304150 -143979
15045 89714 166379 168937 432898 130163 -383950 207563 -62897 166307 218342 88557 112602
15034 112602 252213 112574 262399 253279 190405 137973 -107067 43036 184727 41920 199236
15023 199236 -83255 391971 375880 43868 -42835 96697 341501 373518 17261 -22440 174645
15011 117533 519219 170757 185992 -307270 127522 225904 16465 351452 205939 61014
15000 659338 13178 369224 8512 118301 -103992 224937 332695 441742 526850 399748
14990 399748 376096 3024 205579 121704 147921 209029 134049 472230 141398 -114937 362491
14978 96946 179937 299457 33984 246158 252093 101622 236633 243965 431186 332393 253795
14967 253795 109989 509168 515463 328935 417738 349540 523727 390230 416077 190682
14956 292048 96360 260413 162924 41844 78418 205916 124159 -38734 346909 471082 269930
14945 269930 341058 392672 176120 307608 91309 266186 28352 258976 239506 399283
14935 399283 111681 347514 365800 105424 231142 508734 171647 231351 397041 304978
14925 304978 348472 104771 140416 438103 395435 418511 503355 204490 219343 389565 389473
14914 389473 299263 229568 340954 183159 493406 355084 193887 77557 183474 256958
14904 256958 586217 329975 19417 392358 532112 201028 481447 341992 259230 228393
14894 228393 352709 77609 284420 356739 64243 264581 498449 593575 405987 450406
14884 450406 83612 376501 176492 190212 127462 486328 357261 264697 358035 249669
14874 249669 237528 277677 394464 449786 239498 250751 88538 311470 347693 579684 600553
14863 600553 857376 372096 298964 179703 422839 189584 357144 320824 212819 344946
14853 344946 436314 377517 422661 649593 79378 419869 220428 664193 579072 532162 301662
14842 301662 578721 483037 279115 545261 421350 381980 595646 381240 567114 756122
14832 756122 342569 544630 469528 490649 381798 576847 137152 658760 298330 449370
14822 449370 677782 188317 591009 548943 578007 477173 769102 725879 353273 506009
14812 506009 232171 303140 339290 863564 311899 659486 650252 503250 505509 525623 550790
14801 550790 495277 400486 384518 285001 627583 658161 269410 881010 465772 421357 594860
14790 594860 463249 457902 681999 566724 253254 217614 786001 593318 552897 729433
14780 729433 604785 555879 649995 757280 554253 366584 192537 637064 417153 601329
14770 601329 579925 529892 757653 403175 408546 604622 630706 782863 422065 423598 558151
14759 558151 647831 624613 721073 323147 612501 841240 586448 551393 682272 434512
14749 434512 682421 866370 718528 792737 775687 534674 782406 533877 800284 757458
14739 757458 961311 714838 923845 1177413 706086 654151 788593 794331 949584 643517
14729 643517 790912 1002876 635817 796576 715833 1036941 815251 869860 993292 891240
14719 891240 762863 473374 956637 653378 916516 693451 1077669 908210 669209 791710
14709 791710 709879 897968 801862 590369 743162 939835 837611 890638 1096043 917195
14699 917195 948030 1031518 987458 622235 704698 962620 1241983 811663 988291 1248721
14689 1248721 1175132 1212026 1330305 796415 883287 1065279 939225 1281074 989017 1086773
14679 1086773 1015705 1073795 1290680 706051 1106741 1427967 1009911 899335 912859 925574
14669 925574 1002915 1097538 807635 935473 855847 1303863 1094404 1190166 793905 1016960
14659 1016960 947679 1021854 993061 1154674 1105825 1369024 1328479 850536 1127603 1417372
14649 1417372 1428160 1110343 1234536 1159160 1083872 1531887 1257583 1522278 1050825 1311853
14639 1311853 1490789 1317363 1589188 1306069 1346710 1488196 1448771 1216457 1470542 1000130
14629 1000130 1513934 1435398 1614351 1337805 1508186 1222362 1643413 1245618 1571032 1428980
14619 1428980 1337293 1603505 1720690 1644433 1136624 1423493 1624489 1755074 1873445 1795333
14609 1795333 1559751 1597361 1647560 1594674 1550473 1660806 1546641 1875767 1671946 1660163
14599 1660163 1817952 1679819 1577794 1836052 2111029 1833764 1813585 1817956 1896593 1779315
14589 1779315 1812444 1782662 1909724 2125302 1910714 1924578 2132736 2116892 1882374 1764360
14579 1764360 2225260 2375623 1926078 2071885 2080004 2392641 2323703 2146622 2075248 2408976
14569 2408976 2381128 2434110 2543984 2758163 2398355 2585274 2431564 2443603 2863510 2832127
14559 2832127 3153946 3109070 2772797 3027052 3678871 3422388 4284992 4203949 5035126 5868502
14549 5868502 8341912 12696900 21863538 41321858 45177597 22626717 8879933 4546489
14541 4546489 2949587 2367408 2057260 2034078 1904571 1959697 1933412 1989762 2219914 1893829
14531 1893829 2009771 2219892 2118153 2461093 2569553 2351089 2403009 2386409 2252853 2402077
14521 2402077 2415709 2483398 2612039 2681802 2442880 2375947 2716581 2830189 2545779 2691806
14511 2691806 3132892 2801458 2784870 2871051 3061733 3176996 3090726 2835034 3333531 2918001
14501 2918001 3286848 3173543 3506969 3061170 3335346 3252611 3549956 3455225 3519121 3211559
14491 3211559 3598084 3653914 3450687 3539935 3616505 3556081 3601516 4031557 4150959 4053594
14481 4053594 3884336 4060749 4256193 4503735 4467208 4400358 4037724 4395892 4440308 4108512
14471 4108512 4423104 4220488 4631875 4884447 4704474 4718375 4960707 4951091 4884911 4957440
14461 4957440 4952457 5584126 5412561 5453960 5239344 5465273 5621705 5536501 5470861 5773637
14451 5773637 5384932 5869808 5462604 6103896 5986472 6196947 5735538 6229355 6051440
14442 6051440 5937805 6321912 6399151 6643877 6347999 6768016 6747150 6896922 6814580 7122636
14432 7122636 7017562 7219259 7128446 7372629 7579852 7279990 7644507 7592205 7874875 8004475
14422 8004475 7973655 8229852 8160887 8173902 8096583 8664101 8298781 8651746 8875456 9219781
14412 9219781 9163957 9262037 9234387 9655319 9440563 9824469 9718529 10086193 10212725 10592544
14402 10592544 10588543 10915915 10842994 11296161 11001119 11204396 11675221 11835887 11925413 12153655
14392 12153655 12184324 12508657 12801384 12965973 13039146 13341637 13740243 14139315 14076519 14489433
14382 14489433 14950784 14973112 15341178 15848093 15780301 16148439 16295365 16928349 17130682 17411208
14372 17411208 17708688 18169841 18785684 19140596 19405152 19562374 19865406 20675310 20984607
14363 20984607 21417511 21898576 22211880 22713557 23474578 23984357 24278393 24985610 25403879
14354 25403879 25965157 26770716 27100648 27918618 28537270 29196329 30123295 30407137 31398448
14345 31398448 32041990 33481983 34213679 34850819 35780180 36832781 37840020 38823937 39709294
14336 39709294 40783041 42329251 43268781 44632173 46037213 47178550 49050004 50036277
14328 50036277 51872326 53297738 55086597 56692966 58635291 60679234 62848060 64808391
14320 64808391 67358190 69716684 72439171 74932720 77532048 80293791 83579163 86793315
14312 86793315 90114165 93796327 97437155 101838489 105861632 110486798 115310211 120314267
14304 120314267 125363758 131147507 137064018 143503899 150039674 157601452 165143619 173040090
14296 173040090 181612761 190575966 199994520 210511715 220800044 232148410 243486411
14289 243486411 255888614 268861512 282030211 295882463 310104144 324592598 339562350
14282 339562350 354923405 369928597 384840690 399113656 413047417 425948716 437346146
14275 437346146 447265562 454886150 458967062 460936323 461581994 462202446 461537446 459997949
14267 459997949 457147849 450529413 441903417 431547007 419581837 406441002 392361053
14260 392361053 377469385 362379089 347133988 331682640 316332258 302423251 289096575
14253 289096575 275110359 261894013 248844645 236856316 225415427 214730582 204467411
14246 204467411 194300861 185217097 176785121 168594658 160561674 153194869 146516526 139738326
14238 139738326 133749001 128288507 122842833 117103261 112477758 107885773 103631248 99885683
14230 99885683 95751378 91818517 88339529 84910281 81627475 78560386 75728146 73100298
14222 73100298 70562948 67988247 65904723 63392938 61228600 59211673 57426683 55743201
14214 55743201 54146439 52643562 50852366 49134496 47554728 46202572 44911217 44127079
14206 44127079 42804411 41528246 40185876 38897194 37965891 36835973 36539929 35484661
14198 35484661 34432297 33342224 32423982 31816730 31091558 30082672 29619768 28691289 27788663
14189 27788663 27207741 26883274 26249960 25355207 24904806 24539756 23874750 23291750 22606662
14180 22606662 22550181 21652877 21666927 20631516 20626534 20018527 19810844 19279477 18857202 18796529
14170 18796529 18182375 17988478 17486444 17234255 16862254 16649477 16434518 16182846 15819280
14161 15819280 15541367 15198839 14985980 14540787 14317275 14404383 13888321 13726468 13430698
14152 13430698 13350845 12841316 12735486 12847397 12634459 12129908 11865659 12014731 11701397
14143 11701397 11322910 11139106 11255550 10841066 10936699 10788762 10640485 9921435 10034607
14134 10034607 10142610 9817100 9452372 9598022 9110837 8807530 9371447 8843774 8884933
14125 8884933 8744398 8820034 8649612 8445440 8214946 8021928 7778109 8116044 7903972 7891600
14115 7891600 7610685 7568033 7591564 7346369 7376487 7006784 7263477 6986994 7044302 6659326
14105 6659326 6597927 6893920 6654365 6514278 6285790 6274093 6364996 5821382 5970055 6101792
14095 6101792 5779789 5975369 5494568 5653097 5537251 5687704 5744956 5535320 5374216 5551656
14085 5551656 5045578 5183498 5158656 5067916 5136876 4954516 4431429 4880599 4549351 4927469
14075 4927469 4786134 4587702 4688515 4671504 4524053 4449109 4572884 4015858 4257957 4514619
14065 4514619 4466837 4410450 4211172 4177681 4027527 4244530 4113273 4356146 4056424 4212155
14055 4212155 4453825 4084488 3425614 3762523 4037507 3651150 3790083 3914844 4038087
14046 4038087 3854674 3867396 3817066 3408445 3563438 3214305 3426109 3590413 3262612 3295348
14036 3295348 3436204 3795858 3011892 3283446 3446421 3004337 3246866 3206934 3302639 3261167
14026 3261167 3000810 3069769 3045806 2691866 2750320 2704857 2816213 2939419 2799702 2753636
14016 2753636 2839624 2697197 2556938 2467859 2710219 2330619 2402231 2584596 2473621 2620025
14006 2620025 2505906 2264246 2484767 2340312 2406147 2083554 2404002 2395197 1912534 2157142
13996 2157142 2136581 2336565 1937933 2161405 2375722 2313440 3046540 4211909 7267599
13987 7267599 14764654 34326981 47558070 26512509 13064692 8011416 5987395 4785390
13979 4785390 4167475 3947287 3613574 3581454 2915769 2663246 2857530 2571175 2730007 2605297
13969 2605297 2707599 2478631 2545196 2377170 2267251 2308996 2233815 2250130 2330274 2272647
13959 2272647 2207918 2110106 2082289 2105536 2090036 1909777 1904918 2204680 1855429 2240715 1909140
13948 1909140 1919908 1817362 1971232 1817019 1952346 1708676 2035744 1716655 1863019 1891157
13938 1891157 1757459 1708971 1694776 1911782 1500803 1652258 1599380 1861958 1650923 1947495
13928 1947495 1637016 1700872 1588409 1704098 1508950 1510974 1362882 1431527 1749414 1481054
13918 1481054 1401035 1561186 1563062 1444710 1496633 1374798 1486038 1455090 1580809 1553787
13908 1553787 1259449 1646103 1435269 1663704 1418844 1477304 1682772 1370260 1318107 1477230
13898 1477230 1182371 1604179 1349543 1510921 1291590 1542498 1371501 1480258 1371280
13889 1371280 1666471 1155725 1209129 1662381 918875 1505348 1220574 1129037 1168099 1467991
13879 1467991 1365036 1324648 1267235 1275141 1039147 1214504 1224347 879322 1352452 1007790
13869 1007790 1206800 993147 1103485 938881 1122039 1237101 1378681 1589904 1346510
13860 1346510 1091720 1001532 1202924 1118989 1045186 967589 978249 944141 907990 1087627 1141476
13849 1141476 1165623 815046 1180396 1230251 903654 1124736 1228321 953675 1149367 1042707
13839 1042707 875238 738737 930765 1190655 940535 1155296 1023239 929917 993559 967267
13829 967267 998832 952232 643547 1024023 947746 1101494 957506 1040345 977091 743011
13819 743011 998538 948123 706320 964204 696551 1249877 840473 1225080 872680 817077
13809 817077 1010881 725580 791618 1031581 1215300 1160641 844912 844936 733880 1262760 581969
13797 763846 1122911 996173 879429 601698 1021227 605458 698395 1217076 949875 888706
13787 888706 482294 873828 1137792 914544 737708 893695 789346 957044 886769 766298
13777 766298 621079 824060 640351 937177 819410 1047796 857305 816002 748800 845948
13767 845948 829149 482025 704385 679288 454959 836730 884193 707748 671822 842484
13757 842484 934133 805535 819101 862683 614138 776846 937086 676584 489380 514137
13747 514137 425033 527029 900086 654509 446444 593734 360357 575936 911650 606663
13737 606663 647002 602881 624427 834984 412539 564951 687003 595588 632211 548600 793926
13726 793926 521974 849661 667095 581755 884315 436994 446510 677705 406421 491098
13716 491098 798149 577902 623803 538587 478598 442447 448131 809596 973329 606777 731102
13705 731102 713646 531813 801333 320357 555921 511960 572420 741025 324119 43097
13694 863783 416307 194354 483023 619759 870883 633347 545743 370439 492982 569651
13684 569651 658743 562864 648660 429485 415339 284736 394355 515023 648725 281145
13673 506779 610786 623724 408225 697677 609500 255940 425489 613385 457575 468934
13663 468934 812635 375665 517945 469542 484860 309947 539510 387030 431065 589882
13653 589882 293906 511848 529129 372709 542468 155554 183118 427142 717006 790756
13643 790756 271175 480606 560282 282737 513632 439897 631826 467314 609885 59510
13632 221073 417460 593858 394700 740131 283236 389507 458877 225008 304396 441499
13622 441499 311854 434565 195433 219029 274402 448490 477931 740749 548935 178031
13611 562262 87644 688386 508559 421742 319008 266969 582450 392831 339696 582117
13601 582117 290990 487137 367213 441739 502434 241647 -73913 449334 729594 367422
13591 367422 510570 367822 645415 190731 643233 139528 401479 243851 435619 742710
13581 742710 284967 452145 199786 422431 139762 342299 331713 -50117 428545 542494
13571 542494 141537 263088 285304 295499 319281 178950 341644 218723 308977 209070
13561 209070 456745 510691 438677 311522 573138 -50441 310081 290060 251489 222251 402097
13550 402097 319889 229116 257492 425425 348385 366259 488046 454128 45705 407630 392123
13539 392123 270475 554927 310446 79598 75670 316911 348363 60787 296350 516362
13529 516362 30534 372536 477384 278712 202124 311069 400836 154949 310300 576037
13519 576037 503869 419500 188499 385669 540036 341682 687804 171076 119053 263289
13509 263289 337367 432806 423161 222098 105960 405035 58938 369013 687041 424753
13499 424753 135915 174089 366478 322705 519167 343532 517470 151116 302840 348363
13489 348363 84226 101092 31661 271635 515840 3674 368742 9418 339469 5216 318270
13478 318270 193538 171711 341120 164015 185709 270692 47758 78098 153270 393688 442440
13467 442440 105996 322109 396116 335992 278934 253142 547977 171806 248785 211054 -77951
13455 243517 111730 340283 509175 23923 417131 -30339 116952 35912 236561 295644
13445 295644 236185 206454 -149454 296633 14944 -19622 279172 500053 121873 460572
13435 460572 154636 176522 83450 328249 88302 77495 347717 51175 367693 78879 -50656
13423 391214 268591 264252 236013 88552 147661 290376 565316 533019 265440 255002 221568
13412 221568 196583 121877 -55989 175992 170472 293703 288654 183105 226515 -77342 159257
13400 317932 285835 274858 348877 51130 61874 54681 157844 165038 -124219 -125417 165887
13388 329962 474325 22852 524129 485357 236374 -29561 202602 155825 -97592 257135
13377 187320 187478 46117 54205 -199574 299804 384597 163072 83698 318959 318188 338971 305333
13365 305333 433445 172189 223762 618087 530847 263740 -73036 167739 193968 174670
13355 174670 325348 299253 -466 424378 126247 -204469 424892 -164011 381963 109605
13344 359120 314770 392539 471957 -95762 235160 253826 72394 296439 592225 286988 388654
13333 388654 11382 8288 295896 268928 125963 461858 -2028 287700 40644 66625 461597
13322 461597 2479 177337 252873 198517 305340 -116795 353615 602751 194610 -22380
13311 38751 4467 189742 -47873 -20674 37024 -110722 270004 -93646 63857 -51676 363184
13299 69420 425912 216363 156939 87405 153914 108997 154775 323231 -101692 117200 182521
13288 182521 54754 186065 12938 175082 70115 36963 -77613 279972 192596 397532 123030
13276 177667 90434 -45302 133433 53645 -47680 298513 -76924 -218993 -128632 89622 38970
13264 40651 366424 -16228 212459 73960 168566 139514 51121 12642 185390 23904 -88604
13252 225630 -28796 289163 178305 158826 -55200 126807 279454 100635 551767 79564
13241 280757 64278 30750 176239 -190010 -29295 102408 114683 488178 214794 162247
13231 162247 94616 -257308 -157469 108348 645440 38859 7882 -86993 30579 -75176 301280
13219 569277 346022 93964 196857 -21298 -51168 616 34359 -40838 -210956 1293 254170
13208 254170 79623 71949 278702 -165190 201173 63044 38530 -170463 51172 122821 38240
13196 4279 -51532 143857 74685 212360 239887 -12199 240285 -68550 167361 170991 348217
13185 348217 353589 -192474 181844 -20803 307348 113577 316464 -69537 53542 157314
13175 157314 370587 270110 463999 -217756 -3301 333928 -16358 166566 124694 99942
13165 99942 14870 -37510 -232576 7951 137830 153800 -10506 248450 169149 268273 117713
13153 50365 290179 -31448 106655 315709 -393 103325 74403 -2581 360431 56388 262064
13142 262064 -27249 -128080 37659 112920 174488 -29370 -152203 255371 267908 224571 227369
13131 227369 -110034 -101000 -51840 -6627 -21238 328422 73372 96566 199351 120398 -45227
13119 311068 110217 -118889 184946 -77431 -197513 383817 8471 -121921 -93480 -266520
13109 -266520 308991 -309018 -14388 -67392 113498 -118749 142850 -111909 3935 33968
13099 33968 180194 -173459 243708 57809 -22056 81181 7193 -123224 -98798 -159379 118752
13087 194040 -137837 97386 59640 160443 382986 -116577 33772 136129 209056 118029
13077 118029 -255149 215160 30700 114798 -65154 -11982 -151466 39750 331719 -76129 -267102
13066 -267102 -116399 -40616 118974 73653 -60828 -162596 -152573 34175 86283 -168316 -8362
13054 113342 175292 214096 35323 139029 186321 74890 -57739 166123 75896 60392 54374
13043 54374 197154 58618 -103690 286890 -92295 287087 226592 -66516 68278 189431 301753
13032 301753 188850 378306 143654 144593 8604 261101 277436 -14355 -152668 -125848 -99570
13021 -99570 -89150 -128804 -14360 -38935 3045 -92309 140005 304215 -58342 260607 196025
13010 196025 386232 261622 328249 124911 219941 83866 310990 -164682 93565 115252
13000 115252 145242 -51216 127466 107590 103914 -148560 -201214 -68359 316510 46764 252249
12989 252249 471806 -41318 67349 50000 356499 -12483 216098 177463 149125 70512 133349
12978 133349 -47963 83855 160757 -513534 124545 293775 22831 -94617 -214621 -112562
12968 -112562 -269592 190266 162622 97689 -244786 -57542 238341 83939 -38246 -44735 217320
12956 162656 36993 -58462 -262097 288999 -22200 -5163 -109587 -239209 252436 202929 -188170
12944 4418 246552 278899 -9110 287023 -35642 -114130 169476 126809 -118340 174108 -312754
12932 61638 62879 -126090 -117242 54581 -102205 68640 155471 291020 232907 39588 18819
12920 -103826 -58027 222472 294852 259324 96726 -36625 -35531 20181 -203501 94907 10266
12908 267419 151432 180594 202834 13100 -105394 -150621 209449 94503 -38053 95373 329040
12897 329040 167626 -81220 132441 217713 -51441 115900 236086 146305 36618 349972
12887 349972 211271 128564 -213881 -64021 -122424 62491 40200 -41785 137666 157807 95232
12876 95232 -133144 -9779 7666 -79040 -81860 20788 285853 -258506 53755 -233294 229417
12864 -235116 299338 300792 196523 -168001 106829 -310814 208919 75228 -5494 220439
12853 130792 278064 -80254 -325538 5324 242528 127773 2745 -37653 250917 342911 -218226
12841 -54845 -112353 77257 201719 -120994 84543 29514 -53681 46700 186046 -278781 59428
12829 2526 98862 172255 43478 300167 155497 158591 40979 -98793 4021 95897 128380 162944
12817 162944 -16447 204492 -122524 -18502 -113792 41964 -57584 98154 -32508 143364 24863
12805 106589 -6037 -90061 -106280 30382 -35891 -94906 -30028 -88523 161113 60664 212532
12794 212532 -382655 11005 122283 -78104 252974 45985 -37602 -135463 -289332 26835 -21459
12782 -69668 25776 -12927 -145666 46163 -264145 -204710 -14553 199220 229026 -114498 -98438
12771 -98438 93330 -32139 254090 -10852 152688 152895 40558 -87640 177740 -35477 -9534 -137512
12759 -137512 105330 -154560 257883 -3161 141715 12799 231857 67777 -82459 -247983
12749 -247983 -119718 -66000 -287774 -22939 32089 172983 -68363 469771 380825 237295
12739 237295 91804 25131 225944 47798 373039 655087 288633 108131 73156 -67362
12728 -51894 195036 118291 -30833 142877 -55667 -5653 227688 31554 94900 -4997 -86100
12717 -86100 -242492 -74484 196550 190017 272988 43746 105118 -23111 232199 238306 215348
12706 215348 57423 57934 228276 57220 126168 459940 249370 -55404 -64394 258671 -204037
12694 -36214 -149596 -132142 -205515 -105206 113418 -43107 25199 180964 113988 35161 127428
12683 127428 -34341 -3684 161681 35727 203240 48218 383332 -113258 120831 100497 47369
12671 249183 -194761 289657 53885 24128 66623 344704 175845 -101820 11279 -82322
12660 -81885 -3446 74321 271707 405662 152760 -21849 334867 194584 71237 29616 255072
12649 255072 39122 252401 134389 -455363 88246 -216982 42141 -199625 24996 331279
12639 331279 47947 322170 80905 317801 -3457 -279806 17305 47596 146672 186222 226960
12628 226960 112744 143080 -97210 174375 332445 140750 455342 162616 30411 8431
12617 136739 418457 40617 -78869 -32197 -209927 336436 -148580 50527 38971 -269801
12606 -153562 444325 -50432 150466 206653 6237 136679 96063 281606 283200 392713 394196
12595 394196 -103461 197829 117538 28458 -153375 169821 349245 -173451 -21921 386081
12584 -57178 34123 -119622 -125325 -19052 -25864 -109274 41812 -74540 168194 -35224 300392
12572 174364 101010 50001 117147 9544 15166 -105841 229922 213897 -178364 -317936 69005
12560 821 -61508 76765 84769 -78842 72049 -255823 -57161 1746 288699 200760 -195193 -142278
12548 -142278 -17603 74383 -110813 218353 81681 -99137 -30174 198796 282996 99893 359472
12537 359472 269615 -119444 52517 127262 -104827 -97400 23759 285401 -32717 111472 14443
12525 -36926 273792 -70297 23226 247193 -133746 -787 14944 -180836 -332640 -81200 216371
12513 -63855 287250 65265 103108 -87217 -55994 -194913 -38028 -144783 95938 -376074 -219970
12502 -219970 139951 -134581 -29121 170231 259486 39502 95240 131239 198442 31034 37803
12491 37803 88040 145197 -77196 -466762 -128793 63523 -44467 180182 139704 80597 -207492
12479 -50144 -20900 85797 77434 -78577 7888 66377 -203844 186495 -165506 9819 193307
12468 193307 -32783 83887 18025 -182998 -129026 11544 -36079 -442474 11882 -5181 -91907
12457 -91907 182017 -26748 -58141 -108301 102526 137093 162288 -111754 -284554 -147524 -177576
12446 -177576 -162877 -142543 105629 22079 -56687 -120174 -79767 213437 558 -159477 -241059
12435 -241059 -313608 -64485 75041 100859 47809 -127 -231046 306384 -232926 28826 103521
12424 103521 245724 -130879 8209 48191 -62813 -349562 -324374 -322224 49665 140606 28541
12412 71835 4378 21584 143000 -251937 4626 -318445 99504 187578 8925 107651 -197609
12400 42980 -321057 -33422 -88497 193438 -38064 370577 -92917 -108034 879 156634 260962
12389 260962 -393340 209564 -35471 -180023 -145092 -194037 266216 72313 106571 -58054 -5277
12377 -264356 414766 -63891 -186988 -91865 269084 -477003 -477775 -156269 90376 -208049 -21070
12365 303026 173650 -148874 49026 189967 -130458 -361981 12266 124982 112179 119108
12355 119108 126899 -79292 -24677 214334 243711 165954 -38316 -293290 -72878 -59256 -55621
12344 -55621 325646 -209734 -54002 11788 -15911 -245037 -104908 -11705 -341062 -133810
12333 -153299 172218 -20489 -101019 344129 -257385 -371055 -56134 -135903 -276131 28263
12322 -66564 282518 237627 -62939 -278399 52132 -183589 -144348 66960 -214125 -35918 -66494
12311 -66494 -100232 89983 -12637 130545 -214632 -54712 198593 140742 -160035 73260 -119839
12299 -32648 145512 504348 59499 -50580 -149859 67391 129015 24059 153243 164037 124241
12288 124241 65874 27195 42720 76793 167988 11117 -171382 -166518 126064 63767 110044
12277 110044 118331 144179 24209 88554 323192 153955 243198 -232680 -117748 187928 37501
12265 87934 179690 -74382 31937 36593 88689 182126 4774 -22579 -140971 1084 -374944 188555
12252 135591 158102 202397 130903 -128043 322125 -29742 -1546 -42750 398125 -94831 112702
12240 215085 236001 370678 108311 257013 84579 115284 234929 94783 -22853 183576
12229 309555 40716 -149546 258461 231068 -118503 -132786 213674 -42883 283538 312564
12219 312564 268250 485566 -22318 470729 149181 357517 31222 124051 81009 20189 354258
12208 354258 176232 214057 42390 349145 328211 415148 180452 196328 90387 106156 90980
12197 90980 258396 179478 126086 169802 160799 269804 198733 19320 14990 -42434 14246 111779
12185 111779 54464 201981 230895 106673 12100 -4160 61356 -1599 228636 100712 45055
12173 -113237 287240 138691 163106 235401 -137614 110473 217511 478634 43084 29117
12163 29117 117325 351086 -20933 201980 79910 169056 18337 -178376 -170950 -35189 176895
12151 -100571 -123821 -330653 193494 228573 -11387 219008 149668 -45390 253381 -156961
12140 -32290 121774 -434788 62874 -293709 -16961 161082 157639 -26440 103126 -11870 -28728
12129 -28728 255101 6114 -144144 -61921 219134 408068 181540 807 74470 45161 -85417
12117 -61756 2141 -159596 71186 -128108 135749 214310 -67378 -61661 -100190 62155 -395666
12105 -12571 -92646 -64438 92731 7636 -103682 35200 -221886 271567 -3732 79613 -326231
12093 -167324 -285048 156758 -6423 88635 -239939 252203 46974 -159464 13883 -33013 -145253
12082 -145253 101863 -142260 -180022 -2189 241628 -20345 -458082 -18705 -161356 417969
12071 602489 2190246 1150951 443565 98235 162357 361091 148442 228042 34571 102244
12061 102244 -112376 -116759 -159967 -243752 85192 137146 116974 222641 -237384 -358863 13091
12049 204515 116559 -451143 -73420 140781 133997 -115563 19755 -210640 27386 -60466 -23446
12037 -40230 -4065 11328 -27040 -43375 -148120 57826 -430996 133378 -90775 -170145 144541
12025 546251 7109 -450017 1270 -55382 -181969 83865 -141826 -106365 292774 73492 -54692
12013 129827 86011 139296 97009 -188012 111083 -33746 -41676 94006 -16919 -81503 42939
12001 181690 -382639 63888 -58638 -97757 -173779 124851 130043 41008 173736 181847 -30476
11989 265842 85262 231942 -401286 -54360 -165910 -200541 6524 -321544 206410 -51644 84569
11977 288708 -3952 79026 -222624 45825 168523 111990 -11013 4919 152106 48112 -79627
11965 15934 137052 98697 16533 265497 -37307 317045 -221113 -196561 47414 -81418 -179406
11954 -179406 -23087 242099 -94174 -118987 192415 195115 -193712 200964 -45757 -24111 -246
11942 59556 270331 -232415 30096 183572 -265352 -373556 174379 -158453 253815 -23317
11931 -124628 8019 -43310 -57952 -55963 -268081 -109089 85918 -241497 -233691 203830 202285
11920 202285 -54397 -83014 46361 -45177 -11552 177652 -327517 -37300 -42725 180747 -241101
11908 -143026 248148 54477 53563 -23082 138700 -132032 78143 346335 97674 -224265 -156281
11897 -156281 -243531 59697 -15657 44377 206819 385995 168536 7426 -64920 3581 -333012
11885 22051 -81830 176148 25248 -202241 97222 -92266 -126516 -145902 28432 -36109 -37018 -267778
11873 -267778 116170 12199 -52491 12767 -24092 -30727 -67333 -103951 -84504 -154109 7983 -3319
11860 172108 -180209 148965 -3838 -123585 -53718 -145896 -105853 -303141 27594 26621 145049
11849 145049 36025 -88780 -39746 145505 -114154 -46273 -69576 -168 -248936 19344 201349
11838 201349 -258047 -4688 -105686 -23576 21892 -280419 -182139 4095 -115922 103911 326307
11827 326307 226940 -1499 20568 118907 125235 37057 282234 -23831 -79557 -310590 -2033 -76012
11815 -76012 122707 -308243 -31306 -163315 -108583 -93526 -96172 171184 -160513 262217 -113935
11803 -116670 -5215 -363837 -120604 -224922 14456 93108 -81774 128357 -74533 66849 130962
11792 130962 63349 2403 279935 340116 2135 94421 141402 -190525 -218245 -203467 -74395
11780 101989 -30784 -98541 88616 77447 103701 225216 -86152 22180 24595 107098 204539
11769 204539 -97273 121262 -124072 -138208 59276 125249 -59465 61554 -180956 -23087 138291
11757 -115635 -93141 56161 -127953 160501 -89364 170439 48730 -378634 297982 -267440
11746 -182688 50098 123868 -115384 -96754 216185 -169987 67649 23272 -42912 76375 288527
11735 288527 172688 -138754 172689 -28141 21525 207658 -30757 9318 235909 -60428 10208
11723 -198123 7987 -21359 -460127 320293 207102 383539 -131266 38181 -170845 -41068
11712 426871 39428 187953 -32598 30421 74640 -286218 -93163 -79141 290026 -93872 -223665
11701 -223665 146032 290169 -46702 -180003 128720 193394 -286310 -78931 -49226 199626
11690 344778 326412 11253 178761 114908 -26233 243782 -12037 -6572 195146 109428 -293558
11678 -69191 210845 -168788 -101385 184814 -185210 67558 -65188 28318 -17378 -154009 175620
11666 -263950 237774 102492 -170503 -116423 -22311 -355850 -32819 -108212 -131651 -131730 -111156
11655 -111156 41670 33251 -73676 64240 285677 -214151 185593 172401 -75963 2336 357113
11644 357113 -97837 -172745 126033 260310 -251333 -135551 77627 -76144 143182 135037 91936
11633 91936 -137782 211416 -239426 -224928 145964 -37778 -169411 75974 -22629 273347
11622 10031 497041 242996 -96573 -56840 14351 -168411 -154754 276539 93313 -67847 167437
11610 -143582 -18277 115416 210163 177987 41546 75581 -111044 -201027 -76033 72146 145174
11599 145174 181979 205470 -53921 295159 107253 104637 -70479 -304931 198666 -27953 -50029
11588 -50029 277150 7704 375054 206126 216197 18439 284668 -93023 -239381 106879 -103643
11576 -103899 -88936 -134469 147891 120479 85651 -111251 -83809 233921 158649 -154488 183975
11564 -74498 -92455 -132088 -57269 152129 -232475 274266 314256 194663 218652 22229 -363136
11552 53750 26604 -100181 27425 9034 365307 -289845 138317 -115146 312268 -230931
11541 -127861 21544 164321 10743 173434 -150062 -45627 72152 128413 201971 -262014 -55014
11529 212335 -53833 113063 89365 -153164 -43611 -64270 -20505 351178 291760 -51056 116811
11517 -189312 264659 159395 31373 -87045 42284 273560 17922 -7966 173612 73155 -190730
11505 232622 371380 94109 200425 606641 -398127 -97879 59442 100295 -250563 49659
11494 92003 78211 414375 -196167 157692 95602 -3820 65427 83523 222948 144877 133589
11483 133589 109925 304893 163518 39723 49911 215994 345316 -22072 216609 334293
11473 334293 196649 48726 13986 82571 20840 179956 234561 179406 -132775 71446 -232639
11461 43490 270065 283874 117285 -355471 202466 331614 -121704 34023 52045 437798
11451 437798 -34024 258876 -234725 85748 372753 -182302 385123 103052 -262113 -29618
11440 -127558 -72889 448306 -84418 -44499 -233783 106966 107684 -162911 230883 112236 -156945
11428 143343 54441 -57330 -227279 108846 29381 15821 303574 -116775 -18357 -255385
11418 -255385 343458 -121494 108965 -1346 -188108 -18897 220442 -37833 55118 -248359
11407 254357 346354 63227 165339 241221 86700 -16810 -16285 -114570 39333 228920 -24396
11395 55294 -9763 -120637 104045 148544 30868 -118369 190955 -226576 -152821 164987 -166141
11383 -64840 -91078 -294168 63828 274749 158493 36397 -288843 67623 67077 -307418 -182625
11372 -182625 -39045 152215 -67918 -472123 88540 101009 12139 65973 198858 111682 -122877
11360 -307856 31342 175495 -125746 -7657 -73344 -34678 -218580 -127050 -148898 182283 314393
11349 314393 324136 88945 103362 149992 -10464 138964 -33973 -6252 -17217 -53164 -145707 128523
11336 311109 -111779 96446 -80822 72462 -79676 -68898 149479 -132852 -34235 107553 -131750
11324 116344 271309 29474 -153543 210522 -31236 173183 -270123 -174672 -28332 101244
11313 187214 80872 -73222 -228745 -37473 -37639 -97753 -101296 38572 111625 -159464 152435
11301 107364 13156 17567 205529 -63313 -87483 32862 59906 -22069 -103824 -24874 -84282
11290 -84282 -17292 -77617 -49708 144515 127337 -133722 57957 72318 -102684 155762 141147
11279 141147 14175 124031 -248850 -103320 123820 -35302 439857 -60612 138375 -222445
11268 103912 -179052 -68554 -166432 -19896 132728 -527227 152792 91828 -148946 -135905
11258 -135905 -235132 -138478 -206228 -275009 -242700 -42853 31984 26629 -42366 43351 126663 -155305
11245 -132076 -142176 -13636 32374 52034 114515 -274346 36346 -421476 15047 -147605 -2759
11233 -254694 242122 57866 -51031 -56820 -770 -146359 -31470 -45511 -154233 36182 138408
11222 138408 -170841 180530 109741 -233660 -168022 -100965 -46504 188317 153141 -208458
11211 -27124 264806 -260680 -44541 185646 121232 -17557 -59094 223422 83559 -7691 50999
11199 -63536 -113097 191963 225572 118471 51798 -239557 -318198 311386 -192209 63420 -13763
11187 166568 -122784 -122244 68330 359509 85693 41510 315470 2518 -55815 -145848 38626
11175 -3089 94496 319347 138974 -185966 -155684 -251799 -141995 -464989 -182774 -18275 -16882
11164 -16882 -24798 150093 -168868 -107553 125387 110939 103258 -11353 24662 -59826 -115631
11153 -115631 120853 89462 -306047 -199800 -168332 10225 -121056 -129605 -115635 -24467 -30513
11142 -30513 -242047 -17335 350558 -13376 -4632 -68322 251490 -116266 -269404 95608 30031
11130 -77259 -17956 84629 21569 22220 224131 -101122 -4689 36510 25953 159442 170460 152549
11118 152549 2027 -313028 -20918 313189 100790 264723 80692 13461 286668 -77684 -130163
11107 -130163 88739 -82717 -30677 137172 245860 206217 212237 278859 118062 137530 375232
11096 375232 283137 491615 329713 17001 123090 315126 208863 259995 222282 238305
11086 238305 -13915 63156 174130 346575 124587 57197 -58390 150385 -9982 503390 376141
11075 376141 450550 252049 466102 529167 337536 528962 279984 447169 705835 402201
11065 402201 317734 580487 601532 638549 634315 471651 571845 584510 673237 559170 829469
11054 829469 886262 762947 1062388 720086 609021 766079 390840 1124617 844601 840221
11044 840221 469050 795590 748918 570226 842721 742667 317047 345620 603595 737128
11034 737128 680189 719661 807756 696234 771924 752372 763572 536854 767026 756622 942061
11023 942061 564196 667556 962752 494382 478936 632613 1058479 778018 776320 299271
11012 518922 861553 636343 539761 557391 550233 762410 525110 399195 844527 756046
11002 756046 684127 499701 620708 631000 759040 747786 380233 829837 810421 505237
10992 505237 924192 700778 498564 810390 1117246 959894 926069 1152747 1108951 1218038
10982 1218038 1045913 1260421 1008198 1468459 1710710 1940640 1830978 2479721 2482376 2640719
10972 2640719 3356108 3079827 2790806 2806493 2579421 2363360 2176419 1942349 1374442 1847533
10962 1847533 1565666 1756978 1590987 1621318 1561503 1859485 1491422 1407361 1389645 1301351
10952 1301351 1264699 1118583 835459 717730 489333 324981 700364 258298 534031 421993
10942 421993 236928 317227 38859 390594 164345 -15409 600467 -21626 -275393 40267
10931 -43054 -93753 69423 -285730 -71218 124420 128331 -4684 217689 17591 -153261 -141877
10920 -141877 415985 494868 -17835 -145339 -242048 -230454 -163721 92782 148646 116991 -1290
10908 52207 -69729 -128599 251856 228537 13632 88671 -134620 22947 -49026 -130773 99133
10896 22816 46429 1570 -41452 -14217 239687 91566 111020 -152991 115202 -12240 104207
10884 -94656 -53103 42095 -53042 -187128 -293117 -144411 -50940 345579 9395 -186091 312140
10872 46205 123218 108966 53944 -447942 61445 -257034 179353 -143367 -153180 81436 -106141
10860 -133995 -56029 179394 -52084 299141 -241616 -91122 -250669 211085 -48531 -22830
10849 284976 311661 55374 8667 32831 -448103 -47886 74446 65098 22057 467696 -346070
10837 240886 -30242 -96289 221086 -69526 -274693 256018 -164457 -20224 -26525 -219785 195850
10825 -125328 -96049 16961 -39229 -315350 31463 -167468 -120461 -414171 -189079 -93632 255777
10813 -244058 -281351 -83167 -270111 -73411 74633 102003 249028 140647 219240 -210734 -325894
10802 -325894 -256756 292796 156520 367025 -51395 57652 -138232 331439 27954 131327
10792 131327 -92336 260397 -207357 -106526 -173855 -247176 133481 70908 -43434 -32934 29621
10780 -195212 53176 -242347 76864 -279888 151921 65989 -222418 -447019 -52533 -441416
10770 -441416 -191990 173731 7706 -27045 -303989 74863 -93525 43224 -53477 170932 -200686
10758 -178977 -1987 -35183 -143124 -185295 53875 -380436 -88833 62582 -141745 -111418 -16620
10746 -63502 88935 -77749 -200064 -199165 169316 27095 142006 10784 -127899 117512 109732
10735 109732 -173772 -143706 -57309 -202399 80025 -191312 -55959 122682 176958 257611 -188864
10723 -20824 -114244 163796 -188307 126630 -79911 78945 -291353 12753 -32334 -143961 265747
10711 -51958 -65841 -57446 -301286 -158790 152537 -29178 -189032 20043 44605 -122578 -5056
10699 -64645 -329522 -424549 64532 421166 199879 -168077 325280 22023 -307199 -43871
10688 -137152 -64809 -394428 91250 -196984 -381225 -313971 -116119 76499 117419 -56687 -155222
10677 -155222 -186326 -167167 96920 65045 -24618 -161061 -94873 -61133 98498 -54615 -98046
10666 -98046 -6314 327999 161400 20181 -77174 -158980 24616 74616 -84611 28486 -192497
10654 -80853 191603 143033 30527 -242574 181160 64936 -254912 -90492 -199557 -20637 176311
10642 -138300 -82513 -116673 -14555 95633 60131 128719 -200902 -230479 -268635 4168 -145139
10630 318525 -120948 164696 270389 -33253 35206 -291439 -125946 26394 -311088 -31331
10619 -272301 -55558 91219 -257454 -215777 -110542 -179964 140598 -115116 -118462 109240 -28153
10607 -234506 85720 95095 -174013 -24473 231934 -195167 -230348 -13041 -7121 236755 -98970
10595 374979 -256936 -110801 356230 -182596 -248942 159474 100279 -24218 179566 261801
10585 261801 -142591 -116370 275039 1696 -45308 48293 -101523 11255 118880 -20553 202810
10573 -52756 16436 -68105 -58254 -266685 -217341 12051 -175538 219449 -77896 68956 13345
10561 -134729 -214857 -152661 70524 63714 -16558 321250 152143 -62119 -94076 97615 -21105
10549 220471 124089 190042 120173 40779 -189 52707 -253051 28781 -91221 -153234 -342016
10538 -342016 -14316 -101001 -292226 189868 147404 -115001 -218604 -24756 136128 -109339
10527 -332165 -249393 128869 58269 -311162 178648 216953 -162421 -116699 -275596 -95626
10516 -110059 216295 -126538 610189 -115134 -45188 -14848 79302 -54936 -181941 -126997
10506 -126997 191196 -71656 -38171 24203 141407 -128796 -146625 -147172 91847 22481 -5211
10494 -185745 51074 -169495 -475034 298086 9515 283490 -97527 -88452 43313 188607 -178904
10482 55446 518078 449947 497817 223905 6371 265690 169800 -78424 -44751 176398 -3293
10470 87947 98164 -94930 -109685 -184419 -50609 121691 -64551 -86719 -87973 -42557 -47185 -131680
10458 -131680 20205 -105072 442790 -208695 -292259 30696 137877 -192693 126711 24854
10447 54571 62229 1804 -20053 -150349 -270275 -141892 -102474 -7980 3459 115667 -4154 52671
10434 -177458 -19826 297116 -7362 293306 -136917 223011 -186711 27956 -32193 36090 80577
10423 80577 -156148 -230433 128776 79062 -90564 -269372 -139902 -204535 -200974 -26159 -40199
10412 -40199 -1435 -9538 7032 188330 171070 106814 -204013 -58888 -379583 -51071 -75706 71241
10399 -273264 90571 7487 163103 32438 -134719 179656 -78520 -140331 6245 -16440 110656
10387 125464 -34095 160976 -38447 80271 -143342 -235165 89213 315234 239702 242439 231310
10376 231310 242831 236594 492122 -18716 170317 224918 237868 410468 223799 607192 303237
10364 718660 468226 431681 520662 -46527 373195 309872 88164 129990 -4315 50118 575323
10353 575323 311304 389268 535827 575079 434688 209494 358364 150018 230034 381472
10343 381472 213045 529142 150720 146690 153199 202488 105328 477730 285418 -174284 275964
10331 247037 13510 101500 -34048 129033 110198 -165804 311246 287072 96148 365760 241206
10320 241206 -95447 23712 292415 96988 219261 147578 93753 58077 329554 -254016 190954
10308 -96501 73578 154586 219937 -87533 48746 -8018 -228839 9883 -199613 -219539 -41101 -15872
10295 312 -108945 -39046 -145822 -249037 128917 -375214 133573 147235 -190532 263908
10284 36529 -272794 -334665 -8790 -220336 95935 -209198 274531 -6511 -199090 204870 97134
10272 26655 179058 227818 -105351 -51780 -59970 45316 120899 91656 156372 -161707 64115
10260 239356 102963 119652 428483 252264 236900 335658 -65989 -13077 -283906 -98707 -30829
10248 181764 -43356 260163 -21133 125173 -162742 -123691 -78467 82000 -49150 -38084 141029
10236 69675 108194 -288271 -317138 -58387 -387541 194100 7633 -179474 -209934 -13180 -39821
10225 -39821 -624460 -77797 -427139 -188197 -69865 125408 14387 149363 -267805 65756
10214 343804 -59280 -127220 200896 -431020 5158 -18977 -240882 178867 -138724 -249500
10204 -249500 -81047 50298 -321120 71688 125332 -76217 97310 -54528 7017 -286335 -52669
10192 209526 12629 79823 -191150 38224 -117746 43557 -290690 -142537 131251 78664
10182 78664 23776 -13411 -46812 -305910 216141 -197714 -152578 -59267 -283774 -106523 355916
10170 -394694 -182159 -73540 69127 96025 7172 -18204 14067 263897 -94535 -222314 274016
10158 -13803 -66246 36246 -55214 96366 -101247 -281151 -104173 -355952 -58900 -12076 237064
10146 -288212 -228746 -118148 -97034 -121174 224826 -322583 139472 110961 99308 362625
10136 362625 74972 -217597 44676 -102247 -310213 -76321 -146903 215397 -148558 77549
10125 -330910 -460112 -476113 -29224 -171626 226334 -186077 179677 -137459 -705 131593
10114 342232 -234586 537891 -116045 -25064 559 -45805 -273700 86460 -74550 25517 -75585
10102 -93632 -20249 -146716 -288059 -37850 324502 -200948 105802 73269 -107172 24640
10091 -130599 -126349 -1452 -57822 252632 106952 88583 -202883 160929 -11510 -128718 -124483
10080 -124483 366421 25459 -71563 -162769 -207683 153074 -193290 -150762 -82904 -307934 -9841
10068 -326351 128239 -112615 155778 -8293 30799 -242215 90470 -72937 -273524 -245488 101344
10056 -233755 -60268 144236 -39805 -559694 -59379 -57789 -16344 -7955 -63957 -7019 -43439 139798
10043 272511 -379860 -173811 -168359 -62315 33804 -216197 65220 -279015 -77933 109719 236864
10032 236864 -44479 -102468 -217516 -256677 118650 26790 -44691 18382 -351320 -228688 -641740
10021 -641740 -245548 -176267 -221983 -164108 -230635 -174675 103396 -193120 -222999 -126748 -51902
10009 -5774 -38867 -416522 197584 -128878 -48981 -177026 -203473 386 -144377 -58964 224261
9997 255922 146133 -159413 41884 -24038 17844 151153 204012 -152962 96911 -217038 -48139
9985 -44318 -12803 157197 -183896 -262668 -89899 -275922 47916 -10046 -13827 -181767 65773
9973 -290386 -188668 -52678 -446797 -484102 33776 -131013 70567 -40069 154100 -184749 93875
9961 5622 -196500 -41238 174801 -127983 -276404 -341346 -57343 -41247 -59298 -53779 -276339
9950 -276339 -257985 -165516 43624 -52147 -129507 8327 258443 -295195 100148 -203009 73318
9938 29748 -256104 -94767 -33225 -45241 -23 7572 -180244 268975 -313874 -3301 -246033 -145409
9926 -145409 154907 223966 -344831 235220 -287539 -31588 -176787 12907 -212225 -40306
9915 -69269 -42911 -79618 53583 -178061 117119 -107638 -65922 -118308 -82877 38578 -208313
9903 -454389 -113150 -331839 -119646 -179950 53840 -15441 -70726 -59384 -75157 -227858 -126503
9892 -126503 -113234 57636 -283114 27230 413210 -186399 -146518 -449353 132403 54790 -44142
9880 246814 -38177 114740 -106553 167232 151381 -123401 -101299 -187497 -121207 75563 167099
9869 167099 17473 118089 27183 -46099 -90751 -375191 -87758 -219372 -193505 -225245 39356
9857 -69698 -115473 -76468 62083 32695 -133358 -155529 -121348 220648 -27170 28706 -146876
9845 -382081 -249924 362037 -72112 63880 29946 -201688 122120 -157164 -133265 14883 85633
9834 85633 -208317 -144783 105152 48756 -3418 -603 -71872 83201 22094 -114530 -254489 217344
9821 -137794 -69684 -59173 16271 131820 -225942 -303998 70700 206725 -146232 -53616 -58919
9810 -58919 -26165 -215948 -31097 -90401 -238028 140426 -230108 233370 -356206 5925 -137721
9798 199380 -96047 146284 -315930 -464705 -299896 -161466 -4800 -44436 -23279 33183 99354
9787 99354 -47053 14205 40702 318560 -147187 -21963 -159474 -194751 43324 143933 158608
9776 158608 66544 -115643 7066 -205204 116205 -14629 -124512 -206115 157285 -1671 -282884
9765 -282884 -140739 -4273 -33530 -293575 12137 -48646 188054 -172238 -60875 162273 -412255
9753 -93575 -352981 -229222 -190401 -9734 -106093 56335 -351365 84752 -348299 -41664 165801
9741 -257157 42241 135632 -77738 -139890 -192455 -47082 -145644 -146532 66483 -17044 -139619 166549
9728 -45280 -271708 4001 -160004 258943 -58842 -185683 398578 184203 -91940 -96087 10796
9716 -161105 -266118 184840 -138502 -67523 350630 -28100 189829 -111925 -339260 -33088
9705 234737 104485 -90549 -198470 27687 -104005 -311447 211568 -170446 -36818 -41865 227561
9693 -194099 136132 -46067 -150228 -35158 -510661 5549 85478 -20967 -194425 11789 -156959
9681 143127 46830 -17742 -192772 -33077 -60529 -31355 7907 -196874 -39514 -206399 -4657
9669 145229 -33845 145553 112731 76574 181814 -164612 83681 -153488 -89309 -357025 35198
9657 -87794 131457 -285017 12839 -205843 -128928 -1384 220626 -133345 48898 -283977 -130082
9645 -16496 -179713 -370871 -89322 -260224 111155 -51348 12773 -238095 -46369 -176748 86905
9633 -16695 107663 213765 312329 94600 309083 159500 -60290 95226 83256 54835 52002
9622 52002 79900 -82748 -206448 -403247 -68067 -249743 -469000 -39129 -47690 -19494 -171454
9611 -171454 -226769 -21594 -131394 -282069 -251707 33775 -206497 -41759 -12535 -147050 30903
9599 -81585 -122925 -75934 -267027 -25423 -17784 115821 276609 1528 -23257 -90260 -149226 -316601
9587 -316601 -88564 -309623 4881 30902 -180465 -145494 -62294 92991 -138422 -235525 -343842
9576 -343842 -155540 -233919 17364 -75520 -731346 46739 -21407 -152996 -92790 -353030 -287140
9565 -287140 241719 20492 -266194 -168620 -375550 -191465 265083 -190078 52127 41517
9555 41517 -131928 -232292 106108 -264678 -83966 116751 -96742 -92986 -213081 5043 -273851
9543 283534 151636 -2719 79247 75191 -332489 -261312 -52555 87261 16869 45470 -57538 -343944
9531 -343944 51879 37636 89808 -145005 97125 -125166 -90102 -25490 234105 276141 105133
9519 198478 76212 127813 -279705 -9115 -111441 -75109 -358700 92961 -73962 183406 -184380
9507 194186 -86021 156720 -158217 -235539 -69312 123839 -409638 119417 -199014 -78302
9496 178568 -98501 21706 -277892 -40293 -222395 -179006 52146 -132577 -50064 -238585 -37969
9484 -116687 -183378 -179743 -93511 18675 -80203 -232114 -22237 -113025 -58909 -57575 -424972 -134398
9471 105113 27760 -134680 73871 235028 -199625 8663 44700 54987 -250253 -420147 -15799
9459 140762 107460 105148 109692 -179389 -283005 99604 -60915 25340 143962 188085 -98166
9447 -138014 -260824 -39476 -34780 -212765 86307 -112749 4979 123390 343251 -282274 3602
9435 -65911 -169231 -172519 57954 5326 -123265 -163285 -507623 -36787 -70383 81967 -83859 -133033
9423 -133033 171141 -319521 -195486 -161510 164372 45446 -274965 -358012 319773 132292
9412 -255985 -92713 47662 33690 -97510 113926 -15092 233194 36545 -124472 -116705 24400
9400 -54006 -181721 -81848 65565 -123352 38537 -207587 -77918 -7780 -60859 154692 -312669
9388 -187706 -132909 148761 -298110 -82451 -342301 -55154 -133541 24999 -154737 -29490 69836
9376 -30412 -34276 -97037 129891 -205378 -94952 -243644 -255485 -221434 -303962 -221660 -254497
9365 -254497 259436 -41207 -189421 -143352 -175603 179895 92094 97188 -129463 67959 -196717
9353 119457 49144 -59519 281606 90134 -168352 220462 -67746 51948 -131664 -237932 65791
9341 -241958 -128273 116801 66447 -203037 -31674 -197262 -101008 -17696 -248088 156600
9330 -176368 -262312 56568 -3997 183054 -123698 225445 -153193 -198069 -269032 -15372 90609
9318 -52234 8627 -123107 121009 -50790 -145988 22963 -95637 237783 148573 228838 35017
9306 17564 43093 129687 101475 45314 -249389 -146272 -332589 -27812 533 -106278 -120793
9295 -120793 -294317 76039 22918 -311447 -33237 -332006 -127993 147401 -239440 -151018
9285 -151018 -175612 -30808 60359 205353 152918 55729 -3400 185974 18058 -87368 -174204
9274 -174204 -464178 248148 -60441 29233 45435 -77669 253198 -302242 179306 265367 18271
9262 232401 -164726 -45978 -246922 -14139 -154316 40590 84586 -249234 -143357 -141527 27088
9250 -188 -11592 -172273 -152839 -298502 -106653 28522 158696 -158147 108144 -73664 249584
9238 162075 -127595 248205 -137380 142128 132075 -125848 -26098 -308789 -71365 -216529
9228 -216529 123148 -54247 4657 -198160 84158 -88314 -121654 -233779 -98822 -14931 -85349
9217 -85349 -92086 -199585 -32262 -350439 -178165 201632 32388 -146217 184109 80960 -43269
9205 -486753 -129455 -152260 223230 -150172 -177482 -16356 -102380 -338524 -27235 -103641 -69251
9194 -69251 84376 -25065 44379 -53448 -325385 122318 -34074 -140648 -259972 182363 47263
9182 97102 -16088 -298982 -122586 -15271 160994 169429 50431 68157 44309 73105 -5313 -146826
9170 -146826 -265648 -256083 821 -237048 -149988 2318 -226467 -19099 -271509 83728 -211708
9158 332923 93123 232349 366917 56056 -21460 123774 120374 230716 -50837 290738 -33172
9146 -398294 283752 -185399 -66471 -258861 -90443 213276 104991 -189810 21347 -280183
9135 -33750 -272807 -283939 -213856 155493 -60566 -154841 121125 -319937 100682 169304 -170881
9123 27303 164453 -236678 199710 117419 -142595 -78426 -41001 -184853 28949 -243401 -140835
9112 -140835 200711 248752 -324706 9639 -25478 -178396 -95987 168548 -206024 75123 -92903
9100 56832 -81024 -6442 -246308 138935 -206289 -112045 36196 -128619 13731 -197455 -314419
9089 -314419 -404141 21912 -309888 -100341 15357 -13423 -19701 235065 -414135 -11252 188460
9077 80846 46782 -85542 400303 -310692 -26866 -241224 -184812 99986 51061 -281702 84197
9065 117146 -92473 -186781 -229036 5660 120824 81726 -237350 34092 -23185 -51073 -30732
9054 -30732 -80085 -76542 -32347 158590 -16175 161313 -27190 49969 84280 154056 270376
9043 270376 39486 -73103 -301426 4212 86482 -90764 -65945 -197914 -265656 -93534 -166725
9032 -166725 -32649 -62740 -85789 9687 -66997 -38654 -139395 -110929 -128344 103359 -122279
9020 -138708 -37110 -249578 -395206 -242908 19406 -478786 -19728 4293 41988 202438 -72599
9008 -142262 123985 -358717 -372321 308694 -88008 -74217 -195178 -205580 -80939 -260622 -229042
8997 -229042 -20859 -144040 55080 3059 -262680 -139051 -33855 -47118 74283 279898 272722
8986 272722 255786 -141759 -75728 -20319 198555 -91090 232872 -128761 352202 -186595
8975 -158895 93191 -156539 64575 272268 235721 -157126 -332801 -52489 25615 78228 -186139
8963 -28935 -62722 22996 -191021 -142457 -335308 -176272 183202 70541 -53141 -231477 -61429
8951 104147 -56211 212909 -161863 85383 60179 -82227 85247 -111 -101982 -28519 -32909 31572
8938 -142318 -87906 -101125 222187 320031 -53831 259320 20568 -41892 -161756 -388334 70845
8926 92542 159925 388029 701675 1846480 6973747 8550019 1984395 272386 572421
8917 572421 461516 -183681 30162 72117 22459 -159563 104017 72703 82408 155496 -186557
8905 68013 -206173 -7801 -214757 54532 128777 12173 131146 -60052 -201499 -83093 -324093
8894 -324093 -209499 -56652 40434 -32515 98573 354285 154569 -58937 -151352 142856 -253143
8882 206968 -185074 -22638 -176083 11495 110317 -236774 -210757 -386959 -25131 -218704 -124140
8871 -124140 54922 -19777 -46708 204017 44350 -130256 -26030 115156 149048 -21827 -222177
8860 -222177 -20275 64216 -66837 93286 -321441 -84581 -366227 -215012 -295990 -5170 -31556
8849 -31556 74742 297012 23229 -155313 -302630 -447098 -264209 76328 -159985 -289641
8839 -289641 -234592 -175646 76504 -31139 -12998 -118030 127025 -147023 225535 -6067 305921
8827 -20249 -185028 -80019 108186 28670 -424359 -97942 -369811 -158965 123321 -335705
8816 -78315 63925 -236167 -10568 -76466 -332629 -300242 -4892 -200514 -189992 -17907 -262040
8805 -262040 -354945 -8194 -81966 178828 -112306 33435 40525 66793 -190813 68786 -114867
8793 379579 82491 109293 -73189 -152723 -124233 -72348 -330877 -262370 -16541 -60278 156881
8781 -252879 -199855 69205 -33646 -14536 140257 58691 -4783 -101110 29350 36265 -65979 -181337
8769 -181337 25701 -143606 70583 -55432 102242 5186 -56110 20318 88072 -246826 -49683
8757 -175150 -162838 72328 117655 -97543 -16133 377675 -50058 284726 -79872 -37016 -110754
8746 -110754 -119471 -43006 -225156 131897 -38516 -78072 21966 241590 -15146 -28984 144561
8734 186294 -236114 107787 178278 -240359 -168012 -20542 -151077 -246280 31668 -145300 -80559
8723 -80559 -168739 -98505 52799 307436 -73233 92610 -215041 -254058 -96043 -134385 -106553
8712 -106553 -256917 -45307 -278398 -166148 -22489 -35688 -41080 -90360 166781 -326340 -34803
8700 -238491 -121408 -194672 -366508 -172191 -19561 131046 -183148 -353137 62792 240789
8690 240789 -442591 -145928 -183044 -103306 -177382 -98112 -61346 -181576 192232 -129662 134386
8678 -23319 -14282 -145217 -93282 -253159 -465125 21310 63921 -106730 202845 112665 -27982
8666 43589 156588 118842 266868 -170871 -75793 -101161 -11629 119854 -66155 68139 -43548
8654 143885 -159059 -75581 23271 -132096 -7086 112275 -117274 21558 -14215 224905 119158
8643 119158 -98567 100801 62216 -15789 -82366 57800 -219340 -114607 201652 -233415 -142444
8632 -142444 -5668 -216992 116881 -146862 153592 236855 105527 -50825 -149839 -447909 3614
8620 355748 -43857 -1568 -169376 104607 -214929 -238607 55035 -8887 -5212 -158861 -199282
8609 -199282 -127795 15716 -55337 -69512 -576993 24735 58224 4704 132149 -164041 -165825
8598 -165825 -136907 8410 -157709 -42106 -17804 188877 15512 64234 -282013 -73255 -127830
8587 -127830 -17370 -276508 -178265 159416 -411378 -45807 -175525 -5248 1669 -264627 -328228
8576 -328228 -106795 157737 -137547 -266733 -14465 -308397 -136398 32929 -342351 262347
8565 137882 169466 -222901 287396 -140629 -100155 52959 348000 16777 -254127 72832 -143094
8553 -425648 -86885 -60671 -9759 211207 -322270 -286934 -75545 -250857 -342993 25062 70591
8542 70591 200662 -355157 -108224 101713 58979 -154637 -190837 -4223 -78116 -179323 42269
8530 -53407 -222851 -202894 -54158 99050 34748 15150 102365 -172830 -154907 -107360 -99401 -113577
8518 -113577 68032 -221927 -179117 -121201 -190343 -127703 121275 277477 266676 321881 -43627
8506 51724 -146517 -102991 285749 16878 -70309 -28478 51811 46701 -35730 -161538 -45900
8494 -222753 -12460 39636 42934 -80758 -145774 50632 -267110 -121151 128246 -132399 113457
8482 -61920 123131 33392 -28470 -141635 -49866 -135332 71098 33197 25264 -10193 102280
8470 27183 -133764 122140 -194216 -246724 91861 -136400 78229 -59913 -78649 -159762 103403
8458 -114114 -68047 192983 40357 -14265 -99160 25324 -254812 -304467 285168 7978 95988
8447 95988 -248785 -226111 172619 110334 -315617 -4732 122627 -220832 -382389 -19027 17219
8435 -27275 -153356 -279129 -37185 -209139 199777 -94788 -102051 -25388 138026 182187 -179544
8423 -97696 -95445 129696 5809 126847 42807 67061 -42721 118725 -318312 12580 65367
8412 65367 180466 -33333 -92559 -105149 145130 -36541 -106315 89151 -90524 -50798 191515
8400 -251765 -165989 -157997 -146708 -166847 9130 -55240 -150897 -61810 -639773 -5253 53621 336107
8388 336107 25616 13367 151087 -181883 102292 -351703 -843 135035 -472460 -358713 -456986
8377 -456986 1130 115998 -253470 -358095 291958 4933 33145 -416125 -214303 -132476 8340
8365 -212744 -18566 125124 -124578 240300 -351658 -202489 -76831 -114405 -92608 -234026
8355 -234026 57159 27022 251203 -57136 -168820 94555 -108911 82172 11184 -27089 10543
8343 77363 -36521 -52098 -544995 -131340 -81782 42926 -228400 -195916 -327212 78882 172108
8332 172108 90603 137841 -231756 -38073 43557 -301521 342219 76067 201891 -29160 225267
8320 312174 -187970 -332570 -254727 -577267 -148710 91123 90209 203248 -13147 41787 157305
8309 157305 -157643 -118090 60161 -9174 160496 -163440 9850 107996 -111050 107467 -98088
8297 -161797 -308980 -184290 269514 -253367 -49805 -207237 -92991 -11915 -146358 -144512 239315
8285 44058 -267545 157354 -194625 68979 35427 -340659 145149 195103 191830 115000 -247929
8273 -193582 -16887 -147089 -17599 -84592 -79581 19547 -183927 -171604 -210064 56378 -351117
8261 64920 158371 -64064 301279 -207349 50822 -186119 -21733 -131678 257360 -371728 -103047
8249 244085 16281 -167140 -78090 15429 -161296 190560 -157434 -131767 -14215 118611 -38461
8237 60293 311333 -356530 124041 -133836 116278 56652 -380256 -244824 -296498 123746
8226 -381546 -135986 21290 119563 -14030 27880 28261 68920 93337 41408 67952 -55775 -202976
8214 -202976 33680 54000 -135861 83670 15414 66115 199223 101407 68356 -89779 -295962
8203 -295962 -132578 277 -94061 205832 -56547 360557 -1883 114572 -27107 147694 -422254
8191 56679 33899 -153 98534 -11901 -323410 146122 39223 -208454 142469 -112135 -145025
8180 -145025 -474315 -323347 43025 49491 -241879 -98940 77471 -33876 25867 -95244 -174215
8169 -174215 -152775 -112554 -11554 -400772 75611 -406389 202995 68383 60297 -63383 -94431
8158 -94431 -50009 200971 -188567 -316926 -238512 -44067 137327 -134888 232678 -26263 175947
8146 262271 -56133 -371207 -247257 126975 -267556 150146 96714 -139613 -99076 6432 -38143
8134 66258 -334889 -112227 -50908 -166810 -96558 61388 -128803 -147619 -285672 -96170 -108158
8123 -108158 -104656 -109158 -346446 -14245 117919 244602 49561 298719 -340877 -92996 -240674
8112 -240674 -360091 -142675 -317911 194600 -143745 -96938 -261235 -1613 -68372 6522 -366
8100 -146963 -72709 -94243 273843 20850 -185344 185382 30577 -209503 -63225 -140951 52553
8088 -153488 15112 -144657 113285 282581 97070 45647 -99943 -179143 -165633 -208691 209570
8076 -174344 -65390 32198 43442 112676 33307 117931 -321748 -42581 100657 4980 -167279
8064 220141 40380 -285765 -33303 -190644 -296464 -186745 17428 -190659 -106776 -127688 -5735
8052 -10136 -218390 -28850 -243283 -261551 -231773 409985 -274678 -46598 73684 -268380 260218
8040 -105067 -72127 -170255 -200414 -166890 43887 123357 107227 -4202 -69222 -387740 -105705
8028 59626 292537 96563 -48744 -17429 14222 -235209 -205250 26089 -155862 -260569 138152
8016 221967 -297521 -68376 -285135 508283 62113 -104007 273550 -29877 196901 36097
8005 -59446 107096 -39280 185679 -1957 101992 -272832 125558 35033 43647 72528 -148774
7993 -215970 13557 -79280 -95190 139454 -306347 -166396 173709 -17506 62051 264835 -108366
7981 -153906 307850 -57355 -63283 52629 321822 -88047 -91458 -172763 -142448 191435 -316117
7969 -29104 -84784 -165448 4660 89293 -70610 -227357 316314 41214 62349 -158675 219419
7957 -196416 162238 -122095 232892 -130493 183793 -304513 96914 212325 -10191 25715
7946 -123327 -143557 -252692 -233506 -33551 -63886 68219 206819 151248 -12692 43891 -111064
7934 185767 -168899 -54918 -311644 25228 -203855 -190937 -65241 -122446 -37416 91456 -118134
7922 -52279 -349143 -18654 -106400 -92532 -292874 1517 -392196 -198014 -121548 -32156 -74608
7911 -74608 -128769 -238268 98635 237648 88505 -112733 160883 -223140 36556 109024 -42009
7899 220103 161180 171231 -141744 -283689 -90452 184178 35652 228242 -111858 259498
7888 -48282 70554 -451736 83776 -197090 110745 -395955 15686 -27110 -10586 -288513 -58571
7876 -134237 54320 -941 -230932 -135746 208735 -404278 182247 19959 -209109 -267361 -91234
7864 -61981 136231 -192873 -84083 434578 305945 -5281 -44449 -234677 107697 104384 -147182
7852 1328 -60805 -156275 -72491 -108204 415131 81965 109968 -353755 87010 -236898 -29183
7840 137706 -89933 132247 46339 -413498 322373 47637 269637 -51111 -88412 -26936 -77448
7829 -77448 -52478 -157391 -31812 -375417 233039 -41695 -112542 -238181 83730 106248 -222029
7817 -151773 -377698 160812 -173920 -126678 -318147 80306 -68648 6704 -44024 -43266 412565
7805 83430 190463 275023 32046 62049 -151795 -51656 -61210 74952 -207946 78929 48659
7794 48659 137397 349124 40405 49005 -204639 403506 -71362 14157 328569 -209524 -259002
7783 -259002 73299 9539 -55621 211738 128108 -62592 10715 -96098 -307665 196120 -213885
7771 -147917 -396367 -3633 58307 365021 -137817 -116126 -387906 -64231 -200353 -119392 -210095
7760 -210095 121784 -143720 208509 -155607 366804 7919 141078 -128779 81769 -190856
7749 79371 -72345 -683169 221730 -101197 227554 -93235 -14097 -212225 -209124 21354 -26027
7737 43529 30320 -28045 -240280 -170355 -52370 -139802 -65717 75163 -57117 -81242 104106
7725 -34864 -136883 -42230 -120118 88829 5072 -99400 -191797 -5463 -153555 -59794 30755 -247158
7712 8102 65548 116803 -21677 -282562 -59589 68469 -91115 -184105 -45561 -262955 -219525 -15832
7699 -206853 -170598 157412 37001 209350 49846 -177108 167020 -162549 360750 215002
7689 215002 79995 289287 -437205 -197919 18148 150637 -127035 121844 176517 71499
7678 -106701 -174579 -13784 -170323 377261 -211766 -209595 249501 253927 251730 119 -104480 -241545
7666 -241545 -120510 57603 -174628 132625 -213878 -64500 -259672 -24837 -94404 38898 -94235
7654 -104191 68639 -56045 59908 115743 -246964 -43582 -173950 11138 -67852 -37963 -19480
7643 -19480 175830 -44267 195729 -264022 -220513 202028 159222 118618 -19154 71962 -209923
7631 -282585 440113 -20658 134702 -197309 -172635 -27896 -224980 -486832 -172622 235026
7620 302650 168375 167583 22235 87315 -40984 -141208 53986 -422442 3802 327663 15380
7608 -195095 59243 118738 237590 -219958 -184044 319785 31425 -121989 160543 -298114
7597 -334851 -242401 -20112 212453 191554 327577 -173410 -268400 -165963 -36217 46844 -6847
7585 151936 167321 167513 76124 -5032 -275845 83815 -87821 -326977 -37022 66625 -27710 34386
7572 293528 34749 -69543 -203729 -364876 281466 -162095 -79210 -162570 21643 -373962 10622
7560 -99425 42286 143714 17800 103195 342308 -192931 -308576 -217537 -107415 -115230 -235895
7549 -235895 -19766 -51591 70577 216833 -141363 245947 -143381 -60078 137204 182587 -42028
7537 -27338 -60292 -180573 -253803 -204176 233856 133272 -178311 -99476 -51138 -40107 -94885
7526 -94885 15220 71205 267312 -359721 305870 -215448 -13999 9807 -274294 -166777 -50649
7514 297622 -349612 24943 -163051 -64569 -72691 78179 81502 179617 -115709 52804 61217 -322060
7501 -356856 71405 -131473 38102 -111010 -84788 -129388 222641 -182972 185338 -127356
7490 -99312 2752 -63785 -19613 -62874 -157088 -298342 410513 -336397 17747 -515495 88448
7478 -50393 28830 -85358 -319490 -12281 -86851 -71559 260592 122862 -327533 200713 133362
7467 133362 135633 63325 25895 21583 4944 25091 -111412 39294 73389 -152984 -52515 11345
7454 305333 133259 72034 109577 51300 -236561 -31548 78235 53887 -126514 -30517 -282724
7443 -282724 -372883 70233 263376 -191446 -33104 451719 36849 -24569 -170199 119420 -116011
7431 -36123 26338 -181337 -216871 -460192 -222005 -118133 24614 -38430 -144432 -207185 -70849
7419 -231978 149719 64674 -41555 -211974 11340 -12215 158242 -143678 160100 -211184
7408 306935 143673 -175398 -150754 162080 58312 155848 -283470 217942 -278860 86018
7397 -59072 -32637 -324087 305407 -165977 -317819 -54739 -93103 -111680 303738 142786 -63832
7385 279677 -225936 -122588 386988 -294922 -167565 -207618 207638 -60892 -299795 85788
7374 -107557 158971 -22626 -57781 366742 -111914 3859 123199 107506 -188945 128185 -124552
7362 -139170 -143588 -232971 -215914 -82521 -207813 -284485 178529 -302344 114807 -151184 94743
7350 -333995 281732 -91047 253693 52808 -73459 -87938 -276656 21513 -198514 11179 -494265
7338 46185 112079 -301476 49990 -309774 29570 -97552 -158118 149784 36071 -235041 -209154
7327 -209154 -149306 137607 -99056 56892 54399 -70006 -71150 62336 -171773 -169108 103460 243987
7315 243987 -328748 -165184 150736 -257069 65306 -60853 151750 123857 14657 -76634 -148535
7304 -148535 231508 -219511 -224502 53742 -235626 197656 -76216 155093 143798 -94516 -136212
7293 -136212 -105042 430985 186859 -64612 -385830 122842 -417426 -158441 -70728 -250269
7283 -250269 78222 202807 39225 -97709 -62226 -6330 35058 -102326 -296782 -204743 -12036
7271 -196844 -29732 -379963 74404 -115527 217980 133412 -35982 134195 184470 -73896 -14288
7259 -353070 57423 147913 -97289 7323 112633 84460 -27197 280378 -92060 -244310 -145734
7248 -145734 -101754 40431 71918 -177122 233848 -154 -186229 196801 302423 -119478 34066
7236 126089 -94620 78646 187931 -40997 -14941 229146 -213333 -253794 -266064 -48124 23971
7224 -147437 131158 -164231 -170726 -391920 326891 241590 -32964 92465 -79713 -151995 88900
7212 -136826 106554 54938 -98252 274230 -63644 -241463 -214912 122348 170046 -77490 -65480
7201 -65480 -297017 -82359 -200128 284517 323013 181377 130667 -111607 109696 -455602
7190 -286744 -57844 -5652 158879 196771 105605 109572 81677 -49533 -123090 -144476 179600 -177203
7177 -102126 -162561 -165085 -48642 -37827 176211 80127 -229747 -50367 -208205 -77836 155023
7165 -93931 190245 -338856 -172046 216975 156854 44111 86513 248227 -19430 310476 -138313
7153 -91748 183962 -212828 183793 -28190 74145 -257071 -69305 -258450 114637 -174456
7142 -143842 24481 362354 448546 21421 110749 -35428 204473 -38721 43915 87877 46463
7131 46463 -6535 42160 43067 -19128 -121657 -246209 -46981 34852 -121598 368915 -131988
7119 -113925 108791 324263 246068 204100 61027 -197453 87370 -37428 -343336 -79616 -189169
7108 -189169 -541078 184293 230902 -82272 -65432 109386 -55452 119805 -23589 -315862 96402
7096 -35281 -122226 -257264 483065 -36589 -4553 66060 305080 55048 130136 219928 -249683
7084 -227855 74071 44029 -121892 -66419 -224830 236220 -224631 -185747 185171 -182290
7073 -66386 126383 114881 -148267 90259 -345291 93423 -276384 -89098 -2957 111894 -83255
7061 -169331 213718 375844 -61364 36239 -123788 -8547 -13557 19779 -80286 -483066 40069
7049 -237673 443634 -40337 159021 822 386834 -300419 -75197 197023 143410 -79116 242552
7037 -196916 -184895 -262402 -186259 358033 109262 216950 374819 -112200 -14253 -75143 -212350
7026 -212350 111246 -33513 162874 3596 206946 287786 159297 48377 -64604 204424 187204
7015 187204 288116 -246793 -20817 130340 -292450 -100431 -211244 -243423 -373482 -256125
7005 -256125 -60640 147927 2334 -107692 -167778 -154146 -315575 -98622 -173053 78201 -211703
6993 262577 -249866 7940 -236309 -139136 -290155 -279409 -105776 -53768 -90763 -2950 264942
6981 -108772 62669 -350506 262675 -316601 7404 -38675 297954 -6465 176307 -151789 -107693
6970 -107693 -314091 -45351 107589 -37120 114122 -86028 202489 -55025 170285 -274504
6959 -486309 -286272 -190186 38382 -325522 354071 84755 29528 259891 -189755 19092 -46861
6947 -134509 -7932 -128986 230018 266352 -52136 184245 97620 -9572 -83036 -23719 128979
6935 -37973 252871 153146 -52644 -10711 144737 -60452 157618 -254601 -155584 119513 -128184
6923 5028 49644 40309 -256087 66275 108810 -78444 64506 -334093 -52538 88026 108476 -24277
6910 -38074 -260353 -207166 -191849 177412 -145863 27692 -34482 -51923 -165310 -213636 -61562
6898 -165850 -37654 104427 196884 -85614 58736 -98493 -139891 141312 146211 -117253 58100
6886 156926 115677 284749 113119 -93278 85420 163330 33074 -12673 -116481 -128648 51702
6874 39832 -265628 -451101 -190161 98257 -50584 -55874 -126763 41329 -242626 -87228 -283142
6863 -283142 -263330 -299 -45318 47215 -29472 -293594 13880 -95591 165587 238667 216373 324781
6851 324781 140949 -267860 273046 38608 -41658 -78282 237099 -155836 108666 262317
6841 262317 198888 -222317 -8038 -200545 -71218 -22177 -29854 -295164 296464 -133174 -102281
6830 -102281 -334847 186177 -64928 -67076 -98769 28859 -140223 -142053 -184813 99891 -99508
6818 -227508 317741 58081 -26302 73612 -13831 -173872 -106703 330440 57427 197359 -107069
6806 355189 92140 41004 61887 222591 26425 47151 -135390 44862 202692 -311994 22942
6794 88146 97238 -224242 -77222 244025 -220019 93966 -992 -51213 -22470 -170516 -66586 274612
6781 -252575 112138 -263838 -53877 299626 181806 163300 62492 -83410 -84592 502422 -76455
6769 278113 -213840 -85607 48780 -53059 97974 445916 -942 -293446 -113929 43195 37303
6758 37303 90152 -23222 -229303 280090 63290 -181771 -13069 -75662 16603 5005 -361606
6746 256036 -170720 -138452 -75864 -191518 335156 -139437 -204882 7890 45136 26614 106281
6735 106281 -40608 165564 -215823 -60 -37394 77458 -55825 -58259 -139740 33906 -192461 -149154
6723 -149154 116069 42957 -10857 -42658 12163 -101331 125380 -68156 78380 121946 37625
6711 -92201 7689 -201617 162007 172144 -93059 -37541 -115446 -294788 -207819 -170559 -166083 -328678
6699 -328678 -355368 15593 92156 126641 -343815 232755 -94588 -109415 71849 -94643 185777
6687 -38458 27187 12753 102746 33599 -77192 14434 261618 -162504 236482 -274746 17269
6675 -230063 -77073 201703 -262720 -10694 -108588 93913 -77219 -46473 -193206 -98565 -229713
6664 -229713 68565 1249 -53667 -282326 229503 375643 -57070 95129 12596 -35420 -247643
6653 -247643 -230973 31166 -165450 -18992 -151483 -39021 -58294 96828 -67061 -42714 107911
6641 -24067 -25243 -46443 2646 -323875 -9605 36183 87450 -96376 9397 -65578 -78107 -400951
6629 -400951 80647 20298 -179419 1947 94277 -52670 -31559 212778 -218130 26415 -127442
6617 46983 -24048 -45704 254151 46275 553491 155491 50773 -275085 -357311 28175 1345
6605 32306 108314 -179259 -170000 73974 -202419 -102633 -142696 -401553 -180595 48619 -51271
6593 -72224 -83339 69082 -140518 9287 -329601 216348 307641 188111 -107655 -72989 109501
6581 239307 242501 151958 37772 13771 -54825 219966 174566 259399 365770 -86392 -71578
6570 -71578 128746 73240 -280158 79244 84060 -36556 -38245 3430 106218 -192780 292265
6558 -25752 -165985 -361165 -114034 309124 28829 346962 -118992 -391471 270335 -297201
6547 -145493 129640 68170 -56689 31898 21705 -176165 -454989 216644 78718 -256638 181274
6535 138173 105209 -109041 57102 -242831 160958 32638 -27387 -74924 -124604 27553 322641
6524 322641 -104728 42192 -119476 81029 409310 -52843 25760 6025 -434960 132041 -266403
6512 -34184 -381528 -174443 69202 -149588 176353 -120935 56173 161996 -211801 81024
6501 234837 -79476 -221603 74489 170571 -257274 262418 -315158 65640 -565450 -427115
6491 -427115 26160 187547 -44596 85813 -47384 -127852 -22365 58701 -197450 -271531 -75538
6479 -32499 -275706 -255616 -123527 410032 -69348 -121355 -158757 -32253 -37039 -243981 20197
6467 -42132 139456 -177101 161488 230272 269803 -260603 91992 38651 -221697 125739 75230
6456 75230 92172 217425 407539 38234 -14804 -63373 110486 238747 78199 130150 27218
6444 26436 -243297 169914 16083 -313708 -245292 177096 -18292 -13993 -261283 -329815 -268325
6433 -268325 41813 107752 28021 82555 -57662 -153761 304019 -63576 51522 -135424 -262307
6422 -262307 17893 -101191 -14306 -7257 11928 -4714 79489 43861 90786 120625 -144373 230374
6409 16613 173243 179292 23168 -36125 15401 -209379 35061 -122502 -265247 -110611 -5418
6397 72211 78850 -9518 82588 144195 -76603 -318912 61859 103164 65661 67950 84332 -262956
6384 -94611 -144804 -169411 -98899 140982 -49579 -142541 152642 321186 108048 -113870 203949
6372 -225173 75764 292381 -4204 -225208 -246901 192224 111755 -55012 27065 15282 -73724
6360 -54607 -101563 -23812 133691 115464 -195125 190895 185765 -161720 -24507 319753 112007
6348 -37810 119484 -56316 -126236 21483 -198887 -82024 -146787 -161236 -328411 221147 64062
6336 299597 41743 -323880 3849 3228 -275155 -358885 -121482 63005 -26619 92586 69470 -9592
6323 309446 102694 64348 34146 241624 -144488 -205818 -167934 115356 260672 -70617 107204
6311 -23765 36859 154553 -129863 63874 -411283 -50503 359454 -151270 83201 74072 184036
6300 184036 -17430 94530 25751 97053 -72621 -140423 -74342 -37800 -81815 -578558 91085
6288 27607 164621 -28905 -69334 373263 -153189 -65030 12971 122338 -83138 72324 -149118
6276 -205947 -322571 -214106 130477 -162805 -73331 232690 127939 80488 -103807 28583
6265 -94754 250461 66615 15042 320619 173873 -323069 -148229 -200153 74651 -153480 176293
6253 -164842 -70244 -46000 198573 17010 -235064 243865 17711 156725 -30138 -120756 -282050
6242 -282050 -75987 210646 -118212 229770 -235416 82129 -234365 -102872 58627 -84746
6231 -137702 -735 -80142 -151266 277842 133678 26793 -224414 172693 168128 67593 -68822
6219 222672 -299426 70649 -78601 155810 -158079 -118028 -244466 115529 179880 -162312
6208 55674 24904 -248778 -191281 107191 30392 50207 -324646 -187608 -99903 34015 175396
6197 175396 82084 83227 18294 -83108 -339198 -378138 74552 -115454 -56502 451928 -15512
6185 110975 -388987 -131709 94183 -72589 229036 300401 -106114 -182893 -10307 120251 -5211
6173 -11056 -122245 123826 168391 -174123 -145104 -74569 148830 -438 -42546 110912 -73147
6161 76919 -63252 13160 17967 -117541 61509 228513 25637 133244 174011 20944 97705
6150 97705 -149681 -83804 86400 -123456 -39258 106410 194830 -229800 -95329 -7158 138547
6138 132341 96922 154061 158498 -66763 -41575 -102710 147767 -448876 165538 150961 520995
6127 520995 -59762 -109357 -109674 -121858 384164 -100220 -299252 83921 -151334 -271573 -56986
6115 -176162 101070 -285224 53871 140422 -76114 144492 26314 -105241 62533 245622 73784
6103 -19272 151842 228082 -147469 188310 330049 -242018 67830 31207 -261543 174796
6092 -29610 14530 153338 290006 -119798 -154346 -11051 70970 59880 159891 -163964 165073
6080 -73984 37076 -20667 -26120 39762 249522 -123832 75631 -201170 -20753 174937 24619
6068 154132 -545231 50983 58989 111682 73392 -10173 123077 -61047 203583 177002 -221360
6056 276869 177463 139709 -223977 -129271 -86227 109345 242766 -210532 -183456 -154002 -12030
6044 418242 -63564 244186 -20073 481183 197748 -238109 -8965 61870 -136505 -160324 -102823
6033 -102823 168851 86783 37133 253670 166088 74869 121295 316506 50254 -174799 -124029
6022 -124029 118892 -120057 12736 -168075 185570 79393 296396 35855 43972 39079 -79971
6010 196319 -109634 -133149 -162649 48233 141873 -165202 72178 325653 -48959 -143981 -294221
5999 -294221 6648 -227654 82355 -13087 229288 160046 88445 -248034 -68322 -134869 297251
5987 -204411 18120 -28124 -5108 -195700 -35578 263132 136947 30950 97125 156903 -172841
5975 226879 369664 -38289 39370 129281 -5888 20276 -350417 -112266 -298438 64170 -58296
5963 -245693 -222567 133038 -135660 -32266 -166502 -77274 -247646 -29815 -43468 131847 -78482
5951 48265 -64973 -46900 56232 -157037 112421 -16407 9816 -76648 -28627 224401 23270
5939 -78810 54520 151636 213529 -98424 140977 66584 -80344 42587 17608 56312 49994 -196545
5926 39767 -129095 -96006 -14447 -208322 286705 146501 -330689 154241 2151 -135775 72987
5914 -280610 -63586 188231 9519 -22694 -79535 -97062 66021 2772 -192486 -119364 -283362
5903 -283362 62570 -289976 -15354 382458 -49620 -106218 133534 -76627 -123123 -5575 -352409
5892 -352409 -25381 -377470 -175039 -19984 -68179 -8118 -56591 -184369 30302 -67035 -177419
5881 -177419 -328425 -8850 144910 -199578 32508 30321 288391 205103 49527 78806 26166
5869 6421 115553 -252759 164408 161799 239043 -328342 96640 75714 177639 41759 25070
5858 25070 131861 357050 -62235 250108 147517 -92352 -24175 -111858 152842 -166418 131119
5846 -122534 -287971 -349212 10631 -73736 68095 -232145 138712 -1764 240614 144908 30679
5834 -152724 -19941 15779 129693 41376 -127819 -168515 78747 -353507 -408653 -113189 -86653
5823 -86653 -65470 -22236 -133971 261923 116536 22961 -198595 40373 -125324 -113702 -281559
5812 -281559 -16717 -97166 -451914 89327 116161 80535 -202776 34345 -279168 94135 -277950
5800 -344867 -225740 103975 -174267 -43150 227970 299527 42755 213965 -6243 -3880 -57418
5789 -57418 46843 115036 207893 -176422 -193269 -90448 -51720 198579 -37932 152794 -70366
5777 -224919 195110 -47182 -165494 -75403 -260512 182269 -176888 141785 -84933 122660
5766 -176935 152908 -265668 -163561 6711 -155889 -48424 -42949 -349520 118746 -366787 -77873
5754 235567 127028 29882 197628 190487 -46572 212948 -84764 70961 -53579 93425 -149814
5742 339956 -5079 119769 368099 -18961 65381 194514 166537 137092 144560 174358 -167608
5730 24852 -194308 174332 41134 255868 176194 6370 -58603 -82143 -379559 -76336 305328
5718 -113260 128658 -63284 102791 -564 206772 -19519 149573 123572 168791 -94808 -234744
5707 -234744 -71878 -141162 -151894 -412941 160306 -200922 300405 -351628 -184490 553972
5696 -19468 124657 445185 -279218 403274 6713 35178 113458 -45303 -191618 232459 57503
5684 5697 -176363 335539 269043 82099 -63542 227350 35932 -57705 -131672 10161 31551
5673 31551 -175253 50078 -2406 -141821 25381 -184566 -212347 -319803 46453 -101685 159418
5661 83167 -25560 2978 169260 -105202 -103979 -96430 61576 -82324 66530 -132265 62836 -184430
5648 -282257 200159 -1524 -66276 36503 162948 -43778 204524 5621 -55310 -330531 367241
5636 -157387 -197351 -322446 -253434 49390 29619 123319 56903 -201070 -13776 67360 -104805
5624 138841 -68569 -25441 88574 -94025 55914 -351256 -18500 -422853 -111099 21891 122726
5613 122726 -90190 -157188 -228220 240067 -32261 112644 -178325 -62683 79942 318695 59723
5601 -78601 210006 207035 32271 -85003 28736 50818 -181717 -1603 311866 279048 128763
5589 75804 -2837 155193 220073 4683 202465 -25453 196022 -232141 -203768 488 -96209 -20411
5576 -159385 46693 -47511 -147901 -193876 21582 -37071 -201598 4638 -3868 164778 -64781
5564 -270149 201967 -97306 -26827 49190 7390 190708 -153450 -216104 -127350 -143520 -517159
5553 -517159 -265389 51502 36152 -123559 -214182 73885 108274 -206456 168087 64043 293613
5542 293613 -114736 -52654 148893 -401484 42444 -30116 282679 41314 22914 -153362 -61634
5530 213597 -164703 -152254 -136619 48130 -1177 -85380 -9680 -86805 -125361 -20359 153096 -61028
5517 -95729 44189 6452 176264 137409 81579 42638 -233419 144438 160165 -158259 -101996
5506 -101996 -46456 -61634 -197104 -254459 -50308 -27786 24316 97664 -185666 53290 551367
5495 551367 238258 100877 97171 280917 -25112 6353 54206 -95209 -62026 -205163 54735
5483 217262 -298211 585149 79162 -138203 81496 38777 221711 153811 -3277 311841 -319736
5471 -89526 167381 107250 30275 -270024 114417 -31492 -181034 -163224 179349 34331 -88383
5459 72935 -85471 -37284 -203331 -179105 -196372 234515 273091 73991 -280377 -168600 100639
5447 -133790 -99494 77821 38058 -29037 -161182 176139 197054 208826 -38597 -58460 -51136
5436 -51136 224831 -206662 -269948 137915 100779 93172 -123725 -180468 -44488 330007 239268
5425 239268 304 -171883 -159925 358368 75881 118358 -49606 300917 148725 -181923 -57260
5413 -385282 -30339 186102 41815 155548 120957 -94976 77594 -128547 -108814 -8800 -113546
5402 -113546 148356 135212 -323407 181433 -73449 -24467 -81081 28370 -141495 -170459 -119207
5391 -119207 42264 111781 -74032 -9030 -40103 70384 -448390 -138635 139556 5961 -69360
5379 -276676 63542 158955 52750 -35834 108169 -188979 16326 201308 -162958 -1862 9493
5367 11697 -321436 -122042 -240178 -241472 -226023 138934 69527 -136413 -61093 -64863 -132718
5356 -132718 -132381 -3575 260944 -302854 119106 229794 235368 -100706 10462 65901 257731
5345 257731 51233 -64811 -165101 -153842 172878 -129478 -271928 -25433 93442 -76484 143384
5333 -23729 105448 -124500 136377 7947 39500 -122376 128116 -214933 -176723 101500 -275181
5321 69404 228320 267737 -90943 -118091 55978 -181401 -256529 273376 -83725 -145186 18160
5309 85460 -65585 -187031 -233400 122420 -189379 -200783 206941 3556 -46530 227751 12518
5297 227867 252245 187956 -11455 79594 -65485 155452 265149 201572 -74680 110859 -193696
5285 214154 -171302 -98064 233268 -141605 185590 -312698 275580 -1636 -96504 -55843 389327
5273 169005 168208 262579 89617 257912 114734 74269 124970 -86955 -60126 -24271 198561
5261 -280787 19135 238607 -181698 -143424 -7951 337201 -1590 282912 992 143456 216743
5250 216743 -5704 -46317 -102437 96397 180428 -62068 -163267 7554 68317 -314389 -168572
5239 -168572 7608 -121076 246122 -81792 -34244 252975 44977 66723 44361 229402 66972
5227 103961 250243 129015 113125 116686 30663 -94415 53333 -94721 -73595 -47332 -27350
5216 -27350 341478 -244305 77637 96244 26007 -48597 -316499 -78799 -95776 -69418 38780
5204 399900 -86754 -92618 -152408 46710 -254719 273371 77676 -85956 144349 -320145 -56576
5192 247183 -211695 -114768 -313101 82907 296930 -90938 48399 -87658 15050 252851 -52520
5180 -152961 129485 -212101 120698 87495 108968 -96504 -85554 190965 127357 -179378 -411319
5169 -411319 -248056 -127213 -28291 69870 -44040 193598 181545 120409 -317285 -105847 22155
5157 237899 -315089 384590 55925 135027 -55009 -116050 -16197 -231755 -26868 -257416 193568
5145 26298 -288634 -287294 -167737 -147516 -295112 -350699 -90300 8756 68034 -44667 31973 -149491
5132 194559 -137187 -42378 15892 136987 -130331 147031 -20830 -207651 55699 -117011
5121 234091 -176673 96322 -144437 3399 -142437 -62325 -147804 198194 61570 -44253 243194
5109 -268841 73298 -34214 -69377 -37065 353560 -256086 -111083 89957 104427 227785 -75970
5097 -94753 186179 311990 -280753 -53883 -69685 8844 504940 29484 -135133 -63074 -35477
5086 -35477 34693 96333 -179825 -421936 -113534 26917 -141874 -144200 437554 -188701 -64217
5074 115226 -15952 237795 -91761 408731 52985 193970 -37086 -214091 215184 123424 -114802
5062 249644 50235 39028 126515 217943 119727 -246241 -393226 35266 -16251 397781 -109468
5050 173118 141832 19245 -88922 114007 309788 162285 288 -3334 -393844 -6632 336787
5038 -112465 -235737 151916 21589 484680 108889 211337 4452 221595 -273001 115882
5027 -100667 173604 244129 59162 -197147 223029 -178275 278673 -79459 -71298 -92072 -235370
5016 -235370 189551 233922 119749 288444 -82364 45439 155635 75459 133404 104813 -271834
5004 152939 -205610 193054 -70834 58965 -44627 137555 -90736 -136750 30378 -136347 -277638
4993 -277638 13506 150738 -29886 57736 59276 139039 -152642 -82671 135214 155733 -107815
4981 347267 54698 -234174 -204534 58696 94332 116279 94043 833 -75070 124201 -51854 -182141
4969 -182141 -27208 23140 -223786 19 114035 -168997 328577 -51201 -29017 20656 293265
4958 293265 405643 -165650 -302514 148725 -37726 93344 -135830 -38291 199082 -65005
4947 2518 -105445 -105445 -165369 168844 -125522 -378936 -203671 274018 195592 -287458 -159638
4936 -159638 -118313 371533 -12425 -227669 231164 114967 -15468 -20474 -251540 -16037 -103826
4925 -103826 60724 -70823 245421 49543 61757 -88080 -221511 446714 200884 -167298 117719
4913 99608 -238818 -10187 -2465 -374252 -69971 149285 107407 107907 -47910 -153623 -3619 62475
4900 -63322 -50734 231413 -121940 -38672 -110645 -39297 -142298 60938 218877 252871 185932
4889 185932 -21100 -179765 -15609 151705 -201271 -153043 83887 -167194 159425 -330233
4878 8972 -384498 114461 267645 11349 -5908 -285736 107845 -213296 -125197 151715 -117438
4866 469867 -186995 156554 -38138 -217535 -65034 210891 289864 75125 106163 46814 -19706
4854 -126846 -174680 244227 -48989 -74287 197878 47518 -119840 -273073 -10196 21865 111197
4843 111197 -236127 -16646 120033 63822 -344705 -39244 -118974 -107333 103080 126478 -55593
4831 -32758 -21514 -236812 -180630 -182019 206935 99173 54170 -198064 11844 131727 108123
4820 108123 -10552 -89299 -118047 -220616 144755 195660 133385 -123870 8321 184591 -187387
4808 -161918 -669 -105203 142487 76689 -248915 92808 214017 -42263 72052 97990 -42566
4796 -52809 -102494 -68577 219409 558651 149016 -144785 -239961 -110881 4910 -375310 -101479
4784 -110956 43538 -229594 -174482 -13726 -86748 47935 59543 -66391 1253 78607 64122 -86888
4771 178037 -92051 107771 -67376 147774 109292 57595 28487 30114 90394 52252 100702
4760 100702 564675 151251 -11272 -16978 -297338 -170013 54486 -6080 310793 -151187 13240
4748 -18657 223605 -156531 -197123 -16931 18592 -308733 101877 -6652 234896 47338 -35144
4736 49002 -266119 25574 -155554 -195507 107998 -15736 -241743 90872 188821 38188 -207798
4724 -126692 -240927 -86423 34091 243578 14340 175969 -171511 -19587 5082 -41449 236235
4712 -55767 377729 299027 -89779 97067 69077 -326988 -76 248379 259264 -59160 61184 256550
4700 256550 160963 -23394 -18389 6490 63698 -157556 77396 33172 -125735 -6305 336554 119824
4687 94666 38733 10853 288667 20528 61888 10491 -299203 -3923 -3992 180295 167538 -32258
4674 -56429 57123 -57650 -167320 343012 98186 119471 -53246 -175554 96319 -178721 -429692
4663 -429692 -84220 -77010 416726 -103712 11458 -107376 81595 103389 19489 -16351 -90401
4652 -90401 354917 -283954 -135487 141895 349557 -86822 -91901 -123920 -108300 296707 145763
4640 16613 85915 58541 328511 -137150 -20422 -108863 -222448 39280 270377 334464 129126
4628 73291 22248 -100384 -42640 154950 62299 162754 -85573 340889 -47280 97503 -84706
4616 60655 -5231 252000 103549 157383 238044 -248125 102102 -1913 61796 -274332 -13196
4604 165062 -66833 -7961 -305920 44795 -62722 -257767 -296113 -236814 133088 -71458 -40998
4593 -40998 16269 -38946 -7003 -108907 48421 -225083 303791 -89917 -94715 231075 -150959
4581 -65513 251522 375985 451362 -26300 79187 -54286 116776 257624 -128682 -80300 316423
4569 -59572 -39201 13900 -456525 -35545 90027 -92697 -203534 44381 32779 -2336 -52476 246147
4556 -46896 -83541 -73925 -112715 227529 -266083 -22535 -5295 38349 -454959 175485 -75144
4544 6257 156871 -33252 -155746 -136927 186115 -249432 -87626 -60948 -54880 142532 63610
4532 104015 -36286 126439 -98395 -37824 150542 285415 281854 263996 -29328 -116270 13556
4520 104047 195196 43508 48138 135357 -199000 -356732 -99263 172315 191931 10968 1955
4508 344633 186574 -114546 94094 376268 -229957 141435 77818 84171 224330 -67946 97480
4496 238546 179816 -269388 35627 81681 93073 106691 156634 -133206 311951 323313 118398
4484 -31312 93898 -165500 49309 -90464 271462 -148265 84367 133253 31791 -22669 42528
$$ [...]
##END NTUPLES=NMR SPECTRUM
##END=
