
##TITLE=AC1414_VIERS12223_7653325_TJb4ygoicq
##JCAMPDX= 6.0         $$ Bruker NMR JCAMP-DX V2.0
##DATA TYPE= NMR SPECTRUM
##DATA CLASS= NTUPLES
##ORIGIN= BRUKER
##OWNER= Administrator
$$ 1.72 TOPSPIN		Version 2.1
$$ 2013-03-20 00:28:12.748 -0500  Administrator@X
$$ Compression mode = diff/dup
##.OBSERVE FREQUENCY= 400.02188249412
##.OBSERVE NUCLEUS= ^1H
##.ACQUISITION MODE= SIMULTANEOUS (DQD)
##.ACQUISITION SCHEME= undefined
##.AVERAGES= 8
##.DIGITISER RES= 22
##SPECTROMETER/DATA SYSTEM= spect
##.PULSE SEQUENCE= zg30
##.SOLVENT NAME= COFFEE_meoh
##.SHIFT REFERENCE= INTERNAL, COFFEE_meoh, 1, 14.98509
##AUDIT TRAIL= $$ (NUMBER, WHEN, WHO, WHERE, PROCESS, VERSION, WHAT)
$$ ##TITLE= Audit trail, TOPSPIN		Version 2.1
$$ ##JCAMPDX= 5.01
$$ ##ORIGIN= Bruker BioSpin GmbH
$$ ##OWNER= Administrator
$$ $$ E:\/data/COFFEE/nmr/AC1414_VIERS12223_7653325_TJb4ygoicq/10/pdata/1/auditp.txt
$$ ##AUDIT TRAIL=  $$ (NUMBER, WHEN, WHO, WHERE, PROCESS, VERSION, WHAT)
(   1,<2013-03-20 00:28:04.607 -0500>,<Administrator>,<X>,<go>,<TOPSPIN 2.1>,
      <created by zg
	started at 2013-03-20 00:26:58.326 -0500,
	POWCHK enabled, PULCHK disabled,
       configuration hash MD5:
       86 BA 57 50 F2 9D 5C 9B 26 00 A9 28 5F 66 2E 89
       data hash MD5: 64K
       54 09 26 EF 93 B2 E7 9B 31 DB EE FD 30 22 08 91>)
(   2,<2013-03-20 00:28:07.716 -0500>,<Administrator>,<X>,<proc1d>,<TOPSPIN 2.1>,
      <Start of raw data processing
       efp LB = 0 FT_mod = 6 PKNL = 1 PHC0 = 0 PHC1 = 0 SI = 32K 
       data hash MD5: 32K
       52 DB D4 71 91 3F 35 42 8D 71 83 FC 77 EC D9 A6>)
(   3,<2013-03-20 00:28:08.185 -0500>,<Administrator>,<X>,<proc1d>,<TOPSPIN 2.1>,
      <pk PHC0 = 100.6567 PHC1 = 0 
       data hash MD5: 32K
       07 4A 8B B8 0B 4F EA E1 8C 5D CA 53 D0 F1 A5 FF>)
(   4,<2013-03-20 00:28:08.420 -0500>,<Administrator>,<X>,<proc1d>,<TOPSPIN 2.1>,
      <abs ABSG = 1 
       data hash MD5: 32K
       E2 0D CA 0A 6F 0B ED 21 48 EA 7E 38 6E F7 87 71>)
(   5,<2013-03-20 00:28:08.576 -0500>,<Administrator>,<X>,<proc1d>,<TOPSPIN 2.1>,
      <abs ABSG = 2 
       data hash MD5: 32K
       FB 33 B1 93 45 CF 33 9E C1 84 37 AC 75 1B F4 67>)
(   6,<2013-03-20 00:28:08.716 -0500>,<Administrator>,<X>,<proc1d>,<TOPSPIN 2.1>,
      <abs ABSG = 3 
       data hash MD5: 32K
       92 36 CA B8 7E AA 3E EA 4B 68 76 8F 5E A0 3E 25>)
(   7,<2013-03-20 00:28:08.857 -0500>,<Administrator>,<X>,<proc1d>,<TOPSPIN 2.1>,
      <abs ABSG = 4 
       data hash MD5: 32K
       6F CB 86 77 18 12 7E F7 FD 3D 2E 53 91 FD 6F 7C>)
(   8,<2013-03-20 00:28:09.013 -0500>,<Administrator>,<X>,<proc1d>,<TOPSPIN 2.1>,
      <abs ABSG = 5 
       data hash MD5: 32K
       23 1E BA 25 6D 03 26 68 91 C1 77 2F ED DC 02 9A>)
$$ ##END=
$$ 
$$ $$ hash MD5
$$ $$ 93 64 2F 6A 54 B2 04 8C 8E 91 E4 ED E9 47 FC CB
##$RELAX= 
##$RELAX= 
##$RELAX= 
##$RELAX= 
##$RELAX= 
##$RELAX= 
##$RELAX= 
$$ Bruker specific parameters
$$ --------------------------
##$DU= <E:\>
##$EXPNO= 10
##$NAME= <AC1414_VIERS12223_7653325_TJb4ygoicq>
$$ [...]
150 150 150 150 150 150 150 150
##$TP07= 0
##$TPNAME0= <>
##$TPNAME1= <>
##$TPNAME2= <>
##$TPNAME3= <>
##$TPNAME4= <>
##$TPNAME5= <>
##$TPNAME6= <>
##$TPNAME7= <>
##$TPOAL= (0..7)
0.5 0.5 0.5 0.5 0.5 0.5 0.5 0.5
##$TPOFFS= (0..7)
0 0 0 0 0 0 0 0
##$TUNHIN= 0
##$TUNHOUT= 0
##$TUNXOUT= 0
##$USERA1= <user>
##$USERA2= <user>
##$USERA3= <user>
##$USERA4= <user>
##$USERA5= <user>
##$V9= 5
##$VALIST= <valist>
##$VCLIST= <CCCCCCCCCCCCCCC>
##$VD= 0
##$VDLIST= <DDDDDDDDDDDDDDD>
##$VPLIST= <PPPPPPPPPPPPPPP>
##$VTLIST= <TTTTTTTTTTTTTTT>
##$WBST= 2048
##$WBSW= 25
##$XGAIN= (0..3)
0 0 0 0
##$XL= 0
##$YL= 0
##$YMAX_a= 655697
##$YMIN_a= -559708
##$ZGOPTNS= <>
##$ZL1= 120
##$ZL2= 120
##$ZL3= 120
##$ZL4= 120
##$ABSF1= 14.98509
##$ABSF2= -5.573092
##$ABSG= 5
##$ABSL= 3
##$ALPHA= 0
##$AQORDER= 0
##$ASSFAC= 0
##$ASSFACI= 0
##$ASSFACX= 0
##$ASSWID= 0
##$AUNMP= <proc_prof1d_extract_pilot.lims>
##$AXLEFT= 0
##$AXNAME= <>
##$AXNUC= <1H>
##$AXRIGHT= 0
##$AXTYPE= 0
##$AXUNIT= <>
##$AZFE= 0.1
##$AZFW= 0.1
##$BCFW= 0
##$BC_mod= 0
##$BYTORDP= 0
##$COROFFS= 0
##$CY= 15
##$DATMOD= 1
##$DC= 0
##$DFILT= <>
##$DTYPP= 0
##$F1P= 0
##$F2P= 0
##$FCOR= 0.5
##$FTSIZE= 32768
##$FT_mod= 6
##$GAMMA= 0
##$GB= 0
##$INTBC= 1
##$INTSCL= 1
##$ISEN= 128
##$LB= 0
##$LEV0= 0
##$LPBIN= 0
##$MAXI= 10000
##$MC2= 0
##$MEAN= 0
##$ME_mod= 0
##$MI= 0
##$NCOEF= 0
##$NC_proc= -8
##$NLEV= 6
##$NOISF1= 0
##$NOISF2= 0
##$NSP= 0
##$NTH_PI= 0
##$NZP= 0
##$OFFSET= 14.98509
##$PC= 1
##$PHC0= 100.6567
##$PHC1= 0
##$PH_mod= 1
##$PKNL= yes
##$PPARMOD= 0
##$PPDIAG= 0
##$PPIPTYP= 0
##$PPMPNUM= 2147483647
##$PPRESOL= 1
##$PSCAL= 4
##$PSIGN= 0
##$PYNMP= <proc.py>
##$REVERSE= no
##$SF= 400.02
##$SI= 32768
##$SIGF1= 0
##$SIGF2= 0
##$SINO= 400
##$SIOLD= 32768
##$SPECTYP= <>
##$SREGLST= <1H.CDCl3>
##$SSB= 0
##$STSI= 32768
##$STSR= 0
##$SW_p= 8223.68421052631
##$SYMM= 0
##$S_DEV= 0
##$TDeff= 65536
##$TDoff= 0
##$TI= <>
##$TILT= no
##$TM1= 0
##$TM2= 0
##$TOPLEV= 0
##$USERP1= <user>
##$USERP2= <user>
##$USERP3= <user>
##$USERP4= <user>
##$USERP5= <user>
##$WDW= 1
##$XDIM= 32768
##$YMAX_p= 463209034
##$YMIN_p= -674882
##$CURPLOT= <Network HP LaserJet P1505>
##$CURPRIN= <$Network HP LaserJet P1505>
##$DFORMAT= <normdp>
##$LAYOUT= <+/1D_H.xwp>
##$LFORMAT= <normlp>
##$PFORMAT= <normpl>
##$SURQMSG= 1
$$ End of Bruker specific parameters
$$ ---------------------------------
##NTUPLES= NMR SPECTRUM
##VAR_NAME=  FREQUENCY,     SPECTRUM/REAL,   SPECTRUM/IMAG
##SYMBOL=    X,             R,               I
##VAR_TYPE=  INDEPENDENT,   DEPENDENT,       DEPENDENT
##VAR_FORM=  AFFN,          ASDF,            ASDF
##VAR_DIM=   32768,         32768,           32768
##UNITS=     HZ,            ARBITRARY UNITS, ARBITRARY UNITS
##FACTOR=    0.250966925370066, 1,           1
##FIRST=     8223.43324360094, -85897,       -201308
##LAST=      0,             -64050,          -76929
##MIN=       0,             -674882,         0
##MAX=       8223.43324360094, 463209034,    0
$$ Real data points
##PAGE= N=1
##DATA TABLE= (X++(R..R)), XYDATA
$$ [...]
23878 26367 36466 21514 -48669 36996 -15318 25385 75819 -102353 -161901 243698 111020
23866 -50921 6411 -90421 242067 64639 138281 -22241 66557 276572 -10126 -425670 264967
23854 -108614 310399 -82299 -150664 48990 601198 -170264 -97960 97159 62120 -281794 -11107
23842 -442537 -24534 -39267 71154 172586 21732 -50993 -191304 171995 156225 15031 126538
23831 126538 93265 -3918 -120183 -143097 81760 191487 218592 -102866 -21743 -37189 331442
23819 -2545 -55330 -182246 -189895 119890 -21011 -35298 -258380 146828 60154 -16829 79480
23807 21408 -360 37251 -114932 42451 36361 48673 200943 -66979 -168404 228874 -18731
23795 -281463 218862 147936 75053 18767 76503 67322 -313101 -171263 -50496 -161465 -209397
23784 -209397 -316041 86492 -15062 -27917 66859 -81862 -35858 201626 85216 -204135 -6499
23772 -97392 -109116 263270 -62458 60287 -155593 51316 17740 5666 -414331 -158158 69268
23760 -147595 -29696 98922 187363 2381 -51214 -295557 -268146 -85012 206397 -110537 -400320
23749 -400320 -211260 -53007 130798 -201939 -131024 -175011 159958 -57893 -198125 -241733
23739 -241733 224580 154851 143841 -164932 -234083 178418 -23390 -29263 84232 182125 108441
23728 108441 -116968 142595 -20592 -166226 -54715 33121 -139166 72885 -182605 -34691
23717 -66995 -170728 32675 2697 335337 240573 67968 87726 -54421 -54849 219461 -344673
23705 366464 -33896 151061 -138068 55912 -79155 -240223 161961 -99978 -195324 -35089 63565
23693 176773 -111858 -270292 39911 184539 -48724 -74597 -347375 -132222 -178260 310804
23682 277368 244950 -52620 -130879 24139 99397 -206434 197045 274485 250110 -389464 124591
23670 25796 -197693 73685 194426 32218 -190764 285294 -100820 275399 97074 13490
23659 -23412 -93582 -27232 34491 369486 -95032 -49582 -100688 -34233 133178 18961 194453
23648 194453 -220037 -118765 91786 -47595 54799 -128487 115175 -33770 -122046 125050
23637 -261133 13589 -137845 78823 44635 -95084 -418617 -163948 -75988 -65673 -120518 -30419
23625 227879 -145352 83949 -236691 29141 -235864 62386 95052 -185991 5615 275549 310777
23614 310777 -43154 5527 -284653 111874 -25311 26806 -286542 -69917 98176 154392 -61217
23602 -67484 27654 -123041 292992 325712 77865 -266164 -263098 15552 -139747 39444 -39416
23590 150017 -4596 40719 -15419 -218232 352083 84050 27337 4809 83472 250498 212152
23579 212152 -22800 -36827 147804 147053 230344 -24846 -128656 99910 274810 -44139 -20160
23567 214510 396538 -14004 114447 -136813 -290797 44148 -5243 167825 86440 425190
23557 425190 197254 -208518 -97088 42137 -111817 -196850 -175379 83662 -166253 208065
23546 -188301 164438 -217487 170626 -98228 -447416 143429 21159 155285 -126219 -152621
23536 -152621 -99510 66748 -55013 -37400 -110230 14956 189976 361997 -146426 164564 173739
23525 173739 -59876 20287 -206364 -111836 -19515 -227343 -178619 -381640 146895 -26705 100101
23513 -104705 -523397 133005 160699 18853 194006 205364 -64465 67464 202183 -13039 58471
23501 133842 -270973 -224282 167773 189797 -58595 40969 -137213 4563 -25480 -397617 45239
23489 -204209 -164981 -138782 -71295 15280 -135883 80077 -154531 -77925 -244800 185770 -101411
23477 197145 95898 161362 -203834 59270 226252 -185038 233787 -289970 95237 -195150
23466 49941 17304 109408 -35892 -126451 78727 136661 53638 -156943 52509 -78387 -204173
23455 -204173 51525 -135972 174674 92154 -292000 -68589 -3832 28757 -9364 107587 -264867
23443 132504 -112119 199667 100940 276961 -35344 -209839 -156572 179117 -204714 39471
23432 -111957 261757 53238 -101699 16682 -222902 -233911 49068 138605 -272353 55400 -38734
23420 431999 370208 29269 231532 -54405 -160685 50900 207455 153740 -114380 -176654 -86258
23408 122108 269645 2386 6144 122243 377892 -95870 -9144 114475 110334 190362 22520
23396 97522 -68337 150832 -72193 109471 -113385 -84540 -142497 -84601 -187430 -3961 252717
23384 79566 -160536 -141069 42666 -77665 -136190 -81242 21838 -389552 -188159 -119954 -196503
23373 -196503 421991 -104609 154986 34813 175960 172358 40797 -217325 198740 -169189
23362 -59308 -209059 250532 385572 156787 127736 75608 -65346 -193879 -269135 -275878 71378
23350 3448 185430 156755 -191467 -10345 -99432 -258071 -60447 -33354 317798 -62493 91898
23338 -23625 -155722 -186321 -17222 9850 67001 -248068 -385737 84351 79235 -14013 -54921
23327 -54921 72415 113296 -182885 46380 166911 40701 -148823 -201400 158846 -125815 159228
23315 166448 10959 269084 -99812 -199332 -136927 140548 41850 -236137 86754 -43199 -14648
23303 1775 -229300 193373 -102526 -238566 108508 87107 -276137 89904 333769 -63956
23292 -184723 -53416 35395 -973 -14430 93609 27310 -15584 34328 -72942 -500476 193475
23280 63590 99596 129639 196530 -53134 -188543 -138737 164923 -167052 -74214 79809 132645
23269 132645 44666 -160038 -81196 71065 39589 72791 -35258 -57283 86479 48496 -88750
23257 -70511 -108647 74462 167662 55107 -447860 89674 -48953 -19087 -30120 97075 44839
23245 -200255 -36835 233959 89630 129947 186138 -360210 98556 102871 -10836 2115 16603
23234 16603 -299070 -39390 222215 270168 -193607 -70468 327736 188224 -45828 257950
23223 163310 -70641 -156428 -153396 264372 194867 96947 -128311 -37510 85679 -8308 -409070
23212 -409070 196710 91562 -43263 -197656 -107531 131540 -450451 -94336 -178995 -135889 -210993
23201 -210993 -63248 -175077 -219710 106694 -20316 84942 -162171 -17102 -157247 -199035 -24151
23189 -62834 -403058 -222583 -155846 -113706 141426 65856 57263 173921 50912 217342 -84180
23177 159040 -599028 81494 125360 123775 -5739 -170013 -164373 333623 57462 -3285 97222 -77061
23164 -32191 -222129 -322398 49159 59377 190359 114306 91169 -87452 21213 -352703 -108323
23152 -257919 64422 3255 -170726 17757 -15234 84113 -9575 -87383 34052 -186436 -70271
23140 232886 -267363 -56652 71093 -26119 278761 239077 -17154 -103367 -251002 195443 72504
23128 -269864 -4685 506 -278853 -95725 -195348 -87026 23480 25654 83942 48103 -77784 109868
23115 29797 -135767 88981 52830 -304915 -68185 -46170 -28374 -309912 84500 47103 344435
23104 344435 -152610 -131865 -16559 -386148 -297653 209441 149520 -141488 -104539 38548 -60390
23092 146935 -188965 50156 162122 221683 302857 113463 -30570 58444 -193290 -10384 -47877
23081 -47877 11260 -100640 185617 -156017 -175444 -11301 -60021 -39141 -334587 126234 -202602
23069 121866 -69174 73667 -44167 -24844 -212472 -22168 340028 66996 -104288 122799 -162262
23057 -14188 -391436 211233 -44921 10291 84844 146180 220888 -55024 -51808 6034 -151523
23045 -137686 -121645 180155 267092 231291 87630 -136772 -279339 -115283 231192 35389
23034 158328 8084 104934 227069 -48267 -115116 -109603 -4040 16289 -298969 -60086 -308900
23023 -308900 150648 269045 -13065 -30571 -362577 -41814 30458 -42875 364316 7145 184807
23012 184807 227569 187562 41372 124404 94217 -218486 76838 -44555 -23274 -61584 -309002
23001 -309002 -86744 238924 -207702 129973 93743 22449 373647 -100658 -201120 -23963
22990 -188124 -38917 -327702 129007 -255321 -216214 -97770 -73219 194210 -6479 -94174 128274
22978 -185232 171335 -83981 -104961 -159429 -228836 61991 -45381 -288604 -166796 430955 158245
22966 -101925 -254326 -179589 -115512 -172628 -139391 33202 -188441 79494 -90414 -213178 225161
22954 -30903 -99653 74669 -108101 114639 -282706 224018 -57732 1099 -16444 -32303 73530
22942 189547 104245 192973 -42795 -319565 -41830 -18821 -73456 -273536 85930 19717 100555
22931 100555 221073 -191116 -44024 -262393 191915 -19042 110960 -81095 142919 221510
22921 221510 180540 -193933 -46233 -361355 65675 -99899 -222697 -15827 -20244 53780 -186703
22909 -56909 278457 60018 -235529 -172262 -54441 175780 -170732 -5480 -64660 51023 -315848
22897 91259 -7866 -80894 -154093 136477 -92829 172898 -10546 -44185 -156188 -118279 -42228
22885 -7495 211766 258670 -207872 182961 -86354 -292872 -62402 -62196 219111 103527 -208596
22873 21059 -162570 -96579 80342 -8119 -260856 -16711 -27610 -231717 246430 -169392 104157
22861 125781 125111 49180 -293627 -310967 -223580 -21191 -144564 -70620 -76452 -323589 31190
22849 -143669 -108283 39461 261065 -168070 124148 110482 -92690 204497 -62821 -115755 44202
22837 -153046 128863 -107709 70664 479530 31003 -117796 -170495 -233789 31866 6236 -276936
22825 -20271 -24566 117881 895 64855 -32853 169120 -211456 -109631 159569 -296029 65363
22813 179050 77486 51605 6270 14799 8584 247175 -10904 35177 76553 -10455 -433968 190068
22800 155388 276941 -170658 -99061 -204528 -21914 91609 -144616 -65874 -174711 -41174
22789 102836 -42668 9541 26990 -133665 -232946 87797 -218087 -100074 -180646 -100179 62531
22777 -37972 -113956 -32937 -97189 -59901 -354161 173271 -106039 93423 -162447 -212115 -333728
22766 -333728 -115589 65727 -221173 -426373 -246318 -317883 284694 13235 -193779 -43593
22755 -195103 -55297 199046 382255 -196584 -143533 213439 -19168 -99282 132166 -140831
22744 98495 64854 66709 -11124 1822 -39243 57034 -43578 -53107 -132719 -156847 5016 264366
22732 264366 -29268 -35451 -42296 -69238 -26201 -342300 52172 125084 39241 -252180 -160415
22721 -160415 -189312 404204 -138216 190374 -106370 24858 176112 -224250 36679 4021
22710 -395360 75935 -224259 -172333 197751 -47657 46582 60210 -12514 -238766 223433 40094
22698 125139 39813 127463 307054 -89164 -184106 164148 -326172 -197024 304057 208723
22688 208723 -182929 -24852 -245279 68044 232945 -54760 -79306 159575 -166811 -312401
22678 -312401 139726 3492 692 -169092 4786 -109811 19558 99441 290155 95752 214909
22667 214909 -221432 135108 -3460 -231993 50032 38872 48517 -133048 136120 141853 -247990
22655 -43058 -147528 -248770 -42208 -6704 -48258 236978 3258 88792 43689 172674 -8132
22643 113676 -62233 71410 -212853 -89005 61948 -102232 -253882 -269978 -179793 6396 -41323
22631 -5368 -293560 -78481 46363 -99103 -216321 -382254 256259 41480 173539 225313 -122178
22619 -77641 -177900 224723 38136 -89526 -247065 -221240 121077 -209535 -130450 171928
22608 -146999 -340193 -111993 261530 191295 76962 28909 -46515 -351376 160441 128299
22598 128299 -16322 -168145 226512 -122469 -69732 159437 -107106 -103344 190779 127976
22588 127976 248661 -152019 220009 168446 14247 124281 -209310 -269992 161259 -29907
22577 -45122 -132035 -55688 81895 74296 -155328 -193729 -123402 -126744 100838 -273886 -69220
22565 -387320 -115792 -289459 -51004 75520 -1113 52562 103238 -136073 61555 -21632 -184083
22554 -184083 54307 122872 -134749 -200763 78242 412 -77607 190419 -241639 -224273 -66229
22542 -3782 -96252 -225533 -203053 -85494 -136300 89445 -27396 -173188 30966 -137395 69856
22530 -119066 -152805 -50281 45535 105454 -11499 129174 -152259 -17356 120101 166262 -28792
22518 243900 -1862 -152252 98489 109718 -155276 -199313 -346661 -158651 -45552 18951 -108539
22506 -252992 -105159 -368216 -11961 429631 -151544 -1733 -28387 -326725 -227588 -257823 -10859
22494 61158 46485 89994 -203944 110496 -56837 16913 -25202 85591 -92751 -11067 -77168
22483 -77168 -272409 154837 100622 -45641 34487 -25924 117734 229063 -20556 19739 62847
22472 62847 -124996 112990 -243516 852 -53982 -342359 62032 -68929 74737 -179221 -17224
22460 -72479 -224994 32082 -96678 -27718 -11687 -38975 177222 120535 -139177 106171 36730
22448 20386 36848 -205717 -119415 -180065 33247 -80834 289602 398133 -110834 21699 -215437
22436 -7075 -459226 94630 58349 -79412 -1478 74146 61837 128906 -14074 29975 -16990 68153
22423 -48198 159526 39462 -69990 40347 -100622 65326 61200 182354 138439 -143263 116154
22411 -447249 242095 28908 112821 -133239 -147010 349567 26781 82454 -87217 -56382 36331
22399 199004 -114969 -85955 -266983 -58502 121651 152201 165847 171084 132232 12939 -100563
22387 109977 -236232 -62473 309567 -142044 148247 591601 174908 22640 -49631 -223414
22377 -223414 -30305 -127986 -104608 98187 23005 127508 -36629 -97599 -56943 157054 -152047
22365 117977 -135622 -54427 290050 -89443 -378776 -960 -73495 -87698 -174704 -115202 287098
22353 -16299 -198710 -141972 -24555 -282431 -19403 -179777 -181195 -166664 22721 164037 19569
22341 -58773 -83567 -1784 -4618 168737 -75671 -339025 -18974 -16378 -403327 82552 -56165 125448
22328 25377 231859 -10125 115239 342835 8928 -205428 53028 -244385 168319 36665 244096
22317 244096 -254032 -133057 -267940 -62433 -279620 -86472 -388020 -308578 17598 -105844
22306 -146155 19345 184896 87510 -74449 172864 38381 -86575 -98590 59532 -115896 -52671
22294 -193637 -26148 -66465 -192226 22692 -60089 -40929 -147356 -325442 9696 -155042 22712
22282 -241344 -199520 151968 192886 210262 -116602 -277273 -91119 37285 -218876 -221814 621298
22270 -1496 119328 158657 -159377 -194321 78307 -147760 235430 -7689 33055 114960 -128145
22258 33558 -145962 -23836 165820 135151 -52115 50809 -8325 66718 -140606 54396 100688
22247 100688 -134507 -32911 63527 -218352 59905 -160012 184822 -268007 -101218 -254296
22237 -254296 -165149 43645 -236797 36898 5831 4518 84866 105641 -298705 7767 -79988 -156748
22225 -156748 -106831 -104478 -489357 10805 9178 255675 62697 -206200 -260524 -177832 -71478
22213 102661 -2667 -6412 -67903 48758 -185888 -314456 -204580 318922 -280906 121831 17696
22201 -121682 145038 -262013 240847 -344412 119553 -222731 -99197 -307532 -266219 -148681
22191 -148681 -153179 -72101 75120 16618 42473 -2832 -221053 -95790 142771 -2618 5897 -27133
22178 -277305 90330 -274087 -81537 85604 -201892 -55634 -404033 63941 -305247 -86324 331678
22166 -229043 -8104 -55488 125160 190560 -113630 -233463 -43654 -341689 -231932 -263074 -107830
22154 6940 196808 -140075 -113041 11618 43496 98704 50647 -118431 99144 492631 -55409
22142 277741 321044 226254 4698 133303 -349387 -254611 -128631 -94410 148860 -103220 -90461
22131 -90461 134088 184603 81831 -193641 -237278 12526 -108324 -119600 -54138 -173385 -200323
22120 -200323 7285 -66917 -12340 137783 -284550 -55707 121369 144663 167257 81425 675
22108 -213463 -108648 -112483 -14727 -260118 -34835 -312187 148711 60205 229000 6573 99150
22097 99150 -216155 136448 -137336 -50575 -120949 -162153 -13535 68130 -435431 -119583 -124524
22086 -124524 -151762 -36192 -6454 -3567 -58160 299991 -133663 -62965 -72319 -184854 -186022 -222994
22074 -222994 159703 -398803 -28486 19080 -73212 6198 -299252 138403 3303 114564 -94411
22062 -412137 54851 -150928 117484 -28328 -143082 55920 -298613 -39206 -1917 -95820 151362
22050 115205 -53684 -215054 202998 -106747 -223557 -53627 38669 -30178 103269 387265
22040 387265 -202363 120669 78696 217421 2252 142005 74906 258766 -181797 -87572
22029 -307357 -207301 90816 210953 -201000 -201935 -139753 -114778 8301 307413 -192690 -244986
22018 -244986 -71805 59908 123907 298952 4091 -102597 -30550 373853 53800 137093 -83178
22006 38572 179484 -134206 108990 1261 -34442 -15572 -249985 -233406 -10508 48624 -74601
21994 -5933 -200774 390438 15426 -186935 -430886 -499821 -9459 -59726 38292 39439 -2771 -88263
21982 -88263 195420 -5604 244967 -50706 -253279 -136816 192812 6868 -192512 116153 -362903
21970 28092 103178 -3292 85102 -199095 148955 65945 -215335 -221747 44058 -25583 105207
21958 -241849 121304 -142028 -341136 -253541 55595 -101926 -72991 115506 -71946 -111968
21948 -111968 96620 293949 -50188 114667 -291397 170292 230075 -137369 82213 -109075
21937 -2119 -285997 68294 -167313 111989 -200400 -60435 229775 -168290 -85392 -56972 99444
21925 -382781 -342194 -149002 261687 138076 -78032 23709 -50610 -17569 -60393 -22898 93278
21913 49449 -65959 -130593 -331493 -135230 90014 149848 -127863 -35203 441866 215107 -290356
21901 -3350 -311621 -226182 -163420 -296971 98793 219748 -182640 -131159 -72804 -198549 116914
21889 -53141 40991 -338548 -56198 -240485 229839 85703 -109461 -29994 -103752 252996 18066
21877 -323512 283443 -182128 -22208 -179737 99392 107186 -203628 -145022 -137273 13317 -66951
21865 -42895 -100295 -111445 -116630 128604 -119494 -116593 120559 -119676 -269374 -306909 27430
21853 313508 -156729 -216404 173835 66111 -297567 178560 -60613 -128431 -132203 199601 -60258
21841 -262027 -16819 -139198 -166976 -205924 -18679 -2678 -92675 59466 -399 -78927 143401 63580
21828 -52942 -215689 78526 -38662 -192280 219232 192662 -122285 -52206 -98027 -97091 16168
21816 -121678 65665 19390 153918 -111101 -67427 202129 -97890 301788 -141543 -372983
21806 -372983 83846 -38395 -44913 -101535 -103393 -317914 -213489 -38900 73754 -294177 180168
21794 140171 -109869 -250678 -133176 -191533 -93799 18663 -52602 30394 -264939 -84665 -30990
21782 -79206 -126677 -314654 -177431 -121983 -225508 85619 48852 8055 142893 -121343 194156
21770 -150926 170972 -253642 -157513 -67543 -130410 -81121 -45068 -67718 -152221 -160084 251798
21758 20778 -333532 21997 334186 257278 -18770 -26599 -25851 -313778 137553 166349 -501618
21746 66159 -343824 -227161 -43540 -7835 -227746 -170776 220128 -193333 -386438 21983 -288149
21734 -105650 149652 136052 90743 11161 24160 256309 19203 -258179 20296 -78080 -103569
21723 -103569 61298 111605 -15371 106194 61329 124895 184077 173492 -98756 -220892 -136486
21712 -136486 -58297 64347 148608 -69302 232039 -48635 165027 88630 -124704 -205752 -365911
21701 -365911 83194 -30098 -47520 -598069 64827 151274 -68660 -84163 -200056 60040 -240748
21689 -100464 -18910 40218 322648 98628 90132 63340 85198 114539 -168124 83172 135606
21678 135606 190900 47842 76492 -3820 -147221 169665 -29409 246324 -296374 -228174 -177609
21667 -177609 -20863 -42986 -53332 -36123 35718 -213539 130788 -10883 -6086 -108634 127638
21655 -97229 51143 117823 30631 -10365 -221917 -16093 24221 7161 31221 -309270 -66633
21643 51679 -179827 50038 -177265 -27539 -228677 -11495 -49229 -79020 354188 -227352 -184768
21632 -184768 -134980 -230341 339621 -89290 -68154 -153727 119899 -19513 248065 -349999 -293732
21621 -293732 131028 -138358 313795 -170107 105353 260898 -238955 -7120 -107666 -206557
21611 -206557 -54963 -145467 86109 -407439 62592 -405185 -64538 68987 89817 -329598 80415
21599 103609 -27618 -170094 -130524 163566 -274652 85377 1947 -170025 -264414 -1703 160151
21587 333130 169469 -15339 153918 -134765 -234145 -306957 8871 22121 -179305 -219847 244177
21575 -249570 -69231 -36457 3467 281189 165904 11428 21480 142157 214490 91284 -332373
21563 -31307 -250536 -262102 -192225 230259 212779 143082 -195242 158600 -148745 -291268
21553 -291268 -148144 226979 -106522 -7274 -106037 -164454 4331 43761 -21184 -56324 -225900
21542 -225900 -51888 -36678 -134833 -42807 -287279 -2243 141389 53341 -239628 -38597 -270708
21531 -270708 -227561 -358117 -238022 -112883 117727 -381777 -218 -104050 -355340 -72528
21520 89486 -141111 -19476 89 -16966 70400 -158874 -405437 -29475 -301872 -49962 162538
21508 -50590 -257176 34542 -106882 -143937 -62261 -118492 -137636 -239767 -224624 -3777 -324910
21497 -324910 20078 -223592 -169169 -275887 -214670 -145289 197688 44780 59818 -140127 57127
21485 -206804 -275475 20855 71249 87744 -328403 72023 -417628 -79430 -398064 -143263 -66305
21473 205111 -229269 31227 18737 -56440 110274 -34381 -259879 -153126 -241460 39235 -265068
21461 -87061 268450 -4527 -33046 95712 235342 347259 -129400 -32690 -28057 107729 -305458
21449 30407 -153735 973 -169119 -179017 443097 -92555 -22041 286032 71568 26158 65569
21438 65569 249762 429148 231179 364905 352960 388090 39544 -327382 -207057 197917
21427 5549 -16193 -146485 -96535 249165 97220 23343 252811 -73442 -8684 394980 -20806
21415 223499 -73951 151859 -345060 215745 47256 -135054 50439 142793 341726 131212
21404 325823 -40739 87664 80851 37035 -152087 152012 256286 -67651 -61139 -40536 -227520
21393 -227520 -109502 -245552 114135 -41702 -71844 -16832 205359 -67449 107357 141935
21383 141935 4949 -122940 -372722 -83831 -63025 -197490 -274913 -138930 104573 -28634 -52224
21372 -52224 -265786 335788 189791 109580 -96399 28626 16918 -169925 151398 -178975
21361 68694 -78860 -142217 -65524 -23735 -188441 198417 -463714 -385090 -56489 188159 112150
21350 112150 178398 -185221 -165211 -35053 -69786 -171608 140557 -164468 -189150 -12950 169558
21338 41233 -4385 -59561 -465878 -37190 -143103 -129393 -100262 99980 -125731 106500 -316488
21326 245821 -380450 -211053 -116118 226743 205639 -25648 -91412 17982 -195600 -197680 -229032
21315 -229032 70463 -206844 8837 -522861 -178935 -62139 309860 -27178 -8914 -113111 33334
21303 52281 -67582 -35889 219230 -294599 -207478 173095 121376 -370220 37127 28708 -52783
21291 -113641 27009 27823 -175522 224120 -214657 -58425 -149179 298423 -345116 -106201 -23022
21279 -171445 248824 236731 -104042 58134 29701 182176 -49846 -291094 -99972 162533
21268 18057 -217059 7340 165569 283552 95968 -65684 126468 -213938 168824 -67691 18994
21256 -328229 -177204 -121936 -202312 26276 -5539 -59928 -28353 -484930 250688 -214706 -55882
21244 -96460 -56601 -351422 71432 -206069 199483 61774 -15575 45185 110293 -102942 -32111
21232 96029 -139483 119823 52944 123553 -72324 -218950 -179537 -290844 -253556 102842 -332098
21220 -18677 13730 242111 18635 -58462 -157394 -285830 105198 -211495 -156530 -54637 -113478
21209 -113478 -96440 17690 67946 155373 -78394 -117251 146210 -302479 -142301 -184337 5809
21197 12068 107317 -138496 -161828 228025 -219532 -155505 -297442 147118 10584 -50887 -55403
21186 -55403 15506 83926 -74154 -142354 -347918 -34051 -50123 121200 -128089 -271945 -293680
21175 -293680 -16868 182069 62082 -315488 -204062 -387361 -336939 257982 355625 83834
21164 47424 -378824 -14839 -115060 -323056 -78837 -6351 -38104 -534578 74066 -29599 122216
21152 280139 -134942 -180829 -250693 27863 145998 -86552 112196 -83581 19820 194638 -94913
21140 338585 -276691 145687 -103932 24551 258573 25009 94710 169354 -66436 82378 -134596
21128 -275597 317694 -240503 -136711 -188966 30575 -406611 -163467 -306713 -35999 -204562
21118 -204562 -100611 178824 183551 -183824 -68212 -74622 147813 -155470 -208182 211001 231536
21107 231536 -150959 -441884 106658 -124249 62798 -155454 100149 51167 -58233 -79062
21097 -79062 85466 -61991 -35377 -275779 -41055 109080 188773 118717 -55571 -169229 298187
21085 71507 -71363 -85280 -61653 -17400 142076 254867 -146521 -271606 162525 -61503 -87564
21074 -87564 111751 -129596 140688 -123880 -1874 297410 -390075 70563 125282 -226545
21063 -124018 -9412 -101762 112697 -203732 -163703 74044 23243 62205 -41805 -90803 128935
21051 323112 -117822 -202663 -173842 -267345 -91771 -76941 -99504 -22858 -403426 13511 -316094
21039 -53591 53030 286349 133684 -159628 -274840 -4988 85983 -164243 -160976 7216 -245442
21027 -12462 80084 37366 172768 -220885 -458247 154352 -202152 -357592 4895 113693
21017 113693 6709 -58529 399889 -284532 -512327 -52651 -317098 36171 -40597 -171192 -61660
21005 54167 -162568 105921 -94367 -83716 66428 7078 -46910 98877 53872 -230444 -210785
20994 -210785 -179207 -8742 -127502 94669 -9305 -191161 69809 106942 161757 -170635 -169225
20983 -169225 143424 -72400 -528495 -120952 -24752 -39118 283540 -206874 -285949 165184
20972 281530 -11164 78086 60009 -363728 -75436 8445 340135 301805 84725 -38060 -123745
20961 -123745 93784 290320 -32768 -43077 -189178 -219032 -57044 -65688 9885 119592 142726
20950 142726 -207918 -115200 -52596 197401 -1108 -119117 -198109 56934 -412759 100789 90080
20939 90080 167795 66902 72840 -208496 197009 -70121 158890 -259424 -66319 -363412 126444
20927 -43592 -141904 -4318 -116965 -84165 -318727 -56331 -232734 -6028 24959 -138076 173572
20915 -166298 -191803 -97545 63603 61720 170340 -18426 58253 348002 -144432 -8471 5179
20903 -510469 156839 -210169 -18481 -26915 135763 -224390 -412232 -124210 -197527 58553
20892 -142966 196610 -178062 16474 -8614 -154720 -68121 67698 141795 35503 166184 58950
20880 -141212 91997 -205384 87605 -124196 -7042 -210092 70257 -53941 -216664 -120886 105795
20868 123087 -193064 176850 -78541 142416 -304981 -104206 -164456 -145360 -263237 149570
20857 -392644 -48142 -82653 -177936 -139939 -122138 35443 -61645 -495484 -151439 -108900 -66808
20846 -66808 44864 228241 -108447 -219669 -298341 -100183 46425 -154644 -192660 59971 -188820
20834 -157029 4952 26908 304304 -277331 -148069 434513 81624 245257 -11292 187224
20823 -44865 -6809 155689 -193348 -31837 -169868 19774 74279 -55207 -289389 -1739 -33025
20812 -33025 -16004 131668 144977 1232 -169074 231059 -206690 176217 -49032 80227 -251727
20800 291045 66821 -33747 -88209 -110126 -61949 62657 -300822 84775 -27895 251907 -154428
20788 88854 31048 -110047 -136599 -159696 -111783 -83140 80433 -215421 321463 -143008 175696
20776 161742 -330506 44465 -57837 -327380 108441 230832 -17228 82160 -12839 -6957 184824
20764 102544 157750 -63288 250722 159360 -473244 -331462 71309 76268 -229039 -531644 -51336
20752 14012 9286 -15647 35609 -48576 -286165 -56230 -312029 -285443 -93489 -95212 -164122 -235310
20740 -235310 -92821 -22236 -100131 87524 -205484 300316 36927 44899 209142 -218548 -212656
20729 -212656 106996 172388 34776 144095 295253 -93688 -52068 4924 -245370 -167627 180082
20717 -355899 -75179 53459 251977 -317871 131318 156236 113572 -82128 168561 94076 160677
20706 160677 -283726 16807 -332447 73725 19475 -171798 -237878 -215726 119579 75939 -239775
20694 187792 -41293 -222226 7498 -95463 48949 73351 -227944 -243402 -107801 -78048 7194
20682 285680 -37952 42535 -178463 215762 -189923 -113400 -330450 138200 136592 155227 24883
20670 -469145 -309204 107453 -180169 193985 -159141 -28639 -163790 -194564 -65785 70771
20659 109746 -125385 -71704 94651 -78940 -196096 135512 -75284 -40561 -113098 -80196 210718
20647 -117608 -194120 -138191 386752 -63265 46361 -156730 -459796 -9560 16633 -301421 56925
20635 -143062 -143400 -131787 82656 -345667 -151838 -4792 -76040 -180270 -102596 -28834 701 -240
20622 -285290 -224827 98173 -55915 -165666 106429 -249380 -239401 -216981 26626 -166853 -147816
20611 -147816 -229219 45619 -139853 46731 -210418 -249162 -98703 -98194 -211003 -180758 -341311
20600 -341311 181457 -200339 -160403 37082 -67468 -319769 17613 56768 -10407 224247 -205724
20588 -82521 38157 -46661 121210 396787 76526 50516 -127797 197947 -33689 39646 11056
20576 -116138 -251661 115318 66249 121635 110158 -134023 264242 -215801 175654 -151903
20565 89743 211892 108494 -27743 -279246 172455 40916 278510 -54233 -111946 -103239 -137314
20554 -137314 43084 70426 -351510 -98511 43091 -29078 -149552 160843 -282594 -82646 89528
20542 34505 -27610 -413768 11396 -298066 205432 -108223 -6603 224912 146619 -274449 -374033
20531 -374033 -201363 55331 -104367 63865 288587 -164702 -177916 -52877 -153946 -66732
20520 -242843 199057 -297773 80026 -236509 -167589 -269574 -163268 -319588 -74496 -23137
20509 -260475 32903 -155926 7254 -99300 32453 206345 83398 -89677 11971 294955 266019
20498 266019 -12761 -245835 -244323 78737 98913 293186 -317417 -126279 -174218 118355 -275699
20486 -98932 -190265 -327948 -286185 -54530 -233721 -65676 -75752 -137419 -13210 -24250 109742
20474 -87950 158245 35276 2258 -152236 126220 -89806 -260047 -82075 7992 104826 -98338
20462 -34033 -33502 101972 -68055 27306 30698 115248 -37884 -297737 -399561 -101046 -361073
20451 -361073 -157457 145795 -10852 -34441 -263752 77650 -92700 154010 -200981 85123
20440 30830 49532 175152 180369 -54057 226440 249305 -37781 149411 -317246 -218393 48699
20428 -151487 -183575 -301452 -172163 211940 98682 -41566 94967 -154096 -26835 196268
20417 -284064 4099 154788 194313 -79807 110630 20759 -481147 -28880 70869 -219036 119754
20405 -39666 -128280 -569507 -104725 -242134 -85756 -41903 -64960 -117240 -160335 138674 -362353
20393 -406814 13173 75644 -71597 79981 -101641 6511 99065 -90016 -77313 95309 273386
20382 273386 15782 -411239 -193801 232092 -48977 -15347 -258756 -6880 -15829 -177875 -207123
20371 -207123 -455049 -42266 -382598 -120990 -62872 -95229 -44214 -108750 273184 6204 -124062
20359 -1786 -153848 166032 -415979 -154282 18395 -285055 -85100 -163021 246481 -96425 50836
20347 -236231 -14540 -56855 232816 79144 -255551 -162576 -78882 -113574 -165037 83309 -141484
20335 -99712 -241732 13962 -430816 164872 -37113 -265483 138837 -148871 20683 -204412
20324 160729 -58322 304429 -310279 120935 -148615 -64261 -97319 31187 -302506 -31085
20313 -41911 159007 10328 49183 -280340 39901 -124986 -161741 -79242 -252598 29311 -203277
20301 -205651 -45713 -218529 215181 59748 -76528 -165762 -297829 49305 -18378 -342839 7879
20289 103352 66349 -123820 229763 243140 127797 -246649 340646 35279 96735 68090
20279 68090 104455 -88768 -431971 -27024 152566 -81460 180897 -569859 -65689 -127175 25022
20267 -192811 209311 -108370 -124347 -138431 97003 -179733 -140214 -219682 68394 18741 -341507
20255 -301955 25261 -54719 89556 -263664 283587 -50263 -381810 -289410 -218331 -69874 107486
20243 57255 -25481 -172677 -226344 170719 -191221 109644 -79684 -41481 -283205 -205111 -186673
20232 -186673 151030 -60043 -414342 -406363 -165608 -160144 178185 99174 -316348 -251187 37202
20220 8930 -301158 53218 -198666 -138423 -71080 -62206 -288220 78618 246558 -229605 -56567
20208 139807 -86541 -221408 -94930 396112 -174385 -148608 14212 -327968 -52034 220633
20197 -2890 -159915 -181007 -85594 -172295 -222826 75619 -234339 94650 -216291 -70455 -316525
20186 -316525 25340 -195095 -243154 -351167 -104117 -43755 -37065 -241304 -67140 79056 102791
20175 102791 285874 65963 -215520 -137418 -142550 -157478 -134218 -294876 -282490 -77077 115489
20163 218602 49256 331193 -156575 243461 -91917 -197581 -44760 228133 -166548 104999
20152 -151911 9684 37200 -252738 26516 -90961 144075 174682 -90937 239653 84336 93289
20141 93289 -177190 343063 176378 -133663 -18309 -32038 37559 -20368 76302 204043 52138
20129 22497 -370747 -89639 -284570 80085 213308 -126086 -347522 65443 -41251 -35537 143050
20117 60236 -141158 232787 -77933 -207672 -27410 -156372 -149201 -359168 81572 167089 -269983
20105 -219678 100275 -69142 -271409 -77339 -11086 122160 37659 -190055 28631 -4361 -153511
20094 -153511 -410876 -31998 -324026 101544 -134166 61216 25370 -77827 -110394 -366760
20084 -366760 8904 -234132 -118674 -37138 -226224 -280478 116210 118145 -182955 -385396 -44960
20072 4331 160196 22831 -66505 -160207 -204553 -43025 -68023 -54653 110564 -173341 -289499
20061 -289499 -7240 -214861 207569 -117445 198837 227495 48837 -143518 79017 -333668
20050 -380679 27468 -263132 -98466 162369 -151338 -67564 232704 -192301 -148143 -271700
20040 -271700 -64323 -275726 123372 -37873 -299609 -162396 -185466 32721 13243 -215343
20029 -59904 -221671 7923 68579 47699 234000 42443 -269525 -90540 64078 111963 92039
20018 92039 -59511 113688 -73613 -431571 -32933 298256 -291049 60652 149037 -229206 -178628
20007 -178628 107084 -15100 12332 -94621 -240766 -200475 92482 122689 115421 -74966 -364066
19996 -364066 -209806 261045 -1364 -309900 54885 87339 -377634 38015 -144475 -19871 283838
19984 -124300 -31945 -5105 -108824 -121722 291220 -107156 120575 -148638 145558 -300753
19973 -113950 169784 282291 -21081 -138701 -204879 -51039 256964 -195605 -142859 -67983
19962 72734 147214 -233628 56593 -224771 318896 -217696 -126587 -4859 -81767 -62510 -17085
19950 -225749 -322636 -47639 -195716 -93653 11797 42171 -120145 -35887 -72780 213416 44598
19938 -119531 -64246 177768 101464 -25968 -150251 223440 -286719 206374 -95915 -132769
19928 -132769 -191062 -207853 -271157 -105463 153611 -301746 126185 -297808 140273 -256989
19917 384921 -277591 -169572 -161481 -133333 180803 74979 49782 -187528 -312779 203281
19906 -205422 -47147 7573 -93901 155123 -128292 -138878 -87016 -320674 51029 -163025 -12354
19894 -234300 13515 -141414 1482 78022 135998 184817 -134946 -104923 -23740 -200771 -42511
19882 94410 -194733 298049 -145739 264068 51870 -342675 -158345 424840 -76760 -156843
19872 -156843 -257932 -173347 -82575 -290314 206792 145413 -63504 51687 29935 -117691 263444
19860 -353 -165751 -117801 -94068 -245813 9124 -13448 43343 -31646 375286 -86263 245625
19848 -106337 155373 35761 79652 7433 172232 3982 -52085 167842 -167754 -236220 -33443
19836 -51028 65119 197923 76504 -105724 -154417 -299439 -196138 -83199 -299798 -7367 -37329
19825 -37329 -148394 100688 -95507 -78130 365390 193045 140260 -92379 -162413 -141382 154653
19813 -170028 67620 36623 -32281 -99198 -48878 -156647 280463 -146853 -152983 -72034 13283
19801 154003 58079 23902 -220590 -103848 -271111 -115741 -112761 -241500 -21518 -192319
19791 -192319 -145468 -116605 87927 75071 87069 -206551 -275636 -286136 -168588 -391131 -215952
19780 -215952 151223 120325 -425689 93993 105703 103409 114092 76452 -174820 -172401 -109740
19769 -109740 -226269 -171789 -305612 -180805 -135985 -205450 279906 -32841 -129486 245327
19758 157727 -15113 -36550 9769 -91356 -196048 -36090 -232542 -203185 -129280 -255336 29402
19746 131863 260672 -68428 -109867 220263 18103 105821 14108 -244571 -154076 -3289 -272452
19735 -272452 62592 -112550 -89208 -137115 -59897 -181025 173023 -109565 -121561 216163
19724 -107776 -162465 4466 -97631 -102814 -305367 99761 242055 -123748 -280577 220753 -70811
19712 -97638 136323 -463989 -61297 313449 -147944 142591 -92403 -380322 -110163 -211584
19702 -211584 -26723 253217 -269052 121008 -243807 -91077 38780 -190399 -29449 22824
19691 -57011 -89200 26368 -265942 -69748 -150015 185795 98243 -183192 6112 131422 112524
19680 112524 -167962 158569 127821 -163488 -6352 -50676 -340882 -5153 -82060 -19686 -43050
19669 -43050 -137200 -166639 -154410 43430 -89863 -103367 -178314 120450 -105440 63743 -374233
19657 227906 -281027 102422 -156220 208653 167367 15469 -219053 -71713 197314 119118
19647 119118 -1195 -40852 -191189 -54244 -101742 95310 27355 182528 -183660 -59865 -178514
19636 -178514 38514 -258265 58095 6084 -16542 52253 84411 90333 119226 -130001 -276010
19625 -276010 10572 -166566 -299787 -151780 191471 -190731 -176940 -83296 23534 -165881
19614 -160900 81105 -85517 78640 -271533 167203 25302 46410 36911 110760 -91443 -53664
19603 -53664 -238909 -73307 104922 29829 -127072 -74769 -90958 -17742 -194215 50885 -322698
19591 -112577 -47355 28545 195894 -237550 18813 57246 -208543 52451 122092 146051 -136619
19579 -8986 -361170 -140181 -63924 -232208 40134 -343370 -61613 -343295 142628 -37853 8397
19567 -139871 -260935 30259 145290 -153120 -210004 1939 -30221 50396 -111028 -311845 -353350
19556 -353350 -197560 81791 -98865 -205131 150886 -313383 -10622 101048 -51559 42717
19545 226143 -80679 412832 364616 106 236000 -3915 -214315 22531 104033 -122453 -288341
19534 -288341 -95404 -47024 62199 -46862 -163848 190534 -435680 -161492 -229456 -408042
19524 -408042 199678 -50862 -34378 -217130 -356653 -234209 179202 -209163 -92342 -269238
19514 -269238 -72002 -245017 199050 -268007 -237523 -23119 -182598 -121735 -91504 -7253 49074
19502 191773 87309 -247873 -269363 -217101 -387732 -253131 131697 -243426 -21450 180866
19491 192709 169674 -23579 169676 -110182 -97937 93056 -96935 220085 5175 7639 -190325
19479 -182700 109441 -72288 -65071 -150285 -83756 -74705 274171 -114299 -370228 222952 -85126
19467 -62784 247576 -125752 435937 -122590 62791 -248737 -86614 106153 -65150 -92630
19457 -92630 103146 -84121 -238 -303733 -125934 67237 -12081 -3235 -134505 -133125 119402
19445 -104697 -92956 -114619 193243 -138149 -193169 273239 -269123 -324480 11481 109766 -220114
19433 252445 149829 194479 -355318 -239183 -43795 140580 -216567 27527 -375913 -6957
19422 -74388 -288136 -390140 -59271 -126911 -351999 -70171 170962 -240294 -415651 -137425
19411 2823 253921 -85299 185606 19777 -43212 -74593 -309576 -328138 -70302 -427157 -65212
19399 166438 -47581 204660 -57301 -42202 -247289 -31400 57518 -456813 -262583 127124
19388 28833 -112776 -401372 -6914 -185670 -62850 35890 -290668 -47472 124759 -150298 -220550
19377 -220550 -140647 -67931 -22518 3821 113898 -87829 97849 -198581 -100004 -74955 -2444
19365 -56516 -62875 -4934 -94912 94358 102079 76404 22963 -48811 -240657 -206690 -12158 -114696
19353 -114696 -155691 -41692 -140413 -411530 -36922 -177557 -125350 -67992 -7305 -86849 -80412
19342 -80412 -204403 -90141 -46146 100820 136733 -145581 -60651 -103120 123286 -160766 133384
19330 -123384 -230360 -126556 70561 283425 -248773 -43807 266113 36957 -78656 -39654
19320 -39654 175253 -52807 -93462 550783 -127975 77596 99083 -93628 -253192 -301556 -148131
19308 -422764 -175414 43061 99402 12387 -133299 50656 -265397 -52666 -98058 56117 -293117
19296 -51060 -136058 129749 -173052 21974 -26268 110937 103043 -98759 -127485 187 -169218
19284 -39131 -183453 -154905 -102669 -239887 9281 -8271 94102 -328221 167026 -199264 -13212
19272 64755 345122 -3527 -93970 45449 -192064 33911 -197543 -80766 -60343 -16641 -83632
19261 -83632 51460 -85767 -105813 -240154 124425 -77450 -59273 -184952 11361 -404211 97381
19249 72874 -164810 -40465 -226493 33320 -184924 -273769 90870 13217 7564 191416 -68065
19237 -418399 -30867 190802 -164444 120472 62084 -18927 -223229 -218575 46141 -220607 -19416
19225 -10258 -78609 -61258 190961 117810 -544781 -10883 132543 -303737 -145615 -22181 151904
19213 111165 -239289 51423 100606 -58681 43589 -285536 66328 -288755 132152 341546
19203 341546 127942 63156 -147966 144296 -23865 -164295 46412 -10313 -116687 168108
19192 86612 -255618 46077 -314974 110377 54179 -160258 -1293 5215 31717 -97441 -98054 -10566
19179 -281220 -58605 -37560 -343020 257442 6574 137609 -198664 -244502 119936 81480 62945
19168 62945 -51468 241765 -16000 60868 -275275 333849 -54049 -110018 -224365 15638 42757
19157 42757 11005 -303424 -319062 193324 81338 -86047 -146682 -309527 -267654 11702 176155
19146 176155 12997 -76147 -267976 -115868 -153331 -53006 -39650 -291849 -264183 91125 -87697
19134 -392794 -58851 -118696 -131693 2221 -1280 -99052 126723 -40830 100048 -276754 -241855
19123 -241855 80520 -185283 -195449 -124559 33869 366098 134271 177329 116081 158118 -190806
19111 -201622 -119838 -266896 -278139 76719 -93830 3542 -48432 -304543 296763 35158 -48773
19099 -48911 -174141 -126550 121236 -445416 -415087 156704 7835 -18427 126270 45813 117066
19088 117066 -178718 324535 -75410 -62247 68651 -144468 -12319 131313 112251 -70007 -233750
19077 -233750 -333596 -278953 -142634 327505 142153 94256 -346931 -38775 14616 -128220
19066 -79732 15856 -174089 69791 95796 14259 36263 -60090 -186089 -188 58726 66921 42398
19054 42398 -250686 -292353 -183547 -120074 -146745 -139326 171396 -187959 -9545 -211635 -81732
19042 -387017 -303093 -126709 -5595 -415669 29211 22105 -130297 -158160 -97097 -3734 91317
19030 57385 246640 298541 75860 -4124 55786 147151 -72107 -149774 192618 370587 115499
19018 -83801 33165 -368208 169676 118430 -80235 -50631 -190250 144201 -355893 -17881 -79878
19007 -79878 169071 42657 -321288 -70821 -55139 -198594 83278 181851 -251283 -27842 -45901
18996 -45901 -272680 66353 -105580 -29197 -571 152373 -29406 -149667 -11171 -69254 -90140
18985 -90140 -118919 10590 -65944 -139088 -42840 -92113 245272 -270998 -195424 89380 25246
18973 -121272 26909 225924 -267464 18443 -12009 -191203 -294768 46666 81513 160189 160431
18962 160431 -88590 -31386 -42491 54562 138094 -132308 274005 63752 -143775 167856 -362399
18950 -107460 178884 -151713 207787 -77696 -38661 194903 -146173 43559 -171366 -64404
18939 -302771 240596 -374330 110543 -237006 -82304 -388798 -50267 -255379 -35175 93574
18928 -268550 198111 201760 498932 -200161 -61102 -75232 87428 -261902 -137932 -92190 -246203
18917 -246203 -257269 213118 99038 -242298 -283988 -118327 -18841 321047 -155846 45805
18906 -91701 -80441 126854 -17931 -197451 42332 228633 105310 119038 -178624 -20709 -98820
18895 -98820 -308455 76915 64152 41799 -178129 135675 43034 51775 37269 138171 188251
18884 188251 74565 -81677 -330455 74415 -64832 -283975 167529 -253922 237070 -180546
18873 -54234 -26168 165554 -55111 34220 -69695 11419 140612 34989 -159940 -30716 -245946
18862 -245946 274743 151879 85018 -102169 114362 -373568 -88694 9387 -180709 45629
18851 -81766 245361 -103946 -4038 162233 108366 59158 -255747 -385967 -224841 144352
18840 -83758 -59325 -119872 43416 109216 232706 -283789 -80049 268244 -41115 20356 -514008
18828 100007 -37426 -132735 -139676 -139142 -125116 49212 39470 -57426 -93263 -171030 -125600 -49734
18815 -91279 -122110 -286727 159537 258925 11001 -910 218132 -11949 428115 -94006 -193249
18804 -193249 -24269 -42827 147449 209315 -319890 356465 233875 154409 -391272 -58047
18793 29872 5683 -348757 -298233 175915 -59109 16530 33201 30517 -32055 -27698 -167598 5754
18780 -17976 -425701 -30692 83274 -119029 -9836 -13329 -18740 47502 -134039 268698 43150
18768 180436 -275318 -43439 -242160 212332 2931 216302 -36925 -168436 -229045 -176133 -42090
18756 11160 -35131 -152097 15919 33017 -2764 46259 -180102 -123845 49079 -214548 -71122
18744 -122213 121923 -42790 179196 82104 318815 67346 -114504 29814 -33970 34291 -264855
18732 -60933 119111 -246746 10917 -172366 -276752 -326323 32581 -16285 53523 -21812 -136533
18721 -136533 -209987 93448 125253 -160914 -4621 -134209 226360 -83446 10690 87305 -140184
18709 -81941 -309013 369301 190754 -22002 -305593 -130424 -309015 124834 192902 116266
18699 116266 -453875 -203724 -25739 21122 -229048 44366 -279727 -17126 117563 -196418
18688 -17422 417954 -129654 -130526 -94221 234653 -53361 177480 -275277 -243640 153727 -22374
18676 18859 58208 116204 -20021 228032 -24772 -415511 235188 -72651 20203 197433 14159
18664 71334 167275 115586 -16566 -166172 -413740 20888 27930 -142395 -14054 -11059 -85964
18653 -85964 -353634 -126950 -116726 -136804 344566 21279 11830 -349723 -12060 160848 70035
18641 12289 179156 -347923 37039 -64285 -378312 -23182 155724 -35797 -110762 178581 128497
18630 128497 -25506 -22537 -165710 32009 -113762 -185336 105253 -99744 194039 -9886 -14568
18619 -14568 123501 4558 172408 36106 -18268 -207238 -259397 -292250 -213206 -269730 -218196
18608 -218196 86746 -111697 -73174 21820 -399188 40375 31863 -30699 19557 -76040 -275678
18597 -275678 91225 303335 30566 464685 -255474 416475 -176593 -20573 177433 -13480
18586 -186822 46154 51785 51285 330317 -905 -15782 -153176 -351826 -346147 -276124 154851 -29692
18573 -392957 -107712 270734 -141519 55096 6498 -126677 -257712 -306915 -203708 6551 -293030
18561 198479 158341 28532 223408 -170427 -27172 -201046 -94586 -527234 130703 -82062
18550 -12424 -79657 -222579 -287976 46469 -38261 -152280 165657 -372883 61316 -107386 -132996
18539 -132996 -314041 -209172 122956 -66519 -73676 -40251 -68507 -147542 -36167 14168 -145082
18527 6376 87239 -13884 -116760 122941 -115485 -299808 -12283 -160685 -51076 -10618 -194964
18516 -194964 -202933 -45366 -77725 53220 30403 135153 38470 -100200 8585 -1778 119359
18504 28137 -336368 237212 -247658 159505 -256636 138663 207414 -279994 76218 82989
18494 82989 -101098 -387810 -92056 -211180 -351902 -58697 -181559 186659 -105905 124371
18483 263997 -63636 -243789 -168358 -242716 -215376 363842 105079 61891 317928 87874 -252811
18471 -317147 102905 67106 238358 13365 56654 205293 63849 -153777 -94572 -73579 -255278
18460 -255278 -364826 -240637 108833 -46528 -196020 356690 38233 -559281 -156181 36886
18449 -79291 174650 -182026 277389 81160 143868 -108993 -31087 -60787 184303 182253 -60268
18437 -43141 -39443 -351324 -285486 -122278 -63870 48800 -366906 -3097 -171416 150326 77405
18426 77405 283914 -191056 -189152 51068 80113 166756 -84041 27146 66955 -132169 -253031
18415 -253031 65929 118297 -189217 -51384 -115935 -107240 -279690 34681 329623 220146 175737
18404 175737 51419 276154 49803 35331 110378 -30808 112389 -159266 -83974 -192385 -24822
18392 -5729 -284612 -47124 -265850 73264 -107401 -219417 -3015 -7273 -46127 296168 -200346
18380 -354692 217012 -97868 88972 41033 120559 22933 -95723 107727 -101466 194125 108377
18369 108377 -98832 -33947 129190 -4069 -45878 163520 143185 -25643 -202167 -96698 -133443
18358 -133443 236496 -230614 -256848 -371732 -357452 176647 216612 612 17552 -16955 333986
18346 -29640 180768 -78151 -100504 -3933 -202802 9956 19649 -28832 -37547 10166 -13826 -196803
18334 -196803 280720 -160422 -90889 -56455 227673 81807 -9350 -54384 9430 -148835 -214554
18323 -214554 -419805 -133594 -182823 -109483 -89695 -118184 222451 -277116 -55822 -129667 16536
18311 -105496 -219609 -78684 -121174 21772 -452562 -181569 -78728 -104594 118642 1907 -200214
18299 201568 223084 88729 -47465 24852 -240099 223062 126800 -286847 -405193 62018 -160509
18287 -247803 -226178 -159052 -288911 39586 -71907 -119886 109038 -187529 23838 -150927 48488
18275 -38784 7151 -154928 15902 -332673 -288514 -433276 -12836 -53695 59577 32629 -209090
18263 159487 75167 -104205 -34336 -495519 -22701 -24014 -4568 278386 -186116 -162231 -144061
18252 -144061 -49746 123905 -84574 488988 -144772 -105909 -8203 117269 123284 115506 -120959
18240 -674882 -120669 228860 -16712 -62917 -211663 182533 193612 280611 2579 -3574 -139244
18229 -139244 -103418 92243 -122495 236171 -51713 -63760 -78196 -4462 209137 -218331 -46641
18217 11837 -147314 49105 129742 -177501 120687 -384184 -20730 102761 49541 24776 25455
18206 25455 25563 109917 135158 83115 60134 194782 69305 -311865 164812 -31926 258557
18194 -113519 419167 3073 195303 78489 -140139 125211 -582745 -203722 -240701 216304
18183 -226835 923 -35547 -124978 -45188 -41356 130214 118989 -81019 -285733 -1478 344170 -28238
18170 -154735 -58622 -188565 18533 -60899 -50498 -12299 -31609 95063 58369 -262221 182472
18158 -92389 235264 173796 -223851 -46177 97714 -99285 -85114 -6595 -137620 22575 -254519
18146 119374 245282 44726 -304710 -37587 -6900 -195381 -312273 -93560 61221 -36494 63555
18134 269116 51357 -121152 -151635 -265035 121514 35922 47081 45821 8909 32831 76184
18123 76184 -176651 -411543 161762 -59631 -200494 -442274 -60692 -177194 63144 -99242
18112 233248 -288511 -244868 71399 -300748 -46252 -190272 -83556 86295 -226575 63981 -183492
18100 -16050 131471 222791 -137233 283279 58335 -216053 252844 -79655 -134934 -278940
18090 -278940 60447 166709 -3698 -32403 -20754 308248 -271438 -94510 -96249 -103859 -57297
18079 -57297 -105273 -48072 -276701 -55883 -120022 -3861 -85166 251513 -66887 -105101 -380960
18068 -380960 9920 124507 -148709 -343430 -46052 86820 -136219 -10320 153696 -98152 16880
18056 74046 -19326 19237 5057 -83241 24217 72464 -55944 16595 -166052 -17061 -152041
18045 -152041 146926 -371299 26133 -56084 -52377 -15451 -129253 -288396 234758 62588 -388993
18033 244326 46592 -35470 146444 120428 -22858 -242590 -78356 -170156 85179 35988 13367
18021 -81512 -201962 98822 -36026 -143423 149593 236696 -527355 27393 -45861 47730 -244973
18009 -121513 265188 319766 24997 257904 -201661 201068 409455 47666 31862 300786
17999 300786 176523 12599 9077 -98912 -402120 -159620 -183244 -272441 88665 -136169 71518
17987 -127640 46225 223952 -176040 -192807 -100642 -50094 69220 287130 -357917 30912 215417
17976 215417 -12077 27187 -95573 -134458 177712 397188 174174 -12546 -261424 141748
17965 -152188 -87933 -65274 -165544 138405 171832 -151227 -252639 371945 -262036 256481
17954 -10933 -143214 -328327 181436 40936 -21815 -134355 -59412 163656 71221 26069 -72613
17942 -88343 17619 12751 279299 15574 17309 100943 -101738 -244246 -60696 -229109 -123 23805
17929 -182990 -122979 205557 -272861 -123829 -91798 -35336 -74435 291274 35429 83517 49998
17918 49998 35729 68817 228031 -6346 -212940 -49964 186089 -100996 22858 -16528 125599
17906 14507 59973 269111 -81398 95033 -39935 -77815 48391 130258 95063 -38894 -135732
17895 -135732 -11994 176123 13039 52435 244545 -8907 -151116 107403 -143351 246386
17884 261319 -66849 391 70317 -279239 -70682 -73875 82162 420905 -104728 26167 -92122
17872 32068 -105791 -111316 -43411 -271951 -316931 34004 51496 -28669 69977 -129501 -7164
17860 355568 135614 -143994 99761 109784 -221102 67052 81268 176775 -480787 -243237
17850 -243237 -188271 1080 94813 76218 22280 155678 -52118 134058 33644 329140 105719
17838 -251805 -196125 -288467 -92674 -62986 -3682 -96110 -280410 141049 43505 -98399 -197734
17827 -197734 223217 44205 -246969 -3875 -102239 -230063 -90427 -189110 148194 363502 71157
17815 39544 -272940 44304 -296065 245416 -61304 -165884 -264125 108357 37916 -137485
17804 -240776 -81592 263713 -50640 146188 -260699 -20386 119572 9554 -25171 21930 81266
17793 81266 191654 -20655 -28388 -24713 -17772 -245143 76212 129113 322883 -135103 -183170
17782 -183170 -317935 89680 64422 -142621 52584 110090 -149240 -52225 83965 407844 -88028
17770 223312 90026 55790 20294 -95521 69642 51152 -90657 374382 382404 -116820 -347951
17759 -347951 -2272 82128 -60444 -170707 158259 76849 -78653 -21232 -163734 -29013 14864
17747 207371 -179281 -1957 81733 -210678 149567 -417306 40 69354 -161491 -127342 176379
17735 -159727 -21709 105591 -298994 -32638 -185447 72906 169440 94630 -23755 -43950 -286064
17724 -286064 -344381 134820 -33761 -8481 -68675 199847 79495 135780 123759 129046 12997
17712 -290751 -15188 93160 135893 -105066 -133458 -281455 -123166 79798 97651 327063 72532
17700 -138112 -157392 -34708 -91640 -162381 -89445 323608 377960 -176869 -20406 -16086 128990
17688 -28843 162977 -176396 -68394 175463 -356599 -203108 305575 77090 67889 -62983 103594
17676 370930 -56130 131318 96099 -16648 63012 -116850 202591 151135 301976 128684
17665 39268 255024 157517 46334 -27562 -49104 214783 81738 278197 -110877 -444349 -202357
17653 194298 99942 -241504 223460 288935 29670 -35268 257707 81103 107335 196573 -170968
17641 62431 -7287 -46907 -36400 -115024 191162 -36363 61454 43669 194513 78713 74260 100782
17629 100782 -33664 -64524 60412 58986 -98227 302808 -10426 -172512 -58973 -25098 -79261
17618 -79261 19307 182959 136791 103075 -217723 -26693 -358005 -60210 279966 23128 130207
17607 130207 -231772 107446 -221155 151539 246841 -88889 61018 10641 80223 90129 -64727
17595 26752 -173908 136126 488321 201864 -152465 128601 135309 -272871 286005 174863
17585 174863 -249394 65930 -255105 -64757 183787 12459 -230879 -21215 -111331 169702
17574 -231765 -45178 56400 114042 287198 82143 -42165 65875 490985 -299640 381667 -119457
17562 159331 218466 -1328 239289 83298 -97814 -244086 -157154 63576 197035 50117 123379
17551 123379 -329976 -75686 119069 129328 425621 12809 193116 -156603 -49018 260493
17540 -26625 73234 -71704 -8702 223241 24469 43419 32503 -93032 -386198 -66554 346702
17528 74309 490284 116556 -76320 8482 -144044 -6757 137403 173488 -54431 72993 94503
17517 94503 -164294 279777 132709 -218609 -234980 32668 24436 -213676 -13782 32563 45860
17506 45860 364774 -96649 57989 124562 -50357 -157763 161522 -322608 -13951 71999 457055
17495 457055 393822 477815 268695 248632 78528 6303 344365 261706 15539 341012 -108368
17483 68052 242837 156916 94541 88765 107907 -66653 84865 326770 224801 -153565 267420
17471 297452 -195370 -61573 402728 287933 221574 145481 -39565 -20088 52150 157082 178771
17460 178771 427675 107991 165963 126072 -1918 -31632 436846 415347 335576 374628 -37974
17448 419875 370540 114851 150531 574452 214790 9107 399156 -32367 300321 485129
17438 485129 355713 -164346 411863 371535 473686 271625 508745 386751 -19082 309916
17427 -47609 160644 401473 311802 316371 344057 244594 393572 319555 -37710 126183 401241
17416 401241 352493 46154 88380 313533 370718 204800 336377 -46685 -121573 299346 112534
17404 92540 -13930 98510 256632 72633 86850 244944 271038 141859 220468 -142341 268503
17392 213531 213395 166761 415321 70230 -70523 28540 67297 42150 299123 203127 422354
17381 422354 122256 130071 -7505 76755 148049 185368 169841 71649 160007 133297 -35189 -21755
17369 -21755 78928 382864 -13988 355341 -86498 147998 53703 31063 -59046 173038 303748
17358 303748 -34043 -154806 269038 241894 266449 -109617 -75632 -369011 323330 -6223 -293892
17347 -293892 7078 200413 10553 15439 -74171 277905 -116281 -220 -165613 175756 464525
17336 464525 224243 70154 222967 244568 379406 289216 105727 403876 274301 -38965
17325 563420 77008 -17496 89076 312005 229649 109632 126252 319466 -185861 76524 79090
17314 79090 210569 -296495 103910 393234 -44301 313865 114117 -41116 -141382 -3859
17303 -111776 42197 186743 411798 255336 -14195 120860 294598 31589 101042 471893
17293 471893 26718 68297 117106 263542 92407 -72034 135370 159844 86567 -242522 651264
17281 172851 304330 113812 139927 120841 122788 375995 80699 263879 97951 -227952 124184
17269 152890 127670 226627 348315 131610 -90533 99623 466009 314351 357412 498602
17259 498602 55938 187959 209711 19606 -80699 354566 430157 388197 71456 185633 232980
17248 232980 43521 414003 302937 47100 420624 68712 2334 277310 70271 53691 -50174
17236 8420 525117 143791 322278 270727 289888 398052 225323 434754 434734 122638 107657
17225 107657 231314 89715 319862 170407 305596 383660 303310 78889 304812 202801
17215 202801 272153 275085 425293 213779 424471 -102357 229093 247308 171278 453126
17205 453126 239576 390985 232667 418571 -4303 261132 132719 303234 -23150 -14709
17195 -14709 299325 290091 286179 78432 57076 324696 202038 47787 68778 204916 209087
17184 209087 11692 25952 397400 48353 306870 160979 430751 319937 223115 392764
17174 392764 355300 -195744 347584 204020 379422 328024 159459 78653 507883 206981
17163 276144 439378 460072 551746 121474 126191 228270 277325 340617 516904 223064 253483
17152 253483 242583 280059 313833 460941 -1669 210125 121680 563628 351669 91670 309163
17141 309163 472052 208896 282558 237084 208839 296087 492045 52718 374115 238939
17131 238939 401486 488170 10422 443817 328971 366849 98983 437364 269336 372099
17121 372099 313973 77312 332437 48053 118103 477860 264743 392095 117264 -71276
17110 481712 665901 377821 196716 415507 320835 295980 145123 176606 298254 592081
17100 592081 665 204787 361474 513696 219368 258638 296718 600220 229201 220145 639244
17089 639244 471503 513933 685770 268101 547494 346481 105243 344347 162634 497730
17079 497730 392505 333218 431794 426735 295735 344967 209601 281815 736936 596128 -1903
17067 367742 504396 241346 267464 688539 373207 522693 356573 666306 371362 782377
17057 782377 709281 235635 574566 378800 395019 268953 861126 333256 222147 330428
17047 330428 441000 762877 609035 393325 780854 406461 665035 754024 673774 305647
17036 617243 766920 559792 757922 671710 576646 503136 398340 371189 118698 867631
17026 867631 825273 477126 565678 454368 563719 457136 502982 782850 709409 453610
17016 453610 653073 860280 416514 542741 491235 1044161 916828 883414 1107293 610044
17006 610044 807312 764245 470383 467779 681149 564447 668555 514287 627975 837450
16996 837450 524848 554885 836960 802538 745732 831918 487489 806044 336516 704303
16986 704303 607563 888572 541542 837218 907086 1031297 786363 1045904 887883 631173
16976 631173 828752 863856 661873 949684 770099 791485 619504 819609 785102 856745
16966 856745 877357 865217 857279 985858 1061311 1101428 732716 981472 646419 787406 986575
16955 986575 1176996 1121158 983372 839688 705710 1030695 613594 1197659 1254124 1093588
16945 1093588 802700 880264 980110 1038747 1020932 1061024 891838 1226165 1087408 1293353
16935 1293353 1225374 1099585 1187401 917645 1069684 1097327 1258742 1305748 975587 1507880
16925 1507880 1350884 1063561 1306097 1233979 1424799 1209566 1067423 1034802 1286547 1471990
16915 1471990 1563522 1419500 1465482 1387687 1447532 1193988 1657298 1545308 1446061 1298459
16905 1298459 1232598 1422788 1729950 1365877 1496955 1605656 1431386 1484923 1695357 1936520
16895 1936520 1589562 1575788 1627366 1590011 1706386 1682617 1846162 1875790 1924812 1992253 1563889
16884 1563889 1806681 1949418 1655998 1795205 1811032 2251343 2334547 1874551 2209429 1901555
16874 1901555 2557429 1875341 2025437 2191865 2267220 2238215 2300173 2285588 2325151 2228009
16864 2228009 2805323 2355340 2300465 2701980 2824310 2670442 2788382 2732953 2765173 2804583
16854 2804583 2977322 2935801 3064899 2865463 2784912 3081776 2989244 3279716 3315631 2994891
16844 2994891 3509151 3706668 3410227 3348371 3105384 3257086 3465576 3806512 4038872 3777326
16834 3777326 3890119 4061794 3616078 3969448 3813590 3835193 4375536 4510093 4391511 4430748
16824 4430748 4306443 4357520 4660954 4700627 5114143 4761666 4997354 5057597 5342105 5503135
16814 5503135 5389384 5464543 5630191 5665666 5723430 6020560 6015930 6093724 6510543 6876646
16804 6876646 6798256 6788532 6863403 7235349 7342497 7589009 7894300 7799917 8362480 8406109
16794 8406109 8447645 8376748 8583947 9006874 9130396 9472684 9990817 9846799 10398973 10805569
16784 10805569 11006604 11483559 11511249 11581849 11980941 12593630 12816174 13100887 13458222 14039350
16774 14039350 14618673 15233908 15677014 16061675 16545829 17353454 17842902 18530966 18931499
16765 18931499 19699717 20509773 21145155 21907812 23273992 23769581 24589158 25790185 26789286
16756 26789286 28274668 29168754 30693364 31962676 33588661 35104282 36329786 38100064
16748 38100064 39992488 42398001 44716152 46753299 49620890 52115585 54955729 58097767
16740 58097767 61570431 65139300 69003491 73473866 77924297 82617672 88043881 93762903
16732 93762903 99648577 106374440 112979802 120234046 128073678 136112165 144304680 152770083
16724 152770083 160996125 169287621 177326009 184896894 191601810 197122692 201942130 205146843
16716 205146843 206855678 207041561 205925639 202786940 198768290 193138366 186813956 179502151
16708 179502151 171432662 163272252 154559072 146220139 137765625 129836056 121482921 113831968
16700 113831968 106783098 100110830 93481685 87837384 82124279 77348971 72419845 68361546
16692 68361546 64131066 60187916 56902638 54042713 50513848 48118323 45162662 42919308
16684 42919308 41023045 38708195 36604175 35048545 33454403 32050131 30060732 29021159
16676 29021159 27661253 26471561 25360273 24360235 23289562 22328687 21438940 20596535
16668 20596535 19563426 18755393 18361930 17696921 16831667 16206301 15652586 15299357 14632807
16659 14632807 14342101 13441929 13045296 12811194 12262054 11978294 11785550 11213659 10304811
16650 10304811 10269434 9889149 9991674 9742504 9636675 9142732 9096232 8467341 8220046 8184019
16640 8184019 7816319 7893235 7440980 7531433 7250374 7094274 6804591 6873123 6222990 6493727
16630 6493727 6349932 5933775 5672910 5854215 5786277 5415121 5252718 5074441 5426734 4630039
16620 4630039 5131598 4682570 4697228 4574830 4583656 4543314 4685953 4468238 3999239 4243441
16610 4243441 3831230 4056768 3614031 3550674 4009619 3528605 3707724 3360967 3219309 3294667
16600 3294667 3349632 3168943 3123625 2943693 3279290 2970188 2810540 3014940 2836659 2653345
16590 2653345 2894950 2706143 2729097 2584945 2767851 2713601 2343429 2204975 2469044 2314582
16580 2314582 2556070 2402493 2302865 2350215 2114333 2218117 2342914 2284367 2318650 1916148
16570 1916148 2101955 1783348 1752761 1845676 2071761 1882844 1917256 1863440 1556842 2068803
16560 2068803 2156893 1637970 1490003 1437455 1750900 1323018 1572297 1645547 1785444 1544954
16550 1544954 1190839 1359185 1404950 1575229 1434778 1368128 1291873 1370409 1429343 1177947
16540 1177947 1541412 1629923 1528063 1315524 1174370 1078897 1319261 1142140 1295142 1214590
16530 1214590 1138647 1450403 997600 1217749 1119446 761592 975120 1224284 1353966 1115499
16520 1115499 1367233 1045239 1081394 1068514 810615 927781 1109572 1156828 1105584 1054736
16510 1054736 1061415 834889 916477 1046797 1197084 1279201 733432 961330 981336 758228
16500 758228 942268 940076 662729 1071655 1034664 1091821 899581 922322 383125 1122915
16490 1122915 716399 792402 854991 355277 455065 682822 726566 934923 566192 614439
16480 614439 761886 663039 774914 757174 838723 631899 456120 721724 221105 604855
16470 604855 482760 849510 293624 788238 319411 597411 608729 504287 661179 336004
16460 336004 489653 663138 563820 722553 503204 376200 605544 423555 439689 820434
16450 820434 381955 397525 291207 450136 383802 497779 372895 262702 484765 637630
16440 637630 608740 243702 473674 227577 478913 400271 712750 422486 952696 604215
16430 604215 509127 610922 732703 231804 336453 487018 733485 76264 636101 377804
16420 377804 230296 496217 500526 656586 158958 453868 -95458 418827 176119 188662
16410 188662 450008 305620 353415 251488 305299 557248 308209 200154 207601 428335
16400 428335 141078 11108 -51225 371475 -13996 418291 445011 593370 91366 -5076 153442
16388 147522 451716 21099 573294 626772 400894 249333 33190 186823 167491 -3986 455587
16376 516666 592201 437697 474324 217086 369604 381867 303397 269338 123679 168576 490440
16365 490440 306960 105645 33496 247464 386214 335959 426352 383286 349651 96881 121173
16354 121173 52495 121807 422959 -144626 457268 322360 278760 198669 423878 368304
16344 368304 281392 531787 157064 171816 221925 67259 150893 209950 -82020 411714 129989
16332 -6281 415523 122784 265044 -76180 145797 273536 23728 155273 162074 404285 -50228
16320 -87638 319896 283281 -81339 45441 214453 -145360 -103011 223367 251224 149444 63859
16308 -78918 -180208 193588 365215 346867 45364 160800 318655 409332 -369382 17911
16297 150383 371241 367522 209751 448776 13211 188629 428456 237490 -82890 113209
16286 184198 217903 -394727 360439 282199 167147 160142 101400 212802 434239 -4275 157119
16274 -7087 -88526 -95386 -186984 -166962 -10455 3674 198655 58434 20875 151738 147065 192996
16262 192996 64802 99393 127029 30169 214522 96352 356757 -423665 207510 331990
16252 331990 229441 212461 260008 143462 75573 89227 194342 -187641 74548 115703 -115480
16240 70137 121570 306568 -95912 -79751 79101 84133 207633 -86227 -178322 174039 -71873
16228 -181128 191627 -104715 -249302 -83857 94668 -164611 67580 264083 -155594 293818
16217 253840 332740 284332 -254516 84944 18065 -256385 -48483 213028 -293385 81247 -202404
16205 -12589 233465 -82141 -47673 309271 123890 174388 -229399 107433 -22120 363250
16194 -276348 235934 -45388 94500 230984 -142392 103784 68590 198251 101673 -72113
16183 -193464 80604 207213 82658 109028 -102784 48536 16610 -176256 -54787 -15263 -251184
16172 -251184 -36502 339586 -321831 223582 218768 -44409 144384 275039 -77025 -52542 -280262
16161 -280262 -291637 265268 -117214 -283029 106759 17747 288700 367679 -11217 228496
16150 -167644 -193410 183513 -18971 254227 -34500 -202406 -41487 207360 -135094 231269
16139 6586 381132 86077 -6052 -125994 -2527 7467 90249 -33840 -9621 -43529 -723 176562
16126 65598 -189860 51218 -303812 -214904 -195577 -326426 -130113 -21086 83789 -92506 225467
16114 34564 115986 196464 -89125 178020 63537 71679 -226535 8155 -63027 -370046 45402
16102 -250031 -155708 -3789 159943 323613 87650 56859 -202963 114921 -111334 -436315
16092 -436315 -62153 -279364 -26131 203678 80011 42288 -68066 -91815 -144512 -106326 -29543
16080 78992 -75718 -142131 113811 225205 -2245 171246 -300152 -222165 -57041 107111 262518
16069 262518 118658 26234 -140965 231834 198810 211450 90759 -136007 -229110 -92466 -159001
16058 -159001 -103301 -236463 135236 41149 -284394 -136310 -117096 82492 -253410 -181617
16048 -181617 -127101 85486 -256212 131485 108137 -119268 -224607 -211112 90010 -26654 5215
16036 -156468 -115964 88936 -216558 157090 54413 173642 249643 294770 215614 35101 165935
16025 165935 220445 27895 -187213 -107740 -140479 -63383 414 194490 -358790 75193 -290153
16013 38411 -66399 -63652 89529 -125246 44521 112270 -231946 47807 -150452 46457 -39346
16001 266877 121104 -57453 148692 114420 -106420 53842 -382991 -18299 -45324 138720
15990 -242491 -79994 -117608 -113582 -72604 100491 -42383 293364 -60907 232775 104492 286451
15979 286451 301720 -38953 137846 347232 22497 -193000 79622 120498 108994 215585 -159380
15967 100489 170844 47032 -289867 -411666 -91057 78138 -30554 152314 59737 -124878 41787
15955 -163437 62565 60575 -181744 -79725 61217 -271821 -98787 -3400 -10244 243922 -239312
15943 8795 -232591 67825 -10867 -252456 -182644 275271 142803 292056 28367 85001 26961
15931 -106205 -216464 -152458 -1795 -143886 -75906 -23632 -49437 -19460 -35094 -557 285247
15919 42160 -108667 152083 -15924 -51938 30893 83195 -59817 60836 27170 -100418 5720
15907 -178676 229448 -164972 -205330 39101 174272 -95716 272411 -204698 -74232 178329
15896 -46448 152635 -56559 22864 -299523 7365 134153 122718 -28485 -220699 -76675 -245846
15885 -245846 113203 -3034 123247 -277629 -215832 5682 365401 71687 -226130 -307689 45708
15873 58146 154903 -53757 -12080 120407 -29948 -197986 -136924 -21306 -89657 -44588 -45297 -67939
15861 -67939 166507 185684 -392852 -182466 -228962 -49062 28517 -348470 136352 117008 73471
15850 73471 -18872 -231067 -108265 -17659 -178923 5011 -247956 -276328 -64278 42586 355990
15839 355990 29624 -46021 -49060 -172889 59574 -160039 16708 271268 6907 -236877 103190
15827 120053 -145709 -130555 -220344 -148148 -283597 174313 -211976 -362831 -7189 -37148 40141
15815 -297028 -163470 -560790 -70829 -113609 -97084 130215 213163 -469159 366613 62375
15804 208533 -89307 -173039 342692 -275883 120431 -91491 398153 -143121 -84798 110877
15793 144261 -289740 -99751 -29471 -154090 75735 -81030 -49548 -30422 -49093 35861 105098
15782 105098 13586 99534 -257956 -63809 -7558 -32151 -214789 -508907 8499 53641 111404
15771 111404 231532 80550 -185564 -132367 237142 -406005 -85631 -254929 121436 5016
15760 391667 -128670 -171488 146546 6085 6874 93797 -151690 210417 269760 -229257 248803
15748 24331 125603 -163793 241256 139483 -243416 87069 -207667 184725 243177 -335019
15737 77636 62290 -163611 -357127 48224 -247424 137866 -6718 107372 -203401 247639
15726 145338 13852 -61584 -121533 -289688 163447 -175102 -22518 -190135 -76328 -86487 -13641
15714 -1550 -298282 60436 -320196 -150046 39377 -74351 14225 14912 -297149 -396779 220772
15702 -219910 -72818 -138725 -31247 16108 221601 -279126 -301860 -198330 59514 -328140 217266
15690 57491 -31512 3209 -200555 21585 -26 166034 30950 -172265 219071 -6278 -237917 -127449
15678 -127449 45509 42720 -226642 -16319 -191390 -124707 -16164 -8302 143564 471806 -93724
15666 -117479 -167666 -176661 -101670 119360 -212601 378006 -32361 -291392 -85353 -43446 -360409
15655 -360409 -208047 60397 -84421 80341 361403 22124 85540 120532 -165929 -142305 -163606
15644 -163606 -126183 354220 -139238 175342 219201 381512 191844 -293474 212835 23962
15633 121473 183695 286181 172550 41909 298155 176709 -184802 -157336 -139051 144334
15622 3856 317077 24176 -277910 -227309 -164822 1056 75135 172972 -244050 111357 -159311
15610 -95441 14038 48626 -33076 241430 58763 -26793 -3714 -52237 -265983 254951 148645
15599 148645 -151380 -125319 -111980 -174113 332133 -64933 -576 109155 106620 -48688 -3564 -408684
15587 -408684 227784 225876 -153939 262793 -126372 134821 47691 141818 303502 -205406
15576 -290089 205034 315240 -9211 213556 282280 137158 -170354 -215683 -146024 11272 -84436
15564 -125131 -155408 176313 -250208 310786 -80523 220502 177484 -144500 15770 165281
15554 165281 -173720 -106083 27081 62661 158747 -48440 -248987 68612 -18384 -121201 125892
15542 98066 20086 -213359 -146626 216086 54264 25001 -22803 -92872 56798 112178 52965
15530 -130211 -140834 -147453 -79271 148136 -232338 -29203 19947 100061 -139928 -30672 -49209
15519 -49209 57273 23781 73900 250828 -215912 -162251 60728 -113946 157746 124820 -20697
15507 3613 -94650 -141900 -68895 522 -21264 -150847 -27947 -90725 -23651 -58432 -32655 -218525
15495 -218525 -176212 -75059 53962 171445 194262 -13122 174014 204975 343872 -185544 -183036
15484 -183036 129678 209158 -303166 23440 39458 87167 -180644 289679 -152021 316847
15473 142122 198711 51330 -237528 -30745 -105250 24969 -70340 -152948 39750 -113332 51300
15461 75585 -176532 283394 -132 89359 33816 62263 66181 -78960 167772 -286080 -11009
15449 241899 101015 260629 -508531 210766 -58743 52553 83890 -326488 324910 -252703
15438 -46896 -76121 29420 115983 221966 142648 91253 -372856 104492 4142 -9944 -52553
15427 -52553 176698 -31254 -145204 56519 -83749 -90996 35573 7369 149480 -204046 89576
15415 -62723 237022 -69538 -25676 39940 -6455 378155 7082 269539 189585 -127464 -33290
15403 241628 -558812 -209735 79535 71733 -43865 189070 -222194 -59510 -119024 249929 -26781
15391 -77754 126701 136944 -122336 -45158 99755 -44241 26626 8944 39260 25093 180696
15380 180696 -142545 -415210 119164 137234 -91005 -5718 32128 -178713 131474 122304 59962
15368 -192875 3402 65223 -35808 10261 -191332 120538 -71574 204407 211229 86343 345793
15357 345793 -29012 -40542 -184275 281175 -161901 79438 -100606 193285 -111521 -20541
15346 -88451 -73125 80212 -125333 246542 -15826 62295 369543 -200433 -92896 107015 -247081
15334 93740 -176123 107539 -122580 -237648 -62844 257579 110242 -35103 -43134 206215
15323 -216770 92901 50005 64757 312816 296111 521893 226413 58565 -51050 140701 362684
15312 362684 -18841 -50508 247297 31909 -167197 164074 -40974 207244 434954 160471
15301 -3205 28751 -73408 271047 -56726 10044 185250 115988 -473181 37224 112605 -319851
15289 154975 -69906 -111418 -19666 -153324 -14578 -72349 -26979 157270 -321001 79149 -93097
15277 306014 -17782 101150 40036 166818 242323 249296 295551 49134 -80155 117907 -166221
15265 173191 33611 -18144 -78229 -90323 334650 -130797 -35004 -184065 21661 187430 129889
15254 129889 136209 -66037 145103 603849 239287 615584 1217122 1536625 1133968 1593602
15244 1593602 793068 196677 143508 220044 -200401 35982 -247707 414334 265250 121379
15233 361563 251719 199826 207615 -45610 55926 -9238 290563 -131669 204214 48167 85371
15222 85371 55308 -212221 123969 185123 -190567 18257 -123468 164180 -166399 139912
15211 -4156 247768 141235 -152442 120480 -60167 257804 413087 24826 38908 132285 246963
15200 246963 233737 12272 156760 158063 311623 161464 116785 -290882 70617 -26466 69819
15188 77878 190920 289700 -42151 108799 222344 97318 188946 151042 305562 -90037 -32826
15176 -241618 138735 199982 -80247 231230 23831 -32075 199945 -121664 -203760 380170
15165 -95961 -102945 134002 196742 82550 254583 241950 -106050 164048 6234 -86172 -163253
15154 -163253 34392 38064 166691 162900 7713 15894 -65635 124255 232345 305020 172057
15143 172057 -48616 151715 7762 192056 51932 55564 -188217 339382 127905 13223 172497
15132 172497 66455 374539 9143 14728 123926 198981 406844 211490 143566 -164159 79198
15120 206756 173086 100020 257152 -10402 173595 -292357 -138431 -65723 296174 29069
15109 27425 95255 336410 -96718 -26090 108328 26712 435340 -87237 273348 31163 275115
15098 275115 326464 132645 -99897 236412 321363 313551 267279 64390 153950 35022 145068
15087 145068 179738 152871 327691 239441 -193250 231455 204648 168954 153067 296132 198900
15076 198900 355895 315936 -206866 264954 64454 381849 151748 104455 167407 109704
15066 109704 187603 8929 160930 92418 243954 42870 210133 236324 64829 253482 -68756
15054 45248 177258 49648 -169319 159635 148596 432064 452680 141484 248617 98068
15043 224360 239687 -36969 140847 364423 121859 315349 96300 260474 200661 229033
15033 229033 129164 425682 424890 23715 521070 -169289 252718 103100 226730 -35190 321448
15021 353789 69957 297493 -65956 428149 293294 285004 78728 130490 438512 158367 22153
15009 232226 317509 134844 463526 111448 127300 184821 50219 222887 218284 290961 142517
14997 274450 -110566 174487 139907 97107 377167 119150 180619 385973 205022 394343
14987 394343 177112 427129 253288 -125960 99188 -81653 -1968 150139 157756 55011 342918
14976 342918 670810 417797 314801 98607 204387 466826 447977 302310 323147 388666
14966 388666 84321 315681 487767 292898 260485 312891 328755 136690 81688 194205
14956 194205 341519 -6168 220578 252974 56393 22134 48121 308840 239548 327707 70079
14944 280157 23533 206849 467217 405919 341224 180093 408086 451663 50424 11489 77032
14933 77032 406289 155030 14013 485950 139035 134970 213619 290759 208662 281819 81320
14921 495389 276750 449312 32581 161718 279477 218584 115959 151340 383223 336601
14911 336601 315192 335604 385698 248679 329538 502645 628930 374354 431708 269806
14901 269806 119314 142952 546628 37332 -83966 83500 266069 135832 527998 114671
14890 410031 581914 480281 478531 122828 401768 379538 657530 275789 841866 174728
14879 372708 451933 -77682 684834 381263 422609 551109 301649 405046 225159 205252
14869 205252 -78204 261105 619994 402019 865376 628670 205168 511516 484591 245831
14859 245831 187988 93730 134915 349804 451620 579834 289579 482195 539882 247695
14848 528288 210618 433929 514791 60661 494801 333962 350696 491716 189872 493426
14838 493426 678335 450393 496795 400004 567789 386586 490904 277922 464188 523050
14828 523050 509885 497484 406213 294553 478363 552184 552116 698232 493985 446916 426374
14817 426374 615194 442496 425870 421948 467974 734364 499221 529494 560071 532245 578913
14806 578913 245901 418857 358410 448782 584695 559487 464507 235748 321165 395624 666194
14795 666194 257660 461365 444217 367271 644933 413076 812252 602649 372009 433982
14785 433982 304826 481769 675124 427716 631038 686743 437769 799403 656469 238288
14774 332427 572426 772705 735368 861997 438000 843548 691712 690914 960388 249997
14763 822622 653145 787162 509993 796593 528575 495081 800176 527383 643259 883733
14753 883733 711318 698276 605913 699604 769051 558011 405283 516460 549051 629668 850213
14742 850213 816900 634767 716955 796931 906386 541861 643998 886701 648787 565804
14732 565804 658545 736117 698802 1015092 995648 553596 675829 580852 540288 1104648 909030
14721 909030 1138364 766202 677316 486974 637668 1172170 873061 607017 643574 508971
14711 508971 947747 844850 767461 1002956 780120 1138209 718827 1055140 1290281 897471
14701 897471 838405 577324 849510 950334 830294 492532 875472 998680 581495 953087
14691 953087 796039 909266 1037091 1053163 830969 719296 879426 886443 1151786 852720
14681 852720 912318 1105825 804113 1143406 1101153 1217823 1179651 1065108 789695 1144961
14671 1144961 1198718 897184 905627 840889 1180086 918114 1194627 1046731 1350565 802410
14661 802410 1017563 1126402 1253509 908140 1017537 1013133 1260958 1062436 770560 1108884
14651 1108884 805504 1205993 1274493 1484516 1450081 1480157 1055125 1330698 1263247 1133585
14641 1133585 1261155 1221468 1500936 1226354 1319046 1444607 1130760 1520537 1112533 1280513
14631 1280513 1063559 1301341 1368950 1546763 1225261 1477265 1141823 1580561 1497732 1298576
14621 1298576 1202236 1224140 1497232 1210729 1522849 1483710 1610468 1560663 1458821 1493583
14611 1493583 1342100 1519980 1393057 1669928 1564210 1542005 1773876 1918309 1491751 1604872
14601 1604872 1675399 1727788 1357120 1723568 1850270 1732620 1762561 1593960 1908033 1930408
14591 1930408 2003734 1946462 1958182 1903083 1827432 1743365 1842207 1844133 1705325 1997811 2037616
14580 2037616 1950290 1733282 2335252 1710764 1878136 2184699 2377713 2153253 2008350 2099148
14570 2099148 1951398 2274586 2072960 1960140 2115033 2668409 2672842 2538662 2893585 2594778
14560 2594778 2858287 2681241 2896160 2916103 3027411 3061463 3194280 3819095 4357704 4719452
14550 4719452 5538910 7821310 11829659 20737878 35966750 45665379 25687461 11381941
14541 5357237 3460707 2905546 2574387 1965098 2282564 2019469 1923658 2083847 2081208 2017003
14531 2017003 2083923 1894899 1861134 2234842 2210096 2652993 1967140 2164038 2350705 2612727
14521 2612727 2684802 2470628 2431142 2434518 2393425 2451067 2789888 2783173 2811797 2637211 2601646
14510 2601646 2623742 2532119 2710288 3107120 2680427 2601767 2974776 2847943 3089331 3023821
14500 3023821 3071597 3349219 3238151 3159007 3120198 3273955 3042105 3227245 3283196 3359428
14490 3359428 3893274 3459753 3446711 3594614 3458934 3453505 3864649 4107818 3595583 3804108
14480 3804108 3821825 3847570 4111100 4080993 4277426 4075794 4193760 4287145 4315078 4163250
14470 4163250 4552796 4527536 4280275 4736652 4845081 4738082 4383995 4604597 4532651 4516224
14460 4516224 5078445 4769809 4590916 4950373 5129040 4976038 5124809 5173322 5212403 5397429
14450 5397429 4944188 5540895 5667459 5626292 5770757 5471545 5750593 5627955 6042185 6202857
14440 6202857 6125921 5939931 6119736 6398890 6402062 6565321 6372309 6589211 6515969 6663939
14430 6663939 6799168 7255839 7405703 7304327 7462810 7504196 7745023 7539725 7782335 7911823
14420 7911823 7995747 8185358 8208301 8315064 8544927 8506677 8700645 8576366 9008051 8750639
14410 8750639 9340538 9045230 9428337 9889402 9139398 9704251 9757790 10069526 10397102 10381890
14400 10381890 10881275 10736114 10940001 11130146 11444144 11455023 11733896 11957128 11853291
14391 11853291 12392258 12275981 12777916 13089196 13024999 13442239 13768331 14001814 14239687
14382 14239687 14470766 14789265 15163082 15013978 15185720 15485545 16078625 16239642 16837541
14373 16837541 16884331 17056977 17637813 17990809 18378441 19008603 19176172 19577950 20101449
14364 20101449 20225334 20875576 21338062 21432322 22122499 22587254 23267040 23603574 23891093
14355 23891093 24397170 25446729 25545636 26374216 27043099 27701356 28279325 29011775 29712868
14346 29712868 30367612 30988676 32040034 32511451 33738670 34485868 35657270 36793294 37657345
14337 37657345 38435490 39383901 40675627 41696162 43404235 44081840 45978010 47061839
14329 47061839 48849420 50048019 51719712 53195602 55188718 56818957 58695804 60853886
14321 60853886 62779804 65176100 67841074 69723346 72453697 75012193 77604704 80906533
14313 80906533 84015544 87456637 90917579 94331981 98637303 102407481 106604940 111547319
14305 111547319 116438937 121617063 126980229 132593875 139016941 145357895 152776122 160270068
14297 160270068 167913365 175797360 184729223 194169292 204013194 214308132 225120196 236858514
14289 236858514 249010024 261704041 274799612 288285935 302996925 317835218 332923327
14282 332923327 348160983 363584251 378804180 394018261 408413668 422161551 434839730
14275 434839730 446078562 455261364 461062296 462752075 462884651 461612334 463209034 462625482
14267 462625482 458601195 452625113 444615176 434276283 422798756 411120245 397350232
14260 397350232 382416475 366932869 351106209 335113318 319841061 304810629 290827683
14253 290827683 276674240 262903988 249926478 237483575 225704821 214541093 203893339
14246 203893339 193783544 184517746 175846161 167518505 159567284 152138610 145021242 138252094
14238 138252094 132672948 126467362 121313217 115760722 110866173 105940336 102058503 98019538
14230 98019538 94228241 90227385 86673146 83366404 79969106 77047662 74326867 71722814
14222 71722814 68680721 66874443 64437722 62279163 60246430 58001726 55991096 54440821
14214 54440821 53000065 51206573 49324164 47936458 46194729 45374277 43981991 43312248
14206 43312248 42059572 40631394 39017740 37931954 37040384 36141170 35805478 34643238
14198 34643238 33361355 32442914 31283425 30823239 30343574 29471113 28428465 28173203 27346352
14189 27346352 26535679 25921726 25461427 24838092 24479187 23993219 23478865 22457678 22489701
14180 22489701 21618785 21281099 20638396 19869511 19887126 19588090 19242635 18795999 18394283
14171 18394283 17889231 17610138 17492665 17275579 16550589 16115019 16275386 15942484 15622938
14162 15622938 15369239 14852160 14781620 14648386 14302056 13918967 13628767 13076574 13448844
14153 13448844 13029758 13031759 12821236 12184657 11953660 12113180 11879884 11478955 11276708 11329719
14143 11329719 11426947 10817671 10658242 10201937 10135028 10435422 10067791 9912181 9827051 9490958
14133 9490958 9488869 9568683 9031761 9130609 8640460 8955774 8352783 8889556 9043070 8330194
14123 8330194 8436004 8368974 7940586 7928886 7811885 7896500 7614780 7575598 7433828 7577975
14113 7577975 7406464 7133848 6847516 6977267 6927206 6944476 6783395 6604971 6587941 6506996
14103 6506996 6294428 6333688 6449529 6035363 5860542 6139345 6087318 5752944 5762297 5799921
14093 5799921 5478403 5829713 5564014 5742340 5327848 5340634 5361051 5163910 5198496 5094062
14083 5094062 4971196 4969210 5060550 5124111 5137995 4333438 4678581 4393174 4574443 4526219
14073 4526219 4475059 4578590 4574254 4294533 4454967 4361240 4460657 4318219 4207972 4319425
14063 4319425 4029401 4053944 4238683 3984663 3864366 4176042 4392392 4064933 3786655 3748787
14053 3748787 3838568 3529056 3548552 3499839 3712773 3629916 3521150 3658028 3139250 3287545
14043 3287545 3043753 3292011 3569757 3226430 2883336 3407948 3063527 3415371 2858634
14034 2858634 3131929 3122815 3097012 3256084 2896252 2965500 3003863 3208413 3005692 2953888
14024 2953888 2935337 2819523 2886349 2545624 2426511 2954573 2676594 2952457 2413658 2585242
14014 2585242 2541637 2836294 2211374 2587014 2553922 2501341 2668292 2465991 2265858 2210758
14004 2210758 2046956 2306367 2382371 2107953 1968326 2318244 2452803 2027004 2025819 2064489
13994 2064489 1724148 2057995 2089737 2066807 2332819 3426389 6607034 14213777 29766223
13985 29766223 44190798 29714981 14964217 9100693 6841487 5382906 4322529 4092100
13977 4092100 3462306 3077447 3186945 3213386 2851800 2601820 2538636 2355854 2441109 2661087
13967 2661087 2634941 2514488 2211662 2182743 2460726 2400038 2178778 1981124 2426760 2237478
13957 2237478 2491963 1923480 1966234 1937883 2373433 1783266 1972549 2251400 2041579 1479233
13947 1479233 1745823 1792741 1978744 1570717 1712262 1464690 1904854 1817195 1663878 1860425
13937 1860425 1570775 1610373 1748782 1860957 1608166 1527312 1790167 1666265 1694171 1771017
13927 1771017 1725167 1771721 1806047 1242556 1408553 1427483 1360120 1510065 1673434 1705339
13917 1705339 1847155 1442576 1617371 1225031 1615786 1513432 1396279 1446475 1640458 1436518
13907 1436518 1498345 1177922 1470368 1034605 1370963 1347785 1211619 1480763 1550905 1633643
13897 1633643 1339411 1231215 1256961 1550950 1455405 1298716 1622151 1258744 1497794 1112660
13887 1112660 1077389 1070639 1244694 1216462 1179419 1246955 1199627 1159571 1006350 1462424 1151728
13876 1151728 1251153 1296755 1428841 1085321 1300791 1089232 1414258 1100114 893862 1196722
13866 1196722 1066868 1287179 1436684 1094036 1208954 1464197 825803 1467109 1226194
13857 1226194 858664 1130274 1263983 922674 968914 783150 1280691 1041535 927737 990013
13847 990013 985776 1102466 962402 1249187 1091394 1165544 1016524 990183 920398 968071 751763
13836 751763 1073517 1327169 857999 852570 878784 1259016 1126983 587179 700260 980492
13826 980492 586846 1008513 835236 1000798 1009763 662630 757338 875058 1064877 953337
13816 953337 683688 776264 755195 816490 1013395 839330 948878 940010 912456 880802 866171
13805 866171 739227 497671 368276 688432 696862 807080 658185 770699 1057596 1044301
13795 1044301 1002338 793733 555468 682822 569788 883098 859476 950046 731917 1019260
13785 1019260 758455 849762 569662 672472 990758 830308 791472 677450 1023522 720548
13775 720548 463303 525114 630061 794532 676363 803156 563858 589477 572131 783190
13765 783190 614803 1046752 821691 492762 648737 491097 698420 695600 740270 557952
13755 557952 970091 721193 540770 852940 777600 657207 677298 802356 723779 623400
13745 623400 590671 642438 712139 718221 745589 565429 394997 472206 693018 616848 172208
13733 572125 626517 230118 691118 374922 646422 447836 828966 651038 521849 296700
13723 296700 670846 482564 554886 526408 476042 434362 440776 838544 151309 440686 674963
13712 674963 624466 400175 824243 317773 618539 573827 515875 490103 525250 833820
13702 833820 609640 735615 417100 293259 750175 415082 502491 557458 730763 320217
13691 375934 621390 546013 444789 780531 452875 756202 455519 205719 483726 482818
13681 482818 418537 707826 659074 561007 480779 549813 410305 434188 528851 736896 307403
13669 593236 685280 442938 380493 57464 567718 460044 95173 694654 209644 296969
13659 296969 556165 177238 347632 210550 281228 183763 494843 360738 499932 185860
13648 451416 303981 388197 416633 755018 634598 390007 354194 756531 472630 318993
13638 318993 140968 369999 199795 360466 569520 196997 461134 269049 326025 452874
13628 452874 73630 495984 406424 151677 466311 471138 513088 694811 427475 548577
13618 548577 414772 546236 317795 144949 201795 357374 673880 439843 386346 487608
13608 487608 521428 454050 531221 659128 320845 504070 487554 564528 159935 383927
13598 383927 474542 377901 -7843 345165 338091 195063 508969 334357 172860 420775 225563
13587 225563 576226 130430 502792 443835 -170024 24999 487314 310471 355514 361204
13577 361204 176971 288957 210677 -76091 205314 167308 491210 297560 439185 485226
13567 485226 373157 286491 461483 248590 419636 372659 271757 382886 224792 226686
13557 226686 279858 491094 383437 374970 402191 410013 286471 428917 393418 152909 8226
13545 111835 178630 440897 410714 145892 464344 88128 334718 107432 224464 356889
13535 356889 183038 451940 -152865 204562 -79311 512036 289537 262582 540951 590024
13525 590024 118269 246877 334190 371656 214193 419338 267631 279550 149417 373364
13515 373364 346962 95570 324781 203228 15357 280489 260566 483524 331704 592393
13505 592393 213755 123604 354330 474902 248220 84186 167659 99304 408723 197806
13494 187127 449205 158886 260139 462560 274960 192150 393174 221687 311229 366604
13484 366604 375211 505115 33336 566055 310906 607822 364475 259738 346967 405432
13474 405432 419165 200781 157907 206538 554983 236592 676416 139827 223359 315101
13464 315101 129131 238508 382739 209566 143419 231317 222380 -48166 461359 -9386 225413
13452 325798 227789 70306 298534 60513 -12690 199370 258299 375747 539140 35148 94095
13441 94095 408571 108506 183434 317480 110889 215669 287062 430716 423669 278268
13431 278268 315025 228521 372499 177197 15219 263469 -97670 245982 87923 -164756
13420 428738 145885 313543 281789 259870 468824 338885 168618 84623 129058 612224
13410 612224 192649 124482 65336 171083 109196 349799 507926 233721 -10787 183076
13399 338651 254016 27814 -33665 264987 259053 -230287 356791 248440 387935 140659
13388 214884 224106 109089 -238194 -36574 320784 331974 24124 196315 105366 216761 408181
13377 408181 -67444 -4241 232284 101209 381770 -7710 490319 120988 161292 194859 503668
13366 503668 422628 411496 159689 521186 119256 163871 289822 -31158 241664 265806
13356 265806 6729 231842 223518 186688 440145 194839 -12895 426873 215736 273895 329864
13345 329864 169252 44048 580965 364981 247088 346804 129988 -5872 240401 -195186
13334 -48080 265238 316727 156324 121199 141997 -2535 103713 327128 491973 457914 456746
13323 456746 340446 299722 131530 394921 90868 313762 300532 244753 -236600 55584
13312 68681 430590 298644 177557 91689 251208 -88249 -33785 -64918 -172507 313323
13301 190999 299096 -330740 206180 392389 29896 24752 136327 -70249 346654 28879
13290 95980 204260 203556 24456 124864 163370 271462 88562 -12303 386688 269394 211977
13279 211977 -112901 80420 144689 240752 215921 196050 317862 121281 -117190 70779 242840
13268 242840 -16384 -247272 163025 176218 -156341 160562 60365 -228361 129267 -104585
13257 387588 -166323 107474 232129 290898 -134484 180849 299269 284666 323784 -215641
13246 303276 169940 113742 130668 271210 -47796 87314 25077 161594 57943 208262 113090
13235 113090 12983 93436 -185082 -259781 50296 173762 210299 108839 -23454 -135651 38924
13223 -30754 -158439 227117 -102097 -21319 -21361 415839 241669 100696 177864 37136 158812
13212 158812 260902 64032 5601 399727 36792 129132 34864 -161106 171736 189268 72994
13200 104003 -13756 -81791 191491 75606 62451 137873 595175 102507 1803 169359 -86292
13188 -221208 291542 -217668 -206999 96890 355801 298456 369257 153144 108252 68125 -4281
13176 305302 145818 344328 74179 14411 -49471 110245 174384 63088 198265 277220 44081
13164 233790 233641 272422 78453 -17455 -200602 -44742 79135 -160953 143717 -90228 416927
13152 182961 136614 -78372 195634 216628 -149147 132082 -30437 17790 71253 81577 35318
13140 235477 -201980 78883 83338 7531 37376 -74532 109524 -214302 127542 -62757 86182
13128 175407 92997 -189246 156495 74739 -109195 108028 220102 167915 -27068 189583
13117 52806 -126867 299393 -196471 186853 141080 99546 74613 -129879 369007 297008
13107 297008 59148 210542 -113547 -5079 -364238 265269 -116732 46070 55822 361785 -116112
13095 -176911 38649 161854 278322 -126920 301491 143059 -93959 62869 187423 225191
13085 225191 181730 146719 113765 130350 237064 -49881 -44487 131899 333528 6988 -92469
13073 -5623 -225136 233444 147281 164338 209219 71847 236662 195736 -25282 176786 47886
13061 112824 325673 121376 23222 106601 278404 -48047 34797 1554 67939 93509 21342
13049 237055 -126384 175278 -49664 174199 74498 -332833 79140 270112 178266 226826
13039 226826 97553 -37033 -176544 -145251 142263 167476 -40858 -92734 -40277 166404 247967
13028 247967 71818 120079 -108426 -343 -32733 61480 -29631 305107 -197335 75864 -86954
13016 34669 296686 173079 268798 -2064 294705 -261139 -87373 -8863 -241341 17592 112942
13005 112942 26947 438882 129711 60484 441915 45390 88201 -103904 16421 294064
12995 294064 199403 26665 317435 -127194 115789 -118872 -294102 9520 232941 -37684
12984 49418 51091 -11888 -48254 -83052 -67559 -20056 43252 14501 91435 -291413 138186
12972 215250 275406 212046 32021 49155 82872 251570 53663 -174770 293952 130903 115217
12961 115217 121368 -73805 149679 440891 -114434 132171 -135937 15234 387136 -183870
12950 -11340 345488 -75588 -46616 -256411 -145085 5468 -43925 -39092 41394 -72394 -88572
12939 -88572 -10769 138681 51516 213304 176944 232511 -10837 -169538 115412 5033 -56471
12927 8549 65164 72987 -36070 193080 -147591 266531 -225256 34881 -88276 -117534 239093
12915 70429 167986 -217040 144535 190091 343437 56201 -150918 -87372 -69664 348648 -228201
12903 71105 -99889 127870 -482041 89469 137681 173863 201924 26276 427164 52492 45215
12892 45215 56334 230810 93879 38479 -82934 178349 -75188 117643 68771 -18198 161671
12880 -211070 417409 60192 68362 -130987 28960 -92616 -123601 117429 135582 -63496 172492
12868 296470 -135218 -218135 92764 -241287 155788 -221891 59204 -110680 409874 -104564
12857 -191453 231363 -52186 -17888 -138531 -125940 183639 58074 -25097 -182727 -222328 160026
12845 30685 -49682 22894 221716 128445 289269 -154806 -41791 -201196 338147 -208327
12834 75902 -59179 44632 141374 61603 -133218 26354 -11542 -174124 -119999 -135772 8255
12822 -263464 222947 -306677 148626 -116999 -74276 245674 98239 -112747 -159119 48146
12811 -222542 -2043 -134666 -176362 142905 317931 68486 240054 292358 78603 -128341 20503
12799 233932 7568 -136646 41799 -124889 132578 9759 -130318 192954 113535 72490 111060
12788 111060 48580 292571 97248 342594 160081 -42319 224437 -247901 195071 150532
12778 150532 16801 -43309 -35711 49479 109068 -118564 -153220 -258711 -149999 99173 19370
12766 -143191 -57361 196212 6611 -58672 195358 200768 41938 -104279 188933 -19084 8143
12754 35953 -259252 72370 289233 -156374 63487 -84172 -193022 -226474 29516 -70712 148026
12742 141829 -40596 -74394 173558 1163 188432 17610 354280 91184 139611 35759 -209775
12730 -103900 241923 153758 280337 254336 20957 234809 27755 -31830 -1349 93531 55298
12719 55298 352046 71158 -112294 81643 -38550 -199303 -164745 170669 -61643 1200 188863
12708 188863 78516 102547 453145 82250 -129565 -87214 29515 97638 12763 -25308 156730
12696 281230 6038 -126441 103883 263465 -192161 116962 211708 91978 144838 275265
12686 275265 -162901 31406 383188 171767 290159 -72948 428272 115162 -16812 335118
12675 68122 219081 157471 226741 185716 -58542 -13157 227260 156156 -26186 143786 -115229
12663 497581 131546 -117608 98620 352479 181536 -141257 -97114 113231 288364 83751
12652 -164096 323199 326000 99962 -47661 118162 103725 -127803 246569 138498 -187509
12641 -68630 18253 138343 -33752 -47554 -239464 160298 -152996 71101 51714 176160 386054
12630 386054 321481 453544 47308 212590 266054 -171847 334478 175213 -8252 49902 96294
12619 96294 381983 -326111 56053 292534 299149 120216 -69753 139920 -73601 -90015 -93274
12608 -93274 140249 69783 -139261 16933 90704 264353 -95165 -34489 133645 79266 77203
12597 77203 99510 77279 51379 122539 127744 233208 -101451 -29707 130083 82207 45183
12586 45183 15641 388701 68132 181032 8347 21476 -136489 113850 -33671 225755 83367
12574 -383725 -355410 145685 12392 180159 404797 -42150 208996 -103686 62660 171138
12564 171138 30837 96092 -786 25391 49340 -14321 -277235 220744 -233563 233556 194692
12553 194692 -155905 -142833 -196851 -21916 -105091 330001 -211775 -96298 93649 82964 165946
12542 165946 39965 -83285 -10906 99616 26448 -127744 -18211 53826 -223360 34570 -140660
12530 -168458 13500 325216 52041 39322 -4597 36313 -59176 152940 -734 -11780 -124780
12519 -124780 -90533 -34783 64254 -178536 -20186 173109 2944 -152446 -135132 -71044 -70788
12508 -70788 165019 -65479 203105 41215 232813 -19195 -153056 239714 548812 -158518
12497 -66764 -85743 134699 -253998 221361 -143821 12202 33020 -35204 375423 -295159
12486 -245855 -76203 32574 -93145 180787 -92158 65740 -200967 316689 97974 281536 -34366
12474 -26416 -109817 86168 645830 -6450 -74842 63986 -238622 14454 -133607 -215768 -90397
12462 -36857 236461 16318 252937 139386 55549 -159146 -92326 36483 14691 73795 41566
12451 41566 204957 201605 297631 -24069 -227417 96905 -165157 -134962 97381 -167721 -214946
12440 -214946 28004 210279 -12308 -67780 -27815 -242817 -235937 190433 82139 -109922 -53775
12428 -68769 -202077 144332 -70483 74548 -18755 -147622 -126442 122349 -132726 -59986 139013
12416 -43168 -63196 -129865 -286909 -32536 -129308 174400 235127 -76422 -350039 36318 52937
12405 52937 -254684 73742 287209 316723 -148637 -254237 202881 -209308 -307537 -286376
12395 -286376 263930 -156671 99645 36761 61365 55020 51386 53192 -23906 -88011 -37988 82721
12382 -57933 211422 53232 359703 -154873 149099 14301 -170291 78336 -96115 -141739 203792
12370 -61969 -331648 215775 -43246 176429 24638 -51600 152666 152283 90529 -133163 11466
12358 14267 67360 -151235 -30058 -230397 -77285 -66593 123675 65630 -133098 -12072 -146662
12347 -146662 -73116 124504 -17640 -111693 55810 229891 120368 -22590 122012 -9405 295345
12335 -125862 160467 46425 -42706 128874 92712 -164748 -459680 63291 -17994 -139433
12325 -139433 79244 366854 -23786 -28160 -160391 117252 -52645 294345 -466897 -144541
12314 -27764 55078 -84246 168983 -140216 193950 60172 232158 169061 -342374 -346703 302704
12302 -208532 45439 314775 450041 -132919 -10855 39234 -99648 101702 30392 514198
12292 514198 -31183 77200 -84509 -64920 77565 146196 75060 88074 -143430 -348 6337 104390
12280 104390 91548 -6341 -156198 582198 128990 330524 416318 353659 139574 331349
12270 331349 9123 363963 -57312 -84632 76942 72224 -59184 146351 220440 260373 -107139
12258 -51255 270007 -129664 -234627 -4012 296385 90578 8043 278591 -222009 122619 -56850
12246 31309 -196596 47115 480467 257736 179553 39691 112684 -86509 -241944 30049 138213
12235 138213 109327 71265 -122294 -303753 263756 223942 -79880 362536 465330 -34151
12224 53398 149160 112986 249322 190855 336475 -37481 6410 313118 79745 220863 111622
12213 111622 51708 231079 15391 201828 308738 150201 114302 76438 384355 209238
12203 209238 209909 191622 99337 271007 23088 98741 211814 470919 305007 124791 534637
12192 534637 172883 461420 281913 -93058 295768 142822 356601 53693 382331 248263
12182 248263 -126038 283851 341150 61209 443818 10894 -275148 299432 -10932 279130
12171 463505 83554 456398 74591 -275235 287491 -88212 110120 -5575 59495 -6061 262909
12159 -199451 -247644 -182074 -128263 -212363 316717 277887 -2431 28014 296022 205700 -105253
12147 71793 158401 175252 89191 -156840 51276 163926 39683 -47934 -210873 -33456 -77134
12136 -77134 -179969 113235 197909 -176756 -21122 -72812 368564 256585 -134547 -97031
12126 -97031 -162690 70158 29312 -34502 -157973 127882 -132085 -151025 -332799 188386 -9967
12114 113430 197424 -32806 30693 56666 311069 -60961 79612 -79150 165981 -56381 105450
12102 -261122 -29367 124768 141758 30680 112662 169634 45310 -67588 -101028 -166757 -78784
12090 83110 -184470 -288356 168669 44660 -218457 53879 -69352 140607 -168144 -355381
12080 -355381 -12062 -31391 -112486 53801 47332 142788 382410 792764 1417618 985114 184349
12068 42945 -107811 113956 -48689 53008 8056 214379 -187053 200109 -69044 163219 67505
12056 186445 21114 -11834 -2078 185821 -192907 -160053 -356965 65681 -105126 -54626 6055
12044 -272488 16344 -179551 -146366 -195184 140592 27539 81236 -263365 169295 312276
12034 312276 -33764 55061 -35966 18570 -41647 207582 -147540 150093 -902 19398 -196260
12022 -193100 -44765 156170 7529 -310680 -168687 -266284 56463 313448 -177833 -424964
12012 -424964 -103736 -143147 -209333 -134483 51010 -14276 7057 110509 -73186 -67606 -210790
12001 -210790 -256770 175727 63752 164868 -244133 -466106 -215712 -227472 -4484 -75275 -8672
11989 76921 -50831 -325174 168666 -112484 236401 154413 86710 -128469 291879 6048 -51021
11977 -139354 -83088 74559 -36580 259548 -103086 174186 -189969 103722 11465 -424938
11966 178998 -6430 7071 -102708 25045 248541 76108 68862 -212472 -407010 -200525 163698
11954 263523 16469 314838 175368 211319 -150267 -110196 -93773 -19773 216989 -139359
11943 -313241 -177498 48725 -73944 273149 429599 158301 -237203 -70395 61786 25117
11932 106662 -346757 76871 -20090 81170 -47441 109525 -136360 3771 30749 115593 180924
11921 180924 -137967 213551 -209396 166298 -166248 115708 120380 -437346 -45012 -145993
11911 -145993 -77202 -302535 65540 80754 261425 -153114 46100 118800 308486 108851
11900 -242267 107923 181397 15814 -136183 105667 -204788 120128 -35775 291146 -89038
11889 -106683 75139 -340802 -123258 -812 -53187 356801 54674 219846 -149837 -219001 -104167
11877 50936 14310 -331406 -411028 28149 119256 -177854 -52201 67431 -144049 146811 373608
11866 373608 315253 165018 8547 80221 -103630 -167726 86374 413658 -314159 192606 1019
11854 -93005 104689 129857 57154 202127 66015 18108 -51633 -147701 -329112 -58314 -106911
11843 -106911 -123375 -110934 -67333 120467 -286616 -66615 34996 -120507 -280429 -112502
11832 -144485 77119 -116302 138244 -161398 309450 7068 -83546 -129987 89155 40084 -45704
11820 96707 9020 -93555 491031 273183 -15896 73314 -181189 119421 -35406 -81749 -195919
11809 -195919 -125426 177478 143256 29383 -2520 -330916 16963 123107 -8150 32002 -79107
11797 -40922 130984 -50767 -45077 86398 4183 -114794 -315796 43032 -207592 113071 -72110
11785 122023 -26437 206301 -380921 -6105 -63487 59793 78286 -340791 48638 -32848 -24224
11774 -24224 131010 95783 305431 125722 -73104 70385 212536 -101945 -141315 113893
11763 -262995 -212126 -227015 -89190 79152 3965 8130 87485 49230 306723 -371126 332594
11751 397418 -333830 -34103 -148730 -364543 -197911 -308153 258709 -154808 49177 230997
11741 230997 -325682 40834 6329 163911 -138376 -280878 94299 86027 171067 -73579 222094
11729 385499 -54822 81083 -63748 30025 -90599 -9840 148090 -255645 -84540 79215 57825
11718 57825 242417 153615 100377 -69537 175413 -45879 -128949 82103 210 -111977 135671
11706 51354 -77799 17447 -46561 170671 26460 32921 143286 -318791 288427 417835 -155403
11694 123692 -25785 -78829 -68830 171021 174894 76593 135508 -111301 -5018 248133 -381764
11682 86375 60657 -52552 -55979 125789 71949 -104729 117227 -18674 64706 120269 145825
11671 145825 17550 63174 63807 65656 93819 -168383 289026 -590 293014 -234370 142995
11659 39246 -95407 107844 -175773 21733 -200862 355118 269925 -93284 450187 150885
11648 200051 -225803 -145361 230643 179091 259137 -584 -82099 -38260 -246556 57654 -74223
11636 -15301 38110 68615 -91408 144469 247207 -15085 -143662 306050 -80218 -45191 61832
11624 310422 -174038 140377 14517 336749 384057 -137155 -77950 -139893 678 140352 102181
11613 102181 222626 108927 234259 60249 -273182 39665 152929 222583 117372 128330
11603 128330 177767 -61889 2158 -11653 326266 336199 -167444 183749 61216 99946 470004
11592 470004 -73547 223173 75556 -68343 26438 264101 -90067 181188 116512 391818 -329851
11580 71942 -31273 9385 179072 -133662 -12477 169214 -188330 47307 -10587 208338 54270
11568 298077 266037 106539 89267 -171298 -51095 134683 445549 57815 -125120 141467
11557 -367755 25304 -220307 26144 143217 166559 -244566 24050 -323722 -125703 39617
11546 176506 -258164 385412 82111 169216 -20966 -169691 46081 103715 -7758 179425 43420
11534 184392 38719 169555 -133498 187928 238047 10039 -279922 39685 171636 180328 -31114
11522 62418 -80432 -87286 100850 -1663 120650 192190 38468 75647 111208 260857 368576
11511 368576 305886 68789 148867 63323 76633 94826 207337 -126725 69737 436198 196286
11499 177953 26290 354047 1473 111003 114190 -91784 -51290 -125686 219713 292947 251030
11488 251030 257088 323899 18587 216263 -74187 99048 232849 75441 -220629 168647 187904
11477 187904 229285 -29217 298668 134159 149673 515104 435269 -173891 318912 104660
11466 505396 -11077 420645 321263 330415 156744 172572 252540 287024 113005 -131688 -101119
11455 -101119 386169 105232 -21312 308202 250543 83913 214702 108659 142174 -25610
11444 -19940 233655 113140 -102987 -480420 116726 -162767 224925 -9067 84022 205491
11434 205491 -69884 100537 -18417 -100822 32454 -67653 -120347 68804 257040 226420 45022
11422 40024 -92667 -37925 193366 -52599 -395772 56792 -273719 42594 -25574 70211 244715
11411 244715 -201745 69412 173426 142657 -60887 109110 208101 234131 159395 -105452 605774
11399 107996 -85484 -11367 61066 393431 -116654 -7893 -4574 -109644 281539 189626 98038
11388 98038 -155703 -89706 84069 -52618 437907 137031 -45033 -202060 -132223 -289345 124992
11376 225010 -207348 151938 200968 132262 40755 87932 -179458 65820 -77792 62505 72431
11365 72431 168893 106156 -8383 -307484 -72918 -164449 -256278 145039 -50799 220666 -124323
11353 -213853 94264 2636 12392 39398 154147 -35802 70787 -203432 19011 86593 165612
11342 165612 126887 -96182 5749 209045 -154990 38544 -62252 -2816 -413006 -119425 -120242
11331 -120242 86338 -415375 -76154 -203434 -256240 -104467 139553 -169697 -161791 -143700 169915
11319 -80792 134762 -115523 -89759 169958 -229953 206799 420184 45607 342812 -162583
11308 -86558 -95540 -151070 -198054 -90085 86652 152489 -54137 246392 65705 -235825 -1150 -163418
11296 -163418 13440 -173408 -168818 -443430 -142634 67981 -111360 -74654 246849 -141233
11285 -6022 5030 137046 -19386 -173369 86216 -367865 -148647 61072 226234 -178789 -174094
11274 -174094 62635 -67737 -134422 -44662 -401555 -427593 213627 94804 147200 -73031 138959
11262 -22674 152475 13292 -194370 188829 -120213 211917 172824 176315 171121 -299438 116504
11250 -250879 -178885 276913 -232688 161724 104314 76020 -86915 -201230 -297744 99790 25564
11238 -343837 14067 233134 26847 -153166 37857 -168272 49749 104119 -298172 -230001 -17709
11226 35272 -182895 -103896 -276335 -72721 236372 -68912 -283126 115868 -86617 -40211 -371572
11215 -371572 -266066 -32956 306548 185104 -120911 -90401 -47717 -137412 -124050 235610
11204 -268817 287259 22900 55095 155704 3912 125071 -23085 -43851 -131021 42197 -98562
11192 65292 -143376 -313234 -103613 -53164 -53966 3228 286096 -147009 9446 -201913 35267
11180 42545 153918 85229 93910 -104436 53031 -139874 -172096 -45999 72185 -223042 147291
11168 -117512 214302 242426 63976 -32980 24427 -281992 5796 -17123 136168 233590 86938
11156 51782 -407882 -207437 -285439 -29619 83993 -43859 201160 -78903 -7144 -191064 -122564
11145 -122564 327938 -171917 -398872 52311 -245331 -12994 91822 84576 -269096 274872
11134 146077 -342563 247762 71504 -29950 -127956 152934 76584 277206 234312 56322 93355
11123 93355 83293 43037 -229483 -94432 74490 42274 -29915 -76406 -30812 -202944 -125437
11112 -125437 268165 52333 252572 375342 -175635 -319523 40857 323162 -55869 -13446
11101 234949 149345 326857 326345 -8541 257706 157603 406883 297581 33438 155610 37383
11089 433702 207202 -170771 431529 223196 504925 377019 252698 214295 161629 -99000
11078 501715 530032 201313 60080 105651 -221389 272032 1547 471934 376912 266622 240711
11067 240711 499042 337310 506604 612430 458255 580089 263188 288705 438662 1032759
11057 1032759 617846 625308 741533 468547 778115 896763 799020 671103 894268 504712
11047 504712 740799 606433 740806 942325 885139 823192 928175 855862 961835 952600
11037 952600 968490 699914 807262 649456 755972 798864 556278 713323 863635 499195
11027 499195 645190 722058 501060 544151 580700 949023 789790 695984 788678 705893 615748
11016 615748 820179 643501 792971 879695 655539 787474 783721 614094 726709 658802
11006 658802 664667 706966 867871 551290 430651 735893 786276 559775 966444 802918
10996 802918 887859 623100 608693 712440 951572 700886 788768 983269 886377 797009
10986 797009 895776 1046649 1089106 1016077 1327174 1240146 1370020 1446398 1481081 1948588 2013974
10975 2013974 2275246 2626941 3046416 2973981 2762816 2751684 3035073 2653422 2402080 2374506
10965 2374506 1795280 1786794 1602351 1867876 1476877 1868894 1589612 2159972 1838509 1755274
10955 1755274 1904713 1467981 1280516 1506152 1303930 679566 516716 109606 775633
10946 775633 489146 648502 462190 253766 223697 180855 303025 228985 10618 74519
10936 74519 -200156 -98317 292687 175464 265280 -57412 -85138 263148 83498 -47077 -166383
10925 -166383 -47319 -156588 109329 -138546 68006 -248880 -189146 27526 -96934 35952 107127
10914 107127 -50177 150178 331937 110153 62052 28506 355984 -137248 -93035 177609
10903 311111 -7193 209460 -69182 -107474 8596 -62251 -104972 -106593 -281038 13199 -218946
10891 -55643 -91670 128286 -47652 -221136 -155647 -135511 -177701 -120850 44291 5352 -39162
10879 -63442 -10225 98302 -221172 16188 -309491 -213369 133020 -311454 100494 52518 105449
10868 105449 -82254 63096 -21703 -188627 -227401 -122483 97479 357717 -282315 151230
10857 108805 277802 -79632 49835 -80897 -188652 -322564 107652 132866 41732 208 -124426
10845 40677 -3910 108536 -102203 11745 -93578 -110647 -180231 142832 -171289 201373 -53456
10833 -5453 -124385 42920 -311757 -51235 -60640 127548 -228078 -63130 12603 -99161 -235908
10822 -235908 9957 -90321 83596 -22645 251599 70108 87907 -155536 232378 97867 -358039
10810 140937 -38473 -40095 112886 144535 218987 -222095 -157562 140607 -177084 -142731 -200326
10799 -200326 -51822 166979 -37239 -70070 220576 -76542 -81830 -72996 133181 -241333 196848
10787 167569 -64565 206228 40260 -167598 -194666 -68116 -87270 127867 242816 40331 -50210
10775 206241 -93165 -125162 -23548 -284025 -94050 28701 292918 -122837 61029 -33705 153947
10763 -412855 -3532 -217440 -179562 -294480 -120395 -143392 8894 -258195 -156381 -109457 221731
10751 76955 -52944 -133262 -72948 -70040 96493 -325618 90283 150610 -66414 -5236 40573 -123882
10738 -122564 153070 18799 114112 69068 -589742 -208685 -207996 -9391 -15158 -376327 -194092
10727 -194092 -218443 41258 214925 -233917 101410 -47473 14140 290707 -142968 -91226
10717 -91226 -31398 -115883 -113772 63266 -94309 71953 2080 -30363 -43893 -93277 -191347 -63210
10704 -77683 126952 -97756 -71843 -6337 80006 169260 -76465 102016 81213 -242806 -142931
10693 -142931 -210282 -273740 222039 -202703 -24292 -51884 342746 87295 -135650 -102024 -305316
10682 -305316 209564 107949 -9416 -65934 -1631 88365 205758 59852 423565 69575 -67956
10670 -31157 -117822 -137972 -67092 -16492 -287967 -66810 61895 9714 -57861 96066 -45550 -178616
10658 -178616 275794 -98742 -250150 -221622 -152919 30054 201494 96206 -167833 -35425 -88454
10647 -88454 22969 30676 110708 -250147 140586 -247091 77850 -35099 119455 -118972 -65351
10636 -65351 -119441 -142036 -481486 47495 -41247 958 63721 45213 50906 -94678 158208 -294300
10623 -116090 -221404 112551 84874 -518317 115162 173235 35354 -155258 155218 102545
10613 102545 -294401 -166021 -97895 142804 -55947 -35350 -59237 -4291 16104 313745 86094
10601 -299658 199314 35955 -146615 -52925 -143921 -237126 -115836 -9938 63630 141997 197503
10590 197503 2977 -76060 11441 -128114 142697 129399 -94431 -33176 -11146 -72779 72088
10578 -284856 107009 151628 129438 -15020 -157143 -71880 10114 -22273 119595 -147959 257597
10566 -196785 -277587 224237 -200525 84943 -151282 184551 28248 -38672 148600 -29619
10555 -82120 -29565 -122305 -279447 -362372 23372 -269017 -53688 -97237 -147720 106458 -264005
10543 130529 -179813 -116113 260500 86081 -54217 103909 96542 -229930 22541 -51816 -25739
10531 92223 83956 21231 141323 -207373 -276920 75100 -124327 61716 193405 -134353 177418
10519 -155590 4204 121957 -19921 95936 76267 -286394 -15306 -257890 -147291 -99519 -9513
10507 -178732 -101290 275228 -126129 864 328098 -51870 83894 -126735 -67550 -18300 161687
10495 135457 190569 -263892 107240 -368447 -84181 -175547 -34500 48959 26141 129602 341785
10484 341785 -18881 437587 518932 587901 468859 410650 -28852 107767 153229 32336 114570
10473 114570 -90570 60057 142323 -20183 98142 -170315 -328488 119504 -243904 -275956 -224298
10462 -224298 -245232 -296665 175933 -367060 -196620 -98345 -48030 -65765 76651 203848 161757
10451 161757 24360 -322481 200069 247436 115889 21069 103428 -62302 61678 230482 121888
10440 121888 -274942 -147441 59078 70439 -185708 -83548 -373094 -73364 -156713 50879 18354
10428 -260532 -15579 112833 -207090 -231945 29520 -29189 -19485 -239483 -174259 -203670 130542
10416 -103382 -153601 -479801 82303 -6128 -86818 -202796 42294 183840 -177287 -487251 239591
10404 -163714 -175987 -40438 165304 146764 9513 144189 -290760 463385 12650 -141179 186700
10392 77743 397792 -26043 -211221 326075 28437 212196 180313 -109616 184803 -79283
10381 -131255 96386 287787 134089 167019 10510 513195 261324 305113 180961 363690
10371 363690 323355 125538 148609 471604 676947 354258 617440 266430 450554 198703
10360 195497 281172 341667 211318 389693 207349 3314 458066 186441 626713 178251
10349 445029 664868 468450 82861 145387 214164 313447 469324 217698 271400 536352
10339 536352 519051 341124 458718 60130 92715 287027 -60266 140008 44640 -69133 84312
10327 -105765 -129807 12199 188630 -163070 31294 307347 128448 -148798 220317 -292179
10316 291022 141417 -95984 55380 99263 -160708 24424 19732 10107 -67777 -153391 44194
10304 199608 24334 -143870 -192956 -180129 228428 69740 -51737 -81346 -10421 2709 -41741
10292 -499838 -214945 -136439 -157412 -162080 -2504 -150341 151988 274374 -125091 122601 167465
10281 167465 -141667 16823 27032 -339203 -227504 280706 -54917 300785 -46555 8780 40173
10270 40173 -9034 523526 -264519 -123126 166707 239610 -94312 -237363 197847 537978
10260 537978 420134 670806 544304 284748 306550 -5958 76740 113353 -156735 157835
10249 -225077 -413949 151833 -288368 5260 55551 98231 -317463 12626 -16954 -193664 222971
10237 -16511 -311891 -97651 -85989 -283608 219797 76697 -300194 -187380 49321 -63737 18344
10225 -72356 -284268 325613 135002 30543 -182228 324 -189718 -29004 38239 -172176 -79324
10213 22335 214529 -109620 -84594 -81888 17360 199140 -38566 117103 -12370 -4753 -200422
10202 -200422 -618319 33632 -253119 -100265 -254690 -6618 -365393 -133658 98220 136229
10192 136229 -162863 4321 118834 -122240 -297320 -122686 -84325 -114220 -181086 275747
10181 111868 -202890 155757 -356420 8605 262452 -20612 -312961 -246423 -36759 315 197235
10170 197235 194493 35469 -134571 44537 142972 -230978 108541 -335447 76430 -118507 -211776
10159 -211776 214199 63401 -238540 -115452 -14993 33119 73838 -174614 -130286 2247 -353807
10147 -197902 -122190 -354321 67356 18817 331102 163487 -128780 -113629 189521 -29695
10136 -413166 -307836 -16621 -360584 102153 -36247 -145078 -111345 -186494 42507 -130623
10125 11721 201278 78144 -648780 -127191 -154186 82600 131813 -93487 -168295 158551 252008
10114 252008 -142012 -39474 -16157 -33739 -508039 -96659 37818 -290215 -368820 -132859 -28464
10102 16707 135761 -247595 -178503 -132224 -184442 100454 -138501 -274306 106277 -49264
10091 -175910 230189 -207764 30365 -12250 -107188 -55660 -393659 -371249 -14629 -172642 -118660
10080 -118660 29623 183336 -63203 -191890 -711 -385599 21210 -191582 67839 -172592 11216
10068 39066 -158770 -185803 -321296 -48748 37994 -1664 -178328 -132293 298951 -38716 108839
10056 79628 -63081 -121701 145798 80274 -105320 6248 62241 97868 -49938 302469 21071
10044 -108012 112368 23929 -74122 -112592 -256703 144696 -38437 -302373 -58020 -255995
10034 -255995 -62036 -143503 32035 51028 -158604 -52295 11439 -194975 19245 76485 220453
10023 220453 108109 -93092 -43048 12026 -68526 -151547 -146115 -197900 -259682 -319366 -218135
10012 -218135 -101923 132497 -17097 13687 -55278 60208 78595 4085 -210028 289975 -71215
10000 4705 -61112 -236597 106481 -97837 132045 67830 -23340 -113208 -169171 154152 -216192
9988 46854 -216897 225964 130630 109887 -51370 -119675 -140395 -299061 148066 96191 -47169
9976 144319 -33943 -62178 -237499 -286680 -65099 -19337 -179662 133361 97912 157624 -101948
9964 -117699 51470 64493 -196868 102582 -298527 -308422 68186 -16000 2986 5755 -323836
9952 -54622 -147076 142542 -133516 -281859 164271 -301915 -110541 -250274 -19878 -285810
9942 -285810 -332616 -44625 49264 -54438 35359 -14465 -37096 5161 16327 -79837 31154 -24773
9929 -72699 -145764 -195338 -88307 -188667 170984 346928 -92255 -263407 -258486 46608 -256896
9917 57084 -574555 -260253 217849 -116066 -4655 10817 47360 -287474 -83859 -33125 -183787
9906 -183787 110704 -237903 189975 -57363 7313 27455 -403669 -364957 10163 43539 41194
9895 41194 -284276 -137338 -230328 285234 -369188 -241026 -298049 -45791 -143069 -107382 -114690
9884 -114690 -57006 -30807 -156183 -9718 -194141 -180322 -102301 -57465 -256804 -35912 -125744
9873 -125744 -203951 -254897 -209212 -85735 4148 45569 -161637 -137559 -109722 -45438 -46111 38869
9860 -77334 246269 -116989 61335 -303890 -126110 218955 89062 16884 29143 -145709 163664
9848 -25363 -90106 23274 152171 -140742 -67769 223533 89125 -65336 -173845 -75248 -57144
9837 -57144 -136684 -145055 -1661 -113833 -26985 -28329 66580 220619 -2644 69867 -143677 23082
9824 -84741 -94296 -301897 51735 34582 -248872 -211404 -74977 -387822 -217853 -15790 81939
9812 -141613 -301528 -149927 218523 167877 78200 160702 -175170 -39969 3518 -15731 237010
9800 2102 -113269 303131 101131 -305264 -362860 160521 -194326 126127 -71453 -157221 233659
9788 -196362 -185674 46182 -2866 -24305 48321 -271873 -141666 -427548 -14306 -312328 -136049
9776 -175234 -226183 -82685 130999 -29028 -55909 -67517 -170129 -194877 -161016 -89060 -71016
9765 -71016 -151407 -23753 85503 -26150 106870 -199783 -194707 -113700 -81663 -59281 -496263
9754 -496263 -71965 -224111 -159610 -196296 -94089 -48076 -318371 120918 83734 6397 130095
9743 130095 -56951 -297032 38448 -28280 99200 90854 -74817 -260430 -134666 -244993 98890
9731 -163005 -197433 -337514 -62382 13633 129670 -331912 -255366 -194105 -253 -100780 -11993
9719 -94505 -212771 29429 -293112 -16512 -9433 -70287 -78686 -16768 116503 -98252 26686 10571
9706 195224 -8047 -433355 -188823 29890 -224909 53380 -257387 -56999 -84487 -142294 -119200
9695 -119200 -144123 -140841 88762 145614 171479 -22828 -121411 37956 -11377 22746 48675 -43486
9682 148388 129317 -1286 -326141 -164987 215935 -196110 140173 206007 168534 45783 -126449
9670 -204572 -151724 175401 -157053 -140268 -233376 -14104 -312312 145162 -314 -91511 63684
9658 -314907 94607 -340411 -131705 -97387 -322315 -5360 -107519 -1164 -42515 62300 55381
9647 55381 -81447 80028 69336 3752 -79232 64775 -204192 221873 70357 39600 196131
9636 196131 28596 320908 -447354 -459951 -10680 223394 -53225 -74262 -104419 -24136 66137
9624 -12672 -2000 -87484 -290909 -123429 -308568 -120224 42476 59906 109389 -47358 -93286
9613 -93286 -150692 -123474 194004 -45676 -59801 133364 91375 25009 85104 -160653 12802
9601 -74382 27680 21895 -348429 24168 205481 62335 91936 -118457 111651 -30007 116532
9589 -161043 146120 -7452 -135882 11857 -193870 -101328 -211972 113732 -220336 -178703 53436
9577 84934 27676 -112914 92733 -89346 -140803 98382 149872 -39697 -329644 -259646 75425
9565 50662 314089 55328 -236972 136986 -22738 105618 -118541 -169000 -87120 -82850 -26132
9553 -168018 82457 103865 -148954 220857 225068 318100 -260108 -40850 -326979 -5339 116952
9541 424356 -270509 -481833 118343 97866 -145311 -220814 -156519 -82497 -116844 -118038 -154760
9530 -154760 -144247 253117 -76872 -124993 -110118 42960 14207 26799 40956 -456095 -160516
9518 -312295 -84089 71215 -229037 -257232 -106856 114349 -133424 -136455 -143263 -28631 -351027
9507 -351027 -438501 -184798 -164510 -112525 27993 -3205 23382 -48021 -63305 -185542 -106581
9496 -106581 -127878 49723 -216638 159937 -60457 306103 20910 -28510 186348 -100029 -130260
9485 -130260 -168057 -37629 -131386 168357 -4853 382057 -19376 21346 -128758 -77311 -347468
9474 -347468 -39643 -238680 -163721 115972 97018 9627 -41274 -558498 -118422 -182030 14044
9462 71766 -100785 -473642 -33669 -138071 -92354 -112803 -440874 -293425 -191615 -11552 -176414
9451 -176414 -350647 -123041 -18426 -195178 -111243 -29280 -204465 -108458 214936 149939 -263116
9439 18350 -342739 56589 -331310 -76393 -112769 -99223 -74896 -220610 118880 -207087 -76234
9427 119426 133847 -134472 106228 47401 -182807 189915 -519626 -64512 -27981 -29632 -75746
9416 -75746 413883 307669 -216216 -318331 -125318 276475 190697 564659 -366016 -402999
9406 -402999 -129464 101221 97939 259932 51863 122112 -138841 -119928 -163087 120330 -189018
9394 -233147 12788 130103 38833 -59202 65709 -71964 58704 -95078 -247785 -92987 151691
9382 -333665 33031 -58883 106582 -287166 -6665 185716 -179289 -36761 -198010 -213386 106434
9370 79988 82179 68079 -21222 179324 145139 267849 -113315 -58647 71530 66402 -228208
9358 12759 20289 137173 -124655 -46863 -288190 355518 -239253 -91963 85356 1849 -412434
9346 44657 59328 12903 30775 38497 -56081 34166 -189544 -115844 -92886 48390 121645 -73266
9333 -107588 314180 -528357 -422307 -254511 -57991 165911 -1426 185385 1852 -146385 -263156
9322 -263156 182182 267114 -25682 196398 -53944 -77865 -466645 -14110 -12044 8099 154186
9311 154186 226331 61510 -39276 -64707 -278827 91092 -274861 34710 -238416 88318 -82393
9299 -238715 205754 -166727 -160656 -28995 -255363 -296470 44022 176826 -7372 -75604 5758
9287 11609 -55840 108355 -106981 236930 56096 118506 -162583 123734 -8673 196005 -108539
9275 -266887 227526 164153 56775 107859 -316492 -67450 -83747 211071 -143706 -129199 -165521
9264 -165521 -16692 -288266 -213841 68061 165689 -141793 -369766 -154484 83131 79720 -116778
9252 164449 -108497 59906 62402 -292501 190581 -106950 -18738 152668 -388583 36158 -220662
9240 111140 -136524 -152292 -171408 -88625 -241301 -194201 81163 -158855 10875 -156026 -284785
9229 -284785 137188 -70622 -81210 96851 87092 68086 29136 -122252 -69560 -119564 117522
9217 147019 -241877 -18931 -186554 78762 -23841 8520 70441 -230173 -238636 10155 -222708
9205 -18704 -139579 -353498 -68536 -279534 -311035 -43712 185306 -1436 188624 -371126 323998
9193 -219054 -278379 -259051 10024 -122074 -162775 -248122 -10116 39564 269787 -162444 322772
9181 -166275 13654 -30703 -178849 -98834 132410 -276177 36266 25323 -162880 92175 42690
9169 -38475 122131 -107339 11210 -349801 -50002 -397215 173409 -213950 23904 41321 28182
9158 28182 -29677 -42261 -181540 -250065 72685 -261125 118083 -55203 -206735 154196 82634
9147 82634 26303 224787 304862 -392241 -96657 145308 106607 -194735 144681 -29498 -198746
9136 -198746 -212268 -430504 -130083 195678 -433533 125985 -95522 6709 143464 -36182 53186
9124 71042 -154018 57358 -155989 -223497 -37865 -374787 11464 21326 -272846 185652 68999
9112 -207214 -192855 78059 2701 111610 32010 -172981 71726 -68830 34730 -31661 -31135 -320684
9100 -320684 -147989 280438 -44014 -201597 29987 -281699 -265386 -39057 24661 -57606 -591514
9089 -591514 -201461 -358856 -211541 69255 61053 -25672 15074 -81590 -146174 -312808 -192744
9078 -192744 77841 -167192 30513 -47067 -275732 -141390 34310 -48988 40431 110743 45442
9066 -222155 159055 -87028 -161821 -60537 -156813 -76248 129807 158161 157039 -143423 -156716
9055 -156716 -128642 -72614 -160287 -255437 -97569 -83074 236991 -54454 69641 -116729 -110621
9044 -110621 -230797 -214581 -179369 -47097 59053 -62856 -228509 112150 -1276 25934 -113367
9032 -65610 214648 -28778 -139396 14704 -16288 -82678 -233603 -326550 -27699 -249012 162517
9020 -100428 -125844 -22760 122884 -229579 113300 -245202 -86295 -42216 -198578 159038
9009 -62131 -91197 47312 -267173 84198 97939 -305412 -121405 -294702 -273228 426985 81279
8997 -83201 -432733 150319 -80720 198954 -38546 52012 -178264 -18685 -96038 -182072 36370
8985 61180 12963 65158 123757 -196897 165275 -275542 -79500 -16151 78832 -100295 65709
8973 -2148 -201688 -233729 97824 -149416 -63026 -104493 -43683 68547 -380073 -27965 -93023
8962 -93023 24268 -244339 21071 -75187 -92728 -118508 -114756 -226860 219768 46266 -208560
8950 -152529 -96748 72529 310608 16861 -279764 -114552 -404700 -227139 151977 -179682
8939 -111481 -116807 -140158 145156 105950 -186546 185729 137068 -433032 -144272 93064 -281070
8927 53388 -182773 298517 195452 762704 3620553 8486350 9989667 2179666 806649
8917 571301 331322 148103 99681 170302 -87354 148597 128201 13253 -159592 453284 -258418
8905 -76907 -236882 -53255 369353 147198 -285727 167132 -19219 -130732 -94565 -58997 -232088
8894 -232088 136169 -258131 -296316 -17721 176647 -72826 -93767 -199755 281901 32199 122221
8883 122221 -191184 -261311 -21622 -164674 89591 -277629 178318 92114 263837 265597 -64558
8871 57238 -97808 -275966 42272 -137079 55332 -117602 -171435 -92306 218780 -154374 -351058
8860 -351058 -155715 -26277 -64372 95413 -156872 118903 -184596 69058 -204962 83878 -200516
8848 -215271 -354691 408628 80205 152042 -113252 46076 -300784 -350806 126271 -180218
8837 56429 -144218 -48477 -122213 -43086 160732 17183 228163 -279382 -203450 51111 341710
8826 341710 -87843 -75385 113841 -104111 -32448 -104258 -314318 -8825 179720 -102407 116557
8814 56711 -88637 136795 -10233 76353 -92075 -259456 -95866 347887 -52900 1883 -14975
8802 244455 -139559 -170153 49080 -53530 -143065 -212715 -153516 121336 67800 180838 -144424
8790 -57961 -67763 119698 122280 -39709 47463 -425048 -374136 412264 -65209 9449 104800 -459544
8777 -78933 -115028 -151925 -394364 64551 -74920 3501 -139217 -169715 7563 70093 -49390 -208201
8765 -208201 -177956 138455 -113878 -260851 125758 -325843 12976 -341596 53907 -103333
8754 -208084 169199 102843 -192989 -27952 -152456 377064 -405652 101887 15701 107783
8744 107783 -132354 137543 399232 155432 -309827 -140273 10798 -280007 97981 -300579
8733 -193165 -26780 225460 -42272 -157277 -49521 -10844 66398 -224570 337140 -142350 -139202
8722 -139202 31871 45492 -44924 -146582 13099 -79264 -445755 -6742 19533 45497 -278367
8710 -75820 -232466 114700 41615 115773 -228405 110812 -25026 118480 -92106 263815 -152052
8698 92102 -316568 -90559 -335022 -195134 -93177 -343970 119089 -309205 -163638 27703
8687 268045 -228499 82503 41395 -116909 113987 286137 144546 -204359 -38221 167847
8676 -154864 -12197 -276529 -90436 -59697 152669 16140 -326409 -32496 -69485 6834 333289
8665 333289 10376 6680 -198961 14739 -177949 -119282 -177375 97462 2877 -203517 17592
8653 -4163 19722 -206320 -314672 -386682 68118 -13950 -266693 -125448 -531071 -257148 -153398
8642 -153398 68587 -20734 -60443 -265280 -33068 8701 -1301 41454 71579 -177821 -56064 -117403
8630 -117403 -150319 109856 33221 -258550 -46552 125532 -563744 931 15101 -2548 -29869
8619 -29869 -91562 -104094 96754 -141584 -185925 -22130 -184501 103337 197431 -120024 118024
8607 -31524 10053 -95585 -388857 -129677 -92674 -102075 -119343 -157056 -135866 102460 52472
8596 52472 -201702 -174411 205558 16218 -156629 297711 -57784 260847 -288137 10792 -128837
8584 420318 22858 -104173 -26862 92931 -76291 -129707 58708 -279980 113869 79990 -5166
8572 30462 -126434 40071 20926 -265094 119418 -30706 79168 128545 -109311 410154 -135270
8560 -165219 249587 121594 44266 66481 39648 42614 -131203 189237 45732 347253 31977
8548 144401 -105681 -112822 90854 -274986 61524 5243 -91843 -129221 -44644 178314 60431
8536 -69142 -350600 -82562 -90324 -75386 -62337 -148577 -41773 -238197 -175763 78479 -81596 -82325
8524 -82325 -251378 -22484 -15507 165834 -106984 -34450 329645 -29716 -140187 78884 175366
8513 175366 -223362 -265817 -147503 -99454 112646 -161236 -127795 -516609 149490 103562
8503 103562 -117797 157190 159449 -123852 444665 5699 -180674 41209 162214 -205263 83908
8491 -281938 137627 29697 -286486 -312023 46619 -98101 44241 -16282 30663 48750 -1463
8479 -77736 -215008 311927 40353 114124 189683 -416771 -117209 -142245 -42419 2675 202991
8468 202991 -200294 347403 -233743 107477 -25317 89027 -121295 333663 -144973 -146220
8458 -146220 -45678 125665 28393 -69160 215758 -86948 241947 -97956 91958 43924 74294
8447 74294 -68107 -332379 93634 138340 184833 112241 -155649 -229639 -296980 141051 131058
8436 131058 -113580 81117 -261190 37865 -325941 24496 -116834 -272090 61557 -208891
8425 42897 59746 -402444 20228 -74584 -97817 -115597 -127137 -248543 -426155 37790 1342
8413 -157138 -29098 -77857 139409 -72833 -218462 225880 131700 157854 140735 -188178 14855
8401 -60081 -328475 -17265 -57855 -210976 -145384 -126793 -6375 -70581 -10502 204512 45845
8389 67239 -293962 -25220 102458 -476947 -36076 -218743 237221 81051 -244402 25646 59409
8378 59409 54633 -17664 105610 -265464 -125866 -125464 20878 -162529 71656 -193099 -56049
8366 -271960 23119 79624 -54599 167733 -78084 -221716 19939 -279342 -380942 133124 -41952
8354 71768 19215 -49524 72258 7239 -63783 -112802 -13661 -129544 121793 -84791 35483 -209973
8341 -126808 40324 -174034 27514 -2361 -190319 -19191 -98092 141735 16098 -182889 11173
8329 -135630 -41105 -25433 3111 -45839 1954 -21136 -52393 -91647 90434 -90359 247125 90069
8316 170513 -14961 -291362 -56448 157133 -140332 113871 -121418 57125 63305 91804 77151
8305 77151 -15174 -289715 -77408 -180550 -35272 -248264 104842 -146577 -354229 61446 -166515
8293 30824 119758 -34348 -102160 -171266 81320 -86685 -214796 -300133 237505 52708 61448 -477829
8280 54947 -20970 -119027 104156 -76127 -58903 -65281 -12168 -19345 -34021 132854 -177608 -130036
8268 -130036 -35804 2945 -45707 196432 -16130 -345116 38738 -85659 -152642 268388 132343
8256 -257372 -133646 -99487 -360975 142306 -177849 -193343 117944 -158167 112026 -90379
8245 -176106 -201827 7893 225271 -100309 -212703 92441 139795 -292947 154204 338113 51696
8233 119185 -204724 102662 356527 -94433 -62012 -197148 -202562 173607 -228752 302642
8222 55608 53745 27407 270265 2205 185445 279928 -105941 -96241 180272 14993 -15873 -231164
8210 -231164 37343 28769 -56375 -368090 -45228 -226261 -332296 -211784 197252 -36208 -30644
8199 -30644 -61956 76285 -316413 242198 109569 -228134 124120 212855 -109550 -124065 -92164
8188 -92164 120062 -353217 -497198 332842 -9662 -17597 -258484 219780 -251589 -292613 -14781
8176 -285309 219810 -27301 152458 50945 70173 -196177 192485 161183 85618 -94274 -321992
8165 -321992 -22742 -202138 -357338 -300395 -89835 215931 225859 121969 -38061 28687 -329092
8153 73725 111796 -387043 -97176 205390 -29566 156429 7714 -7607 -247560 -81605 356629
8141 293920 -129432 143137 2625 -238344 66258 -81542 74368 -17533 -51675 -190150 211529
8129 153479 -75275 -284352 -224434 -250268 2612 -106059 -280793 -236748 -139648 -251073 -6812
8117 -100200 149555 47617 154128 -40259 -143496 -237313 106948 97389 16113 -107577 -82885
8106 -82885 140388 -72245 -335878 263454 -68337 -283479 349944 -99061 63913 61789 34999
8095 34999 -56428 -30134 349137 -20041 185065 188376 -271826 141692 -100796 8726 -214010
8083 -277959 49588 -194731 -219805 -38737 -159 95321 -16156 62872 -94502 -105585 -60327 -246038
8071 -246038 -72789 -62568 53907 -35859 -183260 -188478 -71131 176320 -125028 -101724 96941
8059 -187969 -19561 116737 -74487 166882 22776 -19664 36212 3507 224454 -405275 -121308
8047 -219924 76205 113936 -95092 146238 116213 -21045 -143561 -132010 -154117 -10690 -468721
8036 -468721 3597 83289 229283 -114679 51004 92565 37141 41269 113912 76557 226428
8025 226428 -46697 24942 52655 59547 -179494 187292 68666 -12699 -296752 -260804 9761
8013 -80095 -100053 -220640 77161 149826 -227383 108253 -114402 -92485 -9312 -93172 -150443
8002 -150443 99630 46422 152645 200087 164434 -5733 85498 22392 32960 -346285 -75867
7990 73430 -209844 86929 168224 -555056 322016 -139339 54263 -119503 -50735 53514 423396
7979 423396 123339 -152806 515137 -175800 -261468 -51177 -309395 -149822 -139284 -280701
7969 -280701 46494 -371294 -96493 -143595 229158 -299349 29567 -187056 7083 131344 -59718
7957 -16443 -191855 -96350 252654 -260793 122362 60172 -126077 -16426 -115505 92792 278635
7946 278635 114150 -157170 -191509 40449 28044 -85968 15753 84739 293246 187613 -11454
7934 -207127 220725 -345968 -133030 86633 28407 -37750 -55099 -64910 50162 -424618 -173616
7922 162503 -18132 309043 72294 -87601 107312 -3874 -210780 84931 20657 89503 -252798
7910 45792 -178402 -225401 170220 -60846 69651 -64833 76409 -380393 -7022 65624 144717
7899 144717 -123230 44708 1966 -99305 -369434 -160426 -96599 -91289 -13190 -268024 -13508
7887 8834 -50524 40211 -85236 -167176 -173880 3062 28935 9478 -114361 -160290 -206487 116785
7874 165947 -66953 -110240 -124463 85137 84740 -181702 -136632 -339615 -279023 158898 21658
7862 144657 -140726 -27428 200648 -189594 -173104 -114009 -119703 234548 161699 -214496 -154543
7851 -154543 -247389 -429260 8037 -100763 -213121 -11268 30353 -151120 -103026 -17857 127880
7839 -397694 37710 -101714 -137481 162091 -9841 284072 -11742 -187202 138858 -259592 247915
7827 -84357 16541 -276690 -183095 -279369 -70018 -145295 -73151 99711 -28580 -169650 89874
7815 117320 -274425 175373 -241461 -239193 -139503 199696 -10835 159038 101962 -9932 28315
7803 -107014 108557 -257325 246239 57561 -59776 -2803 -207184 210628 7783 44286 63697
7792 63697 -144611 -30806 98676 99222 81850 134234 340185 -150428 66583 -193128 295913
7780 -177853 25081 -124201 -175568 170263 -80198 -25016 -277490 -133196 135157 -47220 -22502
7768 -184223 101491 124925 357836 157370 -373478 -43527 -228575 -189112 -44480 -99715 -68699
7757 -68699 -299602 -347251 -261946 -491027 -85322 -44485 -100229 -53123 243409 -329586 -241097
7746 -241097 16775 -354093 277579 -199934 153944 95947 -91085 6759 -112241 131471 -251951
7734 -82795 33850 189066 36660 -94288 -117111 26346 229278 -366859 140825 -382170 -98824
7722 50102 -269841 -213493 -153699 -102469 -512084 -42192 50693 80297 221987 144571 -49798
7710 156464 -291868 147492 183769 62869 -135794 -51649 -446147 60146 -30118 109910 -187987
7698 102356 -543539 207427 223168 -351236 -92004 -14916 -306543 197225 -20790 -172465
7688 -172465 127244 69237 25303 -305863 113680 -12155 76334 87310 18901 -44222 -307539
7677 -307539 41964 -237869 7131 257250 142546 -145715 -345324 -91707 70826 -147130 127599
7665 -169852 66027 -129648 -256830 -356588 69575 -164662 -132492 231416 -12343 113414 -123374
7653 242959 -301615 -81256 127173 -73322 331267 190581 45681 57779 -269430 -134286
7642 -27076 27001 -191832 77794 -58896 38288 154154 -180406 -159532 126856 133190 -178801
7630 -76227 -28690 -97332 -11208 80359 41181 -95443 323701 -520136 174154 182965 207822
7619 207822 181068 367272 -116028 220348 10474 140398 -17814 -362617 -288934 -267319 -88090
7607 -87957 16097 -95054 40719 53823 -90690 -52281 -68731 -68926 108034 48400 17525 -189769
7594 104830 -2403 -58111 -208487 -72373 141961 -150587 -71940 -102723 -77332 -117253 270922
7582 -49358 152126 -60118 76596 -86601 12471 -10510 283650 -103197 11112 -146352 -8800
7570 -158140 171867 -438796 -92770 257677 -81905 68339 -245626 -191606 146027 357556
7560 357556 121244 67827 153062 -68252 -112738 1450 33225 -55517 176476 26439 -58199
7548 -9018 101671 -258368 -239903 -114938 36273 -185032 -42499 21887 188551 -111137 242034
7536 160951 -129706 14413 -90190 -293083 -153185 -184516 -139278 -14995 48877 -141280 -170173
7525 -170173 -280314 118154 -35696 -259025 -156087 102867 -165843 -123907 2953 34756 23255
7514 23255 -22726 176052 211338 114827 139856 167744 -168157 23414 -181165 157320 -171497
7502 -194278 57299 27604 -167427 16305 -256795 89539 58792 164823 112510 282877 -182972
7490 -192887 19094 21760 146715 -155790 128469 75870 130802 -13873 -98184 -18335 -271897
7479 -271897 -354977 -42535 -57960 -217655 331181 -81691 -29570 9525 -246264 -134480 219686
7467 -226419 2587 -143146 -320812 -11082 -178879 -60622 -115716 -16833 -29265 -52155 -239264
7456 -239264 209876 31553 -50278 31655 -434029 -88489 -179097 360958 -199503 101052 -208460
7444 183779 -187445 -84145 -23835 -56940 18956 5401 -144964 -31395 75989 105726 -31731
7432 139204 -186494 157343 98627 113816 -192847 11764 49903 -279451 -164589 -48949 -152499
7421 -152499 -44024 -13145 7895 174724 -83462 142844 -142414 170289 319748 -514 -113667
7410 -113667 -58697 -209133 -1025 150430 54205 -197067 227252 -58181 228135 -188725 63086
7398 377733 156172 42647 179135 60162 -315926 284750 -309097 -279735 -275539 52257 -129335
7386 -28887 -208753 59083 -170499 -112494 -80748 -288481 160661 44606 195726 -130911 -158068
7375 -158068 93066 -277201 156053 355750 -197765 -58883 -7618 -101421 -20390 -153327 -1322
7363 142499 -141180 -249683 1269 155368 -226593 -191194 112991 -301055 20180 124660
7353 124660 135588 -124513 103899 82692 240617 -158516 -296424 14949 -80168 172271
7342 -137111 87281 -170254 4369 155269 -242683 181115 -68320 121193 101513 53783 -68973
7330 -122567 145538 -262245 -27782 -78651 -67061 -280759 -386419 -182607 -27523 101231
7319 95694 138615 12062 -105640 -7118 -161818 156824 -285880 54736 129479 15211 -354499
7307 92599 54776 265376 128296 -425199 -224618 21412 -310509 -15591 -177895 104366
7296 18108 108082 16851 146541 -72346 -276444 -267289 -57374 93692 -60865 -377799 -37162
7284 -61126 25809 259584 319147 -19745 144411 -130885 -200489 -121027 -163135 -308 -8806 117394
7271 -57269 -5343 27163 -147182 34654 42993 -228974 -41557 -160858 48063 -421674 49875
7259 -28582 14964 120992 23304 -17626 -146803 20717 -334358 -349874 -226745 -4760 -57493
7248 -57493 -166672 232448 165107 -301195 158751 255332 133823 -10529 -209821 -288688 129736
7236 -29141 -154783 38476 -31166 -193359 77930 72533 -95022 -95161 -263112 -210571 -113875 -202395
7224 -202395 -71268 235310 226237 -7546 -140504 -73883 -209873 -569201 164580 -214840 5069
7212 -177895 123531 -152879 32402 269659 -177169 -41810 -158049 67058 88568 -56415 -87239
7201 -87239 -96177 -255013 -78723 83139 -127408 360885 45417 53540 36903 -72046 134001
7189 -16553 -84807 911 169934 140091 112656 -25483 -53154 -30572 124617 -156122 219097
7177 -22832 52228 -136271 434328 -111086 -148212 -37124 -4385 284975 162219 -101896 -141255
7166 -141255 -30522 228570 -2010 -44464 -242877 -89693 -45922 -11738 165568 -82200 130903
7154 -162104 49125 105671 43898 -22922 -134377 457219 -256520 -81790 -76074 37234 -29722
7142 -108153 -22857 107267 -52529 -130399 72322 133296 -32105 263052 320351 5815 180018
7131 180018 -191548 -80308 -197537 177813 380326 -29478 -142407 -79271 136550 366521
7121 366521 7996 3900 125492 -266805 -206279 183278 -65368 -124878 146788 -174446 -411899
7110 -411899 67850 63298 148387 -141858 -178363 -28499 -51640 -295175 329759 80136 -316081
7098 -41803 -214872 376577 57927 -221306 -220996 185163 -163245 -302816 -27033 153556 34801
7086 -5305 49588 -149034 -40081 -9354 171984 81265 -106122 -345843 57728 3689 -315675
7074 -101702 1413 -176481 186006 198916 -146771 -285270 -224302 -124168 83253 -229973 -75326
7062 101903 -65691 -162843 46641 20421 239425 -111287 193729 -112957 -43000 -141656 -198687
7051 -198687 -187115 101776 -250896 -160067 270133 -196384 158532 36137 -250071 -220711
7041 -220711 -152053 -182313 514243 3220 -253614 192798 202939 -86226 18105 -176706 87163
7029 77942 58863 34243 -34538 -16061 -62933 -110808 -244790 145981 14492 277653 11657
7017 -87433 -72473 -205129 187069 -301441 -106623 -517103 57836 -127267 242572 -254207
7006 -180144 105060 107307 -24069 -234701 -37831 68843 -64778 22718 53769 69766 -186049
6994 -34850 -17339 -149784 133823 73276 185247 29418 -159739 -54796 -13090 -69325 -47241
6983 -47241 -69510 80011 -27332 -71935 -159883 -129406 -108214 -116251 22461 -150554 150022 3616
6970 -363999 187257 108412 32852 -5683 -202142 -183278 28708 -25292 252551 98256 -674115
6958 -16156 -309305 13434 82771 -19415 -51204 129881 -146182 -5636 302742 -140801 -77081
6947 -77081 32094 -267669 34509 -308775 161924 -22595 -5595 -122846 -129964 5450 87288 -126839
6934 -233041 211110 118617 -271328 -302504 163935 7475 -106520 -44227 -156598 -217668 263585
6922 125087 -121820 15771 -53163 -199777 10119 90595 -119639 110961 151057 -409884 -67185
6910 -110616 107686 -15305 -127546 -225176 -234299 179004 -203745 126074 -106912 -24465 -84014
6899 -84014 270360 268506 163496 200529 61842 195614 192725 99271 -263351 131034 13249
6887 262925 35677 127561 -203317 -11615 -59720 -287072 4601 37362 231006 215925 93519
6875 -117579 -84234 -69458 -100175 -150473 166512 145214 98059 257283 -23052 -155900 118771
6863 149380 -135696 -217096 125666 23309 64891 75620 -142108 121154 8139 -215507 200789
6851 -40954 -117573 -215219 259449 257302 -125890 85783 -100670 -240671 100143 203897 73322
6839 141548 -99004 277382 271251 54064 -221877 8013 150133 -91356 -20949 183954 -257829
6827 -256470 74992 -32936 -130566 -91859 195111 -6504 -188662 -188368 -160318 124835 -452370
6815 206343 -124433 -109071 -107096 -131120 -18128 -12006 -54947 7706 145618 -286165 -11054 -125115
6803 -125115 -87759 -2728 87559 -331889 23945 -130782 -254115 8937 -24981 -265716 445122
6791 68342 113417 -86052 301955 157696 64352 -228766 -196554 46127 -106640 -220501 -418685
6780 -418685 424436 18433 155426 330344 290202 149979 -180885 -284786 53208 -269744
6769 -227319 -128116 29980 117471 -89565 -311364 244423 102589 -34478 -125252 -88111 -178229
6758 -178229 318307 -136446 -162815 -4750 -87126 -105324 -376251 -34898 159791 291506 -372123
6746 -168138 31254 386627 -88414 -212571 -60494 -102643 -100096 49740 38492 193008 39444
6734 33728 133367 88317 -59064 230027 143960 183028 -69324 -101552 231055 -274057 -107813
6722 -71035 17386 -96473 187239 296716 192810 6773 -25444 85309 -1610 -69724 -38740 -160444
6710 -160444 10192 43879 35150 150444 -103725 182954 158674 81200 -168442 -170595 66392
6698 -361299 -29353 187314 -266243 193705 -273595 -59586 67534 -31004 201970 -310527
6687 -113638 198972 -161412 -74673 6500 -21261 158007 -216139 -134877 221426 -147349 219471
6675 -8460 101734 15717 -9532 294759 -2921 -30577 160141 177673 -136607 -273961 247833
6663 -120203 47678 -105087 -173005 -131481 16434 157826 -38602 -62971 46471 -246111 59281
6651 209637 66100 -363897 -273389 -110793 -139797 471962 -329670 -49650 -9174 85946 -141250
6639 68337 -154344 -62151 -149575 57573 -116894 102450 -28500 48025 103463 -33734 189026
6627 -89056 -107074 -223103 -254445 414157 -205577 22477 -22559 92581 150863 57955 -375703
6615 64916 -64428 182538 202385 -153549 -75431 149529 -31033 -83574 -255818 186299 -554428
6603 -378067 117345 -90326 -336007 -147216 2347 -22690 -91220 108103 -50867 -91583 -14910
6591 -287712 209663 78538 151667 430 18618 -71105 183005 -8966 -362101 -143701 134350
6579 -152109 353395 3695 199080 -90223 354577 -160700 230004 35557 -131054 47566 183552
6568 183552 -144209 -335181 -152466 -235482 294522 -6511 135020 15234 145056 -280696
6557 217930 -97987 237785 -199893 -113244 47800 -113124 -494128 -67313 -88235 233664 -206765
6545 -448127 16274 205750 10317 -21570 -152096 83655 -260026 -129000 55942 -17863 128801
6533 20989 -101948 -83534 -149733 -193982 56645 -189041 -145124 -194988 -136244 -138189 -155845 -73838
6520 -262261 304850 -138321 72415 224550 -115774 -247118 402191 8925 74347 -63222 -48979
6509 -48979 -146875 28750 107288 57529 133281 103095 68833 111325 36418 -114145 60624 -179288
6496 -7993 -61670 -180389 115230 59066 -156073 -33083 16019 -357253 156510 75541 169807
6485 169807 20257 -53520 -317586 -88910 -131647 -155819 194062 -298460 -193506 -109599 168228
6473 143045 -247079 -35931 336769 90497 133164 19892 -395468 38878 -95213 -27037 102088
6461 161296 -355686 14153 -141242 -17659 -227103 33008 -9231 106309 -156325 80203 -84224
6449 -12744 -4321 61649 -325050 -203435 -182551 -239301 -28720 -9433 168128 -158943 46766
6437 -155793 197439 -192492 84827 215933 402284 -2845 -161694 -205083 165295 142130 -161971
6425 -169617 225470 -489867 -67548 -223400 -442090 66794 80015 51266 280436 64242 263715
6414 263715 -42416 -66127 -13545 83681 37165 64677 11000 99584 -277696 46876 196220
6403 196220 -169658 159179 -47471 -291424 21189 5451 34565 -46391 -35644 -51013 -232185
6392 -232185 -37647 254862 -115738 27242 59211 -126748 -265141 -270962 -95954 -17227 -4511
6380 -100752 -154074 -386145 22639 -53411 71990 -141029 29617 -32388 -240684 32021 -130923
6368 -248474 219201 122743 39466 -147883 -163082 -145218 -14628 -38009 -254371 -265353 253906
6356 432080 -49394 24904 339708 189256 -54920 -230491 44301 126840 27035 -262411 216897
6344 -76674 89238 131221 4882 -189185 53003 -9819 -124197 -86295 33509 -200360 -182768 -38067
6331 112156 -172293 182241 181389 -143246 -31485 236323 119688 144358 -3265 81673 -293306
6319 337627 -261156 59766 144514 -182246 -271123 101438 -37723 30677 7405 -352374 224438
6307 26180 -131152 385971 166687 -297784 -19622 222232 -15989 -167430 -14578 35191 196587
6296 196587 53818 159089 115406 -15805 52771 72764 -215826 -80330 -44890 61776 31804
6285 31804 -122411 250740 -201296 103872 17100 -45593 81595 274714 113737 149198 -64887
6273 58806 -16907 -156875 132751 -19331 65446 -78943 -215751 -123742 227921 127715 69058
6262 69058 171595 194407 80931 402936 -263128 98512 -165272 -218024 192551 -256970 99364
6250 16041 68842 -356408 44991 -149706 -315712 -16417 202767 189443 -243545 -36433 182006
6238 257133 123224 102168 -62925 -256966 -158059 8014 125184 30515 -276083 143926 101249
6227 101249 30346 179134 210976 140940 264141 -210553 149679 -63202 55265 -144814 81639
6215 -54339 72570 -208608 -60825 21959 -33356 104712 -161877 -14307 13526 -263140 -11698
6203 13672 -272118 77447 -30355 81704 29818 36768 -169609 -16565 -184099 -265614 33296
6191 -11290 -105590 180014 -31852 6916 274874 -167116 -115758 -73161 -409845 177241 -108507
6179 -119422 -150561 336178 188603 398097 -257375 175575 -368275 156009 -99634 -97818
6169 -97818 221298 -134979 -227166 69319 16898 -198741 -210282 -217485 -23035 -28524 461462
6157 -110571 57695 -57327 37498 20889 -22920 -133217 -146951 -167744 49340 -65514 -166267
6146 -166267 1364 68884 -146114 53664 81716 -123651 29644 -71087 -123629 179364 -441765
6134 -267352 102813 112405 426238 -227480 -51528 -90672 149607 7616 -77726 -5155 -120964
6123 -120964 109175 322223 124232 -238018 164986 235797 182230 -41821 88954 6786 211117
6112 211117 155638 -116309 29135 -111352 294845 -33954 256779 226698 43489 -336572 171734
6100 210672 -187955 -101969 -108708 8188 61967 184612 -91747 -46664 -124299 207419 -197781
6088 165183 373438 19097 -172159 129686 293516 11084 227300 260189 -77860 -84845 -64073
6077 -64073 -260695 2260 237904 -125489 -61458 -73729 171482 -18743 123608 141502 -112793
6065 -139058 6460 -58691 -278937 304883 3881 -547878 -67759 -57294 -32447 -74490 -242293
6054 -242293 -94176 12487 96761 -582 -47073 -4502 -56190 -120579 145587 95267 -36698 164975
6041 -163467 -17712 280312 -48495 123630 299070 -177748 94950 -426885 -116144 -45650
6030 115782 236744 -163855 257139 -1029 -28440 -124613 167339 -101116 -312229 -46455 28477
6018 -78575 47191 -70025 17694 -264587 -212556 12233 -343852 176071 -163579 83567 330361
6007 330361 -193970 -312944 121906 -119567 -123931 62012 78643 -125407 -311217 -227799 -28850
5995 -70095 -38779 -221164 70953 -259765 74581 -64359 237205 -75161 -97198 136831 106793
5984 106793 -2344 -227126 -80493 196121 -61327 -146023 85015 65857 37300 41562 105615 248022
5972 248022 -56904 295573 38505 -100180 274064 -100013 106786 8069 -15888 -292561 -238088
5961 -238088 -294265 255947 174833 152908 -114228 -170417 -49671 -311350 -108413 -239423 204308
5949 -149239 -15351 -319855 -205529 76758 265075 -66236 -283000 194071 86021 780 60373
5938 60373 -63267 -87362 226789 43191 32964 93883 44310 180238 -96133 -320759 -259503
5927 -259503 -90525 -165780 -145766 -172091 -121524 51405 139114 18665 330779 124792 -40714
5915 125787 443911 197128 -241765 -127944 -235548 222067 -70630 161548 -333208 -3009
5904 -180251 -69884 120519 101556 136682 136496 26089 36278 87489 3873 236749 -202994 189907
5891 104664 11995 109800 -150640 -110549 15001 13655 187746 -158446 -176711 21458 -257632
5879 -21930 -79363 96685 -18037 -139720 83802 124170 167818 25156 113406 112459 -45399 76648
5866 -71133 -159187 -36226 163883 304456 -61194 -44444 40320 -332 114963 28517 -25405 -8728
5853 216325 163465 38863 4781 -89338 141994 233826 133384 -109299 -344010 148343 135450
5842 135450 79413 253085 -77264 -478730 13070 -32610 -54299 124279 24103 236822 34685
5830 312093 36328 -50114 77040 -20210 -493476 259489 -34269 -107138 -473555 -158721 88300
5818 -52754 -70919 189362 18784 -269044 -17316 -5859 -130961 25389 -203671 -161945 140674
5806 90383 -282792 -86111 120789 -109071 -39851 86505 22815 -154645 47600 -56341 -320142
5795 -320142 18953 -275860 -33520 -204686 182648 14411 102102 69938 117243 8245 187521
5784 187521 -149501 -236457 187839 66028 -50011 191523 -192568 183105 68908 -128907
5773 224292 -320696 -247726 129393 -72555 225276 -126251 -181701 3073 -166159 -152907 -200035
5762 -200035 8032 -67117 -42632 228936 -98669 -29007 40727 -69168 80325 -76144 72410 202571
5750 202571 -167767 -18656 -326643 -48920 -277904 92190 404524 327293 111094 -71647 93098
5738 -127689 55239 -33204 131476 233979 -76064 32396 -193939 81289 -94757 -4020 146340
5726 -104420 74937 303399 232564 309139 -85558 51935 -91625 -139238 56285 -81606 -219884
5715 -219884 -91069 2346 -54201 -155135 -206337 -335635 72528 -3603 261712 -22201 -142004
5704 -142004 -129691 112255 55793 141180 268120 -67366 390007 -7613 -137165 -197088 65658
5692 -108427 -201510 9512 2432 -40985 -181540 141407 267812 -210567 234290 325512 135067
5680 274510 -234870 141180 165449 145416 -85829 169449 195754 -174826 -343046 -292049 -114542
5668 -196960 -181217 191961 -51489 -328067 118535 -227936 -164587 64787 82594 80631 -9758
5656 -150368 -275370 125020 76331 -4112 173818 80154 5681 61901 9757 -163667 168891
5644 -80026 -149987 343454 221266 -471909 216140 -2375 54970 252487 -152552 144680 265625
5633 265625 58381 73383 300336 23077 -72614 -162123 80889 -113300 304569 -3526 55844
5621 -204255 -241843 -24935 -114236 -110490 132744 170469 -80835 88962 -367303 18407 -301526
5609 68262 -102459 -108503 -27252 -59857 -152425 149073 -110542 -203377 -151886 57354 -190198
5597 -35313 -313629 173610 -24632 216992 -43056 105624 50293 -52826 -13412 -11509 -51630
5586 -51630 -521229 -199455 -89366 -180313 10586 -243211 166140 253042 166031 165692 -800 -50630
5574 -50630 141397 145530 -159748 -188621 -94173 -168056 -268886 1661 -9674 141425 1787 3110
5562 3110 375853 -8935 -7929 -246899 26980 89129 151928 -205395 57567 270670 451732
5551 451732 182290 -45769 14510 -9278 -184278 -91087 -66276 184426 106072 41766 -145601
5539 130129 -144804 -44391 -16329 -14039 73558 58870 137375 56215 -48397 -41127 -47636 387440
5526 133892 90903 199994 32859 -57515 -29675 250467 81427 156901 -27833 16643 230227
5515 230227 -141103 -80692 154510 26698 -15770 -367706 -61036 -27631 -195007 191062 40786
5503 -130704 -93307 36845 209234 -183791 -283969 -177515 65951 158293 287438 235328 -99377
5491 96952 -233047 219813 -228732 25234 -183146 -71557 187742 -238379 -201119 -125375 202365
5479 -127976 80839 99284 -48921 -40481 -211670 56450 80251 37308 37044 103034 72537 29961
5466 -58236 -61286 -71989 -142513 -49328 -76462 -62830 -92656 -251083 114693 -149019 -365703
5455 -365703 91395 286775 -143678 -199692 -203720 -50009 305687 -100073 -63458 -10647 -95184
5444 -95184 -79760 -292456 470071 -36931 409951 217905 300522 -9584 -166761 145787 8671
5432 43808 228182 145801 -166890 -35280 97208 14049 238694 92039 84575 -223882 40354
5420 -256480 430675 -20567 453423 -128167 167150 -39115 233080 -359803 -279028 -200270
5410 -200270 -11984 192090 -97468 -39781 64854 243703 9959 218456 -45219 -155417 125106
5398 97361 95786 -108229 -166687 -18430 -128373 -67488 251676 -26292 -225860 -288558 -126220
5386 105931 238877 -35393 207402 -32061 -321997 -68740 -326043 -156351 -273792 -460138
5376 -460138 127419 -54912 111874 92329 -204466 -56574 -102890 323608 -14439 -28734 -300249
5365 -300249 66543 -321742 -299985 142580 177473 -155978 122358 119427 -86115 127833 87788
5354 87788 69101 75752 132651 10555 207063 352464 -102135 -62982 347236 -131439 -163105
5343 -163105 -199854 22419 -91303 -160504 81985 45815 -51491 -109925 -290583 -184270 194562
5331 13559 -183545 -66598 -266629 -230245 -163092 28791 23687 48692 -82006 -212961 -44021
5319 -57429 46632 21377 158523 282323 -232219 75233 229554 -127671 201510 -55389 4906
5307 -82388 -46546 123806 268906 71885 63360 -221501 -44072 -70307 310734 -106547 35371
5295 -208806 9297 238926 103577 -190143 -112830 -161576 -163488 35033 365429 -110677 -44697
5283 -247674 334813 -71018 -291962 114928 -222209 -102196 417344 50132 -136009 158523
5272 -49594 -160094 61043 -68499 171915 -48377 106408 -215319 -303703 -139025 45232 -21338
5260 -133153 3052 11776 29033 -210771 54023 -212045 97111 176909 13541 223092 -15329
5248 -55964 -239740 217904 -59731 116209 19691 58657 104593 249639 -190507 -48943 -87079
5237 -87079 -5812 -9994 51558 -267488 -100933 136466 117160 -2713 16623 294909 -53118 146473
5224 124616 34029 2624 193027 -54773 -119743 -129258 70461 -15118 -239584 368236 80930
5212 127606 -79684 260952 -50362 58174 -30400 62281 53136 72450 -15579 -3064 132949 37783
5199 -78552 -68217 -75762 -58968 -95344 51761 105495 211491 180889 75821 -93783 -98365 34958
5186 -169173 -77252 214424 170536 84973 -191129 -121439 -220083 -42895 230612 -115636 201637
5174 -188974 358982 -158441 67024 -347148 87862 -261833 152409 326382 36245 74503
5164 74503 -24158 56966 -94270 -110869 29392 -261434 -177495 312074 -61258 -97091 123130
5152 -45518 -181840 -112736 141740 72136 -150252 150073 83706 43996 201559 -190639 -134327
5141 -134327 -74493 67069 25127 -107893 -151739 -131807 186497 62190 -145192 151083 -9494
5129 52729 -244964 -88453 -265103 127543 133799 -219315 64430 -229674 -205328 545819 72929
5117 -174334 -183214 -111310 57338 -162908 307334 175135 240356 71444 -163780 -159599 131389
5105 151557 -120282 668 -182324 -69331 160684 -55544 330998 -278853 -135053 390214 372354
5094 372354 -287753 2546 -85681 -104718 -190830 -12680 115311 -35794 10367 -6188 -134400
5083 -134400 31739 -107431 368585 -107699 170489 101477 188159 -232142 -3911 107868 141024
5072 141024 21045 93576 -272215 234173 -103732 -170640 -69653 -72814 18893 -48495 50939
5060 153164 172110 -40912 -362501 30139 -268248 -87566 299035 -197334 45358 -70429 84909
5048 -44145 158175 133868 17698 -73949 -115021 157007 263371 105702 34947 236050 83003
5036 15341 -128683 -219850 98160 -35178 -215328 176117 5506 178988 -25913 151584 -309823
5024 -30104 -140599 322727 -289204 -13011 -326382 -176729 190712 126938 -211056 -205809 -89693
5012 196090 64581 -65787 21372 -267809 -139364 -86237 23264 -94980 236768 -282326 -5607
5000 182434 -33592 -128015 -236848 375757 109189 192207 172859 -44607 129461 290535 -152710
4988 -57227 79336 -210166 -254045 20527 27337 100195 -38600 158726 216516 2272 160183 79229
4975 269302 294634 63018 187145 -212883 132615 47509 -36369 -201848 -84086 -43213 -89047
4964 -89047 108757 64540 -134468 -59334 -155543 122953 -136121 -118885 -411055 -143075 -12196
4952 -19220 -19415 -319589 -80839 -391064 3117 147420 295758 322998 -18825 -60791 -85212 42002
4939 125710 41950 -19126 -13918 112675 -68799 -50460 -98720 -163296 -221067 -136720 65906 -175394
4926 2499 -40241 -51162 227911 44102 168427 92358 -64070 33949 217484 -79896 170163
4914 -349522 -101530 -248931 156981 -165053 337442 -5799 -11857 91689 -23634 -92130 -350578
4903 -350578 183275 75256 118747 -37467 26530 79943 158713 121614 -69667 -349094 169041
4891 -77968 104931 -118680 -402736 -153807 -86110 194710 -3169 117165 71597 30244 -125945
4879 -309811 -40361 118774 169343 82469 124127 -146446 230445 -144207 12351 80975 188692
4868 188692 107322 -21598 -51291 156139 205925 53465 10003 164718 202453 289692 -247600
4856 69851 -14595 104293 -99954 130878 34242 -32241 -7376 107633 34660 -108588 27475
4844 -136172 79284 71260 -194002 -30330 -28085 -8313 -29038 400144 -146909 484267 71931
4832 94952 88715 -210891 254248 -29557 -22860 -137433 -45828 -126560 -86109 -29327 -230266
4821 -230266 -88996 -76910 36184 104944 86889 -255788 -62556 91964 102987 -107726 46438
4809 -207060 378377 -18337 277266 -115442 8242 -254210 707 -49316 -127333 -67 69277 -25193
4796 -205729 -24648 -63302 355618 126512 27 168431 -184351 172329 -128977 -69364 181372
4784 152339 166539 63477 46992 199970 145033 312523 107759 -171767 86930 93909 -273750
4772 -260766 151388 -176718 47456 108103 126211 -243326 80692 -36345 -237871 -174757 40607
4760 -79666 133615 204730 348474 -29017 -130984 107253 -94597 -175528 29251 337821 -117552
4748 25219 -124294 35151 144499 44376 -192003 214551 153930 5992 -87826 -742 -49180 -170275
4736 -170275 209127 -128285 -86337 222785 50726 9399 1694 -58410 94685 176881 -69189
4724 128507 -248251 -13220 -17775 -38525 173864 -112990 -287897 -118442 -158305 -90090 47087
4712 212852 199387 17977 149554 -24246 -262229 32490 510946 78801 6581 -99633 -57338
4701 -57338 -185007 8733 66699 91369 314401 135651 156079 -85678 188407 51415 -139368
4689 173547 -96445 -47716 -14025 139974 -96966 74727 -333296 -135325 -221302 -172316 33524
4677 -17376 -85907 -84001 -22199 28832 190788 -74520 224076 -91996 301888 -49329 -135886
4666 -135886 223383 74753 -71841 -94528 11042 191001 149135 212820 238525 134248 113988
4655 113988 120289 172861 -118360 148278 -29071 -140272 -69410 59909 21733 -124912 144880
4643 -7331 73869 -75088 100364 -220836 140968 136204 -141598 -319207 -161178 -150275 275009
4631 -37551 -42528 92475 22249 169268 3804 165922 197605 146043 -261025 14890 267 35369
4619 35369 128600 -96435 -43796 -257254 105695 292390 -5194 -201330 -143848 357399 -55164
4607 -263750 28905 38790 -270431 140826 -52427 113998 320063 353543 -148271 52198 17662
4595 175689 -79330 35756 -7043 -48096 -165386 -60880 -124677 -41253 -88653 59724 -324632
4583 -19732 -163049 178071 -268329 59573 143974 -112761 -182724 -3084 165684 -206705 143933
4571 60661 189327 103055 -223446 101 -45757 -668 119593 141941 -88974 -3180 54598 137585
4559 137585 -506 -52069 -80248 135004 19272 84511 119274 100093 17482 -20116 5114 118969
4547 118969 46624 -12465 -81958 139337 -230921 128922 284085 -27310 116897 -121649
4536 48793 -135125 349290 182081 3726 -52972 -245763 -87853 -84438 51575 40513 -86912
4524 157992 174053 81232 8310 -26445 139334 -33616 -79336 -33496 109013 -46257 -182419
4513 -182419 52440 124048 -370554 95269 161494 74856 -129624 -32749 121414 -231762 185202
4501 -160919 12332 -1089 55813 77208 -76339 -198779 133165 295277 230493 226966 -68527
4489 182315 -138990 15247 5274 2191 8363 -127063 233907 -138676 -7321 -45453 -65921 103155
4476 63221 166155 26622 14795 227651 111275 -147902 450938 201595 140451 149860 -134464
$$ [...]
##END NTUPLES=NMR SPECTRUM
##END=
