##TITLE=AC1420_PERAH12230_7764121_X5woPd1n38
##JCAMPDX= 6.0         $$ Bruker NMR JCAMP-DX V2.0
##DATA TYPE= NMR SPECTRUM
##DATA CLASS= NTUPLES
##ORIGIN= BRUKER
##OWNER= Administrator
$$ 1.72 TOPSPIN		Version 2.1
$$ 2013-04-17 00:38:06.067 -0700  Administrator@X
$$ Compression mode = diff/dup
##.OBSERVE FREQUENCY= 400.02188249412
##.OBSERVE NUCLEUS= ^1H
##.ACQUISITION MODE= SIMULTANEOUS (DQD)
##.ACQUISITION SCHEME= undefined
##.AVERAGES= 8
##.DIGITISER RES= 22
##SPECTROMETER/DATA SYSTEM= spect
##.PULSE SEQUENCE= zg30
##.SOLVENT NAME= COFFEE_meoh
##.SHIFT REFERENCE= INTERNAL, COFFEE_meoh, 1, 14.98509
##AUDIT TRAIL= $$ (NUMBER, WHEN, WHO, WHERE, PROCESS, VERSION, WHAT)
$$ ##TITLE= Audit trail, TOPSPIN		Version 2.1
$$ ##JCAMPDX= 5.01
$$ ##ORIGIN= Bruker BioSpin GmbH
$$ ##OWNER= Administrator
$$ $$ E:\/data/COFFEE/nmr/AC1420_PERAH12230_7764121_X5woPd1n38/10/pdata/1/auditp.txt
$$ ##AUDIT TRAIL=  $$ (NUMBER, WHEN, WHO, WHERE, PROCESS, VERSION, WHAT)
(   1,<2013-04-17 00:37:59.052 -0700>,<Administrator>,<X>,<go>,<TOPSPIN 2.1>,
      <created by zg
	started at 2013-04-17 00:36:53.475 -0700,
	POWCHK enabled, PULCHK disabled,
       configuration hash MD5:
       33 CF 6A 21 5C D3 B9 40 6C 15 AA 8D 27 A2 4F 13
       data hash MD5: 64K
       9F 2F BE 77 A5 4F BC 31 2A 2E 28 6E 85 A4 20 59>)
(   2,<2013-04-17 00:38:02.005 -0700>,<Administrator>,<X>,<proc1d>,<TOPSPIN 2.1>,
      <Start of raw data processing
       efp LB = 0 FT_mod = 6 PKNL = 1 PHC0 = 0 PHC1 = 0 SI = 32K 
       data hash MD5: 32K
       BF 1B 27 A4 31 6F 36 DF 2C 29 91 32 BF 21 0A 58>)
(   3,<2013-04-17 00:38:02.302 -0700>,<Administrator>,<X>,<proc1d>,<TOPSPIN 2.1>,
      <pk PHC0 = 100.5194 PHC1 = 0 
       data hash MD5: 32K
       0C 47 9F 25 D4 06 68 A3 AE 19 3C F7 E2 DB F3 B5>)
(   4,<2013-04-17 00:38:02.396 -0700>,<Administrator>,<X>,<proc1d>,<TOPSPIN 2.1>,
      <abs ABSG = 1 
       data hash MD5: 32K
       54 E3 E5 67 2A A1 26 3B 24 ED 0F A8 43 B3 D0 A6>)
(   5,<2013-04-17 00:38:02.489 -0700>,<Administrator>,<X>,<proc1d>,<TOPSPIN 2.1>,
      <abs ABSG = 2 
       data hash MD5: 32K
       50 4F E0 A0 4B 8A 62 A5 2E 7F 85 36 A2 38 CA A0>)
(   6,<2013-04-17 00:38:02.567 -0700>,<Administrator>,<X>,<proc1d>,<TOPSPIN 2.1>,
      <abs ABSG = 3 
       data hash MD5: 32K
       F7 FC D5 B8 C9 18 02 98 69 22 85 1E 44 CD D9 35>)
(   7,<2013-04-17 00:38:02.630 -0700>,<Administrator>,<X>,<proc1d>,<TOPSPIN 2.1>,
      <abs ABSG = 4 
       data hash MD5: 32K
       A0 DC AB D9 88 15 21 4F E0 38 03 78 AC 00 0B 53>)
(   8,<2013-04-17 00:38:02.692 -0700>,<Administrator>,<X>,<proc1d>,<TOPSPIN 2.1>,
      <abs ABSG = 5 
       data hash MD5: 32K
       C5 C0 D2 CA EC 86 76 9B 56 D3 3E 9D CC 4A EB 3E>)
$$ ##END=
$$ 
$$ $$ hash MD5
$$ $$ E9 70 9C C6 E7 1E 7A 81 52 BD 32 41 9C 87 29 5E
##$RELAX= 
##$RELAX= 
##$RELAX= 
##$RELAX= 
##$RELAX= 
##$RELAX= 
##$RELAX= 
$$ Bruker specific parameters
$$ --------------------------
##$DU= <E:\>
##$EXPNO= 10
##$NAME= <AC1420_PERAH12230_7764121_X5woPd1n38>
$$ [...]
150 150 150 150 150 150 150 150
##$TP07= 0
##$TPNAME0= <>
##$TPNAME1= <>
##$TPNAME2= <>
##$TPNAME3= <>
##$TPNAME4= <>
##$TPNAME5= <>
##$TPNAME6= <>
##$TPNAME7= <>
##$TPOAL= (0..7)
0.5 0.5 0.5 0.5 0.5 0.5 0.5 0.5
##$TPOFFS= (0..7)
0 0 0 0 0 0 0 0
##$TUNHIN= 0
##$TUNHOUT= 0
##$TUNXOUT= 0
##$USERA1= <user>
##$USERA2= <user>
##$USERA3= <user>
##$USERA4= <user>
##$USERA5= <user>
##$V9= 5
##$VALIST= <valist>
##$VCLIST= <CCCCCCCCCCCCCCC>
##$VD= 0
##$VDLIST= <DDDDDDDDDDDDDDD>
##$VPLIST= <PPPPPPPPPPPPPPP>
##$VTLIST= <TTTTTTTTTTTTTTT>
##$WBST= 2048
##$WBSW= 25
##$XGAIN= (0..3)
0 0 0 0
##$XL= 0
##$YL= 0
##$YMAX_a= 656979
##$YMIN_a= -559996
##$ZGOPTNS= <>
##$ZL1= 120
##$ZL2= 120
##$ZL3= 120
##$ZL4= 120
##$ABSF1= 14.98509
##$ABSF2= -5.573092
##$ABSG= 5
##$ABSL= 3
##$ALPHA= 0
##$AQORDER= 0
##$ASSFAC= 0
##$ASSFACI= 0
##$ASSFACX= 0
##$ASSWID= 0
##$AUNMP= <proc_prof1d_extract_pilot.lims>
##$AXLEFT= 0
##$AXNAME= <>
##$AXNUC= <1H>
##$AXRIGHT= 0
##$AXTYPE= 0
##$AXUNIT= <>
##$AZFE= 0.1
##$AZFW= 0.1
##$BCFW= 0
##$BC_mod= 0
##$BYTORDP= 0
##$COROFFS= 0
##$CY= 15
##$DATMOD= 1
##$DC= 0
##$DFILT= <>
##$DTYPP= 0
##$F1P= 0
##$F2P= 0
##$FCOR= 0.5
##$FTSIZE= 32768
##$FT_mod= 6
##$GAMMA= 0
##$GB= 0
##$INTBC= 1
##$INTSCL= 1
##$ISEN= 128
##$LB= 0
##$LEV0= 0
##$LPBIN= 0
##$MAXI= 10000
##$MC2= 0
##$MEAN= 0
##$ME_mod= 0
##$MI= 0
##$NCOEF= 0
##$NC_proc= -8
##$NLEV= 6
##$NOISF1= 0
##$NOISF2= 0
##$NSP= 0
##$NTH_PI= 0
##$NZP= 0
##$OFFSET= 14.98509
##$PC= 1
##$PHC0= 100.5194
##$PHC1= 0
##$PH_mod= 1
##$PKNL= yes
##$PPARMOD= 0
##$PPDIAG= 0
##$PPIPTYP= 0
##$PPMPNUM= 2147483647
##$PPRESOL= 1
##$PSCAL= 4
##$PSIGN= 0
##$PYNMP= <proc.py>
##$REVERSE= no
##$SF= 400.02
##$SI= 32768
##$SIGF1= 0
##$SIGF2= 0
##$SINO= 400
##$SIOLD= 32768
##$SPECTYP= <>
##$SREGLST= <1H.CDCl3>
##$SSB= 0
##$STSI= 32768
##$STSR= 0
##$SW_p= 8223.68421052631
##$SYMM= 0
##$S_DEV= 0
##$TDeff= 65536
##$TDoff= 0
##$TI= <>
##$TILT= no
##$TM1= 0
##$TM2= 0
##$TOPLEV= 0
##$USERP1= <user>
##$USERP2= <user>
##$USERP3= <user>
##$USERP4= <user>
##$USERP5= <user>
##$WDW= 1
##$XDIM= 32768
##$YMAX_p= 466613126
##$YMIN_p= -707612
##$CURPLOT= <Network HP LaserJet P1505>
##$CURPRIN= <$Network HP LaserJet P1505>
##$DFORMAT= <normdp>
##$LAYOUT= <+/1D_H.xwp>
##$LFORMAT= <normlp>
##$PFORMAT= <normpl>
##$SURQMSG= 1
$$ End of Bruker specific parameters
$$ ---------------------------------
##NTUPLES= NMR SPECTRUM
##VAR_NAME=  FREQUENCY,     SPECTRUM/REAL,   SPECTRUM/IMAG
##SYMBOL=    X,             R,               I
##VAR_TYPE=  INDEPENDENT,   DEPENDENT,       DEPENDENT
##VAR_FORM=  AFFN,          ASDF,            ASDF
##VAR_DIM=   32768,         32768,           32768
##UNITS=     HZ,            ARBITRARY UNITS, ARBITRARY UNITS
##FACTOR=    0.250966925370066, 1,           1
##FIRST=     8223.43324360094, 47354,        -144519
##LAST=      0,             -173695,         -89281
##MIN=       0,             -707612,         0
##MAX=       8223.43324360094, 466613126,    0
$$ Real data points
##PAGE= N=1
##DATA TABLE= (X++(R..R)), XYDATA
$$ [...]
19536A81820a55537k4765E4373a46860A28126D5250c57133A78872m5631h8012
19525D456J72310A6079J121J50590C672a70478N5914G5183R9664c03089J45733
19514a57356j21059a09542A81878K6641a92523F4078g07612B25307e1982l483
19504e5465j05484D9636b44441A81320a71605P7347j29518d2773B22815b07852
19493b03218A14877i7952F3274J56847C533a61535b1923r9436B6419b35477F111
19481D2385k273a94557j03954a08029c1158p5813o9357j56175a66014P5670C1793
19469a73806I8141b70119n2531J35784j94219J69022j02097f0557c162k4544E2932
19457A5709e8392j00152A17183f0843j13439E9955a11922L8846l60751J30686
$$ y = [181820, -155537, -180302, 54373, -146860, 128126, 45250, -357133, 178872, 133241, -88012, 4456, 176766, 16079, 17200, 167790, 3672, -170478, -114564, 75183, 174847, -303089, -157356, -278415, -109542, 181878, 208519, -192523, 64078, -707612, 225307, -51982, -55465, -160949, 49636, -244441, 181320, -171605, -94258, -223776, -42773, 222815, -207852, -203218, 114877, -97952, 63274, 220121, 3533, -161535, -21923, -121359, 26419, -235477, 6111, 42385, 40112, -194557, -298511, -108029, -31158, -106971, -176328, -332503, -166014, -90344, 31793, -173806, 98141, -270119, -322650, -186866, -381085, -212063, -314160, -60557, -3162, -27706, 52932, 15709, -58392, -158544, 117183, -60843, -174282, 59955, -111922, -73076, -433827, -303141]
19447c03141B17892G1000a70068a9138f965A633c80677a71773M4826k10130a34324
19435b0483A3739a45846A16340g8306l15248B1310J46160c92034b3264k7840J9788
19424c1316j32180I2506f2721C6520a28694M7145r8294B38463a86099P7412j99981
19413c08668H0194I366a15089F5691a62662r3773B2771J16675a42196r4448o4209
19402c00853A35301B4700K21195B6017a89324g3254I2524k7972O4948J42613H3691
19390a4084k11979J11877c8072l14547A29074J5210a69159A53806e5067m0125
19380i5192A33102E6335R1575I315d1624k14205l5008l8483a22426p1598o1984
19369b56008a23998Q372I5412m5248d8540L082C3316i8198j61440E7843c11278
$$ y = [-303141, 217892, 71000, -170068, -19138, -6965, 1633, -380677, -171773, -126947, -337077, -134324, -20483, 13739, -145846, 116340, -78306, -393554, 21310, 167470, -392034, -23264, -51104, -31316, -163496, 92506, -62721, 36520, -128694, -81549, -179843, 238463, -186099, -108687, -308668, 80194, 9366, -115089, 65691, -162662, -256435, 22771, 139446, -142196, -236644, -300853, 135301, 24700, 245895, 26017, -189324, -73254, 92524, 64552, 129500, 272113, 83691, -14084, -226063, -114186, -38072, -352619, 129074, 144284, -169159, 153806, -55067, -95192, 133102, 56335, 147910, 9315, -41624, -255829, -290837, -329320, -122426, -194024, -256008, -123998, -115626, 95412, 50164, -48540, -45458, 33316, -98198, -259638, 57843, -311278]
19357h8535r0246A66156i2124B0785M0736b45708K0728J00477j1661c7437B16880
19345C47182a54973C9691j2856r248a60823b0864j16782G6087i6739l5120M2758
19334h9101m62231k6574b75933J33780q7704b7403F0365o684a26315i210j12109
19323a21319D5549L85119I3731c22745B7594a17562I9491a16244a9914j32568
19313a52482D2970f0390G6350J49473b47260i8796l6585l5844O5496F2722d636
19301A16551j477l6903a85086j31746j22333d8985E8220a04349d5438l9302D6866
19289B38978b34714B6072h8202j27732B32157d24940A41959b02521K5215p5687
19279b52993a5911k59602A88872a98224i776H7330b69307a31001K2887A06632
$$ y = [-88535, -178781, 166156, -92124, 20785, 61521, -245708, -224980, -124503, -136164, -37437, 216880, 347182, -154973, 39691, 26835, 17587, -160823, -20864, -137646, 76087, -96739, -131859, -89101, -551332, -577906, -275933, -142153, -229857, -27403, 60365, 53681, -126315, -9210, -121319, 45549, 430668, 93731, -322745, 27594, -117562, 99491, -116244, -19914, -152482, 42970, -60390, 76350, 225823, -247260, -98796, -135381, -171225, -105729, 62722, -4636, 116551, 115074, 78171, -185086, -316832, -439165, -48985, 58220, -104349, -45438, -84740, 46866, 238978, -234714, 26072, -88202, -215934, 232157, -424940, 141959, -202521, -177306, -252993, -15911, -275513, 188872, -198224, -9776, 87330, -269307, -131001, -108114, 106632]
19268A63341n2351O868h8815k98221A99546k7058a0764k69411n0465J36488B46669
19256b30787C17008E4309c03540A71872b1460j92488n3608A53295b40784P7134
19246a63650K2780C6346F795a6120B11225p9754b78800A8513d08209A98633b25670
19234e5213l9408l57917a13237k6076j19949e5252j22446B5117b6283q6348B22138
19222G3277k9215a98402A87372b15646A64264G5920a69331p9978K0103d8149l87813
19211d35962b5300j25788A02235b00044D41987G0355a37700a4449k84811B49932
19200b48080P6955F6126c28747M5008f1235j07136g380F5156J76575b18294j37731
19189c56025a02867E9586a96803h0604b8995G823J70871E303i7973j59254a148
$$ y = [163341, 110990, 117858, -88815, -387036, 199546, 172488, -10764, -280175, -330640, -194152, 246669, -230787, 317008, 54309, -303540, 171872, -21460, -213948, -267556, 153295, -240784, -163650, -140870, 36346, 6795, -16120, 211225, 131471, -278800, 18513, -408209, 198633, -225670, -55213, -94621, -452538, -113237, -139313, -259262, -55252, -177698, 25117, -26283, -112631, 222138, 73277, 44062, -198402, 187372, -215646, 164264, 75920, -169331, -249309, -229206, -48149, -435962, -25300, -151088, 102235, -200044, 441987, 70355, -137700, -14449, -299260, 249932, -248080, -171125, 66126, -328747, -283739, -61235, -168371, -7380, 65156, 241731, -218294, -356025, -102867, 59586, -196803, -80604, -28995, 7823, 178694, 5303, -97973, -257227, -1148]
19177h8343B8992b4790E9228e79017B15782E7393b17325K8848i3673p5301B01125
19165E2100h1624j8314D9292P216b803E0728c28483A94074f5602k50762c1691
19153A26286b4657l2923j00574A02527m1917c14888d2045B67557l5949b55683
19142a64181A39783c59542a11892k26341J61841q6959m9109i1854l4414j33208
19132b59476f8400n0074C05183C7220a5694B96203r8497a5468j42515p3546b2821
19120d7728B7759J31865c42301P3924J31994G5279Q9998E501L39108A54583a14477
19108B3657O4142l78b6043B43141j6135b698k39151A84497c8644C5811b20587
19096a61967e1499j59667B2784J02775e2170k78585J23391Q3525N844j06267A46735
$$ y = [-88343, 28992, -24790, 59228, -579017, 215782, 57393, -217325, -188477, -93673, -168974, 201125, 52100, -81624, -99938, 49292, 56508, -2803, 50728, -328483, 194074, -65602, -316364, -31691, 126286, -24657, -57580, -158154, 102527, 60610, -314888, -42045, 267557, 231608, -255683, -164181, 139783, -359542, -111892, -338233, -176392, -263351, -312460, -91854, -126268, -259476, -68400, -118474, 305183, 37220, -15694, 296203, 197706, -15468, -157983, -231529, -22821, -47728, 27759, 159624, -342301, -268377, -136383, 75279, 165277, 5501, 344609, 154583, -114477, 23657, 87799, 87421, -26043, 243141, 227006, -2698, -241849, 184497, -38644, 35811, -220587, -161967, -51499, -211166, 22784, 125559, -52170, -330755, -207364, -123839, -117995, -224262, 146735]
19084d2402A48114b19103j13983A54364E3014e6383r5002f4520j16569f9610k72873
19073c42483a19070j53416B00853a86084O0410l5282A51162M8929B7690a66682
19062c32325B69597F6146b47863j07047C4152o509d8145j26979B12104d6076j33527
19051a79603j4682A96949a24197H5416b4520g38p6572l4694A02154b36256f989
19039a27759G3301a1183B10080j04360j8427L0552L9102b31158b7448C45999b09742
19027A88153g6220J5901A11169a77661A00222a37979n8564H0767r509a92308F4312
19015b91688A40100d52580b05312L7919d6581J3981p5722d417k844l20696C7247
19003I737a19469k57059B7553L62007b95827d9973m2673o0852d8770j42865k10074
$$ y = [-42402, 148114, -219103, -333086, 154364, 53014, -56383, -151385, -64520, -181089, -69610, -342483, -119070, -272486, 200853, -186084, -125674, -160956, 151162, 200091, 27690, -166682, -332325, 269597, 66146, -247863, -354910, 34152, 27643, -48145, -175124, 212104, -46076, -179603, -194285, 196949, -124197, 85416, -24520, -738, -77310, -112004, 102154, -236256, -6989, -127759, 73301, -11183, 210080, 105720, 87293, 117845, 156947, -231158, -27448, 345999, -209742, 188153, -76220, -60319, 111169, -177661, 100222, -137979, -196543, 80767, 71258, -192308, 64312, -291688, 140100, -452580, -205312, -167393, -46581, -32600, -108322, -4417, -7261, -327957, 37247, 9737, -119469, -376528, 27553, 389560, -295827, -49973, -92646, -153498, -48770, -191635, -401709]
18992d01709a52022P591I236c21965j09514I2860A3792c95315b7556A76985p3241
18981A03744K96843e2605j48936g8251G5805b90957k14617C46467A6600Q3728
18971A00328d3184A40584a14811A43702c72745A7060b83823F3252b0103D9320
18960E8167a836l01521B74934a74510B22250a48163A96514M946c56713M5072o6261
18949c77902J18766f9032A20507e6106b4738r7121l8671g6112b2798j06685N6621
18938g2862m04548i5122j06604H8310M7908b87371I1662a16263B69312c65305
18927A96292r0313j2747h0977K7036A50137b47709h7758I899J639f5542j59479
18916b25021A01359a43065o5586K3150A03064a33250j25099J17813j50226a27424
$$ y = [-401709, -152022, -144431, 9236, -321965, -431479, 92860, 13792, -395315, -27556, 176985, 103744, 400587, -52605, -201541, -78251, 75805, -290957, -505574, 346467, 16600, 100328, -43184, 140584, -114811, 143702, -372745, 17060, -283823, 63252, -20103, 49320, 58167, -1836, -303357, 274934, -174510, 222250, -148163, 196514, 201460, -356713, -311641, -377902, -259136, -69032, 120507, -56106, -24738, -121859, -160530, -76112, -22798, -129483, -72862, -477410, -95122, -201726, 88310, 136218, -287371, 91662, -116263, 269312, -365305, 196292, 105979, 93232, -80977, -53941, 150137, -247709, -87758, 9899, 11538, -65542, -225021, 101359, -143065, -208651, -185501, 103064, -133250, -258349, -140536, -290762, -127424]
18905I4747c6829D62014A39837b59505a09454m6029o0199A63793E1867c6131A40333
18893B62015A06820b59603A61920a02303a412k23283D44670F2018o951G555e4307
18881b295l78166J39574J18991k15615F9421a20208D2077c77982a41453l3912
18871a75365I4482a19004A97025C3063a73540l1978C21024c6040m1809b6552b680
18859i879n7355I258J00546b52875B44980k5704q1147g5733A76824N8020L2899
18848B67743E3243b15048C23825A43691i1758E6323k5813K33609o5074I4104a26874
18836a38214B23128f98784a8020j21469C4789a60516k78838K16518I1888l430
18826H8458a00179k6244p301F5801a31026e0464K138j4878A72917K16672b1707
$$ y = [94747, -36829, 462014, 139837, -259505, -109454, -155483, -215682, 163793, 51867, -36131, 140333, 262015, 106820, -259603, 161920, -102303, -1412, -224695, 444670, 62018, 55067, 7555, -54307, -2295, -380461, -240887, -121896, -337511, 69421, -120208, 42077, -377982, -141453, -175365, 94482, -119004, 197025, 33063, -173540, -205518, 321024, -36040, -77849, -26552, -2680, -9879, -67234, 9258, 109804, -252875, 244980, 219276, 138129, -75733, 176824, 234844, 267743, 53243, -215048, 323825, 143691, -91758, 56323, 30510, 264119, 199045, 94104, -126874, -138214, 223128, -698784, -18020, -139489, 34789, -160516, -439354, -222836, 91888, 88458, -100179, -126423, -133724, 65801, -131026, -50464, -48326, -63204, 172917, 389589, -21707]
18814D10858p0643a85216B42168h1680B31616j1175q7325d4326F1632C135a95070
18802H5052A5773J30738a98895d4413k75328D2151b53150c5200r6863k38645a20306
18790E7521M1331a27699l01224e1523A1679R9336E3994a35209A90290b20248l7501
18779b57749d3870B9410b44605G9563N6367d0378j83696a02255c6427m7729l38315
18768d22471d3013B76596j31610c3079j56949j97583a1843j23206L0293K2555
18758h2201d90A93953h9326j2652C7169h5159A8260a18538R817k45012p8438H571
18745a80656c0894l82074J64700k45380A62047f66087g0049A27795a18967n0217
18735a69184n2255K7629C74J76496h3472B4498b41309b0960r0717j3752B5588
$$ y = [410858, 340215, -185216, 242168, -81680, 231616, 220441, 133116, -44326, 61632, 3135, -195070, 85052, 15773, 146511, -198895, -44413, -319741, 42151, -253150, -35200, -132063, -370708, -120306, 57521, 98852, -127699, -428923, -51523, 11679, 111015, 53994, -135209, 190290, -220248, -257749, -43870, 29410, -244605, 79563, 135930, -40378, -224074, -102255, -36427, -84156, -422471, -43013, 276596, 144986, -33079, -190028, -387611, -11843, -135049, -104756, -82201, -490, 193953, -89326, -101978, 37169, -85159, 18260, -118538, -108721, -353733, -432171, 8571, -180656, -30894, -412968, -248268, -493648, 162047, -666087, -70049, 127795, -118967, -169184, -221439, -193810, 374, 176870, -83472, 24498, -241309, -20960, -111677, -125429, 25588]
18723b71410J00813B13928J33046d4450j14495o9559C1432a48866b4605j55534
18713a80139L7662C71202I0962k8650i4600A21308a92881m9637r6332a02116K3701
18702g8415j02869H8101d24471A72298J8482b13k73483A45970b56850J23064n8723
18691a92509j14030a50605B3655a88879K6423j27841G947a31941E4473d81654
18680c9349A72710l9951l7149B2016a15495B17848b80620J30291E7585K53J60990
18669B18828J1648b87663e9624b5508k71976H375d0904k62961a48843d5442k09535
18658b54977q3156A84533c59692h3759B47116h1637k00119D97960C1858J22777
18648A54635a17801l0603l5210I6447e0046j35379b1486m6873k49082B5651J86424
$$ y = [-271410, -170597, 213928, 346974, -44450, -158945, -228504, 31432, -148866, -24605, -180139, -142477, 371202, 90962, 62312, -94600, 121308, -192881, -242518, -338850, -102116, -78415, -181284, 88101, -424471, 172298, 190780, -213, -273696, 145970, -256850, -133786, -192509, -306539, -150605, 23655, -188879, -162456, -290297, 7947, -131941, 54473, -481654, -39349, 172710, 132759, 95610, 22016, -115495, 217848, -280620, -150329, 57585, 57838, 218828, 230476, -287663, -59624, -25508, -297484, 8375, -40904, -303865, -148843, -45442, -254977, -338133, 184533, -359692, -83759, 247116, -81637, -281756, 497960, 31858, 154635, -117801, -148404, -183614, 96447, -50046, -185425, -21486, -68359, -317441, 25651, 212075]
18637B12075B7670M5692J0781b13481c7927l4873L2011l40919a69273N1346I2466
18625c97785d6638J2289k2310p8542D1485J81719J96751a87421B3426g068F9600
18613a79849D243c554j49459C60993c21639q6062c1159l9897j96047A08153B6656
18601A16119N3636k1816a65966A58982a09743j60035e6443G5738c64k26926j9513
18590b46803f7533l31998K4975B65054h0362A62772a2364q0873A33206E7953Q1774
18579A39727b3267k01508K2800B2079b69458F3850h8399a9082G844c3176p123
18568d0299j29220B19485C3533j6235K35376f7687A25771a06967p4082j1979j04292
18557b97320j84953A31797b15853B9166g3468B9965j532a14357J7189j28837C02360
$$ y = [212075, 27670, 73362, 84143, -213481, -37927, -72800, -40789, -381708, -169273, -117927, 92466, -397785, -46638, -34349, -56659, -135201, 41485, 223204, 419955, -187421, 23426, -7068, 69600, -179849, 4243, -3554, -153013, 360993, -321639, -407701, -31159, -71056, -267103, 108153, 26656, 116119, 169755, 147939, -165966, 158982, -109743, -269778, -56443, 75738, -364, -227290, -246803, -67533, -399531, -374556, 265054, -80362, 162772, -12364, -93237, 133206, 57953, 139727, -23267, -224775, -201975, 22079, -269458, 63850, -88399, -19082, 7844, -33176, -40299, -169519, 219485, 33533, 17298, 252674, -67687, 125771, -106967, -181049, -193028, -297320, -482273, 131797, -215853, 29166, -73468, 29965, 28433, -114357, -97168, -226005, 302360]
18545c37186a29460j49313a15964M0967K7413l8372k22336A33133b43002J6851
18535b26151d0443H9358d2480j54618l2632B27803B9931a46466b3526p3370D1750
18523A63701c18797b8095B11751a12648C7581L097b00546k0209B595i6504m4313
18512a40817a8606k62285B11106a29272C599a79799Q5938q2301b2583k87168h1414
18500a17823e5841j56211c2659H8653l6423L8438K16606I4661R5197a63021P6751
18489h6270k81772A66542E9174B7516J49117N2592r1363J3777b29968m5109j04078
18478c79155J81353O9735D4905K47278p8056J20252A08051a96047o7259O8961
18468a94345o7792j89145I862J85357a63656b684j81725d7613j00270Q389d7016
$$ y = [-337186, -129460, -278773, -115964, -74997, -47584, -85956, -308292, 133133, -243002, -226151, -40443, 89358, -42480, -197098, -229730, 227803, 29931, -146466, -23526, -96896, 41750, 163701, -318797, -28095, 211751, -112648, 37581, 40678, -200546, -220755, 2595, -96504, -140817, -18606, -280891, 211106, -129272, 3599, -179799, -93861, -176162, -22583, -309751, -81414, -117823, -55841, -212052, -32659, 88653, 52230, 90668, 307274, 94661, 189858, -163021, -86270, -368042, 166542, 59174, 27516, 176633, 229225, 137862, 151639, -229968, -275077, -379155, -197802, -128067, 44905, 292183, 214127, 334379, 108051, -196047, -263306, -194345, -262137, -451282, 9862, 195219, -163656, -2684, -184409, -47613, -147883, -139494, -47016]
18456D77064b71266M3964g4265l3829H2960B4868Q6450J27635b3539E1168K8267
18445G9435N3119a37872C8609J02272e1964a7383A41048D4048b6704B9108f5241
18433b51624a05060E4893j2751a09022C46a77877E8916b88239h1253q4109A62183
18421h6927D6239a83660A27160a98893A99843a1551A14653Q6752a00992B07174
18410a10807r1435A15702l6234d8689k3530j82327o45c0280D6831A6467a25473
18398A27644a23999B30234g0523k22576a20161A37268o2110L2635c37494A89450
18387a4518j45400j5587n9807a06757d1607B94492H8778a0414j23356e4321j93837
18376b48158J09411j39753g0853l9491A77746h8008j16846B01461A7702i0450
$$ y = [477064, -271266, -227302, -74265, -108094, 82960, 24868, 111318, 238953, -23539, 51168, 79435, 132554, -137872, 38609, 140881, -51964, -17383, 141048, 44048, -26704, 29108, -65241, -251624, -105060, 54893, 42142, -109022, 346, -177877, 58916, -288239, -81253, -165362, 162183, -86927, 46239, -183660, 127160, -198893, 199843, -11551, 114653, 201405, -100992, 207174, -110807, -202242, 115702, 79468, -48689, -72219, -254546, -255191, -30280, 46831, 16467, -125473, 127644, -123999, 230234, -70523, -293099, -120161, 137268, 75158, 107793, -337494, 189450, -14518, -159918, -175505, -235312, -106757, -41607, 294492, 88778, -10414, -133770, -54321, -248158, -138747, -278500, -70853, -110344, 177746, -88008, -204854, 201461, 17702, -90450]
18365a32997q3377H2146a09986A13081a62959g6543r1478n6890G3955a70467D2526
18353A31942e851j20469n1247k49375f8795A9963d7400C21044b37807l4724a7762
18341A43132o6234i3989A36420D6466d03014L1528a2328j74352O0780E640h0537
18329d08438b3924p0232k6038E0506K0097R2359d6199C00922a24861F5510a44490
18317b7421k05734Q8712M6930J6648B40450d7883A39681a79653B03990a92461
18306a79338A31924h5976c9299B3380i0420k9019H306J80572a02141j61386m3904
18295c07431m3453d5082m363j39865B9306c2950j18965a8003n6929k8464L5164
18284f8232j12915A75049a14196C74686A32686e5312k72944J51399l78051A07472
$$ y = [-132997, -216374, 82146, -109986, 113081, -162959, -76543, -168021, -224911, 73955, -170467, 42526, 131942, -5851, -126320, -177567, -426942, -68795, 19963, -47400, 321044, -237807, -272531, -17762, 143132, 76898, -93989, 136420, 46466, -403014, -371486, -12328, -186680, -125900, 5640, -80537, -408438, -23924, -94156, -120194, 50506, 70603, 162962, -46199, 300922, -124861, 65510, -144490, -27421, -233155, -144443, -97513, -80865, 240450, -47883, 139681, -179653, 203990, -192461, -179338, 131924, -85976, -39299, 23380, -90420, -119439, 8306, 188878, -102141, -263527, -307431, -350884, -45082, -49445, -189310, 29306, -32950, -151915, -18003, -74932, -103396, -68232, -181147, 175049, -114196, 374686, 132686, -55312, -328256, -176857, -554908, 107472]
18273a37738H9733k4418c76453J3079a35591o1338n662A33436a16119e4727H375
18261C05207d37493H2333L65475b5909E2853h4036m9156A52485p2036c49670D3283
18249A18079k8665a43725G0458P5016d7217E9880K96305j77849D3858b41546A06153
18237e3441E0626d96448a6931j20392C46731b73993O0695D1033N781b23m17913
18226d18136N5758G0034a28409B86502j6568C0387L526A4865Q6348i7629k16295
18215c13924i7171k37708J40095A02754d2721A9325a71106G1406a69186a0051
18204A52682Q0714E7581L5272m3682a96008f3178A46628k7771J37191b1593D3646
18192a00703G4134M1809M6802J2672n6688e5058m6513A76900b49323o6581O0906
$$ y = [-137738, 89733, 65315, -376453, -363374, -135591, -196929, -202591, 133436, -116119, -54727, 8375, 305207, -437493, 82333, 447808, -25909, 52853, -84036, -133192, 152485, 80449, -349670, 43283, 118079, 89414, -143725, 70458, 145474, -47217, 59880, 356185, 178336, 43858, -241546, 106153, -53441, 50626, -496448, -16931, -137323, 346731, -273993, -213298, 41033, 46814, -223, -418136, -362378, 70034, -128409, 286502, 269934, 30387, 33913, 14865, 101213, -97629, -313924, -97171, -334879, -194784, 102754, -42721, 19325, -171106, 71406, -169186, -10051, 152682, 233396, 57581, 92853, 49171, -196008, -63178, 146628, 118857, 256048, -21593, 43646, -100703, 74134, 115943, 162745, 175417, 118729, -55058, -101571, 176900, -249323, -315904, -254998]
18181b54998J02179B34243b45386f1238k1958J5545D1656P5221a96437I8749C6205
18169a94759H4957i4074r3132C44151H4580a41676J6893C8832J5689A2031c6252
18157A9711J08920O5465E3698L48723A32708l0187e4624A91060a70987B45138
18146b0387C54065d07082c6269H722O1092Q5706J36747E7711f988j41791A20201
18134a45210l51622G7118A1289b73185E230b24424r0411A66682e2550k64014F1613
18122A55868C9873d2023J623j0233B20359g5040K9487a1027q2492m72617a05259
18110G3359i0132A2583g5324j16443C0605a12540q424J9683I3096a72210C27213
18098h1211k80798A94702m4235d56423b21158A68943e1280A42918o1121J8M4043
$$ y = [-254998, -152819, 234243, -245386, -61238, -83196, -67651, 41656, 116877, -196437, 98749, 36205, -194759, 84957, -94074, -187206, 344151, 84580, -141676, -124783, 38832, 54521, 12031, -36252, 19711, 128631, 194096, 53698, 402421, 132708, 102521, -54624, 191060, -170987, 245138, -20387, 354065, -407082, -36269, 8722, 69814, 155520, 292267, 57711, -6988, -148779, 120201, -145210, -496832, 77118, 11289, -273185, 5230, -224424, -314835, 166682, -52550, -316564, 61613, 155868, 39873, -42023, -40400, -50633, 220359, -75040, -45553, -11027, -93519, -566136, -105259, 73359, -90132, 12583, -75324, -191767, 30605, -112540, -120964, -101281, 93096, -172210, 327213, -81211, -362009, 194702, 150467, -456423, -221158, 168943, -51280, 142918, 81797, 81815, 125858]
18087A25858e4157m2047k04257a10026D8760O645g5383F9735b35549B1240a72265
18075C4169a1065K071B3104g0077A47705F8446A6772Q4587N6613G3792c46307
18063a7010A57644k0711b22759A9551a05014A53763j6264D1119M47050a01669
18052A76369a18384A78657c12439B57625a4625A74238a21118K1157E2061d156
18041a67861H5930a18895b2113G5931a84305N3158A18019L9224A7908a48669A02995
18029a30924k97036a24286B15146b27843K9020P8965l65023B11880f4376A33145
18018B13521a22517A19074c19696G9194a88239j25710F4614O5883b92183Q6922
18008b05261j497b0440A50888j7213o4064b73590J05988g633p0090A60223e7134
$$ y = [125858, -54157, -96204, -300461, -110026, 48760, 55405, -75383, 69735, -235549, 21240, -172265, 34169, -11065, -8994, 23104, -70077, 147705, 68446, 16772, 101359, 157972, 73792, -346307, -17010, 157644, 136933, -222759, 19551, -105014, 153763, 137499, 41119, 488169, -101669, 176369, -118384, 178657, -312439, 257625, -14625, 174238, -121118, -99961, 52061, -4156, -167861, 85930, -118895, -22113, 75931, -184305, -131147, 118019, 157243, 17908, -148669, 102995, -130924, -427960, -124286, 215146, -227843, -198823, -119858, -484881, 211880, -64376, 133145, 213521, -122517, 119074, -319696, 79194, -188239, -313949, 64614, 130497, -292183, -205261, -206758, -20440, 150888, 133675, 69611, -273590, -167602, -7633, -77723, 160223, -57134]
17996b8115B60044b96717J33349l7785g9464r3091A7227a90921Q5986M5434A55078
17984f0667j93676a17593E1413e588m17870g9320b2575C84961c35462c1660k24672
17973b56332B35194e91738a10281C6542a4729I1994c81280E3606a33121C46198
17962a78543d7396G1750h484A13154H490P297L11376E759O4810K8464A9730c89989
17949d2234j68623q4780C60472B5927J97702l9544d36162H4316c73330C784J36572
17938A40356a01313A95693B3245c3924D2802a56709M0933C5277O1774d30824A1396
17926A50485e441k18112A90293g6180j0365A0068J82979i1053A18756E2032b58227
17914A01970a9857M607A04391c503D7488f3147B38467A03084K90652b28471G3239
$$ y = [-28115, 260044, -296717, -163368, -201153, -79464, -172555, 17227, -190921, -104935, -59501, 155078, -60667, -254343, -117593, 51413, -5588, -423458, -79320, -22575, 384961, -335462, -31660, -256332, 235194, -591738, -110281, 36542, -14729, 91994, -381280, 53606, -133121, 346198, -178543, -47396, 71750, -8484, 113154, 8490, 15787, 327163, 5759, 70569, 99033, 19730, -389989, -42234, -210857, -295637, 360472, 25927, 223629, 184085, -436162, 84316, -373330, 3784, 140356, -101313, 195693, 23245, -33924, 42802, -156709, -115776, 35277, 97051, -430824, 11396, 150485, -5441, -223553, 190293, -76180, -86545, 10068, 193047, -91053, 118756, 52032, -258227, 101970, -19857, -15250, 104391, -3503, 47488, -63147, 238467, 103084, 393736, -228471, 73239]
17902a02542A48151J6771l8893B0485n167J28560a0749j63899g906p5654J2320
17891g1240B69751a0885k82663A1612R2462a77220h7934b1812G6413e644k1602
17880b7246j47A86865r895g0616F6918N8258A1134i0492A58774a07521j8547j03152
17868b29220D8394a24820D8083a3680k50447A41021o303a41924B67927d876k062
17857f938C6303a0692A05605d81293I5676b27017A29334b8622j66691A35119b82622
17845D2934a94388P6400j11704F4583d4081o3982b1442j08327C7878K21440b14789
17833c08470b6947G4939J45186l0203C1939R6277D7041b4612H8332K9152a67684
17821b04287B84840b67148K9104D1528i2216A07929a21753m1422A90821a23566
$$ y = [-102542, 148151, 164922, 126029, 20485, 15318, 143878, -10749, -174648, -7906, -83560, -71240, 269751, -10885, -293548, 11612, 104074, -177220, -87934, -21812, 76413, -5644, -27246, -27393, 186865, 176970, -70616, 66918, 125176, 11134, -90492, 158774, -107521, -126068, -229220, 48394, -124820, 48083, -13680, -264127, 141021, 134718, -141924, 267927, -4876, -6938, 36303, -10692, 105605, -481293, 95676, -227017, 129334, -28622, -195313, 135119, -282622, 42934, -194388, -117988, -229692, 64583, -44081, -108063, -21442, -129769, 37878, 259318, -214789, -308470, -26947, 74939, 220125, 189922, 31939, 128216, 47041, -24612, 88332, 117484, -167684, -204287, 284840, -267148, -238044, 41528, -92216, 107929, -121753, -163175, 190821, -123566]
17810A21665c15899a45215H0501l4799D876a0280B04935a96365k67901a04739
17799b29997B5698J51234f2138J2619A9093J89820B4826O7212a43963M6357D1221
17787c12949A14734n2317Q1252E6919R0774C9000d7022C2194K02750Q4446b33282
17775a2357m6776A70909E3120h353m6970B15741c22006J32688A5566a4143k37861
17764b52004d7591A35527L2858b15736J7611f7903r765b1126M239A5258b14774
17752e588A67064c9516G7878a21270n2819c4890B53979F5630J14000B191L2382
17741C4573J57347e9204b76E5062b54488a04934A21021A113K5604a40065I2053
17729F5766b77388A62240o9392d8869n6730j24941R5461j5976A39323k3048K0850
$$ y = [121665, -315899, -145215, 80501, 45702, 4876, -10280, 204935, -196365, -464266, -104739, -229997, 25698, 176932, -62138, -49519, 19093, 208913, 24826, 92038, -143963, -97606, 41221, -312949, 114734, 62417, 143669, 56919, 147693, 39000, -47022, 32194, 234944, 319390, -233282, -12357, -59133, 170909, 53120, -8353, -55323, 215741, -322006, -189318, 15566, -14143, -252004, -47591, 135527, 168385, -215736, -198125, -67903, -77668, -21126, -16887, 15258, -214774, -5588, 167064, -39516, 77878, -121270, -174089, -34890, 253979, 65630, 179630, 2191, 34573, 191920, -59204, -276, 55062, -254488, -104934, 121021, 1113, 26717, -140065, 92053, 65766, -277388, 162240, 92848, -48869, -105599, -230540, -135079, -151055, 139323, 116275, 137125]
17718A37125D2391a54726P2529I0074a01359G5890b75169G9514a30098A45685
17707A40470n1140b17134A96043b50520D84499A4402J17908Q2640B2543N234J77944
17696B05721a29700F4512a0691k52843j65407O6752Q1045Q0414I9618K66139A66816
17684a51884j77187B03769q4676K6227L79388h6241B47996c21100G8701c77385
17673A71906Q661K0090a2320k00654A96923H199L78574H8569D3472A6922a07621
17661B88823q6572O3745i6653D72152b248q4686A29350b973G5638d06k14668G4112
17648d73141B44808L0705F5553d3522j65183P0823k7835P7154k67150I5525a49071
17636a37275N7757K6011C07140a22321l5055C14671j226d72044h6558C7985J7131
$$ y = [137125, 42391, -154726, -82197, 90074, -101359, 75890, -275169, 79514, -130098, 145685, 140470, 89330, -217134, 196043, -250520, 484499, 14402, 132310, 214950, 22543, 27777, 205721, -129700, 64512, -10691, -263534, -428941, -362189, -281144, -200730, 99618, 365757, 166816, -151884, -329071, 203769, 119093, 145320, 524708, -86241, 247996, -321100, 78701, -377385, 171906, 180567, 200657, -12320, -212974, 196923, 8199, 386773, 88569, 43472, 16922, -107621, 288823, 202251, 265996, -96653, 472152, -2248, -86934, 129350, -2973, 75638, -406, -215074, 74112, -473141, 244808, 275513, 65553, -43522, -208705, -137882, -165717, -88563, -355713, 95525, -149071, -137275, -79518, -53507, 307140, -122321, -157376, 314671, 313445, -472044, -86558, 37985, 55116]
17625E5116i4460E0906a13138B87368N8665A34568b8190Q273j39431B52853d9657
17613D936g1743K1577F995g9658I2188a23555a5019o327j9533L544l18703h9881
17600D6540L45527H4058O4627h7801C87315b06489p5374G4440O2648J36936d5425
17588e6297A19592J81777a47058A44220R1253c97295A29616D8821J78634a9506
17577B66631a91401Q0337a7834N357j64069B38307B8743o182J63951i83C14818
17565b3193q3735j3089I4278d6624p503A89105f973A90782e2131r8845B18743
17553A75735a37818I9702J55438e05800C25061c2981A5961b46547A35073L50175
17543D85248c08099d3318A30470J27485c21063b6688j80137D0530d7724B78615
$$ y = [55116, -94460, 50906, -113138, 287368, 346033, 134568, -28190, -19917, -159348, 252853, -49657, 4936, -71743, -50166, 6995, -79658, 92188, -123555, -15019, -21346, -40879, -37335, -356038, -89881, 46540, 392067, 84058, 148685, -87801, 387315, -206489, -281863, 74440, 137088, 274024, -45425, -56297, 119592, 301369, -147058, 144220, 235473, -397295, 129616, 48821, 227455, -19506, 266631, -191401, -111064, -17834, -12477, -176546, 238307, 28743, 22561, 186512, -983, 314818, -23193, -106928, -120017, 94278, -46624, -54127, 189105, -6973, 190782, -52131, -150976, 218743, 175735, -137818, 99702, 255140, -505800, 325061, -32981, 15961, -246547, 135073, 485248, -308099, -43318, 130470, 257955, -321063, -26688, -206825, 40530, -47724, 278615]
17532C601Q2332K8632a91894A22573b00727F2451P9377N2910b24609C59109j76503
17521A82606L8233O4178g6827E8511L32110A40756b96869A51524D5499a51953
17510g3490g872j90663H6327J3079c4223E12241C2631J43445b64812A36997A1437
17498C35391j09459J8187b84838R1109A58460a62489B18126a17670B5520J77293
17488B02813q3969h3225A39729a68695n1198R1004A81890b68121C79195j06384
17478B72811a31446B77859A16506J56019J81017n5155j68269j3151J23820f5306
17467A55157K12327G0141R3836c8311j41310B36649Q5397a42927A55224E8063
17456B80214j24162L31834A70742J86664M6540A42066a5307B90500K13855j54434
$$ y = [3601, 85933, 114565, -191894, 122573, -200727, 62451, 141828, 194738, -224609, 359109, 182606, 220839, 285017, -76827, 58511, 390621, 140756, -296869, 151524, 45499, -151953, -73490, -7872, -198535, 86327, 99406, -34223, 512241, 32631, 176076, -264812, 136997, 11437, 335391, 225932, 244119, -284838, -193729, 158460, -162489, 218126, -117670, 25520, 202813, 118844, -83225, 139729, -168695, -219893, -128889, 181890, -268121, 379195, 272811, -131446, 277859, 116506, 272525, 453542, 398387, 230118, 216967, 340787, -65306, 155157, 367484, 70141, 163977, -38311, -179621, 236649, 322046, -142927, 155224, 58063, 280214, 156052, 487886, 170742, 357406, 403946, 142066, -15307, 290500, 504355, 349921]
17446C49921A63117K35747G5508J36750K05022n6451q3386L17294A47483O4020
17436B11503K67382k38242K15784I1510d5755E40736j71342I3417J49234E4488
17425A63093A5017K06838m4000J26905j1702n2028l6173H3263L3834M3766J72302
17414C33165o4062J3624A31944l3474K43687j9518L9679F0649j2902J42844B4594
17402B43836H2161a82050A81840K4614K39950a80130A88435Q5307H9509J80249
17392B69758A03796K6371K82410q9841C7810K3240J84265j21573b4573B40859
17381A99910J928J9847A2824a56296O0879l30345B89134b0552A09726J93732B0626
17369a77764d3228B97298a05641B20353m5937l3853J94J45583B1350J79650a37807
$$ y = [349921, 163117, 398864, 75508, 212258, 417280, 360829, 277443, 594737, 147483, 211503, 478885, 240643, 456427, 91510, -45755, 540736, 369394, 93417, 242651, 54488, 163093, 15017, 221855, 177855, 304760, 293058, 241030, 204857, 83263, 117097, 160863, 333165, 269103, 282727, 131944, 98470, 342157, 322639, 362318, 60649, 47747, 190591, 24594, 243836, 82161, -182050, 181840, 206454, 446404, -180130, 188435, 273742, 89509, 269758, 103796, 130167, 412577, 322736, 37810, 61050, 245315, 123742, -24573, 240859, 199910, 201838, 221685, 12824, -156296, -95417, -425762, 289134, -20552, 109726, 303458, 20626, -177764, -43228, 297298, -105641, 220353, 174416, 140563, 140757, 286340, 21350, 201000, -137807]
17357A7872J50910c3677B32148H1146Q9987c10601A64315L7681l7259K09922j15018
17346B59641A7081N8093J11558h1854D12160c3911M848D11347a02015C31147b84581
17334f3839B979K35335A12941P7047M12477A06242K85808A30539g8168B36958
17323C84431c1531A06773J26326K48806j67801A17679D6238J89022Q9003j7944
17313C06319c3468E36648k52862a8707A36503a18877C16759A2315O2780Q7750
17303A62845A1084K83422j31009J92432A63717M5308J29714a07647A07806E3724
17292A68581b13030C3342J10569J47416r9903J06436j42509m6712J08412L70319
17282E87370A95512R3207j03422F6780A0649L88929A49679d8062C12373A45669
$$ y = [17872, 168782, -33677, 232148, 81146, 171133, -310601, 164315, 201996, 164737, 374659, 259641, 17081, 75174, 186732, -81854, 412160, -33911, -29063, 411347, -102015, 331147, -284581, -63839, 2979, 238314, 112941, 189988, 602465, 106242, 392050, 130539, -78168, 236958, 384431, -31531, 106773, 233099, 481905, 314104, 117679, 46238, 235260, 324263, 306319, -33468, 536648, 283786, -18707, 136503, -118877, 316759, 12315, 75095, 162845, 11084, 294506, 163497, 355929, 163717, 209025, 338739, -107647, 107806, 53724, 168581, -213030, 33342, 143911, 291327, 191424, 297860, 155351, 108639, 217051, 587370, 195512, 288719, 185297, 66780, 10649, 399578, 149679, -48062, 312373, 145669]
17271A7669f3298B11531R0985j19725B4553L5540J510R9038N6082J5598j08540
17260A23781J25516p5477R1491a26673G0211B8433J02808M4520P6681q2178K7854
17249A98118J71197q9459O2663A8410M2356L09322a55944A07238b0942A99884
17238C38900r4820a47606B71585d8426C74880j55495K7691J36518i776C53522
17227A93558b9832F11536B21139H4853O2803E7758O3258b1954C02348P7790A57981
17215H6532L90334G1280K47254A43339P4733J4473P7022q7222L1921O1658r9117
17204B16807J09740o3461j00597K69545j73418J71429j00165r8730f0969A36724
17193C33203K3399q6787J57161J1730A75110J50043G1936B6869O5703J19238d9155
$$ y = [17669, -63298, 211531, 302516, 182791, 24553, 60093, 61603, 160641, 216723, 232321, 123781, 249297, 173820, 265311, -126673, 70211, 28433, 131241, 175761, 252442, 170264, 198118, 369315, 279856, 342519, 18410, 60766, 370088, -155944, 107238, -20942, 199884, 338900, 244080, -147606, 271585, -48426, 374880, 219385, 247076, 383594, -9776, 353522, 193558, -29832, 611536, 221139, 84853, 147656, 57758, 121016, -21954, 302348, 380138, 157981, 86532, 476866, 71280, 318534, 143339, 218072, 232545, 309567, 222345, 254266, 315924, 216807, 326547, 263086, 162489, 432034, 258616, 430045, 329880, 231150, -60969, 136724, 333203, 356602, 269815, 426976, 438706, 175110, 325153, 71936, 26869, 92572, 211810, -49155]
17181D18619n1895A24886K02180h8536D78399o9316I0246K31302j01553p7428
17171A42567K93933j76099j2266L3514j10923N0353a83759D77014D6894f563E4292
17159B27550K2268J26848j78821N06175C04266J9838j35182J83239r4618L059
17149B80602l2789K63656k06103J55953a04731C35887r9383A11548K33668K56838
17139F02054B34574K00748A52651L376K41083A45797L21160g6794C55628k5358
17129C30270p8977A01679N05491j27719J08058B91506I0134D2155K27314K20509
17119D89978j8521j8488n7540O2192B20891K68317k7506B28637J13963B3751L13243
17108C36994H0260L41197j10669K8488J26562A73558J99312K37937k10327A85601
$$ y = [418619, 366724, 124886, 327066, -88536, 478399, 409083, 90246, 321548, 219995, 142567, 436500, 260401, 248135, 281649, 170726, 221079, -183759, 477014, 46894, -6563, 54292, 227550, 249818, 376666, 197845, 704020, 304266, 324104, 188922, 372161, 277543, 280602, 247813, 511469, 305366, 461319, -104731, 335887, 236504, 111548, 345216, 602054, 234574, 435322, 152651, 156027, 397110, 145797, 466957, -76794, 355628, 330270, 251293, 101679, 607170, 479451, 587509, 291506, 90134, 42155, 269469, 489978, 471457, 452969, 395429, 457621, 220891, 489208, 461702, 228637, 342600, 23751, 336994, 80260, 421457, 310788, 339276, 465838, 173558, 372870, 610807, 400480, 185601]
17097A21504K65919J53731B14797J76398r3552o3546R2604J0205A64415K45119
17087D09534J66147B14711P1553N049K90195Q9556P9935k21415C7330N95323m9890
17076E82763A96520J82396D1949K11872K04834J25453j52031M73983B69258l7061
17066B32197K96492B52509Q8132A48864M44840J68442l24467K05204K6347A32177
17055D20290J41267J19560k60805B01806L21950p2557N16783D70662k3235R3659
17045E41086o7220N3108J18631k06125L1940j29675J70176Q9596r2460r8376L09608
17034G20289n7966p1054K69039m07552M84749k07277r9547j36935k6706K27526
17024F94566l7942k44640L35520j45137j14160J24799L7331Q3201K11853j31491
$$ y = [121504, 387423, 541154, 214797, 391195, 297643, 234097, 326701, 336906, 164415, 409534, 575681, 214711, 286264, 291313, 581508, 671064, 750999, 529584, 37330, 632653, 582763, 196520, 378916, 41949, 253821, 458655, 584108, 432077, 906060, 269258, 232197, 528689, 252509, 340641, 148864, 593704, 762146, 437679, 642883, 669230, 132177, 420290, 561557, 681117, 420312, 201806, 523756, 451199, 967982, 470662, 447427, 541086, 473866, 526974, 645605, 439480, 471420, 341745, 511921, 601517, 509057, 410681, 720289, 662323, 591269, 860308, 452756, 937505, 730228, 630681, 493746, 467040, 694566, 656624, 411984, 747504, 602367, 488207, 613006, 650337, 733538, 945391, 813900]
17014H13900j54008n9539K03130J58766j09232N6299k5909Q7067m6919j31519
17004G92036k7441J56997j03493l64158J07996J29464N3547j19091Q8049n36L3059
16993G46429J10415k2114J48897j95856j08041k17640K29008K51877j32413M0963
16983H51525K37460J32293n59263L83589k38160O3630J31810C88278O04881m11518
16973E81641J54271l2859j10095K19940l2092K67738j73524m11352N98224l31182
16963G30710J47408j60682M23419n8583j53272k80385M33372j96071J70249j09531
16953I46634J22727r4440j76709M46284k5575l01313j9526R0916m7379r9594k64444
16942E77581L49602M30782L78908q34897k63434M11099M71348n00250K6876M35714
$$ y = [813900, 659892, 600353, 803483, 962249, 853017, 909316, 883407, 970474, 923555, 792036, 764595, 921592, 818099, 453941, 561937, 691401, 744948, 625857, 713906, 713370, 746429, 856844, 834730, 983627, 787771, 679730, 462090, 691098, 942975, 810562, 851525, 1088985, 1221278, 662015, 1045604, 807444, 871074, 1002884, 388278, 993159, 581641, 735912, 703053, 592958, 812898, 780806, 1048544, 875020, 463668, 1061892, 730710, 878118, 717436, 1140855, 1082272, 929000, 648615, 1081987, 885916, 1056165, 946634, 1069361, 974921, 798212, 1244496, 1218921, 917608, 898082, 988998, 941619, 842025, 577581, 927183, 1357965, 1736873, 901976, 638542, 1049641, 1520989, 1020739, 1047615, 1483329]
16932A483329k88826J52198M1876P9284o7848R5509j35244Q9970l91615M50991
16922A509624L09j19645j65934k8034P72J61839K18235j50088J97415k47935K27823
16911A604381O0789m41767M55083J55632m64391L72651l97416M73635j33268J97318
16901A882647l62748K61305L8735m52865J96736K68687q726O8354l6874J8674
16891A873925q3906K46497q7246k47799L38638n6996k21791j76815L76070L23949
16881B284526n13813K93845k3024L0667L30096k68811j27346J13839L0627R5797
16871B246403k60350L77393m35698M12032L04526k96853O164k3268J35049K04612
16861B670010o5511O1610n9972L20523j98180K8885K62240l45242M69060r08K12786
$$ y = [1483329, 1194503, 1346701, 1388577, 1467861, 1400013, 1495522, 1360278, 1450248, 1058633, 1509624, 1509933, 1390288, 1224354, 1196320, 1197092, 1358931, 1577166, 1427078, 1624493, 1376558, 1604381, 1665170, 1223403, 1678486, 1834118, 1369727, 1742378, 1344962, 1818597, 1685329, 1882647, 1519899, 1781204, 1819939, 1367074, 1563810, 1832497, 1823771, 1892125, 1855251, 1873925, 1790019, 2036516, 1949270, 1701471, 2040109, 1983113, 1761322, 1584507, 1960577, 2284526, 1770713, 2064558, 2041534, 2072201, 2402297, 2133486, 2006140, 2119979, 2150606, 2246403, 1986053, 2363446, 1927748, 2339780, 2644306, 2347453, 2353617, 2330349, 2465398, 2670010, 2604499, 2666109, 2606137, 2926660, 2728480, 2757365, 3019605, 2674363, 3143423, 3142515, 3355301]
16850C355301k26233j14175j97236N63501P0568l20398M79931k76849K3321M28533
16840C786264p6160K38529K0410j37380O278O0978l60136O03660m6422J47078
16830D243099J91726k04084j12421J09089J88433M1101J49398J00753J01278J13701
16820D922073J9711K35055n1039K69026O981m5424L65703k3392O7499q1887L85002
16809F069308k84606N45507J392K09566K39856o0617L84975J69418j65398K70109
16799G379510L78288K17390K91572j99824N91137J13067L72348j35327M45451
16790I453612L79177M9176L94301K51485J60570M66286M33254n350L47398L46104
16780A2276013N42334J9961L96854N86313K12117J81734O26242O62946L48459
$$ y = [3355301, 3129068, 3014893, 2817657, 3381158, 3451726, 3131328, 3611259, 3334410, 3357731, 3786264, 3710104, 3948633, 3969043, 3831663, 3837941, 3898919, 3538783, 4142443, 4096021, 4243099, 4434825, 4230741, 4118320, 4227409, 4415842, 4456943, 4606341, 4707094, 4808372, 4922073, 4941784, 5176839, 5125800, 5394826, 5401807, 5356383, 5722086, 5698694, 5766193, 5684306, 6069308, 5784702, 6330209, 6331601, 6541167, 6781023, 6720406, 7105381, 7274799, 7109401, 7379510, 7757798, 7975188, 8266760, 8066936, 8658073, 8771140, 9143488, 9008161, 9453612, 9832789, 9881965, 10276266, 10527751, 10688321, 11154607, 11587861, 11582511, 11929909, 12276013, 12818347, 12838308, 13235162, 13821475, 14033592, 14215326, 14841568, 15504514, 15852973]
16771A5852973O83831N37494J51445Q49459N09298J052645N77731O80550R31307
16762B1826733N04978J199306Q30380Q32226J036895R39924J518379J088941J199843
16753C0977605J332154J304935J803161K068154J513766J794606K043962K011047
16745D4849390K435434K695737K554733L189352K955332L524103L643667L892079
16737F9739827M130608M072155N020908N176912N565267O385623O080410O852814
16729A13024524O904954P452702Q160578P515024Q260023Q338741P959216P639301
16721A75255063O984823P000327N316568M767900L075620K047278L21598j300799
16713B03468378k747873l870713n051688o387526p167706p530320q189186q055721
$$ y = [15852973, 16536804, 17074298, 17225743, 18075202, 18584500, 19637145, 20214876, 20895426, 21826733, 22331711, 23531017, 24361397, 25193623, 26230518, 27170442, 28688821, 29777762, 30977605, 32309759, 33614694, 35417855, 37486009, 38999775, 40794381, 42838343, 44849390, 47284824, 49980561, 52535294, 55724646, 58679978, 62204081, 65847748, 69739827, 73870435, 77942590, 82963498, 88140410, 93705677, 100091300, 106171710, 113024524, 119929478, 127382180, 135542758, 143057782, 151317805, 159656546, 167615762, 175255063, 182239886, 189240213, 194556781, 199324681, 202400301, 204447579, 204769177, 203468378, 200720505, 196849792, 191798104, 185410578, 178242872, 170712552, 162523366, 154467645]
16705A54467645q645361p920727q131618p714274p495057p093313o774460o154005
16697I4538830n958826n017118n305473n185681l444165m477602l833690l263268
16689E8053007l627545k738399k905703k496216k447930j962867k333777j926559
16681C7614011k424189j272354j728333j249598j461549j443400j458615j040183
16673B5535790j048806r73122r23877j028726j019526n84540r49031p47215n86666
16664A7674281l28130q74686m81140p56195m67569r39420l14163J193m67452l99758
16654A2646961o57060l97263n9957n56602k49793k16797n42894j80007n77154
16645I209434L66721k36933q74778K89285k54409m09118l09250p2176l6377m82008
$$ y = [154467645, 145822284, 137901557, 129769939, 122055665, 114560608, 107467295, 100692835, 94538830, 88580004, 83562886, 78257413, 73071732, 69627567, 65149965, 61316275, 58053007, 54425462, 51687063, 48781360, 46285144, 43837214, 41874347, 39540570, 37614011, 35189822, 33917468, 32189135, 30939537, 29477988, 28034588, 26575973, 25535790, 24486984, 23513862, 22589985, 21561259, 20541733, 19957193, 19008162, 18260947, 17674281, 17346151, 16471465, 15990325, 15234130, 14766561, 13827141, 13512978, 13514171, 13046719, 12646961, 11989901, 11592638, 11532681, 10976079, 10726286, 10509489, 9966595, 9786588, 9209434, 9576155, 9339222, 8464444, 8753729, 8499320, 8090202, 7780952, 7708776, 7672399, 7190391]
16635G190391j3181j84834k02508l74292k02247o1764j71272j70342l5602j3300
16625E761049k50330J08070m23821l45391K15763j39262k161j36252k87359j8985
16615D481321n2453J82249m91556J82897l75956J34847j38469m4793j33269L4934
16605C779752l60494k9260J45567k57474K01545j09376J45567k48592J39470l39672
16595C067033j72491K94563n28996M2380K74543m22561L92526l1903k04170q2719
16585B628205o0419J21141k26875k68980J82840r3265L52865m49351K27877k85353
16575B128685K25776o20400N47048R9197k54250J4341k07001K96179K3345k91656
16565A961264J8064k20647J6662K53174K7449k87756k37141K99607m1498j24258
$$ y = [7190391, 7177210, 6992376, 6789868, 6415576, 6213329, 6151565, 5980293, 5809951, 5774349, 5761049, 5510719, 5618789, 5194968, 4849577, 5065340, 4926078, 4923917, 4787665, 4500306, 4481321, 4428868, 4611117, 4119561, 4302458, 3926502, 4061349, 3922880, 3878087, 3744818, 3779752, 3419258, 3389998, 3535565, 3278091, 3479636, 3370260, 3515827, 3267235, 3406705, 3067033, 2894542, 3189105, 2660109, 2702489, 2977032, 2554471, 2946997, 2915094, 2710924, 2628205, 2567786, 2688927, 2462052, 2193072, 2375912, 2282647, 2635512, 2186161, 2414038, 2128685, 2354461, 1734061, 2281109, 2380306, 2126056, 2140397, 1933396, 2229575, 2252920, 1961264, 1979328, 1758681, 1775343, 2028517, 2055966, 1768210, 1531069, 1830676, 1789178, 1664920]
16555A664920o1224K15230J13561l63558j96880K67266j82310k27247M43714k50811
16545A422661p7153K6496P4553K11917l54520l6909L79605j29347l23175L34555
16535A528683l33722J55027p4981l19847L17574q0899o7726M22131k78603l42691
16525I24946K51753k79818J64191J63407l23059L13347m23677K50648k22443K77894
16515A097189j64151l02747M10159n4257m40434N36367Q2314j02115l89695J15320
16505G87950J2881P9459P8598J80841k56174j99371J29704J2338J92483k06768
16495H11941O1754j52865j24660j88016N3659o071L57630k92624l2367J44492
16485F32873K98695k7712l49745P1185J50412j54161j44761Q5371K81442j47491
$$ y = [1664920, 1603696, 1818926, 1932487, 1568929, 1372049, 1639315, 1457005, 1229758, 1673472, 1422661, 1345508, 1372004, 1446557, 1658474, 1303954, 1267045, 1646650, 1517303, 1194128, 1528683, 1194961, 1349988, 1275007, 955160, 1272734, 1191835, 1124109, 1546240, 1267637, 924946, 1176699, 896881, 1061072, 1224479, 901420, 1214767, 791090, 1041738, 819295, 1097189, 933038, 630291, 1040450, 986193, 545759, 1082126, 1164440, 1062325, 672630, 787950, 800831, 880290, 958888, 1139729, 883555, 684184, 813888, 826226, 1018709, 811941, 873695, 720830, 596170, 408154, 461813, 455742, 813372, 520748, 488381, 632873, 931568, 903856, 554111, 625296, 775708, 621547, 476786, 562157, 843599, 696108]
16475F96108q878j47582J00856j61961J03134J83565j73396p3446L01661C19628
16464D01194m7595L95456k97834L82474l02666o3752K92036C03058m3451O6042
16454C25649J17557A81044K6198J53693L10796j44935B27496M49537p5178j73585
16444D28270J57357j00391k9912o5882j7547K94219l06914P7077J54349B32817
16433B58144K69552K86062l72867Q0162j87913j34643K12104P9072B40881L40229
16423E81110B84217Q0693J30029m9724A48204J8394J61204M8909k933a05682C06514
16411D57163B20345J37049J11652J34300r1047j91001l8515N3975K7667G9451
16400D59159B21447R3409n8440I1265K91731A64799L7511K50357j72650J21112
$$ y = [696108, 687230, 539648, 640504, 478543, 581677, 765242, 591846, 518400, 820061, 319628, 401194, 353599, 749055, 451221, 833695, 531029, 467277, 759313, 303058, 259607, 325649, 443206, 181044, 207242, 360935, 671731, 526796, 227496, 677033, 601855, 428270, 585627, 485236, 455324, 389442, 371895, 666114, 359200, 436277, 590626, 232817, 258144, 527696, 813758, 440891, 521053, 333140, 198497, 410601, 489673, 240881, 581110, 284217, 364910, 494939, 445215, 148204, 166598, 327802, 376711, 373778, -105682, 306514, 457163, 220345, 357394, 469046, 603346, 512299, 321298, 282783, 336758, 364425, 79451, 459159, 221447, 314856, 256416, 91265, 382996, 164799, 202310, 452667, 280017, 401129]
16390D01129I3834R9362J4530G9584K33590j9217j46719L54499k29897J89212
16380D61052B20802I4762J64475n7191K6177J37966c9100A62064J14115J0893
16370B87072K41029j34263C7783K00116K68981j84882o4000L4402A19661h2462
16359b5205D12033j0171j87197R8463O1532j8298K23328B79587N9458J38553B4545
16347C54020E6680K76288n7511j15219C8338f8252A04270J72268n475J8075I492
16335A65266L12097a53391B1499a11909E6734K11106j26010J4617l7806g5677
16324H3624K19474F7232I287i8083G9579K11149n0275j16945J30453b5808A25922
16312A85471C1623n645P337M8519k7333B6283q052R4725J79858A43657C1208e128
$$ y = [401129, 93834, 193196, 207726, 79584, 313174, 293957, 147238, 501737, 271840, 461052, 220802, 94762, 259237, 202046, 228223, 366189, -39100, 162064, 276179, 287072, 528101, 393838, 37783, 237899, 506880, 321998, 257998, 292400, 119661, -82462, -25205, 412033, 401862, 214665, 313128, 374660, 356362, 579690, 279587, 339045, 477598, 24545, 354020, 56680, 332968, 275457, 160238, 38338, -68252, 104270, 276538, 271063, 289138, 9492, 165266, 477363, -153391, 21499, -111909, 56734, 267840, 141830, 156447, 118641, -75677, 83624, 303098, 67232, 9287, -98083, 79579, 290728, 240453, 123508, 253961, -25808, 125922, 185471, 31623, 25978, 33315, 81834, 54501, 26283, 18231, 112956, 292814, 143657, 31208, -5128]
16299a1512q1126A88473c3713B5822R9373n0905A5956e1012A16971a35569A18584
16287D85187j02698A66667b36666E1384Q8504a08275o061A58769M6462E1864K13773
16276B65637c9349C05910j15706l5638M74876b50884A6390a49112e1071H4288
16265E8227K37279B0003L1752O0883m7366j2055L63894A76771a06056A3094J41914
16254A55008K18654E8037J18539b928p3251B00609m3819K20073q1637G5268J43665
16243B18933b21722B0513i5875j4909I3317K3686J62011A29880d05973c971B13983
16231A24222c22777J36624G5497K41056A20075d4985k5941B78008M1267a90824
16220E1231c7023E719h1046k30174a881j97387j41584F6427d8627J7749A55126
$$ y = [-11512, -92638, 188473, -33713, 25822, 125195, 74290, 15956, -51012, 116971, -135569, 118584, 485187, 382489, 166667, -236666, 51384, 139888, -108275, -114336, 158769, 205231, 51864, 265637, -39349, 305910, 190204, 154566, 629442, -250884, 16390, -149112, -51071, 84288, 58227, 295506, 20003, 51755, 112638, 65272, 53217, 417111, 176771, -106056, 13094, 155008, 373662, 58037, 176576, -2928, -76179, 200609, 156790, 376863, 295226, 75268, 218933, -221722, 20513, -95875, -110784, 93317, 117003, 279014, 129880, -405973, -3971, 213983, 124222, -322777, -186153, 75497, 316553, 120075, -44985, -70926, 278008, 319275, -190824, 51231, -37023, 5719, -81046, -311220, -1881, -199268, -340852, 66427, -48627, -30878, 155126]
16208i042B29929o4174B1687K9782E590J29190j2519J2074B7506K39294a54176
16196e1724E2985J05195c1492A35414b6286p4555M5502C32769b526F095K15093
16185B21188e7859j46310C37173f4867k08317B71576r2416l7932c77506J79893
16175a97613N1756i727j98816m5282a16138c5397k62262A3383b1868I7153k6184
16164G0969J15630E7063a89962P9059d3288j4700A16779M8784a47956I795J86844
16153A96639i1607J4829j9417A60009B8610g161A11750A7132L6736c6038A22279
16141B46699d0503A66045J20108r5025b69798E3519b30661e3191j44396a7800
16130f0880A44334J28296q575A9910h2315k69998c5499k5781q0306A1251e341
$$ y = [-9042, 229929, 165755, 21687, 51469, 5590, 134780, 122261, 134335, 27506, 266800, -154176, -51724, 52985, 158180, -31492, 135414, -26286, -100841, -55339, 332769, -2526, 6095, 221188, -57859, -204169, 337173, -64867, -273184, 271576, 179160, 141228, -377506, -197613, -145857, -9727, -208543, -253825, -116138, -35397, -297659, 13383, -21868, 97153, 70969, 186599, 57063, -189962, -110903, -43288, -57988, 116779, 165563, -147956, 9795, 196639, -91607, -76778, -96195, 160009, 28610, -7161, 111750, 17132, 53868, -36038, 122279, 246699, -40503, 166045, 286153, 191128, -269798, 53519, -230661, -53191, -197587, -17800, -60880, 144334, 272630, 264055, 19910, -82315, -352313, -35499, -61280, -141586, 11251, -5341]
16118a84540g0762B41334i3085k20577A5959O4429a38676f2578j40301H7198j1277
16107G5921a92239r8271I2486a90759p3937D3381J76092D0965L6557i2821B6711
16095E1659k1504P7679K95235j48836b30148I5046e3743J6458A22156d0243l35446
16084c75689a16248l93490a54280k9096J961G2455b54300a20939m91264a17219
16073a82803D2848b01063F0737J02591j9467a05298M1492j87383J2407N7879j40774
16062c21677C7550K62700E2956a5348A6296M444c3713A84820L4855B1819c09807
16050A18114P4778q1839L2835D8616j0281J0246e09385f7629B3856c19390J23180
16039a96210J6567A5627J65379F2320b29487e6341G1393J79520c71277F5447c0901
$$ y = [-184540, -70762, 241334, -93085, -313662, 15959, 80388, -138676, -62578, -202879, 87198, 75921, -192239, -290510, 92486, -190759, -264696, 43381, 219473, 40965, 77522, -92821, 26711, 51659, 30155, 107834, 403069, 254233, -230148, 95046, -53743, -37285, 122156, -40243, -375689, -116248, -509738, -154280, -183376, -181415, 72455, -254300, -120939, -612203, -117219, -182803, 42848, -201063, 60737, 163328, 143861, -105298, -63806, -251189, -238782, -180903, -321677, 37550, 300250, 52956, -15348, 16296, 20740, -33713, 184820, 219675, 21819, -309807, 118114, 192892, 111053, 143888, 48616, 38335, 48581, -509385, -67629, 23856, -319390, -196210, -179643, 15627, 181006, 62320, -229487, -56341, 71393, 250913, -371277, 65447, -30901]
16027a58485O2722I7954K0800g4424H6361M09056a26057C20882k5816q4927d12829
16015F4693b35815a16774h975n0178j33107J9099A28455e7137D0147b32553j7946
16004b50499I5517M4005b76805J34585F2526f8459A01086b26195B7182b05533
15993b61727P8088c8756M876l3496B40748G3043e9029D5970K55190j26705K61046
15982D35501k01458J14322Q0674o0445F9706N48324d0806D498a8030j44382D4561
15970a00698A11704J768l5813c58711A68713j1391a74062N1750A39029b5677j63471
15959a89148A243h6673P873m5782j55405B78694h5985q1205e5882A03299b15063
15947a44202c0634H3229K33230b1673A4307P5380M558b794j08327E241J32081
$$ y = [-158485, -95763, 97954, 118754, -74424, 86361, 495417, -126057, 320882, 295066, 210139, -412829, 64693, -235815, -116774, -8975, -59153, -192260, -173161, 128455, -57137, 40147, -232553, -250499, 95517, 139522, -276805, -142220, 62526, -68459, 101086, -226195, 27182, -205533, -261727, -183639, -38756, -33880, -67376, 240748, 73043, -59029, 45970, 301160, 174455, 435501, 234043, 348365, 429039, 368594, 69706, 618030, -40806, 4498, -18030, -162412, 44561, -100698, 111704, 113472, 77659, -358711, 168713, 157322, -174062, -122312, 139029, -25677, -189148, 1243, -86673, -78800, -124582, -279987, 278694, -85985, -167190, -55882, 103299, -215063, -144202, -30634, 83229, 316459, -21673, 14307, 89687, 94245, -2794, -111121, 5241, 137322]
15936A37322b21829B31538a77419b8493H3566l8969a65887e9034A87977c46893
15925c29798J42196O3015B3724f1898E5226b00065A7731c5441p6961D64722A8246
15913b67258j3555e1323j12583H3480a99042g3397j5417F11P141J32305b59802
15901a93541k3328C04099c74077A0920K8104b6808j36770g8995c6883m0928A70639
15889b87565d6039j37109l2781j9091r328E6639K02520J47296C3293Q1309j4585
15878A00017j0488h9839A05203K90240A45533a48919B4492b57814F4121b61333
15867C35626b33071A22878K17831f05845B15382c21335B4861J00573a0742q9218
15857i9960A17415c26405M9940A92873e6884A00967N5398l7058E4115a9528A01844
$$ y = [137322, -221829, 231538, -177419, -28493, 83566, 44597, -165887, -59034, 187977, -346893, -329798, -187602, -124587, 23724, -61898, 55226, -200065, 17731, -35441, -112402, 464722, 18246, -267258, -280813, -51323, -163906, 83480, -199042, -73397, -88814, 611, 7752, 140057, -259802, -193541, -216869, 304099, -374077, 10920, 39024, -26808, -163578, -78995, -36883, -77811, 170639, -287565, -46039, -183148, -215929, -235020, -244348, 56639, 259159, 406455, 33293, 114602, 100017, 89529, -89839, 105203, 395443, 145533, -148919, 24492, -257814, 64121, -261333, 335626, -233071, 122878, 340709, -605845, 215382, -321335, 24861, 125434, -10742, -99960, 117415, -326405, -276465, 192873, -56884, 100967, 156365, 119307, 54115, -19528, 101844]
15845b33006B71309g4081L1873I2451J15301k2685J43579I2409c3227j38621A287
15833B73294a94582C13646a28321A07343h7462A43102L7123F641N7041J7918c61758
15821d23180g040r3810B5384M4308b07307d0007j51952p992f5057C7066i2761
15809H9863L535D4706g76j43151j38197N2060B44679c3446A54129C0723a85649
15797B45551P2953A26057F2068a95245a6955A73492k8816b62792h2997k72220
15787c55217a60929L9501c4852q2973m097F3882i5655k49812i8962l17482a62407
15775c02648g2398B95194A36880a22543B1807a92559a6817B03856L5318o9681
15765A69493q3301k9087J09052B6277e28043a66030J3825c5125C22647b70260
$$ y = [-233006, 271309, -74081, -42208, 92451, 207752, 185067, 328646, 92409, -33227, -171848, 1287, 273294, -194582, 313646, -128321, 107343, -87462, 143102, 180225, 6641, 63682, 81600, -361758, -423180, -7040, -100850, 25384, 69692, -207307, -40007, -191959, -199951, -65057, 37066, -92761, 89863, 93398, 44706, -776, -143927, -282124, -230064, 244679, -33446, 154129, 30723, -185649, 245551, 318504, 126057, 62068, -195245, -16955, 173492, 144676, -262792, -82997, -355217, -160929, -121428, -34852, -117825, -121922, 63882, -95655, -345467, -98962, -416444, -162407, -302648, -72398, 295194, 136880, -122543, 21807, -192559, -16817, 203856, 239174, 169493, 86192, 57105, 166157, 26277, -528043, -166030, -152205, -35125, 322647, -270260]
15754A45805N4396j9852p1057i7159B8050L68703i9360B67462i3913j35966I1124
15742E8470b2300A59572f9008j53993d058A45626b69437L7655P3329M5792e0125
15730a50316l59598A38799h6399A15132a2214B04319a77574B20356f5673n6535
15720a22208A11418e28575a87780P4223o2351N308b3832k2392k2955A14681c7089
15708e3345C4385b65306a06252d1437n9999c0946k49744d4489D8944h9652D9121
15696a85536Q2643q0704N2059A67853K5336f5851A80341E4251i7959C1877J0842
15685D2719a99502A06001b08974A71190b03816R3020A04983d4850j70424A04694
15674a71431C2058E150a43059A52154N6907q5848c4061k16288M409d8892H8688
$$ y = [145805, 200201, 180349, 109292, -97159, 28050, 396753, -99360, 267462, -93913, -229879, 91124, 58470, -22300, 159572, -69008, -223001, -4058, 145626, -269437, -231782, -158453, -112661, -50125, -150316, -509914, 138799, -86399, 115132, -12214, 204319, -177574, 220356, -65673, -122208, 111418, -528575, -187780, -113557, -175908, -170600, -23832, -46224, -69179, 114681, -37089, -53345, 34385, -265306, -106252, -41437, -101436, -30946, -280690, -44489, 48944, -89652, 49121, -185536, -102893, -183597, -131538, 167853, 193189, -65851, 180341, 54251, -97959, 31877, 42719, -199502, 106001, -208974, 171190, -203816, -110796, 104983, -44850, -215274, 104694, -171431, 32058, 5150, -143059, 152154, 209061, 123213, -34061, -250349, -245940, -48892, 88688]
15662F6535k1854b7101j83832G974P7877K2520J01804c16191C98702a38941d8583
15650H3069N2382P6565g8068j17823B36018b75007D0194L13074f7670n4057L0930
15639i0797F6843c4758j11667l44930d2328C20562a78491L6878G0630J24623H7674
15627B3051J86970k4656A6175b3048m6538j3713A90061g3882A51302o7933B036
15615B0678L56558p4967A46861a48204A43959F3091K44341a75058g988A25826
15604b27118C5989g8151j20757j32865A17359E787d0358r9601N7121D4772a84552
15592a07533c243j67238a3887j1946k4383B63425d66366I2857P3771a74201B13638
15580b74459a22068j15782a13973a3071A65316b88E9540R1312c50676d1762J6638
$$ y = [66535, 44681, -27101, -210933, 7974, 85851, 108371, 210175, -316191, 398702, -138941, -48583, 83069, 135451, 212016, -78068, -195891, 236018, -275007, 40194, 353268, -67670, -121727, -90797, 66843, -34758, -146425, -491355, -42328, 320562, -178491, -141613, 70630, 195253, 87674, 23051, 210021, 185365, 16175, -23048, -69586, -83299, 190061, -73882, 151302, 83369, 2036, 20678, 377236, 302269, 146861, -148204, 143959, 63091, 307432, -175058, -7988, 125826, -227118, 35989, -78151, -198908, -331773, 117359, 5787, -40358, -139959, -82838, 44772, -184552, -107533, -3243, -170481, -13887, -25833, -50216, 263425, -466366, 92857, 166628, -174201, 213638, -274459, -122068, -237850, -113973, -13071, 165316, -288, 59540, 150852, -350676, -41762, -25124]
15569b5124B74564h9208B02127o8308a28684A1824a06055C12563d80269h3126
15558A20212b25977H6648C0501b24989f6814l52041a07343b8452j21477N8278
15548i1651A93747K05594H2103Q0898e5570k47233a11843k26851A96948b3522
15537C01894H4226K2960b90337A18186J99993c1939j74339B15862a06005r6725
15527b02730A97803h8473K5748A34060F6428a8753L212C5638j1796M4790g6311
15515d92036a26396m5669i117C15312A51280c8423A32166a48920j19334B4526
15504G6139q524g9681b5299q4911A14735c55538B97918q1116a78071A73648E7167
15492a06651J7649k3605l24420C55602m8809b65810J02649K7514A08123i8854
$$ y = [-25124, 274564, -89208, 202127, 133819, -128684, 11824, -106055, 312563, -480269, -83126, 120212, -225977, 86648, 30501, -224989, -66814, -418855, -107343, -28452, -149929, -91651, 193747, 399341, 82103, 163001, -55570, -302803, -111843, -338694, 196948, -23522, 301894, 84226, 107186, -290337, 118186, 318179, -31939, -206278, 215862, -106005, -202730, 197803, -88473, -62725, 134060, 66428, -18753, -15541, 35638, 23842, 68632, -76311, -492036, -126396, -172065, -9117, 315312, 151280, -38423, 132166, -148920, -268254, 24526, 76139, 67615, -79681, -25299, -110210, 114735, -355538, 297918, 216802, -178071, 173648, 57167, -106651, -89002, -112607, -437027, 355602, 306793, -265810, -163161, -135647, 108123, -98854]
15481B98040c82482A91700C8562b60427F723b8545n8379j0378R121B5371L287
15470B8658c8179k14927B43449A11336G050J02846J29759H4844l941R2668d0578
15458d7560l4197k47608G9530L64986b03531j6732A70588a73684I380J52941Q0833
15447B43154b11197O8943H7736a23481E383d9952l53856E9712P0450m1336b70572
15435a29274k958j21130P8220A28940e6433A1525i9875b6786G5015J0170a1130
15423b7494A9254d0939A94942a49569L9794r9693c8334l2622B1690F961J90968
15412A97929a38576F5172K23150C6996b0054k8102A81904o1374a45112A21633
15401a50001j1181A63529N584C8867L58362a4173D6906a46552j58633e6728q68
$$ y = [298040, -382482, 191700, 38562, -260427, 6723, -28545, -86924, -97302, -88181, 25371, 28658, -38179, -253106, 243449, 111336, 7050, 109896, 239655, 84844, 80903, 173571, -40578, -47560, -81757, -329365, 79530, 444516, -203531, -220263, 170588, -173684, 9380, 162321, 243154, -211197, -142254, 87736, -123481, 5383, -49952, -403808, 59712, 130162, 88826, -270572, -129274, -132232, -253362, -175142, 128940, -56433, 11525, -99875, -26786, 75015, 85185, -11130, -27494, 19254, -40939, 194942, -149569, -109775, -209468, -38334, -70956, 21690, 6961, 197929, -138576, 65172, 288322, 36996, -20054, -48156, 181904, 120530, -145112, 121633, -150001, -161182, 163529, 169113, 38867, 397229, -14173, 46906, -146552, -305185, -56728, -57596]
15390e7596j1455B40416B1107b0847C50079a45694P342I4873b0400l26506a09519
15378d5652j49081h2476B54915A2398N1938P9571d68130f2706A42388J92803C0008
15366c97133D7416M0472J45545c37467A23356n8299b22458A3118O4310J84855
15356B62283A30716j5039a48263A44524K2745m7839E9228c11066E0741j965N3444
15345A02220c5954b016p5767j51952D4818L08654a19643a2317I7414a72288F4466
15333B24191p6186c8713r2202A03924Q7453l3819B5752O5274b8044E7191a46430
15321b1391k76597A09933a72602n0572k6275R0269H3389b44564a06240A76414
15310A75407b6752o2882b9084J2007F3556J29079G0242b77661J15282B72010j16854
$$ y = [-57596, -69051, 240416, 21107, -20847, 350079, -145694, -138352, 94873, -20400, -346906, -109519, -45652, -194733, -82476, 254915, 12398, 64336, 143907, -468130, -62706, 142388, 335191, 30008, -397133, 47416, 87888, 233433, -337467, 123356, 65057, -222458, 13118, 77428, 262283, 130716, 115677, -148263, 144524, 167269, 119430, 59228, -311066, 50741, 48776, 102220, -35954, -2016, -77783, -229735, 44818, 353472, -119643, -12317, 97414, -172288, 64466, 224191, 148005, -38713, -130915, 103924, 191377, 157558, 25752, 91026, -28044, 57191, -146430, -21391, -297988, 109933, -172602, -223174, -249449, -159180, 83389, -244564, -106240, 176414, 175407, -26752, -89634, -29084, -17077, 63556, 192635, 70242, -277661, -162379, 272010, 155156]
15299A55156a85834j62419B69436F0858b56709A17762O4089p0715L69631C9223
15288A8404d7362l2279A7015J24060Q2394d4295l8780A47315o4276H745Q3619
15277I2364b84938h3527B56812a94323C82076A17983k5225a60655A02546K53015
15267C55561a75785A49601G0631L88983b07037e5417C62625J4568a05755j4062
15257a19817B26925a80940G5180k040e8308C32018a53182b8515E41920J81736
15247G23656J057471J68550o28633M76468o58553C25068P7223A51242N2090E5123
15236E6937j0401O4232b01143C67806h9211B45109a25213M8063B96100A3462K50320
15225B63782k1045e941A76543a00776J935E9535O4019i6199C22847A9757M4610
$$ y = [155156, -185834, -348253, 269436, 60858, -256709, 117762, 181851, 111136, 480767, 39223, 18404, -47362, -79641, 17015, 141075, 223469, -44295, -83075, 147315, 83039, 8745, 92364, -284938, -83527, 256812, -194323, 382076, 117983, 92758, -160655, 102546, 355561, -175785, 149601, 70631, 459614, -207037, -55417, 362625, 377193, -105755, -119817, 226925, -180940, 75180, 73140, -58308, 332018, -153182, -28515, 541920, 723656, 1781127, 1949677, 1321044, 1797512, 1138959, 325068, 402291, 151242, 203332, 55123, 56937, 46536, 110768, -201143, 367806, -89211, 245109, -125213, -77150, 296100, 13462, 263782, 242737, -5941, 176543, -100776, -98841, 59535, 123554, -96199, 322847, 19757, 64367]
15214F4367J32853b58264B60214F1728K10865a38056B17822j6573D5863a4075
15203b44342D7539J26958d6960F9904a48371N838B40368K6928J16944j37850a07259
15191A99758r7296k7781N1368K64250G2751c6591l3091A76717G2861h5277b6390
15179A49119b3789E4385J30400A1242J44673l3211d2940D23774e842G7053K02038
15168B79091A9008J53414B8113M6159J38544a8060C14328E5900J55992B5729K70129
15157B95858D7452N5079P4230J66129p9555B22O1354a26882D49003G9699J43878
15146B23577A04395a13790A27616K80921j03296g2900R946j02180P3009c8043
15135A72590H2617K06522a0828B27216q5689B6147a6853C11042a1599A15881m018
$$ y = [64367, 197220, -258264, 260214, 61728, 272593, -138056, 217822, 201249, 45863, -14075, -244342, 47539, 174497, -46960, 69904, -148371, -142533, 240368, 267296, 384240, 246390, -107259, 199758, 102462, 74681, 126049, 390299, 72751, -36591, -69682, 176717, 72861, -85277, -26390, 149119, -23789, 54385, 184785, 11242, 155915, 122704, -42940, 423774, -5842, 77053, 279091, 19008, 172422, 28113, 74272, 212816, -18060, 314328, 55900, 211892, 25729, 295858, 47452, 102531, 176761, 342890, 263335, 222, 61576, -126882, 449003, 79699, 223577, 104395, -113790, 127616, 408537, 305241, -72900, -62954, -165134, -92125, -38043, 172590, 82617, 289139, -10828, 227216, 141527, 26147, -16853, 311042, -11599, 115881, 111863]
15124A11863j149B7320L72737a967B96725d5868C88176j36797o7500a82341J3372
15113a68969a0211D20667i2914A92026a45008J6713d2948B74944a49431A56000
15102C50767A12676b3761C45410D9527L53857E3661c2246A23237b91069A57541
15091A22753K57274G5244a0561A07283b22806D95001e0272D72766n386A41355
15080a300I1452J37970q8800a6937B78568a62822C07585b6219D96131B34352J92113
15069D26465j84779A5051K59193p0705l4555H2188L92891F1828B0158b49585D1390
15057B25873I3650J57837K9961E1308O8305J36860L3930A43195l8478M52349B47317
15045B5313a86880B09638m4805N7938p4825J16591d7469D31817A08098R3044K31562
$$ y = [111863, 110714, 27320, 400057, -1967, 296725, -45868, 388176, 251379, 183879, -182341, -168969, -10211, 420667, -92914, 192026, -145008, -128295, -42948, 274944, -149431, 156000, 350767, 112676, -23761, 345410, 49527, 403384, 53661, -32246, 123237, -291069, 157541, 122753, 380027, 75244, -10561, 107283, -222806, 495001, -50272, 472766, 467380, 141355, -1300, 91452, 229422, 140622, -16937, 278568, -162822, 307585, -26219, 496131, 234352, 426465, 241686, 15051, 274244, 203539, 168984, 82188, 475079, 61828, 20158, -249585, 41390, 225873, 93650, 251487, 281448, 51308, 119613, 256473, 290403, 143195, 104717, 557066, 247317, 25313, -186880, 209638, 164833, 222771, 147946, 264537, -47469, 431817, 108098, 201142, 432704]
15034D32704j29227J34050N4798j83560m664E1746c2483A25538a43015B52182
15023e6104H8121Q2048m826J28091m9870l9344D7387j2148J25957J99186P3847
15012D34229A57164M4039J87322B8195M71753B10151J79814A90610K29589A87010
15001E9558K28472L4631M01604B15920J55824D9152R0961O5166j6855J59787n6810
14990B91401A01881e0577A31486D5160J99965A17675B5259L00839n4147K50530
14980E22481A88122b5358D47452j65725M6156R3155R0495j6293A25918L32224
14970D58142J06555I7925L18748E3684R6703N7919M78116B13293N6490A08961
14959D12348F7526R1605M1294K6612j08794J48584E22K25070m232Q9243o3356
$$ y = [432704, 303477, 437527, 492325, 308765, 304101, 51746, -32483, 125538, -143015, 252182, -56104, 88121, 170169, 165343, 293434, 243564, 204220, 47387, 35239, 161196, 360382, 434229, 157164, 201203, 388525, 28195, 499948, 210151, 389965, 190610, 420199, 187010, 59558, 288030, 322661, 724265, 215920, 371744, 49152, 140113, 205279, 188424, 348211, 291401, 101881, -50577, 131486, 45160, 245125, 117675, 25259, 326098, 271951, 522481, 188122, -25358, 447452, 281727, 327883, 421038, 511533, 495240, 125918, 458142, 564697, 97925, 416673, 53684, 150387, 208306, 686422, 213293, 269783, 108961, 412348, 67526, 159131, 200425, 227037, 118243, 266827, 522, 225592, 221360, 310603, 247247]
14948B47247m5298l2031j3444M3065K04160j34386j8514j14472R5151K97995E9215
14936B41911K32621P0965j94948j02984K64806B1759K11189o6103L283C7373N29065
14925E66438k10147p6826P0241p4004M77249A33326J23584I6767J60896j3661
14915B44002N3326A17746L10447B10856K30793j43344J83648o6114j58450I0955
14904C00687j13290m6679K78844A16539b01899G2440C2332N57740B67035l073
14894B63962o2764L30700k18079J92528k33937L84420k17360A68305J80271J96214
14884E44790k55879K47417q7730k23730J68752j06251K31510n9451j13058P9377
14874D25747j50325L29129k38612B9824L09382K37886B11329O4958O4443J27197
$$ y = [247247, 201949, 169918, 156474, 199539, 403699, 269313, 250799, 136327, 231478, 529473, 59215, 241911, 474532, 545497, 350549, 247565, 512371, 21759, 232948, 166845, 170128, 37373, 566438, 356291, 279465, 349706, 275702, 752951, 133326, 256910, 96767, 257663, 244002, 297328, 117746, 428193, 210856, 441649, 298305, 481953, 415839, 257389, 90955, 300687, 187397, 140718, 419562, 116539, -201899, 72440, 32332, 590072, 267035, 263962, 201198, 531898, 313819, 506347, 272410, 656830, 439470, 168305, 348576, 544790, 288911, 536328, 448598, 224868, 393620, 287369, 518879, 459428, 346370, 425747, 275422, 604551, 365939, 29824, 339206, 577092, 211329, 276287, 340730, 467927]
14864D67927B05203J56617p7182r6822J98380J94782j22042A99072L00893J8096
14854E18061R7128j10415J09603B10168A01007K64840J04236q4183G1022M28245
14844D99267k17704L3117J27732J55192k05364N5582k15469J09239J83216J34843
14834F59651j97100o6863l0920j13431K70491J07550B26169J10199K96482l6079
14824E96771k08347J49751K67404j61496k43657P7189j56625J00693k5305A33818
14813B47397J97785J04776Q7508k66705J75783Q5323q0888n5348o5651Q0604n4688
14802D55896o2620M4391L26967k97827K79282C11897L20733j96864J6153n3647
14792C98272J67J30761j81746j27480K39230J49987B88266K59770m1157j79294
$$ y = [467927, 205203, 361820, 284638, 187816, 386196, 580978, 458936, 199072, 499965, 518061, 615189, 504774, 614377, 210168, 101007, 365847, 470083, 385900, 71022, 499267, 281563, 314680, 442412, 597604, 392240, 447822, 232353, 341592, 524808, 659651, 462551, 395688, 364768, 251337, 521828, 629378, 226169, 336368, 632850, 596771, 388424, 538175, 805579, 644083, 400426, 477615, 320990, 421683, 396378, 133818, 247397, 445182, 549958, 637466, 370761, 546544, 631867, 550979, 495631, 429980, 510584, 455896, 393276, 437667, 764634, 466807, 746089, 311897, 632630, 435766, 451919, 398272, 398439, 529200, 347454, 219974, 459204, 609191, 288266, 548036, 506879, 327585]
14782C27585q1937P52566j53617l66004L1552j3134N3074J21566k21370j43418
14772C06863M1693M18674m4838j90378J68540k92799m161N1456J93456K95404
14762I43910k45426J01824Q630A97530K75857J55624k66530M70595k57907R9913
14752F75082J2755M9317j23979J11132j78673J10549M4020k75564K37999k48785
14742D13853P7209K70394R5531k87219L70200j41611k52316L677L30656j90931
14732F89443m89J8504J7387J4924K44200l28538p4602L50362k98921L88793l05411
14721G15652j74981L25114j61791L7058K99619j81028k48274K95140l9688m01168
14711D65653O57243k17044J61760l03255J72749l54336K34853q5481J72191l41426
$$ y = [327585, 245648, 998214, 844597, 478593, 510145, 497011, 550085, 671651, 450281, 306863, 348556, 767230, 722392, 532014, 700554, 407755, 403594, 455050, 648506, 943910, 698484, 800308, 808938, 197530, 473387, 629011, 362481, 833076, 575169, 675082, 687837, 737154, 613175, 724307, 545634, 656183, 700203, 424639, 662638, 413853, 491062, 761456, 856987, 569768, 939968, 798357, 546041, 549718, 880374, 689443, 688954, 707458, 724845, 739769, 983969, 655431, 580829, 931191, 632270, 1021063, 715652, 540671, 865785, 703994, 741052, 1040671, 859643, 611369, 906509, 866821, 465653, 1122896, 905852, 1067612, 764357, 937106, 582770, 817623, 732142, 904333, 562907]
14701E62907N66219r1984k286j32139R3619j25952J570j29564J86559j95177M68990
14690A202762l43711n4237j13405J20696l01826M92835j77638R9923L15832r7208
14680A144023l43160L32238k14563j34182J88325k00214K12974j86827J95523
14671I94137q7904j23782j58564M78942l51332K45187j01647K63158j0995k09674
14661I37526J29309M131N6051r6126L40132o6953R8358k32252R144j01070J9610
14650A097860K43268o44882J62534O6188K13960J6103j81522K55124l05817L49787
14640A272603j84752L26607m92774N07636m8066K7863r7502F50010M62869K92039
14630A404918j69132J12331k12934l7661M18590n52022M16017j8574Q8097K0631
$$ y = [562907, 1129126, 1037142, 1034856, 902717, 996336, 870384, 871954, 742390, 928949, 733772, 1202762, 859051, 804814, 691409, 812105, 510279, 1003114, 825476, 925399, 1241231, 1144023, 800863, 1133101, 918538, 784356, 972681, 772467, 985441, 798614, 994137, 906233, 782451, 623887, 1102829, 751497, 996684, 895037, 1158195, 1147200, 937526, 1066835, 1070966, 1127017, 1030891, 1371023, 1304070, 1402428, 1170176, 1179320, 1078250, 1097860, 1341128, 696246, 858780, 924968, 1138928, 1155031, 973509, 1228633, 922816, 1272603, 1087851, 1414458, 921684, 1429320, 1381254, 1409117, 1311615, 650010, 1112879, 1404918, 1235786, 1348117, 1135183, 1097522, 1516112, 964090, 1380107, 1361533, 1449630, 1470261]
14620A470261K23497n40105K92296n3105j323l6457m5234j98551M70277k4790
14610A556766k0219P5969R485k1985O2948k8508l580j87782J57354J7208N204
14599A622860K25984k22152L226R0666m6420L43789n26673K44237k69560K18573
14589A684530k4788J39784k5753M10794k13009M2220j60554J33706j23524j67364
14579A696042J16483K78171j18021m6596J49077Q2288j78446K16265j14240L25000
14569B406023l70348J97803k1346j19015K30877R5448l2130N35885l43239j04850
14559B475108M85249j06292J45989N6256M71433R0517k45804M29627N89196J001293
14549E392572K211426M211028J0104045J9370676M601925B0550207j0065263l930569
$$ y = [1470261, 1693758, 1153653, 1445949, 1392844, 1391521, 1355064, 1309830, 1111279, 1581556, 1556766, 1536547, 1612516, 1622001, 1600016, 1662964, 1634456, 1630876, 1443094, 1600448, 1617656, 1622860, 1848844, 1626692, 1629918, 1720584, 1674164, 2017953, 1491280, 1735517, 1465957, 1684530, 1659742, 1799526, 1773773, 2184567, 1971558, 2013778, 1853224, 1986930, 1863406, 1696042, 1812525, 2090696, 1972675, 1926079, 2075156, 2157444, 1978998, 2195263, 2081023, 2406023, 2035675, 2233478, 2212132, 2093117, 2323994, 2419442, 2387312, 2923197, 2579958, 2475108, 2960357, 2854065, 3000054, 3056310, 3527743, 3618260, 3372456, 3802083, 4391279, 5392572, 7603998, 11815026, 21919071, 41289747, 45891672, 20550207, 10484944, 6554375]
14541F554375C049301n26892o44463j30072N57522k82737L3849k40637R0944M65965
14531B372780j84056l72982N13295r9287R5292K45968j80385N6592K41394k01755
14521B486856j11787J20680j36733j14000K64812j8151Q1997L54701M4909j25421
14511B847863K12333l05314N3249O7002l8118j65459K9309P04073l87147j47995
14501B869796M72404j58810j18373J30728L84581l79442n8898M59964l73735O42061
14491C870276j31046m40074L06440j4152J29008q6589K42060M4085l35097l0654
14481C554257j3258J81788k96674O40955J52952j92869j53945j9589K25058l8123
14471D040552K26796K30409l81242L24311m80769N16930J04860q0833k1079r4969
$$ y = [6554375, 3049301, 2522409, 1877946, 1747874, 2305396, 2022659, 2056508, 1815871, 1906815, 2372780, 2188724, 1815742, 2329037, 2229750, 2325042, 2571010, 2390625, 2447217, 2688611, 2486856, 2375069, 2495749, 2359016, 2245016, 2509828, 2491677, 2573674, 2928375, 2973284, 2847863, 3060196, 2754882, 2808131, 2875133, 2837015, 2671556, 2700865, 3404938, 3017791, 2869796, 3342200, 3183390, 3065017, 3195745, 3580326, 3200884, 3141986, 3601950, 3228215, 3870276, 3739230, 3299156, 3605596, 3591444, 3720452, 3633863, 3875923, 3920008, 3584911, 3554257, 3540999, 3722787, 3426113, 4067068, 4220020, 4027151, 3873206, 3853617, 4078675, 4040552, 4267348, 4497757, 4116515, 4440826, 3960057, 4476987, 4581847, 4501014, 4479935, 4384966]
14461D384966L90410j2292M86863j47466k45152k8812P3385R3217K55017j96938
14451E053198L47340k9446K93104j69792J4703M29938j83991j12146K3884K02406
14441E869198m3943J8116J31418J82579j31280J33316j64883L03705J66699J93671
14431F658596J39757m51006M63025J80726K73536R5076j05190L08788j30765J05716
14421G538259j70134K84303J49053K1499l3764L87757j26244L43765R7925K26969
14411H719388j41052M00985K93145m5826K76442n017K00180P5737N19893j39024
14401A0154851K12226O0971L38093q0834N05010j58436L85427q6228K80215K51432
14391A1862727P8748M75073j73638P08724l44255K80681K42025M48438L66325
$$ y = [4384966, 4775376, 4763084, 5249947, 5102481, 4857329, 4828517, 4901902, 4995119, 5250136, 5053198, 5400538, 5371092, 5664196, 5494404, 5509107, 5939045, 5755054, 5642908, 5666792, 5869198, 5825255, 5843371, 5974789, 6157368, 6026088, 6159404, 5994521, 6298226, 6464925, 6658596, 6798353, 6347347, 6810372, 6991098, 7264634, 7359710, 7254520, 7563308, 7432543, 7538259, 7368125, 7652428, 7801481, 7822980, 7789216, 8176973, 8050729, 8394494, 8492419, 8719388, 8578336, 8979321, 9272466, 9226640, 9503082, 9498065, 9698245, 9773982, 10293875, 10154851, 10367077, 10428048, 10766141, 10685307, 11190317, 11031881, 11417308, 11331080, 11611295, 11862727, 11941475, 12416548, 12242910, 12951634, 12607379, 12888060, 13130085, 13578523, 13944848]
14382A3944848K00458R0071J87757L48217J51884L50839r9061R90684R0020M92594
14372A6748311J70288M24804K74069O50443R2587J47229J041958k83227N43724
14363A9810186P13533K11352O64580L78695N42487J13812R37380J46358J037313
14354B4555696M23382N82691L00587O50936P64465R55810K36636Q78303Q04749
14345C0153255N77721R78367O63479J059216M75000J145914J019599Q23156J376896
14336C8272603R41098J113284J147711J184234J471149J191434J275966J198989
14328D7796468J664421J592247J912851J601571J633585J646795K406708J794753
14320F2049399K402740J856411K615765K808761K495850K953842K818827L399477
$$ y = [13944848, 14145306, 14235377, 14423134, 14771351, 14923235, 15274074, 15175013, 16165697, 16255717, 16748311, 16918599, 17343403, 17617472, 18267915, 18360502, 18507731, 19549689, 19266462, 19810186, 20523719, 20735071, 21399651, 21778346, 22320833, 22434645, 23372025, 23518383, 24555696, 24979078, 25561769, 25862356, 26513292, 27277757, 28233567, 28470203, 29348506, 30153255, 30730976, 31709343, 32372822, 33432038, 33907038, 35052952, 36072551, 36895707, 38272603, 39213701, 40326985, 41474696, 42658930, 44130079, 45321513, 46597479, 47796468, 49460889, 51053136, 52965987, 54567558, 56201143, 57847938, 60254646, 62049399, 64452139, 66308550, 68924315, 71733076, 74228926, 77182768, 80001595, 83401072]
14312H3401072L351687K915531M000753L940470M011673M267029M517284M809681
14304A15215180N114585N594114O023174O109232O275564P125743P322777P997722
14296A66778091Q002672R152228R089522J0119498J0014657J1193847J1570078
14289B35920593J2520963J2800543J3706625J3595470J4384815J4906710J5320674
14282C33156393J5162128J5420965J5718416J5046304J4533534J3643977J3161690
14275D35843407J1273297R491604O288679K379964R3706Q41843M00626k226642
14267D64386484k043272n189111p524907r658845j1638625j3676411j4782511
14260C99872802j5309827j5926218j5840648j5914281j5758766j5493840j4502523
$$ y = [83401072, 86752759, 89668290, 93669043, 97609513, 101621186, 105888215, 110405499, 115215180, 120329765, 125923879, 131947053, 138056285, 144331849, 151457592, 158780369, 166778091, 174780763, 183932991, 193022513, 203142011, 213156668, 224350515, 235920593, 248441556, 261242099, 274948724, 288544194, 302929009, 317835719, 333156393, 348318521, 363739486, 379457902, 394504206, 409037740, 422681717, 435843407, 447116704, 456608308, 462896987, 465276951, 465370657, 466212500, 466613126, 464386484, 462343212, 457154101, 449629194, 439970349, 428331724, 414655313, 399872802, 384562975, 368636757, 352796109, 336881828, 321123062, 305629222, 291126699]
14253B91126699j3368623j3580586j3338773j2627500j1610344j1293266j0976150
14246B04331457r964759r564779q185545q459190q362099p333378p104515o640604
14238A38716588n879462n920861n551737n254413n363639m424268m198886l873070
14230I8250252m130155l853332l455670l554570l194315l067502k580599k683246
14222G1730863k797034k195489k260259j864844k451032k139480k147642j575942
14214E4299141j377242j509630j830342j533596j692022j096973j191359n62734
14206D3505243j674553j266730j515762j137649j099245n73997n20794j340778
14198C4375735j022355j012796q14040n36955j002355o27711r67025l99066o60565
$$ y = [291126699, 277758076, 264177490, 250838717, 238211217, 226600873, 215307607, 204331457, 194366698, 184801919, 176616374, 168157184, 159795085, 152461707, 145357192, 138716588, 132837126, 126916265, 121364528, 116110115, 110746476, 106322208, 102123322, 98250252, 94120097, 90266765, 86811095, 83256525, 80062210, 76994708, 74414109, 71730863, 68933829, 66738340, 64478081, 62613237, 60162205, 58022725, 55875083, 54299141, 52921899, 51412269, 49581927, 48048331, 46356309, 45259336, 44067977, 43505243, 41830690, 40563960, 39048198, 37910549, 36811304, 36237307, 35716513, 34375735, 33353380, 32340584, 31526544, 30989589, 29987234, 29359523, 28392498, 27993432, 27332867]
14189B7332867r33057m84706o96656m10183l77354p30918m32370r19958Q491m92260
14179B1863896p38387k16828l07821l35099o74422k78050l48693k54166n38334
14170A8172096j39813m54204m69267j04135k49545o49644j95248m90012L700n56282
14160A4867646n4505j84172m04114J66637l58868l27253r5297l30626p17272J41469
14150A2703645L6348o09077j74222p1493j75441o12708J60504o4526l24987l90783
14140A0477260O856K90823m31222k82790l7971k52287j64930J12901l77336j25502
14130I215802p1138j771o7081j99942j94498J726k89684K03111j88387m79746
14120G928392Q3978M6308l80903L18942K3158m58881p0932j21353N0547k49346
$$ y = [27332867, 26399810, 25915104, 25218448, 24808265, 24430911, 23699993, 23267623, 22347665, 22356156, 21863896, 21125509, 20908681, 20600860, 20265761, 19591339, 19313289, 18964596, 18710430, 18172096, 18032283, 17578079, 17108812, 17004677, 16755132, 16105488, 15910240, 15420228, 15423928, 14867646, 14813141, 14628969, 14224855, 14391492, 14032624, 13705371, 13610074, 13279448, 12562176, 12703645, 12739993, 12130916, 11956694, 11885201, 11709760, 11097052, 11257556, 11193030, 10868043, 10477260, 10484116, 10774939, 10343717, 10060927, 10022956, 9770669, 9605739, 9718640, 9341304, 9215802, 9144664, 9142893, 9075812, 8875870, 8681372, 8683098, 8393414, 8596525, 8408138, 7928392, 8012370, 8058678, 7677775, 7996717, 8019875, 7560994, 7490062, 7368709, 7419256, 7169910]
14110G169910K3086j98059J02275j44137J94975l56513j9040k36122j3669m50292
14100F072414K15014P0511j05889m73195J76689J44112o4555o897k75973r5882
14090E656349L74972l10527m71773j5395K38602Q3294k70518K06013K6817l51027
14080E166807l79665K54735k00528r8710m2366j65526J42982k68043K96227j83471
14070D522442J11145j46250l62872J72446N87018m45864K9362j9399k55553q593
14060D183882j18696N3400l2592M5719k01381M2891q5674o5105J15936P2466m51362
14049C559484N9992J10106k27294k23660P0746r1158J98444o3351j03217K42264
14039C532356o04240L52606k35207K35442j85756L3113M49795l52271L121l5383
$$ y = [7169910, 7192996, 6994937, 7097212, 6953075, 7148050, 6791537, 6772497, 6536375, 6522706, 6072414, 6287428, 6357939, 6252050, 5778855, 5955544, 6099656, 6035101, 6028204, 5752231, 5656349, 6031321, 5720794, 5249021, 5233626, 5472228, 5555522, 5285004, 5491017, 5517834, 5166807, 4787142, 5041877, 4841349, 4742639, 4700273, 4534747, 4677729, 4409686, 4705913, 4522442, 4633587, 4487337, 4124465, 4296911, 4883929, 4438065, 4467427, 4448028, 4192475, 4183882, 4065186, 4118586, 4085994, 4131713, 3930332, 3973223, 3887549, 3822444, 3938380, 4010846, 3559484, 3619476, 3729582, 3502288, 3278628, 3349374, 3258216, 3456660, 3393309, 3290092, 3532356, 2928116, 3280722, 3045515, 3280957, 3095201, 3128314, 3578109, 3225838, 3228959, 3193576]
14029C193576P0530r0010Q1109j44237n23211R1430j5759K25905j30335L75159
14019C134157m32314J04002l83647j95516L60197o9977J10727j49829k3347L6993
14009B491446R1828l98933L18513j3411j77134M2801J2807J20543j57667k77065
13999B053728J41190k66245K0814K50464k6277k98477K64288l76919M44451J07803
13989B314820J180112L220168P806508J9742841J5134129k2967937A3029762m787941
13981H241821k234103j297846m76064n24968L5460l38301M773n10161J6237k49152
13971B667696j1026k32066J30651j60259r9271K7851n3289j69863K67863m68381
13961A899906J30435o1269J65973K12799m53057p8219L82358k45710J01391J58948
$$ y = [3193576, 3264106, 3174096, 3255205, 3110968, 2587757, 2679187, 2663428, 2889333, 2758998, 3134157, 2701843, 2805845, 2422198, 2226682, 2586879, 2516902, 2627629, 2477800, 2454453, 2491446, 2583274, 2184341, 2502854, 2489443, 2312309, 2355110, 2367917, 2488460, 2330793, 2053728, 2194918, 1928673, 1949487, 2199951, 2173674, 1875197, 2139485, 1762566, 2207017, 2314820, 3494932, 6715100, 14521608, 34264449, 49398578, 26430641, 13029762, 8241821, 6007718, 4709872, 4233808, 3708840, 3744300, 3405999, 3410772, 2900611, 2916848, 2667696, 2656670, 2424604, 2555255, 2394996, 2295725, 2323576, 2270287, 2100424, 2368287, 1899906, 2030341, 1969072, 2135045, 2347844, 1894787, 1816568, 2198926, 1953216, 2054607, 2213555]
13951B213555n07269L32141l1277m8931l23035N82443j29199n46360M02754j81041
13941A763781J51675n1340o3832l68720L35901J62029j81856p9685R6783K7723
13931A792459L8324j68827J7561j87823J51887k24861j11926K07155J22378j04646
13921A531681l78231M86426M6644r7044k79097J29013K7436L4118L15332o42868
13911A173410N01537j72502P7993J7251K26775l17591J33464k71145j11445L31204
13901A588951Q2869k31688j39199o160J17066J07843j17194k7770K53866l88221
13891A240363j57910K39633k69117K20587p5796j17146J18870k71332J79017K07909
13881A315078k3897o5715J40152L3514l04153L05091l19246L54543j23067J81368
$$ y = [2213555, 1706286, 2038427, 2007150, 1958219, 1635184, 2217627, 2088428, 1542068, 1944822, 1763781, 1915456, 1864116, 1800284, 1431564, 1767465, 1929494, 1747638, 1667953, 1764736, 1792459, 1830783, 1661956, 1679517, 1491694, 1643581, 1418720, 1306794, 1513949, 1636327, 1531681, 1153450, 1639876, 1686520, 1589476, 1310379, 1439392, 1466828, 1500946, 1816278, 1173410, 1674947, 1502445, 1580438, 1597689, 1824464, 1506873, 1640337, 1369192, 1257747, 1588951, 1671820, 1440132, 1300933, 1294773, 1411839, 1519682, 1402488, 1374718, 1628584, 1240363, 1082453, 1322086, 1052969, 1273556, 1197760, 1080614, 1199484, 928152, 1107169, 1315078, 1291181, 1225466, 1365618, 1399132, 1094979, 1400070, 1080824, 1435367, 1312300, 1493668]
13871A493668m29957J55934O1014k80188J70556L1030l6401n7371j09560J77152
13861A175877K85423l39072K89785j05969k92231l60607J52646K23298M7496j12820
13851I63826J97309p9923J01279q4418r5986l70581O21397k89496l1545j09233
13841H22629P9480J54525k88446J22885P5857o721j05993J37570P4713r7984J76175
13830A144690k52885J56290j60727q7851N3876o1457K76871j60877J25843k2627
13820A011146J29769k04961l54959M28446o4335J2854j75387N40725l25919j49697
13810H47682p2866K05651j80272J8929j6135Q3521l27733Q7329K33861k37281
13800F42686J08722q4966P7223K51113q0861M4172M4477J29442j36973l52908
$$ y = [1493668, 1063711, 1219645, 1280659, 1000471, 1171027, 1202057, 1165656, 1108285, 998725, 1175877, 1461300, 1122228, 1412013, 1306044, 1013813, 653206, 805852, 1029150, 1076646, 963826, 1161135, 1081212, 1182491, 1098073, 1002087, 631506, 1252903, 963407, 931862, 822629, 902109, 1056634, 768188, 891073, 966930, 960209, 854216, 991786, 1066499, 968515, 1144690, 891805, 1048095, 887368, 799517, 853393, 791936, 1068807, 907930, 1033773, 1011146, 1140915, 935954, 580995, 1009441, 945106, 957960, 782573, 1323298, 997379, 847682, 774816, 980467, 800195, 819124, 802989, 886510, 558777, 646106, 879967, 642686, 751408, 666442, 743665, 994778, 913917, 958089, 1002566, 1132008, 995035, 642127]
13790F42127M5580R9058r5144j8260K05372k09497j11737L21498j1558j90417
13780F77022j67726M27558k62804L20848C48512P32604k63655J60999m5243C63743
13769F55149N6474j62552l556K49613J05608m2171j25049j64262k3601L95227
13759I40880l51158J33357k67450J96945M18095j82367M5629l7909l49216k7154
13749E19652L13148M4475p6323R8990k77050k92044L68158j13155M2986K10033
13739H38870k18528M4675j28230j16663M38142l20670O7621K51437k70390k39089
13729C47175K65274p5646O5860k50927P0489J00669A57771Q94731D64875K40442
13719G05317B20027M98872k78950K85234j34323l9950O7792j70371L10574l09709
$$ y = [642127, 687707, 786765, 691621, 673361, 878733, 669236, 557499, 878997, 867439, 677022, 509296, 936854, 674050, 994898, 348512, 1081116, 817461, 978460, 933217, 363743, 655149, 711623, 549071, 545515, 795128, 900736, 858565, 733516, 569254, 545653, 940880, 589722, 723079, 455629, 652574, 1070669, 888302, 933931, 896022, 546806, 519652, 832800, 877275, 800952, 899942, 622892, 330848, 699006, 585851, 628837, 838870, 620342, 665017, 536787, 420124, 858266, 537596, 605217, 856654, 586264, 347175, 612449, 536803, 602663, 351736, 422225, 522894, 157771, 1052502, 464875, 705317, 220027, 718899, 439949, 725183, 590860, 550910, 618702, 448331, 758905, 449196]
13709D49196K54198o4493O8000j05301K24686k96066q0673K4280r8452K07777
13699E83152J38052k55179J70855M2108j87289o0929K67936B68303N94432C94093
13688D88619N4052J96871j53257k0850j39356L08914o2076k76762L55544B72449
13677F58659k56911N99482m76705k29866G0696J59993N61337C57971J69670r1342
13667D36299j02341j1494n037N1174P4479L0118j1555L4904B05549L53966j54637
13656D04878A74846O22436l08069J32270j31408k02000L84631B21165J33346J21404
13646D75915H9291L56831k2151p6150M97030A85407M04870n0055n7674O6716j60522
13635C88742K23043l05421j26136K26552N6163J06050j18987j98515o1677L3002
$$ y = [449196, 703394, 638901, 706901, 601600, 826286, 530220, 449547, 473827, 375375, 583152, 721204, 466025, 636880, 678988, 491699, 430770, 698706, 268303, 862735, 394093, 488619, 542671, 739542, 586285, 565435, 426079, 734993, 672917, 396155, 751699, 272449, 658659, 401748, 1001230, 524525, 294659, 70696, 230689, 792026, 357971, 527641, 436299, 333958, 322464, 317427, 368601, 443080, 473198, 461643, 496547, 205549, 559515, 404878, 174846, 797282, 489213, 621483, 490075, 288075, 672706, 221165, 354511, 475915, 89291, 446122, 423971, 347821, 844851, 185407, 590277, 540222, 482548, 549264, 388742, 611785, 306364, 180228, 406780, 462943, 568993, 450006, 251491, 189814, 222816]
13625B22816L8020K97814k41654N8621J9158j48537N978k5107Q0179J98265q1618
13614D23935A99675N96182j98179k69484J61591P4958j65532L15770A79673J45442
13604C25115J79809A81346J73471A13143J67965K63495N4606B89714Q4584I3483
13593B84962J65640k3607j11817L9075O9760q5171A52757L54464H0848J70013
13583B50861R1868K45853k03649P0909n768q6880J1543K93286A47898J94804q4993
13572B57709K66717a52049j8108C11624H2519L88470j28942P4880A52501d2731
13561D49753b1058A76096J74167n5400P5805I1117L59760N4432B44953k2436n4743
13550A67774e092D44945j757Q0500a1547B07132I0759K31769K2812n7075n7290
$$ y = [222816, 260836, 558650, 316996, 375617, 394775, 246238, 252216, 227109, 307288, 505553, 423935, 199675, 795857, 597678, 328194, 489785, 564743, 399211, 714981, 179673, 325115, 504924, 181346, 354817, 113143, 281108, 544603, 599209, 289714, 374298, 93483, 284962, 450602, 426995, 315178, 354253, 424013, 338842, 152757, 507221, 80848, 250861, 342729, 588582, 384933, 455842, 450074, 363194, 374737, 668023, 147898, 342702, 257709, 524426, -152049, -170157, 311624, 82519, 470989, 342047, 416927, 152501, -42731, 449753, -21058, 176096, 350263, 294863, 370668, 91117, 450877, 505309, 244953, 222517, 167774, -5092, 444945, 443188, 523688, -11547, 207132, 90759, 322528, 345340, 288265, 230975]
13539B30975K54204D6478K80340N38806l46791C9944L95359F4574L98572J17017
13529E80163k07356A24742N6552l4248a6335A87149p2177J62713o8564N3944Q3987
13518C47052q4962J46622l0559I9008Q8069J23910j10237R1013n7646E3808K09845
13507B63653R4477E7787J44030p8285N8408L13798B19081P5596j14668b5279A74286
13495A62595L01856A66797J07917G7545L01506j310Q2068L69722m09767P0039
13485D89803Q3006B67124J0193K50195k02516r5745L06449k46242M7040O0280
13475C96778R5497j37981K13720j17825j86179J42892j46341q8522l6268K58362
13465C94133j54282n82O9385Q475J36097l6667K0113a24332B04582F6748O4238
$$ y = [230975, 485179, 46478, 326818, 865624, 518833, 39944, 435303, 64574, 463146, 580163, 372807, 124742, 181294, 147046, -16335, 187149, 114972, 277685, 209121, 263065, 347052, 262090, 408712, 378153, 99008, 187077, 310987, 200750, 291763, 234117, 53808, 263653, 358130, 57787, 201817, 123532, 181940, 495738, 219081, 294677, 180009, -25279, 174286, 162595, 464451, 166797, 274714, 77545, 379051, 377741, 459809, 829531, 419764, 489803, 572809, 267124, 277317, 527512, 324996, 229251, 535700, 289458, 336498, 396778, 492275, 354294, 568014, 450189, 264010, 406902, 260561, 172039, 135771, 394133, 239851, 239269, 308654, 317129, 453226, 416559, 436672, -124332, 204582, 66748, 130986]
13454A30986J94224r0010k4823R173m2656K68043F1151M29753B36821J30765D5587
13442g2458D04994J6718A24287E7192Q9248B2876d6414D75009n5780A41478M30546
13431E72024j93605j88613P8516j00684J10784p651g4919C85743B9144i5432C09914
13419C66122g49G4371C5874J63581q0204R4188M2624c4152C61245d0141B22952
13407H2442L10044H4711m443L50899j02722l3723J86597B7399O4028J16417r7827
13396A10017J3226L12050j74750D1386J00454Q4966E0412K31073K06190A47920
13385B06939L87100o4971a106G8464c04635D17341D0814P529b06393j3890B64712
13373C6247c1885A96334J39824I6893P3242J63662A62270R8343R4347N7879J38989
$$ y = [130986, 325210, 235200, 210377, 219550, 176894, 444937, 61151, 490904, 236821, 367586, 45587, -72458, 404994, 421712, 124287, 57192, 146440, 22876, -46414, 475009, 419229, 141478, 572024, 378419, 189806, 268322, 167638, 278422, 270771, -74919, 385743, 29144, -95432, 309914, 366122, -749, 74371, 35874, 199455, 119251, 213439, 256063, -34152, 361245, -40141, 222952, 82442, 392486, 84711, 80268, 431167, 328445, 294722, 481319, 27399, 91427, 207844, 110017, 123243, 435293, 260543, 41386, 141840, 226806, 50412, 281485, 487675, 147920, 206939, 594039, 529068, -1106, 78464, -304635, 417341, 40814, 48343, -206393, -220283, 264712, 36247, -31885, 196334, 336158, 96893, 170135, 333797, 162270, 260613, 354960, 412839, 551828]
13362E51828C0084Q1185J53240j27964J20234H0958J60941K8783F3330K13988
13352B77318c60382B99965A22775K75337j39415K17321j90436J18596j68373K73095
13342E08900K6870B40383k8773K1021k9375K4252E5534L90628A49938M5611P9706
13331B75255F5965J04372O5695J86441A22444K96730j30719p2452D2017b26492
13320A73356l9458J1970R4953J91368l7235K0233j33628P8324d4254p6255A86160
13308B59352c0300A65245j3597A1328K89939r0722A378K67562D7465g4020I8640
13296A22359E1001L4069f7206B00704K90151k43832J67799M6686e0196j789j7183
13285f9168E036M35892j41780j14816f8661a450j02863A98073F0429b8749A62451
$$ y = [551828, 30084, 111269, 264509, 136545, 256779, 80958, 241899, 270682, 63330, 277318, -360382, 299965, 122775, 398112, 258697, 476018, 285582, 404178, 235805, 508900, 535770, 240383, 211610, 232631, 203256, 227508, 55534, 446162, 149938, 195549, 275255, 65965, 170337, 236032, 422473, 122444, 419174, 288455, 216003, 42017, -226492, 173356, 133898, 145868, 240821, 432189, 394954, 415187, 281559, 359883, -44254, -120509, 186160, 259352, -30300, 165245, 151648, 11328, 301267, 210545, 1378, 268940, 47465, -74020, 98640, 122359, 51001, 85070, -67206, 200704, 490855, 247023, 414822, 461508, -50196, -51985, -69168, 5036, 440928, 299148, 184332, -68661, -1450, -104313, 198073, 60429, -28749, 162451]
13273F47b19949D09991a07591C90461D7839a2331B22283h9711B72962c6637C0689
13261D93819j20898j19120J18621d8119D2275K73271j554G5491a63177A14369
13250C50841j52770J26954j06608q0101D36J63313J13405j34298b28067A31586
13239C01116B5326J22320J29375h6175B48081q848H3925J90549J1938o5067a4006
13227i659j53517C84835a63942B43209R1106A29439E1800a62920B65470F8576
13216f7782A02955l2707J89184A3832J62614l5140a63970a7476j63219N8519B53560
13204G038b328q6616A16835E2138J90999a19847c0817m3340l6398C4179f1962
13192D0040a36291k1516H188R5498L3233J67608A8548b0957A80008K27065g1214
$$ y = [647, -219949, 409991, -107591, 390461, 47839, -12331, 222283, -89711, 272962, -36637, 30689, 493819, 372921, 253801, 372422, -48119, 42275, 315546, 313992, 75491, -163177, 114369, 350841, 198071, 325025, 218417, 138316, 436, 163749, 277154, 142856, -228067, 131586, 301116, 25326, 147646, 277021, -86175, 248081, 239233, 83925, 274474, 286412, 221345, -14006, -9659, -163176, 384835, -163942, 243209, 334315, 129439, 51800, -162920, 265470, 68576, -67782, 102955, 70248, 259432, 13832, 176446, 141306, -163970, -17476, -180695, -122176, 253560, 7038, -2328, -88944, 116835, 52138, 243137, -119847, -30817, -74157, -110555, 34179, -61962, 40040, -136291, -157807, 8188, 103686, 136919, 304527, 18548, -20957, 180008, 407073, -71214]
13180F7631J10738N7445b0821A61294a19561B7850K23251j17692a16904F9922
13169G6410L3137M3953a1117H5473a75274C06074A21000e9132m6813C56150j23499
13158B32651n4793a36925a4914C1436J03939k6684K73481I8607a48204C21650
13147a78670D9429m177p246h9637B04662p1704l5725a41083G2512K83051L540
13136C59103j05803R020e1614C581J70956J80195G956J2312R6036K12338a56298
13124b2330d267A84679J22038b01916A47672d6059B74684O9787B8013J482b33033
13112I3215b00881p0695D9189K54983j02567c42656B76098b5495B8337K34665
13102B63002j19734A7957h9997d3217B32018b9539B68946M6233O0083j80778R771
$$ y = [67631, 178369, 235814, -20821, 161294, -119561, 27850, 251101, 133409, -116904, 69922, 76410, 109547, 153500, -11117, 85473, -175274, 306074, 121000, -59132, -105945, 356150, 232651, 177858, -136925, -14914, 31436, 135375, 108691, 382172, 98607, -148204, 321650, -178670, 49429, 45252, 38006, -89637, 204662, 132958, 97233, -141083, 72512, 355563, 359103, 253300, 262320, -51614, 3581, 174537, 354732, 7956, 20268, 116304, 328642, -156298, -22330, -4267, 184679, 306717, -201916, 147672, -46059, 274684, 344471, 28013, 29495, -233033, 93215, -200881, -271576, 49189, 304172, 201605, -342656, 276098, -25495, 28337, 263002, 143268, 17957, -89997, -43217, 232018, -29539, 268946, 315179, 375262, 194484, 204255]
13091B04255l7539P3392m3932E9458K0418a48445C74378D084J29990b25289C2422
13079A94405D9282i5349C15894J39850A65600a89413H7491C4213b70403a3008
13068b13604a5098A22774k4421J33358j06013a5006A47104J0783a8641A21722
13057B25989k8164g781G8992K49120B8608J92239B9424b31419C72848K4471J9998
13046D17317A92426J22843A54025b45782E9340J77032E3081R8007J0719B7453
13035b98149J47887f449B07881F3107a06843j7709a7993A9126c37119B50118B8750
13023A80005F2337B0203c3258A07553l1446d5882Q939B14789p253b31674B13236
13011A17636J7738a19986C401L03664a3978l927A56205L45644a29626A74261K36155
$$ y = [204255, 166716, 240108, 196176, 59458, 79876, -148445, 374378, 4084, 134074, -225289, 32422, 194405, 49282, -95349, 315894, 455744, 165600, -189413, 87491, 34213, -270403, -13008, -213604, -15098, 122774, 98353, 231711, 125698, -15006, 147104, 157887, -18641, 121722, 225989, 197825, -7781, 78992, 328112, 28608, 220847, 29424, -231419, 372848, 397319, 417317, 192426, 315269, 154025, -245782, 59340, 236372, 53081, 151088, 161807, 27453, -298149, -150262, -6449, 207881, 63107, -106843, -124552, -17993, 19126, -337119, 250118, 28750, 180005, 62337, 20203, -33258, 107553, 76107, -45882, -36943, 214789, 207536, -231674, 213236, 117636, 135374, -119986, 3401, 307065, -13978, -17905, 156205, 501849, -129626, 174261, 410416]
13000D10416j40994c13872A80015c7781j93755B17010A9979L45977f1057A61803
12989F27606B92438E012N5334Q2543B9783J8320N2657h1708B12720n653A5202
12977A51180e0898q210H2260L3786A023i5227D5083J81892A1572a31429d9656
12965I7040J6232m9164J18346D4742a06363C8763c7663A0662c26624D9812B0265
12953a92282M0973D0485i3341c1837B53740A11446K06i2218L6892P224A14896
12941a91442B23976a60052C17921F3667J45726h6543a1702A22595c49163A48362
12930a00047C3446L57618a36591k48274A90847l6558M1515h4246H9549a17070
12919A50719R3906p8890E912M7618e8575A33788f5895b0100A88759b13048e7636
$$ y = [410416, 269422, -313872, 180015, -37781, -231536, 217010, 19979, 365956, -61057, 161803, 627606, 292438, 5012, 60346, 142889, 29783, 48103, 100760, -81708, 212720, 207067, 15202, 151180, -50898, -59108, 82260, 116046, 1023, -95227, 45083, 226975, 11572, -131429, -49656, 97040, 113272, 64108, 182454, 44742, -106363, 38763, -37663, 10662, -326624, 49812, 20265, -192282, -151309, 40485, -93341, -31837, 253740, 111446, 111652, -92218, -55326, -48102, 114896, -191442, 223976, -160052, 317921, 63667, 209393, -86543, -11702, 122595, -349163, 148362, -100047, 33446, 391064, -136591, -384865, 190847, 154289, 195804, -84246, 89549, -117070, 150719, 244625, 165735, 5912, 53530, -58575, 133788, -65895, -20100, 188759, -213048, -57636]
12907A06768a46128A52811K71964b6228q2733B09711D1766J63389J90736G4344
12896A75062G1065L88351A37539b32358e3309A51690J79021Q7793A85574f230
12885B3440J2511b24803g0014L4247C21901e0107l0386B78064E1118c0230B55291
12873A9740J17595i7552K8603c3528A5982L35868a7889r5085C9809g8066k17078
12862b95144A66529L069a27669A19233O7860a10252H1246L33431b53635a19239
12851e3245F2986a87485Q0917I0100J01993J11481E4927L02408A45834n7151R5196
12840A83879A7J78842L495A8709J8811L71914j33871A6423b36907A43004C4138
12828F7788Q8333D3930c88194A86795h8123D4664d013A11224K11631b19025I3992
$$ y = [106768, -146128, 152811, 424775, -26228, -108961, 209711, 41766, 205155, 395891, 74344, 175062, 71065, 459416, 137539, -232358, -53309, 151690, 330711, 418504, 185574, -6230, 23440, 35951, -224803, -70014, -35767, 321901, -50107, -80493, 278064, 51118, -30230, 255291, 19740, 137335, -97552, -68949, -33528, 15982, 351850, -17889, -112974, 39809, -78066, -295144, 166529, 169598, -127669, 119233, 187093, -110252, 81246, 414677, -253635, -119239, -53245, 62986, -187485, -106568, 90100, 192093, 303574, 54927, 357335, 145834, 88683, 183879, 17, 178859, 182354, 18709, 37520, 409434, 275563, 16423, -236907, 143004, 34138, 67788, 156121, 43930, -388194, 186795, -88123, 44664, -4013, 111224, 322855, -219025, 93992]
12816h2202c3809r284A81247D0133K26809b77B45435q1029a27926C276P1261C2937
12803i8309L7602a9346n707B08580A01397d7919A623d0339I497a21190D3148K9292
12791G2440K13910b78020N2279A55081a18411e5827r3944C98145A47341a87633
12780f112D4141J94254a9887A68195b87483e2332j59246A64731a91899C2444b27852
12768a59440I3778a17667B1301J9180B0046a03617f240B37663O7301q2837A1829
12756A32766J28681I8145a23303B36286a40381F5717C0102L24578F9622M2806
12746A12428l883J16642f1777B98160i5190A26233R0987l968l9523A7403h227
12734A84281a27575E5650M2353b74319Q2529Q4984l9139m5247O9885L5232K1805
$$ y = [-82202, -33809, -43093, 181247, 40133, 266942, -277, 245435, 164406, -127926, 3276, 74537, 32937, -98309, -60707, -19346, -25053, 208580, 101397, -47919, 1623, -40339, 9497, -121190, 43148, 72440, 286350, -278020, -225741, 155081, -118411, -55827, -149771, 398145, 147341, -187633, -6112, 44141, 238395, -19887, 168195, -287483, -52332, -211578, 164731, -191899, 32444, -227852, -159440, 93778, -117667, 21301, 40481, 20046, -103617, -6240, 237663, 304964, 222127, 11829, 132766, 261447, 98145, -123303, 236286, -140381, 65717, 30102, 354680, 69622, 112428, 108545, 225187, -61777, 298160, -95190, 126233, 217220, 213252, 173729, 17403, -8227, 184281, -127575, 55650, 98003, -274319, -191790, -106806, -145945, -191192, -121307, -86075, -64270]
12723f4270R409a6836l65299A49153G107R7355h0756A45595a22610C25256a14241
12711b31898P1701A78391F7821k4333L83417j57792A01350K2279n9108K2136J64231
12700B50888K42922A77821H7183K40797a61466p9425A7360J9175M10835I4050
12689B49754b46628G1245Q5145B5047a3759l3158K2286E05016H7428N1943a8797
12677E1148K76746P7514j99308g3203A94015j7691l1057J31345P2164c80312G3112
12665a06114d5104B79998D1979h3584E5538K31038b5132l9420A18691J05157j11831
12654A12017b3346b481A35797J3353E1383J06255D0197J43559g3886A83976a80927
12642B53254b44081L4829P6317e3916B73745a40555d6303F0099O1264B5635J09083
$$ y = [-64270, -54861, -16836, -382135, 149153, 7107, 104462, -80756, 145595, -122610, 325256, -114241, -231898, -160197, 178391, 67821, 43488, 426905, 269113, 101350, 123629, 64521, 86657, 250888, 493810, 177821, 87183, 327980, -161466, -240891, 17360, 36535, 447370, 94050, 249754, -246628, 71245, 156390, 25047, -13759, -46917, -24631, 505016, 87428, 139371, -18797, 51148, 327894, 405408, 206100, -73203, 194015, 176324, 145267, 276612, 348776, -380312, 73112, -106114, -45104, 279998, 41979, -83584, 55538, 286576, -25132, -64552, 118691, 223848, 112017, -23346, -2481, 135797, 149150, 51383, 157638, 40197, 183756, -73886, 183976, -180927, 253254, -244081, -209252, -132935, -53916, 273745, -140555, -46303, 60099, 121363, 25635, 134718]
12631A34718A3264k667K66684c73771F86976B71113A6810e9881B70743L7799g0768
12619C0147M7798f8484o4001j50347d5831G4891h6759a0025B60634b41348a08636
12607H6408O0725B778K02222b58651F5198J41231C0084b57278E60922A80160J19711
12596B99871B2593n596Q2343c33487B22633a90725B71469g8602E4577b0781H4319
12584A30894j227B8087K15709j21452d9592I80c1900j79907H1728e347A20073
12572a48651G8063l0884L441b74718G8674n680d8661e200k89796H6762Q01Q5563
12560A73126H2461K59803A9172p333N1436J72400J08412A47645a9345n0197A99653
12548a20305A8288J85652a16461C8288b54153R6488H0600Q1580d2191C6845a16329
$$ y = [134718, 13264, 10597, 277281, -373771, 686976, 271113, 16810, -59881, 270743, 308542, -70768, 30147, 77945, -68484, -132485, -282832, -45831, 74891, -86759, -10025, 260634, -241348, -108636, 86408, 147133, 2778, 205000, -258651, 65198, 206429, 30084, -257278, 560922, 180160, 299871, 22593, 16997, 99340, -333487, 222633, -190725, 271469, -78602, 54577, -20781, 84319, 130894, 129667, 28087, 243796, 122344, -49592, 980, -31900, -211807, 81728, -5347, 120073, -148651, 78063, 47179, 50620, -274718, 78674, 72994, -48661, -5200, -294996, 86762, 87563, 173126, 82461, 342264, 19172, 11839, 63275, 235675, 344087, 147645, -19345, -69542, 199653, -120305, 18288, 203940, -116461, 38288, -254153, -157665, 80600, 162180, -42191, 36845, -116329]
12536H461J32835a5469j54372M7563A92101M294B6361i9707M9539A87948r146
12525A78802o9644J99469q0248b9725B91080j36899E5207k5690b94758A39603
12514e9138B42232D426N3640B6259H218Q4469b25823C26541f7349A49523A7889
12502B56670p0531b1298A59626E7719J20182n8289d5578l69168G8574c2606j17599
12491a50205F4680f519E0208g541B291R2646O3215b18583p5971r7368a19157A33538
12478B83461j33251g7307H7896b36394r8999b8590j80507I9880j1427J23113a52715
12466G4503K98599j42196D5425d7629p1871c455l0066m36457J52452d3407r2933
12455a36340B51961l236i8988H9530C5316b13348a05260j32007B15226q0422a88685
$$ y = [8461, 141296, -15469, -169841, -122278, 192101, 196395, 26361, -99707, -50168, 187948, 178802, 109158, 308627, 228379, -29725, 291080, 154181, 55207, 29517, -294758, 139603, -59138, 242232, 4426, 58066, 26259, 8218, 92687, -225823, 326541, -67349, 149523, 17889, 256670, 186139, -21298, 159626, 57719, 177901, 119612, -45578, -414746, 78574, -32606, -150205, 64680, -6519, 50208, -7541, 2291, 94937, 158152, -218583, -294554, -391922, -119157, 133538, 283461, 150210, -77307, 87896, -236394, -335393, -28590, -209097, 99880, 88453, 211566, -152715, 74503, 373102, 230906, 45425, -47629, -119500, -3455, -33521, -469978, -317526, -43407, -136340, 251961, 248725, -98988, 89530, 35316, -213348, -105260, -237267, 215226, 134804, -188685]
12443D3371J98024g63C05499H9997B1970P7598b77670h8450A96256r7890J55612
12432B53978a37778B43300F3589k8757b3306p3573B27727c0603B67573C6703a20463
12420b8191A89321d8730G8111j6416a1977C9027K86051c05198C81277H1416b19037
12408h8205D3818J39504g3053o8459E7470a68580I9023m7890h6989r0033B4234
12396a647A0620c11302a22825p5667a3326A49963J96455G8065a0254j00128o3350
12385a73732g5107C7246b40522B64363j02628a96967g5129J0845E2278M8493K03471
12374C04242l2005A00635J11229a20040A72537C1876p527J25799B0402a61097
12363c17624G8010l7536M1490L71273E9655c49231g4202A29120c300k5294B66874
$$ y = [43371, 241395, -763, 305499, 89997, 21970, 99568, -277670, -88450, 196256, 98366, 253978, -137778, 243300, 63589, 34832, -23306, -96879, 227727, -30603, 267573, 36703, -120463, -28191, 189321, -48730, 78111, 61695, -11977, 39027, 325078, -305198, 381277, 81416, -219037, -88205, 43818, 183322, -73053, -141512, 57470, -168580, 99023, 51133, -86989, -177022, 24234, -1647, 10620, -311302, -122825, -198492, -13326, 149963, 346418, 78065, -10254, -110382, -173732, -75107, 37246, -240522, 264363, 161735, -196967, -75129, -64284, 52278, 100771, 304242, 272237, 100635, 211864, -120040, 172537, 31876, 24349, 150148, 20402, -161097, -317624, 78010, 40474, 81964, 453237, 59655, -349231, -74202, 129120, -3300, -28594, 266874]
12351A37547k3711a37082j3399A11191b62570B5606J66954h4395A76891a72110
12340e2963G8497B9281M5706g1250K6194F4825a87158d8984j38090i304A43121
12328a513k25953L3080A80983J19414E4953b45628c7910B77785a48574B14528
12317a08175n1887B36353E3137n039J73871C9084K03369k8158e0324C2920J57173
12306A90093a86486A90518A7427L2585J5679l0401K84058A58643l9042a13174
12295e3266H6425K13979b55623J14493n1723g780A93421a5734q5053G2278M30614
12284E02892a00998A38064a52291D41622b21576D79335a35952C00852J89209B34458
12273B06494P9568J67255c8923D19471a41122D9460b42971l2128g6183B38350
$$ y = [137547, 113836, -137082, -150481, 111191, -262570, 25606, 192560, -84395, 176891, -172110, -52963, 78497, 29281, 74987, -71250, -45056, 64825, -187158, -48984, -187074, -9304, 143121, -1513, -227466, -194386, 180983, 300397, 54953, -245628, -37910, 277785, -148574, 214528, -108175, -160062, 236353, 53137, 48098, 221969, 39084, 242453, 214295, -50324, 32920, 190093, -186486, 190518, 17427, 50012, 65691, 35290, 319348, 158643, 119601, -113174, -53266, 86425, 300404, -255623, -141130, -192853, -7780, 193421, -15734, -100787, 72278, 502892, -100998, 138064, -152291, 441622, -221576, 479335, -135952, 300852, 490061, 234458, 206494, 286062, 453317, -38923, 419471, -141122, 49460, -242971, -275099, -76183, 238350]
12262B67343c4108C18248j01781F4327l0871J79574H6895O0619a04333B81199
12251B41304a03671k1735b494j04800l49128a95948B17795b07604B38591L1481
12241B70072a72860E447b5372j28083r191O9418A8463L04465A20813K99637C1689
12229B66094p6873l9571O832J69243r4063J37977m4462j34361G2735a3306B45061
12217C83470A61660C1253M2278N1216K7694R874n1781l4431l1875J30738J19976
12206B94942H390a07591B26597b30612B87704J49815l8281A66495a27009B76369
12195A99545J7354n8811o550O4220r4348R5964J80046A09139N3302P5834a00886
12183c78042B51180l8278H5080N6949c18297B41692A14508a07874m5726c9392
$$ y = [267343, -34108, 318248, 216467, 64327, 33456, 213030, 86895, 147514, -104333, 281199, 241304, -103671, -125406, -2494, -107294, -456422, -195948, 217795, -207604, 238591, 270072, -172860, 5447, -25372, -153455, -162646, -93228, 18463, 322928, 120813, 420450, 31689, 266094, 189221, 149650, 156482, 325725, 231662, 369639, 325177, 190816, 72735, -13306, 245061, 383470, 161660, 31253, 73531, 124747, 152441, 162315, 110534, 76103, 44228, 174966, 294942, 8390, -107591, 226597, -230612, 287704, 437519, 399238, 166495, -127009, 276369, 199545, 216899, 158088, 151538, 215758, 121410, 217374, 397420, 109139, 162441, 238275, -100886, -378042, 251180, 212902, 85080, 142029, -318297, 241692, 114508, -107874, -153600, -39392]
12172A63503i90A51934P5729E7929R6714a49949A30309a65334B52484A23681L35207
12161D58888A53594g9733q9755B05116k0984E977K51138A3227M08268B9208L8080
12150F7288f9711A47066h4629a0829A71579E8019b84663D1235P0158c21972B02590
12138f6808K0136n0777k16043G348h932A20581Q8083j8386l707b68694e3759F7049
12125A29731a36814H0749J4944a80840A29754a62216K8640p0744Q8226p3986A48322
12113b4841B78678f2038j79720A35299b62922a26759B20546a77318M1356e3514
12102d33314E8139O6242l0064f1212l8971A24152b6789B75686e3346j70471J6686
12091b07131d8966q0427j26363a12048B37705o2102c7383A56503f5749k38183
$$ y = [163503, -990, 151934, 227663, 57929, 154643, -149949, 130309, -165334, 252484, 123681, 458888, 153594, -79733, -169488, 205116, 184132, 5977, 257115, 13227, 421495, 29208, 67288, -69711, 147066, -84629, -10829, 171579, 58019, -284663, 41235, 111393, -321972, 202590, -66808, -46672, -97449, -313492, 7348, -8932, 120581, 208664, 190278, 186571, -268694, -53759, 67049, 129731, -136814, 80749, 95693, -180840, 129754, -162216, -133576, -204320, -116094, -190080, 148322, -24841, 278678, -62038, -241758, 135299, -262922, -126759, 220546, -177318, -135962, -53514, -433314, 58139, 124381, 94317, -61212, -100183, 124152, -26789, 275686, -53346, -223817, -207131, -48966, -129393, -255756, -112048, 237705, 175603, -37383, 156503, -65749, -303932]
12081c03932D3047a17798H0514J22092J21186L77718J186308K93316E44831B35351
12070A51855C3804a72679A22053M2098a48775k0337a8095F4360k7256J92914a52708
12058a85114D5768g4686B62334C6199J958a64885C26285B3961a05578A75696a03835
12046A28955P5830d20756I8712f662p0991j30218a01752A68028i3903o0651A07581
12034a80838c7169H3808N5797K7237l0959c14927A03758m5307A6161L66876c1135
12022B04275E6155c07109B7448a66759A59963F8958A3413J73993a63045C76302
12011B27430a58961K9210A39053l2024A5849P5426k8270a47615B2281b81880A51050
11999B4744N4482J09777J13117E8474B2707K93265j39241b29443O6670D89266
$$ y = [-303932, 43047, -117798, 80514, 202606, 323792, 701510, 1887818, 2181134, 544831, 235351, 151855, 33804, -172679, 122053, 164151, -148775, -169112, -18095, 64360, 37104, 230018, -152708, -185114, 45768, -74686, 262334, 36199, 38157, -164885, 326285, 23961, -105578, 175696, -103835, 128955, 204785, -420756, 98712, -6662, -77653, -207871, -101752, 168028, -93903, -154554, 107581, -180838, -37169, 83808, 139605, 166842, 135883, -314927, 103758, 58451, 16161, 383037, -31135, 204275, 56155, -307109, 27448, -166759, 159963, 68958, 13413, 187406, -163045, 376302, 227430, -158961, -129751, 139053, 107029, 15849, 91275, 63005, -147615, 22281, -281880, 151050, 24744, 79226, 189003, 302120, 58474, 22707, 315972, 176731, -229443, -162773, 489266]
11988a99623M7381B37964a74048j08135M6202c8836a5723k68295A69088a01184
11977a42846a4832B27327o3524g7939n7225k2235A75880b61815B81653c01385
11966f9830A26272g0578C7723a16956q8505R8345E04470a07330j29167c1442q3951
11955a15393H8084d23860A98548d9478d030k16642C25641A02903h7278j69936
11945b57214A46426a60910m0235b4864j71965j39369D69687a97273d2694F0728
11934b5329j99227F7157K15789b28356n1780g6538O640l21995C0446a19438I1480
11922c1537C4755J94672F7246Q7947a00384a2582D3245A4690a72319g7330A0880
11910A17198b16669c6191I6145a08944J2285F6395K53378d7466A62371h0866r8642
$$ y = [-199623, -152242, 237964, -174048, -282183, -235981, -38836, -15723, -284018, 169088, -101184, -142846, -14832, 227327, 163803, -77939, -135164, -157399, 175880, -261815, 281653, -301385, -69830, 126272, -70578, 37723, -116956, -205461, -107116, 504470, -107330, -236497, -31442, -115393, 88084, -423860, 198548, -49478, -4030, -220672, 325641, 102903, -87278, -257214, 146426, -160910, -201145, -24864, -196829, -336198, 469687, -197273, -42694, 60728, -25329, -224556, 67157, 282946, -228356, -280136, -76538, -69898, -391893, 30446, -119438, 91480, -31537, 34755, 229427, 67246, 155193, -100384, -12582, 43245, 14690, -172319, -77330, 10880, 117198, -216669, -36191, 96145, -108944, -96659, 66395, 319773, -47466, 162371, -80866, -179508]
11899a79508f5031j55862B09818O8243n2671r8691d7698A73485a62288P5089c4599
11887a27033m0528p3516L6492G2928e4413A00902b67230J23132a0853C3902c30729
11875b16539P7938C2447g4353j25357g767j33734e8585E2119f2579k77949e3137
11863a62588M348f679j06974e0958a6943D0765L0284N5418A5426J40082i8291
11851C00483a18286o6574b1353A73851P401n9860L26033e6513A29007B7525O7690
11840I5215a47274A48243m1027c05044b4653r7717B84931r1412P2499H7125b05519
11828a57295G1017J36383J9075d31880A00331J79211a3361j13548p1267h3050
11817h887j23696A03020b05998f0042m5647c372j01401m5121o1558m3726b4063
$$ y = [-179508, -65031, -220893, 209818, 278061, 225390, 126699, -47698, 173485, -162288, -87199, -34599, -127033, -167561, -241077, -204585, 72928, -54413, 100902, -267230, -144098, -10853, 33902, -330729, -216539, -138601, 32447, -74353, -199710, -7767, -141501, -58585, 52119, -62579, -340528, -53137, -162588, -158240, -6679, -113653, -50958, -16943, 40765, 71049, 126467, 15426, 155508, -98291, 300483, -118286, -184860, -21353, 173851, 181252, 121392, 447425, -56513, 129007, 27525, 95215, -147274, 148243, 107216, -305044, -24653, -122370, 284931, 193519, 266018, 87125, -205519, -157295, 71017, 207400, 226475, -431880, 100331, 279542, -13361, -126909, -198176, -83050, -8887, -132583, 103020, -205998, -60042, -105689, -3372, -104773, -149894, -211452, -255178, -24063]
11805B35650b39779B09750a0582m57972h3386b1930B9205a12559d2367n8157G0688
11793a81255c2297j80776G0951c4836D2946f6662A60861d1711B67321h7498D40524
11781d9037E0184a10218j34518C57507C4865c00470d7752D7267G182P855a92980
11769E9830a13477A65665G3097M7825a46348B67176f4301k10828A8486L09973
11759C28459b04333R1995j09589g7897L1502j74438d5235G9638p248b24587F5891
11747c4544E3659a08879C4416a51037G4164B8538a13913A88933E7859a71056f1865
11735a23371A34212a67046B4187i1405j61734B64963q3313a37030A12946f9085
11724d2690A16736a10465e4687C22970c76269J54985a08187o378B13987d9032
$$ y = [235650, -239779, 209750, -10582, -468554, -83386, -21930, 29205, -112559, -42367, -100524, 70688, -181255, -32297, -213073, 70951, -34836, 42946, -66662, 160861, -41711, 267321, -87498, 440524, -49037, 50184, -110218, -244736, 357507, 34865, -300470, -47752, 47267, 7182, 15037, -192980, 59830, -113477, 165665, 73097, 120922, -146348, 267176, -64301, -275129, 18486, 328459, -204333, -112338, -221927, -77897, -46395, -220833, -45235, 79638, 72390, -224587, 65891, -34544, 53659, -108879, 34416, -151037, 74164, 28538, -113913, 188933, 57859, -171056, -61865, -123371, 134212, -167046, 24187, -91405, -253139, 264963, 181650, -137030, 112946, -69085, -42690, 116736, -110465, -54687, 322970, -376269, -221284, -108187, -114565, 213987, -49032]
11713D3420a62677B69443b3615o0521A89840o1441m8127b16464d7739B68516a8594
11701B70359b36278D7461a79509B12539b37450E3227J3648c9539b234E15d2030
11689B53843r1970D6340a04319C56200J1223H2473l4176B0232J11162d55614g0406
11677C24662j56063F1024b66415B57318N9580r4154n7505R4884B2966J03264D8248
11665A08390L96076B29146e6192b3432j69689B52601D2518K44905j24602a67056
11654F1634J13245D6767J40954b8743j1899E1079O8948r934l8200b32293a13405
11642A93235a48829A25892c2896J2221A43223b14845E0428O37J62066G2429P5710
11631A48139a97987J580d110A34960d6407E5287C411K70758q5882b23962i7688
$$ y = [43420, -162677, 269443, -23615, -84136, 189840, 128399, 80272, -216464, -47739, 268516, -18594, 270359, -236278, 47461, -179509, 212539, -237450, 53227, 66875, -39539, -2234, 515, -42030, 253843, 161873, 46340, -104319, 356200, 367423, 82473, 48297, 20232, 131394, -455614, -70406, 324662, 168599, 61024, -266415, 257318, 316898, 222744, 165239, 260123, 22966, 126230, 48248, 108390, 504466, 229146, -56192, -23432, -193121, 252601, 42518, 287423, 162821, -167056, 61634, 174879, 46767, 187721, -28743, -40642, 51079, 120027, 110093, 71893, -232293, -113405, 193235, -148829, 125892, -32896, -20675, 143223, -214845, 50428, 51065, 213131, 72429, 148139, -197987, -196407, -4110, 134960, -46407, 55287, 3411, 274169, 188287, -223962, -97688]
11619B29427A12933i0104j62586G7343b22644A9607p36Q1107R7372a17282G5819
11607i4438A68202b38817F6729b00872D83872d6088B32656a34093c7119B5833
11596f2396j06628o9780C49616A09253b13938A16695L37275A55612J01031f5116
11585b39472E8004C615a94587p3434H49J33622K25172E2409K1254N0106J69840
11574B93609A43002a16311F3826a60353j90496e9776B42662b38861g0150A58864
11563B16127a20125E8976Q3777a38173C49577j17936E286d864A68009a06617F607
11551a57522C4621b642o6731H1971P1000a8997A79480q2015C5452J23477J86709
11540C45638j01785J16459A68242G0328B0464J71036c06826A23913a94114B00903
$$ y = [229427, 112933, -90104, -252690, 77343, -222644, 19607, 18871, 99978, 197350, -117282, 75819, -94438, 168202, -238817, 66729, -200872, 483872, -46088, 232656, -134093, -37119, 25833, -62396, -169024, -238804, 349616, 109253, -213938, 116695, 453970, 155612, 256643, -65116, -239472, 58004, 3615, -194587, -268021, 849, 134471, 359643, 52409, 73663, 123769, 293609, 143002, -116311, 63826, -160353, -350849, -59776, 242662, -238861, -70150, 158864, 216127, -120125, 58976, 142753, -138173, 349577, 231641, 5286, -4864, 168009, -106617, 6607, -157522, 34621, -2642, -69373, 81971, 152971, -18997, 179480, 97465, 35452, 158929, 345638, 243853, 360312, 168242, 70328, 20464, 191500, -306826, 123913, -194114, 200903]
11529F7289J53075h6309A36166K40987A0732J3513J36585K09547a57071A17020
11518A59117j1975J83780A34218c1616B83851d3592C4636K12053D9821K67089
11508C16910c9531B73642a00799A84482k7469a62045C6902J99545c2791H3003
11497C98755b97998C49078n7501B1830e7506J8838B9986J65159A9082J37390a63571
11485A87571a6793B24031K2670J05015d2002C4080J231K26741K2365P6617A68797
11473B11391e7129A9496J59135l0426K2281A6163K44030a06295A35716a8939C41331
11461E27808a84143G1257b79930B69989k4171h9979C2395r519J26922k0544b01822
11449G796J5320M3072q929d1237B0238O9995G524J56165a44944d6317A57502A1431
$$ y = [67289, 220364, -86309, 136166, 377153, 10732, 24245, 160830, 370377, -157071, 117020, 159117, 147142, 330922, 134218, -31616, 283851, -43592, 34636, 246689, 49821, 316910, -39531, 273642, -100799, 184482, 157013, -162045, 36902, 236447, -32791, 83003, 398755, -297998, 349078, 291577, 21830, -57506, -38668, 29986, 195145, 19082, 156472, -163571, 187571, -16793, 224031, 246701, 351716, -42002, 34080, 35311, 262052, 284417, 361034, 168797, 211391, -57129, 19496, 178631, 148205, 170486, 16163, 260193, -106295, 135716, -18939, 341331, 527808, -184143, 71257, -279930, 269989, 245818, -89979, 32395, 22876, 149798, 129254, -201822, 7796, 23116, 66188, 57259, -41237, 20238, 90233, 7524, 163689, -144944, -46317, 157502, 11431]
11436H2167P8871a354A15727a39062B64923e8234D4042n342a95866G3810M17899
11425D91709b99247J01265P5912A80140g599j88858b0246A13252b06395A64434
11414b75285J34975G1545k4471L7996R9290a46190A32453K17154a99017a5562
11403A7000h3698L5478B51313G202J85616j3975m9744g4629B5651a98717C6348
11391a68537M0450N3590n6308B96885p4001e4518c679D2404a39570A65635m3031
11380A22604B6266O6681a24605H5152a41233C481b31737B15372j00346C9710a80942
11368A4322O8145K71516A7422M0280P0905m3180b64533Q0037k06531D01913C3451
11356b69977J05899k128O6891p3814H3591D302h5836c0548k53132A57760a29381
$$ y = [82167, 161038, -1354, 115727, -139062, 264923, -58234, 44042, 38700, -195866, 73810, 491709, -299247, -197982, -122070, 180140, -7599, -196457, -20246, 113252, -206395, 164434, -275285, -140310, 71545, 47074, 85070, 184360, -146190, 132453, 349607, -199017, -15562, 17000, -83698, -48220, 251313, 7202, 192818, 178843, 129099, -74629, 25651, -198717, 36348, -168537, -128087, -74497, -130805, 296885, 222884, -54518, -3679, 42404, -139570, 165635, 122604, 26266, 92947, -124605, 85152, -141233, 3481, -231737, 215372, 115026, 39710, -180942, 14322, 82467, 353983, 17422, 57702, 128607, 85427, -264533, -184496, -391027, 401913, 33451, -269977, -164078, -166206, -99315, -173129, 83591, 4302, -85836, -30548, -283680, 157760, -129381]
11344a5275C15746a9774B39706I8613a01005G2337L5796O572m4138b14032m2441
11333b56473d7941r8685F8379a2448N975p7440a685A5478d8654j61562B9891J35613
11321A65504M2409k5942p6692a34897O6487A28526h6316A66310a57217m7010G3709
11309e0388p1451j5426a2699A38850c53338B03297l8868L3170j0228d6211j48681
11298a94892a2806p9319A31385c0463C25843d40114h7012m837d5756C0527h752
11286h2951j5909l41708I0880g6638k7209d9975j64090E4472i4630L5014n2471
11275a12087p1255A13763a15710k05316B12084a38263B96727f7085j9386j054
11265h7525k28911J4044J07822A40414n2957m3639c13584G1947h5037j08202b9045
$$ y = [-15275, 315746, -19774, 239706, 98613, -101005, 72337, 108133, 114705, 70567, -214032, -256473, -47941, -146626, 68379, -12448, -6473, -83913, -1685, 15478, -48654, -210216, 29891, 165504, 207913, 181971, 105279, -134897, -68410, 128526, -86316, 166310, -157217, -204227, 73709, -50388, -121839, -137265, -12699, 138850, -353338, 203297, 164429, 197599, 187371, -46211, -194892, -12806, -92125, 131385, -30463, 325843, -440114, -87012, -91849, -45756, 30527, -8752, -82951, -98860, -440568, 90880, -76638, -103847, -49975, -214065, 54472, -94630, -59616, -112087, -183342, 113763, -115710, -321026, 212084, -138263, 296727, -67085, -86471, -87525, -316436, -302392, -194570, 140414, 87457, 43818, -313584, 71947, -85037, -193239, -29045]
11253a76323o4059A0509h1598G5296c1263C43122n9494r7234K90165b01094A10693
11241A96539H3529b35388A60061i8144g787k2913A3942E12a53817E4108a67912
11229a67653g5630j58505N9477B56647b45552j03538J64251F9619E420f3077A74789
11217b93225g8065k46892F1763N7693J22759A07995b27117c2946l37279a02295
11206a93051H4499b36946C29442F5662e1317I150J55938f9130G8114b76468a6933
11194b34018E121b5629r4910d9912E8839J20484c867p930k34912G8439j2327d6171
11181A28559a43507K8192j24196R3242n54863b93467f9090j86609M2928b1715
11170F0719j2539a58496d320j09281L3682F2630B1127K89679a30629A3144L27566
$$ y = [-176323, -240382, 10509, -81598, 75296, -31263, 343122, 283628, 186394, 476559, -201094, 110693, 196539, 83529, -235388, 160061, -98144, -7787, -30700, 13942, 512, -153817, 54108, -167912, -167653, -75630, -234135, -174658, 256647, -245552, -349090, -184839, 69619, 5420, -63077, 174789, -293225, -78065, -324957, 61763, 119456, 242215, 107995, -227117, -32946, -370225, -102295, -193051, 84499, -236946, 329442, 65662, -51317, 9150, 165088, -69130, 78114, -276468, -16933, -234018, 5121, -25629, -120539, -49912, 58839, 179323, -3867, -11797, -246709, 78439, 66112, -46171, 128559, -143507, -115315, -239511, -146269, -701132, -293467, -69090, -255699, -212771, -21715, 60719, 48180, -158496, -4320, -113601, -79919, 62630, 21127, 310806, -130629, 13144, 340710]
11159C40710A37774a37891C65534a13152I0077d39939J40136C95018g8517c7242
11148e4383B48758H7210M6796m2024a64800F253L8258L71332d72046d6776b721
11136H6541N7436b8951B27500L4235a0085C8337J81118J30655l8286c699A8308
11124E3910a81574I933J54621M4772b3751F9534K11740M2353A49063L1678l5336
11113A45405J79323j05743m092J31138C5924K0342J46518N6405F6964a1793G1694
11101I9879J05371o6142I896K04744H244O85463B10506a9819A97825d7289D8045
11089A44528K24725E2290J22235a62476D99058a55410F65495k28411j76448B6056
11078B23930j10310J41334K32283C1099K13142J65360j90368K03934B1059a12354
$$ y = [340710, 137774, -137891, 365534, -113152, 90077, -439939, -299803, 395018, -78517, -37242, -54383, 248758, 87210, 134006, 91982, -164800, 6253, 44511, 415843, -472046, -46776, -2721, 86541, 143977, -28951, 227500, 261735, -10085, 38337, 219455, 350110, 311824, -3699, 18308, 53910, -181574, 9933, 164554, 209326, -23751, 69534, 281274, 323627, 149063, 180741, 145405, 324728, 218985, 214893, 346031, 35924, 56266, 202784, 259189, 66964, -11793, 71694, 99879, 205250, 139108, 9896, 214640, 8244, 693707, 210506, -19819, 197825, -47289, 48045, 144528, 369253, 52290, 174525, -162476, 499058, -155410, 665495, 437084, 260636, 26056, 223930, 113620, 254954, 487237, 31099, 244241, 409601, 219233, 423167, 21059, -112354]
11067C32581L36701l25369O8762I6045K96250J47612l4298q934B22857L66600
11057E89457J5563o4698j18107Q8613J6500o9841J15863j11965J51925j2771L81767
11046I82306j99641j86470k27183O14654C78452N67522J8558k42682j84618J80955
11036G18187J22352n2164k19919j8614K17215j45211J54667m8694M7744q5087
11026F90476o2528K57697C87873L43221k23958L22166j57771j66696K63661p6884
11016F91612K23295D34118J27042P1755j82243j77262L78637j18778O7131n4050
11006E46350J30860C06752J48397J50936j90694J4610N4385J14897N0176j77653
10996D71806q0619N34703k15606j20914l9724O1929j80789M36328k48386M93865
$$ y = [332581, 669282, 343913, 412675, 96045, 392295, 539907, 505609, 496675, 222857, 589457, 605020, 540322, 422215, 510828, 527328, 457487, 573350, 461385, 613310, 600539, 982306, 782665, 596195, 369012, 983666, 378452, 945974, 964532, 721850, 537232, 718187, 840539, 788375, 568456, 549842, 767057, 621846, 776513, 727819, 775563, 690476, 627948, 885645, 387873, 731094, 507136, 829302, 671531, 504835, 768496, 691612, 914907, 434118, 561160, 632915, 450672, 273410, 652047, 533269, 600400, 546350, 677210, 306752, 455149, 606085, 415391, 430001, 484386, 599283, 649459, 471806, 391187, 925890, 710284, 589370, 549646, 611575, 430786, 867114, 618728, 1112593]
10986A112593l13601L88098j70223P2786R7835o1956Q5894j50905O22678l56308
10976A326891Q61615k1537M0675L60665J97951j64986J73218k8603l88232m2185
10966B315472k73643j19228l49551K13034l17269J40616J96675j40089o950K50657
10956A909724k09395Q9430j28870l54406n1790k15940j23586N9113k53751C31574
10945C37207J01490j57247k5714r7402c1898p9222A99267K52477J12098A60433
10934C14970b9004j27335A67485n259n9274J63340j01648J81516d8378a7223m00922
10923d18145l1301A20973J37950J85338a9918C07696E075R6274R8756b54455J18800
10912a35655j08686A85350b97491a12162b016B45140a21413m968b7971B8428b07219
$$ y = [1112593, 798992, 1187090, 1016867, 1089653, 1187488, 1125532, 1211426, 1060521, 1683199, 1326891, 2188506, 2166969, 2207644, 2568309, 2766260, 2601274, 2774492, 2745889, 2357657, 2315472, 2041829, 1922601, 1573050, 1786084, 1468815, 1609431, 1806106, 1666017, 1659067, 1909724, 1700329, 1789759, 1660889, 1306483, 1254693, 1038753, 915167, 974280, 720529, 331574, 337207, 438697, 281450, 255736, 158334, -31898, -111120, 199267, 451744, 563842, 160433, 314970, -29004, -156339, 167485, 162226, 102952, 266292, 164644, 346160, -48378, -17223, -418145, -449446, 120973, 258923, 444261, -19918, 307696, 5075, 101349, 200105, -254455, -135655, -244341, 185350, -297491, -112162, -2016, 245140, -121413, -126381, -27971, 28428, -207219]
10900e6475G1736A7422a31436M1975m2590k50106i2156a487A46660b19412i7020
10888A63525E2977b7744k43506a28712J1306b8611A2297K62811H0883c1730j43187
10877a74917A05679b71002H110J4021c4773B24832h0779c1843l00363A05789a44686
10865a22015p3723H0089B9687J53761e0716j03493D0852M0897L3882b08002A38861
10853A95161E4637e5990I4050c5016A29667E2684J06493K44775I9449e45H087
10841C0718a55795C1137N3402B2009M9563e4360q9302B66999a37967C8959O4970
10830A03929J2853F544e461j01467B05576r9800l4239J21284b73718a04604L6167
10819f8437k02584D6011B1963J13231c97599A40402b6893A62635a75166j15562
$$ y = [-56475, 71736, 17422, -131436, -89461, -132051, -382157, -92156, -1487, 146660, -219412, -97020, 163525, 52977, -27744, -271250, -128712, -117406, -28611, 12297, 275108, 80883, -31730, -174917, 105679, -271002, 8110, 22131, -34773, 224832, -80779, -31843, -332206, 105789, -144686, -122015, -195738, 80089, 29687, 183448, -50716, -154209, 40852, 81749, 115631, -208002, 138861, 195161, 54637, -55990, 94050, -35016, 129667, 52684, 159177, 403952, 99449, -545, 8087, 30718, -155795, 31137, 84539, 22009, 71572, -54360, -143662, 266999, -137967, 38959, 103929, 116782, 6544, -5461, -106928, 205576, 105776, 71537, 192821, -273718, -104604, -68437, -271021, 46011, 21963, 135194, -397599, 140402, -26893, 162635, -175166, -290728]
10809b90728n1498o2271J79933j19903m5658c1460A50636a06762A05062A8728
10798H9351i6838j35496h5152q0192j44850K1553b9054j21575O5337j3274K5005
10787g3561a1907k65475f231n0256b5042j84139f1969j35041B47817j22909O7046
10776A91954b48214R9220r6653A07757L16L87727A84000a33074O4615K8599E7761
10764A41113i3015G9889b18118D2941P8493a64680M3993K9019A22027R0560c4347
10752F8384K77208A3870h2113l89796a36866A41831e3797q8744K0060l9827j23539
10741b85847d7463C1335b66485b4119j4664A00272j6942b76169A99691b31281
10730C10651a62844G6474J76607c1461j4507J0469j7060a7807I9765g8679B14478
$$ y = [-290728, -342226, -404497, -224564, -344467, -390125, -31460, 150636, -106762, 105062, 18728, 89351, -96838, -232334, -85152, -165344, -310194, -288641, -29054, -150629, -85292, -98566, -73561, -11907, -277382, -6231, -56487, -25042, -209181, -61969, -197010, 247817, 124908, 191954, -248214, -148994, -245647, 107757, 108073, 495800, 184000, -133074, -68459, -39860, 57761, 141113, -93015, 79889, -218118, 42941, 121434, -164680, -120687, -91668, 122027, 212587, -34347, 68384, 345592, 13870, -82113, -471909, -136866, 141831, -53797, -142541, -122481, -162308, -285847, -47463, 31335, -266485, -24119, -38783, 100272, 83330, -276169, 199691, -231281, 310651, -162844, 76474, 253081, -31461, -45968, -35499, -52559, -17807, 99765, -78679, 214478]
10718e28119b29156k60398a86487a721k24936a05414j3705j88210A8503M8587
10708F7090a94277A33912d9609D1519k0426J27941b24445B95364a55791H375b79513
10696d3919a7736C3668a12810A8706Q429b66207B18339I9905b3320p444l58581
10685c89345P2361D03218a50116C83916c07263O6756i1723j97453f3603n1669
10675a15272C78746c34063a53944O8304k8793k37543J67459B18005f5135a086
10664a56606B3761e1819A84656r0999a66385p5521A93963i1657l2349k06495a60195
10652a64759G7556b44837H1627J08805d4455j73555d0811A27392b04626f5599
10641A83095l5440M3938b00980b861D2642d23671B59179d060j23831N4901A88652
$$ y = [-528119, -229156, -489554, -186487, -1721, -226657, -105414, -119119, -307329, 18503, 67090, -194277, 133912, -49609, 41519, 21093, 149034, -224445, 295364, -155791, 8375, -279513, -43919, -17736, 33668, -112810, 18706, 27135, -266207, 218339, 99905, -23320, -30764, -389345, -316984, 403218, -150116, 383916, -307263, -240507, -91723, -289176, -63603, -115272, 378746, -334063, -153944, -85640, -114433, -351976, -184517, 218005, -65135, -1086, -156606, 23761, -51819, 184656, 93657, -166385, -241906, 193963, -91657, -124006, -330501, -160195, -164759, 77556, -244837, 81627, 190432, -44455, -218010, -40811, 127392, -204626, -65599, 183095, 147655, 191593, -200980, -2861, 42642, -423671, 259179, -4060, -127891, -72990, 188652]
10629b98198N5654B58920A27056a2783B8790a57544a3800k00163d3608j62937
10619b06545P8168j25682C8355c4753m0381l70765J22038J02059D457f4968a4305
10607b0717H247c8629q1730K5279k2229D6062b94942D6616a24581l2559K1835
10596a35305j35250h5612A71235J5488a55518c0107l09965J8371h3430r724j58692
10585b51846J13504q7287g9579C9575K04908e5992A7316L0178L01469a63667B66410
10573G2051J70476h1657A55495m6572f5542A06874M2702a1447A43971J95164C8300
10561c8461l2713B58078a6337p7292r1202C3114J87614A7545i0634H0815i2827
10549b19699B69946O3522j21505b49488a5096m7422B64556E854K4132m454a4539
$$ y = [-298198, -242544, 258920, 127056, -12783, 28790, -157544, -13800, -213963, -43608, -206545, -128377, -254059, 38355, -34753, -75134, -445899, -323861, -221802, 4457, -64968, -14305, -20717, 8247, -38629, -120359, -95080, -117309, 46062, -294942, 46616, -124581, -157140, -135305, -270555, -85612, 171235, 186723, -155518, -30107, -340072, -321701, -83430, -93154, -251846, -138342, -225629, -79579, 39575, 244483, -55992, 17316, 47494, 348963, -163667, 266410, 72051, 242527, -81657, 155495, 108923, -65542, 106874, 149576, -11447, 143971, 339135, 38300, -38461, -71174, 258078, -16337, -93629, -184831, 33114, 220728, 17545, -90634, 80815, -92827, -219699, 269946, 333468, 211963, -249488, -15096, -62518, 264556, 5854, 29986, 25532, -14539]
10537G0073J22531a3879k39761e6196A66867a61009k26614a1140A1245a56815
10526a02511B99907E628b28221g4727A07097a06010b9769A62865a60326K0718
10516a39608B34523c02696A32704a24135l86124b20399J9360c1012G7770i8925
10505E7066c28451a3970A56019c83261b884E4669a26670I8333k2110a59380A30950
10493a30186J5307D6206h5658E6366J42457C482p87M5758e1435j79038B7263J32347
10481A59610J32585J29878A13731Q8179J80081A58261R0791K7201e4911j60215
10471b15126N8993d6096n74m3567K3778b20k47392a7400A13839a72847P073A02692
10458a05161K6720C82735d8419A09234m7828a51495A43912D2078a38131n2381
$$ y = [70073, 192604, -13879, -253640, -56196, 166867, -161009, -387623, -11140, 11245, -156815, -102511, 299907, 5628, -228221, -74727, 107097, -106010, -29769, 162865, -160326, -139608, 234523, -302696, 132704, -124135, -510259, -220399, -201039, -31012, 77770, -98925, 57066, -328451, -13970, 156019, -383261, -2884, 54669, -126670, 98333, 76223, -159380, 130950, -130186, -114879, 46206, -85658, 56366, 198823, 3482, 2695, 48453, -51435, -230473, 27263, 159610, 292195, 422073, 113731, 201910, 381991, 158261, 249052, 276253, -54911, -215126, -156133, -46096, -46670, -90237, -66459, -220, -247612, -17400, 113839, -172847, -165774, 102692, -105161, -78441, 382735, -48419, 109234, 61406, -151495, 143912, 42078, -138131, -190512]
10448a90512A67207a06762j09545a8073C4160a48794l44598A1371b3114A4889
10437a18305L328B57493j25492M9127a18174n0487C74060E1342K25973b23095
10426i7553E495N4633g5210k0131A84446a48167B22308N0828c06313A44014m2601
10415A01413l4859J8277c34286J59546A9503a00048j33455C44684d04184d470
10404E2410d31234C4987J18820b93061A15169a0789l8787j18023M3025o4997A66995
10392a34224B30478F6653J7800B3287L5149B8297d9601A60770G1630A9321K90264
10381C09585a74750B98964J85027B24205g0519C17180G830K19563F9610a95552
10370D61863r024n3303j82720J54152K68361k27828j03307j2508j33517O3214
$$ y = [-190512, 167207, -106762, -216307, -18073, 34160, -148794, -493392, 11371, -23114, 14889, -118305, -114977, 257493, 132001, 181128, -118174, -168661, 374060, 51342, 277315, -223095, -97553, 5495, 60128, -75210, -95341, 184446, -148167, 222308, 273136, -306313, 144014, 101413, 66554, 84831, -334286, -174740, 19503, -100048, -233503, 344684, -404184, -4470, 52410, -431234, 34987, 153807, -293061, 115169, -10789, -49576, -167599, -124574, -189571, 166995, -134224, 230478, 66653, 84453, 23287, 58436, 28297, -49601, 160770, 71630, 19321, 309585, -174750, 298964, 483991, 224205, -70519, 317180, 7830, 227393, 69610, -195552, 461863, 452839, 399536, 216816, 370968, 639329, 411501, 308194, 295686, 162169, 225383]
10360B25383N989F2908e779B24966m0417G4162N89861C17726q9282J56462J42295
10349E27201k51844q9096E7484L83742j54648n4224J02862C8789J11862K39328
10339C89979j46630k614k6238H089K22030a36776D4771j2277Q2821M9925K93261
10328D58501E5357f0433B92747a40618B14888d165q3203B02742a96388N9134e3838
10316a14582A76084M8767r1075N7278P8225A11743J11914a50333C39420b0566
10305H5401B9337c0455B5187b91451D65817a01800j93853J25450B04203F4107
10294a68062r8958A46036Q3180d0851A17444a79843A04054a36137c4290a4257
10283a15082b5952l09623C154M2072J82840c0014p7318A09462H280J18546a48344
$$ y = [225383, 231372, 62908, -5779, 224966, 184549, 74162, 664023, 317726, 228444, 384906, 527201, 275357, 186261, 57484, 441226, 286578, 232354, 335216, 38789, 150651, 389979, 243349, 240735, 214497, 8089, 230119, -136776, 44771, 32494, 115315, 165240, 458501, 55357, -60433, 292747, -140618, 214888, -4165, -87368, 202742, -196388, -137254, -53838, -114582, 176084, 224851, 133776, 191054, 269279, 111743, 223657, -150333, 339420, -20566, 85401, 29337, -30455, 25187, -291451, 465817, -101800, -295653, -170203, 204203, 64107, -168062, -267020, 146036, 229216, -40851, 117444, -179843, 104054, -136137, -34290, -14257, -115082, -25952, -335575, 3154, 45226, 228066, -30014, -107332, 109462, 8280, 126826, -148344]
10271B20827i7875A90486e8239j11630J0499M9414B58535b28752B9170P6702i2805
10259C03926K22739A34209N2511q3477m7507j3038f3175b6933A50937h1530l5093
10248a16623k6934A86948b20853F1339K7258B0101g8069B0039m093a24824D3260
10236C2673a51168D3522J56785o5957c5723l6869r060r1610M007F9232B5649J78954
10224B04603b43601c1184q4668L3362F0501N3287b20671D3085Q6162K5568a10061
10212a29168e3912A66792m9373a32792O2022J948C29J05934d06579J66536h8710
10200d72923a65433A78568c61800B63625h7620k38370a55934d7957n2341A6252
10189c50454o0828a54282n238m3484a0848B23745a62761J8068A17231d418I2142
$$ y = [220827, -97875, 190486, -58239, -169869, -159370, -109956, 258535, -228752, 29170, 105872, -92805, 303926, 526665, 134209, 186720, 103243, 55736, 42698, -63175, -26933, 150937, -81530, -116623, -143557, 186948, -220853, 61339, 88597, 20101, -78069, 20039, 15946, -124824, 43260, 32673, -151168, 43522, 200307, 134350, -35723, -72592, -81652, -173262, -169255, 69232, 25649, 204603, -243601, -31184, -115852, -82490, 60501, 113788, -220671, 43085, 129247, 154815, -110061, -129168, -53912, 166792, 117419, -132792, -70770, -68822, 329, 106263, -406579, -240043, -88710, -472923, -165433, 178568, -361800, 263625, -87620, -325990, -155934, -47957, -100298, 16252, -350454, -411282, -154282, -159520, -203004, -10848, 223745, -162761, -144693, 117231, -4418, 92142]
10177a19552E4134K4601a51830n4371E3816J53744b8997m4466l4861c6011C9329
10165a48040A46166a3803C6839O087J06455a83205m1729d2516j66543Q5504A23586
10153d8867A77613a16260H7433O1267a92122k14757B62549j15363e09287C2581
10142b91639j21651a89506A25273i9360k25921A36795b85061I0593g4926m446
10132g9372p027A08967h7819O924k5519H7648a69642b9717I2185N9810o4230c30441
10119a54931c3248k82029B77883A19534m1107N9526a62262k87798F3063b75309
10108D1344i826j62210A60806B5749h3216j09614Q7781l9344A4473h1098k11744
10097b92842I3915J43372g5138j96899A35857b9177B6633a03777j15172E4480
$$ y = [-119552, 54134, 78735, -151830, -206201, 53816, 207560, -28997, -73463, -108324, -36011, 39329, -148040, 146166, -13803, 36839, 42926, 149381, -183205, -224934, -42516, -209059, -123555, 123586, -48867, 177613, -116260, 87433, 148700, -192122, -406879, 262549, 147186, -509287, 32581, -291639, -413290, -189506, 125273, -99360, -325281, 136795, -285061, 90593, -74926, -79372, -86399, 108967, -87819, -80895, -106414, 87648, -169642, -29717, 92185, 151995, 87765, -330441, -154931, -33248, -315277, 277883, 119534, 78427, 137953, -162262, -450060, 63063, -275309, 41344, -9826, -172036, 160806, 25749, -83216, -192830, -105049, -144393, 14473, -81098, -292842, 93915, 237287, -75138, -272037, 135857, -29177, 26633, -103777, -218949, 54480]
10086a28409F2541f657j09429j87054B419L861b69446C7625J13532b08570k38559
10075d47129A7638d29278B43506a99543B78964b22366g667j79469p7283B17136
10064h8282K5340q2606D0693a65817G7263b27931q9769e2145A79920a39633A40081
10052D8314a36210k5265b5818j29071A17952b65397C08043i5368e986G9039g8670
10040H0019a62542A65733a03673K8900m1159j53270j82106a57815A50330d7265
10029a57777J3651p7290B65618d8660l1506a8912n8291K8811j20969M9897D4556
10017C35827j12915I5486a0431B87707b14023B02591A00738e3050n8651a2595
10006C7873d83480g4798C60551h6852m9546e0110l14961A61186c28503P4752D7443
$$ y = [-128409, 62541, -6657, -116086, -303140, 2419, 6280, -269446, 37625, 151157, -208570, -447129, 17638, -429278, 243506, -199543, 278964, -222366, -7667, -187136, -264419, 217136, -88282, -62942, -145548, 40693, -165817, 77263, -227931, -317700, -52145, 179920, -139633, 140081, 48314, -136210, -161475, -25818, -154889, 117952, -265397, 308043, -95368, -5986, 79039, -78670, 80019, -162542, 165733, -103673, -74773, -115932, -269202, -451308, -157815, 150330, -47265, -157777, -144126, -221416, 265618, -48660, -80166, -18912, -77203, -48392, -169361, -119464, 44556, 335827, 222912, 95486, -10431, 287707, -214023, 202591, 100738, -53050, -111701, -12595, 37873, -483480, -74798, 360551, -86852, -136398, -50110, -365071, 161186, -328503, -253751, 47443]
9994D123b03250G9098a36356j45127K9551f0746j40026i719k34499q7095j36719
9983d68032a37614M0400M8463B4579o193P5004b59745J17804k28960e6106A58908
9971b45087A63022i5217k19458a13610p8993f602k0297j42513m852M3020K2255
9960a08989j20830k326f926j23262B34002e1007k70206b9783j35138j26274H8130
9948a8600l1598F4720a55402N2083H356J38714g2771A14790g3825q1599k8663
9937a84087b375A65164c6595j91936E8584J07955c98951A70165a38196f5502D17097
9925I7339J45682p6530B2943b59219A03032g514m23434a88376Q0135p5501h9636
9913A41128e0892A57873c202l5880p9675l29607a25822E7388j690J36223C7472
$$ y = [4123, -203250, 79098, -136356, -281483, -251932, -60746, -200772, -9719, -244218, -331313, -468032, -137614, -97214, -48751, 24579, 18386, 93390, -259745, -141941, -370901, -56106, 158908, -245087, 163022, -95217, -314675, -113610, -192603, -6602, -26899, -169412, -174264, -131244, -108989, -229819, -232145, -6926, -130188, 234002, -51007, -321213, -29783, -164921, -291195, 88130, -18600, -50198, 64720, -155402, -103319, 8356, 147070, -72771, 114790, -73825, -155424, -184087, -2375, 165164, -36595, -228531, 58584, 166539, -398951, 170165, -138196, -65502, 417097, 97339, 243021, 166491, 22943, -259219, 103032, -7514, -430948, -188376, -108241, -183742, -89636, 141128, -50892, 157873, -3202, -39082, -118757, -448364, -125822, 57388, 55698, 191921, 37472]
9901a94464i1968A79913h5483r8736G7246A8655f2738B59391c96024f7325l3914
9890a01239B0549f2677A51470j0968e3691A792M4073a18730L990o8322D48464
9878a9512m3553j7023k25363a20825E0109K1121j9518j359a68367l056j23587
9867b95010E1108b30006R8587j01606K8531L0823D33221G4309b38621J1033J03676
9856a23912b658C1981a80856B23956a84621P9749j38192G8874c9275I4218B3642
9844d6579m9653A62214K79405b94240N3650P9578A29569F374d55605e5159A10710
9832b38977l13400F0510c53079A141b8481M411r1269N3334J380k2901A43486b38472
9819a55574j29409H5113a6324j72058A51591n4918d2570k16100G9265C7409l486
$$ y = [-194464, -91968, 179913, -85483, -184219, 77246, 18655, -62738, 259391, -396024, -67325, -101239, 20549, -62677, 151470, 140502, -53691, 1792, 45865, -118730, -114740, -183062, 448464, -19512, -63065, -80088, -305451, -120825, 50109, 71230, 51712, 50353, -168367, -171423, -295010, 51108, -230006, -131419, -233025, -204494, -173671, 433221, 74309, -238621, -227588, -123912, -2658, 31981, -180856, 223956, -184621, -104872, -243064, 78874, -39275, 94218, 23642, -46579, -96232, 162214, 441619, -294240, -240590, -161012, 129569, 6374, -455605, -55159, 110710, -238977, -552377, 60510, -353079, 1141, -28481, -24070, -115339, -62005, -60625, -83526, 143486, -238472, -155574, -284983, 85113, -16324, -188382, 151591, 96673, -42570, -258670, 79265, 37409, 33923]
9808C3923c8750k13538J13321A6850a0837j70349k49689a45886B34200a79243
9797B9248a3200H9992a73212P7566M2684B367i3972m260B2662a22215A18021b20781
9784f9297I3806A7690g0343A67478b82181d1417n9121C69734F2266K14040a61854
9772A8904b93171A28739i1203B02839a49676C9194P9390d8081C99202a08407M7662
9761f0745r8201E7498h8833B8906f1528A42084a00463d5918n3389j52931P2106
9750a80132A99446a70593A63852A4889a93077A48132a1864m0845m85972d8299
9739b08205J1982e567D1546a70602l3532G6137b2045j33751K843j230A9117a09300
9726c58958h9259K25A65535A3038g0467o1718B5099g8319j01565q967j40394a18999
$$ y = [33923, -38750, -252288, -138967, 16850, -10837, -181186, -430875, -145886, 234200, -179243, 29248, -13200, 89992, -173212, -95646, -52962, 2367, -93972, -98232, 22662, -122215, 118021, -220781, -69297, 93806, 17690, -70343, 167478, -282181, -41417, -100538, 369734, 62266, 276306, -161854, 18904, -293171, 128739, -91203, 202839, -149676, 39194, 118584, -48081, 399202, -108407, -60745, -158946, 57498, -88833, 28906, -61528, 142084, -100463, -45918, -99307, -252238, -180132, 199446, -170593, 163852, 14889, -193077, 148132, -11864, -52709, -538681, -48299, -208205, -196223, -5567, 41546, -170602, -204134, 76137, -22045, -155796, -152953, -154183, 19117, -109300, -358958, -89259, -89034, 165535, 13038, -70467, -132185, 25099, -78319, -179884, -188851, -329245, -118999]
9713B43526a49812g1160B25819d49966J22769Q371B02749a26073q8195L549A29496
9701b4413q2681a9309l52721H865a75975c6028r9370p5622A0613B724g3642m4378
9689a18020m4296M4650q617k20872a68776j4526e0880j20032q16k23505a20446
9677G1798a32800A33555a79507K474k55506G9959C0383a76625B1362a70096E8577
9665D4448h6147l7980B07072c1795m8637D1617K7902J55987I8742f961k35652
9654b42613d7571q5773c4374A30368n4431J67018c84166I8185l7335J6981a1265
9642b49261a09770F809c56604J3309a33854a0578n0208B60746e9729j53030Q1102
9631a31657p5442g215k16191C4042c20598a29771p2924A26245c13925J04022B14618
$$ y = [243526, -149812, -71160, 225819, -449966, -327197, -318826, 202749, -126073, -214268, -210719, 129496, -24413, -107094, -19309, -372030, 8865, -175975, -36028, -135398, -211020, 10613, 2724, -73642, -118020, -162316, -117666, -126283, -347155, -168776, -183302, -50880, -170912, -171728, -395233, -120446, 71798, -132800, 133555, -179507, -177033, -432539, 79959, 30383, -176625, 21362, -170096, 58577, 44448, -86147, -124127, 207072, -31795, -80432, 41617, 69519, 225506, 98742, -6961, -242613, -47571, -133344, -34374, 130368, 75937, 242955, -384166, 98185, 60850, 77831, -11265, -249261, -109770, 6809, -356604, -343295, -133854, -10578, -60786, 260746, -59729, -212759, -131657, -207099, -7215, -223406, 34042, -320598, -129771, -202695, 126245, -313925, -209903, 214618]
9619C91941a44248l73842h3961k70466R4155P0650g7886G2198a17265A50232e8905
9607c33640a4030A58747a28203n7239m3609G1617a02601l21025a63692k36096
9597c99788A19329l1363c99350B24342b42567D6518K4161b0762j03944B471a89416
9585a26504M2986n112K7263J3912A46150P0276r7159A0517c932l09155a5178E0709
9572a15992g985j74459h168k46170l5109i0759c8237n5079A196N6631a69628H8039
9559a03058A37477o4424f0918L611A5941b48519f5081B25349A6836a03795D3050
9547b7815C7149P9921a9336A0532c52286q614I0496f2248j63396C666c71873J42733
9535b29140a14294k7641F8759g1453B03702a79734e8028j78374j17326d065k53810
$$ y = [391941, -144248, -518090, -83961, -354427, -260272, -189622, -77886, 72198, -117265, 150232, -58905, -333640, -14030, 158747, -128203, -185442, -229051, 71617, -102601, -423626, -163692, -399788, 119329, 87966, -399350, 224342, -242567, 46518, 70679, -20762, -124706, 2471, -189416, -126504, -83518, -88630, -61367, -47455, 146150, 216426, 119267, 10517, -3932, -313087, -15178, 50709, -115992, -7985, -182444, -8168, -254338, -289447, -90759, -38237, -93316, 1196, 57827, -169628, 88039, -103058, 137477, 73053, -60918, -57307, 15941, -248519, -65081, 225349, 16836, -103795, 43050, -27815, 37149, 117070, -19336, 10532, -352286, -360900, 90496, -62248, -225644, 3666, -371873, -229140, -114294, -141935, 68759, -71453, 203702, -179734, -58028, -236402, -353728, -4065, -257875]
9524b57875D8711O2508E1929L8544a09892A28329c8766A88417a70875F0527P6395
9513A36922K9423E3449K48974d7282H486J8829L34892I9587J14446b85763g4300
9501a39541D4296b21366A44774L2486b10279M5799g2464l1330q528C19763I4241
9489b6870B93682h6251A45127J7660D3590Q1538f9649m7424A34187A2438L01986
9478C14424C9216a7920j63887N5967m6808m7751A08979J13802p9167b6792p2364
9467i9156A3707a28713A77279A1823K29586p2531a08991b6820j32853b6957j89573
9456b16530A31904C0925c4304j85584g1896C3057K75792b80017a38021L4787r8475
9445b01709M7620E0547b36185d2800j79679O9388A20691a25662A10249e7793k4727
$$ y = [-257875, 48711, 111219, 51929, 90473, -109892, 128329, -38766, 188417, -170875, 60527, 136922, 166345, 53449, 302423, -47282, 8486, 27315, 362207, 99587, 214033, -285763, -74300, -139541, 44296, -221366, 144774, 177260, -210279, -164480, -72464, -103794, -112322, 319763, 94241, -26870, 293682, -86251, 145127, 162787, 43590, 125128, -69649, -117073, 134187, 12438, 314424, 39216, -17920, -181807, -125840, -172648, -220399, 108979, 222781, 143614, -26792, -99156, 13707, -128713, 177279, 11823, 241409, 168878, -108991, -26820, -159673, -26957, -216530, 131904, 30925, -34304, -219888, -71896, 33057, 308849, -280017, -138021, -103234, -201709, -154089, 50547, -236185, -42800, -222479, -153091, 120691, -125662, 110249, -57793, -82520]
9434h2520E0037a71989O6241A0095e5783q1693l030d9867A77562a27497N7392
9423g0105l69089N8940A61099f9448G9999a61927A25351b11989D7309f3419G735
9411c31379A66683a1798G4306C6483b01109c3533j64496f8972j27276c0498R069
9400b1429r8967D6623h0536H650a21956B8609a74177N049C1995c02427J12663
9389a89764Q295j84024e0887k77598J55668D7395c75832C7212M4565a74835P9535
9378i5300E019c57505a62826E9809J51809f5557j88237n848a1387B14539b05454
9366A35513A4568b92786f6578I5760L2237j8296l4666a95759Q8587C2038R6969
9355A29007a86363K929j71313A2007g6809j98387A10548i2315k72586G3667J51938
$$ y = [-82520, 50037, -171989, -105748, 10095, -55783, -137476, -140506, -49867, 177562, -127497, -70105, -439194, -380254, 161099, -69448, 79999, -161927, 125351, -211989, 47309, -63419, 7735, -331379, 166683, -11798, 74306, 36483, -201109, -33533, -198029, -68972, -196248, -30498, -21429, -120396, 46623, -80536, 8650, -121956, 28609, -174177, -169128, 31995, -302427, -189764, -181469, -365493, -50887, -328485, -172817, 47395, -375832, 37212, 81777, -174835, -95300, 5019, -357505, -162826, 59809, 211618, -65557, -253794, -259642, -11387, 214539, -205454, 135513, 14568, -292786, -66578, 95760, 127997, 109701, 75035, -195759, -107172, 32038, 129007, -186363, -183434, -354747, 12007, -76809, -275196, 110548, -92315, -364901, 73667, 225605]
9344B25605e2807j14900I879L9998c1589L105D0986J3548L3008c77294f4371j05381
9332a69752f6416a8488j18885A2080a1361F7239k7419d7593A11708e990j56323
9321a62313l1437H7556J23051H4078a69212l1129I2588O9189b3920p8107j33517
9310b35544R6405j742N2817I1505a00198D8888b4857A86957F863b01701F2353
9298a35652O163C4151b14840E2643M0123k8108b11710D5363R648L4943b30253
9286A41889a3011K967l48415M0135J5041e0195r8877j30082I6459l6889i6556
9274A32426b51669A09244K01064d1983j62871H0995L1178a0940j09356D6468a20582
9262b16880E3165b22365l099D01493b74527A9112d008A98988n8329K68293a61602
$$ y = [225605, -52807, -167707, 9879, 49877, -31589, -28484, 40986, 54534, 87542, -377294, -64371, -169752, -66416, -18488, -137373, 12080, -11361, 67239, 39820, -47593, 111708, -5990, -162313, -193750, 87556, 210607, 84078, -169212, -200341, 92588, 161777, -23920, -102027, -235544, -139139, -140881, -88064, 91505, -100198, 48888, -24857, 186957, 6863, -201701, 62353, -135652, -129489, 34151, -214840, 52643, 92766, 64658, -211710, 45363, 55011, 89954, -230253, 141889, -13011, -10044, -358459, -318324, -303283, -50195, -149072, -279154, 96459, 59570, -96556, 132426, -251669, 109244, 310308, -41983, -204854, 80995, 112173, -10940, -120296, 46468, -120582, -216880, 53165, -222365, -225464, 401493, -274527, 19112, -4008, 198988, 140659, 408952, -161602]
9250C0119c7191j76459A9349e0865k21692m4189J10866A82324h3203A10898g7178
9238a44123c7177j36661g7824R013m9292j02556A8874a64991P7326R553j25591
9227b03703B47448b63313A15936a08003R548j23669J3091e1260o7638p4082d1870
9215c28144J54359f0278B58664A7917f4819K1301l89431a04611j2366b4189g146
9203B38636o23e8282D0366A0210L235a91635n5682q7588O1441a30459j08194O5772
9191a72881E8967f1913r3080C5270J08201d7341C22811d1325f352j0391D8879
9179b0072P703A32313i3019G8220a55088J8523f7209j57177c573E5755a49014
9167c6292a3873j10336D17317a93878B0910c11338B02343o8693A0187R2190j6088
$$ y = [30119, -37191, -213650, 19349, -50865, -272557, -316746, -205880, 182324, -83203, 110898, -77178, -144123, -37177, -173838, -77824, -68811, -118103, -220659, 18874, -164991, -87665, -78112, -203703, 247448, -263313, 115936, -108003, -98455, -222124, -209033, -51260, -118898, -192980, -41870, -328144, -173785, -60278, 258664, 17917, -64819, -43518, -432949, -104611, -116977, -24189, -7146, 238636, 238013, -58282, 40366, 10210, 13445, -191635, -247317, -334905, -273464, -130459, -238653, -172881, 58967, -61913, -154993, 35270, 143471, -47341, 322811, -41325, -6352, -16743, 48879, -20072, -12369, 132313, -93019, 78220, -155088, -136565, -67209, -224386, -3573, 55755, -149014, -36292, -13873, -124209, 417317, -193878, 20910, -311338, 202343, 133650, 10187, 102377, 86289]
9156H6289C2639c59479A79750d67049e540m7432A89967j8347o8420a40425A09938
9144a01699j51962Q2381N0645a1589B25426E4692A3196b7778A3703h4540H2891
9132a02759n6366A87425c30679h9191k48704g3044l23527d6745j80872R3551B10373
9120c41926J28148a0364k5500m902k73722H2690a369A96202b61358A09748a47883
9108a99664j5522h2535O029A34271J07428f6304H1389h0803l90657i7081A04695
9096A68869b53213A0777a50937c9482j87153Q6017j27092D3989a36661J3929k85863
9085d08595C64269A49491b15729B34883b36705R1254p1590H9502R1421k3376E8783
9073b43613A9750b4182j83872L2810H8447a8081j11242K4807k67634a21362j02449
$$ y = [86289, 32639, -359479, 179750, -467049, -5540, -52972, 189967, 171620, 103200, -140425, 109938, -101699, -253661, -171280, -120635, -11589, 225426, 54692, 13196, -27778, 13703, -84540, 82891, -102759, -159125, 187425, -330679, -89191, -337895, -73044, -396571, -46745, -227617, -134066, 210373, -341926, -213778, -10364, -35864, -40766, -314488, 82690, -1369, 196202, -261358, 109748, -147883, -199664, -215186, -82535, -76506, 134271, 241699, -66304, 81389, -80803, -471460, -97081, 104695, 168869, -253213, 10777, -150937, -39482, -226635, -140618, -267710, 43989, -136661, -122732, -408595, 364269, 149491, -215729, 234883, -236705, -145451, -217041, 89502, 180923, 157547, 58783, -243613, 19750, -24182, -208054, -175244, 88447, -18081, -129323, -104516, -372150, -121362, -223811]
9062b23811f8199F8364K46386a41387j0694B18940a38411a7372l67065d2320j62865
9051b05185A19348k4411a0992k62232a2114C68658b9460l7415F8952b80007G2419
9039G6472i6277n3480K6584j27563B46319a71194A66448a4750B0134J06044d46618
9027d5933n466A4769c87258A74793f490j54478B8615i1668D3355P9838c901k92597
9015b96498C2917b29138A50487a13084j1729A84373a63841e0716k08634R2476
9005a66874j14943C4520a34315K9106j72013O5423o0181K0063r8221A05517J75415
8994B80932a28741a9821m2333E252c03153E1895P647b28331L1663N2130q101c4292
8981b60158f771G3669J19487G2805c04476C31943b51949f5753K6911j28146F6266
$$ y = [-223811, -68199, 68364, 314750, -141387, -152081, 218940, -138411, -17372, -384437, -42320, -205185, 119348, 94937, -10992, -273224, -12114, 368658, -29460, -66875, 68952, -280007, 72419, 76472, -96277, -149757, -123173, -250736, 246319, -171194, 166448, -14750, 20134, 126178, -446618, -45933, -51399, 14769, -387258, 174793, -6490, -160968, 28615, -91668, 43355, 123193, -3901, -296498, 32917, -229138, 150487, -113084, -124813, 184373, -163841, -50716, -259350, -166874, -281817, 34520, -134315, -105209, -277222, -211799, -271980, -251917, -350138, 105517, 280932, -128741, -19821, -62154, 5252, -303153, 51895, 59542, -228331, -196668, -144538, -152639, -34292, -260158, -6771, 73669, 193156, 72805, -304476, 331943, -251949, -65753, -38842, -166988, 66266]
8969a36818k56148B4458g4271A94731F7370c15494F442e2613J9258I4424a64911
8957a39808k57703P9498a39094J0327D94771B27681a05660j33921F5911a55556
8946e5397k19952A91593b32410k4249L2787j44553i4477k44078B13894K22223
8936D36117b32774B03824q3128J1861J64534c41247i9397C5112J81a51414d7911
8924e0337A08881M15151J170544P03412F63959B52109j10582J72764b71274N5867
8914b15407h7552B48881o5360b46208J4027C39176a92641B2540b36888a12261
8903e8440k36820I0062J52665j09388D0214B0077a1658j6064G2723k2315b02552
8891g5793j64031n9348D7260I741N267J39943i0915j63942f1987k17896k9414
$$ y = [-136818, -392966, 24458, -74271, 194731, 67370, -315494, 6442, -52613, -33355, 94424, -164911, -139808, -397511, -318013, -139094, -128767, 494771, 227681, -105660, -239581, 65911, -155556, -55397, -275349, 191593, -232410, -256659, -223872, -368425, -94477, -338555, 213894, 436117, -232774, 203824, 120696, 132557, 297091, -341247, -99397, 35112, 35293, -151414, -47911, -50337, 108881, 524032, 1694576, 2397988, 663959, 252109, 141527, 314291, -271274, -215407, -87552, 248881, 183521, -246208, -232181, 339176, -192641, 22540, -236888, -112261, -58440, -295260, 90062, 242727, 133339, 40214, 20077, -11658, -27722, 72723, 50408, -202552, -75793, -239824, -299172, 47260, 9741, 15008, 154951, -90915, -254857, -61987, -279883, -309297]
8880c09297g5689b3001A5930a4420n3549j04751j47794P2460A13377R4230e1534
8868C2251d96898b9389C3658O3661B6645J63538H0732a03694d5664A9021b91299
8856b41567d2648B42948E8127b07815d3117j30541m3429A19027c17614A00926
8845f3015A26925d13032B2146L3890K54641H7588A2907K5267J44896a20611c2055
8833b42443M4555n6517a8269D1395a62721D0892g4549C3898h8839l81717f2640
$$ y = [-309297, -75689, -23001, 15930, -14420, -67969, -172720, -320514, -248054, 113377, 207607, -51534, 32251, -496898, -29389, 33658, 97319, 26645, 190183, 80732, -103694, -45664, 19021, -291299, -241567, -42648, 242948, 58127, -207815, -43117, -173658, -217087, 119027, -317614, 100926, -63015, 126925, -413032, 22146, 56036, 310677, 87588, 12907, 38174, 183070, -120611, -32055, -242443, -197888, -254405, -18269, 41395, -162721, 40892, -74549, 33898, -88839, -470556, -62640]
$$ [...]
##END NTUPLES=NMR SPECTRUM
##END=
