##TITLE=AC1421_GUAAH12231_7764224_7nlsLHRoiK
##JCAMPDX= 6.0         $$ Bruker NMR JCAMP-DX V2.0
##DATA TYPE= NMR SPECTRUM
##DATA CLASS= NTUPLES
##ORIGIN= BRUKER
##OWNER= Administrator
$$ 1.72 TOPSPIN		Version 2.1
$$ 2013-04-16 22:06:25.373 -0700  Administrator@X
$$ Compression mode = diff/dup
##.OBSERVE FREQUENCY= 400.02188249412
##.OBSERVE NUCLEUS= ^1H
##.ACQUISITION MODE= SIMULTANEOUS (DQD)
##.ACQUISITION SCHEME= undefined
##.AVERAGES= 64
##.DIGITISER RES= 22
##SPECTROMETER/DATA SYSTEM= spect
##.PULSE SEQUENCE= noesygpps1d.comp
##.SOLVENT NAME= COFFEE_meoh
##.SHIFT REFERENCE= INTERNAL, COFFEE_meoh, 1, 14.96094
##AUDIT TRAIL= $$ (NUMBER, WHEN, WHO, WHERE, PROCESS, VERSION, WHAT)
$$ ##TITLE= Audit trail, TOPSPIN		Version 2.1
$$ ##JCAMPDX= 5.01
$$ ##ORIGIN= Bruker BioSpin GmbH
$$ ##OWNER= Administrator
$$ $$ E:\/data/COFFEE/nmr/AC1421_GUAAH12231_7764224_7nlsLHRoiK/12/pdata/1/auditp.txt
$$ ##AUDIT TRAIL=  $$ (NUMBER, WHEN, WHO, WHERE, PROCESS, VERSION, WHAT)
(   1,<2013-04-16 22:06:20.326 -0700>,<Administrator>,<X>,<go>,<TOPSPIN 2.1>,
      <created by zg
	started at 2013-04-16 21:54:50.012 -0700,
	POWCHK enabled, PULCHK disabled,
       configuration hash MD5:
       33 CF 6A 21 5C D3 B9 40 6C 15 AA 8D 27 A2 4F 13
       data hash MD5: 64K
       B9 24 85 2E 22 8C B2 6C 10 27 9F 95 73 90 D8 5A>)
(   2,<2013-04-16 22:06:23.310 -0700>,<Administrator>,<X>,<proc1d>,<TOPSPIN 2.1>,
      <Start of raw data processing
       efp LB = 0.3 FT_mod = 6 PKNL = 1 PHC0 = 0 PHC1 = 0 SI = 128K 
       data hash MD5: 128K
       FB 19 43 2A 72 8D 61 B5 01 21 93 EC 15 D7 EE 38>)
(   3,<2013-04-16 22:06:24.295 -0700>,<Administrator>,<X>,<proc1d>,<TOPSPIN 2.1>,
      <pk PHC0 = -78.91479 PHC1 = 0 
       data hash MD5: 128K
       EC A3 DD DC FF 8C 85 AA F2 35 E6 E4 22 56 47 C3>)
(   4,<2013-04-16 22:06:24.732 -0700>,<Administrator>,<X>,<proc1d>,<TOPSPIN 2.1>,
      <abs ABSG = 1 
       data hash MD5: 128K
       C4 47 7E 86 71 E9 F4 B9 9E 52 88 ED 22 45 83 9B>)
(   5,<2013-04-16 22:06:24.842 -0700>,<Administrator>,<X>,<proc1d>,<TOPSPIN 2.1>,
      <abs ABSG = 2 
       data hash MD5: 128K
       4C 41 3B 38 D2 D7 FA 2F FE 56 D4 39 10 E7 D7 4E>)
(   6,<2013-04-16 22:06:24.967 -0700>,<Administrator>,<X>,<proc1d>,<TOPSPIN 2.1>,
      <abs ABSG = 3 
       data hash MD5: 128K
       3B E8 6C 79 50 68 A4 C8 42 D5 7C 68 93 D7 32 CA>)
(   7,<2013-04-16 22:06:25.076 -0700>,<Administrator>,<X>,<proc1d>,<TOPSPIN 2.1>,
      <abs ABSG = 4 
       data hash MD5: 128K
       5B 7C DB 50 13 BD EE EA 99 DF 6A B9 AA CF 6F 63>)
(   8,<2013-04-16 22:06:25.170 -0700>,<Administrator>,<X>,<proc1d>,<TOPSPIN 2.1>,
      <abs ABSG = 5 
       data hash MD5: 128K
       8C B5 8B 6A D5 C8 3B ED 3A E8 DA FE 22 E6 7A 3C>)
$$ ##END=
$$ 
$$ $$ hash MD5
$$ $$ 58 C9 83 94 5A B9 37 F9 8C ED 0D 31 49 37 69 F2
##$RELAX= 
##$RELAX= 
##$RELAX= 
##$RELAX= 
##$RELAX= 
##$RELAX= 
##$RELAX= 
##$RELAX= 
$$ Bruker specific parameters
$$ --------------------------
##$DU= <E:\>
##$EXPNO= 12
$$ [...]
##$TP07= 0
##$TPNAME0= <>
##$TPNAME1= <>
##$TPNAME2= <>
##$TPNAME3= <>
##$TPNAME4= <>
##$TPNAME5= <>
##$TPNAME6= <>
##$TPNAME7= <>
##$TPOAL= (0..7)
0.5 0.5 0.5 0.5 0.5 0.5 0.5 0.5
##$TPOFFS= (0..7)
0 0 0 0 0 0 0 0
##$TUNHIN= 0
##$TUNHOUT= 0
##$TUNXOUT= 0
##$USERA1= <user>
##$USERA2= <user>
##$USERA3= <user>
##$USERA4= <user>
##$USERA5= <user>
##$V9= 5
##$VALIST= <valist>
##$VCLIST= <CCCCCCCCCCCCCCC>
##$VD= 0
##$VDLIST= <DDDDDDDDDDDDDDD>
##$VPLIST= <PPPPPPPPPPPPPPP>
##$VTLIST= <TTTTTTTTTTTTTTT>
##$WBST= 2048
##$WBSW= 25
##$XGAIN= (0..3)
0 0 0 0
##$XL= 0
##$YL= 0
##$YMAX_a= 5772882
##$YMIN_a= -12689193
##$ZGOPTNS= <>
##$ZL1= 120
##$ZL2= 120
##$ZL3= 120
##$ZL4= 120
##$ABSF1= 14.96094
##$ABSF2= -5.597241
##$ABSG= 5
##$ABSL= 3
##$ALPHA= 0
##$AQORDER= 0
##$ASSFAC= 0
##$ASSFACI= 0
##$ASSFACX= 0
##$ASSWID= 0
##$AUNMP= <proc_prof1d_extract.lims>
##$AXLEFT= 0
##$AXNAME= <>
##$AXNUC= <1H>
##$AXRIGHT= 0
##$AXTYPE= 0
##$AXUNIT= <>
##$AZFE= 0.1
##$AZFW= 0.1
##$BCFW= 0
##$BC_mod= 0
##$BYTORDP= 0
##$COROFFS= 0
##$CY= 15
##$DATMOD= 1
##$DC= 0
##$DFILT= <>
##$DTYPP= 0
##$F1P= 0
##$F2P= 0
##$FCOR= 0.5
##$FTSIZE= 131072
##$FT_mod= 6
##$GAMMA= 0
##$GB= 0
##$INTBC= 1
##$INTSCL= 1
##$ISEN= 128
##$LB= 0.3
##$LEV0= 0
##$LPBIN= 0
##$MAXI= 10000
##$MC2= 0
##$MEAN= 0
##$ME_mod= 0
##$MI= 0
##$NCOEF= 0
##$NC_proc= -2
##$NLEV= 6
##$NOISF1= 0
##$NOISF2= 0
##$NSP= 0
##$NTH_PI= 0
##$NZP= 0
##$OFFSET= 14.96094
##$PC= 1
##$PHC0= -78.91479
##$PHC1= 0
##$PH_mod= 1
##$PKNL= yes
##$PPARMOD= 0
##$PPDIAG= 0
##$PPIPTYP= 0
##$PPMPNUM= 2147483647
##$PPRESOL= 1
##$PSCAL= 4
##$PSIGN= 0
##$PYNMP= <proc.py>
##$REVERSE= no
##$SF= 400.020009659282
##$SI= 131072
##$SIGF1= 0
##$SIGF2= 0
##$SINO= 400
##$SIOLD= 131072
##$SPECTYP= <>
##$SREGLST= <1H.CDCl3>
##$SSB= 0
##$STSI= 131072
##$STSR= 0
##$SW_p= 8223.68421052631
##$SYMM= 0
##$S_DEV= 0
##$TDeff= 65536
##$TDoff= 0
##$TI= <>
##$TILT= no
##$TM1= 0
##$TM2= 0
##$TOPLEV= 0
##$USERP1= <user>
##$USERP2= <user>
##$USERP3= <user>
##$USERP4= <user>
##$USERP5= <user>
##$WDW= 1
##$XDIM= 131072
##$YMAX_p= 372449666
##$YMIN_p= -12004
##$CURPLOT= <Network HP LaserJet P1505>
##$CURPRIN= <$Network HP LaserJet P1505>
##$DFORMAT= <normdp>
##$LAYOUT= <+/1D_H.xwp>
##$LFORMAT= <normlp>
##$PFORMAT= <normpl>
##$SURQMSG= 1
$$ End of Bruker specific parameters
$$ ---------------------------------
##NTUPLES= NMR SPECTRUM
##VAR_NAME=  FREQUENCY,     SPECTRUM/REAL,   SPECTRUM/IMAG
##SYMBOL=    X,             R,               I
##VAR_TYPE=  INDEPENDENT,   DEPENDENT,       DEPENDENT
##VAR_FORM=  AFFN,          ASDF,            ASDF
##VAR_DIM=   131072,        131072,          131072
##UNITS=     HZ,            ARBITRARY UNITS, ARBITRARY UNITS
##FACTOR=    0.0627417313425164, 1,          1
##FIRST=     8223.62146879497, 1499,         -52188
##LAST=      0,             2189,            -52430
##MIN=       0,             -12004,          0
##MAX=       8223.62146879497, 372449666,    0
$$ Real data points
##PAGE= N=1
##DATA TABLE= (X++(R..R)), XYDATA
$$ [...]
61688D62566l937l597l136k471j997k004k123j871j562j958k981l477k627j073
61674D27752j26k85r68j483j700j740j577j190q19p59r28q78l18N16J143J404
61658D18044J536J684J693J529J524J886K254K165J850J962K571K991K698J994
61644D46381J511J525J878K230K123J303J87l25J44R09J003J98j006k081k700
61629D53280k601j860j159j270k106k837l008l049l342l281j953L22J914J634
61615D30684J08j097j356j333j665k230k934m186n902o845n974m147l373m377
61601C85373n813o047m923l448k503k253k276j923r24N7J8j074k089k186j781
61586C48208j688j864j682r73j79K82K38m11j539k579k972k693k054j190k24L99
$$ y = [462566, 458629, 455032, 451896, 449425, 447428, 445424, 443301, 441430, 439868, 437910, 434929, 431452, 428825, 427752, 427626, 427341, 426373, 424890, 423190, 421450, 419873, 418683, 417864, 417105, 416177, 415299, 414981, 415497, 416640, 418044, 419580, 421264, 422957, 424486, 426010, 427896, 430150, 432315, 434165, 436127, 438698, 441689, 444387, 446381, 447892, 449417, 451295, 453525, 455648, 456951, 457138, 456813, 456957, 457866, 458869, 459067, 458061, 455980, 453280, 450679, 448819, 447660, 446390, 444284, 441447, 438439, 435390, 432048, 428767, 426814, 427136, 429050, 430684, 430792, 429695, 428339, 427006, 425341, 423111, 420177, 415991, 410089, 403244, 397270, 393123, 389750, 385373, 379560, 373513, 368590, 365142, 362639, 360386, 358110, 356187, 355263, 355320, 355338, 354264, 352175, 349989, 348208, 346520, 344656, 342974, 342001, 341822, 342104, 342342, 341931, 340392, 337813, 334841, 332148, 330094, 328904, 328680, 329079]
61570C29079L68P4J81O25P33L33J03O05J531K216K452K400K027J185J54l95j34
61553C43537M56O42L14J0J67O21J004J251J495J690J700J591J473J197O31R1Q8
61536C57958O98J598K549L351L500K710J698J548K145K200J113j44n70n88j177
61521C78589k271k986k950k540k098j746j722k090k332j949j263r06p41j43Q30
61506C53682J445J456J343J332R69m0j235j891j685p41M64J200J075O08O38J142
61490C59762J266O75J09K55P69Q80N17L31Q03J709K369K253J479P82P10R73R00
61473C76542M29J16J94L28L42M76O74M24k84n95L8Q93R41K72k03k01l33r23j352
61454C77778q65M66J915K870L176K953K338J489O67J67J10L63Q00J528K629L695
$$ y = [329079, 329447, 329521, 329702, 330327, 331060, 331393, 331496, 332101, 333632, 335848, 338300, 340700, 342727, 343912, 344066, 343671, 343537, 343993, 344635, 344949, 344959, 345126, 345747, 346751, 348002, 349497, 351187, 352887, 354478, 355951, 357148, 357779, 357870, 357958, 358656, 360254, 362803, 366154, 369654, 372364, 374062, 375610, 377755, 379955, 381068, 380924, 380354, 379766, 378589, 376318, 373332, 370382, 367842, 365744, 363998, 362276, 360186, 357854, 355905, 354642, 353736, 352995, 352852, 353682, 355127, 356583, 357926, 359258, 360227, 360187, 358952, 357061, 355376, 354635, 355099, 356299, 357374, 357982, 358620, 359762, 361028, 361703, 361812, 362067, 362836, 363716, 364233, 364564, 365367, 367076, 369445, 371698, 373177, 373959, 374669, 375642, 376542, 376971, 377087, 377281, 377609, 377951, 378427, 379101, 379525, 379241, 378646, 378684, 379577, 380518, 380790, 380587, 380386, 380053, 379130, 377778, 376913, 377379, 379294, 382164, 385340, 388293, 390631, 392120, 392787, 392954, 393064, 393427, 394227, 395755, 398384, 402079]
61438D02079M048L547K848K632K873L109L086K792K163J253N22M20O88O64K27
61423D32951k8J98L81K4m42j72Q33J619J429M82n58j289j582j290n18R3j12r75
61405D31044j742k065k307k702k797k163j240r28j423j948j703p26K61N92J98
61390D10351m09o03j88M67Q70Q53N58J94k1J16N85J110J535K061K841L567L853
61373D27740L818L840L853L427K540J767J556J702J758J562J194P90O19J052K118
61358D59336L284L918L888L616L665M320N452O659P673Q602R618J0479J0688J0150
61344E51348R337Q629P864O697N177L664K465J736J571J789J770Q48r28k644l294
61329E96029k791k114k283l225l962l932l714m097m801m768l574j887m65P08J928
$$ y = [402079, 406127, 409674, 412522, 415154, 418027, 421136, 424222, 427014, 429177, 430430, 430952, 431372, 432060, 432724, 432951, 432923, 433121, 433502, 433526, 433084, 432912, 433745, 435364, 436793, 437275, 436717, 435428, 433846, 432556, 432038, 432131, 432019, 431044, 429302, 427237, 424930, 422228, 419431, 417268, 416028, 415100, 413677, 411729, 410026, 409300, 409561, 410153, 410351, 409942, 409339, 409151, 409618, 410488, 411341, 411899, 412093, 412072, 412188, 412773, 413883, 415418, 417479, 420320, 423887, 427740, 431558, 435398, 439251, 442678, 445218, 446985, 448541, 450243, 452001, 453563, 454757, 455547, 456166, 457218, 459336, 462620, 466538, 470426, 474042, 477707, 482027, 487479, 494138, 501811, 510413, 520031, 530510, 541198, 551348, 560685, 569314, 577178, 583875, 589052, 592716, 595181, 596917, 598488, 600277, 602047, 602895, 601967, 599323, 596029, 593238, 591124, 588841, 585616, 581654, 577722, 574008, 569911, 565110, 560342, 556768, 554881, 554416, 555124, 557052]
61314E57052L041L700L975M308N001O059P379Q750R816J0371J0621J0880J1093
61301F52046J0881J0000Q453O257L382R3k921m970o006o678p618q722r273q912
61287F36012q142p701p616p344o643n843n164m326l020j352L46J853K938L362
61273E87360L329L574M580N911O673O581O117N827N799N905O145O572P083P528
61259F68984P947Q495R034R058Q272P176O602O536N882L869J213p33j733k654
61245G37948l846m478l990l193l307m395n495n927n822n549n230m813m146l058
61231F74699j645m56K7n6j18K41J048K141L176L685L483K960K621K505K290J818
61215F98419J237Q31R41J780K977L661L377K609K054J682J122M85J82K18M63J416
$$ y = [557052, 560093, 563793, 567768, 572076, 577077, 583136, 590515, 599265, 609081, 619452, 630073, 640953, 652046, 662927, 672927, 681380, 687637, 691019, 691112, 688191, 683221, 677215, 670537, 662919, 654197, 644924, 636012, 627870, 620169, 612553, 605209, 598566, 592723, 587559, 583233, 580213, 578861, 579207, 581060, 583998, 587360, 590689, 594263, 598843, 604754, 611427, 618008, 624125, 629952, 635751, 641656, 647801, 654373, 661456, 668984, 676931, 685426, 694460, 703518, 711790, 718966, 725568, 732104, 737986, 741855, 743068, 742335, 740602, 737948, 734102, 729624, 725634, 722441, 719134, 714739, 709244, 703317, 697495, 691946, 686716, 681903, 677757, 674699, 673054, 672598, 672625, 672569, 672451, 672692, 673740, 675881, 679057, 682742, 686225, 689185, 691806, 694311, 696601, 698419, 699656, 700487, 701428, 703208, 706185, 709846, 713223, 715832, 717886, 719568, 720690, 721175, 721357, 721575, 722038, 723454]
61199G23454L724O929R671J1325J2592J4152J5618J6336J6463J6578J6664J6181
61187H79687J4889J2992J0603P679M539J967N62J80J63m0n22j175k073l378m941
61172I21132o251p085p852q960j0086j0619j0726j1259j2488j3572j3706j3225
61160G95303j3077j3513j3862j3466j2344j0943r563q202o738n140l523k028o82
61147F82222N58J609K222K125J144p05l088n415p230q436r009q728p595o271n437
61132F27966m844l581j428Q29K533L945N540P183Q573R875J1408J3071J4662J6392
61118G12124J8471K0521K1990K2959K3916K4932K5705K6215K6686K6914K6388
61107I76821K5123K3732K2447K0696J8027J4952J2400J0483Q216M561l70n300
$$ y = [723454, 727178, 734107, 743778, 755103, 767695, 781847, 797465, 813801, 830264, 846842, 863506, 879687, 894576, 907568, 918171, 925850, 930389, 932356, 932918, 933098, 933261, 933221, 932699, 931524, 929451, 926073, 921132, 914881, 907796, 899944, 890984, 880898, 870279, 859553, 848294, 835806, 822234, 808528, 795303, 782226, 768713, 754851, 741385, 729041, 718098, 708535, 700333, 693595, 688455, 684932, 682904, 682222, 682780, 684389, 686611, 688736, 689880, 689175, 686087, 680672, 673442, 665006, 655997, 647269, 639674, 633403, 627966, 623122, 619541, 618113, 618942, 621475, 625420, 630960, 638143, 646716, 656591, 667999, 681070, 695732, 712124, 730595, 751116, 773106, 796065, 819981, 844913, 870618, 896833, 923519, 950433, 976821, 1001944, 1025676, 1048123, 1068819, 1086846, 1101798, 1114198, 1124681, 1132897, 1137458, 1137088, 1131788]
61095A131788r061j1859j4861j8456k1500k2757k2639k2682k3502k4158k3666
61084I16647k2311k1024k0158j9393j8459j7395j6222j4888j3445j2046j0689
61073G30617r184p370n382l671k684k343j945q84O40J898K586L087L861M964O251
61058G20441P607Q829R697J0336J1133J2221J3332J4296J5242J6210J7049J7886
61046H74279J9215K1242K3515K5430K6805K7763K8488K9266L0368L1647L2683
61035A170701L3447L4304L5222L5629L5435L5495L6541L8206L9666M0774M1970
61024A577390M3511M5287M7137M8889N0444N2162N4711N8201O2138O6573P2537
61013B178980Q0699R0511J01374J13846J28828J46326J66054J88664K15702K49399
$$ y = [1131788, 1122727, 1110868, 1096007, 1077551, 1056051, 1033294, 1010655, 987973, 964471, 940313, 916647, 894336, 873312, 853154, 833761, 815302, 797907, 781685, 766797, 753352, 741306, 730617, 721433, 714063, 708681, 705010, 702326, 699983, 698038, 697154, 697794, 699692, 702278, 705365, 709226, 714190, 720441, 728048, 736877, 746574, 756910, 768043, 780264, 793596, 807892, 823134, 839344, 856393, 874279, 893494, 914736, 938251, 963681, 990486, 1018249, 1046737, 1076003, 1106371, 1138018, 1170701, 1204148, 1238452, 1273674, 1309303, 1344738, 1380233, 1416774, 1454980, 1494646, 1535420, 1577390, 1620901, 1666188, 1713325, 1762214, 1812658, 1864820, 1919531, 1977732, 2039870, 2106443, 2178980, 2259679, 2350190, 2451564, 2565410, 2694238, 2840564, 3006618, 3195282, 3410984, 3660383]
61003C660383K93335L51769M27335N21717O40417P93028R82812J195838J405084
60994A0271718J585989J724597J813283J849068J839309J795279J705555J523282
60986B4108080J204689P73732L36487J2746j50530j94397j88808j81899k12682
60977B5507418l43145o35691j083157j577242j966960k155226k142702j994228
60969A3609067j781015j552081j335933j146625r85371q45480p20869o09580n11145
60960D120968m24889l51192k91180k44180k07394j78310j55535j37278j21233
60951B009777j06467r3632q2880p3234o4438n7561n3018m9545m6037m3082m1732
60940A298151m1768m2141m2268m2059m1233l9447l6804l3851l1244k9471k8402
$$ y = [3660383, 3953718, 4305487, 4732822, 5254539, 5894956, 6687984, 7670796, 8866634, 10271718, 11857707, 13582304, 15395587, 17244655, 19083964, 20879243, 22584798, 24108080, 25312769, 26086501, 26422988, 26435734, 26285204, 26090807, 25901999, 25720100, 25507418, 25164273, 24528582, 23445425, 21868183, 19901223, 17745997, 15603295, 13609067, 11828052, 10275971, 8940038, 7793413, 6808042, 5962562, 5241693, 4632113, 4120968, 3696079, 3344887, 3053707, 2809527, 2602133, 2423823, 2268288, 2131010, 2009777, 1903310, 1809678, 1726798, 1653564, 1589126, 1531565, 1478547, 1429002, 1382965, 1339883, 1298151, 1256383, 1214242, 1171974, 1129915, 1088682, 1049235, 1012431, 978580, 947336, 917865, 889463]
60929H89463k7160k5078k2638k0694j9000j6660j3917j2078j1451j0809r377p908
60917F92693p177o732o033n537n590n278l669j439mM08O23Q77O09k37q60o79k1
60900F51954M83N56K63k62r57j851k891l650l677l284l472m672o022o434n907
60885F10177n346n401o014o714o913o270n224m816n534o668p284p316p183o902
60871E22592o248n452m939m590l966l084k334j846j379p67O2J176K270K615J995
60856D96105J382J898L367M625N034M892M559M051L522L255L055K451J639J438
60842E41273K003K297J317o82k575l660m129m484m828m808m133l128k594k945
60828E08924l634l750l009j895j005o41q61j414j715j396q95j016j890k823l223
$$ y = [889463, 862303, 837225, 814587, 793893, 774893, 758233, 744316, 732238, 720787, 709978, 700601, 692693, 685516, 678784, 672751, 667214, 661624, 656346, 652677, 651238, 651234, 651642, 652265, 653142, 653751, 653514, 652654, 651975, 651954, 652437, 652993, 653256, 652994, 652037, 650186, 647295, 643645, 639968, 636684, 633212, 628540, 622518, 616084, 610177, 604831, 599430, 593416, 586702, 579789, 573519, 568295, 563479, 557945, 551277, 543993, 536677, 529494, 522592, 516344, 510892, 505953, 501363, 497397, 494313, 491979, 490133, 488754, 487987, 488049, 489225, 491495, 494110, 496105, 497487, 499385, 502752, 507377, 512411, 517303, 521862, 525913, 529435, 532690, 535745, 538196, 539835, 541273, 543276, 545573, 546890, 546208, 543633, 539973, 535844, 531360, 526532, 521724, 517591, 514463, 511869, 508924, 505290, 501540, 498531, 496636, 495631, 494990, 494129, 492715, 491000, 489604, 488709, 487693, 485803, 482980, 479757]
60813D79757l225l295l674m327n063n516n351m585l599k726k169k158k743l379
60799D27947l308k507j831j916k431k684k588k521k565k439k166k166k525k630
60785C93670j935q19j94l03m44JP82J348J669K009K192J871J314J212J592J772
60769D05737J499J408J961K678K917K770K692K714K596K345K024J440N97L3J54
60754D33565N16L93k46q61j172j268j189r79r22j162j323j079p63q30j087j145
60738D20448j292k077l314m325m980n543n690m749k998j690j544k026k390k580
60724C75250k754k682k094j163l06J74J43k41m07N2P04P77L76M20J252K067K059
60707C73627J430Q82P07Q08J076J394J628J816K002J901J306Q36J425K850L657
$$ y = [479757, 476532, 473237, 469563, 465236, 460173, 454657, 449306, 444721, 441122, 438396, 436227, 434069, 431326, 427947, 424639, 422132, 420301, 418385, 415954, 413270, 410682, 408161, 405596, 403157, 400991, 398825, 396300, 393670, 391735, 390916, 390722, 390419, 389975, 389976, 390758, 392106, 393775, 395784, 397976, 399847, 401161, 402373, 403965, 405737, 407236, 408644, 410605, 413283, 416200, 418970, 421662, 424376, 426972, 429317, 431341, 432781, 433378, 433411, 433565, 434081, 434474, 434228, 433367, 432195, 430927, 429738, 428759, 427837, 426675, 425352, 424273, 423510, 422680, 421593, 420448, 419156, 417079, 413765, 409440, 404460, 398917, 393227, 388478, 385480, 383790, 382246, 380220, 377830, 375250, 372496, 369814, 367720, 366557, 366251, 366425, 366568, 366327, 365920, 365972, 366676, 367453, 367829, 368249, 369501, 371568, 373627, 375057, 375939, 376646, 377454, 378530, 379924, 381552, 383368, 385370, 387271, 388577, 389413, 390838, 393688, 397345]
60692C97345L048J973J767K430K938K701J951J125O49R53J968K810K679J876J318
60677D27531J244J128P88P43J268J806J702J118P38P47N48m21j878k980l378l556
60661D27148l969m219l578k234j286j380j927j975j333m79K77R54J463J561J303
60646D10326J096J234J548J569R66j60j354k152k472k528k462k231j887j718j902
60631C97873k188k116j550q56n26o33p36m05K02N71O05P94J380J834J590R01M55
60614C97195M09M31M21N10M98O6m97n15J8M02L69M88J157J930K164J792J111M00
60596D08349L4L26R43J064N23J54N86J377J823J938K004J785J042L44M36J058
60580D23786J198N48q3J04R55J731J995J915K008K695L971N415O573P287P629
$$ y = [397345, 400393, 402366, 404133, 406563, 409501, 412202, 414153, 415278, 415927, 416880, 418848, 421658, 424337, 426213, 427531, 428775, 429903, 430691, 431434, 432702, 434508, 436210, 437328, 438066, 438813, 439361, 438940, 437062, 434082, 430704, 427148, 423179, 418960, 415382, 413148, 411862, 410482, 408555, 406580, 405247, 404768, 405045, 405999, 407462, 409023, 410326, 411422, 412656, 414204, 415773, 416739, 416579, 415225, 413073, 410601, 408073, 405611, 403380, 401493, 399775, 397873, 395685, 393569, 392019, 391163, 390637, 390004, 389268, 388863, 389065, 389636, 390241, 391035, 392415, 394249, 395839, 396740, 397195, 397604, 398035, 398456, 398966, 399464, 399530, 399033, 398518, 398536, 398938, 399307, 399795, 400952, 402882, 405046, 406838, 407949, 408349, 408383, 408709, 409652, 410716, 411239, 411393, 411979, 413356, 415179, 417117, 419121, 420906, 421948, 422292, 422728, 423786, 424984, 425532, 425449, 425553, 426508, 428239, 430234, 432149, 434157, 436852, 440823, 446238, 452811, 460098, 467727]
60565D67727P783Q016Q480Q843Q515P461O443O082N986N294L725J711l16k218
60551E43532l791m638m527l643k416j279m33L31J525L361N331O662P164P440Q259
60536E62878R858J1863J3719J5158J6263J7113J7516J7205J6144J4402J1873Q505
60524G32497M704J052k317n533q225r655r863r904j0452j0813r968q159o610n865
60510F40889n234m006k482j410p64L10K368M891O981Q566J0508J3432J6980K0460
60496G11489K3764K7080L0199L2777L5016L7240L8993L9374L8272L6349L3742
60485A084295K9840K4617J9136J4172R250L692k180p651j2876j8619k5067l1446
60473A087163l6762m0483m2726m4029m4624m3895m1156l7020l3176l0424k7892
$$ y = [467727, 475510, 483526, 492006, 500849, 509364, 516825, 523268, 529350, 535336, 540630, 544355, 546066, 545750, 543532, 539741, 535103, 530576, 526933, 524517, 523238, 522805, 523136, 524661, 528022, 533353, 540015, 547179, 554619, 562878, 572736, 584599, 598318, 613476, 629739, 646852, 664368, 681573, 697717, 712119, 723992, 732497, 737201, 738253, 735936, 730403, 722178, 712523, 702660, 692756, 682304, 671491, 661523, 653364, 646754, 640889, 635655, 631649, 629167, 627757, 626993, 627303, 629671, 634562, 641543, 650109, 660617, 674049, 691029, 711489, 735253, 762333, 792532, 825309, 860325, 897565, 936558, 975932, 1014204, 1050553, 1084295, 1114135, 1138752, 1157888, 1172060, 1181310, 1185002, 1182822, 1175171, 1162295, 1143676, 1118609, 1087163, 1050401, 1009918, 967192, 923163, 878539, 834644, 793488, 756468, 723292, 692868, 664976]
60462F64976k4716k1481j9097j7173j4696j1868r974r613j0009j0056r242p658
60450D99393n828m505l962l554k582j348p35r22j288j474j741k236k629k622k306
60435D61661j844j314q59o16m33n6M11N62K44k79o85q06o47l79k22j80j1L28N93
60416D55468P21J016J603K193K606L013L341L063K040R05J26n96j400j522l83
60401D72194J206J959J794J668K016K369K339K066J772J643K023L009M037M518
60387E04613M598M697M631M088L454L276L201K540J599J387K095K949L423L606
60373E50157L417K616J636J352J806K147J925J523J242R44P73J155J928K336K199
60358E77156K229K878L757M414M949N596O414P508Q836R762R664Q991Q795R120
$$ y = [664976, 640260, 618779, 599682, 582509, 567813, 555945, 545971, 536358, 526349, 516293, 507051, 499393, 493565, 489060, 485098, 481544, 478962, 477614, 476879, 475957, 474669, 473195, 471454, 469218, 466589, 463967, 461661, 459817, 458503, 457644, 457028, 456595, 456539, 456950, 457512, 457756, 457477, 456792, 455986, 455339, 454960, 454738, 454558, 454547, 454875, 455468, 456189, 457205, 458808, 461001, 463607, 466620, 469961, 473024, 475064, 475969, 476095, 475499, 474099, 472577, 472194, 473400, 475359, 477153, 478821, 480837, 483206, 485545, 487611, 489383, 491026, 493049, 496058, 500095, 504613, 509211, 513908, 518539, 522627, 526081, 529357, 532558, 535098, 536697, 538084, 540179, 543128, 546551, 550157, 553574, 556190, 557826, 559178, 560984, 563131, 565056, 566579, 567821, 568765, 569538, 570693, 572621, 574957, 577156, 579385, 582263, 586020, 590434, 595383, 600979, 607393, 614901, 623737, 633499, 643163, 652154, 660949, 670069]
60344F70069Q930P666N831L791J290j481l563m578n409o814q334r194r410r313
60330F39481q718p379n679m229l285l012l610m714n328m974m269l833l404k606
60316E74441j807j383p55Q56L132N025O204P383R184J1357J3195J4368J5229J6358
60302F72787J7729J8454J7682J5607J3063J0155O214J235l620p348j0169j2695
60290G39094j4852j6208j6766j6693j5821j4062j1917j0051q635p571o884o440
60278E93194n769m683l682l261l281l450l862m584n171n192m808m306l558k521
60264E35066j783j940k720l355l480l195k592j850j335j094n54N81J613J711J190
60249E16263J067J523J692J054J91n5K97N11J33m88o79k99P1p0l79j23P70J696
$$ y = [670069, 678999, 686665, 692496, 696287, 697577, 696096, 692533, 687955, 682546, 675732, 667398, 658204, 648794, 639481, 630763, 623384, 617705, 613476, 610191, 607179, 603569, 598855, 593527, 588553, 584284, 580451, 577047, 574441, 572634, 571251, 570496, 571352, 574484, 579509, 585713, 593096, 602280, 613637, 626832, 641200, 656429, 672787, 690516, 708970, 726652, 742259, 755322, 765477, 771691, 772926, 769306, 761958, 751789, 739094, 724242, 708034, 691268, 674575, 658754, 644692, 632775, 622724, 614089, 606518, 599634, 593194, 587425, 582742, 579060, 575799, 572518, 569068, 565206, 560622, 555451, 550259, 545451, 541145, 537587, 535066, 533283, 531343, 528623, 525268, 521788, 518593, 516001, 514151, 512816, 511722, 511168, 511749, 513362, 515073, 516263, 517330, 518853, 520545, 521599, 521790, 521735, 522032, 522543, 522676, 522188, 521509, 521210, 521281, 521211, 520832, 520709, 521479, 523175]
60231E23175K356K965L406L044J855R45J258K369L226L519L646L789L813L853
60217E63219M280N143O171P174Q069Q710R054R299R469R248Q587Q030Q018Q253
60203F72724Q261Q150Q184Q053P253N925M685L813L191K828K782K699K043P56
60189G41347p14j993l044l957m896n993o999p300o719o030o169p088p868p839
60175F64738p152o379n888n566m934l688k252j441j466j618j229m14L11O43L97
60160F24062n33j676k085j489p77p43j012q11j61M66J119K050K806K674J848J279
60144F27017J477K115K742L180L375L456L813M573N278N626O137P384Q870R522
60130F94565R061Q115P155O134N053M144L405K632J866J341J129J253J900K961
$$ y = [523175, 525531, 528496, 531902, 534946, 536801, 537746, 539004, 541373, 544599, 548118, 551764, 555553, 559366, 563219, 567499, 572642, 578813, 585987, 594056, 602766, 611820, 621119, 630588, 639836, 648423, 656453, 664471, 672724, 680985, 689135, 697319, 705372, 712625, 718550, 723235, 727048, 730239, 733067, 735849, 738548, 740591, 741347, 740633, 738640, 735596, 731639, 726743, 720750, 713751, 706451, 699732, 693702, 687533, 680445, 672577, 664738, 657586, 651207, 645319, 639753, 634819, 631131, 628879, 627438, 625972, 624354, 623125, 622711, 623022, 623665, 624062, 623529, 621853, 619768, 618279, 617502, 616759, 615747, 614936, 614775, 615241, 616360, 618410, 621216, 623890, 625738, 627017, 628494, 630609, 633351, 636531, 639906, 643362, 647175, 651748, 657026, 662652, 668789, 676173, 685043, 694565, 703626, 711741, 718896, 725030, 730083, 734227, 737632, 740264, 742130, 743471, 744600, 745853, 747753, 750714]
60116G50714L754L840L703L929M194L889L218K682J938L93j427k410k638l278
60102G72501m643n807o295o730p364p361o279n060m684m734m238l213k320j623
60088G02150o56M97J126R41M59K82M41N85M41j2n50q31o53k94m44j605l478n173
60070F93226o142o746p521q199q113p527p577q544r149q274o536n301m741m018
60056E94838k947k253k240k348k106j643j109m17L42R59J655K824M223N191N714
60041F00683O401P305P684P159O272N594N003M169L079J837M84p13j396j675k022
60026F49864k541l038l737n079o674p522p546p866r047j0061r773q633p984q200
60012E52163q489q187p437o598n748m900m205l721l262k593j728q93k16M89J465
$$ y = [750714, 754468, 758308, 762011, 765940, 770134, 774023, 777241, 779923, 781861, 782254, 780827, 778417, 775779, 772501, 767858, 762051, 755756, 749026, 741662, 734301, 728022, 722962, 718278, 713544, 709306, 706093, 703773, 702150, 701494, 701991, 703117, 704058, 704517, 704799, 705240, 705825, 706266, 706254, 705704, 704873, 704220, 703926, 703482, 701877, 698399, 693226, 687084, 680338, 672817, 664618, 656505, 648978, 641401, 632857, 623708, 615434, 608898, 603597, 598856, 594838, 591891, 589638, 587398, 585050, 582944, 581301, 580192, 579775, 580117, 581076, 582731, 585555, 589778, 594969, 600683, 607084, 614389, 622073, 629232, 635504, 641098, 646101, 650270, 653349, 655186, 655670, 654957, 653561, 651886, 649864, 647323, 644285, 640548, 635469, 628795, 621273, 613727, 605861, 596814, 586753, 576980, 568347, 560363, 552163, 543674, 535487, 528050, 521452, 515704, 510804, 506599, 502878, 499616, 497023, 495295, 494402, 494186, 494675, 496140]
59997D96140K495K990K715K169J888J831J813K136L040L964M185M016M392N367
59983E39141N938N482M392L172J832N06k72m34p72j934l578m942n671n749n100
59968E32011l831k479j597j253j053m34J015L042M627M931M335L869L711L149
59954E50043J977R37M75J08n89j238j480j604j847j839j369r50r92j039o02j40
59938E39851m22j343k048k033j507q88m62l04j67L75J445K786M159N429O230O250
59922E57351N958O173O740O585N446M461M399M475L806K993L055L590L398K507
59908F20937K070K453K735K338J895K142K817L201L007K349J376M30J23P19J615
59893F50207J945J664J665K549L634L694K684K047K862M336M921M534M514N388
$$ y = [496140, 498635, 501625, 504340, 506509, 508397, 510228, 512041, 514177, 517217, 521181, 525366, 529382, 533774, 539141, 545079, 550561, 554953, 558125, 559957, 560463, 560191, 559757, 558985, 557051, 553473, 548531, 542860, 537111, 532011, 528180, 525701, 524104, 522851, 521798, 521364, 522379, 525421, 530048, 534979, 539314, 543183, 546894, 550043, 552020, 552957, 553432, 553540, 552951, 551713, 550233, 548629, 546782, 544943, 543574, 542624, 541632, 540593, 539991, 539851, 539429, 538086, 536038, 534005, 532498, 531610, 531148, 530844, 530677, 531052, 532497, 535283, 539442, 544871, 551101, 557351, 563309, 569482, 576222, 582807, 588253, 592714, 597113, 601588, 605394, 608387, 611442, 615032, 618430, 620937, 623007, 625460, 628195, 630533, 632428, 634570, 637387, 640588, 643595, 645944, 647320, 647750, 647873, 648592, 650207, 652152, 653816, 655481, 658030, 661664, 665358, 668042, 670089, 672951, 677287, 682208, 686742, 691256, 696644]
59879F96644O052N603M777M729N283N345M474L128J693K19j165k316l397m505
59865G26564n244n230m820m666m781m714m398m176m090l789l153k444j826j210
59851F72023m75N11J971L842N519O473O983P745Q836R620R610Q909P824O484M927
59836G60802L161J188p57k076k289j604o97o6J01m00j724l653n648p271q331q804
59820G21932q889q996r270r334q845q088p593p343o834n876m810l927l162k448
59806F26517j968j834j796j481q19j25J94K6l15l94j06K82M62K98k53j081j710
59789F15897j613r33n71j245k647l769l894l152k305k088k591l205l312k941k407
59774E79224j612l34R64J416J033Q23J341K019K310K651L564M583M953M911N358
$$ y = [696644, 702696, 708299, 713076, 717805, 723088, 728433, 732907, 736035, 737728, 737947, 736782, 734466, 731069, 726564, 721320, 716090, 711270, 706604, 701823, 697109, 692711, 688535, 684445, 680656, 677503, 675059, 673233, 672023, 671548, 672059, 674030, 677872, 683391, 689864, 696847, 704592, 713428, 723048, 732658, 741567, 749391, 755875, 760802, 763963, 765151, 764394, 762318, 760029, 758425, 757728, 757662, 757763, 757363, 755639, 751986, 746338, 739067, 730736, 721932, 713043, 704047, 694777, 685443, 676598, 668510, 660917, 653574, 646740, 640864, 636054, 632127, 628965, 626517, 624549, 622715, 620919, 619438, 618619, 618494, 618688, 618714, 618399, 618005, 617899, 618181, 618643, 618941, 618688, 617607, 615897, 614284, 613351, 612780, 611535, 608888, 605119, 601225, 598073, 595768, 593680, 591089, 587884, 584572, 581631, 579224, 577612, 577278, 578242, 579658, 580691, 581514, 582855, 584874, 587184, 589835, 593399, 597982, 602935, 607846, 613204]
59759F13204O496P525P718P252O989P647R064J0094R727Q441P890Q849J0208J0466
59745G31570R493Q194P087O132N408M976M328K913J026n83j738k743l514l736
59731G68813l691m018m569m509l715l191l680m501m321k802j003k51q17j778k165
59716G23802k015k066k500k601j883q92m58n79n78m0R53K111K997L116K592K365
59700G24324L169M527N389N542N698O333P052P201O603N641M854M393L741K274
59686G96741J60j683k706l189l399l131k566k668l878n188n521n409o147p697
59672G43719q685q359p361o491n779m986m201l623l319l311l398k953j494N22
59658F80281K035K545K450K384K698L500M608N500N794N646N346M723L476J780
$$ y = [613204, 619700, 627225, 634943, 642195, 649184, 656831, 665895, 675989, 685716, 694157, 702047, 710896, 721104, 731570, 741063, 749257, 756344, 762476, 767884, 772860, 777188, 780101, 781127, 780544, 778806, 776063, 772549, 768813, 765122, 761104, 756535, 752026, 748311, 745120, 741440, 736939, 732618, 729816, 728813, 728562, 727745, 725967, 723802, 721787, 719721, 717221, 714620, 712737, 711845, 711387, 710808, 710230, 710190, 711143, 713254, 716251, 719367, 721959, 724324, 727493, 732020, 737409, 742951, 748649, 754982, 762034, 769235, 775838, 781479, 786333, 790726, 794467, 796741, 796901, 795218, 792512, 789323, 785924, 782793, 780227, 777559, 773681, 768493, 762972, 757563, 751416, 743719, 735034, 726675, 719314, 712823, 707044, 702058, 697857, 694234, 690915, 687604, 684206, 681253, 679759, 680281, 682316, 684861, 687311, 689695, 692393, 695893, 700501, 706001, 711795, 717441, 722787, 727510, 730986, 732766]
59644G32766N0j627l313m815n963o947p865q391q429q453q537p792n711l403k381
59629F49189k596k876k782k765k874k790k936m037n536n953n012m055m060m478
59615E96439m479m071l563k983k514k539k758k256q29N53J097J108J191J344J392
59600E77132J489J713J749J455J170J123J063P63L45o6m00k99N41J558J694Q02
59584E91832j85o87j144j866k255j824j177j243k022k759k978k780k394j919j440
59569E65159j117j138j559k024j890j004j22j3m26n54k05K08N59R68J103N40k93
59552E58192n31j56J30K16O30J349J770J889K363L245L992M814O621R297J1435
59537F05256J2261J2531J3051J3597J3795J3655J2570R355M212o43l305m060m024
$$ y = [732766, 732816, 731189, 727876, 723061, 717098, 710151, 702286, 693895, 685466, 677013, 668476, 660684, 654973, 651570, 649189, 646593, 643717, 640935, 638170, 635296, 632506, 629570, 625533, 619997, 614044, 609032, 604977, 600917, 596439, 591960, 587889, 584326, 581343, 578829, 576290, 573532, 571276, 570447, 571000, 572097, 573205, 574396, 575740, 577132, 578621, 580334, 582083, 583538, 584708, 585831, 586894, 587657, 588002, 587936, 587536, 587237, 587778, 589336, 591030, 591832, 591647, 590960, 589816, 587950, 585695, 583871, 582694, 581451, 579429, 576670, 573692, 570912, 568518, 566599, 565159, 564042, 562904, 561345, 559321, 557431, 556427, 556305, 556292, 555866, 555312, 555107, 555315, 555874, 556842, 557945, 558485, 558192, 557661, 557505, 557635, 557851, 558481, 559830, 561600, 563489, 565852, 569097, 573089, 577903, 584524, 593821, 605256, 617517, 630048, 643099, 656696, 670491, 684146, 696716, 706071, 710283, 709640, 706335, 702275, 698251]
59524F98251l232j337R37K433L029L258L108K293J188K47r92l198n884p791q459
59509F83851q520q637q971r457r930j0020r519q652p644o353m735l196k115j456
59495E84646j189j410j713j236R5J193J276R65J181J817K290K673L332M032M330
59480F02282M360M477M649M894N642O853P457O682N253M335L888L207K432K213
59466F68624K227J502P7r16q88l71J97J109K540L975M942N613O359P160P796Q262
59450G18208Q800R602J0518J0919J0055P861N173K907J156o38k939n730q524j0510
59436G56858j1091j0548r760r117q233o933n754n102m552l553k125n49J091K632
59422F83264L869N236P622J1071J4596J7679K0811K4023K6228K6877K6890K6795
$$ y = [698251, 695019, 693682, 694619, 697052, 700081, 703339, 706447, 708740, 709928, 710175, 709183, 705985, 700101, 692310, 683851, 675331, 666694, 657723, 648266, 638336, 628316, 618797, 610145, 602501, 596148, 591413, 588217, 586102, 584646, 583457, 582047, 580334, 579098, 579193, 580386, 581662, 582627, 583808, 585625, 587915, 590588, 593920, 597952, 602282, 606642, 611119, 615768, 620662, 626304, 633157, 640614, 647296, 652549, 656884, 660772, 663979, 666411, 668624, 670851, 672353, 672430, 671514, 670626, 670255, 670452, 671561, 674101, 678076, 683018, 688631, 694990, 702150, 709946, 718208, 727008, 736610, 747128, 758047, 768102, 775963, 781136, 784043, 785199, 784561, 781622, 775892, 767368, 756858, 745767, 735219, 725459, 716342, 708109, 701176, 695422, 690320, 685768, 682215, 680090, 679541, 680632, 683264, 687133, 692369, 699991, 711062, 725658, 743337, 764148, 788171, 814399, 841276, 868166, 894961]
59410H94961K5509K2382J8945J6560J3517P055k105r705j2642j1607q878n665
59398I48327k449M4J537K588L088J307m283j2623k0368k4556k4577k1879j8366
59385H27790j5113j2280r828p904o452n116l883l251l195k702j160M13O28k39
59371G57708o91k23K18j2l94l58j17O3M26J116J795K269K848L722M633N413O297
59354G84713P468Q753R997J1200J2255J3087J4065J5644J7555J8944J9430J9390
59342I52501J9169J8663J7763J6576J4974J2574R371N852K386j009m270p135r551
59329A047864j1707j3609j5076j6135j6997j7675j8025j8082j7892j7287j6301
59318H69078j5471j5088j4545j3201j1538j0511j0044r305q276p879q355q744
$$ y = [894961, 920470, 942852, 961797, 978357, 991874, 998929, 996824, 987119, 974477, 962870, 953992, 948327, 945878, 945922, 947459, 950047, 953135, 954442, 950159, 937536, 917168, 892612, 868035, 846156, 827790, 812677, 800397, 790569, 782665, 776213, 771097, 767214, 763963, 760768, 758066, 756906, 757319, 757947, 757708, 757017, 756794, 757012, 757000, 756606, 756248, 756131, 756194, 756620, 757736, 759531, 761800, 764648, 768370, 773003, 778416, 784713, 792181, 800934, 810931, 822131, 834386, 847473, 861538, 877182, 894737, 913681, 933111, 952501, 971670, 990333, 1008096, 1024672, 1039646, 1052220, 1061591, 1067443, 1069829, 1068820, 1064550, 1057415, 1047864, 1036157, 1022548, 1007472, 991337, 974340, 956665, 938640, 920558, 902666, 885379, 869078, 853607, 838519, 823974, 810773, 799235, 788724, 778680, 769375, 761099, 753220, 744865, 736121]
59306G36121q262p170n999m813l650k726j807k00K190M497O022P040Q106R218
59292G38567J0112J0757J1047J0451Q366M569p06o594j1452j3717j3325j1668
59280G36407r946q150n921l489j214J170M023O978R285J0828J2227J3967J5829
59267G81994J7167J7486J6728J5090J2709R667O358L480J355n09k766n341p636
59254H65782r246j0038r808q656p457p085p197o624n046l397k461j873q99N78
59240G86573K170L562M596N165N400N605N882O056O013N777N278M430L371K176
59226H52054N44j677l921n600p129r347j1916j3383j3024j1753j0815j0423j0115
59213G43495r693r229q645p818o822n755m601l516k854k683k573k056j104n8O30
$$ y = [736121, 727859, 720689, 714690, 709877, 706227, 703501, 701694, 701494, 703684, 708181, 714203, 721243, 729349, 738567, 748679, 759436, 770483, 780934, 789300, 793869, 793163, 786569, 775117, 761400, 748075, 736407, 726461, 718311, 712390, 708901, 707687, 708857, 712880, 719858, 729143, 739971, 752198, 766165, 781994, 799161, 816647, 833375, 848465, 861174, 870841, 877199, 880679, 882034, 881525, 878759, 873418, 865782, 856536, 846498, 836690, 828034, 820577, 813492, 806295, 799671, 794625, 791228, 788767, 786894, 785995, 786573, 788743, 792305, 796901, 802066, 807466, 813071, 818953, 825009, 831022, 836799, 842077, 846507, 849878, 852054, 852598, 850921, 847000, 841400, 834271, 824924, 813008, 799625, 786601, 774848, 764033, 753610, 743495, 733802, 724573, 715928, 708110, 701288, 695533, 690932, 687416, 684562, 681879, 679306, 677250, 676146, 676088, 676718]
59198F76718P37N48O96J427K255K752L215M049M893N208N291N844O721P072O664
59183G34090O044N556N051M576M321L959L046K040J850K278K144J130K72L12P59
59168G77428J070J558K517L388L536L111K530J815Q94p0j092k454m045n320o221
59153G78645p308q669r570r635r564j0124j1146j1989j2306j1934j0786r265q106
59140F48243p446o734n850n401n478n166l906k449j740j603j288o70p4N90J726
59125F02754L315M884N965O342O168O051O573P639Q738R822J1137J2286J2474
59112G04148J1801J1251J1171J0983J0581J0640J1005J0325Q085N697M518M029
59100H14234L153K146J821J720P17j125k648l302l473l383k814j882j174r96j226
$$ y = [676718, 677455, 678003, 678699, 680126, 682381, 685133, 688348, 692397, 697290, 702498, 707789, 713633, 720354, 727426, 734090, 740134, 745690, 750741, 755317, 759638, 763597, 766643, 768683, 770533, 772811, 774955, 776085, 776357, 776669, 777428, 778498, 780056, 782573, 785961, 789497, 792608, 795138, 796953, 797847, 797777, 796685, 794231, 790186, 784866, 778645, 771337, 762668, 753098, 743463, 733899, 723775, 712629, 700640, 688334, 676400, 665614, 656349, 648243, 640797, 634063, 628213, 622812, 617334, 612168, 608262, 605813, 604073, 602470, 601182, 600512, 600438, 601028, 602754, 606069, 610953, 616918, 623260, 629428, 635479, 642052, 649691, 658429, 668251, 679388, 691674, 704148, 715949, 727200, 738371, 749354, 759935, 770575, 781580, 791905, 799990, 805687, 810205, 814234, 817387, 819533, 821354, 823074, 823791, 822666, 820018, 816716, 813243, 809860, 807046, 805164, 803990, 802994, 801768]
59085H01768j708k290k715l024l740n085o440p192p629q279q888q821q122p380
59071G20455o882o532o314o193n863n257m890n121n499n453n086m663l882k548
59057F46272j404j328k059k627k658k373j737p16j22r01k485l081j919k81J50
59042F22731p28j635j571o79K92Q80J182J451J686J715J576J570J952K802M118
59027F37342N720P179Q270R420J1195J3387J5252J6525J7416J7598J6283J3612
59015G89199J0918R077P409M793J234k224m595n519n272m650m332m136l476k459
59001G85967j656p75J101L697N392N479N163N429N369L794J335l84r15j017j235
58986H16744j614k267l170l860m144m520n128n121l891k053k90J755M285O246
$$ y = [801768, 800060, 797770, 795055, 792031, 788291, 783206, 776766, 769574, 761945, 753666, 744778, 735957, 727835, 720455, 713573, 707041, 700727, 694534, 688671, 683414, 678524, 673403, 667904, 662451, 657365, 652702, 648820, 646272, 644868, 643540, 641481, 638854, 636196, 633823, 632086, 631370, 631248, 630347, 627862, 624781, 622862, 622581, 622731, 622003, 620368, 618797, 618118, 618410, 619290, 620472, 621923, 623609, 625324, 626900, 628470, 630422, 633224, 637342, 643062, 650241, 658511, 667931, 679126, 692513, 707765, 724290, 741706, 759304, 775587, 789199, 800117, 809194, 816603, 821396, 822630, 820406, 815811, 810292, 805020, 800370, 796038, 791902, 788426, 785967, 784311, 783536, 784637, 788334, 793726, 799205, 804368, 809797, 815166, 818960, 820295, 819911, 818996, 817979, 816744, 815130, 812863, 809693, 805833, 801689, 797169, 792041, 786920, 783029, 780976, 780686, 782441, 786726, 792972]
58972G92972O748O711P526Q907R681J0011J0981J2429J3015J2382J1536J0969
58960I13868R983Q062N652L271R91j138l086n360q503j2050j4899j6609j7518
58947H62664j7793j7403j6780j6390j5759j4031j1394q903p048n520m199l189
58935G24255k105o06M70r2j877l011k597j729j707k399k919k910k651k491k646
58920F94985l045l205k717j860j260j056r79r44q84l28J007K498L428M146N448
58905F95234P118Q263Q867R704J0918J1968J2966J4570J6366J6888J5768J4497
58893H43127J4464J5333J6075J6628J7606J9049K0322K0975K1107K1008K0751
58882A046445K0027J8322J5377J1508P274L082o44l446n444p556j0377j3240j5040
$$ y = [792972, 799720, 806431, 813957, 822864, 832545, 842556, 853537, 865966, 878981, 891363, 902899, 913868, 923851, 931913, 937565, 940836, 941827, 940689, 937603, 932243, 923740, 911690, 896791, 880182, 862664, 844871, 827468, 810688, 794298, 778539, 764508, 753114, 744211, 737163, 731643, 727444, 724255, 722150, 721544, 722014, 721922, 720045, 717034, 714437, 712708, 711001, 708602, 705683, 702773, 700122, 697631, 694985, 691940, 688735, 686018, 684158, 682898, 681842, 680863, 679919, 679035, 678707, 679714, 682212, 685640, 689786, 695234, 702352, 710615, 719482, 729186, 740104, 752072, 765038, 779608, 795974, 812862, 828630, 843127, 857591, 872924, 888999, 905627, 923233, 942282, 962604, 983579, 1004686, 1025694, 1046445, 1066472, 1084794, 1100171, 1111679, 1118953, 1122035, 1121391, 1117945, 1112501, 1104945, 1094568, 1081328, 1066288]
58869A066288j5650j5770j5761j5509j5082j4633j3930j2888j2140j2237j2633
58858I10055j2526j2242j2616j3365j3390j2549j1756j1401j0916r988r057q373
58846G71876p653o800o124n773n771o436p852r164r430q983q827r028q825q069
58832F63141p193o057m307k726k526l305l307j884j35J054K008K892L104K567
58818F43326K221K560K984L061L169L348K842J478K57j07j01k91l69l7K19j01
58802F64459q28j688k689l522l630l215l126l381l054k012j474k102k865k568
58788F28305j417j89J060K508L693M152M296M808N691O573P349P938P976P361
58774F90104O535N770M689K953Q43j224l173m966o415p545q508r028q662p697
$$ y = [1066288, 1050638, 1034868, 1019107, 1003598, 988516, 973883, 959953, 947065, 934925, 922688, 910055, 897529, 885287, 872671, 859306, 845916, 833367, 821611, 810210, 799294, 789306, 780249, 771876, 764223, 757423, 751299, 745526, 739755, 733319, 725467, 716303, 706873, 697890, 689063, 680035, 671210, 663141, 655948, 649891, 645584, 642858, 640332, 637027, 633720, 631836, 631701, 632755, 634763, 637655, 640759, 643326, 645547, 648107, 651091, 654152, 657321, 660669, 663511, 664989, 665246, 665139, 665038, 664747, 664378, 664341, 664560, 664459, 663631, 661943, 659254, 655732, 652102, 648887, 645761, 642380, 639326, 637314, 635840, 633738, 630873, 628305, 626888, 626699, 627759, 630267, 633960, 638112, 642408, 647216, 652907, 659480, 666829, 674767, 682743, 690104, 696639, 702409, 707098, 710051, 710894, 709670, 706497, 701531, 695116, 687571, 679063, 670035, 661373, 653676]
58760F53676o970o660o187n403m855m671m251l363k435j486L3J971L186L081K436
58745F18102K228K597L353M405N269N263M737M960O317P623P881P506P264P120
58731F94625O891O917P285P303O536N542M873M345L827L833M472M816M169L188
58717G68622K944L539M420N354O311O965O948O238M833K643J2k327m159n984q076
58702G98283j0097j1873j3613j5223j6267j6868j7577j8176j7746j6248j4802
58691F29793j4012j3212j1811j0211q858p587o409n807n772n620n164m930m885
58678E25515m298l216k603k573k023n88O65J193J944L545N196O306P550R284J0485
58663E56382J0479J0189J0455J0512R494P949O468M190L60l799o369p104p126
$$ y = [653676, 646706, 640046, 633859, 628456, 623601, 618930, 614679, 611316, 608881, 607395, 607428, 609399, 612585, 615666, 618102, 620330, 622927, 626280, 630685, 635954, 641217, 645954, 650914, 657231, 664854, 672735, 680241, 687505, 694625, 701516, 708433, 715718, 723021, 729557, 735099, 739972, 744317, 748144, 751977, 756449, 761265, 765434, 768622, 771566, 775105, 779525, 784879, 791190, 798155, 805103, 811341, 816174, 818817, 818829, 816502, 812343, 806359, 798283, 788186, 776313, 762700, 747477, 731210, 714342, 696765, 678589, 660843, 644595, 629793, 615781, 602569, 590758, 580547, 571689, 564102, 557693, 551886, 546114, 540494, 535330, 530400, 525515, 521217, 518001, 515398, 512825, 510802, 510214, 510879, 512072, 514016, 517561, 522757, 529063, 536613, 545897, 556382, 566861, 577050, 587505, 598017, 607511, 615460, 621928, 626118, 626478, 622679, 616310, 609206, 602080]
58650F02080p120p084p127p203o750n681m848m652m154k680j138n78n21RP96J133
58634E44482J231J573J735J173M31K84M08J14m16o95r34j343j366p20j91k40R7
58617E45623J671L573M478M628N046N649N663N147M611L858K579J495J387J668
58603E97076J260L49j01j2p9m86r32j501k299k821k645k186j798q95R94L182M904
58586E92010O519Q438R891J0093R733R918J0431J0454J0243J0589J1243J1242
58574G10804J0358R109P852O953P141Q623J0559J2342J4532J7574K0709K3151
58562H59707K5225K7269K8656K9112K9548L0139K9097K5049J9320J4064R384M232
58550A130802r80m809p002q375r183r365r618j0501j1245j1147j1239j2840j5421
$$ y = [602080, 594960, 587876, 580749, 573546, 566796, 561115, 556267, 551615, 547461, 544781, 543643, 543065, 542544, 542553, 543349, 544482, 545713, 547286, 549021, 550194, 550625, 550909, 551317, 551431, 551015, 550320, 549386, 548043, 546677, 545957, 545766, 545526, 545623, 547294, 550867, 555345, 559973, 565019, 570668, 576331, 581478, 586089, 589947, 592526, 594021, 595408, 597076, 598336, 598685, 598584, 598572, 598493, 598007, 597075, 595574, 593275, 590454, 587809, 585623, 583825, 582930, 583924, 587106, 592010, 598529, 606967, 616858, 626951, 636684, 646602, 657033, 667487, 677730, 688319, 699562, 710804, 721162, 730271, 738123, 745076, 752217, 760840, 771399, 783741, 798273, 815847, 836556, 859707, 884932, 912201, 940857, 969969, 999517, 1029656, 1058753, 1083802, 1103122, 1117186, 1126570, 1130802, 1129822, 1125013, 1118011, 1109636, 1100453, 1091088, 1081470, 1070969, 1059724, 1048577, 1037338, 1024498, 1009077]
58537A009077j7724k0026k3226k6581k8352k8133k6658k4173k0811j7726j5861
58526G59806j4302j1825r145p677o996n732m158l470l300k285p01q5o29j241j748
58511F86512k812l930l816k609j597j026j96N55K07q76j315j013j059j571j575
58496F63879r32m21j40M03Q58O00K87J069K695M184N747Q002J0013J0439J0138
58481G16821J1236J3910J6324J7496J8013J8185J7711J6990J6611J5694J2741
58470H91732Q024L177j133n251q778j0940j2134j3136j3254j1453q501n880l331
58457H09142J91M011O719Q743J1234J3325J3374J2132J1578J1264Q991M669L03
58444I15676l480p537j1221j2726j2361j2176j2335j1202q978p689p394n903k783
$$ y = [1009077, 991353, 971327, 948101, 921520, 893168, 865035, 838377, 814204, 793393, 775667, 759806, 745504, 733679, 724534, 716857, 709861, 704129, 699971, 696501, 693201, 690916, 690215, 690130, 689501, 688260, 686512, 683700, 679770, 675954, 673345, 671748, 670722, 670526, 671081, 671288, 670412, 669097, 668084, 667025, 665454, 663879, 662947, 662526, 662386, 662789, 663647, 664247, 664534, 665603, 668298, 672482, 678229, 686231, 696244, 706683, 716821, 728057, 741967, 758291, 775787, 793800, 811985, 829696, 846686, 863297, 878991, 891732, 899756, 902933, 901800, 896549, 887771, 876831, 864697, 851561, 838307, 826854, 818353, 812473, 809142, 809333, 813344, 820063, 828806, 840040, 853365, 866739, 878871, 890449, 901713, 910704, 915373, 915676, 912196, 904659, 893438, 880712, 868351, 856175, 843840, 832638, 823660, 815971, 808577, 802674, 799891]
58431G99891j79R21J951L716N269O463Q484J1081J2324J1805J1172J0888R450
58418H93236O493L650J595q75m101o772q492j0300j2094j2488j1732j1774j2807
58405H13539j2718j0640q122o157m134k176j494j728j076M42R60M68J162L453
58391G71779N073M960M571M572L674J765P51J171J290N09M44J565K137J552J381
58376H07194K131K190J115N84J164J464J337K441M785O347P007Q948J2212J3885
58362H72804J3033J2317J3298J4158J3619J3141J3493J3031J1153R687R104P192
58350A016030L311J31o31n10o28L12K580L903L428L445N263P110P921R333J2023
58335A073021J4016J4481J5334J7242J8091J7138J6526J6875J5830J2810J0597
$$ y = [799891, 799712, 800633, 802584, 806300, 811569, 818032, 826516, 837597, 849921, 861726, 872898, 883786, 893236, 899729, 903379, 904974, 904099, 899998, 893226, 884734, 874434, 862340, 849852, 838120, 826346, 813539, 800821, 790181, 782059, 775902, 771768, 769592, 768098, 766370, 765294, 765736, 766696, 767164, 768326, 771779, 776852, 781812, 786383, 790955, 794629, 796394, 797145, 798316, 799606, 800115, 800559, 802124, 804261, 805813, 807194, 809325, 811515, 812630, 813214, 814378, 815842, 817179, 819620, 824405, 830752, 837759, 846707, 858919, 872804, 885837, 898154, 911452, 925610, 939229, 952370, 965863, 978894, 990047, 999734, 1008838, 1016030, 1019341, 1019472, 1018841, 1018331, 1017703, 1018015, 1020595, 1024498, 1027926, 1031371, 1036634, 1043744, 1051665, 1060998, 1073021, 1087037, 1101518, 1116852, 1134094, 1152185, 1169323, 1185849, 1202724, 1218554, 1231364, 1241961]
58324A241961J0159Q663M912J883J392J078o65j602l02Q59L23L11K282M046M306
58309A279606N319Q143J0046R677R854J2110J3576J2538J1965J3952J5784J5176
58297A417746J4404J5466J6200J5032J4476J6133J7290J6339J6245J8744K0546
58286A598621J9464J8713K0740K2518K1579K1033K3612K6324K6133K5506K7132
58275A851375K8647K7878K7879L1317L5182L6423L7533M1183M4788M5826M6956
58264B254987N0460N3293N3140N3451N6900N9961N9588N8869O0387O0710N7518
58253B879264N5148N6798N8502N7308N7728O3093O8502O9887P1936P9062Q6731
58242C603959R0277R3925J02257J11036J15775J20939J31132J41713J48036J55100
$$ y = [1241961, 1252120, 1260783, 1265695, 1267578, 1268970, 1270048, 1269383, 1267781, 1267479, 1268338, 1268661, 1268972, 1271254, 1275300, 1279606, 1284925, 1293068, 1303114, 1312791, 1322645, 1334755, 1348331, 1360869, 1372834, 1386786, 1402570, 1417746, 1432150, 1447616, 1463816, 1478848, 1493324, 1509457, 1526747, 1543086, 1559331, 1578075, 1598621, 1618085, 1636798, 1657538, 1680056, 1701635, 1722668, 1746280, 1772604, 1798737, 1824243, 1851375, 1880022, 1907900, 1935779, 1967096, 2002278, 2038701, 2076234, 2117417, 2162205, 2208031, 2254987, 2305447, 2358740, 2411880, 2465331, 2522231, 2582192, 2641780, 2700649, 2761036, 2821746, 2879264, 2934412, 2991210, 3049712, 3107020, 3164748, 3227841, 3296343, 3366230, 3438166, 3517228, 3603959, 3694236, 3788161, 3890418, 4001454, 4117229, 4238168, 4369300, 4511013, 4659049, 4814149]
58232D814149J67896J81362J90481K00753K17579K35305K48508K63691K87362
58223F807086L13342L35026L58989L92618M29891M64181N02951N54290O11543
58214A0769917O67740P31976Q14368R09180J011246J133734J290131J475413J685846
58205B0489551J938721K250007K614100L031521L534223M157912M918903N849506
58197D8784444P022311Q507108J0354185J2662650J5574588J9072068K2796665
58190A44774019K6178477K8740577L0202568L0380554K9209459K6854299K3480187
58183C39820140J8735009J1756614K137903r038697j9392696k6670494l0036218
58176B87311561l0132286k8211432k5359728k2301367j9522315j7337390j5835856
$$ y = [4814149, 4982045, 5163407, 5353888, 5554641, 5772220, 6007525, 6256033, 6519724, 6807086, 7120428, 7455454, 7814443, 8207061, 8636952, 9101133, 9604084, 10158374, 10769917, 11437657, 12169633, 12984001, 13893181, 14904427, 16038161, 17328292, 18803705, 20489551, 22428272, 24678279, 27292379, 30323900, 33858123, 38016035, 42934938, 48784444, 55806755, 64313863, 74668048, 87330698, 102905286, 121977354, 144774019, 170952496, 199693073, 229895641, 260276195, 289485654, 316339953, 339820140, 358555149, 370311763, 372449666, 363410969, 344018273, 317347779, 287311561, 257179275, 228967843, 203608115, 181306748, 161784433, 144447043, 128611187]
58169A28611187j4840361j3992905j2963495j1642853j0154384q691194p367815
58162D8958180o215841n245364m453708l804222l249474k771236k370873k035591
58154A8811871j744090j493296j290542j127597r87194q66931p73420p00088o32812
58145I195901n71015n22760m84710m46123m07203l75280l47864l16809k84684
58136E439453k60428k42805k23688k03643j89297j79187j66886j54613j49450
58127C669456j49050j44732j36077j29522j25113j17379j07213j00479r6632r0200
58117B473059q1905p7207p5501p1401o5224o1892o0952n7714n2787n0774n0945
58106A766757m8638m4526m3212m3948m1927l7581l5709l6465l5795l3762l3838
$$ y = [128611187, 113770826, 99777921, 86814426, 75171573, 65017189, 56325995, 48958180, 42742339, 37496975, 33043267, 29239045, 25989571, 23218335, 20847462, 18811871, 17067781, 15574485, 14283943, 13156346, 12169152, 11302221, 10528801, 9828713, 9195901, 8624886, 8102126, 7617416, 7171293, 6764090, 6388810, 6040946, 5724137, 5439453, 5179025, 4936220, 4712532, 4508889, 4319592, 4140405, 3973519, 3818906, 3669456, 3520406, 3375674, 3239597, 3110075, 2984962, 2867583, 2760370, 2659891, 2563259, 2473059, 2391154, 2313947, 2238446, 2167045, 2101821, 2039929, 1978977, 1921263, 1868476, 1817702, 1766757, 1718119, 1673593, 1630381, 1586433, 1544506, 1506925, 1471216, 1434751, 1398956, 1365194, 1331356]
58095A331356l5017l3099k8995k7436k8115k6339k1877j9105j8706j7182j4408
58084A061077j3956j5786j6037j4372j4399j6570j7409j6159j5766j6859j6952
58073H86812j5840j5868j6782j6099j4377j4425j5510j4237j0927r187r384q476
58061G25700o292n984q005r312q976r119j0025r619q120q120r711j0325r513r084
58047F03495q777o691l823l094m043l581j805j782l644m292l179l025m393m849
58033E46517m039m445o353o987n655n037o373p780q139q509r010q356p017o870
58019D51947p392o311m114l612m827m836k996j815k190k258j549j747k696k126
58005D03478r1P11k41m90O54J014M1q1J180J562L69l18K4q11l291m754m022l362
$$ y = [1331356, 1296339, 1263240, 1234245, 1206809, 1178694, 1152355, 1130478, 1111373, 1092667, 1075485, 1061077, 1047121, 1031335, 1015298, 1000926, 986527, 969957, 952548, 936389, 920623, 903764, 886812, 870972, 855104, 838322, 822223, 807846, 793421, 777911, 763674, 752747, 743560, 734176, 725700, 719408, 713424, 705419, 696107, 687131, 678012, 667987, 658368, 650248, 642128, 632417, 622092, 612579, 603495, 594718, 588027, 584204, 581110, 577067, 573486, 571681, 569899, 566255, 561963, 558784, 555759, 551366, 546517, 542478, 538033, 531680, 524693, 519038, 514001, 507628, 499848, 491709, 483200, 474190, 465834, 458817, 451947, 444555, 438244, 434130, 430518, 425691, 420855, 417859, 416044, 413854, 411596, 410047, 408300, 405604, 403478, 403387, 404098, 403857, 403367, 404021, 405035, 405076, 404995, 406175, 407737, 408106, 407788, 407812, 407001, 403710, 398956, 394934, 391572]
57987C91572m192m748l725k561k305j782n93n72k420m037l967l516l899m108l130
57972C46017j678m43Q53J762J166k31l24Q98J246K55r9P86J085J33l95J26K00
57955C51357n12l92O47M40j488k834k564k379k991k702j157n69j499j256J502
57940C33603M393N587O700R047J0713J0200R566J0871J2457J1888J0015Q991Q449
57927D52480O704L932J352j140m066o526p588q130r299j0544j0915j0866j0969
57914C84425j0465q704o556m864l183j372n42r58r49M59J832J770J163J260J538
57899C54854J244J175K060K934K890K767L376L771L069K259K378K591J828Q07
57885C88003N88P25M41J97L63q1j823l655m248m156m483n008n134n209n473n136
$$ y = [391572, 387380, 382632, 378907, 376346, 374041, 372259, 371666, 371094, 368674, 364637, 360670, 357154, 353255, 349147, 346017, 344339, 343896, 344749, 346511, 347677, 347446, 347122, 348020, 349266, 349521, 349422, 350208, 351293, 351426, 351031, 351157, 351357, 350845, 350453, 351100, 351540, 350052, 347218, 344654, 342275, 339284, 336582, 335425, 334856, 333357, 332101, 333603, 337996, 343583, 350283, 359330, 370043, 380243, 389809, 400680, 413137, 425025, 435040, 444031, 452480, 459184, 463116, 464468, 463328, 459262, 452736, 445148, 437018, 427719, 417175, 406260, 395394, 384425, 373960, 365256, 358700, 353836, 350653, 349281, 348739, 347781, 346832, 347291, 349123, 350893, 352056, 353316, 354854, 356098, 357273, 359333, 362267, 365157, 367924, 371300, 375071, 378140, 380399, 382777, 385368, 387196, 388003, 388591, 389316, 389757, 389954, 390317, 390236, 388413, 384758, 380510, 376354, 371871, 366863, 361729, 356520, 351047, 345911]
57869C45911l908k891k661k121o36N23L94J43J060K513L525M560O053O993O817
57854C66275O886Q211R400Q906P552O852O436N289L961L332K549M65k097l613
57840D30404m271n085n805n748n544o044o541o044n216n124n195m408l339k976
57826C59064k700j544l98o37j521j289j26K46n93j484j864k179k494k450k346
57811C37685k676l018k858k791l501m344m487m577n518o458n945m380l371l162
57797B80599k652j582q42p54o79k66K34P05J132J218J078J621L254N011N987O626
57781C00690P446P757P095O589P321Q439Q627Q274Q362Q343P167N407M306L537
57767C99360K001j8j539k950n162p447q352q173q321q760q364p355o964o958n882
$$ y = [345911, 342003, 339112, 336451, 334330, 333694, 334217, 334611, 334754, 335814, 338327, 341852, 346412, 352465, 359458, 366275, 373161, 381372, 390772, 399678, 407230, 414082, 420518, 425807, 429768, 433100, 435649, 436114, 434017, 430404, 426133, 421048, 415243, 409495, 403951, 397907, 391366, 385322, 380106, 374982, 369787, 365379, 362040, 359064, 356364, 354820, 354422, 353785, 352264, 350975, 350849, 351095, 350502, 349018, 347154, 344975, 342481, 340031, 337685, 335009, 331991, 329133, 326342, 322841, 318497, 314010, 309433, 303915, 297457, 291512, 287132, 283761, 280599, 277947, 276365, 275523, 274769, 274090, 273824, 274058, 274763, 275895, 277113, 278191, 279812, 283066, 288077, 294064, 300690, 308136, 315893, 322988, 329577, 336898, 345337, 353964, 362238, 370600, 378943, 386110, 391517, 395823, 399360, 401361, 401343, 399804, 396854, 391692, 384245, 375893, 367720, 359399, 350639, 342275, 334920, 327956, 320998, 315116]
57752C15116l768k206j730j238k39N12Q74J711L054L668K977J803Q23j81j229
57737C19947j786j832j978k275k136j536r72k86J079K630L046K028O94M0J32P52
57721C17547J613K022J533Q68J051J821K082J579Q49j25j677l218l772l633l919
57706C14621m647m812m275l936m019l819l227k962l126k956k251j719j677j634
57692B69561j292q58l47K89M55m29j699k095j448n83K46J386K600L373M274O487
57676B79920J0031J3934J8028K3093K9194L5466M1620M8069N4330N8731O0041
57665F72457N8280N3685M5867L4138J7891k711k5337m5304n8439o4072o4233o0725
57653E61497n4566m7412m1204l6332l1922k7782k4311k0907j6570j2025r072p812
$$ y = [315116, 311348, 309142, 307412, 306174, 305935, 306447, 307321, 309032, 312086, 315754, 318731, 320534, 321357, 321176, 319947, 318161, 316329, 314351, 312076, 309940, 308404, 307432, 307146, 308225, 310855, 313901, 315929, 316623, 316663, 316795, 317547, 319160, 321182, 322715, 323583, 324634, 326455, 328537, 330116, 330965, 330840, 329163, 325945, 322173, 318540, 314621, 309974, 305162, 300887, 296951, 292932, 289113, 285886, 282924, 279798, 276842, 274591, 272872, 271195, 269561, 268269, 267411, 267064, 267353, 267808, 267379, 265680, 263585, 262137, 261554, 261800, 263186, 265786, 269159, 273433, 279920, 289951, 303885, 321913, 345006, 374200, 409666, 451286, 499355, 553685, 612416, 672457, 730737, 784422, 830289, 864427, 882318, 879607, 854270, 808966, 750527, 686455, 622222, 561497, 506931, 459519, 418315, 381983, 350061, 322279, 297968, 277061, 260491, 248466, 239394, 231582]
57641B31582o561m623l094k596k384j962j706j465m89Q67J259N24o3M8R5k39m52
57624B08741p52j820k882k393r33q48k497l545k822k078k739l645l578l456m195
57609A70558m597l479j976j704k172k036j520j562j684p83Q34J913K057J693Q91
57594A56433l17j287j647k030k825l140k177p39q2j68k63k92m44k89L78P26J48
57577A41985n60n11l14r43j940k214j935k094k707k980k799k737k815k550j946
57562A12940j381q03o0L78O6m24j49Q63J801K245K355K289K266K752L724M249
57546A33111L624K467J822J739J551J067N70J41j64J18J163K250K618K520K575
57531A57172K645K297J854J943K325K192J376M89Ml3L07Q24J111J064J020R08
$$ y = [231582, 225021, 220398, 217304, 214708, 212324, 210362, 208656, 207191, 206702, 207569, 208828, 209352, 209289, 209337, 209432, 209193, 208741, 207989, 206169, 203287, 200894, 199961, 199113, 196616, 193071, 190249, 188171, 185432, 181787, 178209, 174753, 170558, 165961, 162482, 160506, 158802, 156630, 154594, 153074, 151512, 149828, 149045, 149879, 151792, 153849, 155542, 156433, 156116, 154829, 153182, 151152, 148327, 145187, 143010, 142271, 142189, 142021, 141758, 141466, 141022, 140733, 141111, 141837, 141985, 141425, 140914, 140600, 139657, 137717, 135503, 133568, 131474, 128767, 125787, 122988, 120251, 117436, 114886, 112940, 111559, 110756, 110696, 111074, 111140, 110716, 110567, 111430, 113231, 115476, 117831, 120120, 122386, 125138, 128862, 133111, 136735, 139202, 141024, 142763, 144314, 145381, 145951, 146092, 145928, 146046, 147209, 149459, 152077, 154597, 157172, 159817, 162114, 163968, 165911, 168236, 170428, 171804, 172293, 172297, 172264, 172571, 173395, 174506, 175570, 176590, 177498]
57515A77498o0k140m151m712l905k900k395k367k841l874m928n158m402l332k699
57500A27634k781l262l462l046k615k941l591l330k119j416j960k619k330j709
57486I0453j680j722r90k3K24J65P82J690J744J128J091J817K141J404J67r62
57470I7429j888k425k322j975k011k156j619n02K83M97P58J184J074J85p53j153
57454H4606j244j298j110o44m05o95j095j047n85j48j1j04j09L05J123J910K226
57437H1675J972J273L55k77j14O36J165J218J304J431O93j058k240j506J92Q64
57421H7583K19m01m32p56j860k865k784j644n7J373K010J504M89J15O50J227J135
57404H5506N22l02j371k502k993k440j350n54l01k00K17J024J809K030J612J107
$$ y = [177498, 177438, 175298, 171147, 166435, 162530, 159630, 157235, 154868, 152027, 148153, 143225, 138067, 133665, 130333, 127634, 124853, 121591, 118129, 115083, 112468, 109527, 105936, 102606, 100487, 99071, 97111, 94492, 92162, 90453, 88773, 87051, 86061, 86038, 86262, 86427, 87209, 88899, 90643, 91771, 92862, 94679, 96820, 98224, 98391, 97429, 95541, 93116, 90794, 88819, 86808, 84652, 83033, 82531, 82814, 83311, 84069, 85253, 86327, 86512, 85759, 84606, 83362, 82064, 80954, 80310, 79905, 79210, 78115, 77068, 76483, 76335, 76324, 76220, 76111, 76416, 77539, 79449, 81675, 83647, 84920, 85275, 84998, 84884, 85520, 86685, 87903, 89207, 90638, 91331, 90273, 88033, 86527, 86719, 87583, 87802, 87401, 86969, 86213, 84353, 81488, 78704, 77060, 77003, 78376, 80386, 81890, 82379, 82494, 83144, 84371, 85506, 86028, 85726, 84355, 81853, 78860, 76420, 75070, 74516, 74215, 74015, 74232, 75256, 77065, 79095, 80707, 81814]
57388H1814J074J560K334L203L820L705K930K338K493K893K739J991J044o5j326
57373A12547k238k419k340k591k902k749k427k529k819k673k222j926j496m40
57359H0776O08M94o53j488j347p94l25K14P65Q99P47R29J352J222M59o3L0L3n20
57340H3338j055r33k92M68J151J382P88j33l23K57M19l97j138p60K13N59K5p77
57322H2792j454j946k040j607j059q67q65o18k01n3k32k89J51J000J760J806R25
57305G7203k53o68L3J025J267O04k74p24o43l35j81l73p36q75n90p5L25M55M18
57286G5603M45O70R34R23O00K87K15K87M59R53J741K260K136J750J584J372N39
57269I2758p68j771k001j612r11k18K6l87j050j371j218p74j66K68k9q97j113
$$ y = [81814, 82888, 84448, 86782, 89985, 93805, 97510, 100440, 102778, 105271, 108164, 110903, 112894, 113938, 113873, 112547, 110309, 107890, 105550, 102959, 100057, 97308, 94881, 92352, 89533, 86860, 84638, 82712, 81216, 80776, 81384, 81878, 81225, 79737, 78390, 77596, 77271, 77485, 78250, 79149, 79896, 80825, 82177, 83399, 83858, 83795, 83825, 83858, 83338, 82283, 81350, 81058, 81526, 82677, 84059, 84847, 84714, 84391, 84648, 85067, 84670, 83532, 82772, 82985, 83544, 83569, 82792, 81338, 79392, 77352, 75745, 74686, 73819, 72954, 72336, 72135, 72082, 71850, 71561, 71712, 72712, 74472, 76278, 77203, 76950, 76282, 76315, 77340, 78607, 79211, 78937, 78213, 77570, 77235, 77054, 76681, 75945, 75070, 74480, 74405, 74730, 75185, 75603, 76048, 76718, 77652, 78575, 79175, 79462, 79677, 79964, 80423, 81376, 83117, 85377, 87513, 89263, 90847, 92219, 92758, 91990, 90219, 88218, 86606, 85695, 85477, 85503, 85116, 84066, 82695, 81477, 80703, 80537, 80805, 80776, 79879, 78766]
57252G8766K7J422J533N03l68q09j597k559k356p00Q74J137P88J092J941K238
57236H1932J575N68k5N5N74J024J054R21J125J627J875J691J502J591J805K075
57220A00969K598L271L672L766M020M629N292N834O369O650O092M678L282K732
57206A63854L118M084N203N919N867N381N113N126N069N155O008P389Q201Q029
57192B43516P668P730P763P287O812P087Q076R250J0290J0914J0739R960R619
57179C56711J0471J1960J2927J3085J3125J3614J4284J4474J3988J3391J3446
57168E01476J4248J5144J5724J6496J8102K0267K2202K3725K5132K6256K6572
57157G25344K6235K5944K5742K4937K3401K2006K1429K1374K1230K0850K0404
$$ y = [78766, 78793, 80215, 81748, 82251, 81883, 81074, 79477, 76918, 74562, 73862, 74736, 75873, 76661, 77753, 79694, 81932, 83507, 84075, 84050, 84105, 84679, 85703, 86757, 87678, 88803, 90430, 92305, 93996, 95498, 97089, 98894, 100969, 103567, 106838, 110510, 114276, 118296, 122925, 128217, 134051, 140420, 147070, 153162, 157840, 161122, 163854, 166972, 171056, 176259, 182178, 188045, 193426, 198539, 203665, 208734, 213889, 219897, 227286, 235487, 243516, 251184, 258914, 266677, 273964, 280776, 287863, 295939, 305189, 315479, 326393, 337132, 347092, 356711, 367182, 379142, 392069, 405154, 418279, 431893, 446177, 460651, 474639, 488030, 501476, 515724, 530868, 546592, 563088, 581190, 601457, 623659, 647384, 672516, 698772, 725344, 751579, 777523, 803265, 828202, 851603, 873609, 895038, 916412, 937642, 958492, 978896]
57146I78896K0163K0483K1390K2145K2074K1636K1825K2571K2904K2679K2874
57135A219640K3965K5314K6482K7887K9755L1603L3374L5920L9682M3869M7554
57124A585045N0780N3938N7085O0462O4848P0703P7642Q5298R3974J03824J14123
57113B417722J24049J33669J43625J54335J66080J79576J96119K17230K44290
57104C976695K78502L21562L76515M47176N36233O44785P74432R28706J111444
57095I396050J324527J567225J834576K114218K387390K634636K833676K943355
57087B7035653K895605K625040K126888J490501Q67428L92210J14782j1186q3857
57078C7453064j86334l41187n14813o62285p69847q59159r59532j083047j223222
$$ y = [978896, 999059, 1019542, 1040932, 1063077, 1085151, 1106787, 1128612, 1151183, 1174087, 1196766, 1219640, 1243605, 1268919, 1295401, 1323288, 1353043, 1384646, 1418020, 1453940, 1493622, 1537491, 1585045, 1635825, 1689763, 1746848, 1807310, 1872158, 1942861, 2020503, 2105801, 2199775, 2303599, 2417722, 2541771, 2675440, 2819065, 2973400, 3139480, 3319056, 3515175, 3732405, 3976695, 4255197, 4576759, 4953274, 5400450, 5936683, 6581468, 7355900, 8284606, 9396050, 10720577, 12287802, 14122378, 16236596, 18623986, 21258622, 24092298, 27035653, 29931258, 32556298, 34683186, 36173687, 37041115, 37433325, 37548107, 37536921, 37453064, 37266730, 36925543, 36410730, 35748445, 34978598, 34119439, 33159907, 32076860, 30853638]
57069C0853638j367934j509243j644495j771797j883642j963869j992972j959078
57061A6760608j864656j724029j556186j379206j207258j049263r09444p88898
57053F281668o86122n96986n16640m42671l75754l17393k68114k27724j95585
57044B654679j70114j49134j31192j15806j02521r0785q0694p2554o5720n9043
57034A617116n2517m7179m3271l9639l5213k9929k4015j7511j0635l574M349J4191
57022A332173K5573L6060M2826M4675M2421L7464K9459J5490p135l6124o3584
57011A499298q1749q8886q8503q4165p7324o9196o1605n5309m9514m3788l8865
57000G60394l5151l1914k8509k5154k2107j9281j6853j5055j3221j0352o688l455
$$ y = [30853638, 29485704, 27976461, 26331966, 24560169, 22676527, 20712658, 18719686, 16760608, 14895952, 13171923, 11615737, 10236531, 9029273, 7980010, 7070566, 6281668, 5595546, 4998560, 4481920, 4039249, 3663495, 3346102, 3077988, 2850264, 2654679, 2484565, 2335431, 2204239, 2088433, 1985912, 1895127, 1814433, 1741879, 1676159, 1617116, 1564599, 1517420, 1474149, 1434510, 1399297, 1369368, 1345353, 1327842, 1317207, 1313633, 1317982, 1332173, 1357746, 1393806, 1436632, 1481307, 1523728, 1561192, 1590651, 1606141, 1599006, 1562882, 1499298, 1417549, 1328663, 1240160, 1155995, 1078671, 1009475, 947870, 892561, 843047, 799259, 760394, 725243, 693329, 664820, 639666, 617559, 598278, 581425, 566370, 553149, 542797, 536109, 532654]
56988E32654j094R27K652L601M135N099N989N265K728k46l107o816j1498j5392
56974E24897j7083j7137j6601j5414j3348j1038q981o641l550l15K389M817P323
56961D29318R608J1475J3370J5340J6409J5830J4058J1709Q364L212l685j1280
56949E33728j8078k2590k4085k3261k1377j8672j4786j0521p539n899l625N18
56937C63813N381R394J2632J5889J9015K1393K2979K3805K3260K0799J6474J0074
56925E64908R82j0145k0602k7667l0691l0560k8310k5191k2715k1264j9579j6733
56913C12433j3714j1841j0705r125p215n961n360m615l720l390l512l118j852
56900B28305l27R72K169L274L995M383M962O156Q006J0402J3097J5693J7933J9866
$$ y = [532654, 531560, 532487, 535139, 538740, 542875, 547974, 553963, 559228, 561956, 561710, 558603, 551787, 540289, 524897, 507814, 490677, 474076, 458662, 445314, 434276, 425295, 418654, 415104, 414789, 417178, 421995, 429318, 438926, 450401, 463771, 479111, 495520, 511350, 525408, 537117, 545481, 548693, 545008, 533728, 515650, 493060, 468975, 445714, 424337, 405665, 390879, 380358, 372819, 366920, 363295, 363813, 369194, 378588, 391220, 407109, 426124, 447517, 470496, 494301, 517561, 538360, 554834, 564908, 565890, 555745, 535143, 507476, 476785, 446225, 417915, 392724, 370009, 348745, 329166, 312433, 298719, 286878, 276173, 267048, 259833, 253872, 248512, 243897, 240177, 236787, 233275, 230157, 228305, 227978, 228950, 231119, 234393, 238388, 242771, 247733, 253889, 261895, 272297, 285394, 301087, 319020, 338886]
56886C38886K1445K2339K2312K1340J9029J4623Q057M68o608j2055j5038j5177
56874D19621j3259j0852q560n592j571K456N730R404J5100K2569K9997L6192M1201
56861E42436M5152M7666M8437M7421M4354L8525K9100J5589j333j9009l3537m2126
56849G62675m4606m2479l7312l0397k2845j5008o387L115J2561K1367L0514M1342
56837F72540N3588O5462P5118Q1302Q3303Q1240P5808O6636N1382K7901k552l4826
56825A296902o2523q0977q8653q7116p9721o9557n8348m7048l6519k6947j7340
56814F42153o526N581J8159L0324M1196M9784N5496N8365N8285N4610M6828L4853
56802A089108J8356k895k7061m9649o6079p4432p5327p0366o1748n2151m3366
$$ y = [338886, 360331, 382670, 404982, 426322, 445351, 459974, 468031, 468499, 461891, 449836, 434798, 419621, 406362, 395510, 386950, 381358, 379787, 382243, 387973, 397377, 412477, 435046, 465043, 501235, 542436, 587588, 635254, 683691, 731112, 775466, 813991, 843091, 858680, 857347, 838338, 804801, 762675, 718069, 675590, 638278, 607881, 585036, 570028, 563641, 566756, 579317, 600684, 631198, 672540, 726128, 791590, 866708, 948010, 1031313, 1112553, 1188361, 1254997, 1306379, 1334280, 1331728, 1296902, 1234379, 1153402, 1064749, 977633, 897912, 828355, 770007, 722959, 686440, 659493, 642153, 635627, 641208, 659367, 689691, 730887, 780671, 836167, 894532, 952817, 1007427, 1054255, 1089108, 1107464, 1104569, 1077508, 1027859, 961780, 887348, 812021, 741655, 679907, 627756, 584390]
56791E84390l5378k7559k0012j2847n333K954J0961J7420K2374K6229K8286K7795
56779F19280K5493K2415J7766R781j695j4927k7912l8713m5011m5628m2419l8702
56767D39728l5696l2140k7272k2249j8361j5675j3858j2783j1857j0204q047o654
56755B24932o503o688o423n882n162l869k241j435j921k604k261j099k03j33o36
56740A77872j259j662j675j370r21l76J66L45K1l31k19J33K65K94N46P66N94M14
56722A73603P83J354J404J128J315J971K339K157J770J209K47p15j011q08p49
56707A85997o85j3R65J296R93R83J432J453O74k53r13j623k369k517j886j067
56691A82467l40N96J601J942J528J257J673K228K276J872J346Q72O72Q85J158
$$ y = [584390, 549012, 521453, 501441, 488594, 483261, 486215, 497176, 514596, 536970, 563199, 591485, 619280, 644773, 667188, 684954, 694735, 693040, 678113, 650201, 611488, 566477, 520849, 478430, 439728, 404032, 371892, 344620, 322371, 304010, 288335, 274477, 261694, 249837, 239633, 231586, 224932, 218429, 211741, 205318, 199436, 194274, 190405, 188164, 186729, 184808, 182204, 179943, 178844, 178641, 178508, 177872, 176613, 174951, 173276, 171906, 170985, 170609, 170775, 171120, 171141, 170810, 170591, 170724, 170989, 171283, 171829, 172595, 173189, 173603, 174386, 175740, 177144, 178272, 179587, 181558, 183897, 186054, 187824, 189033, 189280, 188565, 187554, 186746, 185997, 185312, 185299, 186264, 187560, 188553, 189536, 190968, 192421, 193095, 192842, 191929, 190306, 187937, 185420, 183534, 182467, 182127, 182723, 184324, 186266, 187794, 189051, 190724, 192952, 195228, 197100, 198446, 199318, 199990, 200875, 202033]
56676B02033J092R90J264J406O92l69n59J86P92Q97J062J201N12p30j018J02J231
56659B10784J219N88K25M0k46k76P3R9n57j139r22k73K26O98J390J983K171K169
56641B18252K169K032J897K200K696K552J753J285J479J463P44K7k93r96k508
56626B34752l764l788l253l301l746l688l117k695k468k069j726k020k836l398
56612A92883l217k392j285m49l83q97j151p93m50n86o33J02J234J773J332K97
56596A85385p20j079l83R14J675J431R94J201J701J659J043M89L14L99P29J347
56580A97099J925J939J218J43n93l53Q58K180K711K527K353K382K257K170K867
56565B21683M428O011P160Q264R414R954R804J0021J1246J2413J1914R403N746
$$ y = [202033, 203125, 204115, 205379, 206785, 207477, 207108, 206549, 206735, 207527, 208424, 209486, 210687, 211199, 210469, 209451, 209553, 210784, 212003, 212591, 212816, 212856, 212610, 212334, 212407, 212506, 211949, 210810, 209888, 209615, 209841, 210539, 211929, 213912, 216083, 218252, 220421, 222453, 224350, 226550, 229246, 231798, 233551, 234836, 236315, 237778, 238522, 238549, 238256, 237260, 234752, 230988, 227200, 223947, 220646, 216900, 213212, 210095, 207400, 204932, 202863, 201137, 199117, 196281, 192883, 189666, 187274, 185989, 185540, 185157, 184260, 183109, 182316, 181866, 181280, 180647, 180749, 181983, 183756, 185088, 185385, 184665, 183586, 183203, 184117, 185792, 187223, 188217, 189418, 191119, 192778, 193821, 194310, 194624, 195023, 195752, 197099, 199024, 200963, 202181, 202324, 201731, 201378, 202236, 204416, 207127, 209654, 212007, 214389, 216646, 218816, 221683, 226111, 232122, 239282, 247546, 256960, 266914, 276718, 286739, 297985, 310398, 322312, 331715, 337461]
56552C37461J832j774m496n904o077n507m824m668n305o178o412n834m947m024
56538B73343k999k172j991k118j816j261j325j950k035j230n09n56q93r70j011
56523B50507j227j429j752k595l611m025m147m929n841n157k868j252j658k672
56509B07344k618j871j399q69J25O23r9q75l42P89R62K53j53q1j97m31k17K07
56491B01151J98p9m5K38N51J263K432K972K078O82K01N61P87O89N95K59m62o54
56473B13417L67J484J164j64p58n9R75J626J911J725J018M89P27J032M83l21j50
56456B24966P07Q72J67k31J58N93O34O46P04M58J82O11J496J707Q85q2m67m67
56438B33539m34m23o41j358k221k479k044j488j012k65P77J579J835J833J926
$$ y = [337461, 339293, 337519, 333023, 327119, 321042, 315535, 310711, 306043, 300738, 294560, 288148, 282314, 277367, 273343, 270344, 268172, 266181, 264063, 262247, 260986, 259661, 257711, 255676, 254446, 253937, 253381, 252488, 251518, 250507, 249280, 247851, 246099, 243504, 239893, 235868, 231721, 226792, 220951, 215794, 212926, 211674, 210016, 207344, 204726, 202855, 201456, 200587, 200712, 201335, 201236, 200361, 200019, 200808, 201770, 202023, 201870, 201789, 201592, 201161, 200944, 201151, 201349, 201270, 201225, 201463, 202014, 203277, 205709, 208681, 210759, 211441, 211642, 212203, 212990, 213679, 214274, 214533, 214071, 213417, 213784, 215268, 216432, 216268, 215510, 215451, 216426, 218052, 219963, 221688, 222706, 223195, 223922, 224954, 225437, 225116, 224966, 225673, 226545, 226712, 226481, 226639, 227232, 227866, 228512, 229216, 229674, 229856, 230467, 231963, 233670, 234555, 234473, 234006, 233539, 233105, 232682, 232041, 230683, 228462, 225983, 223939, 222451, 221439, 221174, 221951, 223530, 225365, 227198, 229124]
56423B29124K139K224J840R12O0J16Q81J128K62q07j104q62o34k19N54R60N06
56406B37080j0K81Q54Q35O00R39J444J195M13m4k21o69j066p38l3J91J1M0J29
56387B41231j29k44L86J182J322J359K242L418L615K990K663K627K008J096J094
56372B66860J971K380J834J182Q71M36j70k89J59N43P26J176J761J834J412J043
56356B83729O40k67j225j229l16N02P96Q69P24J68l00r2K76K7k75M52J814K446
56338B88739K221K209K565K358J483J042J630K732L811M620M610L535K508K848
56324C26911M073M555L940L235K808K122J336J187J379Q27l63j038r72j005j148
56309C47847n36P16J441J382J459J976K320K530L326M449M797M413M538N434N903
$$ y = [229124, 231263, 233487, 235327, 236239, 236299, 236415, 237296, 238424, 238686, 237879, 236775, 235913, 235279, 235060, 235614, 236574, 237080, 237070, 237351, 238205, 239040, 239640, 240579, 242023, 243218, 243631, 243587, 243366, 242697, 241631, 240893, 240860, 241051, 241062, 241102, 241231, 241102, 240858, 241244, 242426, 243748, 245107, 247349, 250767, 254382, 257372, 260035, 262662, 264670, 265766, 266860, 268831, 271211, 273045, 274227, 275098, 275534, 275364, 275075, 275234, 275777, 276503, 277679, 279440, 281274, 282686, 283729, 284369, 284102, 282877, 281648, 281332, 281834, 282630, 283499, 284223, 284391, 284091, 283999, 284275, 284302, 284027, 284479, 286293, 288739, 290960, 293169, 295734, 298092, 299575, 300617, 302247, 304979, 308790, 313410, 318020, 321555, 324063, 326911, 330984, 335539, 339479, 342714, 345522, 347644, 348980, 350167, 351546, 352373, 352010, 350972, 350000, 348995, 347847, 347311, 348027, 349468, 350850, 352309, 354285, 356605, 359135, 362461, 366910, 371707, 376120, 380658, 386092, 391995]
56294C91995N213L929K668J603J265K149L480L951L670L776M388M665M684N218
56280D42654N968N986N692O302P438P647P146P648R366J0667J0936J1282J2139
56267E50871J2623J2728J3748J5927J7953J9339K1099K3651K6207K8692L2070
56256G74908L6341M0419M4396M9637N6283O2992O9456P6717Q4657R1698R7474
56245A484978J03130J08469J11538J11711J10384J07948J02854R4558Q4578P3568
56235B493716O0117M3639K5885Q388r005k6040m1065n3402o4124p3406p9717q2953
56223B202033q5531q8854r1194r0746q8337q5530q2345p8511p4771p1402o7415
56212A297397o2653n8568n5709n2606m8412m4347m1285l8284l4772l1788k9707
$$ y = [391995, 397208, 401137, 403805, 405408, 406673, 408822, 412302, 416253, 419923, 423699, 428087, 432752, 437436, 442654, 448622, 454608, 460300, 466602, 474040, 481687, 488833, 496481, 505847, 516514, 527450, 538732, 550871, 563494, 576222, 589970, 605897, 623850, 643189, 664288, 687939, 714146, 742838, 774908, 811249, 851668, 896064, 945701, 1001984, 1064976, 1134432, 1211149, 1295806, 1387504, 1484978, 1588108, 1696577, 1808115, 1919826, 2030210, 2138158, 2241012, 2335570, 2420148, 2493716, 2553833, 2597472, 2623357, 2631745, 2622740, 2596700, 2555635, 2502233, 2438109, 2364703, 2284986, 2202033, 2116502, 2027648, 1936454, 1845708, 1757371, 1671841, 1589496, 1510985, 1436214, 1364812, 1297397, 1234744, 1176176, 1120467, 1067861, 1019449, 975102, 933817, 895533, 860761, 828973, 799266]
56201G99266k7166k3673k0731j9057j7211j4479j2462j2092j1732j0023q066p059
56189F15515o229m970m427n054n012l122j025m11m53J9J62q35j632r08L08N99
56173E82525N41J171J946K122K361L247M010M238M888O229O960O711P003Q478
56159F42430R697J0024J0946J3064J4719J5198J6202J8479K0315K1177K3502K8642
56147H44395L4488L9398M5082N3115O1975P0352P9913R1834J03741J13086J20438
56136A657817J26499J29230J27097J21956J15432J05744R1692P6627O4582N5362
56126B672038M7032M0264L6006L1599K3517J2061l42j3127k6340l7959m6527n4445
56114B683777o4941p7732r0855j04149j17346j27341j31236j29899j25158j16307
$$ y = [799266, 772100, 748427, 727696, 708639, 691428, 676949, 664487, 652395, 640663, 630640, 622574, 615515, 609286, 604316, 599889, 594835, 589823, 586701, 585676, 585265, 584812, 584831, 584993, 584158, 582526, 581618, 581926, 582525, 583066, 584237, 586183, 588305, 590666, 593913, 597923, 602161, 607049, 613278, 620238, 626949, 633952, 642430, 652127, 662151, 673097, 686161, 700880, 716078, 732280, 750759, 771074, 792251, 815753, 844395, 878883, 918281, 963363, 1016478, 1078453, 1148805, 1228718, 1320552, 1424293, 1537379, 1657817, 1784316, 1913546, 2040643, 2162599, 2278031, 2383775, 2475467, 2552094, 2616676, 2672038, 2719070, 2759334, 2795340, 2826939, 2850456, 2862517, 2862175, 2849048, 2822708, 2784749, 2738222, 2683777, 2618836, 2541104, 2450249, 2346100, 2228754, 2101413, 1970177, 1840278, 1715120, 1598813]
56104A598813j03068q8952p7460o7587n7072m7155l9888l3759k6664k0349j7134
56093A019725j5037j1051o659m907m489k175J086J934P05M80J678K506L213N004
56079I92013O419N610M452N803Q446R465R450J0611J1964J1435J0458J1437J2932
56066A110495J2580J2184J4434J7159J6777J4971J5791J8316J8508J6431J5259
56055A282905J4940J3155J0954J1112J2479J2046J0956J2350J5116J6014J5980
56044A428007J7890K0189J9457J7326J7950K0507K1216K0776K2631K5748K6551
56033A658248K6227K8650L2742L4405L4263L5944L8557L8662L7711L9560M2606
56022B047575M2576M0991M2527M6113M7326M7368N0566N5269N6643N6312N9519
$$ y = [1598813, 1495745, 1406793, 1329333, 1261746, 1204674, 1157519, 1117631, 1083872, 1057208, 1036859, 1019725, 1004688, 993637, 986978, 982071, 977582, 975407, 976493, 978427, 979132, 979612, 981290, 983796, 987009, 992013, 998432, 1004042, 1008494, 1014297, 1022743, 1032208, 1041658, 1052269, 1064233, 1075668, 1086126, 1097563, 1110495, 1123075, 1135259, 1149693, 1166852, 1183629, 1198600, 1214391, 1232707, 1251215, 1267646, 1282905, 1297845, 1311000, 1321954, 1333066, 1345545, 1357591, 1368547, 1380897, 1396013, 1412027, 1428007, 1445897, 1466086, 1485543, 1502869, 1520819, 1541326, 1562542, 1583318, 1605949, 1631697, 1658248, 1684475, 1713125, 1745867, 1780272, 1814535, 1850479, 1889036, 1927698, 1965409, 2004969, 2047575, 2090151, 2131142, 2173669, 2219782, 2267108, 2314476, 2365042, 2420311, 2476954, 2533266, 2592785]
56011B592785O4920O7212O7625P1339P6773P8361P7922Q1911Q9291R3812R6366
56000C458317J02992J12340J17787J20518J27642J38625J46620J52031J61381
55991D638253J74106J84068J92736K06832K24617K39045K52547K73322K99311
55982F684837L22038L43765L73693M09937M43617M78094N24383N80413O35754
55973A0796531O94197P69489Q61695R61445J074665J217987J393153J592766J826996
55964B1188924K115747K460403K856183L326635L912126M635320N518813O623726
55956E2637877Q026595R785063J1986932J4777567J8192857K1935587K5435031
55949A62777509K8174405K9873113L0372410K9567291K7534294K4434031J9999015
$$ y = [2592785, 2657705, 2724917, 2792542, 2863881, 2940654, 3019015, 3096937, 3178848, 3268139, 3361951, 3458317, 3561309, 3673649, 3791436, 3911954, 4039596, 4178221, 4324841, 4476872, 4638253, 4812359, 4996427, 5189163, 5395995, 5620612, 5859657, 6112204, 6385526, 6684837, 7006875, 7350640, 7724333, 8134270, 8577887, 9055981, 9580364, 10160777, 10796531, 11490728, 12260217, 13121912, 14083357, 15158022, 16376009, 17769162, 19361928, 21188924, 23304671, 25765074, 28621257, 31947892, 35860018, 40495338, 46014151, 52637877, 60664472, 70449535, 82436467, 97214034, 115406891, 137342478, 162777509, 190951914, 220825027, 251197437, 280764728, 308299022, 332733053, 352732068]
55942C52732068J3329824L728681q049717j9633196k8390972l3013057l3870755
55935B46832876l2204207k9230204k5816239k2500828j9527788j6908382j4569816
55928H6075412j2467537j0581497q891538p399395o131778n093226m246406l551875
55920B7712160k992961k550350k188230j881484j628413j424635j250631j095143
55912A2700313r65159q62374p72757o88409o17451n63274n14603m64778m21431
55903F830077l88882l59011l27333l00937k82941k65153k43245k24033k11158
55894D227384j98084j81528j67689j59194j49513j36044j25543j20833j15037
55885B873919j04626r5706r1648q6592p6985o8143o3625n9158n2549m8738m9540
$$ y = [352732068, 366061892, 369790573, 361740856, 342107660, 313716688, 280703631, 246832876, 214628669, 185398465, 159582226, 137081398, 117553610, 100645228, 86075412, 73607875, 63026378, 54134840, 46735445, 40603667, 35510441, 31264035, 27712160, 24719199, 22168849, 19980619, 18099135, 16470722, 15046087, 13795456, 12700313, 11735154, 10872780, 10100023, 9411614, 8794163, 8230889, 7716286, 7251508, 6830077, 6441195, 6082184, 5754851, 5453914, 5170973, 4905820, 4662575, 4438542, 4227384, 4029300, 3847772, 3680083, 3520889, 3371376, 3235332, 3109789, 2988956, 2873919, 2769293, 2673587, 2581939, 2495347, 2418362, 2350219, 2286594, 2227436, 2174887, 2126149, 2076609]
55874B076609m9055m4927m3809m9762n6933n9726o0818o3171o3124n7880n1741
55863A475663m8769m6484m2257l8805l7982l6162l1107k6806k6613k7702k6877
55852A086099k5772k5926k4954k1863k0171k1653k2873k1717k1213k3085k3745
55841H33127k0873j7922j7821j7972j5790j3571j3542j3462j1406r871j0843j1694
55829F58360j0041q061p999q005o251m763n363o165n645n859q105r745q769p319
55815E56270p363p189n486m466n537o179m515k672k271j086K263M831M434L866
55801E24900O025Q826R140P998P693P202M732J708J24j210l983o729p477p385
55787E51564q307r400r345r206r944r878p860o078o576p800p678p188p601p172
$$ y = [2076609, 2027554, 1982627, 1938818, 1889056, 1832123, 1772397, 1711579, 1648408, 1585284, 1527404, 1475663, 1426894, 1380410, 1338153, 1299348, 1261366, 1225204, 1194097, 1167291, 1140678, 1112976, 1086099, 1060327, 1034401, 1009447, 987584, 967413, 945760, 922887, 901170, 879957, 856872, 833127, 812254, 794332, 776511, 758539, 742749, 729178, 715636, 702174, 690768, 680897, 670054, 658360, 648319, 640258, 632259, 624254, 618003, 613240, 607877, 601712, 596067, 590208, 582103, 572358, 563589, 556270, 548907, 541718, 536232, 531766, 526229, 520050, 515535, 512863, 510592, 509506, 511769, 516600, 521034, 524900, 530925, 539751, 548891, 556889, 564582, 571784, 576516, 578224, 578348, 577138, 573155, 566426, 558949, 551564, 543257, 533857, 524512, 515306, 505362, 495484, 487624, 481546, 474970, 467170, 459492, 452304, 444703, 437531]
55773D37531m100j01K394M047O346Q140P852O596N746L926j97m524o548p402r381
55758D50325j1616j1912j0920j0826j1493j1465j1290j2423j4188j4886j4680
55747C14626j4450j3287j0140o549m816m569l968k900k356j904o01P76J002P78
55733B51642J364K009J206n91j786k066k070j860j626k368m050m789l716k712
55719B28587l225l616k102l9M94L63J486L133L330K548K747L855M291M008M105
55704B49965M190K986R06n92j589l168n002n867n891o056o135n352m309m122m296
55689B05668l546k019p71J36J134J708J383J220K393M118M900M829M853M835M261
55674B35102L644L327K193m34k851l155k129j723j872j257q4L52J19K80P87Q51
$$ y = [437531, 433431, 433330, 435724, 439771, 446117, 454257, 462109, 468705, 474451, 478377, 478180, 473656, 467108, 459706, 450325, 438709, 426797, 415877, 405051, 393558, 382093, 370803, 358380, 344192, 329306, 314626, 300176, 286889, 276749, 270200, 265384, 260815, 256847, 253947, 251591, 249687, 249086, 249862, 250864, 251642, 253006, 255015, 256221, 255630, 253844, 251778, 249708, 247848, 246222, 243854, 239804, 235015, 231299, 228587, 225362, 221746, 219644, 219605, 220099, 220462, 221948, 225081, 228411, 230959, 233706, 237561, 241852, 245860, 249965, 254155, 257141, 258047, 257455, 255866, 252698, 247696, 241829, 235938, 229882, 223747, 218395, 214086, 209964, 205668, 202122, 200103, 199332, 199468, 200602, 202310, 203693, 204913, 207306, 211424, 216324, 221153, 226006, 230841, 235102, 238746, 242073, 244266, 243832, 240981, 237826, 235697, 233974, 232102, 230845, 230761, 231113, 231232, 231512, 232299, 233150]
55658B33150P51J199J700J465J114J588K332K425K377K830K719R40j377k477k716
55643B48020l433m359m566m746n893o852n985m284l962m813m848l894l513l802
55629A83070l315k022j467j934k098j643j689k468k829k311j608j026l35m6p99
55614A57480j741j490m29J6j48P5L18n81j989k088r49m43j066j442j175j504k675
55597A40169l145k150r28o28q53r67j094j255r87m20k54m92m44r9l0j2O76J702
55579A28789J953J382R83J050J106J313K244L368L636L347L617M216L939L062
55565A64005L144M338M982M191K846J720N66n48r37q34j426k878l942l908l424
55550A67895l066k685k396k644k971k371j021j12J08M28Q01K61j023j507m83J113
$$ y = [233150, 233901, 235100, 236800, 238265, 239379, 240967, 243299, 245724, 248101, 250931, 253650, 254590, 253213, 250736, 248020, 244587, 240228, 235662, 230916, 225023, 218171, 212186, 207902, 203940, 199127, 194279, 190385, 186872, 183070, 179755, 177733, 176266, 174332, 172234, 170591, 168902, 166434, 163605, 161294, 159686, 158660, 158325, 158279, 157480, 155739, 154249, 153820, 153836, 153688, 153763, 154081, 153500, 151511, 149423, 148474, 148031, 146965, 145523, 144348, 142844, 140169, 137024, 134874, 133946, 133318, 132465, 131498, 130404, 129149, 128162, 127742, 127488, 126996, 126552, 126453, 126423, 126411, 127087, 128789, 130742, 132124, 133107, 134157, 135263, 136576, 138820, 142188, 145824, 149171, 152788, 157004, 160943, 164005, 167149, 171487, 176469, 180660, 183506, 185226, 185792, 185244, 184307, 183473, 182047, 179169, 175227, 171319, 167895, 164829, 162144, 159748, 157104, 154133, 151762, 150741, 150629, 150737, 151165, 151966, 152227, 151204, 149697, 149214, 150327]
55534A50327K324K982K773J435L7J00J132J032p21k333k649k630l165l512k970
55519A44162k212j914j665j255j429k365k911k347j502j181q32K30J443J922J631
55504A29775Q83l19j653k277j961j495j461j660k030k883l755l532k346j782k480
55489A01024l011k091m93M13O40Q96J024N65P3N07J655K293J722M26n42l83Q95
55472A05613K321K714J946R73M68J13n62j374j853j845j427p75k62k31n81r97
55456A04241j393j596j048L43J534J541R14Q51J269J190O64O54J123J015K72J00
55440A11674Q41J277N74n29j093j168j074p40k97k23m24j94N53J105J170J151
55424A12603J028L23o86j012m92O0L30O84Q71K35o16k79J028J444M55l06J04L66
$$ y = [150327, 152651, 155633, 158406, 159841, 159878, 159978, 161110, 162142, 161421, 159088, 156439, 153809, 150644, 147132, 144162, 141950, 140036, 138371, 137116, 135687, 133322, 130411, 128064, 126562, 125381, 124549, 124779, 126222, 128144, 129775, 130658, 130339, 128686, 126409, 124448, 122953, 121492, 119832, 117802, 114919, 111164, 107632, 105286, 103504, 101024, 98013, 95922, 95429, 95842, 96482, 97378, 98402, 98967, 99040, 99547, 101202, 103495, 105217, 105643, 105101, 104718, 105613, 107934, 110648, 112594, 113567, 114035, 114148, 113586, 112212, 110359, 108514, 107087, 106312, 106050, 105819, 105238, 104241, 102848, 101252, 100204, 100547, 102081, 103622, 104536, 105387, 106656, 107846, 108510, 109164, 110287, 111302, 111574, 111674, 112515, 113792, 114366, 113837, 112744, 111576, 110502, 109762, 109465, 109242, 108818, 108624, 109177, 110282, 111452, 112603, 113631, 113954, 113268, 112256, 111764, 111824, 112154, 112838, 113709, 113944, 113328, 113049, 114077, 115521, 115976, 115670, 115774, 116140]
55406A16140o28j796j751r88o34m91O1M82l2r34j163p97n92n13j6P44J118J027
55388A09237R71J269J872K489K569J750O34K53N76N42j88p42o54o41j160j653
55372A17124j877k530l770m548m362m245m959n506m711l071j751p74M26J541J827
55357G8814J378Q83N79M51P93J647K274K046J323P93N80N28O26O04O2n57j81J179
55339I3822K125J905J418J440J366O66J27L68N23k15r74n44O04J161R22N41J88
55322A05443j48P2R84J500Q62Q3L76J032N44q16j434q74k51k44m34n22p29r61
55304A04483q50o35q66j254r66n3N65N46M58O66Q74Q81R39J122J074N74j50p06
55286A06702q39m85J88R43J775K644K963K075M38o30p33q18j442j768j088j00
$$ y = [116140, 115512, 113716, 111965, 110977, 110343, 109852, 109913, 110395, 110363, 109429, 108266, 107469, 106877, 106364, 106348, 107092, 108210, 109237, 110208, 111477, 113349, 115838, 118407, 120157, 120791, 121044, 121620, 122162, 121974, 121232, 120578, 119937, 118777, 117124, 115247, 112717, 108947, 104399, 100037, 95792, 90833, 85327, 80616, 77545, 75794, 75020, 75446, 76987, 78814, 80192, 81075, 81654, 82105, 82898, 84545, 86819, 88865, 90188, 90981, 91561, 92089, 92715, 93319, 93381, 92824, 92643, 93822, 95947, 97852, 99270, 100710, 102076, 102742, 102869, 103237, 103760, 103545, 102571, 102027, 102631, 103792, 104714, 105255, 105443, 105295, 105367, 106351, 107851, 108713, 108796, 109172, 110204, 110748, 109932, 108498, 107624, 107373, 107129, 106695, 106173, 105444, 104483, 103633, 102998, 102132, 100878, 99912, 99859, 100424, 100970, 101428, 102094, 102968, 103849, 104788, 105910, 106984, 107558, 107408, 106702, 105863, 105378, 105566, 106509, 108284, 110928, 113891, 115966, 116404, 115774, 115041, 114223, 112781, 111013, 109925, 109825]
55270A09825K76K34K75J03m91p63k24K07l82j160p86M29J028O64K42K24K23J35
55252A10059L02O13N09q0o33p91n09J54Q08P85R6l91k67k43p18q63j21N64K71
55233A09545l02j87L0n68j238o92N91J139Q96R03J118O94L0L21J188J005k70q15
55215A13388J35J146R27M0n19p45q82o72j07J40k42p26r16j033j061m99O02J407
55197A10383J441J072N99j41r54j199p89m01l42k09J61M37O68J249J811J349j57
55180A14978j355j272m22L57R49J378J222M13k33j08K87J96k10k64P8K84J64J20
55162A16562M89R93R93K52n83n87K53R44Q95P29J133J586J201K06n04q29j293
55145A22440j713j413n77j27k66l97m38q34j233o88O13J250N91m53j056j445j716
$$ y = [109825, 110101, 110335, 110610, 110713, 110222, 109459, 109235, 109442, 109060, 107900, 107114, 107543, 108571, 109235, 109477, 109701, 109924, 110059, 110361, 110974, 111483, 111403, 110770, 109979, 109470, 109624, 110432, 111217, 111313, 110922, 110655, 110412, 109694, 108831, 108710, 109274, 109545, 109243, 109056, 109086, 108518, 107280, 106588, 107179, 108318, 109214, 110117, 111235, 111929, 111959, 112280, 113468, 114473, 114203, 113388, 113523, 114669, 115596, 115636, 115117, 114372, 113490, 112818, 112711, 112851, 112609, 111883, 110967, 109934, 108873, 108374, 108976, 110383, 111824, 112896, 113495, 113354, 112400, 111201, 110412, 110011, 109669, 109460, 109621, 110058, 110726, 111975, 113786, 115135, 114978, 113623, 112351, 111929, 112286, 113235, 114613, 115835, 116248, 116015, 115907, 116194, 116390, 116180, 115916, 115994, 116278, 116442, 116562, 117051, 118044, 119037, 119289, 118706, 118119, 118372, 119316, 120211, 120940, 122073, 123659, 124860, 125066, 124562, 123733, 122440, 120727, 119314, 118737, 118610, 118344, 117947, 117509, 116675, 115442, 114754, 115367, 116617, 117208, 116755, 115699, 114254, 112538]
55128A12538j134M93J941K025J091K62n7j24j30j83m56p08k61R68K073K256J744
55111A22338J106L84n46j292j389r58m62n3L95Q72J214J248R11M43L60P26P45
55094A26042j95j285j118K69J310J102M30K33K53n3l67j61K29J33l71o30l35L05
55076A25791R33J156O84k16p72n98j36P5P9J23J39Pj28p3J44M67Q36R36M45l51
55056A29541q23q61q34o71M8R29Q33m12j432j115j10K93l2k59m4K07K03K5k72
55037A25214o70r09p61m45l00k44rK86K69n3k76j63J06K68L09M34P59J102J150
55018A26067Q51M85K30r2n87r63r91r02q41m00O25J403R89j76o97j37N39N16O9
54999A25988k06j59K20R53J583J420N77l4k6J6l03m71K5Q57J457J685J595J210
$$ y = [112538, 111404, 111897, 113838, 115863, 116954, 117216, 117159, 117035, 116905, 116722, 116266, 115558, 115297, 116265, 118338, 120594, 122338, 123444, 123828, 123282, 121990, 120601, 119643, 119181, 119128, 119523, 120395, 121609, 122857, 123768, 124211, 124571, 125297, 126042, 125847, 124562, 123444, 123713, 125023, 126125, 126555, 126788, 127041, 126988, 126621, 126460, 126689, 126822, 126451, 125821, 125486, 125791, 126724, 127880, 128564, 128348, 127576, 126978, 126842, 126917, 126996, 127119, 127258, 127265, 127137, 127064, 127208, 127675, 128511, 129447, 129892, 129541, 128718, 127857, 127023, 126352, 126400, 127329, 128162, 127750, 126318, 125203, 125093, 125386, 125354, 125095, 125051, 125258, 125461, 125486, 125214, 124544, 123635, 122874, 122429, 122129, 121885, 121876, 122162, 122431, 122378, 122102, 121939, 122045, 122313, 122622, 123056, 123815, 124917, 126067, 126918, 127403, 127633, 127541, 126954, 125991, 125000, 124098, 123257, 122857, 123482, 124885, 125874, 125698, 125001, 124864, 125403, 125919, 125988, 125782, 125623, 125843, 126796, 128379, 129799, 130376, 130342, 130316, 130332, 130029, 129558, 129583, 130440, 131897, 133582, 135177, 136387]
54981A36387Q69J020J377J159M48L19J114J684J062p6m93j87j09o67j360j646
54965A40901j403p32J54R47J485J706J383M23n61o85k7M20K43R8L72L93l67j231
54947A43519j316p87m02l86m98o56q27q03o17n93n87KJ006J289N04PR64K530L066
54928A45415K496K072K354K856L394M350N582O343O483O627O882O412M764K828
54914B08858J796J598R54j021l661n353n266m241l704l993m365m444m691n168
54900A67299m956l508j755r78j146j322j209j236j325q06L46J120P79j00l05N96
54884A51494J944K915L431M000M863N645N967O035O162O040N156L774K755K344
54870B12525J962J257M59m45j887l759n219n923o439o978o736n309l761l299l666
$$ y = [136387, 137256, 138276, 139653, 140812, 141260, 141579, 142693, 144377, 145439, 145363, 144870, 144683, 144574, 143907, 142547, 140901, 139498, 138766, 138920, 139867, 141352, 143058, 144441, 144864, 144303, 143618, 143591, 144011, 144254, 144352, 144724, 145117, 144750, 143519, 142203, 141416, 141014, 140628, 140130, 139474, 138647, 137844, 137227, 136634, 136047, 136049, 137055, 138344, 138848, 138855, 139819, 142349, 145415, 147911, 149983, 152337, 155193, 158587, 162937, 168519, 174862, 181345, 187972, 194854, 201266, 206030, 208858, 210654, 212252, 213206, 212185, 208524, 203171, 197905, 193664, 189960, 185967, 181602, 177158, 172467, 167299, 162343, 158835, 157080, 156102, 154956, 153634, 152425, 151189, 149864, 149058, 149404, 150524, 151303, 151203, 150898, 151494, 153438, 156353, 159784, 163784, 168647, 174292, 180259, 186294, 192456, 198496, 203652, 207426, 210181, 212525, 214487, 215744, 216203, 215758, 213871, 210112, 204893, 198970, 192531, 185553, 178817, 173508, 169747, 166448, 162782]
54855A62782l829l581l379l148k433j432q93r93j234j327j393j449j354j244j360
54840A33733j541j358p16N6N28L39n57j482j429k86Q55J067O81N19O81Q30J042
54823A32962J524J932J763J117M28j61n61m01L35Q28L69o19j244j301j089o17
54807A35265N9L55o6m55pP63P49N5k23K18N71M05K54M86O86M95K09J97L62M70
54787A40848N46P16J038J511J929J887J318P49O11O60O00Q05J622K465K576K365
54771A62246K936M336N374N296M678M479M980N907O896P472P129N760L774J705
54757B32968r8j524k764m142n616o663o996o919o690o048m960m147m110m162l358
54742A64771j943j016r84j285j383j195p10n8K65K6j33N15J660K433K645K708
$$ y = [162782, 158953, 155372, 151993, 148845, 146412, 144980, 144087, 143094, 141860, 140533, 139140, 137691, 136337, 135093, 133733, 132192, 130834, 130118, 130174, 130702, 131041, 130484, 129002, 127573, 127287, 128142, 129209, 129890, 130409, 131090, 131920, 132962, 134486, 136418, 138181, 139298, 139726, 139565, 139004, 138603, 138938, 139766, 140135, 139516, 138272, 136971, 135882, 135265, 135324, 135679, 135613, 135158, 135151, 135914, 136663, 136718, 136495, 136713, 137284, 137689, 137943, 138429, 139115, 139610, 139819, 140016, 140378, 140848, 141394, 142110, 143148, 144659, 146588, 148475, 149793, 150542, 151153, 151813, 152413, 153218, 154840, 157305, 159881, 162246, 165182, 169518, 174892, 180188, 184866, 189345, 194325, 200232, 207128, 214600, 221729, 227489, 231263, 232968, 232870, 231346, 228582, 224440, 218824, 212161, 205165, 198246, 191556, 185508, 180548, 176401, 172291, 168129, 164771, 162828, 161812, 160828, 159543, 158160, 156965, 156255, 156197, 156462, 156488, 156355, 156870, 158530, 160963, 163608, 166316]
54726A66316K737K740L230M572N974O352N928N753N860N261L722K093P78q42l057
54711B17417n163o455o911o621n597m404l941m187m123l218k119j525j349j290
54697A60514j381j619j816k076k600k953k384j083j41n8k83m41q39j470j636j142
54681A38592p47q13n72N06J575J479L45p39j047n75M19J489J995J664R36L65l1
54664A44841n27j121j555j588j098k33M64N18J02k49m88r05j294j069k89L44O29
54647A36482J068J731J915J275L98j81n92q68n17M95J233R73J89k71l47m66o44
54630A41873o00l51p2K23M78M69K66L66Q76J161O91j83p82r15p65m29l1J40L1
54611A42446k1J40K27J12J98P94J606K119K104J512M25o86j186j021p04l97J50
$$ y = [166316, 169053, 171793, 175023, 179595, 185569, 191921, 197849, 203602, 209462, 214723, 218445, 220538, 221316, 220474, 217417, 212254, 205799, 198888, 192267, 186670, 182266, 178325, 174138, 170015, 166797, 164678, 163153, 161804, 160514, 159133, 157514, 155698, 153622, 151022, 148069, 145685, 144602, 144461, 144403, 144120, 143679, 142840, 141370, 139734, 138592, 137845, 137032, 136460, 136966, 138541, 140020, 140365, 139626, 138579, 138004, 138423, 139912, 141907, 143571, 144507, 144872, 144841, 144314, 143193, 141638, 140050, 138952, 138719, 139183, 139701, 139803, 139554, 139066, 138161, 136867, 135798, 135509, 135853, 136482, 137550, 139281, 141196, 142471, 142869, 142688, 142096, 141228, 140711, 141206, 142439, 143412, 143601, 143330, 142983, 142517, 141873, 141273, 140922, 140850, 141073, 141551, 142020, 142286, 142652, 143528, 144689, 145380, 145197, 144415, 143500, 142735, 142306, 142275, 142415, 142446, 142425, 142565, 142792, 142904, 143102, 143896, 145502, 147621, 149725, 151237, 151662, 150976, 149790, 148769, 148065, 147668, 147818]
54594A47818O46J91j251k283j669J31J723K307J924P95o22j455j177l42R5m0j99
54577A46592j15n2k14m07l68j4N26R96J146R42N08q3o66q44m38N9L3l71n69n21
54557A46140n31k98O66J760J784Q67M69J054J338N77J5Q59K214K485J830J632
54541A62861K126K174J198o2p34p11l32L8Q8j52k54j02k71j092j859j726r92n92
54523A59606p21q05o21m84m75l23j1J91K53L34L77K66K02K86Q0p53j640j780j297
54504A52685r65r20o39j01M4l36m13M21J497J569K98j267j718p66M10M13o95j422
54486A48095p23P23J492J232Q09R53J383J333M93o13j094o14J57M15M33J243K913
54469A58630M137L944K938K147J556P40J78O46J736K155J437L72k50m33n11o93
$$ y = [147818, 148464, 148655, 147404, 145121, 143452, 143583, 145306, 147613, 149537, 150332, 149710, 148255, 147078, 146736, 146831, 146791, 146592, 146477, 146425, 146211, 145804, 145436, 145422, 145948, 146944, 148090, 149032, 149540, 149457, 148791, 147947, 147509, 147568, 147601, 147230, 146661, 146140, 145609, 145311, 145977, 147737, 149521, 150388, 150857, 151911, 153249, 153826, 153841, 154700, 156914, 159399, 161229, 162861, 164987, 167161, 168359, 168297, 167563, 166852, 166520, 166558, 166646, 166494, 166240, 166138, 165867, 164775, 162916, 161190, 160198, 159606, 158885, 158080, 157459, 156975, 156500, 156177, 156166, 156357, 156610, 156944, 157321, 157587, 157789, 158075, 158155, 157402, 155762, 153982, 152685, 151720, 150800, 150161, 150060, 150104, 149768, 149355, 149776, 151273, 152842, 153140, 151873, 150155, 149389, 149799, 150212, 149517, 148095, 147372, 148095, 149587, 150819, 151628, 152581, 153964, 155297, 155790, 155177, 154083, 153469, 153626, 154041, 154474, 155717, 158630, 162767, 166711, 169649, 171796, 173352, 174092, 174270, 174916, 176652, 178807, 180244, 180616, 180366, 179933, 179422, 178729]
54453A78729j151j831k134j465j71O96O01m5o88j218j661j875j775j519j244r09
54437A62340m58L5M00N46N99Q79J417J659J109K43O5O40Q69J70n95m52K62O02
54419A70330M58L93N97Q34J042J155P90j09p51m93P9k2o36p16Q0R74J245R75O52
54400A76877O03Q30R71O15lj00N04J030J051J285K241K987K413J017J74J36Q0
54383A92711l45p61j056j382j405q27k76n16j071r70m59m57p12j51J072J692J545
54366A86632J735K453K492J486P31J051J516J197O88Q22J216J167Q67O57J50q75
54350B03985j637j499j126j374j873j845j581j872k478k447j681j039r28q53m09
54335A81343J56N16O85O76L75j08l73k75j76m84j049j300r40l98l26o79o44K49
$$ y = [178729, 177578, 175747, 173613, 172148, 171977, 172673, 173274, 173229, 172541, 171323, 169662, 167787, 166012, 164493, 163249, 162340, 161882, 161917, 162317, 162863, 163462, 164341, 165758, 167417, 168526, 168769, 168834, 169474, 170343, 170513, 169918, 169466, 169728, 170330, 170788, 171181, 171778, 172612, 173654, 174809, 175599, 175490, 174739, 174246, 174325, 174303, 173667, 172951, 173031, 174005, 175250, 176225, 176877, 177480, 178310, 179281, 179896, 179893, 179793, 180297, 181327, 182378, 183663, 185904, 188891, 191304, 192321, 192495, 192631, 192711, 192366, 191605, 190549, 189167, 187762, 186935, 186659, 186143, 185072, 184102, 183643, 183186, 182474, 182323, 183395, 185087, 186632, 188367, 190820, 193312, 194798, 195529, 196580, 198096, 199293, 199981, 200803, 202019, 203186, 204053, 204710, 204860, 203985, 202348, 200849, 199723, 198349, 196476, 194631, 193050, 191178, 188700, 186253, 184572, 183533, 182605, 181752, 181343, 181499, 182015, 182700, 183376, 183751, 183643, 183270, 182995, 182819, 182335, 181286, 179986, 179046, 178648, 178322, 177643, 176999, 177248]
54317A77248J277J338L74o24r37p89o53n85m37k54j66k24m17n72l83J13L34m1
54299A74602l92n3N39M28k58m78JK32l31j008j012m33L33J150J772J711J047N47
54281A78397O00P33N16J53j66n73q51l96O64J206O24k81m95l3N55J095J458J227
54263A84433M08k56l93o43j343j542k76J770L016K908K133J323N92M3k32n50j167
54246A90224j660j436p20k65l06m64n02n28n56m89l99l63k32k4j97q93j346p44
54228A79100N50J362J173N21N6r0l1J87N11Q53J165J292R96L44j91l76n68j104
54210A85750j736k078k139j910j038M42J526J235p9j196j546j460j186n84K19
54195A74220P55R62J284J826K029J414K87n48n35K11J003J132N58m8p9L91R15
$$ y = [177248, 178525, 179863, 180237, 179613, 178676, 177887, 177234, 176649, 176212, 175958, 175792, 175568, 175151, 174579, 174196, 174309, 174643, 174602, 174210, 174157, 174696, 175124, 174866, 174388, 174389, 174621, 174290, 173282, 172270, 171837, 172170, 173320, 175092, 176803, 177850, 178397, 178997, 179730, 180246, 180399, 180233, 179660, 178809, 178413, 179077, 180283, 180907, 180626, 180131, 180098, 180653, 181748, 183206, 184433, 184841, 184585, 184192, 183549, 182206, 180664, 180388, 182158, 185174, 188082, 190215, 191538, 192130, 192173, 191941, 191391, 190224, 188564, 187128, 186408, 186143, 185837, 185373, 184871, 184343, 183787, 183298, 182899, 182536, 182304, 182280, 182083, 181190, 179844, 179100, 179650, 181012, 182185, 182706, 182762, 182672, 182641, 182828, 183339, 184192, 185357, 186649, 187645, 187989, 187798, 187422, 186854, 185750, 184014, 181936, 179797, 177887, 176849, 177291, 178817, 180052, 179973, 178777, 177231, 175771, 174585, 174001, 174220, 174975, 175937, 177221, 179047, 181076, 182490, 182777, 182229, 181694, 181905, 182908, 184040, 184598, 184550, 184471, 184862, 185777]
54178A85777J234J242Q18J25k84j49O5j45n11m00J96O99O89J51p52j628j841j145
54160A84141j74K25o4n50q72r06n09J64M59j0o61o97k53r0l81o16n02j99J87O13
54140A79305Q32Q07J123K122K929K425R53r9l05n43j228j551r44o4K43J11R1K33
54122A86440M02P58J353J727J534J058O61K71j54k49J19L87J10k43J0O82R87O66
54104A96519J31k49m20k86K77J078J732K109K344K469K457K579L188M135M780
54089B22843M731M202L562K773J514l11k325l901m586m405l768l108k584k139
54075B12498j751j457j177o70J80J047J358R23L12K89Q55J208Q11J56R0O72J242
54058B16586J474J758K412L044L065K490J896J737J962K187K087J610R85M61J03
$$ y = [185777, 187011, 188253, 189071, 189196, 188912, 188763, 188828, 188683, 188172, 187772, 187968, 188667, 189356, 189507, 188755, 187127, 185286, 184141, 183967, 184192, 184128, 183578, 182706, 181800, 181291, 181455, 181914, 181904, 181243, 180546, 180293, 180203, 179822, 179206, 178704, 178505, 178692, 179305, 180137, 180944, 182067, 184189, 187118, 189543, 190496, 190397, 190092, 189549, 188321, 186770, 185826, 185762, 186005, 186116, 186207, 186440, 186842, 187600, 188953, 190680, 192214, 193272, 193933, 194204, 194050, 193801, 193920, 194307, 194417, 194174, 194184, 194866, 195853, 196519, 196650, 196401, 195981, 195695, 195972, 197050, 198782, 200891, 203235, 205704, 208161, 210740, 213928, 218063, 222843, 227574, 231776, 235338, 238111, 239625, 239314, 236989, 233088, 228502, 224097, 220329, 217221, 214637, 212498, 210747, 209290, 208113, 207443, 207623, 208670, 210028, 210951, 211263, 211552, 212407, 213615, 214426, 214582, 214672, 215344, 216586, 218060, 219818, 222230, 225274, 228339, 230829, 232725, 234462, 236424, 238611, 240698, 242308, 243293, 243754, 243857]
54043B43857o8J12P32J445J737J606J595K006K485K678K893L685M954N956O200
54028B81873N928N660N505N116M172K823J710J460J995K468K117J180O40R84J572
54013C25203J435L80j008k253l356m325m891m931m809m953n244n177m523l558
53999B77990k738k317k346k700l126l375l352l065k529j858j291r52o92m05l22
53984B46922o90j279j547j290q11m66l79n22p44p96o37o62j162j705j519m92O80
53967B32901J360J475J189O81L66O18J156J254P75M14O36J116J504K037L037M355
53951B54874N751P182Q413Q974Q953R110R649R677Q537O945N833M813K813o8k492
53936C48964l479l214k366j544j335j935k654k561j694r42p62p36m41J8N25J269
$$ y = [243857, 243789, 243901, 244633, 246078, 247815, 249421, 251016, 253022, 255507, 258185, 261078, 264763, 269717, 275673, 281873, 287801, 293461, 298966, 304082, 308254, 311077, 312787, 314247, 316242, 318710, 320827, 322007, 322647, 323631, 325203, 326638, 327018, 326010, 323757, 320401, 316076, 311185, 306254, 301445, 296492, 291248, 286071, 281548, 277990, 275252, 272935, 270589, 267889, 264763, 261388, 258036, 254971, 252442, 250584, 249293, 248341, 247649, 247244, 246922, 246232, 244953, 243406, 242116, 241305, 240839, 240460, 239938, 239194, 238398, 237761, 237099, 235937, 234232, 232713, 232221, 232901, 234261, 235736, 236925, 237606, 237972, 238590, 239746, 241000, 241775, 242189, 242825, 243941, 245445, 247482, 250519, 254874, 260625, 267807, 276220, 285194, 294147, 303257, 312906, 322583, 331120, 338065, 343898, 348711, 351524, 351456, 348964, 345485, 342271, 339905, 338361, 337026, 335091, 332437, 329876, 328182, 327240, 326478, 325742, 325301, 325319, 325844, 327113]
53920C27113K296L316M143M853N400N602N628N921O505O927O998P066P249P031
53906D06048N987M521L470L133L016K425J158l51j450j871j845j710j640j850
53892D19041k570l643m498m967n633o868p967p983p096o386o354o483o221n603
53878C36769m886m259m007m324m823m805m152l422l056l067l409m004m337l858
53864B80360k899k469k895l399l250k666k220k024j892j781j639j281p58m73o25
53849B50089r35j114j175j121p99l07p7k69n62p16q69j040r73p25p83j301j732
53832B35591j677j438j317r26J39J439K140K039J536Q71J27k54K59J424K244K078
53816B44275J262N26J79J43M15J018J615J693J277J093J690K670L266L539M248
$$ y = [327113, 329409, 332725, 336868, 341721, 347121, 352723, 358351, 364272, 370777, 377704, 384702, 391768, 399017, 406048, 412035, 416556, 420026, 423159, 426175, 428600, 429758, 429407, 427957, 426086, 424241, 422531, 420891, 419041, 416471, 412828, 408330, 403363, 397730, 390862, 382895, 374912, 367816, 361430, 355076, 348593, 342372, 336769, 331883, 327624, 323617, 319293, 314470, 309665, 305513, 302091, 299035, 295968, 292559, 288555, 284218, 280360, 277461, 274992, 272097, 268698, 265448, 262782, 260562, 258538, 256646, 254865, 253226, 251945, 251187, 250714, 250089, 249154, 248040, 246865, 245744, 244945, 244638, 244561, 244292, 243730, 243014, 242145, 241105, 240132, 239407, 238624, 237323, 235591, 233914, 232476, 231159, 230233, 230372, 231811, 233951, 235990, 237526, 238397, 238524, 238270, 238529, 239953, 242197, 244275, 245537, 246063, 246242, 246385, 246800, 247818, 249433, 251126, 252403, 253496, 255186, 257856, 261122, 264661, 268909]
53801B68909N473O185N695M781M631N251N697N591N288M863L938K680J930K090
53787C33002K638K945K872K421J564O65K96L36k1j114k414l477m460n405n839
53772C24009n635n407n575n670n185m441m010l863l725l627l535l036k053j328
53758B66919j459j939j928j506j317j380j180p69p72j275j550j127m81l77r22
53743B48937j572j838j726j472j038j46J032J579Q05n87j080k46P83R33N16M06
53727B45286P64J238J719K121J981J157M45O49J334J447Q71M30N26P12P05Q43
53711B62228J400K110K672L108L462L664L800M083M326L928K674J252O56J240
53697C00603K450L398L617L349L068K877K570K209K117K174J723N12p72j389j477
$$ y = [268909, 274382, 280567, 286262, 291043, 295674, 300925, 306622, 312213, 317501, 322364, 326302, 328982, 330912, 333002, 335640, 338585, 341457, 343878, 345442, 346107, 346403, 346739, 346718, 345604, 343190, 339713, 335253, 329848, 324009, 318374, 312967, 307392, 301722, 296537, 292096, 288086, 284223, 280498, 276871, 273336, 270300, 268247, 266919, 265460, 263521, 261593, 260087, 258770, 257390, 256210, 255441, 254669, 253394, 251844, 250717, 250236, 249859, 248937, 247365, 245527, 243801, 242329, 241291, 241145, 242177, 243756, 244561, 243974, 242894, 242648, 243431, 244364, 244880, 245286, 246050, 247288, 249007, 251128, 253109, 254266, 254711, 255360, 256694, 258141, 259012, 259442, 259968, 260680, 261385, 262228, 263628, 265738, 268410, 271518, 274980, 278644, 282444, 286527, 290853, 294781, 297455, 298707, 299363, 300603, 303053, 306451, 310068, 313417, 316485, 319362, 321932, 324141, 326258, 328432, 330155, 330667, 329895, 328506, 327029]
53682C27029j561j623j306p83o17r55j434j752j822j483p20O3M78O40P45M83m22
53665C14960j420j706j365j047p95j44O67P52L6m59j33M12N37N94J059J477J066
53648C14491m2r26r46j80Q81J564J293K18o50l98Q03K047K761K976K905K786K912
53631C32495L190K876J507Ro0J447K897K997K421K586L492L966L678L643M467
53616C71611N296N182M592M663N506O210O166N547M622L557K833K908L301K919
53602D34913J629N81O13J126J107N39Q0n1j33k31j63N1K61M77N97J78r58k165
53584D38451k620k333j960j818j745j736k002k426k587k400k230k288k352k204
53570D07750j939j698j460j174q85o95p00r05j103r78m94P5N89J196J837K065
$$ y = [327029, 325468, 323845, 322539, 321756, 321139, 320184, 318750, 316998, 315176, 313693, 312973, 313036, 313514, 314154, 314899, 315382, 314960, 313540, 311834, 310469, 309422, 308627, 308483, 309150, 309902, 309938, 309479, 309346, 309758, 310295, 310889, 311948, 313425, 314491, 314449, 313523, 312577, 312397, 313278, 314842, 316135, 316353, 315703, 315305, 316108, 318155, 320916, 323892, 326797, 329583, 332495, 335685, 338561, 340068, 340077, 340017, 341464, 344361, 347358, 349779, 352365, 355857, 359823, 363501, 367144, 371611, 376907, 382089, 386681, 391344, 396850, 403060, 409226, 414773, 419395, 422952, 425785, 428693, 431994, 434913, 436542, 437123, 437736, 438862, 439969, 440508, 440588, 440537, 440404, 440173, 440010, 440061, 440322, 440799, 441396, 441574, 440616, 438451, 435831, 433498, 431538, 429720, 427975, 426239, 424237, 421811, 419224, 416824, 414594, 412306, 409954, 407750, 405811, 404113, 402653, 401479, 400594, 399899, 399199, 398294, 397191, 396213, 395719, 395794, 396383, 397579, 399416, 401481]
53554D01481J716J264J109R72N32J69M39J139J655J912K285K764K954K831K744
53539D25966K814K957L357M208N137N590N757O299P267Q061Q510R106J0040J0859
53525E15928J1288J1680J2381J3236J4024J4727J5231J5318J5256J5803J7320
53514F72192J9267K0853K1779K2281K2779K3662K4928K6056K6603K6857K7390
53503I34647K8063K8219K7754K7127K6303K4693K2495K1023K1086K1766K1527
53492A204703K0062J8401J7601J7917J8982K0221K1142K1553K1455K0745J9398
53481A422180J7936J7137J7030J6758J5783J4581J3727J2830J1064Q387N606L298
53469A576317J204j240m136o957r075j0418j1617j3311j5359j7018j7847j8059
$$ y = [401481, 403197, 404461, 405570, 406542, 407074, 407243, 407682, 408821, 410476, 412388, 414673, 417437, 420391, 423222, 425966, 428780, 431737, 435094, 439302, 444439, 450029, 455786, 462085, 469352, 477413, 485923, 495029, 505069, 515928, 527216, 538896, 551277, 564513, 578537, 593264, 608495, 623813, 639069, 654872, 672192, 691459, 712312, 734091, 756372, 779151, 802813, 827741, 853797, 880400, 907257, 934647, 962710, 990929, 1018683, 1045810, 1072113, 1096806, 1119301, 1140324, 1161410, 1183176, 1204703, 1224765, 1243166, 1260767, 1278684, 1297666, 1317887, 1339029, 1360582, 1382037, 1402782, 1422180, 1440116, 1457253, 1474283, 1491041, 1506824, 1521405, 1535132, 1547962, 1559026, 1567413, 1573019, 1576317, 1577521, 1576281, 1572145, 1565188, 1556113, 1545695, 1534078, 1520767, 1505408, 1488390, 1470543, 1452484]
53457A452484j8043j8057j8456j9584k1195k2458k2863k2710k2478k2198k1761
53446A222681k1355k1201k1086k0514j9146j6966j4351j2060j0642r726q377o361
53434A040896m443l189k182q45O14J739K773M282O170P796Q952J0044J1317J2548
53420A096472J3593J4768J6470J8686K1015K3001K4378K5210K5898K7010K8920
53409A335421L1423L3782L5337L6238L7289L8873M0476M1583M2643M4466M7025
53398A764556M9607N1898N4119N6191N7689N8647N9480O0113O0125N9808N9895
53387B392128O0106N9241N7136N5106N3870N2330M9389M5645M2213L8986L5343
53376B941493L1592K8199K4341J8862J2241O070P73m662j0812j7119k3188k9328
$$ y = [1452484, 1434441, 1416384, 1397928, 1378344, 1357149, 1334691, 1311828, 1289118, 1266640, 1244442, 1222681, 1201326, 1180125, 1159039, 1138525, 1119379, 1102413, 1088062, 1076002, 1065360, 1055634, 1047257, 1040896, 1036453, 1033264, 1031082, 1030237, 1030851, 1032590, 1035363, 1039645, 1045815, 1053611, 1062563, 1072607, 1083924, 1096472, 1110065, 1124833, 1141303, 1159989, 1181004, 1204005, 1228383, 1253593, 1279491, 1306501, 1335421, 1366844, 1400626, 1435963, 1472201, 1509490, 1548363, 1588839, 1630422, 1673065, 1717531, 1764556, 1814163, 1866061, 1920180, 1976371, 2034060, 2092707, 2152187, 2212300, 2272425, 2332233, 2392128, 2452234, 2511475, 2568611, 2623717, 2677587, 2729917, 2779306, 2824951, 2867164, 2906150, 2941493, 2973085, 3001284, 3025625, 3044487, 3056728, 3062798, 3063571, 3058909, 3048097, 3030978, 3007790, 2978462]
53364B978462l5546m1178m5919n0205n4222n7442n9531o0835o1614o1570o0595
53353B389805n9219n7927n6575n4866n2853n0673m8343m6103m4449m3537m2991
53342A832269m2430m1724m0720l9290l7675l6097l4029l0765k6857k3857k2266
53331A456559k0826j8508j6111j4887j4505j3673j2282j1523j1917j2572j2566
53320A297189j2105j1789j1580j1059j0123q943p598o228n161m448l501j705P34
53307A203683L039M766N997O773O991P102Q177J0802J4246J7191J9061K0224K1163
53294A349215K2076K3140K4536K6058K7206K7844K8297K8698K8693K7973K6627
53283A640363K4785K2396J9565J6629J3668J0525P434M952K896J65l706p591j0240
$$ y = [2978462, 2942916, 2901738, 2855819, 2805614, 2751392, 2693950, 2634419, 2573584, 2511970, 2450400, 2389805, 2330586, 2272659, 2216084, 2161218, 2108365, 2057692, 2009349, 1963246, 1918797, 1875260, 1832269, 1789839, 1748115, 1707395, 1668105, 1630430, 1594333, 1560304, 1529539, 1502682, 1478825, 1456559, 1435733, 1417225, 1401114, 1386227, 1371722, 1358049, 1345767, 1334244, 1322327, 1309755, 1297189, 1285084, 1273295, 1261715, 1250656, 1240533, 1231590, 1223992, 1217764, 1212603, 1208155, 1204654, 1202949, 1203683, 1206722, 1211488, 1217485, 1224258, 1231249, 1238351, 1246528, 1257330, 1271576, 1288767, 1307828, 1328052, 1349215, 1371291, 1394431, 1418967, 1445025, 1472231, 1500075, 1528372, 1557070, 1585763, 1613736, 1640363, 1665148, 1687544, 1707109, 1723738, 1737406, 1747931, 1755365, 1760317, 1763213, 1763378, 1759672, 1752081, 1741841]
53270A741841j2051j4345j7293j9801k1386k2911k5150k7678k9630l0841l1731
53259A489024l2559l3302l3866l4096l3802l3035l2059l1056l0077k9307k8926
53248A136939k8664k7984k6835k5710k4966k4545k4435k4791k5352k5329k4265
53237H54063k2554k0810j9134j7368j5669j4394j3631j3090j2337j1024r233p707
53225F77112p298q026r014r541r699r874j0142j0506j1214j2342j3434j3985j3973
53212E38064j3544j2624j1306j0186r701r411q593p324o378o130o294o639p226
53199D22708p886q075p637p160p232p677p850p466o782o135n587n004m298l554
53185C30365l024k949l271l623l668l394l018k676k362k109j997j926j618j042
$$ y = [1741841, 1729790, 1715445, 1698152, 1678351, 1656965, 1634054, 1608904, 1581226, 1551596, 1520755, 1489024, 1456465, 1423163, 1389297, 1355201, 1321399, 1288364, 1256305, 1225249, 1195172, 1165865, 1136939, 1108275, 1080291, 1053456, 1027746, 1002780, 978235, 953800, 929009, 903657, 878328, 854063, 831509, 810699, 791565, 774197, 758528, 744134, 730503, 717413, 705076, 694052, 684819, 677112, 669814, 661788, 652774, 643233, 633534, 623660, 613518, 603012, 591798, 579456, 566022, 552037, 538064, 524520, 511896, 500590, 490404, 480703, 471292, 462699, 455375, 448997, 442867, 436573, 429934, 422708, 414822, 406747, 399110, 391950, 384718, 377041, 369191, 361725, 354943, 348808, 343221, 338217, 333919, 330365, 327341, 324392, 321121, 317498, 313830, 310436, 307418, 304742, 302380, 300271, 298274, 296348, 294730, 293688]
53171B93688o71r97j818k463k686k864l088k709j366Q6M78j07n36l61l09q19j139
53154B72319n23N53J118J069R83R45N00l99j221j606j608j286o65j24q3l06j75
53137B69491K40J92n11j008n35N97J532J875J712J215P03O42J064J347J049N83
53121B80188N17O13K99k61l29K77J055J712K363K747K183O94o35r86q32j076j683
53104B86846j900j528j178j301j633j723j509j189q88o66o51r38j420j802j776
53089B66744j273o77n36r36j263r62l37j70o22j009p73j62L48P71J348J795J512
53072B63798N48j76L0O80O64l09j293j309n09J31O6l95q07j112j287j105n68j82
53054B56865l09n28j40Q57J783K103J829J225O05L57O35J045J054O66K46k27j042
$$ y = [293688, 293017, 292020, 290202, 287739, 285053, 282189, 279101, 276392, 275026, 275112, 275590, 275483, 274947, 274586, 274277, 273458, 272319, 271796, 272349, 273467, 274536, 275519, 276464, 276964, 276565, 275344, 273738, 272130, 270844, 270179, 270055, 269972, 269666, 269491, 269731, 269923, 269412, 268404, 267869, 268466, 269998, 271873, 273585, 274800, 275503, 276145, 277209, 278556, 279605, 280188, 280705, 281318, 281617, 281356, 281027, 281304, 282359, 284071, 286434, 289181, 291364, 292058, 291423, 290437, 289605, 288529, 286846, 284946, 283418, 282240, 280939, 279306, 277583, 276074, 274885, 273997, 273331, 272680, 271742, 270322, 268520, 266744, 265471, 264794, 264258, 263322, 262059, 261097, 260760, 260590, 259968, 258959, 258186, 258024, 258372, 259143, 260491, 262286, 263798, 264346, 264170, 264200, 264880, 265544, 265235, 263942, 262633, 262124, 262255, 262321, 261926, 261119, 260007, 258720, 257615, 257047, 256865, 256556, 256028, 255888, 256745, 258528, 260631, 262460, 263685, 264290, 264647, 265282, 266327, 267381, 268047, 268293, 268066, 267024]
53037B67024j926k068j222j30M31M85M17K49j77o94r07o58q3N22Q27P17N56P68
53019B64131J082P87j57r47j101r86q24q1J399K530K236J029K70K65K50nJ62R52
53001B70992J571J410Q72N30K90j51n95o80m85l12j62O7J30l25j058j229k27J602
52983B72240L174L649L118K323J722J190O24L95Q23J515J782J533J260J222J183
52968B97753R68P76P99R46J041J042R55P97O12L06l78j362j964j642q67o37j139
52951B98006j544j231n88l61p78j511k104k245j972j780k000k178j585m43K16
52936B77902R7J30R25J629J103l35j337j259o49j62O3j6n27j160j169k85P97J137
52918B76884N43l87r18o98J15R62J272Q93J82l75m80j7Q99J739J744O46q96j877
$$ y = [267024, 265098, 263030, 261808, 261678, 262109, 262594, 263011, 263260, 263083, 262389, 261482, 260824, 260741, 261263, 262090, 262807, 263363, 264131, 265213, 266000, 265843, 264896, 263795, 262809, 261985, 261904, 263303, 265833, 268069, 269098, 269368, 269633, 269883, 269878, 270040, 270992, 272563, 273973, 274845, 275375, 275665, 275514, 274919, 274239, 273754, 273442, 273280, 273347, 273477, 273152, 272094, 270865, 270638, 272240, 275414, 279063, 282181, 284504, 286226, 287416, 288040, 288435, 289258, 290773, 292555, 294088, 295348, 296570, 297753, 298721, 299497, 300296, 301242, 302283, 303325, 304280, 305077, 305689, 305995, 305617, 304255, 302291, 300649, 299782, 299145, 298006, 296462, 295231, 294643, 294282, 293504, 291993, 289889, 287644, 285672, 283892, 281892, 279714, 278129, 277686, 277902, 277999, 278129, 279054, 280683, 281786, 281451, 280114, 278855, 278206, 278044, 278107, 278091, 277564, 276404, 275235, 274950, 275747, 276884, 277427, 277040, 276122, 275424, 275539, 276501, 277773, 278666, 278848, 278473, 277993, 277976, 278875, 280614, 282358, 283004, 282108, 280231]
52900B80231j948j551j173q80o32n73o76m62L97J372J505N75o04j167j058p18
52884B72638l85j3L66N94O21N54N48O80Q19O43Q8k20M57J859K798K605J967J845
52866B88464K231K558K808L306L695L100J428k79r42m90K22J79j058k885m073
52851B98264m021l447l321l529l279k577k259k613k925k618j993j529j219r74
52837B61960r81j235j247p11%L52L09K19K90L98J86n90j575j827q95M27J046J054
52819B57180J324J806J475J69q44o43R4K91m3k53j82M2N73J400J895J596R58N84
52801B67422K63m64j305j696j697j686j503r17m66q30j613j829j441j346j784
52786B49108j897j139j39L15L97P81J489J826J337L91k04j1O31J021Q41L63k0
$$ y = [280231, 278283, 276732, 275559, 274679, 274047, 273474, 272798, 272336, 272733, 274105, 275610, 276185, 275581, 274414, 273356, 272638, 272253, 272240, 272606, 273200, 273821, 274375, 274923, 275603, 276422, 277065, 277153, 276933, 277390, 279249, 282047, 284652, 286619, 288464, 290695, 293253, 296061, 299367, 303062, 306162, 307590, 307311, 306369, 305879, 306101, 306280, 305222, 302337, 298264, 294243, 290796, 287475, 283946, 280667, 278090, 275831, 273218, 270293, 267675, 265682, 264153, 262934, 261960, 260979, 259744, 258497, 257786, 257786, 258138, 258447, 258666, 258956, 259354, 259540, 258950, 257375, 255548, 254653, 255080, 256126, 257180, 258504, 260310, 261785, 261954, 261110, 260467, 260561, 260852, 260809, 260556, 260374, 260416, 260989, 262389, 264284, 265880, 266838, 267422, 267685, 267221, 265916, 264220, 262523, 260837, 259334, 258417, 257951, 257121, 255508, 253679, 252238, 250892, 249108, 247211, 246072, 245933, 246248, 246645, 247426, 248915, 250741, 252078, 252469, 252265, 252254, 252885, 253906, 254747, 255110, 255090]
52769B55090k14k89k22j1K49M33M00j29j176k020j718l59Q69J129Q29O53N59K46
52751B54319q6k07l79o24j95J317K922L419L131L232L687L273J683K52K02J231
52735B77177K146K175J267l2p36j17J379K515K649K169J502N67n72j413j698j733
52719B87245j643j193o20p85j841k571j843j54J059J156O42Q0l95o96o94o31r45
52702B76171j532j748j316p00l86k07J82N42L06m65r50o33l3O2k44j42N93J232
52684B70732J212R53J077J365J124K98m34o11m38l65o38j247j878j950j168rP61
52667B68784R84J110J363J413R94L59oJ45O89J184J223R89J273K479L810M076
52651B90869L167K099J650J628J469R30K6r93j605j473j069j150j621j665j113
$$ y = [255090, 254876, 254587, 254365, 254354, 254603, 255036, 255436, 255307, 254131, 252111, 250393, 250034, 250903, 252032, 252861, 253514, 254073, 254319, 254233, 254026, 253647, 253023, 252828, 254145, 257067, 260486, 263617, 266849, 270536, 273809, 275492, 275744, 275946, 277177, 279323, 281498, 282765, 282733, 281997, 281880, 283259, 285774, 288423, 290592, 292094, 292661, 292089, 290676, 288978, 287245, 285602, 284409, 283789, 283004, 281163, 278592, 276749, 276595, 277654, 278810, 279452, 279532, 279137, 278441, 277747, 277116, 276171, 274639, 272891, 271575, 270875, 270489, 270282, 270464, 271006, 271312, 270847, 269897, 269264, 269231, 269293, 269049, 268907, 269500, 270732, 271944, 272897, 273974, 275339, 276463, 276761, 276327, 275716, 275278, 274913, 274275, 273028, 271150, 269200, 268032, 268023, 268784, 269768, 270878, 272241, 273654, 274648, 275007, 275001, 275146, 275835, 277019, 278242, 279231, 280504, 282983, 286793, 290869, 294036, 296135, 297785, 299413, 300882, 301812, 301838, 300845, 299240, 297767, 296698, 295548, 293927, 292262, 291149]
52636B91149p77j129j545j332p32k98MM43P82O37K15K0J40L29M97O22M64j3k79
52617B89197J06O71N54k67r30q04r0O96J191J081J68j152j946j692q72k93r2J91
52599B85717P53J126Q45J11m34m48r3M18J044J595J595Q25k15p63o65m21m41o17
52581B89932o45l61K78J229K161K563K224J435O46M6m18p86j025j093j071j151
52565B93964j452j744j638j125p23q00j060r74n06lL33M19R7n26q36m62nl16j226
52546B81417j808j714j306o49N19J676J732P18R8P14J521J198J18l31K39J006
52530B85148J370J522J717J837J739J462J017M94J91K72M06K37k9Q6O55J420K243
52513C01787L004L299K928K478K726L531L997L685K966K121Q71q64k399l020k931
$$ y = [291149, 290372, 289243, 287698, 286366, 285634, 285336, 285340, 285783, 286565, 287202, 287417, 287437, 287577, 287906, 288403, 289025, 289489, 289476, 289197, 289303, 289974, 290528, 290261, 289331, 288527, 288437, 289133, 290324, 291405, 291573, 290421, 288475, 286783, 285911, 285618, 285526, 285717, 286470, 287596, 288441, 288552, 288118, 287670, 287577, 287995, 289039, 290634, 292229, 293054, 292839, 292076, 291411, 290990, 290549, 289932, 289287, 288926, 289204, 290433, 292594, 295157, 297381, 298816, 299462, 299508, 299090, 298304, 297279, 296186, 295115, 293964, 292512, 290768, 289130, 288005, 287282, 286482, 285422, 284448, 283942, 283939, 284272, 284691, 284788, 284262, 283426, 282964, 282959, 282643, 281417, 279609, 277895, 276589, 275940, 276459, 278135, 279867, 280585, 280683, 281397, 282918, 284116, 284234, 283903, 284142, 285148, 286518, 288040, 289757, 291594, 293333, 294795, 295812, 296306, 296497, 296769, 297175, 297412, 297383, 297469, 298124, 299544, 301787, 304791, 308090, 311018, 313496, 316222, 319753, 323750, 327435, 330401, 332522, 333393, 332529, 330130, 327110, 324179]
52498C24179k992l639m427m693m301l629k995k349j596r56p72r99j211j125r07
52483B87588q07p51m44K84J317K263K630K204J323N64J87J34M88J388K536L298
52467C04202L472L429L354L009K435K196K549K886K615J979J588J475J152K10
52453C36551j478l707n631o109n009l642l239l514l447k937k630k571k144j329
52439B89164q18q33p64k39L36N76O45O58L40k72m64K26J189J416P17j92o01m01
52421B90683O1L51J65m73j096j013J12J834L168L488L188L092L294L207K924L647
52405C16632N985Q524R166P770O279O143O672O293M463J772j084l661n571o597
52391C62786o929o819o200n015l629k567j942j521j139q13n88m90n03l44M10J682
$$ y = [324179, 321187, 317548, 313121, 308428, 304127, 300498, 297503, 295154, 293558, 292602, 291830, 290831, 289620, 288495, 287588, 286781, 286030, 285586, 285870, 287187, 289450, 292080, 294284, 295607, 296171, 296358, 296492, 296980, 298368, 300904, 304202, 307674, 311103, 314457, 317466, 319901, 322097, 324646, 327532, 330147, 332126, 333714, 335189, 336341, 336551, 335073, 331366, 325735, 319626, 314617, 310975, 307736, 304222, 300775, 297838, 295208, 292637, 290493, 289164, 288346, 287513, 286749, 286510, 286846, 287422, 288067, 288725, 289065, 288793, 288329, 288555, 289744, 291160, 291877, 291685, 291084, 290683, 290744, 291095, 291260, 290787, 289691, 288678, 288790, 290624, 293792, 297280, 300468, 303560, 306854, 310061, 312985, 316632, 322617, 331141, 340307, 348077, 354356, 360499, 367171, 373464, 377927, 379699, 378615, 374954, 369383, 362786, 355857, 349038, 342838, 337823, 334194, 331627, 329685, 328164, 327025, 326212, 325624, 325134, 324631, 324287, 324697, 326379]
52375C26379K679K734K218K079K668L528M314N157N930N838M370K264Q51N08L90
52360C71907k68j207j800k039k352k729k671j928p83L64J282J745J598J062O10
52345C62791M25L61M08P75J416J965K273K532K815L034L452M533O082P238P663
52330D07763P981Q663R313R645J0204J1334J2302J2383J2157J2579J3357J3576
52318E41257J3383J3629J4104J3753J2726J2604J4112J5962J6691J6477J6439
52307G01137J7068J8166J9506K0739K1252K0879K0301K0123K0007J9290J7950
52296I16418J6423J4857J3176J1501R866P897N305K470L1j785l099l997m680n528
52282I78855o458o676n719m356l744l947m070l612k882k176j345l59M65R80J523
$$ y = [326379, 329058, 331792, 334010, 336089, 338757, 342285, 346599, 351756, 357686, 363524, 367894, 370158, 371009, 371517, 371907, 371639, 370432, 368632, 366593, 364241, 361512, 358841, 356913, 356130, 356494, 357776, 359521, 361119, 362181, 362791, 363216, 363577, 363985, 364760, 366176, 368141, 370414, 372946, 375761, 378795, 382247, 386780, 392862, 400100, 407763, 415744, 424407, 433720, 443365, 453569, 464903, 477205, 489588, 501745, 514324, 527681, 541257, 554640, 568269, 582373, 596126, 608852, 621456, 635568, 651530, 668221, 684698, 701137, 718205, 736371, 755877, 776616, 797868, 818747, 839048, 859171, 879178, 898468, 916418, 932841, 947698, 960874, 972375, 982241, 990138, 995443, 997913, 997944, 996159, 993060, 989063, 984383, 978855, 972397, 965721, 960002, 955646, 951902, 947955, 943885, 940273, 937391, 935215, 933870, 933511, 933976, 934956, 936479]
52267I36479K452L769N258O654P640Q127Q525R382J0679J1934J2950J3932J4879
52254A052660J5473J5720J6066J6521J6273J4715J2421J0550R456Q424O709M313
52242A199301J753m84k154l278m193n317o683p842q426q648r015r692j0399j0931
52228A113992j1463j2181j2850j2991j2440j1593j1023j1010j1343j1422j0538
52217I85138q428n728l672k986l117k812j546n2O49M87K82O88J544K313K717K777
52201I68254K597K398K576L361M439N224N523N668O016O564P076P300P016O153
52187A040165M962L848K882J774L85r98k082l027m226n825p549q963r773r983
52173A001590r856r506q628o898m687k954k242k132j816q87N96K262L437L487
$$ y = [936479, 938931, 942700, 947958, 954612, 962252, 970379, 978904, 988286, 998965, 1010899, 1023849, 1037781, 1052660, 1068133, 1083853, 1099919, 1116440, 1132713, 1147428, 1159849, 1170399, 1179855, 1188279, 1194988, 1199301, 1201054, 1200570, 1198416, 1195138, 1190945, 1185628, 1178945, 1171103, 1162677, 1154029, 1145014, 1135322, 1124923, 1113992, 1102529, 1090348, 1077498, 1064507, 1052067, 1040474, 1029451, 1018441, 1007098, 995676, 985138, 976710, 970982, 967310, 964324, 961207, 958395, 956849, 956797, 957446, 957933, 958215, 958903, 960447, 962760, 965477, 968254, 970851, 973249, 975825, 979186, 983625, 988849, 994372, 1000040, 1006056, 1012620, 1019696, 1026996, 1034012, 1040165, 1045127, 1048975, 1051857, 1053631, 1054016, 1053018, 1050936, 1047909, 1043683, 1037858, 1030309, 1021346, 1011573, 1001590, 991734, 982228, 973600, 966702, 962015, 959061, 956819, 954687, 952871, 951984, 952580, 954842, 958279, 961766]
52159I61766K649J983K154K602K438J670R86P07O29O53Q40R97Q85P24R31J418
52143I84032J736J733J557J173N54J39L51Q01P73L98N48J499K661L772N371P744
52127A014842J0239J2122J3537J5107J7115J9447K1797K3603K4272K3917K3459
52116A219457K3622K4177K4455K4161K3298K1810J9835J8031J7091J6935J6712
52105A449584J5646J3811J2148J1648J2383J3381J3660J3111J2045J0326P724
52094A585467M797K435M74k179n856r610j2648j5192j7378j8443j7942j6877j6589
52081A460459j6996j6897j5739j4126j2740j1599j0416r120p839o702n704m598
52069A327983l077j135J006L356O033Q557R972J0049R782J0289J1591J2918J3674
$$ y = [961766, 964415, 966398, 968552, 971154, 973592, 975262, 976248, 976955, 977584, 978237, 979077, 980074, 980959, 981683, 982614, 984032, 985768, 987501, 989058, 990231, 990785, 990924, 991275, 992076, 992849, 993247, 993795, 995294, 997955, 1001727, 1007098, 1014842, 1025081, 1037203, 1050740, 1065847, 1082962, 1102409, 1124206, 1147809, 1172081, 1195998, 1219457, 1243079, 1267256, 1291711, 1315872, 1339170, 1360980, 1380815, 1398846, 1415937, 1432872, 1449584, 1465230, 1479041, 1491189, 1502837, 1515220, 1528601, 1542261, 1555372, 1567417, 1577743, 1585467, 1590264, 1592699, 1593173, 1590994, 1585138, 1575528, 1562880, 1547688, 1530310, 1511867, 1493925, 1477048, 1460459, 1443463, 1426566, 1410827, 1396701, 1383961, 1372362, 1361946, 1352826, 1344987, 1338285, 1332581, 1327983, 1324906, 1323771, 1324777, 1328133, 1334166, 1342723, 1352695, 1362744, 1372526, 1382815, 1394406, 1407324, 1420998]
52056A420998J3836J3852J4444J5847J6981J6241J3552J0725R104P872N524K068
52044A561044j342m237p000r652j1753j3201j4183j4487j3936j3218j3174j3563
52032A431298j3562j3289j3532j4206j4299j3516j2704j2510j2643j2701j2677
52021A285659j2446j1786j1089j1006j1216j0635r131p909p705p806p397o857
52009A170676o959p628q334r065j0145j1614j3400j5542j7697j8985j9043j8684
51997A013580j8839j9244j8894j7465j5631j4183j3407j3160j3103j2982j2981
51986H43691j3521j4529j5276j5329j5127j5192j5247j4759j3882j3251j3046
51975F84532j2976j2932j2999j2946j2291j0899q991o561l398K27L379N192N626
$$ y = [1420998, 1434834, 1448686, 1463130, 1478977, 1495958, 1512199, 1525751, 1536476, 1545580, 1553452, 1558976, 1561044, 1559702, 1555465, 1548465, 1538813, 1527060, 1513859, 1499676, 1485189, 1471253, 1458035, 1444861, 1431298, 1417736, 1404447, 1390915, 1376709, 1362410, 1348894, 1336190, 1323680, 1311037, 1298336, 1285659, 1273213, 1261427, 1250338, 1239332, 1228116, 1217481, 1208350, 1200441, 1192736, 1184930, 1177533, 1170676, 1163717, 1156089, 1147755, 1138690, 1128545, 1116931, 1103531, 1087989, 1070292, 1051307, 1032264, 1013580, 994741, 975497, 956603, 939138, 923507, 909324, 895917, 882757, 869654, 856672, 843691, 830170, 815641, 800365, 785036, 769909, 754717, 739470, 724711, 710829, 697578, 684532, 671556, 658624, 645625, 632679, 620388, 609489, 600498, 593937, 590539, 590766, 594145, 599337, 604963]
51962F04963N421N452O053O703O474M989K829P88r81k730m300n179n304n240n280
51947F14658m880l347p99J877M014N820P976J0719J3453J5370J6281J6632J6719
51934G14493J6325J5347J4352J3931J3633J2223R250N804L371K191J205n51l043
51921H18531n777q613j1707j4990j8150k0996k3379k4824k4776k3340k1372j9549
51909F01058j7677j5114j1686p943m697k457j005N28K823N397O859O379M475K104
51895E69044l81k889m949o289p576r537j1545j2175j1103r444q048o497m195j494
51881D72922Q00K462L858N287O774Q130R020R316R401R675R706Q653O587M546
51867E67137L040J434p65k988m476n261n543n061l834k819k712k750j791j50Q12
$$ y = [604963, 610384, 615836, 621889, 628592, 635066, 640055, 642884, 643672, 642691, 639961, 635661, 630482, 625178, 619938, 614658, 609778, 606431, 605632, 607509, 611523, 617343, 625319, 636038, 649491, 664861, 681142, 697774, 714493, 730818, 746165, 760517, 774448, 788081, 800304, 809554, 815358, 818729, 820920, 822125, 821574, 818531, 812754, 804141, 792434, 777444, 759294, 738298, 714919, 690095, 665319, 641979, 620607, 601058, 583381, 568267, 556581, 548638, 543941, 541484, 540479, 541007, 543830, 549227, 556086, 562465, 566940, 569044, 568663, 565774, 560825, 554536, 546960, 537423, 525878, 513703, 502600, 493156, 485108, 478611, 474416, 472922, 473722, 476184, 480042, 485329, 492103, 500233, 509253, 518569, 527970, 537645, 547351, 556004, 562591, 567137, 570177, 571611, 570846, 567858, 563382, 558121, 552578, 547517, 543683, 540864, 538152, 535402, 533611, 533461, 534273]
51852E34273O70K89L09L78L5o84j799l566n692p122p186o430n941o111o448o323
51836D78652n545m372l204k242j469r08o47m64J87J459K636K842J933L63j468
51821D67753l164m016l592k520j772j354m65R64J974J947J398J045R42R18J045
51806D61103J267J208Q31N38L13m07j498j776p29K90k34j734k336j459l54n9k95
51789D54669n82j114j891k125j345l41j30n64p72n94o18r72j023m21L70Q35J214
51772D44596K147L856N997Q055R632J0501J0697J0425R895R240Q602P981O968
51759E48592M981K066r24l313n405p853j0380j1868j1808j0995j0439j0141r350
51746D63163p747n757l911k426j368o83P0J503L617N536O379O267O178O812P908
$$ y = [534273, 534943, 535232, 535541, 535919, 535954, 535270, 533471, 529905, 524213, 517091, 509905, 503475, 497534, 491423, 484975, 478652, 473107, 468735, 465531, 463289, 461820, 460912, 460265, 459801, 459988, 461447, 464083, 466925, 468858, 469221, 467753, 464589, 460573, 456981, 454461, 452689, 451335, 450870, 451834, 453808, 455755, 457153, 458198, 459140, 460058, 461103, 462370, 463578, 464409, 464947, 465260, 464853, 463355, 461579, 460850, 461140, 460906, 459172, 456836, 455377, 455023, 454964, 454669, 454087, 452973, 451082, 448957, 447612, 447271, 447141, 446577, 445805, 445211, 444593, 443621, 442598, 442177, 442547, 443382, 444596, 446743, 450599, 456596, 464651, 474283, 484784, 495481, 505906, 515801, 525041, 533643, 541624, 548592, 553573, 555639, 554715, 551402, 545997, 538144, 527764, 515896, 504088, 493093, 482654, 472513, 463163, 455416, 449659, 445748, 443322, 441954, 441271, 441341, 442844, 446461, 451997, 458376, 464643, 470821, 477633, 485541]
51731D85541Q687Q692Q037P007N685M034K190N48m30m58L98J631K397J946J53
51716E36058k306m387n337n110m272l541l301l388l433l331l297l458l565l307
51702D84025k699k003j320m83N66J431J467M17j130k101j969j316j064j196q43
51687D71782K48R36J3k130l921m483m275l895l166j819k68Q59J500J884J983J843
51671D57091K056L130M583N555O186P442R468J1128J1603J1560J1949J2345J1388
51658E65484Q514M402o6m329p656r217r000p953o787n258l126j054R4M19N64L55
51642E25386j181m257p632r847j0634j0626j0136q929p110n482m709m474l859
51629D36510k473r04N0K64L03O72J308J773J745J239N02k52j056k070l168l784
$$ y = [485541, 494228, 502920, 510957, 517964, 523649, 527683, 529873, 530421, 529991, 529533, 529931, 531562, 533959, 535905, 536058, 533752, 529365, 524028, 518918, 514646, 511105, 507804, 504416, 500983, 497652, 494355, 490897, 487332, 484025, 481326, 479323, 478003, 477520, 478086, 479517, 480984, 481401, 480271, 478170, 476201, 474885, 473821, 472625, 471782, 472030, 472966, 472979, 470849, 466928, 462445, 458170, 454275, 451109, 449290, 449022, 449881, 451381, 453265, 455248, 457091, 459147, 462277, 466860, 472415, 478601, 486043, 495511, 506639, 518242, 529802, 541751, 554096, 565484, 573998, 578400, 578334, 574005, 566349, 557132, 548132, 540179, 533392, 528134, 525008, 523954, 524048, 524467, 525031, 525386, 524205, 519948, 512316, 502469, 491835, 481209, 471073, 462144, 455034, 449552, 444843, 440369, 436510, 434037, 433133, 433183, 433447, 433750, 434422, 435730, 437503, 439248, 440487, 440989, 440737, 439681, 437611, 434443, 430659]
51613D30659l479k548j806j660j842k026k267k639k889k806k532k167j451k88
51599D00259Q03J395K026L633O189Q550R723R712R061Q101O852N222L088N75j738
51584D73451l241l953m295m241l296j457N57K264L976O066Q312J0384J2433J4637
51570E11597J6582J7649J7788J7447J7107J7259J8379K0339K2214K3306K4153
51559G23820K5822K8456L1176L3259L4634L5191L4362L1610K6807K0011J1438
51548A036586J867p478j5741k2777k8618l3005l5773l7234l7808l7551l6345l4288
51536G11835l1595k8359k4692k0910j7278j3720j0146o900m562l323k850k734
51524E44766k743k671k344j928j906k505l375m120m854n891o991p413o843n847
$$ y = [430659, 427180, 424632, 422826, 421166, 419324, 417298, 415031, 412392, 409503, 406697, 404165, 401998, 400547, 400259, 401062, 402457, 404483, 408116, 414305, 422855, 432578, 442290, 451351, 459452, 466304, 471526, 474614, 475189, 473451, 470210, 466257, 461962, 457721, 454425, 452968, 453525, 455789, 459765, 465831, 474143, 484527, 496960, 511597, 528179, 545828, 563616, 581063, 598170, 615429, 633808, 654147, 676361, 699667, 723820, 749642, 778098, 809274, 842533, 877167, 912358, 946720, 978330, 1005137, 1025148, 1036586, 1038453, 1030975, 1015234, 992457, 963839, 930834, 895061, 857827, 820019, 782468, 746123, 711835, 680240, 651881, 627189, 606279, 589001, 575281, 565135, 558235, 553673, 550350, 547500, 544766, 542023, 539352, 537008, 535080, 533174, 530669, 527294, 523174, 518320, 512429, 505438, 498025, 491182, 485335]
51510D85335n177m974m935m885m792m434l638k731k292k415k625k604k474k358
51496D35001k142j862j770j777j366l81M94N90K14K07P71J254J124N78O8l90j119
51479D29494k135k825k526j375l87l72j015j429j427j551j908j896j390j192j729
51464D06337k168j679q99j043k071k841k864k657k414j651m30K87K1m04q1P28
51448C86171J292J760K906M900O994Q409R038R343R931J1125J2584J3359J2618
51435D90430J0371P360M407J909j22j745k807l071k804k973m352o363p508p082
51421D75650n958n307n175m754l650k264j159o51p78j166j111l14M96L20p75j671
51405D41733j619j085q93j092j042l22Q79K102K975L349L422L694M518N660O545
$$ y = [485335, 480158, 475184, 470249, 465364, 460572, 456138, 452500, 449769, 447477, 445062, 442437, 439833, 437359, 435001, 432859, 430997, 429227, 427450, 426084, 425703, 426197, 426787, 427001, 427208, 427979, 429233, 430357, 430935, 431003, 430613, 429494, 427359, 424534, 422008, 420633, 420246, 419874, 418859, 417430, 416003, 414452, 412544, 410648, 409258, 408066, 406337, 404169, 402490, 401591, 400548, 398477, 395636, 392772, 390115, 387701, 386050, 385620, 385907, 385928, 385524, 385443, 386171, 387463, 389223, 392129, 397029, 404023, 412432, 421470, 430813, 440744, 451869, 464453, 477812, 490430, 500801, 508161, 512568, 514477, 514355, 512610, 509803, 506732, 503928, 500955, 496603, 490240, 482732, 475650, 469692, 464385, 459210, 454456, 450806, 448542, 447383, 446732, 445954, 444788, 443677, 443363, 443859, 444179, 443404, 441733, 440114, 439029, 438136, 437044, 436002, 435680, 436559, 438661, 441636, 444985, 448407, 452101, 456619, 462279, 468824]
51390D68824P008P471Q357R641J1177J3123J5760J9044K2734K6876L1704L7027
51378F78746M2076M6186M9257N1445N2682N2722N1353M8314M3241L5912K6398
51367A178332J4907J935j1235k2771l1585l8105m3258m7105m9122m9480m9076
51356H53437m8299m6613m3630l9866l6090l2547k9116k5765k2447j9010j5638
51345D94416j2973j1411j0514r545q337p259o492n760m800l763l048k828k789
51332D04897k442j707j080r97j184r72j77P62J481K035K497K697K599K447K344
51317D13200K033J320M20l24p23o94l38j34n32j263j566j270j017j133j109n77
51301D06293o8j73o34r44j272j963k647k729k473k598k999k841j927j071q09o49
$$ y = [468824, 475832, 483303, 491660, 501301, 512478, 525601, 541361, 560405, 583139, 610015, 641719, 678746, 720822, 767008, 816265, 867710, 920392, 973114, 1024467, 1072781, 1116022, 1151934, 1178332, 1193239, 1195174, 1183939, 1161168, 1129583, 1091478, 1048220, 1001115, 951993, 902513, 853437, 805138, 758525, 714895, 675029, 638939, 606392, 577276, 551511, 529064, 510054, 494416, 481443, 470032, 459518, 449973, 441636, 434377, 427885, 422125, 417325, 413562, 410514, 407686, 404897, 402455, 400748, 399668, 398671, 397487, 396515, 396338, 397100, 398581, 400616, 403113, 405810, 408409, 410856, 413200, 415233, 416553, 416973, 416649, 415926, 415232, 414894, 414760, 414228, 412965, 411399, 410129, 409112, 407979, 406870, 406293, 406225, 406052, 405418, 404474, 403202, 401239, 398592, 395863, 393390, 390792, 387793, 384952, 383025, 381954, 381145, 380496]
51285C80496J02J294K211K569K874L797N308O518O513N474M537M350M246L351
51271D33640J958J088J000J032Q34P94J194J757K211K619K938K885K406J703O80
51256D58739q31k288k752k288k150l045m113m310m001m286n281o024n838m930
51242D06602l727k468j481j146j404j721j685j355r36m63J45Q85J521J561P31
51227C95059m09p45Q6J146J474J419J890K728K942K419K173K584K638J545J47
51212D17096k59K46N40K26r0q8j75m64k97P20J956K520K376K165K282K584K811
51195D34149K821K526J924J195M92j99q71j326j439j343j112n80J85N17r2j044
51179D35803j161k04P37O13m40j533k076j996j435p44m82q15j125o66N39J812
$$ y = [380496, 380598, 381892, 384103, 386672, 389546, 393343, 398651, 405169, 411682, 417156, 421693, 426043, 430289, 433640, 435598, 436686, 437686, 438718, 439552, 440346, 441540, 443297, 445508, 448127, 451065, 453950, 456356, 458059, 458739, 457908, 455620, 452868, 450580, 448430, 445385, 441272, 436962, 432961, 428675, 423394, 417370, 411532, 406602, 402875, 400407, 398926, 397780, 396376, 394655, 392970, 391615, 390679, 390216, 390361, 391246, 392767, 394328, 395059, 394650, 393905, 393991, 395137, 396611, 398030, 399920, 402648, 405590, 408009, 410182, 412766, 415404, 416949, 417096, 416837, 417083, 417623, 417849, 417759, 417671, 417496, 417032, 416735, 417455, 419411, 421931, 424307, 426472, 428754, 431338, 434149, 436970, 439496, 441420, 442615, 443107, 442908, 442037, 440711, 439272, 437929, 436817, 436237, 436422, 436939, 436847, 435803, 434642, 434438, 435175, 435788, 435348, 433815, 431739, 429743, 428308, 427564, 427082, 426267, 425142, 424476, 425015, 426827]
51163D26827K671L155L425L537L534L383K905K117J462J202P31p26k784m057l916
51148D43466l270l214l586l539k958k421k088j531p36l54p42j334j356p16J57
51133D15778R37J481J634J423J244J443J807J901J775J874K239K409K274K465
51119D40684L416M531M792M056L131K669K480K122J586J151R06P97Q41R98R97
51104D75157O47J59j51k75m14m79k35K12M39L48L11N28O50K73m70j117j412j364
51086D72807r57k40M59P46O22M01K22q3n51r26r95q09m31K37J096J679J669J452
51068D76398J721K630L716M687N848P563R658J1693J3502J5171J6632J7728J8625
51055F05572J9623K0448K0153J8157J5192J2823J1937J2062J2254J2200J2022
$$ y = [426827, 429498, 432653, 436078, 439615, 443149, 446532, 449437, 451554, 453016, 454218, 454949, 454223, 451439, 447382, 443466, 440196, 436982, 433396, 429857, 426899, 424478, 422390, 420859, 420123, 419769, 419027, 417693, 416337, 415621, 415778, 416715, 418196, 419830, 421253, 422497, 423940, 425747, 427648, 429423, 431297, 433536, 435945, 438219, 440684, 444100, 448631, 453423, 457479, 460610, 463279, 465759, 467881, 469467, 470618, 471524, 472321, 473162, 474160, 475157, 475804, 475963, 475812, 475537, 475123, 474644, 474409, 474621, 475060, 475408, 475719, 476247, 476897, 477170, 476700, 475583, 474171, 472807, 471850, 471610, 472069, 472815, 473437, 473838, 474060, 473977, 473426, 472500, 471505, 470696, 470265, 470502, 471598, 473277, 474946, 476398, 478119, 480749, 484465, 489152, 495000, 502563, 512221, 523914, 537416, 552587, 569219, 586947, 605572, 625195, 645643, 665796, 683953, 699145, 711968, 723905, 735967, 748221, 760421, 772443]
51044G72443J1243Q725M073j350n412p192p610q172r521j1249j2454j2257j0399
51031G10868p805o194o603q464j0502j2035j2904j2667j0886q185n963m780l805
51018F00075k213l42J053K033L204M685O068P259Q621J0189J1320J1407J0606
51005F73965R771R691J0404J1125J0926R591P763O069M484K701R14k74o35o53
50991G55842j045k097l438m243l828k263l83J137K602M772P706J0548J2628J4222
50977G92160J5978J7960J9727K1059K2171K3164K3881K4512K5926K8891L3120
50966A048549L7561M1654M5756N0103N4074N6995N9225O1605O4023O5300O4604
50955A649449O2322N9332N6079N2547M8370M2800L5260K6582J8906J3705J0309
$$ y = [772443, 783686, 792411, 796484, 795134, 789722, 782530, 774920, 766748, 757227, 745978, 733524, 721267, 710868, 703063, 696869, 690266, 681802, 671300, 659265, 646361, 633694, 622808, 614623, 608660, 603880, 600075, 597862, 597520, 598573, 600606, 603810, 608495, 614563, 621822, 630443, 640632, 651952, 663359, 673965, 683736, 693427, 703831, 714956, 725882, 735473, 743236, 749305, 753789, 756490, 757404, 757130, 756495, 755842, 754797, 752700, 749262, 745019, 741191, 738928, 738545, 739682, 742284, 747056, 754762, 765310, 777938, 792160, 808138, 826098, 845825, 866884, 889055, 912219, 936100, 960612, 986538, 1015429, 1048549, 1086110, 1127764, 1173520, 1223623, 1277697, 1334692, 1393917, 1455522, 1519545, 1584845, 1649449, 1711771, 1771103, 1827182, 1879729, 1928099, 1970899, 2006159, 2032741, 2051647, 2065352, 2075661]
50944B075661O997L100p44l839o055p356p799q041r056j1088j3511j5804j8120
50931A984345k0683k3231k5363k7107k8828l0814l3104l5554l8064m0855m4223
50920A636519m7834n0563n1514n0910m9503m7480m4721m1758l9381l7315l4450
50909A141090l0613k7086k4870k3397k1628j9561j7835j6492j5108j3789j3095
50898I17616j3054j2988j2315j0940q912o353l831k108j342r14l32J35Pm97n23
50883H43649L77J730K737L238L719M518N407O131O893P966R149J0073J0886J2069
50869I28542J3633J5108J6314J7575J9024K0372K1564K3112K5392K8171L1268
50858A160075L5100M0039M5611N1005N6221O2062O9009P6692Q4525R2452J00817
$$ y = [2075661, 2082658, 2085758, 2085014, 2081175, 2075120, 2067764, 2059965, 2051924, 2042868, 2031780, 2018269, 2002465, 1984345, 1963662, 1940431, 1915068, 1887961, 1859133, 1828319, 1795215, 1759661, 1721597, 1680742, 1636519, 1588685, 1538122, 1486608, 1435698, 1386195, 1338715, 1293994, 1252236, 1212855, 1175540, 1141090, 1110477, 1083391, 1058521, 1035124, 1013496, 993935, 976100, 959608, 944500, 930711, 917616, 904562, 891574, 879259, 868319, 859407, 853054, 849223, 847115, 845773, 844859, 844527, 844662, 844669, 844172, 843649, 844026, 845756, 848493, 851731, 855450, 859968, 865375, 871506, 878399, 886365, 895514, 905587, 916473, 928542, 942175, 957283, 973597, 991172, 1010196, 1030568, 1052132, 1075244, 1100636, 1128807, 1160075, 1195175, 1235214, 1280825, 1331830, 1388051, 1450113, 1519122, 1595814, 1680339, 1772791, 1873608]
50847A873608J09693J18573J26689J33619J39531J44693J48710J50541J49314
50838C094971J44965J37930J28479J16512J01803Q4252O4249M3014K2393L960
50828C942528j1724k4957l6151m5286n1748n4729n4056n0689m6011m0622l4429
50817C492126k7979k2983k1030k2421k6702l3661m2986n3547o4038p4164q4389
50806C018226r4517j03446j10306j15063j17809j18214j16031j11585j05376r7686
50796A928193q8829p9446p0180o1301n2864m4938l7474l0238k3187j6740j1412
50785A411584p362m449k573j596j082m54M03R02K93j489l657n360o529p712r102
50770A361817j0210j0738j1328j2945j5562j8029j9345j9618j9662j9933k0211
$$ y = [1873608, 1983301, 2101874, 2228563, 2362182, 2501713, 2646406, 2795116, 2945657, 3094971, 3239936, 3377866, 3506345, 3622857, 3724660, 3808912, 3873161, 3916175, 3938568, 3942528, 3930804, 3905847, 3869696, 3824410, 3772662, 3717933, 3663877, 3613188, 3567177, 3526555, 3492126, 3464147, 3441164, 3420134, 3397713, 3371011, 3337350, 3294364, 3240817, 3176779, 3102615, 3018226, 2923709, 2820263, 2709957, 2594894, 2477085, 2358871, 2242840, 2131255, 2025879, 1928193, 1839364, 1759918, 1689738, 1628437, 1575573, 1530635, 1493161, 1462923, 1439736, 1422996, 1411584, 1404222, 1399773, 1397200, 1395604, 1394522, 1394068, 1394471, 1395373, 1395666, 1394177, 1390520, 1385160, 1378631, 1370919, 1361817, 1351607, 1340869, 1329541, 1316596, 1301034, 1283005, 1263660, 1244042, 1224380, 1204447, 1184236]
50759A184236k0077j9389j8261j6804j4997j2860j0589q382o179l784j277R83
50747A052620K908M986P800J1464J5690K0179K4611K8641L2332L6423M1554M7254
50735A326462N2347N6318N9850O3661O7495P0558P2658P4333P5940P7081P7087
50724B073790P5779P3577P0865O7500O2994N7012M9474M0320K9555J7623N256
50713B623745p143j9505l1098m0165m5299m6986m6925m5898m3121l7899l1055
50702B228651k4154j8028j2749q697o741p319r882j3598j8270k4281l1759l9974
50690B013199m7655n3825n8263o1158o2476o1863n9153n4743m9353m3562l7635
50679A423513l1625k5453j8943j1980m712K450R112J5156K0688K5714K9871L2673
$$ y = [1184236, 1164159, 1144770, 1126509, 1109705, 1094708, 1081848, 1071259, 1062877, 1056698, 1052914, 1051637, 1052620, 1055528, 1060514, 1068314, 1079778, 1095468, 1115647, 1140258, 1168899, 1201231, 1237654, 1279208, 1326462, 1378809, 1435127, 1494977, 1558638, 1626133, 1696691, 1769349, 1843682, 1919622, 1996703, 2073790, 2149569, 2223146, 2294011, 2361511, 2424505, 2481517, 2530991, 2571311, 2600866, 2618489, 2623745, 2616602, 2597097, 2565999, 2525834, 2480535, 2433549, 2386624, 2340726, 2297605, 2259706, 2228651, 2204497, 2186469, 2173720, 2165023, 2158282, 2150963, 2141081, 2127483, 2109213, 2084932, 2053173, 2013199, 1965544, 1911719, 1853456, 1792298, 1729822, 1667959, 1608806, 1554063, 1504710, 1461148, 1423513, 1391888, 1366435, 1347492, 1335512, 1330800, 1333250, 1342362, 1357518, 1378206, 1403920, 1433791, 1466464]
50667A466464L3970L4101L3525L2450L0910K8917K6494K3675K0754J8314J6731
50656A766305J5819J5177J4777J4902J5588J6518J7423J8348J9509K1167K3589
50645A959122K6812L0408L3842L7059M0441M4156M7810N0837N2896N3840N3625
50634B430848N2423N0598M8355M5646M2485L9159L5932L2641K8745K3737J7544
50623B848113J0665L698l497j2042k2888l5175m6096n2634n3434m9113m1372l2070
50611B514155k2720j4167o672m95L632M887L122r57o559j3478k1919l1712m1946
50598B365171n1467n9565o6099p1012p4043p5011p4120p1869o8764o5279o1771
50587A626171n8257n4454n0308m6234m2665l9615l6933l4597l2355k9511k5753
$$ y = [1466464, 1500434, 1534535, 1568060, 1600510, 1631420, 1660337, 1686831, 1710506, 1731260, 1749574, 1766305, 1782124, 1797301, 1812078, 1826980, 1842568, 1859086, 1876509, 1894857, 1914366, 1935533, 1959122, 1985934, 2016342, 2050184, 2087243, 2127684, 2171840, 2219650, 2270487, 2323383, 2377223, 2430848, 2483271, 2533869, 2582224, 2627870, 2670355, 2709514, 2745446, 2778087, 2806832, 2830569, 2848113, 2858778, 2862476, 2858979, 2846937, 2824049, 2788874, 2742778, 2690144, 2636710, 2587597, 2546225, 2514155, 2491435, 2477268, 2470596, 2470101, 2473733, 2478620, 2481742, 2480785, 2474226, 2460748, 2438829, 2407117, 2365171, 2313704, 2254139, 2188040, 2117028, 2042985, 1967974, 1893854, 1821985, 1753221, 1687942, 1626171, 1567914, 1513460, 1463152, 1416918, 1374253, 1334638, 1297705, 1263108, 1230753, 1201242, 1175489]
50576A175489k1829j8653j5917j2487q159m039r61J533M154O680Q495R704J0960
50563A134970J2539J4241J6105J8554K1808K5430K8533L0449L1311L2069L3566
50552A399575L5508L6779L6812L6157L5503L4889L4206L3811L4002L4440L4756
50541A786438L5409L7192M0257M4208M8925N4526O0713O6899P2981P9350Q6201
50530B413099R3328J00541J07700J14438J20509J26266J32086J37308J40562J41227
50520C627064J39821J36704J31297J22934J11807R8453Q2897O4898M4692K2930
50510D583497J29k3228m6180o7349q5673j00691j12230j20029j23698j22878j17413
50499C664257j07599r4215p8146n9982m0166j9572K53J7582L1325M1180M6924
$$ y = [1175489, 1153660, 1135007, 1119090, 1106603, 1098444, 1094405, 1093444, 1094977, 1099131, 1105811, 1114306, 1124010, 1134970, 1147509, 1161750, 1177855, 1196409, 1218217, 1243647, 1272180, 1302629, 1333940, 1366009, 1399575, 1435083, 1471862, 1508674, 1544831, 1580334, 1615223, 1649429, 1683240, 1717242, 1751682, 1786438, 1821847, 1859039, 1899296, 1943504, 1992429, 2046955, 2107668, 2174567, 2247548, 2326898, 2413099, 2506427, 2606968, 2714668, 2829106, 2949615, 3075881, 3207967, 3345275, 3485837, 3627064, 3766885, 3903589, 4034886, 4157820, 4269627, 4368080, 4450977, 4515875, 4560567, 4583497, 4583626, 4560398, 4514218, 4446869, 4361196, 4260505, 4148275, 4028246, 3904548, 3781670, 3664257, 3556658, 3462443, 3384297, 3324315, 3284149, 3264577, 3264830, 3282412, 3313737, 3354917, 3401841]
50488C401841M7667M2211L0292J3127p542l0601n5243p9837j01896j19482j32114
50477C008423j40181j44021j43959j40680j35017j27530j18647j08984r9153q9390
50467A760861p9767p0604o2321n5084m8906m3909m0022l6581l2781k8645k4957
50456A237284k2138j9579j6390j2408q194m342j155J291L206N134P521J0121J2184
50443A192535J3385J4232J5442J7117J8744J9770J9920J9068J7236J4814J2505
50432A374768J0849R911R513R591J0143J0954J1578J1653J1238J0892J1383J3103
50420A505576J5725J8609K1563K4909K8794L2904L7149M2081M8044N4251N9494
50409A889099O3591O7354P1091P3965P5234P5211P4461P2696O9169O3764N6890
$$ y = [3401841, 3449508, 3491719, 3522011, 3535138, 3527596, 3496995, 3441752, 3361915, 3260019, 3140537, 3008423, 2868242, 2724221, 2580262, 2439582, 2304565, 2177035, 2058388, 1949404, 1850251, 1760861, 1681094, 1610490, 1548169, 1493085, 1444179, 1400270, 1360248, 1323667, 1290886, 1262241, 1237284, 1215146, 1195567, 1179177, 1166769, 1158575, 1154233, 1153078, 1154369, 1157575, 1162709, 1170230, 1180351, 1192535, 1205920, 1220152, 1235594, 1252711, 1271455, 1291225, 1311145, 1330213, 1347449, 1362263, 1374768, 1385617, 1395528, 1405041, 1414632, 1424775, 1435729, 1447307, 1458960, 1470198, 1481090, 1492473, 1505576, 1521301, 1539910, 1561473, 1586382, 1615176, 1648080, 1685229, 1727310, 1775354, 1829605, 1889099, 1952690, 2020044, 2091135, 2165100, 2240334, 2315545, 2390006, 2462702, 2531871, 2595635, 2652525]
50398B652525M8602L8613K7161J5011K560j0498k4304l8163n0990o1999p0757
50387B527761p6914q0184q0449p7709p2202o4581n5642m5829l5293k4506j4290
50376A900162n107L219J0693J6525J9679J9675J6490J0231J465q456j8309k8052
50364A938215l8293m8590n7070o2055o3620o3231o2239o0935n8768n5170n0281
50353A317963m5026m0361l6430l2720k8861k4875k0730j6380j2397r793q793q427
50341A033170p965q110r931j2977j5468j6313j5995j5303j4110j1976r274p018
50329H88730n762n146m483l402j880p8J770L325M236M427M322M609N534O527O866
50314I09595O575O241O038N571M873M820N993P642Q542Q622Q956J0137J1515J2294
$$ y = [2652525, 2701127, 2739740, 2766901, 2781912, 2784472, 2773974, 2749670, 2711507, 2660517, 2598518, 2527761, 2450847, 2370663, 2290214, 2212505, 2140303, 2075722, 2020080, 1974251, 1938958, 1914452, 1900162, 1895055, 1898274, 1908967, 1925492, 1945171, 1964846, 1981336, 1991567, 1993032, 1984576, 1966267, 1938215, 1899922, 1851332, 1794262, 1732207, 1668587, 1605356, 1543117, 1482182, 1423414, 1368244, 1317963, 1272937, 1232576, 1196146, 1163426, 1134565, 1109690, 1088960, 1072580, 1060183, 1050390, 1041597, 1033170, 1025205, 1017095, 1007164, 994187, 978719, 962406, 946411, 931108, 916998, 905022, 895748, 888730, 882968, 877822, 873339, 869937, 868057, 867979, 869749, 873074, 877310, 881737, 886059, 890668, 896202, 902729, 909595, 916170, 922411, 928449, 934020, 938893, 943713, 949706, 957348, 965890, 974512, 983468, 993605, 1005120, 1017414]
50300A017414J2671J3379J4644J6282J8490K1790K6087L0401L3718L5656L6120
50289A276652L4899L2020K8050K3267J6564O053q583k4485l6964m2756m2093l7774
50277A224850l2531k7435k2380j7434j3172r829o827l545k53K157L308L743M144
50264A104796M678N334O382Q058J0050J1808J3342J5278J8060K1361K4434K6789
50252A270370K8434K9634L0580L1104L0680K8852K5889K2890K0947K0082J9247
50241A558709J7473J4793J1817Q593M543m94n865j1070j6498k2377k7602l0575
50229A501447l1113l0514k9639k8122k5766k3531k2353k1979k1899k2641k4950
50218A218940k8278l1122l2656l2934l1936k9649k6920k4908k3471k1348j8141
$$ y = [1017414, 1030085, 1043464, 1058108, 1074390, 1092880, 1114670, 1140757, 1171158, 1204876, 1240532, 1276652, 1311551, 1343571, 1371621, 1394888, 1411452, 1417505, 1408922, 1384437, 1347473, 1304717, 1262624, 1224850, 1192319, 1164884, 1142504, 1125070, 1111898, 1102069, 1095242, 1091697, 1091444, 1093601, 1096909, 1100652, 1104796, 1109474, 1114808, 1121190, 1129248, 1139298, 1151106, 1164448, 1179726, 1197786, 1219147, 1243581, 1270370, 1298804, 1328438, 1359018, 1390122, 1420802, 1449654, 1475543, 1498433, 1519380, 1539462, 1558709, 1576182, 1590975, 1602792, 1611385, 1615928, 1615434, 1609569, 1598499, 1582001, 1559624, 1532022, 1501447, 1470334, 1439820, 1410181, 1382059, 1356293, 1332762, 1310409, 1288430, 1266531, 1243890, 1218940, 1190662, 1159540, 1126884, 1093950, 1062014, 1032365, 1005445, 980537, 957066, 935718, 917577]
50207I17577j4982j2864j1492j0346r649r569r405q569p670p620q137q124p220
50194G91930o070n241m711m414m489m843n018m659l804k704j653j009j019j552
50180G40744k208k605k527j983j300r17q86q00m11Q5N32J201K280L339L817L787
50164G42148L779M000M191M175M121M311M892N820O852P702Q399R271J0463J1742
50150H31866J2952J4187J5310J5858J5899J6472J8497K1639K4890K7998L1546
50139A047114L5859M0555M5257M9993N4761N9185O2766O5147O6086O5501O3545
50128A655769O0527N6817N2998M9611M6412M2227L6065K8073J8931Q821k340j4056
50116B039855k5562l6621m7147n6250o2713o6344o7884o7630o5256o1211n6899
$$ y = [917577, 902595, 889731, 878239, 867893, 858244, 848675, 839270, 830701, 823031, 815411, 807274, 799150, 791930, 785860, 780619, 775908, 771494, 767005, 762162, 757144, 752485, 748681, 745977, 744324, 743315, 742296, 740744, 738536, 735931, 733404, 731421, 730121, 729204, 728318, 727518, 727107, 727192, 727724, 728925, 731205, 734544, 738361, 742148, 745927, 749927, 754118, 758293, 762414, 766725, 771617, 777437, 784289, 791991, 800390, 809661, 820124, 831866, 844818, 859005, 874315, 890173, 906072, 922544, 941041, 962680, 987570, 1015568, 1047114, 1082973, 1123528, 1168785, 1218778, 1273539, 1332724, 1395490, 1460637, 1526723, 1592224, 1655769, 1716296, 1773113, 1826111, 1875722, 1922134, 1964361, 2000426, 2028499, 2047430, 2056251, 2053911, 2039855, 2014293, 1977672, 1930525, 1874275, 1811562, 1745218, 1677334, 1609704, 1544448, 1483237, 1426338]
50105A426338n3027m8834m3650l8363l4441l2149l0590k9102k7728k6492k5064
50094A036898k3234k1224j9377j7806j6366j4797j2904j0683q354o230m643l766
50082H77514l355k872k108j464j196p69L92J800K484K455K639L310L685L352K973
50067H88840L011K880K104J395J600K239K180J267K87m51j431k845m044m348l778
50052H88906k935k503k780l327l216k078o70J34N92J634L418N156O368P451Q818
50037I04968J0210J1240J1991J2737J3523J4387J5566J7052J8305J8820J8858
50026A067657J9184K0167K1446K2475K3158K3841K4912K6488K8465L0649L2738
50015A341180L4214L4560L3661L1827K9253K5773K1460J7242J4316J2882J1902
$$ y = [1426338, 1373311, 1324477, 1280827, 1242464, 1208023, 1175874, 1145284, 1116182, 1088454, 1061962, 1036898, 1013664, 992440, 973063, 955257, 938891, 924094, 911190, 900507, 892153, 885923, 881280, 877514, 874159, 871287, 869179, 867715, 866519, 865750, 866142, 867942, 870426, 872881, 875520, 878830, 882515, 885867, 888840, 891851, 894731, 896835, 898230, 899830, 902069, 904249, 905516, 905803, 905352, 903921, 901076, 897032, 892684, 888906, 885971, 883468, 880688, 877361, 874145, 872067, 871397, 871531, 872123, 873757, 877175, 882331, 888699, 896150, 904968, 915178, 926418, 938409, 951146, 964669, 979056, 994622, 1011674, 1029979, 1048799, 1067657, 1086841, 1107008, 1128454, 1150929, 1174087, 1197928, 1222840, 1249328, 1277793, 1308442, 1341180, 1375394, 1409954, 1443615, 1475442, 1504695, 1530468, 1551928, 1569170, 1583486, 1596368, 1608270]
50004A608270J0265P848N141K217j451o288j2099j8353k4668l0831l6570m1465
49992A462016m5144m7442m8318m7720m5634m2371l8755l5725l3573l1716k9515
49981A016103k7278k5978k5829k5593k3835k0644j7510j5557j4490j3426j2015
49970G93948j0387q630o941n858n694n870n483m394l274k674k563k699k793k360
49956G24328j000J022L014M710O320P827Q809R125R105Q908Q377P665P210O828
49942H12248N650L403J050m24j215k079l147m124n237p049r530j1977j3824j4952
49928G48793j5354j4985j3958j2422j0408q140o242n132m408l413k188j273o90
49915F50180J56J508K827L529L666L665L785M058M526N327O527Q042R589J0865
$$ y = [1608270, 1618535, 1626383, 1631524, 1633741, 1632290, 1626002, 1613903, 1595550, 1570882, 1540051, 1503481, 1462016, 1416872, 1369430, 1321112, 1273392, 1227758, 1185387, 1146632, 1110907, 1077334, 1045618, 1016103, 988825, 962847, 937018, 911425, 887590, 866946, 849436, 833879, 819389, 805963, 793948, 783561, 774931, 767990, 762132, 756438, 750568, 745085, 740691, 737417, 734743, 732180, 729481, 726688, 724328, 723328, 724350, 727364, 732074, 738394, 746221, 755030, 764155, 773260, 782168, 790545, 798210, 805420, 812248, 817898, 821301, 822351, 821927, 820712, 818633, 815486, 811362, 806125, 799076, 789546, 777569, 763745, 748793, 733439, 718454, 704496, 692074, 681666, 673526, 667284, 662152, 657744, 654331, 652143, 650870, 650180, 650336, 651844, 654671, 658200, 661866, 665531, 669316, 673374, 677900, 683227, 689754, 697796, 707385, 718250]
49901G18250J1824J2602J3086J2916J2095J1216J0709J0151Q837O720M337J957
$$ y = [718250, 730074, 742676, 755762, 768678, 780773, 791989, 802698, 812849, 821686, 828406, 832743, 834700]
$$ [...]
##END NTUPLES=NMR SPECTRUM
##END=
