##TITLE=AC1422_MEXAH12232_7764400_sQMqy75a5n
##JCAMPDX= 6.0         $$ Bruker NMR JCAMP-DX V2.0
##DATA TYPE= NMR SPECTRUM
##DATA CLASS= NTUPLES
##ORIGIN= BRUKER
##OWNER= Administrator
$$ 1.72 TOPSPIN		Version 2.1
$$ 2013-04-11 19:40:21.178 -0700  Administrator@X
$$ Compression mode = diff/dup
##.OBSERVE FREQUENCY= 400.02188249412
##.OBSERVE NUCLEUS= ^1H
##.ACQUISITION MODE= SIMULTANEOUS (DQD)
##.ACQUISITION SCHEME= undefined
##.AVERAGES= 64
##.DIGITISER RES= 22
##SPECTROMETER/DATA SYSTEM= spect
##.PULSE SEQUENCE= noesygpps1d.comp
##.SOLVENT NAME= COFFEE_meoh
##.SHIFT REFERENCE= INTERNAL, COFFEE_meoh, 1, 14.96075
##AUDIT TRAIL= $$ (NUMBER, WHEN, WHO, WHERE, PROCESS, VERSION, WHAT)
$$ ##TITLE= Audit trail, TOPSPIN		Version 2.1
$$ ##JCAMPDX= 5.01
$$ ##ORIGIN= Bruker BioSpin GmbH
$$ ##OWNER= Administrator
$$ $$ E:\/data/COFFEE/nmr/AC1422_MEXAH12232_7764400_sQMqy75a5n/12/pdata/1/auditp.txt
$$ ##AUDIT TRAIL=  $$ (NUMBER, WHEN, WHO, WHERE, PROCESS, VERSION, WHAT)
(   1,<2013-04-11 19:40:14.100 -0700>,<Administrator>,<X>,<go>,<TOPSPIN 2.1>,
      <created by zg
	started at 2013-04-11 19:28:44.693 -0700,
	POWCHK enabled, PULCHK disabled,
       configuration hash MD5:
       33 CF 6A 21 5C D3 B9 40 6C 15 AA 8D 27 A2 4F 13
       data hash MD5: 64K
       FA 01 1A E7 67 25 E7 CB 9E E4 8F 61 F6 06 1F 7F>)
(   2,<2013-04-11 19:40:18.382 -0700>,<Administrator>,<X>,<proc1d>,<TOPSPIN 2.1>,
      <Start of raw data processing
       efp LB = 0.3 FT_mod = 6 PKNL = 1 PHC0 = 0 PHC1 = 0 SI = 128K 
       data hash MD5: 128K
       82 F8 A5 6A 80 FD 29 88 72 D2 B7 52 F9 A0 C1 6A>)
(   3,<2013-04-11 19:40:19.397 -0700>,<Administrator>,<X>,<proc1d>,<TOPSPIN 2.1>,
      <pk PHC0 = -80.80994 PHC1 = 0 
       data hash MD5: 128K
       6E 39 60 9D 20 A6 5C A0 EC D8 E1 D9 18 B7 4F 64>)
(   4,<2013-04-11 19:40:20.132 -0700>,<Administrator>,<X>,<proc1d>,<TOPSPIN 2.1>,
      <abs ABSG = 1 
       data hash MD5: 128K
       47 95 15 EC DC 81 B2 63 C4 10 F7 C9 08 BF 0B 2C>)
(   5,<2013-04-11 19:40:20.319 -0700>,<Administrator>,<X>,<proc1d>,<TOPSPIN 2.1>,
      <abs ABSG = 2 
       data hash MD5: 128K
       3B D2 F6 81 D1 07 74 2D 06 8D B3 81 7B C1 6B 31>)
(   6,<2013-04-11 19:40:20.507 -0700>,<Administrator>,<X>,<proc1d>,<TOPSPIN 2.1>,
      <abs ABSG = 3 
       data hash MD5: 128K
       77 5F C6 0F 49 3F 78 26 94 F3 17 16 92 12 F9 1B>)
(   7,<2013-04-11 19:40:20.678 -0700>,<Administrator>,<X>,<proc1d>,<TOPSPIN 2.1>,
      <abs ABSG = 4 
       data hash MD5: 128K
       C2 D3 C9 67 ED 7A A3 A8 FD 8E B1 45 0C A1 59 1A>)
(   8,<2013-04-11 19:40:20.850 -0700>,<Administrator>,<X>,<proc1d>,<TOPSPIN 2.1>,
      <abs ABSG = 5 
       data hash MD5: 128K
       84 45 D8 51 7D 95 D1 FA AC C8 DE 66 C6 53 16 25>)
$$ ##END=
$$ 
$$ $$ hash MD5
$$ $$ A9 BF EE C7 6B E3 08 7E B4 A9 00 BF 98 63 B0 39
##$RELAX= 
##$RELAX= 
##$RELAX= 
##$RELAX= 
##$RELAX= 
##$RELAX= 
##$RELAX= 
##$RELAX= 
$$ Bruker specific parameters
$$ --------------------------
##$DU= <E:\>
##$EXPNO= 12
$$ [...]
##$TP07= 0
##$TPNAME0= <>
##$TPNAME1= <>
##$TPNAME2= <>
##$TPNAME3= <>
##$TPNAME4= <>
##$TPNAME5= <>
##$TPNAME6= <>
##$TPNAME7= <>
##$TPOAL= (0..7)
0.5 0.5 0.5 0.5 0.5 0.5 0.5 0.5
##$TPOFFS= (0..7)
0 0 0 0 0 0 0 0
##$TUNHIN= 0
##$TUNHOUT= 0
##$TUNXOUT= 0
##$USERA1= <user>
##$USERA2= <user>
##$USERA3= <user>
##$USERA4= <user>
##$USERA5= <user>
##$V9= 5
##$VALIST= <valist>
##$VCLIST= <CCCCCCCCCCCCCCC>
##$VD= 0
##$VDLIST= <DDDDDDDDDDDDDDD>
##$VPLIST= <PPPPPPPPPPPPPPP>
##$VTLIST= <TTTTTTTTTTTTTTT>
##$WBST= 2048
##$WBSW= 25
##$XGAIN= (0..3)
0 0 0 0
##$XL= 0
##$YL= 0
##$YMAX_a= 5608837
##$YMIN_a= -12191817
##$ZGOPTNS= <>
##$ZL1= 120
##$ZL2= 120
##$ZL3= 120
##$ZL4= 120
##$ABSF1= 14.96075
##$ABSF2= -5.597432
##$ABSG= 5
##$ABSL= 3
##$ALPHA= 0
##$AQORDER= 0
##$ASSFAC= 0
##$ASSFACI= 0
##$ASSFACX= 0
##$ASSWID= 0
##$AUNMP= <proc_prof1d_extract.lims>
##$AXLEFT= 0
##$AXNAME= <>
##$AXNUC= <1H>
##$AXRIGHT= 0
##$AXTYPE= 0
##$AXUNIT= <>
##$AZFE= 0.1
##$AZFW= 0.1
##$BCFW= 0
##$BC_mod= 0
##$BYTORDP= 0
##$COROFFS= 0
##$CY= 15
##$DATMOD= 1
##$DC= 0
##$DFILT= <>
##$DTYPP= 0
##$F1P= 0
##$F2P= 0
##$FCOR= 0.5
##$FTSIZE= 131072
##$FT_mod= 6
##$GAMMA= 0
##$GB= 0
##$INTBC= 1
##$INTSCL= 1
##$ISEN= 128
##$LB= 0.3
##$LEV0= 0
##$LPBIN= 0
##$MAXI= 10000
##$MC2= 0
##$MEAN= 0
##$ME_mod= 0
##$MI= 0
##$NCOEF= 0
##$NC_proc= -2
##$NLEV= 6
##$NOISF1= 0
##$NOISF2= 0
##$NSP= 0
##$NTH_PI= 0
##$NZP= 0
##$OFFSET= 14.96075
##$PC= 1
##$PHC0= -80.80994
##$PHC1= 0
##$PH_mod= 1
##$PKNL= yes
##$PPARMOD= 0
##$PPDIAG= 0
##$PPIPTYP= 0
##$PPMPNUM= 2147483647
##$PPRESOL= 1
##$PSCAL= 4
##$PSIGN= 0
##$PYNMP= <proc.py>
##$REVERSE= no
##$SF= 400.020009737219
##$SI= 131072
##$SIGF1= 0
##$SIGF2= 0
##$SINO= 400
##$SIOLD= 131072
##$SPECTYP= <>
##$SREGLST= <1H.CDCl3>
##$SSB= 0
##$STSI= 131072
##$STSR= 0
##$SW_p= 8223.68421052631
##$SYMM= 0
##$S_DEV= 0
##$TDeff= 65536
##$TDoff= 0
##$TI= <>
##$TILT= no
##$TM1= 0
##$TM2= 0
##$TOPLEV= 0
##$USERP1= <user>
##$USERP2= <user>
##$USERP3= <user>
##$USERP4= <user>
##$USERP5= <user>
##$WDW= 1
##$XDIM= 131072
##$YMAX_p= 357155331
##$YMIN_p= -11260
##$CURPLOT= <Network HP LaserJet P1505>
##$CURPRIN= <$Network HP LaserJet P1505>
##$DFORMAT= <normdp>
##$LAYOUT= <+/1D_H.xwp>
##$LFORMAT= <normlp>
##$PFORMAT= <normpl>
##$SURQMSG= 1
$$ End of Bruker specific parameters
$$ ---------------------------------
##NTUPLES= NMR SPECTRUM
##VAR_NAME=  FREQUENCY,     SPECTRUM/REAL,   SPECTRUM/IMAG
##SYMBOL=    X,             R,               I
##VAR_TYPE=  INDEPENDENT,   DEPENDENT,       DEPENDENT
##VAR_FORM=  AFFN,          ASDF,            ASDF
##VAR_DIM=   131072,        131072,          131072
##UNITS=     HZ,            ARBITRARY UNITS, ARBITRARY UNITS
##FACTOR=    0.0627417313425164, 1,          1
##FIRST=     8223.62146879497, 2236,         -54928
##LAST=      0,             3634,            -55342
##MIN=       0,             -11260,          0
##MAX=       8223.62146879497, 357155331,    0
$$ Real data points
##PAGE= N=1
##DATA TABLE= (X++(R..R)), XYDATA
$$ [...]
67890 85347 84961 84766 84897 84908 84476 83848 83441 83293 83168 83003 82976 83280 84095 85611 87754 89981 91710 92875
67872 92875 93736 94265 94228 93896 94028 94879 95748 95951 95780 95933 96312 96099 94999 93706 92931 92538 91970 91081 90132
67853 90132 89228 88198 86943 85458 83583 81158 78522 76464 75421 74982 74475 73827 73545 73931 74660 75285
67837 75285 75794 76480 77429 78450 79468 80721 82475 84697 87071 89262 91144 92844 94581 96339 97773
67822 97773 98602 99119 100049 101759 103836 105618 106948 108133 109316 110239 110604 110294 109189 107117 104275 101428
67806 101428 99358 98102 97005 95528 93712 91823 89840 87648 85514 83959 83050 82237 81108 79963 79281
67791 79281 78897 78251 77328 76692 76481 76042 74893 73477 72452 71729 70848 69936 69511 69515 69371 69006 69020 69623 70236
67772 70236 70459 70727 71521 72572 73443 74340 75643 76982 77593 77451 77290 77554 78056 78719 79896 81666 83436
67755 83436 84608 85207 85536 85621 85388 85004 84584 83894 82804 81877 81942 83108 84621 85692 86102 85961 85382 84582
67737 84582 83921 83554 83237 82700 82002 81329 80660 79903 79127 78360 77280 75472 73049 70706 69114 68454 68517 68972
67719 68972 69492 69887 70228 70685 71197 71515 71544 71339 70778 69679 68334 67391 66924 66176 64681 63178 62741 63322
67701 63322 63880 63822 63495 63250 62891 62324 61997 62208 62536 62470 62179 62157 62446 62745 62976 63213 63252 62888 62483 62663
67681 62663 63365 63791 63455 62874 62962 64053 65713 67270 68323 68924 69471 70378 71753 73426 75244 77090 78627
67664 78627 79322 78933 77839 76763 76267 76538 77406 78429 79140 79461 79740 80263 80848 81154 81221 81332 81354 80643 78829
67645 78829 76455 74519 73528 73259 73335 73637 74126 74679 75297 76203 77431 78519 78931 78713 78486 78811 79738 80858
67627 80858 81623 81767 81693 82299 83959 85765 86237 84903 82824 81514 81690 83083 84958 86519 87252 87216 86856
67610 86856 86424 85916 85651 86357 88330 90825 92692 93331 92818 91551 90157 89316 89119 88843 87880 86601 85796
67593 85796 85478 84890 83565 81781 80010 78463 77219 76282 75492 74714 74063 73564 72755 71216 69388 68270
67577 68270 68263 68836 69292 69294 68704 67659 66927 67424 69077 70781 71760 72358 73175 74064 74418 73991 72973 71667 70503
67558 70503 69989 70139 70250 69596 68126 66240 64314 62780 62248 62968 64400 65720 66538 66815 66468 65551 64561
67541 64561 64011 63800 63416 62622 61618 60755 60475 61260 63091 65103 66276 66431 66150 65849 65464 64944 64512 64349
67523 64349 64399 64503 64369 63558 61985 60398 59772 60133 60490 60111 59353 59003 59284 59853 60386 60732 60755 60423 59976
67504 59976 59604 59051 57937 56489 55557 55686 56469 57150 57693 58700 60259 61460 61531 61030 61248 62498 63763
67487 63763 64149 63990 64115 64624 64956 64777 64245 63540 62703 61862 61250 61016 61210 61714 61981 61302 59747 58481
67469 58481 58575 59835 61331 62667 63932 64716 64236 62536 60677 59564 59341 60083 62100 65108 67887 69409
67453 69409 69829 69939 70159 70500 70954 71323 71085 70025 68723 67882 67465 67010 66488 66245 66346 66576 66995 67790
67435 67790 68638 68862 68383 67955 68249 69128 70031 70693 71207 71669 72096 72540 72999 73279 73140 72601 71906 71144 70030
67416 70030 68257 66056 64198 63269 63034 62781 62226 61776 61859 62380 63015 63666 64292 64518 63856 62306 60456 59025
67398 59025 58468 58895 60049 61326 62080 62008 61200 59922 58572 57714 57764 58531 59302 59512 59299 59329 60103 61442
67380 61442 62623 63067 62887 62626 62492 62163 61471 60929 61188 62182 63198 63720 63845 63928 64223 64852 65698 66257 65996
67361 65996 64991 63840 62867 61855 60754 60184 60795 62396 64170 65532 66345 66478 65762 64517 63598 63549 63997
67344 63997 64157 63794 63407 63500 63980 64287 63973 63083 62117 61657 61898 62524 63112 63650 64503 65864 67511 69238
67326 69238 71294 74043 77312 80404 82760 84294 85051 84966 84152 83107 82262 81467 80255 78561 76884 75715
67310 75715 75014 74328 73249 71763 70281 69371 69380 70239 71633 73318 75235 77467 80164 83321 86466 88766
67294 88766 89731 89734 89582 89674 89895 90229 90977 92159 93118 93010 91541 89063 86130 83221 80728 78941 77938
67277 77938 77581 77537 77288 76335 74628 72756 71513 71303 71999 73276 74861 76574 78358 80269 82287 84119
67261 84119 85389 86035 86332 86466 86297 85662 84759 83992 83488 82929 81912 80383 78661 77076 75657 74195 72635
67244 72635 71377 71057 71908 73353 74368 74368 73660 72983 72660 72356 71664 70693 69954 69760 69946 70146 70173 70064 69975
67225 69975 70148 70862 72113 73353 73774 73021 71585 70338 69722 69474 69116 68533 68015 67860 68072 68489 69061 69927
67207 69927 71139 72393 73171 73257 73028 73041 73418 73883 74345 75015 75715 75534 73772 71111 69281 69351 70735 72071
67189 72071 72711 73043 73661 74681 75823 76840 77747 78774 80112 81637 82977 83907 84534 84969 85075 84747 84231
67172 84231 83819 83393 82713 82070 82103 82901 83747 84021 83891 83829 83811 83538 83176 83308 84056 84749 84700 84011 83370 83253
67152 83253 83613 84204 84859 85399 85622 85543 85562 86111 87201 88426 89403 90061 90505 90774 90811 90560 90042 89382 88788
67133 88788 88435 88367 88611 89268 90270 91140 91363 91057 90891 91199 91608 91839 92356 93689 95427 96555 96694 96393
67115 96393 96226 96286 96650 97640 99243 100788 101699 102236 103132 104690 106603 108432 109899 110794 110934 110260 108932
67098 108932 107427 106503 106677 107559 108122 107890 107525 107831 108546 108657 107772 106639 106279 107010 108321 109428 109905
67081 109905 110036 110500 111529 112604 113256 113841 115011 116631 117928 118615 119148 119772 120135 120166 120587 121911 123426
67064 123426 123896 123119 122202 122302 123537 125138 126332 126912 127185 127542 128110 128889 130122 132132 134633 136573
67048 136573 137110 136647 136507 137602 139726 142095 144198 146003 147671 149343 151105 152969 154855 156573 157854
67033 157854 158478 158513 158374 158516 159079 159932 160964 162207 163743 165698 168235 171300 174331 176563 177818 178850
67017 178850 180685 183633 187061 190100 192445 194456 196603 198962 201292 203497 205810 208492 211473 214472
67003 214472 217351 220150 222820 225145 227054 228837 230873 233192 235549 237933 240832 244728 249371 253844
66989 253844 257515 260728 264287 268377 272361 275624 278206 280525 282856 285391 288426 292071 295977 299720
66975 299720 303316 307000 310691 314224 317987 322698 328333 333880 338512 342612 347194 352607 358259 363532
66961 363532 368463 373453 378652 383895 389138 394758 401328 409060 417511 425931 433920 441642 449409 457254
66947 457254 465032 472821 481019 490010 499774 509789 519411 528531 537855 548263 559801 571570 582753
66934 582753 593525 604649 616453 628657 641099 654138 668176 683118 698520 714073 729745
66923 729745 745668 762099 779417 797872 817286 837131 856958 876737 896780 917388 938592
66912 938592 960249 982399 1005459 1029893 1055619 1081986 1108549 1135797 1164735 1195680 1227777
66901 1227777 1259971 1292248 1325589 1360764 1397601 1435469 1474038 1513259 1552992 1593120 1633955
66890 1633955 1676029 1719439 1763717 1808469 1853824 1900072 1947091 1994386 2041621 2088886 2136471
66879 2136471 2184451 2232523 2280255 2327442 2374121 2420101 2464711 2507323 2548070 2587668 2626479
66868 2626479 2664053 2699700 2733118 2764223 2792703 2818122 2840307 2859325 2875166 2887703 2896920
66857 2896920 2902980 2906098 2906406 2903749 2897496 2886814 2871446 2852075 2829671 2804686 2777144 2747266
66845 2747266 2715528 2682180 2647070 2610008 2571009 2530251 2488048 2444795 2400643 2355347 2308802
66834 2308802 2261592 2214610 2168148 2121857 2075574 2029647 1984334 1939452 1894902 1851052 1808226
66823 1808226 1766180 1724468 1683104 1642476 1602748 1563714 1525157 1487101 1449729 1413291 1378033
66812 1378033 1344058 1311225 1279267 1247991 1217360 1187468 1158517 1130701 1104056 1078494 1053919
66801 1053919 1030152 1006814 983578 960542 938131 916619 896014 876301 857322 838431 818875
66790 818875 798768 779219 761165 744510 728637 713214 698027 682620 666873 651644 638001
66779 638001 625856 614043 601855 589833 578822 568798 558999 548862 538515 528475 519097 510206
66767 510206 501173 491414 480922 470277 460205 451188 443291 436111 428998 421658 414501 408075 402272
66754 402272 396410 390064 383386 376600 369715 362907 356733 351608 347265 343002 338342 333376 328647 324748
66740 324748 321720 318752 314850 309980 305204 301429 298396 295251 291785 288549 285928 283623 281088 278006
66726 278006 274279 269950 265363 261085 257393 253950 250196 246023 241978 238831 236983 236126 235396 233955 231598
66711 231598 228820 226234 223927 221466 218489 215180 212049 209306 206571 203361 199772 196551 194388 193251
66697 193251 192487 191507 190244 188929 187618 186122 184310 182286 180147 177757 174983 172131 169864 168546 167843
66682 167843 167130 166194 165308 164735 164414 164130 163665 162739 161073 158764 156447 154820 153986 153375 152281 150409 148003
66665 148003 145595 143656 142358 141603 141261 141340 141889 142809 143845 144708 145157 144994 144127 142692 141037 139461 137954
66648 137954 136231 134117 131858 129933 128493 127173 125669 124395 124194 125276 126760 127515 127255 126522 125811
66633 125811 125155 124487 123834 122913 121053 118009 114652 112300 111344 110934 110147 109042 108331 108380 108940 109644 110287
66616 110287 110609 110267 109250 108076 107366 107293 107568 107807 107788 107486 107050 106687 106418 105949 104873 103057 100790 98613
66598 98613 96964 95910 95172 94483 93852 93360 92784 91714 90134 88579 87596 87289 87512 88202 89237 90315 91310
66581 91310 92522 94118 95451 95476 93880 91398 89038 87357 86537 86575 87144 87607 87514 86911 86063 85137 84351 84101
66563 84101 84589 85520 86397 86984 87228 86936 85885 84221 82434 80921 79753 78901 78405 78264 78322 78424 78626 79201
66545 79201 80380 82080 83861 85179 85722 85516 84729 83505 81998 80489 79359 78909 79115 79511 79441 78645 77593
66528 77593 77053 77286 77869 78314 78605 79043 79809 80813 81779 82306 82016 80833 79023 76928 74876 73416 73186
66511 73186 74162 75299 75407 74389 73244 72897 73354 74021 74416 74376 73947 73339 72874 72733 72768 72647 72148 71310 70441
66492 70441 69984 70204 70881 71499 71793 71911 72004 71963 71815 72026 72880 73753 73637 72500 71520 71594 72166 72095 71295 70713
66472 70713 70822 71020 70754 70450 70833 71920 73308 74965 76974 78700 79107 78069 76678 75979 75891 75665 74991
66455 74991 74320 74307 75211 76661 77814 77946 77020 75625 74377 73594 73447 73949 74651 74806 74116 73035 72187 71805
66437 71805 71927 72682 73980 75263 75961 76029 75716 75078 74074 72896 71829 70899 70029 69380 69150 69263 69613 70405
66419 70405 71753 73106 73564 72779 71128 69113 67079 65447 64624 64522 64635 64735 65061 65710 66293 66444 66220
66402 66220 65735 64760 63130 61360 60431 60972 62774 65028 66896 67939 68244 68154 67879 67424 66849 66424 66400 66743
66384 66743 67205 67589 67937 68526 69609 71035 72156 72355 71714 70999 70930 71647 72873 74315 75760 76988 77808
66367 77808 78189 78277 78283 78295 78120 77387 75998 74386 73142 72373 71722 70930 70113 69400 68698 67962 67468 67517 67960 68206
66347 68206 67738 66568 65288 64609 64757 65316 65771 66103 66647 67452 68140 68409 68308 67943 67252 66301 65511 65315
66329 65315 65726 66460 67290 68081 68632 68741 68421 67886 67341 66907 66734 67024 67869 69078 70180 70735 70764 70776 71184
66310 71184 71779 72005 71703 71286 71145 71204 71200 71094 71008 70949 70782 70364 69647 68767 68115 68108 68842 70094 71624 73195
66290 73195 74333 74504 73698 72465 71214 69834 68246 66953 66669 67549 69018 70190 70325 69235 67559 66357
66274 66357 66128 66412 66607 66801 67415 68353 69093 69442 69651 69834 69759 69289 68593 67870 67273 67149 67891 69377 70909
66255 70909 71906 72383 72586 72497 71953 71057 70169 69578 69345 69423 69766 70363 71226 72263 73079 73065 71903 70007 68293
66236 68293 67436 67395 67666 67871 67994 68112 68167 68117 68121 68358 68752 69071 69206 69171 68922 68501 68255 68537 69181 69770 70406
66215 70406 71635 73339 74370 73818 72215 70929 70675 71158 71897 72680 73330 73714 74035 74585 75225 75609 75911
66198 75911 76650 77700 78212 77775 77003 76588 76330 75683 74846 74684 75654 77261 78556 78858 78159 77154 76786 77433
66180 77433 78542 79295 79493 79474 79347 78834 77925 77186 77139 77608 77994 78004 77787 77416 76640 75297 73746 72600 72093
66161 72093 71988 72159 72933 74573 76574 77910 78111 77815 78066 79162 80456 81148 81051 80571 80221 80297 80844 81697
66143 81697 82516 82974 83008 82769 82347 81688 80915 80502 80838 81643 82185 82121 81840 81809 81890 81641 81030 80485 80247 80064
66123 80064 79648 79175 79130 79729 80629 81268 81458 81556 81988 82720 83388 83876 84473 85361 86280 86842 86861 86222 84852 83240
66103 83240 82557 83633 85921 87972 88901 88948 88757 88708 88947 89382 89500 88761 87454 86623 86890 87774 88521 89093
66085 89093 89939 91137 92281 93016 93278 93128 92758 92551 92832 93531 94325 94970 95377 95566 95761 96346 97408 98474
66067 98474 98932 98635 97896 97110 96619 96692 97228 97616 97272 96275 95214 94553 94478 95147 96513 97901 98340 97586 96467
66048 96467 96001 96425 97224 97830 97995 97767 97416 97363 97880 98820 99774 100541 101281 102127 102775 102661 101622 100235 99286
66029 99286 98976 98883 98710 98752 99470 100858 102515 104159 105770 107310 108620 109650 110618 111849 113481 115247
66013 115247 116535 116940 116919 117596 119599 122269 124402 125607 126499 127664 129031 130306 131494 132756 134151
65998 134151 135836 138190 141450 145380 149536 153702 157879 162062 166196 170264 174183 177749 180774 183147
65984 183147 184707 185276 184999 184377 183762 182958 181557 179493 176990 174191 171135 168039 165215 162661 159983
65969 159983 156862 153438 150158 147270 144505 141303 137457 133563 130611 128982 128018 126774 125076 123651
65955 123651 123371 124596 127022 129836 132106 133418 134147 134858 135505 135598 135106 134700 134965 135808 136933 138466 140728
65938 140728 143618 146685 149674 152627 155434 157647 158902 159360 159609 160233 161434 162970 164434 165686 167042
65923 167042 168978 171660 174776 177829 180515 182931 185490 188616 192465 196953 201986 207463 213027 218150
65909 218150 222691 227157 232047 237043 241206 243993 245792 247388 249208 251153 252879 254038 254455 254258 253733
65894 253733 252935 251612 249604 247155 244646 242139 239365 236086 232274 227981 223202 217894 212073 205927
65880 205927 199843 194232 189206 184462 179584 174426 169207 164361 160353 157484 155657 154353 152996 151388
65866 151388 149794 148569 147743 146904 145527 143506 141403 140059 139862 140422 140891 140571 139370 137911 137105 137290
65850 137290 137819 137813 137369 137525 138936 141094 143117 144722 145921 146343 145664 144485 143938 144317 144801 144727 144504 144942
65832 144942 146169 147642 148980 150404 152445 155413 159128 163067 166880 170739 175070 180036 185539 191604
65818 191604 198318 205351 211947 217535 222046 225580 228137 229776 230625 230583 229425 227361 225013 222609 219696
65803 219696 215963 211853 207892 203904 199472 194910 191154 188729 187301 186090 184454 182238 180025 178806
65789 178806 178940 179598 179684 179108 178629 178737 179439 181024 184165 189060 195220 202367 210822 220662 231127 241363
65773 241363 251208 260764 269631 277228 283580 289063 293470 295898 295598 292531 287098 279793 271224 262014
65759 262014 252468 242583 232555 223054 214844 208310 203418 199966 197763 196835 197635 200798 206417 213677
65745 213677 221532 229694 238668 248839 259875 271171 282488 293829 304854 314791 322881 328649 331812
65732 331812 332254 330151 325828 319450 311127 301320 290725 279612 267777 255421 243563 233056 223543
65719 223543 214036 204396 195552 188214 182000 176069 170104 164379 159171 154456 149985 145536 141284 137948
65705 137948 136217 135873 135821 135190 134049 132872 131813 130926 130584 130992 131483 130990 129357 127657 126997 127382 127960
65688 127960 128137 128187 128832 130399 132465 134342 135904 137706 140194 143078 145792 148346 151271 154848 158930
65673 158930 163572 169224 176086 183785 192076 201455 212615 225506 239362 253477 267552 281458 295176
65660 295176 308957 322989 336781 349337 360117 369445 377722 384644 389572 392408 393757 394421 395067
65647 395067 396289 398478 401559 405089 408636 411836 414201 415228 414739 412733 408855 402454 393385 382375
65633 382375 370306 357389 343341 328148 312295 296403 280966 266348 252681 239753 227290
65622 227290 215350 204288 194381 185646 177877 170619 163361 156142 149819 145254 142283 139997 137960 136474
65608 136474 135581 134572 132924 131015 129379 127792 125852 124045 123396 124124 125394 126449 127287 128087 128670 128851
65592 128851 128744 128373 127520 126337 125650 126087 127273 128452 129656 131552 134251 137084 139767 143077 147886
65577 147886 153995 160472 166959 174116 182775 193112 204723 217164 230177 243584 257175 270674
65565 270674 283717 295916 307019 316913 325417 332155 336722 338970 339078 337381 334094 329117 322097 312805
65551 312805 301587 289339 276907 264519 251902 238961 226214 214558 204637 196451 189523 183442
65539 183442 178221 174056 170796 167883 165021 162741 161985 163102 165418 167888 169898 171369 172354 172795 172601
65524 172601 171632 169597 166218 161668 156749 152412 149036 146196 143205 139911 136899 134839 133662 132532
65510 132532 130775 128708 127316 127099 127510 127630 127164 126489 125933 125490 125271 125685 126788 127843 128063 127649 127593
65493 127593 128397 129569 130544 131576 133316 135918 139062 142590 146511 150476 153845 156504 159181 162703 167132
65478 167132 171767 175726 178359 179356 178798 177061 174573 171710 168919 166654 164969 163367 161318 158829 156318
65463 156318 153966 151514 148735 145807 143081 140639 138342 136264 134799 134155 133932 133453 132541 131644 131101 130627
65447 130627 129790 128799 128343 128704 129468 130250 131256 132809 134635 136042 136782 137342 138322 139762 141260 142625
65431 142625 144171 146270 148758 151035 152805 154494 156683 159254 161397 162423 162267 161156 159193 156521
65417 156521 153585 150881 148517 146259 143962 141776 140003 138942 138791 139516 140830 142428 144215 146161 148052
65402 148052 149561 150598 151386 152175 153076 154214 155875 158317 161401 164557 167200 169201 170930 172779 174744
65387 174744 176437 177397 177264 175904 173613 171112 169036 167420 165964 164700 163967 163762 163638 163371 163216 163283
65371 163283 163225 162885 162729 163102 163571 163644 163772 164815 166716 168644 170476 173297 178074 184565 191890 199596
65355 199596 207686 216110 224814 233998 243758 253597 262713 270728 277768 283897 288875 292474 294700 295627
65341 295627 295267 293680 291028 287448 283004 277805 272023 265708 258755 251153 243148 235044 226918 218734
65327 218734 210753 203612 197799 193182 189339 186337 184736 184591 184776 183835 181385 178287 175386 172666 169768
65312 169768 166804 164211 162112 160357 159034 158394 158202 157647 156193 154342 153211 153374 154213 154502 153612 152147
65296 152147 151361 151972 153648 155662 157799 160377 163536 166893 170004 172769 175143 176718 177015 176195 175072
65281 175072 174281 173660 172644 171038 169175 167452 166055 165085 164620 164549 164563 164429 164080 163384 162151 160537 159111
65264 159111 158246 157609 156629 155329 154322 154025 154176 154219 153871 153264 152762 152722 153199 153803 154004 153624 152868 151961 150982
65245 150982 150020 149144 148138 146659 144802 143166 142171 141561 140858 140075 139661 139883 140537 141232 141761 142235 143022
65228 143022 144396 146071 147180 146995 145656 144005 142770 142088 141758 141675 141872 142320 142838 143221 143372 143338 143216
65211 143216 143114 143187 143560 144061 144172 143506 142363 141540 141557 142310 143445 144651 145485 145440 144567 143692 143566 144027 144405
65192 144405 144516 144733 145192 145523 145477 145366 145681 146564 147809 149153 150455 151787 153427 155554 157886 159837
65176 159837 161125 162008 162876 163790 164562 165143 165788 166875 168492 170144 170978 170591 169583 169064 169691 171377 173799
65159 173799 176731 179866 182805 185480 188197 191076 193830 196385 199429 203970 210471 218636 227876 237810
65145 237810 248447 260165 273449 288553 305514 324452 345466 368001 390699 412263 432326
65134 432326 451335 469863 488271 506614 524329 540255 553446 563835 571727 576918 578870 577563
65122 577563 573489 566906 557824 546754 534584 521462 506559 489347 470393 450458 429566 407723
65110 407723 386017 366010 348131 331482 315220 299432 284579 270799 258126 246827 237120 228784
65098 228784 221348 214475 207966 201674 195647 190194 185569 181696 178391 175658 173556 171907 170428 169164
65084 169164 168548 168939 170190 171691 172847 173510 173985 174561 175048 174950 174126 173122 172673 172989 173690 174323 174689 174638
65066 174638 173881 172223 169949 167782 166401 166026 166438 167267 168219 169147 170083 171172 172445 173608 174205 174109 173726
65049 173726 173616 173988 174646 175277 175543 175061 173645 171601 169565 167973 166873 166178 165743 165161 163925 162036
65033 162036 160143 158808 157871 156807 155434 153914 152253 150286 148135 146264 145024 144357 143986 143612 142916
65018 142916 141731 140363 139489 139540 140296 141178 141806 142251 142850 143875 145216 146418 147232 148145 150077 153415 157547
65001 157547 161515 164901 167827 170333 172176 173248 173858 174419 175042 175635 176227 176900 177455 177481 176982 176690 177417
64984 177417 179115 180935 182306 183673 185946 189446 193563 197256 199676 200564 200369 199885 199477 198759 197253
64969 197253 195160 193095 191187 188969 186120 182830 179397 175923 172603 169778 167473 165211 162596 159792
64955 159792 157255 155247 153826 152953 152360 151585 150488 149476 148984 148979 149215 149674 150409 151172 151566 151463 151041 150583
64937 150583 150436 150861 151664 152296 152610 153141 154249 155415 155923 155854 155744 155610 155123 154523 154373 154389 153522 151488
64919 151488 149322 147988 147277 146670 146535 147604 149661 151662 153025 154106 155364 156713 157849 158759 159714
64904 159714 161023 162928 165533 168737 172375 176380 180684 185080 189519 194424 200283 206867 213262 218876
64890 218876 224074 229530 235213 240411 244608 247955 250836 253420 255802 258180 260506 262118 262194 260600 257997
64875 257997 255056 251914 248479 244850 241177 237434 233682 230342 227874 226322 225485 225233 225266 224851 223447
64860 223447 221509 219962 218868 217295 214664 211473 208351 205110 201298 197106 193061 189156 184989 180520
64846 180520 176088 171866 168019 165292 164623 165895 167689 168603 168458 168003 167824 167917 168070 168198 168287 168231 167851 167068
64828 167068 166051 165121 164451 163903 163290 162663 162180 161836 161634 161958 163393 166096 169580 173213 176729 180241
64812 180241 184007 188295 193248 198797 204812 211302 218225 225222 231884 238299 244924 251815 258353 263782
64798 263782 267566 269128 267896 264120 259175 254434 249986 244977 239082 233101 228045 224096 220653 217168
64784 217168 213777 211153 209694 208850 207577 205606 203931 203567 204175 204546 204305 204312 205216 206430 207071 207405 208747
64767 208747 212164 217764 225027 233215 241483 249195 256405 263641 271035 277948 283755 288769 293939 299645
64753 299645 305149 309402 312144 313974 315533 317040 318626 320585 322880 324663 324752 322702 319075 314651 309642
64738 309642 303820 297073 289632 281916 274357 267241 260596 254293 248385 243202 239041 235919 233668 232030
64724 232030 230556 228740 226529 224523 223333 222961 223071 223655 225030 227330 230462 234395 238959 243370 246688
64709 246688 249003 251533 255070 258783 261096 261447 260565 259169 257114 253977 249920 245585 241444 237588 233955
64694 233955 230388 226540 222096 217228 212621 208885 206020 203585 201314 199365 197958 197039 196492 196566 197775
64679 197775 200257 203408 206383 208954 211796 215902 221733 228894 236551 244125 251569 259051 266505 273593
64665 273593 280054 285822 290730 294172 295341 293866 290227 285459 280355 274948 268878 262274 256065 251147
64651 251147 247353 243576 239068 234354 230732 229050 229093 229972 230874 231586 232565 234462 237472 241263 245719 251491
64635 251491 259419 269426 280444 291574 303006 315476 329027 342578 354656 364289 371204 375481
64623 375481 377249 376640 373838 369079 362710 355249 347336 339471 331825 324352 317088 310241 304013 298470
64609 298470 293618 289522 286252 283812 282184 281344 281132 281137 280820 279842 278276 276519 274886 273207 270913 267677
64593 267677 263913 260413 257522 254933 252264 249514 246888 244578 242895 242215 242431 242768 242566 242145 242597 244801
64577 244801 248847 254145 259753 264813 269092 273058 277131 281024 284112 286122 286993 286403 284111 280625 276799
64562 276799 272778 268076 262660 257136 251693 245825 239473 233590 228993 225329 221836 218480 215583 212814
64548 212814 209547 205978 203074 201387 200604 200300 200470 201241 202560 204311 206318 208131 209249 209608 209518 209128
64532 209128 208317 207137 205953 205069 204507 204150 203770 203028 201849 200752 200313 200372 200357 200348 201032 202420 203408 203146
64514 203146 202259 202073 203010 204411 205697 206992 208583 210348 212031 213741 215944 219069 223265 228445 234426
64499 234426 240975 247806 254716 261843 269602 278140 286905 294977 301748 307018 310580 312199 312051 310665
64485 310665 308282 304720 300086 295123 290493 286174 281961 278154 275225 273049 270989 268536 265457 261559
64471 261559 256916 252202 248192 244906 241764 238613 236126 235048 235470 236899 238640 240012 240666 240915 241425
64456 241425 242436 243508 244102 244106 243733 243296 243161 243563 244330 245145 246105 247591 249491 251175 252476 254110 256709
64439 256709 260024 263624 267846 273330 279958 287126 294852 303759 313885 324500 335487 348193 364344
64426 364344 384581 408634 436648 469671 508882 554880 607939 668571 737505 815135 901053
64415 901053 994040 1092278 1193491 1294976 1393766 1487069 1572809 1649813 1717438 1774916 1820829
64404 1820829 1853128 1869868 1870215 1854921 1825760 1784520 1732494 1670659 1599927 1521171 1435416 1344368
64392 1344368 1250636 1157153 1066309 979704 898549 823901 756368 695854 641847 593943 551889
64381 551889 515237 483264 455364 431273 410738 393141 377753 364224 352431 341881 331738
64370 331738 321695 312446 304897 299088 294168 289206 283681 277387 270477 263680 257965 253689 250281 246939
64356 246939 243428 240115 237541 236162 236267 237847 240555 243991 247923 252220 256725 261421 266531 272207
64342 272207 278086 283292 286923 288517 288194 286432 283706 280282 276388 272490 269184 266779 265162 264169 263821
64327 263821 264097 264678 265169 265495 265886 266479 266999 266894 265864 264360 263428 263739 264806 265512 265399 264987 264725 264196
64309 264196 262715 260244 257308 254322 251479 248896 246383 243342 239539 235725 232809 230530 227763 224179
64295 224179 220792 218565 217221 215892 214401 213278 212880 213098 213847 215267 217336 219664 221879 224059 226614
64280 226614 229762 233283 236848 240496 244622 249443 254764 260380 266446 273182 280437 287867 295253 302224
64266 302224 307922 311583 313421 314341 314757 314347 313020 311383 309951 308649 307475 306992 307518 308320 308212 306675
64250 306675 303873 299958 295001 289371 283490 277321 270714 264138 258419 253692 249236 244533 239963 236226
64236 236226 233472 231276 229169 226971 224804 222974 221751 221106 220750 220448 220213 220200 220548 221282 222220 223024 223438
64219 223438 223454 223168 222720 222524 223197 224792 226262 226213 224282 221412 218802 216971 215854 215325 215338 215793 216491
64202 216491 217111 217283 216993 216910 217944 220280 223146 225632 227454 228839 230113 231727 234374 238598 244355
64187 244355 251261 259241 268675 279843 292425 305590 318471 330444 340961 349274 354584 356561 355563
64174 355563 352139 346480 338648 329200 319167 309352 300016 291291 283413 276317 269408 262162 254833 248269
64160 248269 243095 239247 236201 233475 231008 229139 228059 227244 225776 223435 221186 220176 220558 221643 223081
64145 223081 225268 228566 232667 236904 240834 244257 247085 249506 252029 254889 257477 258800 258535 257298
64131 257298 255783 254054 251970 249878 248350 247333 246162 244565 243185 242797 243417 244600 246325 249019 252752
64116 252752 257027 261530 266680 273135 280984 289677 298568 307292 315694 323639 330947 337516 343510 349286
64102 349286 354902 359713 362792 363964 364279 365278 367880 372022 377107 382512 387776 392577 396673 399845 401918
64087 401918 402856 402675 401192 397988 392759 385714 377530 368950 360424 352003 343543 335118 327216 320399 314728
64072 314728 309731 305032 300778 297298 294557 292182 289940 287959 286504 285704 285566 286072 287136 288442 289436
64057 289436 289683 289414 289520 290758 292969 295333 297316 299099 301121 303685 307028 311315 316320 321578 327094
64042 327094 333526 341358 350313 359931 370236 381282 392448 402970 412959 423059 433110 441868 448272
64029 448272 452317 454513 455152 454493 453041 451110 448475 445020 441416 438626 436885 435653 434399 432871 430699
64014 430699 427384 422871 417603 411817 405301 398189 391490 386181 381965 377602 372487 367284 362782 358754
64000 358754 354461 349930 346054 343460 341838 340609 339793 339845 340894 342525 344342 346429 349151 352610 356421
63985 356421 360037 363292 366639 370824 376343 383166 390934 399294 408102 417445 427441 437946 448495 458723
63971 458723 468841 479506 491260 504270 518550 534090 550724 568237 586788 606901 628818
63960 628818 652196 676755 703028 732171 765293 803280 847113 897905 956756 1024966 1104289
63949 1104289 1196489 1302635 1423302 1559536 1713037 1885139 2075971 2284836 2510931 2753129
63939 2753129 3009212 3275840 3549339 3826196 4102725 4374510 4636311 4882303 5106377
63930 5106377 5302591 5465913 5592837 5681313 5730087 5738209 5705224 5631758 5519791 5372415
63920 5372415 5193463 4987442 4759653 4516030 4262495 4004171 3745098 3488625 3238020
63911 3238020 2996559 2767108 2551797 2352087 2168771 2001684 1849807 1712154 1588522
63902 1588522 1478907 1382251 1296353 1219171 1149795 1087902 1032798 983456 939177 899643 864421
63891 864421 832799 804083 777699 753045 729593 707234 686278 667029 649477 633385 618586
63880 618586 605246 593953 585414 579891 576935 575832 576175 577956 581331 586493 593608 602611 613205 625247
63866 625247 638879 654074 670332 687156 704568 722639 740741 757815 773367 787682 801000
63855 801000 812942 822866 830393 835403 837843 837672 834835 829236 820967 810468 798152 783914 767414
63842 767414 748834 728936 708367 687295 665788 644068 622298 600519 578937 557799 536874
63831 536874 515651 494340 474191 456314 440483 425502 410534 395724 381754 369206 358292
63820 358292 348810 340246 332086 324066 316206 308789 302294 297059 292883 289194 285700 282609 280097 277987
63806 277987 276123 274714 274002 273893 274169 274705 275152 274769 273118 270744 268678 267276 265956 264059 261618 259196
63790 259196 257262 255785 254285 252269 249716 247114 244927 243169 241645 240357 239405 238661 237864 236939 235916
63775 235916 234621 232834 230746 228936 227792 227210 226933 226916 227199 227654 228035 228213 228210 228023 227570 226900 226341 226224
63757 226224 226405 226288 225528 224566 224177 224628 225583 226687 227761 228430 228240 227363 226634 226593 226945 227294 227836 228835
63739 228835 229967 230831 231715 233129 234852 236257 237486 239476 242710 246629 250405 253637 256136 257791 259028
63724 259028 260851 263946 268059 272644 277699 283498 289733 295482 300054 303535 306416 308904 310700 311373
63710 311373 310889 309703 308294 306702 304712 302383 300116 298206 296609 295274 294415 294291 294845 295733 296648 297650
63694 297650 299250 302038 305932 309881 312733 314450 316081 318437 321190 323474 324897 325596 325702 325269 324632
63679 324632 324339 324707 325640 326863 328091 329055 329652 330087 330673 331530 332600 333811 335004 335844 336141 336238 336623
63662 336623 337110 336772 334917 331854 328428 325007 321292 316982 312250 307491 302922 298625 294772 291575 289097
63647 289097 287247 285855 284603 283080 281233 279680 279203 279866 280997 282103 283337 284865 286327 287489 289078
63632 289078 292223 297095 302736 308307 313889 319803 325788 331410 336932 343197 350725 359352 368725 378758
63618 378758 389468 400707 412274 424194 436781 450535 466095 484218 505587 530419 558193
63607 558193 587872 618574 649950 681810 713434 743563 771123 795619 816667 833538 845597
63596 845597 853056 856844 857721 855875 851503 845307 838049 829801 820045 808447 795148 780225 763271
63583 763271 743849 722193 699126 675381 651379 627709 605365 585192 567307 551337 537099
63572 537099 524751 514381 505789 498754 493268 489460 487426 487167 488525 491179 494837 499409 504850 510928
63558 510928 517395 524354 532149 540849 550109 559715 570117 582363 597683 617071 640954 669089 700861
63545 700861 735643 772666 810705 848375 884750 919129 949977 974779 991546 1000275 1002547 999999
63533 999999 993692 984707 974560 964659 955615 947146 938440 928569 916745 902268 884244 861738 834602
63520 834602 804053 771966 739619 707468 676007 646094 618165 591754 566312 542160 520132
63509 520132 500465 482597 466068 451096 438061 426766 416514 406751 397438 388875 381422 375341
63497 375341 370606 366741 363034 359169 355577 352927 351269 349913 348272 346540 345358 345037 345392 346235 347581
63482 347581 349360 351257 353045 354850 356926 359396 362391 366179 370729 375277 378748 380748 381858 382755
63468 382755 383341 382974 381383 378990 376360 373685 370908 368078 365349 362778 360377 358326 356907 356203 355998
63453 355998 355981 355955 355897 355972 356522 357888 360208 363457 367596 372545 378030 383774 389879 396802 404920 414371
63437 414371 425422 438636 454460 472911 493848 517248 542795 569452 595911 621357 645351
63426 645351 667069 685346 699720 710999 720574 729591 739137 750780 766225 786397 811115 839616
63414 839616 871078 904667 939457 974393 1008102 1038716 1064245 1083416 1096129 1103131 1105400 1103858
63402 1103858 1099328 1092509 1084005 1074322 1063589 1051218 1036162 1017784 996249 971878 944492 913872
63390 913872 880698 846472 812485 779311 747352 717211 689219 663045 638277 615101 594054
63379 594054 575392 559112 545368 534287 525530 518606 513664 511428 512241 515622 520884 527685 535795
63366 535795 544822 554590 565481 578073 592685 609553 629140 651857 677667 706287 737563 771245
63354 771245 806590 842673 879023 915446 951213 984837 1014733 1039695 1058696 1070905 1076336 1076237
63342 1076237 1072399 1066146 1058119 1048708 1038194 1026479 1013118 997755 980331 960750 938573 913358
63330 913358 885293 855332 824629 793952 763662 734126 706006 680261 657959 639914 626164
63319 626164 615750 607297 599938 593483 587615 581246 572928 561738 547623 531187 513518 495959 479526
63306 479526 464424 450389 437456 426044 416315 407872 400218 393170 386720 380863 375734 371544 368139
63293 368139 364919 361456 357952 354829 352067 349292 346302 343129 339707 335926 332050 328701 326260 324481
63279 324481 322840 321122 319570 318532 318041 317783 317510 317444 318095 319574 321310 322656 323591 324503 325431 325906 325631
63262 325631 324953 324539 324851 326059 328207 331214 334854 338886 343085 347118 350619 353609 356650 360350 364820
63247 364820 369836 375365 381648 388818 396798 405595 415403 426322 438225 451063 465105 480714 497985
63234 497985 516694 536480 556939 577696 598594 619775 641441 663525 685745 707931 730123
63223 730123 752276 774054 795134 815737 836718 858926 882349 905958 928475 949263 968386
63212 968386 985857 1001008 1012672 1019855 1022199 1019987 1013805 1004094 990880 973962 953386 929627
63200 929627 903345 875293 846682 819315 794911 774174 756627 741275 727309 714519 703508
63189 703508 695451 691132 690064 690930 692970 696562 702344 710263 719776 730544 742445 755186 768397
63176 768397 782067 796490 811737 827450 843143 858462 873160 887064 900054 911900 922118
63165 922118 930099 935301 937220 935359 929525 920025 907382 891980 874181 854484 833241 810432 786171
63152 786171 761234 736555 712389 688635 665857 645148 626807 610004 594132 579759 567671
63141 567671 557626 548763 540756 533819 527871 522489 517570 513297 509537 505985 502912 501079 500721 501234
63127 501234 502032 503133 504722 506764 509332 512763 517127 522017 527244 533176 539967 546930 553232 558730
63113 558730 563521 567155 569235 570497 572280 574849 577247 579009 581008 584017 587333 589618 590630 591248
63099 591248 592076 592867 593265 593276 592846 591593 589342 586597 584252 582993 583005 583918 584978 585592 585858 586277 586914
63082 586914 587309 587403 588002 589866 592632 595179 596980 598675 601300 605341 610629 616810 623680 631180 639289
63067 639289 647943 657062 666672 677017 688551 701855 717455 735558 755941 778305 802836 830239
63055 830239 861146 895665 933550 974499 1018070 1063678 1110955 1159910 1210436 1261989 1314134
63044 1314134 1367087 1421159 1475876 1530321 1584273 1638296 1692578 1746480 1799513 1852074 1904602
63033 1904602 1956433 2006025 2052101 2094098 2131579 2163562 2188343 2203797 2208191 2201116 2183531 2156669
63021 2156669 2121124 2077221 2025846 1968370 1906063 1840273 1773118 1707262 1644727 1586315 1532267
63010 1532267 1482956 1438794 1400017 1367013 1340541 1321198 1308782 1302399 1301072 1304013 1310581 1320400
62998 1320400 1333513 1350125 1370005 1392231 1415539 1438958 1462215 1485613 1509421 1533343 1556688
62987 1556688 1579077 1600705 1621620 1640878 1656722 1667633 1672993 1672777 1666903 1655063 1637008 1612738
62975 1612738 1582475 1546709 1506367 1462783 1417241 1370516 1322924 1274852 1227103 1180642 1136152
62964 1136152 1094019 1054623 1018349 985169 954468 925477 897889 871924 847812 825329 803906
62953 803906 783187 763398 745034 728094 711812 695376 678834 662973 648288 634391 620627
62942 620627 606957 593942 582110 571664 562637 554884 547865 540873 533650 526586 520195 514610 509680
62929 509680 505269 501256 497486 493954 490974 488890 487675 486981 486531 486239 485977 485439 484329 482553 480216
62914 480216 477597 475187 473492 472592 471968 470921 469164 466950 464691 462609 460733 459071 457697 456718 456153
62899 456153 455834 455448 454821 454150 453867 454221 455078 456098 456949 457327 457015 456120 455126 454454 454000 453327 452266 451140
62881 451140 450366 450057 450113 450457 451065 451862 452769 453737 454682 455507 456267 457153 458128 458732 458479 457466 456400 456033
62863 456033 456591 457695 458726 459334 459769 460652 462369 464795 467636 470753 473902 476547 478416 480137 482688
62848 482688 486128 489416 491701 493282 494966 496945 498787 500215 501331 502171 502571 502536 502340 502163 501959 501761
62832 501761 501779 502062 502289 502175 501924 502158 503356 505419 507748 509741 511291 512770 514519 516491 518483 520491
62816 520491 522558 524412 525612 526095 526297 526678 527365 528308 529477 530809 532196 533657 535353 537374 539740
62801 539740 542585 546054 550000 554211 559109 565747 574726 585496 597070 609201 622420 637185 653553
62788 653553 671610 691752 714538 740765 771627 808231 850648 897925 949352 1005437 1067334
62777 1067334 1135614 1209895 1289360 1373058 1459679 1547480 1634665 1719626 1800641 1875479 1941565
62766 1941565 1996658 2039448 2069489 2086548 2089996 2078985 2053406 2014679 1965408 1908125 1844383
62755 1844383 1775019 1701100 1624389 1546906 1470209 1395126 1322014 1251195 1183233 1118895 1058780
62744 1058780 1002915 950801 901999 856613 815144 777925 744881 715733 690110 667418 646904
62733 646904 628123 611226 596593 584217 573597 564143 555476 547442 540101 533812 529088 526152 524670
62720 524670 524002 523730 523950 525072 527441 531081 535777 541360 547965 556046 566060 578121 591933 607174
62706 607174 623933 642757 664298 689043 717353 749462 785245 824204 866072 911387 961081
62695 961081 1015342 1073070 1132577 1192594 1252511 1311884 1369916 1425324 1476505 1521876 1560052
62684 1560052 1589703 1609413 1618139 1615872 1603469 1581686 1550770 1511276 1464805 1413492 1359006 1302457
62672 1302457 1244988 1187857 1131935 1077578 1024994 974433 926082 880204 837305 797797 761549
62661 761549 728178 697698 670412 646243 624789 606012 590166 576876 565009 553769 543289
62650 543289 533756 524655 515495 506713 499055 492344 485707 478987 473156 469167 466995 465951 465461 465248 465183
62635 465183 465290 465738 466573 467614 468711 469895 471151 472235 472891 473043 472678 471717 470285 468938 468380 468932
62619 468932 470405 472410 474598 476731 478822 481258 484545 488795 493644 498773 504331 510672 517805 525380
62605 525380 533197 541533 550925 561783 574281 588484 604509 622663 643418 667144 693837 723221
62593 723221 755113 789525 826412 865531 906515 948737 990953 1031394 1068501 1101431 1129710
62582 1129710 1152698 1169667 1180112 1183650 1179870 1168735 1151028 1127909 1100111 1068043 1032598 995313
62570 995313 957536 919880 882566 845895 810214 775811 743102 712617 684573 658751 634996
62559 634996 613536 594560 577720 562359 548086 534938 523085 512576 503274 494887 487176 480173
62547 480173 474137 469260 465548 462876 460913 459145 457346 455987 455657 456061 456178 455591 455052 455385 456344 456999
62531 456999 456894 456384 456214 457131 459562 463174 467040 470648 474558 479722 486591 495333 506444 520383 536866
62516 536866 555256 575563 598343 623719 651302 681116 713740 749230 786547 824441 862372
62505 862372 900091 936675 970517 1000104 1024596 1043859 1058241 1068225 1074036 1075648 1073314 1067971
62493 1067971 1060947 1053329 1045796 1039040 1034201 1032759 1035894 1044025 1057099 1075362 1099611 1130518 1167911
62480 1167911 1210882 1258381 1309421 1362964 1418023 1473728 1528809 1580945 1627055 1664439 1691568
62469 1691568 1707928 1713545 1708657 1693417 1667693 1631360 1584929 1529772 1467792 1401134 1332075 1262715
62457 1262715 1194509 1128214 1064288 1003192 945403 891524 842340 798460 759848 726010 696558
62446 696558 671229 649505 630793 614998 602320 592359 584061 576833 571108 567364 565111 563373 561845
62433 561845 560953 560889 561164 561132 560535 559405 557710 555258 551831 547408 542265 536821 531348 525927 520640 515572
62417 515572 510601 505439 500039 494691 489585 484530 479317 474166 469536 465606 462140 458843 455691 452935
62403 452935 450777 449013 447083 444686 442254 440523 439694 439452 439769 441070 443403 446035 448371 450792 454015
62388 454015 457874 461306 463459 464319 464352 464143 464497 466383 470342 475974 482246 488317 494136 500251 507026
62373 507026 514113 520882 527378 534515 543197 553481 564902 577305 590972 606067 622452 640282
62361 640282 660568 684891 714442 749218 788253 830738 876900 927434 982116 1039382 1097348
62350 1097348 1154695 1210167 1261783 1307291 1345324 1375608 1398112 1412551 1418748 1417028 1408112 1392891
62338 1392891 1372263 1346828 1316670 1281810 1242998 1201818 1160009 1118914 1079504 1042491 1008183
62327 1008183 976511 947305 920374 895309 871555 848797 827007 805954 784989 763559 741818
62316 741818 720487 700218 681165 663078 645665 628886 612986 598181 584441 571667 559989
62305 559989 549597 540330 531774 523849 516968 511414 506863 502820 499292 496652 494964 493802 492803 492092
62291 492092 492022 492779 494412 497068 500861 505452 510042 514016 517572 521555 526661 532902 539860 547255 555132
62276 555132 563610 572683 582255 592251 602595 613223 624275 636265 649886 665431 682374 699842
62264 699842 717695 737004 759130 784376 811898 841039 872362 907133 946089 989074 1035684
62253 1035684 1085760 1139092 1194782 1251034 1305515 1356071 1401232 1440055 1471513 1494371 1507865
62242 1507865 1512275 1508484 1497115 1478446 1453026 1421772 1385300 1343634 1297006 1246742 1194974 1143425
62230 1143425 1092667 1042636 993680 946942 903710 864517 828982 796537 767112 741079 718612
62219 718612 699243 682004 665962 650776 636834 624794 614820 606309 598427 590832 583799 577800 573084
62206 573084 569519 566686 564252 562380 561611 562166 563567 565183 566929 569147 572036 575617 580096 585688 592096
62191 592096 598683 605349 612802 621731 632028 642996 654000 664771 675417 686386 698080 710160
62179 710160 721484 731103 739176 746569 753780 760681 767215 773834 781138 789545 799576 812212 828625
62166 828625 849577 875192 905196 939147 976474 1016395 1057876 1099595 1140090 1178067 1212544
62155 1212544 1242603 1267123 1285051 1296026 1300483 1299044 1292060 1279895 1263289 1243012 1219305 1192098
62143 1192098 1161772 1129319 1095748 1061804 1028322 996353 966668 939616 915677 895603 879472
62132 879472 866019 853561 841463 830210 820208 811206 802874 795288 788611 782804 777962 774547 773029
62119 773029 773521 775896 779904 784959 790170 794921 799232 803261 806657 808709 808998 807579 804635 800370 795292
62104 795292 790246 785852 781958 777735 772369 765633 757917 749833 741861 734304 727400 721350 716263 712171
62090 712171 709172 707525 707519 709161 711970 715220 718542 722279 727103 733298 740631 748892 758283 769148 781600
62075 781600 795558 810886 827309 844518 862590 881972 902747 924277 946064 968677 993209
62064 993209 1019968 1048310 1077724 1108360 1140284 1172746 1204444 1234074 1260407 1282370 1299460
62053 1299460 1311808 1319474 1321983 1318822 1310113 1296383 1277950 1254957 1227855 1197314 1163650 1126798
62041 1126798 1087075 1045645 1003905 962571 921663 881356 842561 806454 773597 743726 716256
62030 716256 690714 666783 644439 624214 606827 592255 579600 568224 558496 550717 543727 535583
62018 535583 525663 515258 505861 497668 490123 483163 477271 472730 469456 467338 466279 466063 466584 468085
62004 468085 470822 474644 479174 484268 490021 496446 503421 510799 518280 525300 531226 535650 538396 539435
61990 539435 538937 537139 534027 529444 523627 517245 510626 503389 495206 486594 478421 470944 463820 456852
61976 456852 450159 443768 437655 432118 427537 423728 420087 416431 413169 410520 408109 405572 403060 400837
61962 400837 398810 396841 395266 394665 395200 396408 397578 398212 398293 398276 398686 399548 400477 401530 403627 407598 413000
61945 413000 418515 423614 429189 436219 444475 453185 462536 473545 486478 500349 514354 528912 544645
61932 544645 560991 576710 591400 605548 619284 632085 643774 654722 664649 672190 676347 677736
61920 677736 677747 676969 675106 672010 668010 663466 658775 654701 652022 650893 651195 653380 658254 665841 675191
61905 675191 685471 696614 708551 720379 730779 738942 744760 748365 749854 749307 746735 742028 735170
61892 735170 726498 716672 706423 696314 686558 676973 667296 657615 648292 639423 630604 621421 611903 602294
61878 602294 592506 582147 571095 559891 549399 540110 531755 523631 515365 507409 500740 496040 493172
61865 493172 491411 490109 489220 489322 491179 495140 500839 507508 514661 522515 531786 543131 556769 572566
61851 572566 590352 610043 631457 654230 678096 703082 729031 754903 779040 800417 819329
61840 819329 836490 851658 863614 871389 875047 875192 872184 866168 857697 848062 838942 831691 826839 824219
61826 824219 823639 825366 829848 837037 846142 856038 865788 874845 882916 889611 894086 895118 891815 884269
61812 884269 873287 859509 843107 824391 804301 783978 763962 744062 724006 704055 684899
61801 684899 667026 650277 634114 618399 603790 591161 580604 571184 561801 552151 542716 533971
61789 533971 525903 518348 511493 505752 501201 497470 494185 491197 488253 484877 481002 477392 474834 473042
61775 473042 470983 468350 466011 464757 464280 463843 463402 463429 463998 464653 464993 464891 464335 463630 463612 465083 468054
61758 468054 471946 476408 481356 486376 490793 494476 497913 501309 504151 505854 506362 505865 504465 502404 500134
61743 500134 497748 494669 490358 485125 479928 475505 471981 469150 466765 464616 462623 460901 459648 459006
61729 459006 459042 459704 460719 461700 462468 463183 464141 465558 467520 469854 472042 473584 474612 475859 477836 480286
61713 480286 482620 484604 486325 487734 488571 488701 488158 486876 484635 481395 477502 473417 469273 464833 459876
61698 459876 454548 449237 444196 439474 435199 431580 428472 425264 421503 417381 413231 408884 404104 399536
61684 399536 396399 395063 394528 393629 392151 390405 388273 385366 381854 378467 375699 373514 371851 370934 370860
61669 370860 371186 371155 370276 368646 366852 365697 365870 367586 370341 373007 374459 374384 373542 373152 374042 376390 380000
61652 380000 384443 388978 392830 395752 398109 400285 402274 403969 405515 407058 408375 409091 409230 409310 409863
61637 409863 410967 412281 413433 414371 415262 416026 416153 415210 413463 411702 410400 409322 408022 406430 404815
61622 404815 403413 402248 401140 399797 398079 396214 394563 393135 391615 389887 388160 386489 384490 381780
61608 381780 378377 374450 369956 364831 359421 354440 350433 347331 344463 341150 337462 334230 331977 330036
61594 330036 327252 323536 320011 317435 315222 312443 309180 306335 304465 303355 302447 301250 299572 297772
61580 297772 296518 295975 295547 294779 294096 294140 294784 295407 295827 296242 296470 295975 294654 293008 291550 290575 290385 291103
61562 291103 292269 293264 294160 295497 297205 298501 299044 299463 300401 301676 302874 304238 306364 309224 311999
61547 311999 313871 314731 315178 315944 317175 318238 318464 318123 318262 319518 321513 323626 325825 328367 331117 333715
61531 333715 336122 338375 340000 340291 339268 337757 336334 334681 332307 329530 327279 326072 325554 325038 324147
61516 324147 322874 321341 319772 318556 317994 317943 317881 317452 316809 316321 316088 315881 315516 315061 314648 314277 313943 313855
61498 313855 314322 315356 316563 317532 318231 318848 319350 319484 319292 319300 319924 320892 321537 321559 321180 320713 320386 320591 321776
61479 321776 323857 326095 327806 329028 330308 332057 334267 336566 338383 339259 339270 338995 338953 339253 339800 340470
61463 340470 340919 340695 339864 339170 339247 339920 340622 341152 341659 342215 342879 343914 345382 346790 347624 348053 348541 349018
61445 349018 349132 349168 349884 351310 352552 353056 353455 354721 357063 360039 363306 366696 369851 372332 374105 375583
61429 375583 377108 378517 379184 378547 376720 374660 373474 373497 374211 375013 375713 376272 376546 376588 376874 377819 379287
61412 379287 380797 382031 382839 382990 382297 380938 379344 377736 376049 374282 372716 371694 371332 371441 371587 371240
61396 371240 370099 368398 366778 365689 364965 364120 363048 362225 362089 362440 362709 362714 362829 363408 364468 366017 368230
61379 368230 370978 373610 375642 377399 379514 381977 384246 386119 387936 389895 391764 393372 394857 396236
61365 396236 397249 397875 398592 399824 401439 403067 404635 406309 408182 410256 412588 415274 418496 422639 428037
61350 428037 434455 441222 448105 455643 464255 473389 482022 489709 496587 502530 506986 509811 511757 513830
61336 513830 516406 519194 521839 524222 526209 527407 527388 526113 523968 521284 518057 514327 510635 507696 505526
61321 505526 503265 500091 496117 492197 489070 486912 485601 485133 485788 487994 491950 497320 503435 509870 516656
61306 516656 523891 531440 539267 547748 557276 567602 577824 586932 594121 598780 600664 600172 598106 594952
61292 594952 590655 585221 579260 573560 568250 562735 556607 550364 544984 540923 537800 535022 532346 529673
61278 529673 526771 523637 520923 519461 519363 520057 521235 523212 526210 529822 533552 537384 541415 545367 549032
61263 549032 552862 557443 562586 567648 572721 578725 586118 594152 601708 608305 613965 618675 622550 626103
61249 626103 629674 632746 634460 634720 634178 633090 630896 627233 622832 618910 615939 613372 610398 606655 602336
61234 602336 597965 593985 590320 586469 582258 578387 575848 574936 575132 575886 577134 579075 581882 585614 589963
61219 589963 594050 596956 598641 599962 601697 603978 606718 609987 613628 617086 620020 622661 625196 627242
61205 627242 628402 628938 629434 630197 631459 633718 637221 641499 646114 651605 659005 668648 680159 693248
61191 693248 707653 722471 736574 749675 762054 773207 781803 787296 790611 792934 794644 795803 796713
61178 796713 797368 797153 795743 793716 791655 789256 785964 781902 777482 772508 766422 759114 750860 741837 732324
61163 732324 723039 714478 706100 696846 686357 675145 663793 652653 642194 632953 625094 618495 613184
61150 613184 609227 606329 604125 602690 602145 601894 600985 599173 596925 594302 590573 585151 578254 570457 562264
61135 562264 554340 547517 542116 537759 534212 531948 531480 532627 534942 538432 543259 548999 554953 561230
61121 561230 568859 578604 590089 602368 615130 628994 644685 662174 680749 699816 719452 740111
61109 740111 761944 784560 807419 830142 852332 873359 892650 910149 926184 940752 953075
61098 953075 962057 967133 968570 967004 962860 956243 947176 935832 922602 908054 892703 876673 859707
61085 859707 841721 823256 805148 787787 770990 754576 738807 724194 711176 700061 690945 683506
61073 683506 677150 671525 666635 662304 657950 653290 649036 646486 646408 648567 652150 656386 660863 665669 671245
61058 671245 677863 685275 693116 701572 711372 723052 736526 751335 767055 783399 800321 818214
61046 818214 837806 859526 883052 907664 933005 959308 986891 1015694 1045492 1076426 1108995
61035 1108995 1143463 1179474 1216397 1253929 1292304 1332083 1373874 1418035 1464371 1512218 1561015
61024 1561015 1610661 1661154 1712230 1763710 1815899 1869191 1923581 1979275 2037652 2100819 2170128
61013 2170128 2245699 2327472 2416118 2513120 2621101 2744507 2889363 3062540 3272756 3533219
61003 3533219 3862915 4286012 4832221 5536897 6433438 7536387 8829003 10270930 11820163
60994 11820163 13443293 15099050 16713667 18181577 19400711 20315605 20935054 21317908
60986 21317908 21546416 21704112 21856716 22029065 22184961 22227970 22031962 21489610 20555368
60977 20555368 19263753 17716478 16046092 14374902 12789156 11335891 10033574 8883242
60969 8883242 7875307 6994716 6225676 5554016 4967056 4453597 4004733 3613647 3274125
60960 3274125 2979779 2724573 2503088 2310200 2141489 1994001 1865578 1753338 1653954 1565655
60950 1565655 1488571 1422429 1364971 1313306 1265822 1221856 1180436 1140542 1102209 1066284 1033141
60939 1033141 1002325 973307 945830 919495 893637 867864 842462 818163 795600 774875 755550
60928 755550 737170 719782 703688 688773 674582 661193 649478 640161 632936 626738 620572 613968
60916 613968 607073 600552 595008 590286 585707 581105 577112 574251 572422 571532 571862 573303 574866 575643 575800
60901 575800 575956 576070 575677 574941 574611 575024 575817 576581 577145 577156 576027 573565 570235 566591 562656 558025 552438
60884 552438 546175 539870 533851 527678 520602 512591 504539 497275 490732 484376 478066 472098 466730 462089
60870 462089 458289 455157 452081 448643 445307 443006 442102 442170 442675 443422 444415 445761 447742 450601 454217 458264
60854 458264 462602 467158 471512 475075 477686 479697 481482 483271 485397 488135 491107 493256 493744 492734
60840 492734 491143 489845 489150 488782 488122 486615 484148 481064 477844 474819 472089 469466 466588 463300 459957
60825 459957 457117 454928 453071 451291 449701 448409 447104 445253 442625 439445 436097 432780 429400 425649
60811 425649 421237 416196 411046 406516 402934 399899 396693 393019 389233 385819 382861 380136 377445 374615
60797 374615 371434 368008 365025 363215 362525 362234 361889 361663 361715 361755 361484 361010 360595 360349 360443 361213 362647 364125
60779 364125 365128 365972 367462 369906 372759 375098 376249 376213 375763 375911 377024 378626 380214 381848 383644
60764 383644 385197 386091 386672 387683 389267 390921 392319 393547 394517 394769 394028 392511 390545 388292 385986
60749 385986 384034 382642 381630 380819 380357 380497 381207 382084 382554 382136 380695 378490 375825 372659 368759 364230
60733 364230 359648 355591 352196 349249 346564 344208 342433 341418 340979 340649 340114 339476 338918 338279 337236 335873
60717 335873 334774 334439 334800 335371 335743 335851 335865 335942 336150 336579 337378 338544 339767 340790 341911 343844 346928
60700 346928 350710 354370 357324 359369 360599 361411 362328 363618 365231 367087 369033 370543 371031 370740 370666 371280
60684 371280 371934 371993 371801 371851 371645 370452 368857 368513 370310 373607 377270 380562 382977 384179 384508 384828 385506
60667 385506 386050 386011 385562 384819 383241 380268 376196 371896 367976 364627 361997 360185 358997 358137 357668 357912
60651 357912 358910 360268 361618 363011 364711 366666 368371 369366 369826 370356 371083 371219 369916 367434 365046 363693
60635 363693 363085 362287 360929 359570 358959 359149 359435 359151 358385 357745 357437 356966 355835 354258 352881 352110 352011
60618 352011 352547 353498 354404 354991 355498 356218 357013 357738 358734 360196 361386 361397 360615 360436 361353 362227 361853 360492
60600 360492 359414 359519 360850 362932 365061 366673 367906 369463 371574 373521 374612 375178 376030 377276 378315
60585 378315 378803 378983 379090 379028 378772 378654 379031 379915 381080 382375 383831 385535 387490 389612 391880 394527
60569 394527 398011 402773 409030 416693 425309 434143 442601 450604 458360 465707 471971 476568 479488 481031
60555 481031 481306 480177 477633 474086 470358 467305 465244 463770 462378 461234 461046 462150 464174 466750 470189
60540 470189 475201 482171 490956 501181 512548 524965 538571 553474 569400 585703 601763 617094
60528 617094 630980 642362 650366 654825 656146 654843 651359 646135 639553 631837 623158 613892 604726 596416
60514 596416 589328 583174 577437 572221 568437 566808 566890 567475 567844 568280 569543 572410 577631 585707 596570
60499 596570 610016 626479 646835 671328 699239 729709 762261 796358 831180 866078 900580
60488 900580 933648 963716 989967 1012882 1032970 1049589 1061643 1068817 1071290 1068724 1060458 1046460
60476 1046460 1027224 1002871 973252 939061 902074 864041 825815 787721 750336 714662 681844
60465 681844 652690 627195 604550 583939 565341 549230 535559 523438 511828 500289 489134
60454 489134 479201 471342 465663 461169 456533 451292 445993 441231 436959 432812 428683 424867 421875 420147
60440 420147 419571 419276 418286 416510 414708 413416 412348 411085 409811 408895 408050 406552 404276 402083 400997
60425 400997 401285 402409 403583 404190 403923 402969 402066 402045 403074 404412 405062 404628 403541 402657 402745 404098 406308
60408 406308 408510 410127 411392 412915 414852 416827 418624 420486 422601 424700 426403 427707 428932 430453
60394 430453 432624 435667 439344 442974 446053 448713 451372 454153 456931 459791 463012 466548 469806 472164
60380 472164 473679 475137 477297 480113 482911 485343 487825 490858 494287 497639 500790 503777 506214 507693
60366 507693 508634 509921 511655 513099 513995 515030 516712 518731 520887 523727 527650 532197 536978 542553 549530
60351 549530 557436 565473 573804 582939 592244 600288 606621 611974 616592 619522 619952 618311 615462 611543
60337 611543 606237 599819 593269 587430 582434 577964 573809 570041 566610 562995 558614 553643 548952 544934
60323 544934 540892 536085 530917 526422 522864 519635 516433 513740 512111 511681 512510 514802 518626 523922 530903
60308 530903 539964 551063 563689 577472 592340 607965 623646 638903 653672 667670 679939 689260
60296 689260 694681 695629 691965 684156 673097 659663 644676 629175 614131 599906 586486 574282
60284 574282 564035 555858 549002 542816 537306 532542 528227 524209 520805 518184 515893 513395 510629 507676
60270 507676 504413 500969 497977 495742 493541 490417 486363 482142 478183 474369 470831 468188 466755 465997
60256 465997 465022 463390 461343 459421 458025 457248 457053 457558 458922 460911 462871 464399 465799 467543 469420
60241 469420 470580 470428 469190 467636 466558 466530 467769 469911 472020 473161 473106 472438 471926 471862 472085 472544 473568
60224 473568 475497 478286 481642 485355 489267 493103 496652 500029 503438 506786 509902 513130 517298 522976
60210 522976 530011 537802 545765 553529 561072 568710 576657 584593 592005 598940 605968 613352 620755 627862
60196 627862 634704 641207 646948 651701 655705 658983 660931 661122 660188 659290 658890 658501 657474 655505 652443
60181 652443 648132 642612 636193 629274 622299 615835 610340 605778 601665 597585 593556 589893 586836 584303
60167 584303 581911 579270 576298 573181 570018 566755 563497 560634 558467 556873 555560 554453 553700 553506 554166
60152 554166 555963 558654 561216 562518 562323 561421 560801 560904 561571 562379 562990 563404 564019 565280 567256 569698
60136 569698 572535 576117 580853 586766 593513 600766 608314 615741 622262 627259 631007 634455 638015 640919
60122 640919 642264 642500 643208 645322 648235 650952 653494 656571 660304 663998 667137 669940 672816 675726 678300
60107 678300 680226 681343 681582 681001 679721 677639 674432 670050 665056 660176 655519 650584 645128 639735 635230
60092 635230 631708 628547 625345 622355 619812 617309 614335 611212 608940 608105 608338 608920 609529 610279 611299
60077 611299 612446 613270 613233 612144 610319 608001 604761 599934 593692 587127 581071 575361 569505 563555 557848
60062 557848 552283 546456 540399 534683 529815 525866 522616 519729 516779 513481 510026 507022 505025 504222
60048 504222 504479 505553 507255 509588 512715 516710 521370 526342 531388 536364 541045 545188 548873 552629
60034 552629 557013 561969 566702 570346 572776 574610 576352 577872 578845 579267 579070 577498 573581 567255 559486
60019 559486 551202 542648 533884 525215 516783 508313 499774 491827 485099 479317 473762 468389 463878 460589
60005 460589 457987 455252 452136 449067 446618 445011 444052 443441 443076 442963 442933 442724 442369 442281 442850 444236 446595
59988 446595 450076 454368 458660 462421 465968 469884 474076 477812 480573 482510 484095 485590 486807 487202
59974 487202 486294 484204 481678 479443 477625 475921 474111 472179 470104 467868 465623 463739 462744 463090 464702
59959 464702 466715 468179 469141 470550 472801 475027 476292 476890 477724 478803 479289 478896 478346 478276 478443 478318 477926
59942 477926 477729 478013 478694 479473 479947 479762 478862 477535 476144 474916 473959 473261 472673 472149 472085 473227 476065
59925 476065 480399 485514 490730 495749 500571 505166 509353 513083 516688 520478 524042 526347 526808 525943 524732
59910 524732 523745 523268 523843 525902 528884 531400 532533 532656 532793 533525 534716 536049 537500 539269 541413 543720
59894 543720 546024 548574 551859 556033 560748 565615 570498 575205 579373 583046 587044 592224 598548 605275
59880 605275 611914 618466 624837 630607 635504 639703 643476 646833 649620 651673 652718 652371 650444 647231
59866 647231 643397 639502 635545 631018 625583 619747 614539 610461 607073 603799 600744 598359 596737 595712
59852 595712 595434 596323 598523 601826 606069 611265 617425 624452 632087 639773 646872 653279 659356 664949 669059
59837 669059 671134 672184 673776 676154 678221 679176 679197 678522 676894 674233 671058 667769 664058 659392 653717
59822 653717 647485 641308 635658 630446 624901 618420 611576 605612 600882 596518 591829 587276 583586 580641
59808 580641 577748 574524 570974 567115 563089 559334 556171 553441 550903 548710 547087 545848 544660 543581
59794 543581 542869 542444 541987 541555 541668 542677 544228 545477 545816 545473 545302 545833 546582 546650 545950 545368 545540 545964
59776 545964 545641 544235 542278 540527 539507 539455 540304 541737 543492 545503 547628 549501 550891 551991 553160
59761 553160 554604 556604 559778 564664 571011 577744 583730 588538 592659 597119 602745 609560 616844 623844
59747 623844 630342 636594 642998 649923 657515 665403 672729 678769 683504 687428 690915 693861 695912 696947
59733 696947 697367 697888 698899 700097 700930 701364 701901 702842 703908 704641 704874 704648 704056 703358 702910 702719 702274 701126
59715 701126 699425 697681 696115 694451 692176 688928 684813 680505 676859 674242 672399 671030 670232 670329 671530
59700 671530 673922 677467 681787 686268 690684 695577 701791 709750 719221 729443 739233 747294 752803 755654
59686 755654 756014 754005 750073 745277 740651 736303 731565 726051 720196 714685 709622 704438 698481 691606
59672 691606 684242 676961 670011 663288 656662 650187 643920 637735 631471 625204 619350 614561 611488 610442
59658 610442 611121 612784 614746 616705 618678 620865 623601 627171 631515 636175 640605 644426 647464 649695
59644 649695 651140 651595 650484 647252 642029 635728 629363 623375 617669 612183 607277 603487 600825 598477
59630 598477 595529 592021 588869 586631 584869 582996 581047 579056 576364 572495 568310 565180 563123 560793
59616 560793 557293 552986 548449 543773 539157 535125 531682 528221 524733 522160 521003 520588 520402 521114 523294
59601 523294 525970 527696 528556 529888 532241 534717 536424 537595 539102 541485 544700 548284 551579 554125
59587 554125 555940 557270 558201 558680 558691 558143 556845 554860 552581 550185 547351 543818 539821 535634 531170
59572 531170 526437 521927 518086 514845 512091 510035 508541 506797 504433 502388 501767 502240 502552 502222 501657
59557 501657 500868 499308 497071 495147 494254 494219 494710 495653 496730 497294 497197 497102 497667 499047 501376 505179 510978
59540 510978 518934 528948 540622 553112 565730 578764 592919 607718 621189 631389 637569 639739
59528 639739 638190 634080 629603 626632 625502 625577 626423 627741 628795 628981 628812 629487 631346 633373 634220 633211
59512 633211 630354 626056 620978 615686 610127 603755 596361 588489 580864 573726 566996 560835 555646 551518
59498 551518 548036 544716 541448 538396 535678 533356 531685 531052 531566 532856 534368 535781 537092 538446 540002
59483 540002 541874 544187 547272 551769 558243 566576 576021 585986 596510 607776 619473 630957 641773
59470 641773 651585 659771 665557 668615 669227 667927 665305 662092 659052 656692 655268 654996 655934 657749 660065
59455 660065 663127 667761 674494 683040 692778 703427 715008 727433 740441 753764 766960 779004
59443 779004 788483 794542 797537 798423 797430 793770 786871 777531 767392 757498 747914 738551 729589 720921
59429 720921 711989 702567 693175 684356 676161 668762 662955 659479 658328 659333 662905 669497 678921 691091
59415 691091 707061 728193 754235 783135 812760 841996 870049 895542 916594 931215 937667 935462
59403 935462 926629 915351 905657 899453 896803 897452 901565 909107 918804 927660 931694 927775 915220 895754
59389 895754 872213 847530 824418 804802 789020 776052 764852 755117 746745 739301 732514 726826
59377 726826 722860 720522 719008 717560 715956 714422 713302 712698 712260 711428 709938 707956 705733 703438 701347
59362 701347 699902 699422 699938 701256 703003 704752 706587 709452 714380 721285 729042 736918 745386 755296 766804
59347 766804 779541 793339 808292 824317 841116 858442 876035 893325 909555 924254 937411
59336 937411 949067 958794 965703 969123 969272 966972 962576 955559 945497 933033 919299 904666 888823
59323 888823 871985 855128 838886 823027 807380 792588 779372 767525 756158 744708 733274
59312 733274 722212 711744 701887 692512 683571 675370 668376 662660 657788 653432 649904 647997 648500 651837
59298 651837 657837 665721 674536 683594 692208 699190 703221 703777 701204 695814 687597 677036 665555 654653
59284 654653 644967 636458 629086 622906 617858 613990 611729 611586 613657 617598 622984 629626 637719 647643
59270 647643 659387 672187 685111 697987 711325 725310 739350 752645 764604 774581 781816 785973
59258 785973 787379 786550 783889 779860 774882 768901 761722 753913 746685 740604 735150 729888 725330 722174
59244 722174 720364 719453 719305 719902 721051 722859 725951 730578 735985 741289 746504 752073 757896 763568 769114
59229 769114 774540 778957 781085 780654 778559 775553 771418 765541 757793 748661 738863 728868 718629 707871
59215 707871 696843 686489 677554 669888 662985 656850 651724 647248 642613 637554 632655 628627 625674 623583
59201 623583 622117 621259 621247 622209 623681 624839 625508 626546 628839 632224 635843 639194 642339 645392 648493
59186 648493 652051 656410 661347 666385 671439 676635 681673 685957 689271 691777 693440 694105 694129 694322 695145
59171 695145 696408 697822 699348 700960 702496 703875 705131 706210 707104 708165 709807 711801 713204 713075 711056
59156 711056 707364 702616 697606 692729 687458 680811 672521 663484 654878 647075 639592 631901 624019 616376
59142 616376 609302 602760 596544 590506 584454 578030 571106 564271 558494 554190 551017 548645 547158 546446
59128 546446 545836 544812 543724 543366 544190 546348 550074 555471 562168 569640 577585 585672 593454 601097 609726
59113 609726 620247 632091 643826 654760 665198 675333 684774 693191 700674 707295 712914 717534 721341
59100 721341 724371 726608 728374 730067 731519 732114 731578 730191 728306 726218 724408 723267 722549 721695 720715
59085 720715 720135 719987 719488 717951 715458 712433 709042 705188 700667 695187 688693 681795 675393 669680 663925
59070 663925 657432 650276 643006 636090 629910 624793 620676 616992 613122 608871 604472 600450 597491 595989
59056 595989 595464 594779 593177 590916 588777 587234 586170 585104 583483 580974 577710 574174 570872 568175 566352
59041 566352 565396 564845 564119 563074 561975 560952 559828 558544 557454 557117 557990 560302 563885 568108 572315
59026 572315 576489 581296 587452 595169 604228 614386 625647 638202 652022 666512 680780 694358
59014 694358 707270 719273 729483 737130 742246 745095 745436 743049 738745 734127 730373 727782 726294 725743
59000 725743 725729 725999 727022 729519 733372 737593 741375 744487 746611 747140 746039 744331 743268 743218 743497 742983
58984 742983 740932 737621 734206 731544 729198 726197 722700 720197 719863 721449 724046 727366 731776 737538
58970 737538 744488 752305 760778 769920 779844 790386 800926 810906 820484 830181 839885 848693 855793 860999
58956 860999 864288 865275 863408 858380 850312 839819 827912 815435 802521 788922 774751 760475 746348
58943 746348 732478 719434 708045 698485 690197 682833 676623 671602 667213 663040 659360 656568 654447
58930 654447 652407 650090 647506 644886 642662 641224 640440 639677 638368 636331 633545 630090 626412 623183 620736
58915 620736 618980 617936 617830 618579 619726 621095 623068 625979 629642 633712 638228 643706 650965 660771 673160
58900 673160 687079 701162 714880 728551 742368 756082 769540 782770 795454 807082 817775
58889 817775 828244 838849 849556 860997 874536 890715 908298 925398 940978 954759 966335
58878 966335 975084 980722 983471 983850 982422 979380 974203 966230 955793 944268 932812 921577 910360
58865 910360 899301 888571 878033 867684 857925 848878 839912 830308 820012 809361 798449 787190
58853 787190 775635 763894 752081 740634 730317 721600 714307 708029 702452 697136 691500 685311 678741
58840 678741 671810 664267 656188 648102 640306 632654 625233 618534 612706 607300 602100 597497 593663 590097
58826 590097 586441 583110 580628 578954 577950 577918 579092 581044 583078 584846 586306 587620 589389 592300 596170
58811 596170 599989 603201 606241 609448 612343 614449 615898 616634 615961 613707 610941 608639 606383 603334 599828
58796 599828 596873 594604 592362 589944 587652 585328 582420 578969 575664 572927 570735 569356 569453 571336 574637
58781 574637 578826 583567 588574 593536 598309 602983 607781 612920 618258 622996 626152 627509 627623 626803 624781
58766 624781 621637 618132 614566 610130 604084 596976 590003 583752 578234 573526 569568 565875 562279 559493
58752 559493 558172 557877 557729 557550 557536 557361 556653 556062 556787 559164 562513 566263 570422 575072 580175 585813
58736 585813 591969 598134 603684 608565 613177 617819 622629 627688 632745 637316 641450 645868 650758 655101
58722 655101 657883 659396 660667 662230 664210 666891 670255 673586 676565 680142 685243 691129 696235 700166
58708 700166 703612 706674 708610 709093 708358 706149 701719 694971 686533 676632 664905 651421 636937 622087
58694 622087 607192 592848 579740 567792 556365 545389 535527 527232 520341 514467 509008 503021 496016
58681 496016 488715 482163 476367 470798 465800 462203 459696 456999 453760 451014 449615 449512 450706 453557
58667 453557 457745 462165 466397 471241 477360 484433 492053 500297 508768 516129 521381 524860 527319 528799
58653 528799 529007 528117 526428 523813 520250 516474 513409 511123 508846 505836 501883 497259 492495 488078 484131
58638 484131 480579 477682 476039 475920 476868 478124 479293 480559 482416 485125 488250 490924 492771 494177 495326
58623 495326 495524 494099 491543 488944 486599 484070 481416 479425 478601 478769 479765 481764 484817 488737 493488
58608 493488 499031 504682 509280 512180 513732 514765 515975 517599 519228 520155 520361 520733 521781 522693 522408
58593 522408 521106 519748 518720 518008 518227 520153 523513 527496 532276 538697 546548 554570 562280 570490 579760
58578 579760 589589 599365 608940 617923 625585 631946 638016 644595 651668 659261 667972 678358 690581 704825
58564 704825 721306 739719 759513 780722 803644 827727 851830 875568 899213 922108 942402
58553 942402 958668 970788 979092 983802 985638 985740 984558 981744 977466 972741 968071 962730 955810 947062
58539 947062 936383 923455 908257 891168 872319 851684 829906 808063 786573 765396 745329
58528 745329 727820 713259 700695 689468 679884 672018 665200 659076 653909 649404 644545 639023 633617
58515 633617 628768 624038 619432 615846 613635 612045 610625 609845 609704 609139 607608 606003 605211 604950 604774 604974
58499 604974 605671 606236 606449 607032 608215 609011 608835 608625 609328 610477 611379 612635 615275 619288 624168 630115
58483 630115 637509 645888 654617 664085 675202 688180 702635 718422 735457 753049 770063 785465
58471 785465 798299 807686 813332 815613 814873 811199 805091 797583 789478 781228 773617 767484 762637 758268
58457 758268 754789 753982 756829 762431 769582 778121 787995 798245 807742 816032 822765 827246 829061 828220
58443 828220 824327 816778 806205 794583 783445 773079 763637 755542 748441 741374 734519 729219 725864
58430 725864 723493 722023 722879 726610 731898 737932 745755 755986 767105 777423 787047 796408 804444 809858
58416 809858 812834 814037 813158 809784 804404 797311 787947 776597 765243 755318 746104 736712 728060 721280
58402 721280 715661 709940 704377 699939 696645 694299 693637 695138 697845 700826 704524 709247 713824 717362
58388 717362 720835 725184 729255 731530 732558 733778 735186 736164 737413 739999 743399 746348 748720 750895
58374 750895 752402 752978 753910 756487 760127 763764 767899 773499 780028 786480 793228 800970 809053 816748 825088
58359 825088 835410 847146 858944 870804 883092 894578 903612 910318 915741 919890 922511 924592 927050
58346 927050 929056 929692 930096 931992 935315 939299 944545 951847 960311 968924 978689 990898 1004541 1017784
58332 1017784 1030737 1044492 1058738 1072744 1087270 1102957 1118184 1131022 1141985 1152344 1161266
58321 1161266 1167365 1171612 1175841 1179760 1182310 1184480 1187776 1191353 1193796 1196353 1201155 1207562 1213505 1219151
58307 1219151 1225902 1233159 1239597 1246360 1255446 1266077 1276272 1286749 1299506 1313697 1326779 1338731
58295 1338731 1351259 1363870 1374780 1384838 1396562 1410059 1423788 1438340 1455380 1473801 1491234
58284 1491234 1508500 1528327 1550577 1573121 1596502 1623011 1651880 1680250 1708352 1738965 1772186
58273 1772186 1805621 1839345 1875700 1914452 1953053 1991547 2032374 2075540 2118879 2162876 2210270
58262 2210270 2261158 2313374 2367259 2424865 2484966 2544269 2603036 2663913 2725731 2784459 2840027
58251 2840027 2896108 2953548 3010345 3067934 3130708 3199059 3269412 3341377 3418253 3500338 3584655
58240 3584655 3671657 3765334 3866431 3972576 4085100 4208258 4341640 4481121 4627498 4786122
58230 4786122 4957964 5139631 5332257 5541255 5766952 6005089 6257222 6530816 6828497
58221 6828497 7147534 7490485 7865201 8273546 8711959 9184400 9702620 10272654 10894306
58212 10894306 11575342 12332125 13174900 14108010 15146891 16318875 17645679 19143889 20846509
58203 20846509 22806146 25076357 27714723 30811995 34500457 38940017 44338085 51004287
58195 51004287 59371223 69972089 83431743 100422304 121437665 146441635 174731574
58188 174731574 205219185 236815005 268420428 298513247 324857785 344787483 355962275
58181 355962275 357155331 348688986 332341155 310736245 286489695 261558676 237090257
58174 237090257 213653276 191529349 170882236 151827653 134450180 118775131 104739154
58167 104739154 92220048 81102386 71299075 62718761 55244569 48751042 43120123 38237246
58159 38237246 33994790 30308767 27117937 24361968 21973660 19894343 18081332 16496326
58151 16496326 15100366 13864249 12770877 11802536 10936463 10156006 9454893 8826641 8259656
58142 8259656 7745802 7283631 6869349 6493471 6149431 5836776 5552785 5289292 5040703
58133 5040703 4807261 4587773 4377182 4174113 3983063 3806089 3639474 3481194 3334215
58124 3334215 3199459 3072604 2951020 2837260 2732570 2633409 2537547 2447482 2364576 2285615
58114 2285615 2208460 2135660 2069297 2007315 1947964 1892947 1843132 1795761 1748797 1703755 1661683
58103 1661683 1620615 1579419 1539918 1502884 1466124 1428781 1393362 1361274 1330493 1299788 1271160
58092 1271160 1245898 1222280 1199342 1178918 1161784 1145720 1129538 1115040 1102820 1090149 1075336
58081 1075336 1060296 1046433 1031828 1014985 997690 981553 965227 947556 930123 914123 897975
58070 897975 880541 863566 848475 833841 818437 803762 791104 779086 766552 754912 745171 735559
58058 735559 724643 713955 704989 696335 686372 676167 667065 657979 647795 638100 630775 624985 619070
58045 619070 613370 608697 604044 598269 592190 586705 580746 573337 565816 559785 554699 549554 544967 541446
58031 541446 537548 531967 525559 519169 511503 501514 490966 482157 474821 467696 461344 456814 453050 448320
58017 448320 443022 438676 435250 431765 428452 426067 424064 421578 419239 418033 417286 415729 413600 411915
58003 411915 410603 409062 407563 406496 405390 404169 404111 405867 407870 408469 408307 408794 409630 409820 409871 410851 412256
57986 412256 412803 412457 411811 410456 407793 404587 401962 399710 397205 394909 393279 391308 388005 384314 381725
57971 381725 379967 377923 375839 374700 374282 373772 373500 374177 375188 375439 375149 375102 374986 374267 373769 374380 375024
57954 375024 373957 371369 368671 365862 361857 357022 353131 350864 349276 347765 346824 346820 347605 349407 352724
57939 352724 357331 362565 368434 375379 383253 391586 400364 409480 418047 425369 431910 438088 442963 445418
57925 445418 445806 444993 442661 438127 432036 425570 418661 410662 402117 394093 386384 378158 369897 362908 357355
57910 357355 352469 348289 345415 343413 341255 339068 337805 337445 337111 336608 336211 335387 333540 331661 331419 332824
57894 332824 334552 336268 338724 341852 344815 347897 352239 357561 362136 365351 368351 371721 374417 375607
57880 375607 375942 376289 376545 376324 375575 374026 371177 367301 363425 359952 356275 351996 347475 343041 338741
57865 338741 334986 332327 330455 328544 326704 325933 326560 327974 330040 333473 338467 344124 349638 355043 360459
57850 360459 365601 370385 375141 379877 384080 387442 390104 392115 393340 393861 393814 392985 391341 389578 388260
57835 388260 386768 384143 380616 377178 374029 370799 367964 366533 366343 366050 364881 363148 361148 358899 357010
57820 357010 356372 356875 357600 358273 359202 359836 358932 356348 353262 350363 347116 342969 337942 331891 324556 316565
57804 316565 309035 302008 294669 287217 280940 276148 271699 267049 263189 260939 259801 259186 259367 260454 261674
57789 261674 262439 263104 264048 265128 266594 269336 273521 278130 282466 287002 292151 297441 302661 308637 315989
57774 315989 324097 332029 339512 346253 351366 354452 356387 358172 359720 360499 360550 360082 358829 356587 353739
57759 353739 350556 346693 342084 337634 334264 331787 329331 326397 323037 319664 317118 316230 316756 317381 317243
57744 317243 316771 316648 316800 316979 317512 318751 320326 321611 322451 323026 323523 324225 325337 326474 327021 327176 327750
57727 327750 328754 329271 329134 329508 331184 333413 335303 337357 340664 345265 350317 355371 360659 366420 372506
57712 372506 378335 382987 385896 387629 389252 390801 391337 390675 389757 388910 387275 384847 383653 385562 389867
57697 389867 394341 397954 401344 405130 409039 412312 413952 412815 408399 401384 392744 382741 371491 359932
57683 359932 349358 340249 332375 325731 320670 317432 316221 317524 321829 329433 341090 358445 383217
57670 383217 416120 456842 504352 556627 610591 662947 710707 750562 778527 791104 786719 766024
57658 766024 731728 688539 642083 596560 553570 513481 477030 444937 416924 392223 370557
57647 370557 351822 335423 320789 308045 297385 288405 280778 274868 270802 267598 264172 260577 257311
57634 257311 254123 250569 247112 244503 242566 240701 239039 237882 236511 233990 230861 228682 227916 227522 226593
57619 226593 225195 223534 221442 218895 216121 213015 209262 205102 201200 197765 194556 191709 189742 188700
57605 188700 188046 187403 186705 185789 184629 183883 184330 185682 186714 186618 185613 184264 182929 181842 181056 180236 179037
57588 179037 177565 176024 174239 172195 170627 170167 170158 169312 167391 165292 163569 161945 160284 158966 158013 156737
57572 156737 154623 151896 149018 146255 143900 142210 140928 139428 137464 135193 132455 128777 124357 120348
57558 120348 117757 116442 115477 114225 112888 112212 112821 114703 117432 120833 125122 130245 135565 140565 145389
57543 145389 150256 154901 159093 163136 167254 171062 174331 177676 181656 185693 188733 190469 191068 190451 188951
57528 188951 188069 189152 191545 193326 193620 192946 191654 189600 187326 185953 185608 185291 184543 183916 183490 182361
57512 182361 180179 177963 176738 176300 175888 175175 174066 172429 170600 169365 168906 168388 167007 164748 161904
57497 161904 158677 155615 153515 152348 151013 148699 145852 143414 141705 140401 138975 136881 134024 131330
57483 131330 130042 130112 130092 128974 127259 125832 124702 123469 122223 121208 120165 118634 116523 113937 110973
57468 110973 108071 106009 105086 104779 104479 104051 103420 102349 101025 100158 100013 99933 99226 97965 96532 95037 93617
57451 93617 92681 92380 92360 92380 92620 93131 93682 94456 96125 98790 101670 104222 106747 109374 111411 112404 112986
57434 112986 113811 114405 113959 112663 111353 110362 109614 109413 110184 111636 112978 113862 114518 115169 115871 116682 117463
57417 117463 117776 117437 116907 116724 116888 117210 117793 118692 119528 119983 120301 120823 121462 122078 122834 123657 123910 123288 122512
57398 122512 122349 122392 121623 119937 118251 117280 116937 116904 117147 117846 119255 121554 124478 127309 129609 131699 133993
57381 133993 136221 137783 138635 139288 140166 141396 143039 145067 147301 149587 151736 153115 152864 150987 148722
57366 148722 147299 146747 146360 145803 145149 144357 143417 142702 142512 142512 142179 141469 140572 139418 138087 137299 137752 139148
57348 139148 140525 141362 141898 142593 143789 145599 147687 149361 150238 150399 149658 147436 143918 140592 138838 138480
57332 138480 138454 138338 138398 138676 138974 139345 139742 139580 138522 137297 136842 136977 136793 135985 134852 133463 131839 130682
57314 130682 130799 131979 133341 134483 135364 135464 134294 132422 130825 129510 128030 127014 127613 129501 131042
57299 131042 131594 132037 132709 132569 131177 129974 130532 132568 134697 136304 137627 138613 138768 137951 136636 135411
57283 135411 134592 134156 133836 133515 133536 134269 135493 136732 138104 140102 142585 144843 146703 148654 150743 152350
57267 152350 153395 154712 156743 158787 160135 161135 162464 164016 165199 165844 166181 166377 166624 167255 168269
57252 168269 169139 169571 170036 171129 172769 174437 175810 176822 177472 178007 178902 180285 181691 182652 183081 182899
57236 182899 181868 180240 179027 179035 179973 181034 182095 183788 186485 189702 192548 194539 195924 197334 199148
57221 199148 201306 203767 206863 210874 215547 220433 225458 230636 235519 239627 243296 247316 251814 256235
57207 256235 260355 264435 268364 271623 274214 276713 279229 281217 282590 284039 285903 287665 289004 290515
57193 290515 292881 296074 299776 303855 307992 311578 314496 317360 320644 324215 327947 332016 336291 340330
57179 340330 344305 349047 354807 360943 367261 374601 383551 393538 403841 414574 426077 438317 451522
57166 451522 466377 482821 499531 515313 530052 543687 555409 564867 573129 581437 589885 598290
57154 598290 607465 618464 631240 645015 659305 673750 687750 701178 714720 728789 743046 757693
57142 757693 773964 792341 811579 830726 850758 872796 896035 919125 942500 967515 994205
57131 994205 1021766 1050436 1080993 1113015 1145532 1178892 1214263 1251791 1291012 1332531 1377594
57120 1377594 1426499 1479142 1536474 1599709 1668775 1743300 1824353 1913430 2010741 2116537 2233115
57109 2233115 2363313 2508179 2668606 2848131 3051504 3281833 3542425 3840483 4185935
57100 4185935 4588333 5059369 5618010 6289498 7100895 8082872 9275298 10725288 12478820
57091 12478820 14577253 17057513 19944342 23238596 26918912 30956168 35322065 39989365
57083 39989365 44935576 50131553 55475175 60693443 65323672 68850640 70921340 71468029
57075 71468029 70663054 68785769 66118592 62905226 59339423 55565836 51696308 47829800
57067 47829800 44054653 40436622 37014668 33808845 30825433 28055879 25482247 23091100
57059 23091100 20880251 18850582 16995724 15302992 13761756 12367549 11118819 10011671
57051 10011671 9037260 8182535 7432923 6774607 6195250 5684597 5235953 4846065 4511533
57042 4511533 4225277 3977467 3758968 3562298 3380253 3206425 3037924 2876418 2726511
57033 2726511 2593987 2484454 2400661 2339956 2295347 2259426 2226669 2192982 2155669 2114715 2072611
57022 2072611 2031848 1992673 1952449 1905549 1844239 1762301 1659372 1541281 1416175 1291271
57012 1291271 1172549 1064687 969655 886529 813676 750241 695179 646451 602342 562526 526974
57001 526974 494856 465464 439132 416110 395284 375157 355532 337332 321291 307642 296493
56990 296493 287626 280411 274733 271520 271614 274655 279783 286760 295386 304231 311058 314307 313517 308711 300419
56975 300419 290074 279341 268950 258835 249240 240850 233900 228031 223175 219891 218675 219529 222343
56962 222343 227219 234259 243488 255025 268946 284836 301738 318492 333764 345852 352997 354172
56950 354172 349493 340057 327577 313937 300509 287820 276016 265508 256905 250558 246547 245013 246185
56937 246185 250275 257604 268504 282759 299465 317952 338429 360962 383950 404251 418887 426181
56925 426181 425574 417306 402609 383659 362834 341961 322098 303608 286459 270715 256625 244012
56913 244012 232047 220250 209446 200883 194511 189000 183528 178676 175260 173123 171544 170221 169282 168847
56899 168847 169115 170511 173205 176728 180597 185199 191671 200977 213352 228455 245650 264269 283986
56886 283986 304969 327267 349889 370645 387082 397660 402127 401052 395282 385899 374387 362408
56874 362408 351236 341500 333449 327279 323234 321800 323973 330983 343542 361743 385795 416197 452655
56861 452655 493374 536129 579637 622934 663603 697592 721045 731802 729406 714847 690756 661021
56849 661021 629418 598661 570644 546813 527939 514196 506001 504440 510573 524882 547896 580881
56837 580881 625150 680684 745598 816721 890347 962662 1029734 1087005 1128954 1150196 1147923 1123535
56825 1123535 1081765 1028404 968788 907583 848676 794646 746564 704638 669154 640871 620677
56814 620677 609099 606420 613292 630742 659074 696800 741072 788960 837788 884238 923890 952048
56802 952048 964867 960035 937461 899919 852447 800395 747895 697821 652145 611614 575667 543574
56790 543574 515664 493114 476801 466867 463185 465688 474206 488351 507544 530845 556694 582852
56778 582852 606494 624455 633857 633010 621892 601932 575582 545818 515170 484809 454842 425603
56766 425603 398171 373480 351519 331731 313637 296770 280632 265276 251459 239738 229741 220707
56754 220707 212253 204227 196380 188824 182296 177309 173342 169514 165714 162485 160043 158086 156303 154504
56740 154504 152506 150443 148917 148251 147862 147048 146117 146025 147003 148195 148616 147891 146198 144141 142650 142413 143291
56723 143291 144621 145954 147169 148163 149012 150186 152009 154061 155693 156956 158423 160251 162057 163569 164815
56708 164815 165807 166658 167850 169705 171724 173115 173860 174558 175365 175853 175842 175536 174855 173440 171504 169897 169196
56691 169196 169313 170070 171414 172997 174272 175242 176435 178005 179542 180925 182553 184433 185817 186241 186343
56676 186343 187095 188613 190195 191287 192016 192889 194153 195403 195820 194973 193346 191840 190922 190489 190287 189967
56660 189967 189021 187353 185778 185311 185975 186899 187460 187691 187645 187171 186316 185342 184295 183213 182611 182952 183740 184003
56642 184003 183641 183355 183250 182607 181237 179933 179172 178386 177022 175424 174098 172841 171204 169195 167150 165475
56626 165475 164826 165750 167795 169687 170742 171404 172116 172638 172880 173410 174490 175539 176223 177189 178894 180563
56610 180563 181169 180775 179990 178760 176662 173922 171185 168683 166449 164882 164202 163736 162759 161767 161958 163577
56594 163577 165637 167170 167943 168041 167649 167368 167943 169378 170786 171324 171013 170601 170834 171818 172888 173233 172843
56577 172843 172552 172995 173982 175197 176901 179383 182132 184274 185629 186811 188462 190848 194032 197955 202526
56562 202526 207911 214466 222121 230293 238738 247863 257542 266185 271854 274095 274042 273002 271633 270235 268927
56547 268927 267498 265726 263900 262548 261730 261079 260448 260010 259748 259297 258242 256315 253529 250449 248018 246651
56531 246651 245796 244793 243774 243178 242813 242133 241183 240508 240269 240061 239516 238495 236849 234602 232188 229910
56515 229910 227338 223930 220068 216761 214381 212421 210434 208465 206473 204104 201288 198511 196233 194404
56501 194404 192688 190848 188840 186838 185154 183829 182409 180480 178372 176921 176577 177042 177718 178183 178382
56486 178382 178662 179492 180876 182240 183145 183790 184500 185159 185599 186131 187125 188392 189542 190646 191994 193470
56470 193470 194788 196015 197277 198277 198758 199078 199586 199785 198989 197589 196754 196961 197675 198445 199421 200762 202328
56453 202328 204092 206209 208541 210750 212880 215230 217678 219788 221558 223395 225272 226591 226995 226678 225808
56438 225808 224257 222091 219812 217909 216475 215271 213907 212056 209862 207933 206609 205486 204074 202481
56424 202481 200963 199320 197483 196180 196101 196720 196942 196709 196987 198333 200472 203140 206321 209604 212366 214676
56408 214676 217125 219727 221885 223449 224846 226066 226575 226413 226455 227319 228772 230352 231790 232766 233203 233862
56392 233862 235714 238548 241165 243029 244691 246433 247722 248385 249184 250645 252265 253345 253766 253497 252302
56377 252302 250523 249252 249047 249116 248388 246770 244888 243254 242229 242165 242947 243888 244494 244870 245092 244907 244425
56360 244425 244422 245371 246704 247537 247679 247583 247782 248717 250583 252950 255024 256523 257817 259066 259897 260214 260560
56343 260560 261265 261926 262198 262442 263102 264014 264847 265828 267542 270272 273856 277901 281962 285847 289797 294005
56327 294005 298105 301714 305310 309720 314746 319129 322051 323811 324939 325557 325810 326033 326209 326146 326300 327448
56311 327448 329315 330615 330756 330501 330624 331150 332405 335509 340988 347828 354723 361473 368475 375645 382564
56296 382564 388989 394497 398346 400289 400997 401194 401098 401084 401953 403939 406311 408597 411368 415167 419502 423636
56280 423636 427605 431773 436101 440585 445680 451604 457938 464564 472237 481548 491973 502648 513386
56267 513386 524329 535368 546661 559015 573022 588428 604979 623216 643900 667404 694227
56256 694227 725195 760466 799211 841148 887666 940636 1000785 1067892 1141766 1222216 1308741
56245 1308741 1400943 1498574 1600555 1704815 1809670 1914295 2017039 2114419 2202884 2280710
56235 2280710 2347228 2401159 2440939 2465952 2476269 2471779 2452735 2420625 2377477 2324700 2263415
56224 2263415 2195292 2122184 2045459 1966395 1886477 1806576 1726725 1647547 1570925 1498232 1428820
56213 1428820 1361434 1296292 1234591 1176780 1122592 1072051 1025103 980844 938493 898662 862462
56202 862462 829766 799509 771280 745433 722036 700829 681926 665548 651340 638800 627981
56191 627981 618965 611139 603808 597004 590933 585275 579850 575306 572289 570527 569405 568673 567948 566583 564837
56176 564837 564038 564635 565299 565001 564686 565568 567052 567902 568390 569708 572103 575073 578578 582690 586942 591421
56160 591421 597430 605634 614749 623636 633417 645564 659134 672206 685242 700697 719769 741726
56148 741726 766113 793589 824811 860423 902054 951739 1010535 1079027 1158341 1248769 1347882
56137 1347882 1451913 1558603 1666948 1774742 1878482 1975603 2065144 2146663 2220339 2287772
56127 2287772 2350787 2409497 2462917 2510767 2552879 2587430 2611841 2625121 2627658 2619214 2598924 2566642
56115 2566642 2522273 2464367 2391445 2304376 2205783 2097968 1983610 1867618 1755570 1650429
56105 1650429 1552827 1463957 1385625 1317708 1258130 1205504 1159780 1120522 1086665 1057788 1033682
56094 1033682 1013114 995011 980213 969876 962908 957367 953461 952452 953370 953888 953967 955543 958927 962589
56080 962589 966331 971489 977941 983974 989308 995367 1002467 1009541 1016744 1025442 1035572 1045820 1056328
56067 1056328 1068348 1081370 1093692 1105645 1119029 1133440 1146640 1158649 1171984 1187579 1203842
56056 1203842 1219948 1236525 1252799 1266766 1278775 1291500 1305802 1320006 1333570 1347846 1362790
56045 1362790 1376766 1390279 1406141 1425176 1445388 1466015 1488685 1513855 1539923 1566682 1595945
56034 1595945 1628009 1661124 1694983 1730919 1768246 1804563 1840175 1877914 1918037 1957771 1996500
56023 1996500 2036700 2079079 2121645 2164417 2210018 2258609 2307394 2356239 2408427 2464645 2521649
56012 2521649 2578297 2637360 2699931 2763754 2828727 2898181 2972911 3049773 3128023 3210929 3299261
56001 3299261 3389607 3481341 3578783 3684118 3794748 3910026 4033674 4167021 4306910 4453101
55991 4453101 4610449 4780932 4961027 5149920 5352491 5571168 5803157 6049034 6315328
55982 6315328 6605077 6914991 7245748 7605345 7998182 8421234 8875715 9371780 9916839
55973 9916839 10510861 11158791 11875492 12672756 13554827 14533593 15634370 16880208 18286872
55964 18286872 19882477 21716694 23843906 26319109 29224640 32685880 36858405 41936727
55956 41936727 48204629 56066299 66029593 78694622 94729256 114686835 138657055
55949 138657055 166053088 195810073 226787314 257862318 287574468 313776221 333803961
55942 333803961 345172698 346382766 337442724 319909483 296409952 269826759 242559269
55935 242559269 216213002 191698530 169450005 149573293 131954216 116378090 102614638
55928 102614638 90438068 79637021 70049331 61575827 54142963 47662823 42034646 37161784
55920 37161784 32950132 29304592 26142866 23404332 21036295 18981979 17190234 15625467
55912 15625467 14258433 13056764 11992890 11051666 10221078 9482966 8820263 8225208 7692554
55903 7692554 7211517 6771457 6368920 6002278 5665444 5352918 5064987 4801863 4558280
55894 4558280 4329396 4116373 3920712 3738606 3566367 3406019 3259922 3124876 2996977
55885 2996977 2877665 2769524 2670431 2577047 2490061 2410864 2336714 2264021 2193015 2124734 2056911
55874 2056911 1987267 1917718 1851183 1787319 1725087 1666116 1611673 1559683 1508552 1460627 1418082
55863 1418082 1378780 1340147 1303792 1272161 1243717 1215609 1188249 1163045 1138312 1111758 1084753
55852 1084753 1060058 1037360 1014793 992775 972488 952495 930709 908115 887049 867374 847653
55841 847653 828397 810801 793800 775657 757074 739770 723484 707325 692373 679810 667992
55830 667992 654609 640465 628057 617614 607534 597631 588934 581100 572795 563939 555251 546455 537112
55817 537112 528095 520052 511705 501973 492394 485026 479236 473106 466772 461755 458090 454839 452629 452998
55803 452998 455773 459434 463534 468648 474511 480315 486226 492647 498573 502488 504277 504646 503537 500761
55789 500761 497317 494333 491527 488235 484866 481792 478109 473219 468327 464503 460612 455271 449754 446953
55775 446953 448545 455062 467348 485560 507713 531460 556438 582687 607616 626728 636770 636425
55763 636425 625208 604206 577228 548775 520959 493951 468508 445917 426133 408122 391651
55752 391651 376928 363187 349578 336803 326032 316869 308224 300358 294129 289121 284644 281698 281628
55739 281628 283522 285266 286540 288388 290355 290664 289039 286931 284897 281975 277677 272583 266903 260440
55725 260440 253881 248255 243181 237540 231671 226960 223469 220148 217340 216827 219202 223251 228262 234900
55711 234900 243379 252661 261946 271243 279894 286136 288808 288323 285571 281009 275013 268019 260172 251784
55697 251784 243861 237012 230262 222341 213797 206274 200094 194327 188965 185073 182773 180986 179344 178598
55683 178598 178955 179760 181043 183613 187281 190735 193528 196547 200051 202960 204666 205963 207485 208590 208583
55668 208583 207868 207192 206683 206155 205553 204784 203896 203513 204182 205375 206186 206871 208389 210554 212109 212737 213405
55651 213405 214517 215303 215481 215988 217440 219116 220118 220448 220372 219734 218433 216744 214772 212382 209765 207097
55635 207097 203585 198017 190505 182647 175746 169871 164741 160297 156181 151910 147925 145365 144500 144482 144812
55620 144812 145819 147323 148131 147465 145942 144620 143898 143631 143458 142705 140915 138680 137141 136559 136255 135867
55604 135867 135475 134566 132335 129256 126930 125984 125407 124394 123489 123326 123497 123488 123665 124558 125939 127226 128149
55587 128149 128636 128765 129130 130413 132347 133984 135170 136821 139551 143119 147506 153441 161406 171103 182310
55572 182310 195280 209961 225726 242260 259755 277916 295542 311275 323927 332181 335285 334224
55560 334224 330964 326257 319358 309927 298734 286229 272143 257119 243137 231503 221651 212635 204402
55547 204402 196873 189230 181196 173814 167936 163017 158346 154401 151903 150511 149508 148984 149318 150180 150923
55532 150923 151311 151178 150224 148856 148230 148584 148458 146524 143315 140210 137571 135005 132667 131091 130143 129187
55516 129187 127935 126340 124092 121007 117462 113830 110013 106130 102974 101034 99679 98101 96441 95249
55502 95249 94522 94075 94200 95031 95832 95829 95335 95182 95517 95933 96325 96770 96959 96587 96008 95773 95779 95492 94746 93819
55482 93819 93074 92957 93830 95387 96806 97880 99361 101740 104556 107411 110670 114358 117383 118831 119228
55467 119228 119428 119080 117432 115024 113198 112209 111088 109237 107069 105128 103576 102524 102039 101779 101275 100461
55451 100461 99418 97906 95876 94077 93344 93469 93501 92961 92082 91076 89902 88617 87383 86277 85530 85590
55435 85590 86428 87264 87611 88079 89394 91094 92092 92178 92056 92154 92329 92641 93500 95018 96822 98495 99762 100444
55417 100444 100777 101479 102980 104854 106511 108030 109706 111320 112515 113448 114261 114388 113262 111307 109387
55402 109387 107618 105640 103611 101939 100323 98152 95659 93673 92398 91483 91108 91867 93532 95028 95801
55387 95801 96236 96680 97029 97442 98392 99736 100602 100560 100103 99635 98776 97108 94973 93122 92023 91732 91917 91781
55369 91781 90519 88177 85682 83792 82456 81315 80326 79644 79330 79471 80275 81799 83773 85742 87132 87295
55353 87295 85994 83999 82766 83243 85099 87184 88524 88936 88956 89229 89837 90233 89938 89109 88267 87740 87601
55336 87601 87885 88470 88992 89221 89319 89458 89470 89246 89110 89362 89761 89915 89898 89974 89994 89594 88800 87945 87200 86640 86465
55315 86465 86710 87028 87213 87512 87938 87802 86666 85344 85110 86202 87842 89422 90812 91776 92051 91944 91977
55298 91977 92017 91540 90696 90251 90519 91157 91959 92990 93953 94359 94411 94826 95663 96204 96152 96101 96509 97015 97121 96829
55278 96829 96311 95564 94729 94128 93671 92767 91187 89542 88614 88526 88764 88677 87903 86695 85830 85766 85949 85502 84521
55259 84521 83990 84456 85486 86519 87480 88326 88742 88601 88203 87796 87400 87229 87621 88334 88560 87969 87194 86966
55241 86966 87254 87566 87634 87478 87198 87023 87274 88063 89224 90495 91472 91555 90552 89286 88918 89592 90377 90596
55223 90596 90515 90604 90881 91250 91747 92140 91977 91354 91020 91382 92054 92694 93588 94917 96100 96470 96128 95607 95089
55204 95089 94479 93943 93849 94363 95385 96610 97419 97131 95789 94411 94125 95192 97014 98742 99699 99678 99126
55187 99126 98707 98475 97862 96684 95595 95249 95535 96078 96984 98523 100337 101528 101476 100298 98645 97300 96676
55170 96676 96478 96062 95269 94594 94367 94249 93811 93193 92773 92550 92258 91876 91606 91493 91358 91014 90448 90013 90423
55151 90423 92170 94754 96997 98315 99187 100087 100580 99999 98527 96975 95834 95118 94883 95240 95968 96637 97109
55134 97109 97415 97233 96045 93902 91608 89967 89130 88785 88657 88655 88737 88901 89244 89872 90715 91546 92220 92792 93275
55115 93275 93400 92952 92365 92538 93787 95386 96559 97499 98819 100300 101035 100749 100094 99548 98913 98244 98376
55098 98376 99914 102263 104301 105546 106164 106287 106073 106118 107018 108453 109279 108700 107048 105370 104516 104611 105158
55081 105158 105583 105748 105914 106224 106424 106193 105469 104344 102941 101565 100748 100787 101346 101780 101788 101611 101696 102295 103317
55062 103317 104491 105730 107235 108994 110292 110145 108371 105936 104058 103228 103166 103423 103815 104506 105783 107547
55046 107547 109078 109614 109194 108537 108037 107384 106245 104804 103419 102329 101922 102692 104515 106480 107911 109104
55030 109104 110510 111672 111723 110695 109583 109069 108854 108339 107418 106295 104997 103499 102170 101648 102142 103140
55014 103140 103981 104580 105322 106289 107034 107272 107433 108124 109327 110513 111344 111797 111795 111293 110651 110392 110514 110581 110499
54995 110499 110658 111244 112004 112806 113847 115148 116330 117134 117694 118145 118379 118343 118133 117663 116733 115549 114692 114465
54977 114465 114712 115288 116091 116629 116337 115486 115005 115150 115158 114512 113691 113222 112848 112220 111666 111622 111946 112400 113208 114481
54957 114481 115674 116311 116708 117347 118040 118409 118660 119105 119379 119019 118486 118708 119733 120566 120319 119002 117274
54940 117274 115911 115329 115205 114797 113931 113287 113352 113703 113931 114617 116553 119429 122198 124431 126439 128304 129830
54923 129830 131364 133717 137149 141170 145453 150265 155834 161899 168016 173840 179030 183311 186666 189074
54909 189074 190151 189485 187205 183794 179484 174292 168523 162734 157299 152440 148479 145540 143205 140990
54895 140990 138950 137325 135881 134232 132606 131559 131097 130734 130311 130125 130370 131038 132159 133518 134450 134729
54879 134729 135381 137676 141493 145683 149896 154852 160751 166718 172118 177252 182180 185976 187910 188506 188581
54864 188581 187918 185755 182165 178066 174112 170322 166674 163380 160557 158099 155946 154144 152558 150803
54850 150803 148563 145859 142973 140179 137550 135044 132770 131015 129822 128754 127351 125769 124580 123926
54836 123926 123214 121773 119593 117320 115668 114882 114655 114559 114566 114944 115617 116047 116006 116041 116711 117720 118351 118458 118412
54817 118412 118326 118046 117811 118186 119254 120482 121475 122301 123005 123383 123387 123281 123295 123503 124032 124944 126002 126989 128167
54798 128167 129826 131539 132514 132639 132460 132187 131527 130553 129835 129509 129051 128218 127461 127039 126544 125709 124985 124850
54780 124850 125185 125766 126801 128438 130286 131950 133578 135469 137601 140015 143139 147204 151756 156287 161045
54765 161045 166725 173649 181661 190472 199630 208486 216596 223868 230006 234228 235970 235441 232973 228350
54751 228350 221460 213270 205309 198278 191813 185531 179622 174336 169563 165102 160954 157178 153843 151150
54737 151150 149227 147690 145832 143488 141415 140516 140897 141880 142828 143620 144320 144734 144707 144781 146073 149162 153308
54720 153308 157254 160695 164459 169243 174761 180293 185386 189587 192068 192262 190692 188440 185827 182195
54706 182195 177120 171261 165696 160834 156388 152181 148506 145662 143560 141964 140778 139840 138649 136784
54692 136784 134565 132895 132279 132342 132403 132121 131367 129943 127980 126307 125766 126225 126680 126336 125151 123505 121865
54675 121865 120814 120783 121538 122268 122353 121787 120903 120114 119910 120610 121871 122829 122927 122309 121314 120054 118605 117293
54657 117293 116456 116114 116039 116003 115929 115985 116545 117832 119622 121450 122962 123834 123690 122618 121554 121515 122472 123510
54639 123510 124020 124122 124035 123828 123829 124478 125546 126194 126051 125526 124921 124004 122787 121861 121523 121290 120760 120324 120476
54620 120476 121042 121638 122304 123071 123463 123096 122389 122012 121954 121745 121261 120741 120341 120229 120841 122371 124227 125570
54602 125570 126271 126765 127145 127055 126419 125722 125439 125584 125926 126348 126907 127685 128583 129174 128921 127647 125757 123978
54584 123978 123028 123380 124861 126533 127428 127524 127477 127444 126960 126109 125842 126640 127691 128062 127997 128324 129176 130135 131163
54565 131163 132489 133872 134797 135198 135299 134995 134103 132983 132155 131555 130915 130696 131685 133690 135488 136249 136272
54548 136272 136221 136330 136628 137274 138282 139289 139992 140557 141354 142413 143273 143378 142669 141859 141902 143025 144454 145278
54530 145278 145326 145041 144883 145147 145949 146911 147181 146317 144892 143772 143040 142189 141151 140482 140561 141141 141719 142010
54512 142010 142034 141945 141717 140930 139223 137068 135527 134942 134511 133667 133096 133666 135002 136062 136648 137297 138060 138469
54494 138469 138565 138882 139415 139610 139391 139250 139241 138856 138033 137436 137499 137996 138680 139595 140526 140933 140678 140192 139828 139694
54474 139694 140149 141578 143550 145042 145716 146155 146715 147099 147336 148089 149466 150472 150359 149763 149820 150758 152073
54457 152073 153518 155230 157195 159210 161048 162253 162204 160841 158987 157463 156234 154824 153183 151674 150544
54442 150544 149820 149438 149102 148349 147091 145770 144684 143636 142558 141946 142225 143153 144328 145824 147721 149437
54426 149437 150228 150128 149863 149946 150282 150473 150190 149495 149077 149756 151412 152910 153547 153975 155079 156556 157445 157568
54408 157568 157421 156966 155689 153835 152410 151767 151244 150580 150638 152098 154199 155604 156008 156169 156619 157151 157505
54391 157505 157821 158232 158517 158513 158617 159488 161259 163235 164485 164653 164120 163443 162824 162147 161355 160561 159875 159334
54373 159334 159057 159296 160180 161439 162530 163131 163535 164421 166182 168544 170980 173333 175755 178159 180149 181599
54357 181599 182862 184123 184893 184571 183374 182241 181860 182110 182490 182666 182429 181447 179401 176396 173015 169926
54341 169926 167449 165509 163971 162915 162476 162461 162331 161741 160968 160615 160889 161343 161396 160935 160323 159942 159868 159905 159748
54322 159748 159083 157714 155769 153753 152227 151397 151101 151112 151337 151692 152000 152115 152039 151835 151523 151163 150881 150738
54304 150738 150710 150957 151825 153349 154908 155723 155649 155214 154903 154741 154604 154551 154643 154595 153901 152348 150360 148822 148496
54285 148496 149500 151300 153168 154659 155764 156800 158137 159798 161268 161977 161993 161901 161883 161436 160270 159005
54269 159005 158475 158696 159038 159157 159161 159112 159042 159399 160769 163005 165199 166595 167157 167250 167251 167512 168174 168913 169308 169538
54249 169538 170232 171606 173217 174512 175080 174402 172149 168938 166057 164192 163017 162205 162032 162514 162816 162226
54233 162226 161223 160848 161333 162014 162399 162667 163157 163826 164290 164183 163527 162841 162632 162706 162390 161605 161196 161775 162801
54214 162801 163269 162946 162333 161721 160933 159883 158802 157909 157315 157155 157407 157667 157529 157197 157307 158138 159285 160110
54196 160110 160266 159868 159408 159483 160284 161387 162148 162165 161318 159672 157681 156125 155468 155514 156024 157248 159293 161340
54178 161340 162302 162188 162063 162604 163442 164138 164988 166352 167710 168095 167332 166321 166040 166557 167131 167085 166474 165952
54160 165952 166031 166474 166461 165394 163529 161797 161015 161284 162093 162834 163112 162652 161285 159274 157450 156627 156837
54143 156837 157440 157988 158622 159484 160154 160003 158979 157788 157327 157968 159284 160424 160931 161187 161872 163066 164230
54126 164230 164962 165247 164923 163628 161610 159934 159381 159609 159961 160602 162112 164263 166127 167386 168669 170344
54110 170344 171682 171763 170852 170281 171029 172812 174667 176042 177019 177637 177524 176521 175302 174958 176100 178708
54094 178708 182595 187387 192207 196198 199499 202894 206226 208052 207381 204987 202341 199962 197593 195356
54080 195356 193628 192123 190195 187994 186420 185909 186054 186471 187125 187731 187715 187152 187013 188061 189970 191885
54064 191885 193386 194560 195584 196687 198268 200617 203508 206259 208123 208643 207868 206340 204779 203701 203312
54049 203312 203526 203943 204060 203852 203887 204538 205398 205977 206653 208230 210776 213679 216810 220673 225292 229920 234206
54032 234206 238812 244297 250089 255213 259512 263483 267328 270896 274320 277943 281640 284832 287211 288946
54018 288946 290136 290535 290000 288815 287337 285620 283571 281301 279035 276748 274075 270670 266622 262441 258602
54003 258602 255115 251618 247858 244033 240604 237895 235921 234500 233366 232176 230591 228522 226313 224557
53989 224557 223562 223014 222301 221188 219997 219069 218258 217211 215965 214956 214416 214033 213395 212585 212066 212009 211980 211515
53971 211515 210868 210807 211592 212480 212537 211702 210697 210133 210200 211065 212891 215381 217937 220488 223568 227403 231568
53954 231568 235964 241411 248711 257559 266943 276108 284500 291237 295502 297356 297584 296953 296126 295882 296534
53939 296534 297369 297522 297308 297817 299234 300533 300943 300822 300780 300832 300857 301158 301980 302943 303494 303624 303710 303975 304497
53920 304497 305506 307344 310180 313932 318365 323256 328690 335110 342692 350670 357788 363566 368708 374083
53906 374083 379656 384613 388193 390217 391098 391500 391766 391633 390736 389298 387887 386554 384716 381898 378042
53891 378042 373052 366731 359416 352095 345535 339702 334280 329218 324441 319505 313980 307899 301530 295013
53877 295013 288470 282205 276595 271997 268778 266975 265824 264180 261588 258455 255088 251293 247194 243601
53863 243601 240990 238755 236117 233192 230475 227796 224699 221603 219628 219181 219421 219296 218589 217707 216879 215936
53847 215936 214782 213819 213684 214378 214878 214061 212093 210410 210089 210701 211087 210768 210100 209452 208913 208674 209061 210081
53829 210081 211254 212054 212354 212478 212919 213937 215313 216613 217639 218388 218635 218086 217066 216515 217003 218134
53813 218134 219188 219895 220348 220741 221568 223489 226457 229486 231883 234216 237438 241475 245495 249266 253365
53798 253365 258127 263148 267852 271984 275495 278524 281468 284622 287725 290371 292741 295397 298418 301264
53784 301264 303478 305040 306057 306626 306947 307099 306727 305449 303435 301048 298124 294318 290106 286567 284074
53769 284074 281983 279776 277674 275790 273508 270289 266476 262726 259106 255341 251551 248139 245151 242328
53755 242328 239631 237283 235425 234102 233391 233063 232292 230298 227369 224715 223146 222283 221250 219774 218293
53740 218293 217253 216716 216605 216905 217454 217818 217585 216742 215621 214609 214006 214011 214599 215483 216406 217434 218703 220008
53722 220008 220988 221716 222661 224002 225462 227022 229268 232551 236196 239056 240754 241935 243398 245406 247875
53707 247875 250765 254066 257530 260623 262809 263977 264575 265120 265608 265720 265654 266305 268345 271533 275271 279435
53691 279435 284209 289373 294295 298419 301381 302914 303175 302952 302939 302877 301957 299996 297684 295771 294547 294056
53675 294056 294191 294472 294291 293499 292395 291162 289827 288723 288342 288561 288581 287804 286334 284593 282970 281910
53659 281910 281645 281631 280983 279725 278960 279366 280225 280499 280240 280230 280642 280919 280802 280734 281214 282335 284063 286356
53641 286356 288819 290657 291391 291508 292131 293980 296658 298990 300151 300421 300791 301907 303661 305801 308507
53626 308507 312063 316248 320394 324016 327131 330057 333153 336691 340728 345038 349293 353268 356835 359926
53612 359926 362720 365702 369270 373209 376735 379173 380564 381625 383183 385580 388510 391385 393862 395950
53598 395950 397655 398756 399123 399095 399288 399983 400865 401448 401609 401598 401632 401672 401611 401497 401406 401165 400393 398861 396674
53579 396674 394062 391158 388121 385281 382968 381237 379898 378790 377870 377040 376030 374582 372779 371167 370287
53564 370287 369960 369264 367637 365835 365197 365906 366690 366566 366119 366445 367509 368460 369125 370106 371490 372565 373067
53547 373067 373785 375515 378180 381322 384696 387892 390174 391497 393152 396559 401654 407210 412547 418133
53533 418133 424497 431406 438436 445787 454025 463242 472896 482448 491962 501999 513005 524883 537193
53520 537193 549697 562642 576508 591616 607953 625226 643019 661128 679819 699652 720985
53509 720985 743810 768004 793382 819412 845334 870888 896545 922652 948662 973696 997629
53498 997629 1020987 1043880 1065751 1086349 1106222 1125899 1145201 1163899 1182601 1202229 1222751
53487 1222751 1243191 1262884 1282055 1301007 1319458 1337173 1354607 1372288 1389878 1406534 1421956
53476 1421956 1436366 1449520 1460555 1469029 1475376 1480038 1482711 1482902 1480716 1476588 1470606 1462599 1452727
53463 1452727 1441521 1429480 1416901 1403845 1390027 1375066 1359105 1342767 1326102 1308139 1288083
53452 1288083 1266511 1244633 1222777 1200486 1177866 1155753 1134498 1113669 1093269 1074399 1058239
53441 1058239 1044886 1033540 1023349 1013828 1004937 997072 990641 985554 981516 978705 977479 977446 977683 978154
53427 978154 979983 983937 989477 995865 1003363 1012644 1023684 1036085 1050013 1065903 1083604 1102635 1123092
53414 1123092 1145517 1169953 1195819 1222681 1250613 1279842 1310547 1342946 1377126 1412875 1450047
53403 1450047 1488919 1529770 1572412 1616683 1663112 1712354 1764130 1817426 1871631 1926702 1982309
53392 1982309 2037725 2092798 2148184 2204215 2260232 2315420 2369656 2422990 2474823 2524277 2571100
53381 2571100 2615564 2657619 2696700 2732390 2764772 2793985 2819776 2841644 2859210 2872195 2880184
53370 2880184 2882605 2878994 2869153 2852973 2830211 2800676 2764771 2723705 2678945 2631453 2581595 2529721
53358 2529721 2476593 2423131 2369971 2317432 2265791 2215315 2166016 2117573 2069707 2022631 1976924
53347 1976924 1932776 1889411 1845560 1800645 1755437 1711501 1670098 1631690 1596176 1563210 1532259
53336 1532259 1502695 1474191 1447083 1422225 1400361 1381491 1364787 1349119 1333739 1318582 1304020
53325 1304020 1290322 1277223 1263962 1249882 1235134 1220671 1207420 1195572 1184797 1174889 1165876 1157686
53313 1157686 1150155 1143406 1137792 1133501 1130573 1129318 1130191 1133143 1137589 1143262 1150627 1160147 1171584 1184362
53299 1184362 1198289 1213571 1230423 1249035 1269618 1292064 1315727 1339912 1364400 1389283 1414578
53288 1414578 1440278 1466413 1492594 1517792 1541080 1562353 1581872 1599395 1614374 1626772 1636915
53277 1636915 1644538 1648784 1649361 1647094 1643016 1637388 1629897 1620370 1608840 1595121 1578730 1559271 1536802
53264 1536802 1511876 1485316 1457805 1429615 1400778 1371426 1341785 1311932 1281822 1251605 1221669
53253 1221669 1192330 1163671 1135698 1108394 1081547 1054842 1028260 1002163 976787 951879 927057
53242 927057 902461 878782 856586 835728 815573 795755 776529 758323 741141 724727 709233
53231 709233 695373 683735 674205 666165 658863 651367 642585 631988 620267 608816 598406 588561 578226
53218 578226 566763 554324 541497 528725 515993 503090 490137 477689 466148 455371 445077
53207 445077 435387 426663 418974 412103 405879 400086 394194 387657 380531 373370 366499 359763 353009 346393
53193 346393 340052 333872 327802 322175 317460 313810 310894 308102 304907 301234 297452 293867 290275 286192
53179 286192 281495 276647 272334 269085 267118 266232 265885 265617 265381 265194 264652 263202 260897 258418 256297 254502
53163 254502 252928 251887 251789 252545 253539 254133 254100 253630 252969 252111 250902 249452 248150 247127 245981 244429 242918
53146 242918 242115 241906 241530 240725 240121 240279 240903 241341 241509 241857 242633 243550 244228 244703 245406 246723 248600 250574
53128 250574 252205 253367 254154 254663 254971 255091 254871 254237 253763 254546 256988 260005 261990 262507 262474 262814 263536
53111 263536 264202 264631 264848 264779 264310 263427 262151 260575 258964 257547 256242 254868 253580 252679 252059 251292 250256
53094 250256 249259 248549 248189 248288 248775 248965 248046 246106 244025 242281 240618 239104 238562 239434 240939 241993 242469
53077 242469 242978 243837 244816 245542 245634 244804 243364 242289 242253 242845 243206 243074 242636 241759 240155 238212 236882 236601
53059 236601 236826 236847 236587 236417 236485 236496 236068 235207 234456 234539 235713 237444 238755 238942 238102 237141 237083 238071 239130
53040 239130 239331 239047 239482 240964 242465 243041 242928 242762 242459 241625 240578 240110 240392 240792 240677 239874 238517
53023 238517 237011 236076 236324 237714 239698 241694 243166 243616 243102 242515 242772 243813 244873 245578 246225 247084
53007 247084 248035 248823 249251 249168 248773 248713 249331 249979 249775 248887 248237 247994 247290 245684 243988 243188 243263 243635 244180
52988 244180 245149 246463 247759 248976 250368 251953 253374 254309 254781 255078 255570 256572 258221 260477 263248
52973 263248 266374 269432 271794 273063 273351 273082 272681 272498 272778 273515 274450 275336 276099 276753 277360 278115 279223
52956 279223 280542 281521 281644 280751 278959 276582 274196 272387 271123 269728 267806 265962 265161 265498 266083 266139
52940 266139 265735 265284 264762 263852 262586 261385 260400 259240 257561 255675 254250 253466 252791 251668 250188 248956
52924 248956 248464 248740 249469 250282 250969 251577 252284 253087 253689 253830 253689 253742 254209 254738 254719 253881 252589 251499 250952
52905 250952 250727 250538 250573 251252 252448 253399 253558 253200 252896 252695 252268 251602 251105 251025 251201 251424 251716 252124 252477
52886 252477 252484 251964 250975 249807 248802 248058 247416 246829 246496 246479 246504 246519 247090 248711 250890 252568 253413 254072 255054
52867 255054 256093 256881 257783 259270 261095 262569 263478 264236 265222 266347 267274 267743 267664 267078 266040 264445 262108
52850 262108 259180 256314 254159 252700 251307 249436 247125 244876 243218 242326 241866 241143 239607 237308 234825
52835 234825 232730 231174 229985 229070 228619 228930 230068 231732 233417 234664 235216 235128 234848 235016 235918 237132
52819 237132 237957 238190 238293 238699 239259 239528 239395 239146 239004 238887 238654 238372 238253 238464 239032 239850 240647 241051 240837
52800 240837 240130 239301 238637 238183 237864 237593 237188 236361 235065 233761 233096 233221 233649 233836 233708 233488 233324 233263
52782 233263 233392 233699 233912 233723 233153 232473 231876 231458 231440 232060 233220 234508 235614 236449 236849 236510 235467 234397
52764 234397 234139 234883 235960 236471 236036 234968 233821 232909 232278 231985 232175 232795 233497 234008 234468 235198 236281
52747 236281 237616 239284 241489 244066 246352 247814 248655 249592 251042 252727 254112 255067 255944 257065 258397
52732 258397 259857 261607 263729 265781 267077 267416 267135 266460 265388 264323 264117 265037 266153 266304 265298 263639
52716 263639 261517 258827 255971 253807 252692 252187 251825 251558 251367 251037 250588 250459 250976 251964 253069 254092
52700 254092 254873 255219 255150 254897 254481 253641 252396 251311 250930 251179 251573 251842 252128 252679 253525 254438 255183 255855
52682 255855 256834 258216 259521 260242 260449 260434 260045 258966 257473 256142 254893 253174 251190 249966 249900 250189
52666 250189 250198 250469 251681 253380 254601 255174 255516 255568 254986 254184 254227 255640 258016 260804 263756 266558 268775
52649 268775 270425 272084 274154 276305 277783 277994 276832 274800 272753 271170 269715 267874 265895 264596
52635 264596 264317 264649 265227 266182 267571 268915 269643 269718 269604 269898 271045 273073 275366 277009 277580 277421 277093
52618 277093 276857 276747 276742 276616 276004 274843 273556 272597 272034 271721 271586 271466 270986 269942 268662 267705 267292 267204
52600 267204 267096 266671 265753 264457 263280 262771 263091 264015 265277 266768 268499 270486 272603 274396 275201 274674
52584 274674 273197 271605 270559 270235 270503 271176 272077 273046 273919 274459 274412 273796 273018 272530 272357 272220 272083 272315
52566 272315 273159 274191 274582 273870 272356 270713 269318 268039 266534 264659 262636 261005 260382 261031 262464
52551 262464 263613 263685 262888 262181 262289 263152 264252 265175 265781 266133 266502 267203 268155 268723 268309 267033 265640 264814
52533 264814 264760 265350 266311 267287 268068 268823 269810 270797 271150 270690 270119 270314 271429 272935 274279 275144 275311 274765
52515 274765 273950 273560 273990 275256 277303 279988 282771 284942 286355 287534 288891 290170 290920 291100 290896 290239
52499 290239 288978 287347 285863 284789 283975 283099 281858 280059 277891 275975 274804 274214 273681 273061 272647 272613
52483 272613 272807 273058 273300 273429 273512 274038 275385 276950 277465 276486 275037 274403 274737 275318 275768 276376 277409 278737
52465 278737 280209 281958 284148 286741 289600 292639 295708 298511 300712 302078 302474 301782 299938 297090 293698
52450 293698 290364 287377 284475 281276 277980 275354 273866 273078 272115 270627 269008 267749 266873 266091 265353
52435 265353 265023 265449 266421 267198 267139 266178 264674 263083 261954 261880 262865 263938 263990 263127 262603 263290 264730 265955
52417 265955 266683 267316 268221 269442 270826 272044 272872 273789 275946 280065 285748 292313 299828 308635 318213
52402 318213 327326 335223 341878 347058 349935 349891 347192 342687 337280 331778 326724 322155 317879 314023 310898
52387 310898 308400 306181 304454 303910 304603 305604 306093 306185 306276 306267 306027 306069 306989 308608 310396 312598 316109 321236
52369 321236 327218 333119 338603 343621 347836 350716 352006 351915 351028 350090 349576 349281 348508 346861 344754 343024
52353 343024 342176 342084 342326 342656 343181 344117 345363 346450 347100 347742 349156 351494 354084 356353 358614 361548
52337 361548 365196 369022 372927 377583 383527 390435 397676 405267 413741 423248 433379 443938 455389
52324 455389 468300 482647 497984 514048 530823 548140 565534 582596 599266 615719 632112
52313 632112 648501 664884 681195 697247 712785 727716 742313 757052 772114 787174 801912
52302 801912 816592 831727 847155 861926 875319 887520 898961 909353 917884 924156 928347 930539
52290 930539 930480 928120 923909 918397 911891 904605 896773 888475 879786 871272 863885 858109 853558 849745 846863
52275 846863 845354 845094 845606 846976 849891 854716 861094 868643 877481 887730 898858 909952 920531 930763
52261 930763 941088 951963 963833 976856 990573 1004217 1017472 1030657 1044055 1057412 1070251
52250 1070251 1082313 1093338 1102675 1109574 1113843 1115826 1115762 1113541 1109144 1102905 1095163 1085957 1075298 1063492
52236 1063492 1050968 1037983 1024741 1011629 999083 987243 975951 965016 954323 943804 933539
52225 933539 923825 914956 906969 899735 893198 887324 881928 876852 872328 868878 866735 865540 864729 864182 864382
52210 864382 865925 868904 872766 876798 880710 884628 888578 892244 895413 898425 901926 906137 910573 914464
52196 914464 917386 919533 921519 923886 926731 929846 933159 936856 940998 945259 949274 953032 956624 959699
52182 959699 961496 961464 959714 956747 952886 948025 941929 934737 927058 919462 912032 904703 897893 892374 888384
52167 888384 885340 882585 880020 877815 876065 875145 875815 878322 881720 884792 887469 890601 894446 898065 900357
52152 900357 901069 900720 900072 899864 900603 902303 904634 907350 910263 912937 914948 916498 918306 920727 923437
52137 923437 926044 928518 930877 933008 935094 937809 941750 947001 953493 961482 971397 983498 997886 1014630
52123 1014630 1033685 1054880 1078084 1103100 1129393 1156273 1183457 1210997 1238556 1265198 1290145
52112 1290145 1313273 1334725 1354448 1372409 1388758 1403415 1415874 1425795 1433509 1439680 1444802 1449285
52100 1449285 1453525 1457533 1460863 1463264 1464994 1466094 1465851 1463454 1458762 1451906 1442641 1430782 1416913 1401858
52086 1401858 1385664 1367937 1349083 1330414 1312955 1296871 1282148 1269134 1258120 1248970 1241433 1235417
52074 1235417 1230797 1227472 1225799 1226504 1229902 1235570 1242974 1252021 1262740 1274856 1287958 1301765 1315894
52061 1315894 1329711 1342768 1355139 1366995 1378148 1388382 1398011 1407592 1417129 1425981 1433547 1439606
52049 1439606 1443972 1446281 1446319 1444222 1440046 1433394 1423818 1411483 1397061 1381014 1363372 1344374 1324914
52036 1324914 1305953 1287660 1269566 1251625 1234671 1219545 1206066 1193238 1180410 1167823 1156011
52025 1156011 1145049 1134667 1124825 1115699 1107124 1098472 1089361 1080203 1071722 1064116 1057104 1050688 1045254
52012 1045254 1040671 1035817 1029515 1021727 1013365 1005071 996621 987430 977120 965506 952478 938081 922468
51999 922468 905699 887924 869773 852196 835764 820472 806268 793327 781600 770511 759412
51988 759412 748093 736747 725738 715544 706340 697388 687319 675545 663022 651138 640174 629374
51976 629374 618188 606761 595290 583634 571829 560533 550690 542868 536926 532240 528301 525263 523788
51963 523788 524234 526258 529456 534002 540136 547284 554316 560556 565938 570193 572591 572747 571145 568563 565457
51948 565457 562140 559137 556857 555192 553906 553355 554490 558161 564604 573543 584472 596853 610324 624893
51934 624893 640827 658279 677013 696414 715626 733654 749501 762370 771726 777155 778249 774787
51922 774787 766857 754592 737876 716707 692027 665812 640009 615536 592442 570693 550356 531434
51910 531434 514177 499420 487900 479187 472029 465905 461564 459761 460209 462172 465378 469753 474736 479509
51896 479509 483663 487141 489793 491387 491726 490326 486423 479844 471570 462906 454424 446284 439107 433736
51882 433736 430333 428463 427892 428583 430056 431652 433481 436442 441220 447813 455894 464879 473655 481111 487050
51867 487050 491907 495492 496884 495762 492994 489576 485773 481654 477683 474206 471003 467984 465803 465136
51853 465136 465683 466514 467215 468199 469997 472610 475431 477530 478147 477082 474528 470578 465275 459135 453026
51838 453026 447332 441727 436040 430751 426304 422521 419169 416569 415083 414434 414162 414357 415277 416534 417333
51823 417333 417351 416772 415634 413840 411716 409819 408106 405991 403401 401217 400337 400726 401714 402924 404561 406916
51807 406916 409830 412725 415066 416782 418136 419163 419462 418756 417446 416320 415820 415938 416614 417731 418685 418554
51791 418554 416965 414482 411920 409586 407398 405338 403387 401290 398937 396908 396041 396313 396662 396273 395630
51776 395630 395809 396941 398083 398629 399249 401103 404555 409081 414086 419370 424994 431160 438162 446018 454233
51761 454233 462262 470035 477582 484279 489059 491344 491185 488488 482933 474964 466093 457690 449860 441992
51747 441992 433922 425995 418359 410968 404284 399331 396770 396203 396562 397130 398200 400769 405546 412241 419979
51732 419979 428288 437234 446520 455057 461811 466757 470621 474027 477315 480788 484530 488039 490527 491549
51718 491549 491051 489009 485470 480836 475703 470490 465590 461600 458823 456617 453839 450033 445709 441539
51704 441539 437822 434777 432700 431565 430961 430630 430606 430663 430233 429203 428269 428046 428235 428179 427874 427831 428247 428901
51686 428901 429663 430298 429860 427190 422413 417247 413333 410734 408572 406628 405505 405485 406172 407407 409727 413566
51670 413566 418667 424706 431892 440399 449764 459579 470344 482622 495481 506784 515239 521214 525204
51657 525204 526433 523759 517394 508988 500329 492632 486808 483476 482489 482955 483936 484953 485751 485889 484614
51642 484614 481039 474641 465924 456455 447835 440543 434006 427658 421552 416044 411457 408177 406655 406957
51628 406957 408476 410311 411852 412970 413755 414151 413797 412291 409718 406789 404204 401982 399669 397097 394503
51613 394503 391915 388902 385192 381182 377555 374609 372239 370321 368772 367328 365667 363863 362519 362337
51599 362337 363631 366288 369996 374448 379466 385112 391652 399201 407342 415189 421847 426735 429423 429490 426851
51584 426851 422207 416861 411970 408090 405393 404039 404182 405804 408759 412993 418654 426115 435843 448040
51570 448040 462271 477587 493128 508547 523918 539498 555658 572757 590860 609673 628997
51559 628997 649149 670885 694885 721224 749092 777105 804127 829721 853411 873574 887734
51548 887734 894224 893150 885500 871955 853052 829961 804340 777480 750045 722466 695161 668499
51536 668499 643036 619667 599152 581579 566655 554303 544502 536713 530084 524262 519456 515612 512034
51523 512034 507974 503218 497970 492441 486730 480841 474696 468284 461773 455318 448867 442426 436359 431120
51509 431120 426743 422885 419282 415836 412396 408913 405758 403478 402149 401248 400129 398369 395845 392895
51495 392895 390283 388579 387651 387161 387290 388376 390022 391401 392448 393893 395925 397670 398391 398501 398772 399110
51479 399110 398733 397332 395450 393791 392545 391350 389688 387343 384617 382034 379765 377536 375111 372594
51465 372594 370252 368305 366901 365943 364919 363308 361181 358970 356645 353751 350398 347512 345724 344654
51451 344654 343830 343735 345210 348096 351264 354034 357021 361443 367985 376440 386161 396668 407860 419721
51437 419721 431858 443323 452890 459497 462706 463125 462300 461729 461817 461987 461731 461093 460113 458447 455759 452070
51421 452070 447485 442087 436327 430996 426400 422001 417251 412362 407880 404000 400798 398730 398187 398729 399319
51406 399319 399281 398648 397746 396931 396611 397046 398036 399067 399786 400213 400680 401724 403746 406528 409423 412302 415963
51389 415963 421229 428008 435720 444285 454120 465482 478544 493984 512895 536058 563737 596017
51377 596017 632762 673276 716549 761816 808301 854421 897868 936582 969165 994264 1010309
51366 1010309 1016288 1012527 1000363 981249 956254 926166 891798 854184 814507 773817 733033 693299
51354 693299 655968 621818 590579 561723 535521 512724 493352 476526 461526 448372 437204
51343 437204 427718 419443 412052 405154 398324 391652 385808 381243 377678 374651 372147 370339 369060 368005
51329 368005 367271 367297 368309 369993 371692 372865 373501 374077 374867 375390 374994 373910 373157 373167 373168 372250 370472 368402
51311 368402 366168 363690 361491 360356 360165 359838 358662 357138 356180 355914 355624 354695 353285 352103 351716 352046
51295 352046 352364 351763 349829 347037 344543 343435 343958 345436 346958 348113 348990 349767 350621 351964 354291 357672
51279 357672 361741 366281 371351 376655 381315 384692 387092 389178 390974 391974 392112 392052 392515 393798 395965
51264 395965 399006 402613 406274 409724 413048 416146 418432 419225 418205 415401 411160 406323 401959 398457
51250 398457 395116 391029 386250 381644 377759 374363 371115 368118 365553 363187 360640 358003 355832 354575
51236 354575 354158 354127 354030 353716 353358 353227 353376 353689 354276 355575 357845 360643 363057 364452 364873 364855 365078 366016
51218 366016 367494 368629 368616 367709 367044 367337 368153 368715 368999 369589 370688 371831 372580 373059 373720 374883 376635
51201 376635 378915 381537 384280 387064 389928 392777 395261 396982 397790 397862 397568 397249 397065 396976 396860 396604 396135
51184 396135 395483 394810 394235 393581 392540 391151 389847 388849 387837 386512 385226 384633 384859 385470 386141 386911 387782
51167 387782 388584 389383 390612 392573 395050 397582 399859 401772 403303 404519 405433 405778 405169 403622 401680
51152 401680 399891 398406 397111 395891 394619 393174 391635 390191 388702 386695 384070 381535 379974 379520
51138 379520 379500 379219 378564 377969 377981 378835 380292 381916 383504 385110 386677 388038 389363 391174 393632 396174
51122 396174 398238 400091 402473 405558 408684 411025 412195 412264 411592 410711 410056 409766 409827 410289 411094 411911 412475
51105 412475 413014 413961 415417 417251 419594 422623 425859 428279 429341 429468 429333 429118 428700 428104 427383 426432
51089 426432 425323 424567 424624 425317 426158 427067 428283 429585 430199 429678 428524 427671 427539 427902 428492 429406 430842
51072 430842 432676 434483 435981 437348 439124 441812 445545 450071 455116 460939 468509 478887 492246 507593
51058 507593 523665 539988 556832 574214 591286 606775 619887 630795 640544 650543 661740 673950
51046 673950 686003 696641 705121 711019 713896 713562 710512 705704 699910 693459 686502 679247 671946 664919
51032 664919 658494 652582 646319 638482 628466 616671 603942 590973 578418 567134 557840 550589 544922
51019 544922 540567 537706 536598 537230 539518 543564 549454 556822 564914 573157 581554 590411 599835 609637
51005 609637 619609 629595 639234 647904 655183 661215 666405 670850 674269 676415 677280 676944 675563 673564 671463
50990 671463 669285 666514 662911 659115 656162 654690 655024 657777 663663 672608 683618 695823 709247 724216
50976 724216 740400 756947 773387 789937 807021 825006 844577 866776 892327 921172 953084
50965 953084 988513 1028394 1073086 1121934 1174049 1229151 1287316 1348131 1410408 1472757 1534126
50954 1534126 1593679 1650419 1703186 1750999 1793319 1829989 1861022 1886492 1906594 1921742 1932522
50943 1932522 1939550 1943434 1944825 1944356 1942454 1939340 1935184 1929957 1922973 1913065 1899726 1883914 1867136
50930 1867136 1849788 1830944 1809756 1786288 1760821 1733159 1703132 1671058 1636978 1600030 1559509
50919 1559509 1516256 1472072 1427961 1383899 1340297 1298499 1259443 1222749 1187762 1154805 1124775
50908 1124775 1097957 1073886 1052106 1032420 1014571 998125 982684 967944 953665 939859 926843
50897 926843 914905 904082 894403 886079 879265 873974 870387 868750 868615 868696 868087 867295 867514 869082 871237
50882 871237 873171 874708 876078 877672 880015 883452 887729 892267 896825 901523 906444 911746 918052 926059
50868 926059 935747 946606 958617 972265 987513 1003613 1020339 1038694 1059883 1084111 1110959 1140625
50856 1140625 1174222 1213019 1257778 1308713 1365808 1429268 1499810 1578326 1665217 1760354 1863723
50845 1863723 1975511 2095308 2221791 2353630 2490116 2630207 2771369 2910137 3043751
50836 3043751 3170522 3288600 3395134 3487008 3562072 3619554 3659671 3683175 3691120 3684911 3666615
50825 3666615 3639102 3605546 3568604 3530186 3491973 3455882 3423792 3396823 3374806 3356278 3339018
50814 3339018 3320744 3299436 3273193 3240129 3198664 3147790 3086929 3015833 2935029 2846147 2751285
50803 2751285 2651981 2549152 2444073 2338906 2236088 2137540 2044655 1958573 1879938 1808592
50793 1808592 1744035 1686318 1636169 1594095 1559540 1531103 1507496 1488159 1473018 1461870 1454159
50782 1454159 1449195 1446364 1445021 1444412 1443958 1443564 1443398 1443310 1442627 1440662 1437327 1433040 1428036 1421951 1414177 1404481
50766 1404481 1393092 1380200 1365678 1349479 1332064 1314112 1295824 1276860 1257045 1236813 1216783
50755 1216783 1197231 1178297 1160503 1144638 1131069 1119508 1109574 1101415 1095662 1092892 1093268 1096716 1103325
50742 1103325 1113523 1127793 1146329 1169107 1196210 1227807 1263762 1303631 1347254 1395010 1447127
50731 1447127 1502971 1561502 1622360 1685988 1752655 1821807 1892505 1964019 2035658 2106370 2174831
50720 2174831 2239764 2299812 2353267 2398221 2433101 2457033 2469825 2471735 2463173 2444563 2416763 2381675
50708 2381675 2342214 2301370 2261456 2224331 2191762 2164930 2143771 2127417 2115226 2106728 2100527 2094121
50696 2094121 2085321 2073292 2057730 2037499 2010863 1976899 1936097 1889637 1838707 1784577 1728683
50685 1728683 1672338 1616719 1563295 1513807 1469487 1430603 1397065 1369175 1347501 1332266 1323280
50674 1323280 1320332 1323279 1331832 1345516 1363770 1385805 1410473 1436582 1463332 1490275 1516976 1542968
50662 1542968 1567953 1591676 1613704 1633663 1651691 1668354 1684137 1699355 1714490 1730177 1746702
50651 1746702 1763912 1781731 1800434 1820282 1841247 1863349 1887005 1912837 1941283 1972496 2006362
50640 2006362 2042481 2080359 2119773 2160699 2202761 2245061 2286679 2327082 2365895 2402742 2437629
50629 2437629 2471047 2503193 2533284 2560093 2582935 2601548 2615043 2621457 2618544 2604891 2580553 2547269
50617 2547269 2508288 2467572 2428675 2394121 2365459 2343434 2328023 2318665 2314656 2315096 2318420 2322298
50605 2322298 2324200 2321973 2313911 2298702 2275592 2244398 2205157 2158021 2103707 2043853 1980474 1915148
50593 1915148 1848978 1783192 1719246 1658110 1599831 1544029 1490614 1439709 1391194 1344831 1300883
50582 1300883 1260116 1222985 1189115 1157855 1129083 1103174 1080396 1060759 1044435 1031849 1023146
50571 1023146 1017812 1014981 1014010 1014667 1016949 1020891 1026485 1033700 1042611 1053506 1066782 1082680 1101187
50558 1101187 1122143 1145295 1170281 1196742 1224486 1253392 1283193 1313520 1344122 1374848 1405431
50547 1405431 1435617 1465497 1495428 1525570 1555799 1586145 1617008 1648934 1682548 1718897 1759442
50536 1759442 1805419 1857281 1914869 1977914 2046364 2120636 2201610 2289915 2384997 2485414 2590376
50525 2590376 2700535 2816802 2938721 3064437 3191875 3319320 3445042 3566986 3682906
50516 3682906 3790418 3886911 3969710 4036381 4084780 4113204 4120968 4108715 4077746 4029161 3964061
50505 3964061 3884393 3793147 3693755 3589813 3485319 3384640 3291944 3210764 3143854 3093056 3059253
50494 3059253 3042646 3042838 3058189 3085333 3119924 3157813 3194998 3226681 3247371 3252376 3238815 3205222
50482 3205222 3150993 3076851 2985362 2880351 2765735 2645041 2521680 2399084 2280290 2167276
50472 2167276 2060702 1960437 1866557 1779753 1700611 1628760 1563118 1502773 1447114 1395331 1346582
50461 1346582 1300914 1259349 1222704 1190759 1162852 1138811 1118869 1103049 1090968 1082012 1075415 1070486
50449 1070486 1067160 1066092 1067934 1072758 1080420 1091153 1105294 1122533 1141812 1161875 1181716 1200596
50437 1200596 1218036 1233768 1247508 1258897 1267919 1275323 1282250 1289370 1296550 1303426 1310089 1317101 1324930
50424 1324930 1333590 1342899 1353021 1364595 1378346 1394718 1413980 1436435 1462321 1491678 1524582 1561384
50412 1561384 1602499 1648122 1698451 1753957 1814831 1880167 1948128 2017015 2085804 2153641 2219337
50401 2219337 2281543 2339051 2390785 2435817 2473441 2502806 2522407 2530381 2525546 2507873 2478009 2436871
50389 2436871 2385836 2326798 2261806 2193059 2123354 2055827 1992928 1936042 1886288 1844964 1812878
50378 1812878 1789929 1775834 1770632 1773844 1783695 1797773 1813956 1830013 1842887 1849408 1847691 1837192
50366 1837192 1817678 1789016 1751911 1708027 1659121 1606541 1551622 1495986 1441246 1388713 1339358
50355 1339358 1293653 1251517 1212836 1178037 1147767 1121984 1099799 1080232 1062801 1047418 1033971
50344 1033971 1021899 1009831 995976 979386 960734 941408 922128 903115 885231 869814 857188
50333 857188 846330 836445 828078 822113 818347 815792 813955 813098 813433 814763 816980 820303 824864 830337
50319 830337 836185 842050 847807 853338 858456 863014 866995 870451 873416 875931 878170 880426 882987 886086
50305 886086 889937 894608 899865 905339 910920 916704 922553 928160 933795 940501 949141 959577 971211 983880
50291 983880 997600 1011736 1025236 1037717 1049613 1061151 1071704 1080191 1085559 1086916 1084003 1077879
50279 1077879 1070490 1063150 1055884 1048450 1041402 1035618 1031269 1027841 1024965 1022759 1021509 1021422 1022622 1025026
50265 1025026 1028324 1032363 1037492 1044327 1053320 1064730 1078828 1095800 1115572 1138018 1163239 1191298
50253 1191298 1221618 1252858 1283503 1312613 1340121 1366543 1392366 1417613 1441967 1465206 1487194
50242 1487194 1507395 1524737 1538111 1546727 1549762 1546050 1534732 1516257 1492365 1465013 1435612 1405380
50230 1405380 1375859 1348438 1323341 1299559 1276051 1252688 1229668 1206224 1180596 1151516 1119315
50219 1119315 1085339 1050775 1016493 983527 952841 924582 898283 873939 852324 833999 818557
50208 818557 805164 793354 782921 773465 764608 756483 749526 743839 739091 734939 731242 727899 724837
50195 724837 722161 719937 717753 714829 710837 706484 702964 700761 699090 696708 693229 689442 686325 684021
50181 684021 681945 679603 676965 674182 671347 668550 665879 663311 660903 659034 658129 658185 658888 660143 662058
50166 662058 664439 666920 669731 673665 679028 685113 691121 697053 703312 709945 716877 724504 733382 743522
50152 743522 754610 766874 781125 797920 817159 838536 862002 887731 916030 947397 982368
50141 982368 1021225 1064024 1110807 1161483 1215515 1272056 1330465 1390417 1451445 1512623 1572847
50130 1572847 1631388 1688179 1743606 1797795 1849844 1897779 1939331 1972619 1995986 2007657 2006199
50119 2006199 1991348 1964092 1925958 1878477 1823232 1762019 1696951 1630534 1565403 1503422 1445048
50108 1445048 1389948 1338155 1290227 1246382 1206111 1168771 1134062 1101783 1071676 1043710 1018048
50097 1018048 994466 972262 951076 931384 913786 898193 884132 871563 860866 852220 845518 840827
50085 840827 838369 837875 838324 838596 838295 837869 838018 839048 840715 842588 844439 846169 847481 847979 847676 847149
50069 847149 847007 847374 847959 848296 847733 845628 842032 837927 834296 831037 827291 822767 818164 814232 810981
50054 810981 808020 805164 802364 799505 796701 794567 793757 794365 796080 798746 802326 806485 810795 815525 821752
50039 821752 830337 841016 852768 864918 877526 890746 904279 917748 931448 946248 962575 979762
50027 979762 996765 1013498 1031122 1050885 1073029 1097094 1122957 1151089 1181817 1214760 1249134
50016 1249134 1284226 1319341 1353535 1385749 1415219 1441653 1465151 1486072 1504845 1521645 1536160
50005 1536160 1547664 1555288 1558169 1555456 1546232 1529516 1504608 1471807 1432846 1390227 1345987 1301299
49993 1301299 1257181 1214942 1175531 1138876 1104426 1072057 1041949 1013815 986998 961344 937294
49982 937294 914955 893660 872765 852466 833498 816278 800557 785645 770776 755571 740395
49971 740395 726116 713345 702109 692277 683872 676729 670266 663941 657758 652048 646994 642539 638493
49958 638493 634508 630349 626549 624343 624446 626200 628528 631488 636131 642954 651249 660140 669462 679229
49944 679229 688832 697384 704628 711038 717098 722760 727572 731024 732805 732921 731585 728835 724265 717256
49930 717256 707585 695830 683153 670640 658823 647814 637805 629133 621757 615036 608458 602490 598262
49917 598262 596343 596188 596854 597861 599143 600550 601774 602707 603605 604896 606932 609771 613153 616841 621109
49902 621109 626675 633951 642591 651950 661825 672408 683674 695168 706343 716749 725858 733042 737980
49889 737980 740937 742443 742681 741202 737249 730473 721430 711292 700937 690413 679408 668060 656959
49876 656959 646436 636348 626684 617951 610654 604642 599307 594265 589561 585367 581833 579152 577503 576976
49862 576976 577738 580124 584195 589373 595050 601506 609558 619126 628893 637850 646552 656137 666527 676494
49848 676494 685423 694011 702935 711603 718750 723793 727064 728998 729628 728712 725902 720865 713650 704951 695672
49833 695672 686220 676542 666818 657747 650020 643811 638906 635058 631991 629289 626618 624143 622524 622469 624249
49818 624249 627610 632072 637298 643253 650012 657496 665435 673560 681749 689917 697836 705099 711268 716099
49804 716099 719754 722823 725964 729354 732467 734473 734894 733807 731468 727908 723005 716777 709334 700599
49790 700599 690397 678981 667261 656295 646606 638137 630683 624076 618094 612585 607726 603840 600890
49777 600890 598463 596337 594747 593982 594049 594899 596618 599155 602281 606117 611317 618196 625965 633425 640280
49762 640280 647145 654298 661123 667007 672103 676784 680807 683518 684658 684478 683213 680897 677678 673766
49748 673766 668899 662295 653585 643700 634525 627527 622867 619824 617762 616436 615606 614887 614160 613733 613811 614109
49732 614109 614386 615112 617049 620189 623672 626929 630366 634543 639119 643200 646613 650325 655578 663008 672663
49717 672663 684328 697446 710958 723688 734954 744617 752544 758243 761122 760960 758067 753146 747096
49704 747096 740821 734956 729697 724918 720450 716226 712294 708846 706154 704246 702592 700281 696660 691809
49690 691809 686450 681493 677585 674896 673301 672901 674240 677735 682957 688950 695412 703189 713362 726206
49676 726206 741316 758327 776997 796808 816942 836549 854554 869365 879428 884257 884711 882330
49664 882330 878822 875995 875352 877355 881461 887053 893884 901373 908030 912057 912228 907890 898543 884139
49650 884139 865715 845212 824513 804874 787086 771655 758649 747662 738175 729936 723031 717753
49638 717753 714332 712632 712135 712288 712748 713132 712783 711217 708674 705784 702606 698464 692923 686503 680101
49623 680101 673996 667858 661610 655805 650990 646976 643029 638785 634818 632148 631201 631340 631583 631601 631769 632258
49607 632258 632622 632567 632771 634330 637462 641204 644470 646965 648901 650368 651393 652282 653334 654313 654664 654244
49591 654244 653491 652910 652796 653436 655053 657329 659474 661034 662293 663558 664506 664673 664293 664088 664354 664854 665542
49574 665542 666794 668778 671133 673562 676372 680146 685187 691518 699127 707887 717398 727184 736833 745704
49560 745704 752846 757674 760670 762884 764703 765461 764388 761590 757848 753805 749660 745471 741409 737674
49546 737674 734411 731788 730022 729289 729604 730756 732272 733650 734845 736424 738904 741959 744711 746953 749632
49531 749632 753843 759689 766644 774753 784820 797454 812508 829610 848617 869149 890130 910241
49519 910241 928640 944880 958418 968702 975728 980153 982883 984861 987148 990770 996267 1003532 1012052
49506 1012052 1021060 1029444 1035860 1039102 1038367 1033221 1023584 1009819 992679 973184 952594 932356 913715
49493 913715 897235 882838 870268 859308 849550 840371 831415 823046 816085 811031 807598 805081 803167
49480 803167 802185 802391 803181 803498 803082 802864 803819 805825 808019 809920 811700 813609 815750 818318 821494 825113
49464 825113 828915 833089 837971 843275 848278 852856 857636 862817 867504 870648 872164 872588 871990 869819 865770
49449 865770 860452 855113 850790 847615 844837 841663 838069 834693 832100 830533 830200 831222 833273 835914
49435 835914 839418 844623 851677 859614 867503 875436 884016 893514 904111 916438 931294 949215 970730
49422 970730 996310 1025330 1055661 1085289 1113947 1142049 1168132 1188445 1199332 1199386 1189469 1171896
49410 1171896 1150102 1128136 1109315 1095177 1085727 1080292 1078046 1078284 1080770 1085687 1093052 1102266 1112357
49397 1112357 1122492 1132265 1141782 1151464 1161485 1171320 1180145 1187539 1193454 1197650 1199804 1200212 1199633 1198153
49383 1198153 1194820 1188787 1180290 1170134 1158791 1146669 1134804 1124477 1116180 1109549 1104314 1100713 1098923
49370 1098923 1098620 1099422 1101358 1104547 1108576 1112573 1115868 1118311 1119828 1119929 1118001 1114134 1109381 1104929 1101110
49355 1101110 1097421 1093360 1088909 1084225 1079399 1074712 1070763 1067992 1066298 1065469 1065738 1067425 1070098 1072633
49341 1072633 1074347 1075674 1077367 1079262 1080279 1079645 1077616 1074784 1071113 1066173 1060170 1054090 1048682 1043851
49327 1043851 1039361 1035673 1033628 1033657 1035906 1040875 1049231 1060959 1075307 1091655 1109804 1129209 1148546
49314 1148546 1166381 1181725 1193573 1200512 1201509 1196832 1187621 1174749 1158748 1140663 1122193 1104672
49302 1104672 1088368 1073058 1058963 1046810 1037185 1030050 1024739 1020347 1016311 1012873 1010830 1010594 1011526
49289 1011526 1012343 1012161 1011013 1009417 1007688 1005765 1003473 1000710 997372 993341 988703 983858 979269 975163
49275 975163 971687 969271 968493 969372 971039 972391 973034 973332 973601 973583 972876 971571 970109 968563 966473 963655
49259 963655 960928 959641 960496 963221 967693 975024 987020 1004486 1026410 1050896 1076499 1102361 1127364
49246 1127364 1149727 1167611 1179886 1186184 1186450 1180705 1169334 1153494 1135136 1116482 1099329 1084596
49234 1084596 1072330 1062015 1053021 1045062 1038425 1033701 1031144 1030292 1030263 1030387 1030528 1030934 1031925 1033690 1036216
49219 1036216 1039379 1043126 1047526 1052479 1057448 1061812 1065641 1069936 1075775 1083277 1091607 1099980 1108343 1116996
49205 1116996 1125953 1135065 1144616 1155332 1167671 1181333 1195542 1209611 1223143 1235967 1248188 1260176
49193 1260176 1272266 1284447 1296379 1307661 1317982 1327226 1335589 1343472 1351026 1357911 1363854 1369378 1375644
49180 1375644 1383467 1392773 1403194 1414951 1429007 1446577 1468720 1496206 1529258 1567241 1608901 1653135
49168 1653135 1699361 1746721 1792914 1834218 1867089 1889808 1902638 1906874 1904323 1897466 1889147 1881436
49156 1881436 1875023 1869974 1866626 1865220 1865094 1865025 1864410 1863483 1862455 1861199 1860044 1860134 1862421 1866666 1871931 1877755
49140 1877755 1884414 1892274 1901415 1911809 1923409 1936021 1949445 1963711 1978806 1994213 2009216 2023791
49128 2023791 2038739 2054674 2071199 2087432 2103118 2118825 2135129 2151991 2169059 2186346 2204484
49117 2204484 2224431 2247005 2272600 2301400 2334196 2373187 2421765 2483092 2558638 2648058 2750536
49106 2750536 2866513 2998455 3149659 3320912 3506892 3695966 3875296 4037880 4184916
49097 4184916 4320598 4443907 4544916 4608761 4624018 4589355 4514163 4412852 4296909 4170581
49087 4170581 4032960 3883502 3725528 3565669 3411327 3268579 3140911 3028841 2930953 2845770
49077 2845770 2772495 2710114 2656749 2610561 2570760 2537032 2508312 2482874 2459529 2438080 2418628
49066 2418628 2400982 2384894 2370378 2357565 2346501 2337136 2329284 2322549 2316529 2311179 2306812 2303713 2301844
49053 2301844 2300853 2300264 2299790 2299663 2300509 2302661 2305786 2309467 2313911 2319619 2326498 2333806 2340946 2347761 2354016
49038 2354016 2359200 2363148 2366377 2369505 2372647 2375644 2378504 2381297 2383950 2386565 2389661 2393677 2398329 2402834
49024 2402834 2406660 2409702 2411860 2412919 2412979 2412677 2412886 2414314 2417298 2421676 2426882 2432553 2439059 2447051 2456467
49009 2456467 2466394 2476083 2485586 2495179 2504686 2513856 2522993 2532493 2541963 2550489 2557853 2564763 2571603 2577539
48995 2577539 2581332 2582690 2582414 2581405 2579976 2578006 2575287 2571658 2567090 2561752 2555857 2549428 2542433 2535157
48981 2535157 2528221 2522159 2517073 2512669 2508557 2504469 2500365 2496340 2492387 2488357 2484238 2480249 2476406 2472155
48967 2472155 2466857 2460666 2454582 2449538 2445675 2442571 2439861 2437450 2435448 2434148 2433942 2435074 2437630 2441929
48953 2441929 2448677 2458432 2470968 2485423 2501074 2517801 2535832 2555322 2576324 2598998 2623606 2650155
48941 2650155 2678082 2706476 2734729 2762939 2791668 2821497 2853006 2886914 2923729 2963195 3004536
48930 3004536 3047405 3092252 3139553 3189046 3240076 3292376 3346097 3401267 3457677 3515197 3573768
48919 3573768 3633109 3692883 3753232 3814642 3877055 3939406 4000304 4058962 4115341 4169745 4222578
48908 4222578 4274221 4324648 4373137 4418755 4461214 4500993 4538616 4574141 4607527 4639049 4668955
48897 4668955 4696961 4722501 4745372 4765613 4782758 4795837 4804402 4809114 4810937 4810124 4806424 4799896 4790866
48884 4790866 4779187 4764202 4745569 4723644 4698990 4672021 4643257 4613256 4581869 4547930 4510287
48873 4510287 4469001 4425182 4379765 4332736 4283470 4231514 4177133 4121371 4065536 4010424 3956038
48862 3956038 3902235 3849467 3798617 3750240 3704335 3660871 3620129 3582361 3547393 3514844 3484648
48851 3484648 3457108 3432372 3410043 3389529 3370771 3354376 3340902 3330209 3321831 3315866 3313019 3313692
48839 3313692 3317394 3323273 3330887 3340244 3351434 3364583 3379912 3397320 3415992 3434836 3453377 3472012
48827 3472012 3491378 3511736 3532982 3554920 3577342 3599929 3622273 3644099 3665548 3687173 3709432
48816 3709432 3732161 3754755 3776932 3798991 3821146 3843055 3864395 3885624 3907587 3930458 3953563
48805 3953563 3976309 3998885 4021974 4046117 4071455 4097807 4124796 4152071 4179472 4206910 4234227
48794 4234227 4261353 4288375 4315032 4340272 4362877 4382650 4400532 4417355 4432874 4446241 4456972
48783 4456972 4465100 4470674 4473560 4473521 4470108 4462459 4449490 4430384 4404943 4373680 4337749 4298537 4256909
48770 4256909 4212825 4165865 4116113 4064342 4011401 3957651 3903070 3847670 3791765 3735905 3680658
48759 3680658 3626407 3573327 3521568 3471311 3422595 3375279 3329445 3285739 3244995 3207403 3172367
48748 3172367 3139375 3108759 3081306 3057216 3035756 3015979 2997496 2980541 2965552 2952897 2942800
48737 2942800 2935272 2930009 2926400 2923657 2921041 2918228 2915557 2913718 2913046 2913319 2914373 2916535 2920031 2924180
48723 2924180 2927687 2929809 2930824 2931309 2931368 2930718 2929151 2926710 2923655 2920454 2917564 2915096 2912970 2911416 2910890
48708 2910890 2911291 2911755 2911575 2910942 2910422 2910116 2909852 2909863 2910586 2911947 2913474 2915193 2917789 2921744 2926798 2932450
$$ [...]
##END NTUPLES=NMR SPECTRUM
##END=
