##TITLE=AC1423_MEXR_12233_7764356_ZsiqsYwX4C
##JCAMPDX= 6.0         $$ Bruker NMR JCAMP-DX V2.0
##DATA TYPE= NMR SPECTRUM
##DATA CLASS= NTUPLES
##ORIGIN= BRUKER
##OWNER= Administrator
$$ 1.72 TOPSPIN		Version 2.1
$$ 2013-04-11 20:31:49.204 -0700  Administrator@X
$$ Compression mode = diff/dup
##.OBSERVE FREQUENCY= 400.02188249412
##.OBSERVE NUCLEUS= ^1H
##.ACQUISITION MODE= SIMULTANEOUS (DQD)
##.ACQUISITION SCHEME= undefined
##.AVERAGES= 8
##.DIGITISER RES= 22
##SPECTROMETER/DATA SYSTEM= spect
##.PULSE SEQUENCE= zg30
##.SOLVENT NAME= COFFEE_meoh
##.SHIFT REFERENCE= INTERNAL, COFFEE_meoh, 1, 14.98509
##AUDIT TRAIL= $$ (NUMBER, WHEN, WHO, WHERE, PROCESS, VERSION, WHAT)
$$ ##TITLE= Audit trail, TOPSPIN		Version 2.1
$$ ##JCAMPDX= 5.01
$$ ##ORIGIN= Bruker BioSpin GmbH
$$ ##OWNER= Administrator
$$ $$ E:\/data/COFFEE/nmr/AC1423_MEXR_12233_7764356_ZsiqsYwX4C/20/pdata/1/auditp.txt
$$ ##AUDIT TRAIL=  $$ (NUMBER, WHEN, WHO, WHERE, PROCESS, VERSION, WHAT)
(   1,<2013-04-11 20:31:41.111 -0700>,<Administrator>,<X>,<go>,<TOPSPIN 2.1>,
      <created by zg
	started at 2013-04-11 20:30:35.376 -0700,
	POWCHK enabled, PULCHK disabled,
       configuration hash MD5:
       33 CF 6A 21 5C D3 B9 40 6C 15 AA 8D 27 A2 4F 13
       data hash MD5: 64K
       FB FF 8C 6B 4B D8 C9 B1 73 E3 E1 D7 E1 BC AF C0>)
(   2,<2013-04-11 20:31:44.204 -0700>,<Administrator>,<X>,<proc1d>,<TOPSPIN 2.1>,
      <Start of raw data processing
       efp LB = 0 FT_mod = 6 PKNL = 1 PHC0 = 0 PHC1 = 0 SI = 32K 
       data hash MD5: 32K
       A1 FA A8 F0 D6 B0 80 3F 3C FE 13 C2 F0 0F 12 39>)
(   3,<2013-04-11 20:31:44.673 -0700>,<Administrator>,<X>,<proc1d>,<TOPSPIN 2.1>,
      <pk PHC0 = 95.91064 PHC1 = 0 
       data hash MD5: 32K
       2E FB 04 C9 2E 28 2F A9 35 50 77 4B EE EB 31 17>)
(   4,<2013-04-11 20:31:44.908 -0700>,<Administrator>,<X>,<proc1d>,<TOPSPIN 2.1>,
      <abs ABSG = 1 
       data hash MD5: 32K
       68 AD 1C 88 99 47 61 21 EE BF 81 73 16 BD B2 ED>)
(   5,<2013-04-11 20:31:45.048 -0700>,<Administrator>,<X>,<proc1d>,<TOPSPIN 2.1>,
      <abs ABSG = 2 
       data hash MD5: 32K
       EA 90 49 F1 6F B4 AC 62 F7 11 E8 F2 16 4D 3B 47>)
(   6,<2013-04-11 20:31:45.204 -0700>,<Administrator>,<X>,<proc1d>,<TOPSPIN 2.1>,
      <abs ABSG = 3 
       data hash MD5: 32K
       09 70 2E A0 F2 23 3D F1 ED 06 0D 10 96 F2 1F EC>)
(   7,<2013-04-11 20:31:45.345 -0700>,<Administrator>,<X>,<proc1d>,<TOPSPIN 2.1>,
      <abs ABSG = 4 
       data hash MD5: 32K
       49 C0 2A 18 EA 2E E8 1A EA 03 93 7D 7C E6 C8 B6>)
(   8,<2013-04-11 20:31:45.486 -0700>,<Administrator>,<X>,<proc1d>,<TOPSPIN 2.1>,
      <abs ABSG = 5 
       data hash MD5: 32K
       B8 35 A7 B9 FB 1C 96 E0 00 1A 94 2B 3B 2E 2C 40>)
$$ ##END=
$$ 
$$ $$ hash MD5
$$ $$ 94 BA F1 2F E7 90 65 0B 75 BB 2F 0B 5B 11 93 03
##$RELAX= 
##$RELAX= 
##$RELAX= 
##$RELAX= 
##$RELAX= 
##$RELAX= 
##$RELAX= 
$$ Bruker specific parameters
$$ --------------------------
##$DU= <E:\>
##$EXPNO= 20
##$NAME= <AC1423_MEXR_12233_7764356_ZsiqsYwX4C>
$$ [...]
150 150 150 150 150 150 150 150
##$TP07= 0
##$TPNAME0= <>
##$TPNAME1= <>
##$TPNAME2= <>
##$TPNAME3= <>
##$TPNAME4= <>
##$TPNAME5= <>
##$TPNAME6= <>
##$TPNAME7= <>
##$TPOAL= (0..7)
0.5 0.5 0.5 0.5 0.5 0.5 0.5 0.5
##$TPOFFS= (0..7)
0 0 0 0 0 0 0 0
##$TUNHIN= 0
##$TUNHOUT= 0
##$TUNXOUT= 0
##$USERA1= <user>
##$USERA2= <user>
##$USERA3= <user>
##$USERA4= <user>
##$USERA5= <user>
##$V9= 5
##$VALIST= <valist>
##$VCLIST= <CCCCCCCCCCCCCCC>
##$VD= 0
##$VDLIST= <DDDDDDDDDDDDDDD>
##$VPLIST= <PPPPPPPPPPPPPPP>
##$VTLIST= <TTTTTTTTTTTTTTT>
##$WBST= 2048
##$WBSW= 25
##$XGAIN= (0..3)
0 0 0 0
##$XL= 0
##$YL= 0
##$YMAX_a= 601859
##$YMIN_a= -512370
##$ZGOPTNS= <>
##$ZL1= 120
##$ZL2= 120
##$ZL3= 120
##$ZL4= 120
##$ABSF1= 14.98509
##$ABSF2= -5.573092
##$ABSG= 5
##$ABSL= 3
##$ALPHA= 0
##$AQORDER= 0
##$ASSFAC= 0
##$ASSFACI= 0
##$ASSFACX= 0
##$ASSWID= 0
##$AUNMP= <proc_prof1d_extract_pilot.lims>
##$AXLEFT= 0
##$AXNAME= <>
##$AXNUC= <1H>
##$AXRIGHT= 0
##$AXTYPE= 0
##$AXUNIT= <>
##$AZFE= 0.1
##$AZFW= 0.1
##$BCFW= 0
##$BC_mod= 0
##$BYTORDP= 0
##$COROFFS= 0
##$CY= 15
##$DATMOD= 1
##$DC= 0
##$DFILT= <>
##$DTYPP= 0
##$F1P= 0
##$F2P= 0
##$FCOR= 0.5
##$FTSIZE= 32768
##$FT_mod= 6
##$GAMMA= 0
##$GB= 0
##$INTBC= 1
##$INTSCL= 1
##$ISEN= 128
##$LB= 0
##$LEV0= 0
##$LPBIN= 0
##$MAXI= 10000
##$MC2= 0
##$MEAN= 0
##$ME_mod= 0
##$MI= 0
##$NCOEF= 0
##$NC_proc= -8
##$NLEV= 6
##$NOISF1= 0
##$NOISF2= 0
##$NSP= 0
##$NTH_PI= 0
##$NZP= 0
##$OFFSET= 14.98509
##$PC= 1
##$PHC0= 95.91064
##$PHC1= 0
##$PH_mod= 1
##$PKNL= yes
##$PPARMOD= 0
##$PPDIAG= 0
##$PPIPTYP= 0
##$PPMPNUM= 2147483647
##$PPRESOL= 1
##$PSCAL= 4
##$PSIGN= 0
##$PYNMP= <proc.py>
##$REVERSE= no
##$SF= 400.02
##$SI= 32768
##$SIGF1= 0
##$SIGF2= 0
##$SINO= 400
##$SIOLD= 32768
##$SPECTYP= <>
##$SREGLST= <1H.CDCl3>
##$SSB= 0
##$STSI= 32768
##$STSR= 0
##$SW_p= 8223.68421052631
##$SYMM= 0
##$S_DEV= 0
##$TDeff= 65536
##$TDoff= 0
##$TI= <>
##$TILT= no
##$TM1= 0
##$TM2= 0
##$TOPLEV= 0
##$USERP1= <user>
##$USERP2= <user>
##$USERP3= <user>
##$USERP4= <user>
##$USERP5= <user>
##$WDW= 1
##$XDIM= 32768
##$YMAX_p= 463019387
##$YMIN_p= -730809
##$CURPLOT= <Network HP LaserJet P1505>
##$CURPRIN= <$Network HP LaserJet P1505>
##$DFORMAT= <normdp>
##$LAYOUT= <+/1D_H.xwp>
##$LFORMAT= <normlp>
##$PFORMAT= <normpl>
##$SURQMSG= 1
$$ End of Bruker specific parameters
$$ ---------------------------------
##NTUPLES= NMR SPECTRUM
##VAR_NAME=  FREQUENCY,     SPECTRUM/REAL,   SPECTRUM/IMAG
##SYMBOL=    X,             R,               I
##VAR_TYPE=  INDEPENDENT,   DEPENDENT,       DEPENDENT
##VAR_FORM=  AFFN,          ASDF,            ASDF
##VAR_DIM=   32768,         32768,           32768
##UNITS=     HZ,            ARBITRARY UNITS, ARBITRARY UNITS
##FACTOR=    0.250966925370066, 1,           1
##FIRST=     8223.43324360094, -136262,      -98802
##LAST=      0,             -63750,          -38671
##MIN=       0,             -730809,         0
##MAX=       8223.43324360094, 463019387,    0
$$ Real data points
##PAGE= N=1
##DATA TABLE= (X++(R..R)), XYDATA
$$ [...]
19555B06995M0244a78852L5178A046M2271P3759h6794C02989a10563k08813A21617
19543e4762n4521e2709A26822a61297L828f5022m0242k47753D7185R2544d8748
19531a77053L020P8912j14856j28045J47575k10769E2107a61055B40826I3166
19520I5923i9113o9802A08625J6255j0270c83918a72579A26447b58062e504o4537
19509g0041L0823A20443g8459o0089A45415J44243m9858f342A47411f6099A32797
19497i257j21336M2035A89847a84470d8074A74724i228A58996a57532l28996J94647
19486b91881A72827c26626Q6280A79950b57087D3565a0779k15035A68847a05878
19475a24187j32078N6805g3558l54376c9458C7617a31943J267N7805D0638J24948
$$ y = [206995, 247239, -178852, -143674, 1046, 43317, 117076, -86794, 302989, -110563, -319376, 121617, -54762, -109283, -52709, 126822, -161297, -157469, -65022, -105264, -353017, 47185, 139729, -48748, -177053, -174033, -95121, -209977, -338022, -190447, -401216, 52107, -161055, 240826, 93166, 95923, -99113, -168915, 108625, 124880, 114610, -383918, -172579, 126447, -258062, -5504, -70041, -39218, 120443, -78459, -138548, 145415, 289658, 239800, -6342, 147411, -66099, 132797, -9257, -130593, -88558, 189847, -184470, -48074, 174724, -9228, 158996, -157532, -486528, -291881, 172827, -326626, -240346, 179950, -257087, 43565, -10779, -225814, 168847, -105878, -124187, -256265, -199460, -73558, -427934, -39458, 37617, -131943, -130676, -72871, 40638, 165586]
19464A65586b7142o8195d7059I7708c67176b4531h134A35642a79054C5699a23739
19452b30799A32984a26525I283a78078E0202J38436L5870F4774e32711b57450
19441a06482B64778a87684c9472A88924c75176B33958a42675C08089A08409i4207
19430b47176A1954d69697e9163A36402C7626L52595b4818F1817a11295A27499
19419e117k0748A38245a81910e2193a7451k33296J20570j66003J32251C1598O1715
19408I3313C6016a94642j79272a74266A23671D009a70822D0954J11983a45625
19397A0891J33820j1216a15885N222E8583J02364b68869K9074e8413e924B88753
19385B9468J65257a18532a3313B1503d9193j51788O7973d4372D745a05096B38535
$$ y = [165586, -27142, -95337, -47059, 97708, -367176, -24531, -8134, 135642, -179054, 35699, -123739, -230799, 132984, -126525, 9283, -178078, 50202, 188638, 224508, 64774, -532711, -257450, -106482, 264778, -187684, -39472, 188924, -375176, 233958, -142675, 308089, 108409, -94207, -247176, 11954, -469697, -59163, 136402, 37626, 390221, -24818, 61817, -111295, 127499, -5117, -25865, 138245, -181910, -52193, -17451, -250747, -130177, -296180, -163929, 31598, 93313, 36016, -194642, -373914, -174266, 123671, 4009, -170822, 40954, 152937, -145625, 10891, 144711, 133495, -115885, -110663, 58583, 160947, -268869, -239795, -58413, -5924, 288753, 29468, 194725, -118532, -13313, 21503, -49193, -200981, -133008, -44372, 4745, -105096, 238535]
19373c03141B89061a67278f2792j25618N484N8585h942n21193H5891c0297p823
19362c8120A08325a59586E1484d07254e6381o3578L0567B66079c31065B8952c85561
19350E7600b33979K6060N8538G2416N9223c05477B54835c6705j5287r0430j37774
19339b80196C06447d39788a94243C0276B504b85496g459n5101D8132a59730A76587
19327c11738L8463p4692B60466a01150A56106a86183i2413j39676C5065A1430
19316B80201A5819R241f3510q7038N6798c775j61947D812a29167N0902C52860
19304c60183a13719N5258j22874m0360C17024D2775J41136F3785a74970g9980
19293F1219b32817g9603A0247b3598B11095a62131N9822j9618J7079A1735a7979
$$ y = [-303141, 289061, -167278, -62792, -188410, -182926, -124341, -8942, -530135, 85891, -30297, -38120, 108325, -159586, 51484, -407254, -56381, -119959, -89392, 266079, -331065, 28952, -385561, 57600, -233979, -207919, -149381, 72416, 131639, -305477, 254835, -36705, -51992, -142422, -280196, 306447, -439788, -194243, 30276, 2504, -285496, -7459, -62560, 48132, -159730, 176587, -311738, -273275, -347967, 260466, -101150, 156106, -186183, -92413, -232089, 35065, 11430, 280201, 15819, 25060, -63510, -150548, -93750, -3775, -165722, 4812, -129167, -78265, 352860, -360183, -113719, -58461, -181335, -221695, 317024, 42775, 183911, 63785, -174970, -79980, 61219, -232817, -79603, 10247, -23598, 211095, -162131, -102309, -121927, -104848, 11735, -17979]
19281b02614e7621C0905b40885A9288b69218a0677j67104B20972q094H5748J92133
19270B77881i9930j69284c1497o8994F1657B1744M0381b36810a12924D064L5039
19259C9103c8195k76258J48923A16416c40664A4389a37754N8657E9042d9713k4229
19248g3942l1964G9728h0636r2039I8651L740a32409l5989A05320b66933a01819
19236A0694c96512a18465F6522P2400a42579O7242A15590O0458o4379b19338O7528
19225a51810d9129j37889B0282a68214j23046e5612k941l5674c153j33648B64891
19213b22553k00772E1644P7062f3261K2762B7222a17876N5840F7651B0822e27933
19201A95613I7356i3042C2265g7483I2276J687K76192g0328I2955h918k626k47241
$$ y = [-202614, -57621, 30905, -240885, 19288, -269218, -10677, -177781, 220972, 212878, 85748, 277881, -99930, -269214, -31497, -100491, 61657, 21744, 62125, -236810, -112924, 4064, 39103, -38195, -314453, -165530, 116416, -340664, 14389, -137754, -79097, 59042, -49713, -73942, -105906, 79728, -80636, -172675, 98651, 102391, -132409, -168398, 105320, -266933, -101819, 10694, -396512, -118465, 66522, 138922, -142579, -75337, 115590, 176048, 111669, -219338, -151810, -49129, -187018, 20282, -168214, -291260, -55612, -58553, -94227, -3153, -136801, 264891, -222553, -423325, 51644, 128706, -63261, -40499, 27222, -117876, -62036, 67651, 20822, -527933, 195613, 97356, -93042, 32265, -77483, 92276, 93963, 370155, -70328, 92955, -8918, -11544, -258785]
19189b58785c5190H730a03476o9789B09073b28305A5534e8488e143j53933O4025
19178i5051q6160g9330A19912b94727L5170J15500B25175d4525l6430C67397h0795
19166b62046A32306b56626J15361e0932J4737n6005A5443Q8671h320A10435b49869
19154a26399R759b760m41411c1001A61642b7136k1531j1697G1252c11200a0628
19142a26039j1715B9969L0206J09417n6163A8M9742K0327a04182E703b85918a1535
19129A05159F449c03348d6p348k416o8499o9434p361A26428k7096b0442k67056
19117b87498a16571e4054l2924A48292J97230d98912g2049j3682F6899e7879n4060
19106a11939k73192a87693C7554b49027A56950i7102C36294A02840K9246b6787
$$ y = [-258785, -35190, 8730, -103476, -173265, 209073, -228305, 15534, -58488, -5143, -159076, -95051, -181211, -79330, 119912, -294727, -259557, -144057, 225175, -44525, -80955, 367397, -80795, -262046, 132306, -256626, -141265, -50932, -36195, -92200, 15443, 104114, -8320, 110435, -249869, -126399, -116640, -2760, -444171, -31001, 161642, -27136, -48667, -60364, 71252, -311200, -10628, -126039, -137754, 29969, 60175, 169592, 113429, 18, 49760, 70087, -104182, 5703, -285918, -11535, 105159, 6449, -303348, -46, -7394, -9810, -78309, -147743, -155104, 126428, 99332, -20442, -287498, -116571, -54054, -86978, 148292, 345522, -498912, -72049, -85731, 66899, -57879, -111939, -385131, -187693, 37554, -249027, 156950, -97102, 336294, 102840, 132086, -26787]
19095b42340J12410M7368k831p7758d0481A28007a64420A30079a04409A55995
19084b18126C88350c53399J59646a245k9641j6382n6692j24948k6206a24021A51496
19072b93617B33078j00124a67866B11854F9948f9517k14757Q82J06526P5229d9804
19060H6122a52836G882C450J4056J21935a50677a6899l68829B13223e13564a56304
19048B39123e3977D82878b21885a10165A12896D1713b78761A0244J20403c56492
19037C0071a82817p2363b5505k47970i176A39424D7206f4218k92927g4277B28410
19025c2421A85904r0949b48515c8477q549C07201b44765Q1610P157o6988j4042
19014b37028R8201a3350p0304m3340B32595a40972n4630R5242k42001A09886A9283
$$ y = [-242340, -129930, -82562, -85393, -163151, -40481, 128007, -164420, 130079, -104409, 155995, -218126, 388350, -353399, -193753, -1245, -30886, -47268, -103960, -228908, -255114, -124021, 151496, -293617, 233078, 132954, -167866, 211854, 69948, -69517, -284274, -283392, -176866, -101637, -49804, 86122, -152836, 7882, 3450, 17506, 139441, -150677, -16899, -385728, 213223, -513564, -156304, 239123, -53977, 482878, -221885, -110165, 112896, 41713, -278761, 10244, 130647, -356492, 30071, -182817, -255180, -25505, -273475, -9176, 139424, 47206, -64218, -357145, -74277, 228410, -32421, 185904, 94955, -248515, -38477, -47026, 307201, -244765, -163155, -155998, -222986, -237028, -138827, -13350, -83654, -126994, 232595, -140972, -195602, -100360, -342361, 109886, 19283]
19002i7081K361F2237a74814C8722d1683E9463G288d8214B35161h244C47139A55913
18989a59293l973A22852c5637k01073a09695A12484b55844J18593M5924c1849
18978b45458J08763j15741P5430h8191q2256D28346d22451K8887J32237d8249
18967f0622D022a96558A0994k390c63441A70805C1325a9731j7996j1048p5072
18956a23847j29865B7623a46269j05346d2310D7737e7057B22396b4428c591E6180
18944D6526L2372K62806c9113j04963C37019h8479q8486c3791C5233K02312A8707
18932b30858N0813A10480h0897E0586b1950k31968h4044B89335A10655b57941
18921a85901c521m2696j08261B43174h5458E5210g4342B19566B6640R2977e2455
$$ y = [-97081, -94720, 62237, -174814, 38722, -41683, 59463, 7288, -48214, 235161, -8244, 347139, 155913, -159293, -163266, 122852, -35637, -236710, -109695, 112484, -255844, -137251, -91327, -31849, -245458, -136695, -252436, -177006, -88191, -170447, 428346, -422451, -393564, -261327, -48249, -60622, 4022, -196558, 10994, 8604, -363441, 170805, 31325, -19731, -37727, -48775, -123847, -253712, 27623, -146269, -251615, -42310, 47737, -57057, 222396, -24428, -3591, 56180, 46526, 78898, 341704, -39113, -144076, 337019, -88479, -176965, -33791, 35233, 237545, 18707, -230858, -180045, 110480, -80897, 50586, -21950, -253918, -84044, 289335, 110655, -257941, -185901, -3521, -46217, -154478, 243174, -85458, 55210, -74342, 219566, 26640, 119617, -52455]
18909g6537l8180n1443b1090A86436c223m0833H9718M1121a84132G7550a07977
18897i8155A42344f168j58959A08508a72672B66259K06656B1662J15597K67450
18887D04709a14176E0862b02777I2670a540l02814C45075I628a08206d263m04525
18876d08788K3510c6182j35764e6424B36850a0103B63833a06206D14403A89581
18865b18627O0485M1139A5246a0318A77858l0457e1976j43535b1728B75710b02592
18853A76634C143J18426b40868I5591p140d8936k5769H4230a89609e3723j35076
18842a88799A02880c14904a06063j98116g5138C55626b21981r8941i9536A01746
18831G6675g2608G748h0733j03392A65773g6019c4414B30738m3054I242b46247
$$ y = [-76537, -114717, -166160, -21090, 186436, -3223, -44056, 89718, 130839, -184132, 77550, -107977, -98155, 142344, -6168, -165127, 108508, -172672, 266259, 472915, 21662, 137259, 404709, -114176, 50862, -202777, 92670, -1540, -304354, 345075, 9628, -108206, -4263, -408788, -385278, -36182, -171946, -56424, 236850, -10103, 263833, -106206, 414403, 189581, -218627, -158142, -117003, 15246, -10318, 177858, 147401, -51976, -195511, -21728, 275710, -202592, 176634, 3143, 121569, -240868, 95591, 88451, -48936, -74705, 84230, -189609, -53723, -188799, 102880, -314904, -106063, -304179, -75138, 355626, -221981, -320922, -99536, 101746, 76675, -72608, 7748, -80733, -184125, 165773, -76019, -34414, 230738, 187684, 9242, -246247]
18819f7080j23427A73812e5794A11516i2686k8350G0063b67711d4281k38279b8876
18807A71328a44216e0868A87793n9155l3882h2027l0643A5219a35568B7277R4795
18796A22072A5078J16867b01039A16931C2230b539I587g2267l67665a63241A04970
18784a57655J0723c6149A27670B6744b47170A2707J29482c03652a06876r1079
18774a97955c6836G7158h7412d3267r1402A59575E9529a13223D18854g603a813
18762a79930A43922p512e2122A2401a37410L0288M051C7047j7139L1076R8819
18751A49803J15252O5127j06292c9557q4890m6213d1840o4880j53907H1703a55478
18739e6451j96207Q4646B1072K01107I4285c36665J41667h0728M0120A79467b39432
$$ y = [-67080, -190507, 173812, -55794, 111516, -92686, -121036, 70063, -267711, -44281, -282560, -28876, 171328, -144216, -50868, 187793, 128638, 94756, -82027, -112670, 15219, -135568, 27277, 122072, 15078, 131945, -201039, 116931, 32230, -2539, 9587, -72267, -439932, -163241, 104970, -157655, -146932, -36149, 127670, 26744, -247170, 12707, 142189, -303652, -106876, -197955, -36836, 77158, -87412, -43267, -134669, 159575, 59529, -113223, 418854, -7603, -1813, -179930, 143922, 136410, -52122, 12401, -137410, -107122, -103071, 37047, 19908, 50984, 149803, 265055, 330182, 223890, -39557, -124447, -170660, -41840, -106720, -260627, 81703, -155478, -56451, -252658, -168012, 21072, 222179, 94285, -336665, -194998, -80728, -40608, 179467, -239432]
18727G1392B8722a21905j3812j45816a13900d2702j62526b9037o8924J8485j77898
18716b57374Q8770f0855k9389B35624a70895c6661k13053h9321A0091J5262M9414
18705G4767d9315j62296R6609A697K10621a53067L8515I5681b0961r3830N7316
18694e7475j79337j00442e8612A72713a42941C5634P9803b69379E4488b46845
18683b32575O8854j58730J15626A4270R7742j3245B0606d7278G1818f5680A71323
18671i4608k04488J04712A08010J22182E0035a47087R807j85771G9514K79098
18661C58612a2073n1270K9195A25836a3324o1851k63527h2001c2864j51275b3313
18649b27124I1855d81808B0312a0399j38667C4281n944a89977B22814B6245h2407
$$ y = [71392, 28722, -121905, -135717, -281533, -113900, -42702, -205228, -29037, -97961, -79476, -257374, -168604, -60855, -90244, 235624, -170895, -36661, -249714, -89321, 10091, 25353, 74767, -49315, -211611, -115002, 1697, 212318, -153067, -114552, 95681, -20961, -114791, -57475, -236812, -337254, -58612, 172713, -142941, 35634, 115437, -269379, 54488, -246845, -232575, -163721, -322451, -206825, 14270, 112012, 98767, 20606, -47278, 71818, -65680, 171323, -94608, -299096, -194384, 108010, 230192, 50035, -147087, -137280, -323051, 79514, 358612, -12073, -63343, -34148, 125836, -13324, -75175, -338702, -82001, -32864, -184139, -23313, -227124, 91855, -481808, 20312, -10399, -149066, 34281, 28337, -189977, 222814, 26245, -82407]
18637C4821e7391q6799A651a86656A765a10361A28481n7296D095c07223J30215
18626a77008B58341r7820c71563J35480d5068C01132q3670a68367A699a37167
18615a34945B14637c39532o5388h1993A79333N9341b629k05018f2548q2671k56390
18604d01609a52866j48601l3840A02777g2952k69501Q963h78o179F9548b49567
18592c08232D7812j1873Q7788O4203b06539G5957l5134d68396J25671D250a64854
18580H0315a28206k0865B74426a42152O595B06249c21155J44069O5293F0772B9992
18568c94994B60519B6656b45824b139A55594A6959D503J77670b7518B19996A09047
18556b85853H062a42656j57102i4866n2229b2792m1753A54529N0585B2882a26982
$$ y = [34821, -57391, -144190, 1651, -186656, 1765, -110361, 128481, 71185, 4095, -307223, -177008, 258341, 160521, -371563, -236083, -45068, 301132, 217462, -168367, 1699, -137167, -134945, 214637, -339532, -404920, -81993, 179333, 238674, -2629, -207647, -62548, -145219, -401609, -152866, -301467, -335307, 102777, -72952, -342453, -333490, -878, -7057, 69548, -249567, -308232, 47812, 35939, 123727, 187930, -206539, 75957, 40823, -468396, -342725, 4250, -164854, 80315, -128206, -149071, 274426, -142152, -135557, 206249, -321155, -177086, -111793, 60772, 29992, -394994, 260519, 26656, -245824, -2139, 155594, 16959, 4503, 182173, -27518, 219996, 109047, -285853, 8062, -142656, -299758, -94866, -147095, -22792, -64545, 154529, 205114, 22882, -126982]
18544a62475C165J51663c5803a3466B23759J60879C9335f183j93720f7433j6842
18533h4275B50153o9958J07625c8827q1828L9878F2635J01034l8408R8312a56955
18521b06940i9258m53220h7712A19467b7341A4589a34355a2675j07674F7652a36541
18509i868H7094c44266G2516A6909a40313j04415P3575C11018A8399a22870d1488
18497A45324d2717A176a47868A97860D3578c46643f5669A58280a70088L4815f7606
18485D1366a83506c6368k93260h0443j17096A39898b79220e9548A39186g3084
18474g0678a5668k7365j83984f1876a2526p5234q0683P6605q3329L9405k0644
18463a56406r342d24k75130j79090A39936a7359p8279A20836C1890a7024C0713
$$ y = [-162475, 3165, 154828, -35803, -13466, 223759, 384638, 39335, -6183, -199903, -67433, -84275, 250153, 180195, 287820, -38827, -120655, -80777, 62635, 163669, 125261, 223573, -156955, -206940, -99258, -552478, -87712, 119467, -27341, 14589, -134355, -12675, -120349, 67652, -136541, -9868, 87094, -344266, 72516, 16909, -140313, -244728, -171153, 311018, 18399, -122870, -41488, 145324, -42717, 1176, -147868, 197860, 43578, -346643, -65669, 158280, -170088, -135273, -67606, 41366, -183506, -36368, -329628, -80443, -197539, 139898, -279220, -59548, 139186, -73084, -70678, -15668, -43033, -227017, -61876, -12526, -87760, -168443, -91838, -175167, -135762, -156406, -165748, -424, -275554, -454644, 139936, -17359, -95638, 120836, 31890, -17024, 30713]
18451d7697A46611a96882A05161a43182f4038k34809f6907n4642c6491j26450
18441a62941H52f7087o5030L5399A92175q6316b94418A65062D2690c0537j25702
18430a56239A2995J04245a63911b3919j12308A59662a50046a9570n9912j31191
18420b10673e4326j15160K0616f4733A97230L4711a31644I2588b22297d9271K0889
18409b8382j34766L0037a3308j93615n8987J13949j24232C9240J14317l8469a05967
18397a29686j53807A3615a18704a3739j44380A42858c0228D7863a43400J0932
18387a32468q5000C438L9914b00576A78048E4507O2384a9885A22307a94078m8067
18376b42145d5563o7435d0977k0411j77439a1182r6160E1863a05449H8979a22626
$$ y = [-47697, 146611, -196882, 105161, -143182, -64038, -298847, -66907, -121549, -36491, -162941, 852, -67087, -132117, -96718, 192175, 105859, -294418, 165062, 42690, -30537, -156239, 12995, 117240, -163911, -23919, -136227, 159662, -150046, -19570, -79482, -210673, -54326, -169486, -148870, -64733, 197230, 231941, -131644, 92588, -222297, -49271, -28382, -163148, -133111, -13308, -206923, -265910, -151961, -276193, 39240, 153557, 115088, -105967, -129686, -283493, 13615, -118704, -13739, -158119, 142858, -30228, 47863, -143400, -132468, -217468, 3438, 43352, -200576, 178048, 54507, 116891, -19885, 122307, -194078, -242145, -45563, -112998, -40977, -61388, -238827, -11182, -107342, 51863, -105449, 88979, -122626]
18364H5901J16335F1678J17424b43316l5621a25899k02050H095a98951N0010r6414
18353b45355G463a13750L193K3836j5671A05713c68286D4396O7862a07365E4147
18341a44947L5734j43004J01554l64515e2948l62734A09960e3386h425A01785
18330F0896a38297C36460j31200b06797A79549M1544C8912C024a15416K2376j93847
18319b86887P3060O5352k448m9389d4910n5519D7715a39605B15994b47292n6317
18308c03609a14387b4627k60124H196a77002P4079I5184D4263a49461L7643a036
18296A03782b19338K5573q8610C10679b13433B47918I9122K2492b48772M3165
18286b05607J1536A17460d3972C5018L5198b26550F1884a32795k4912E6202g7368
$$ y = [85901, 202236, 61678, 179102, -243316, -278937, -125899, -327949, 8095, -198951, -148941, -245355, 7463, -113750, -110557, -86721, -102392, 105713, -368286, 44396, 112258, -107365, 54147, -144947, -109213, -252217, -150663, -515178, -52948, -415682, 109960, -53386, -8425, 101785, 60896, -138297, 336460, 205260, -206797, 179549, 221093, 38912, 3024, -115416, -93040, -286887, -213827, -148475, -150923, -200312, -44910, -100429, 47715, -139605, 215994, -247292, -303609, -114387, -24627, -284751, 8196, -177002, -102923, 95184, 44263, -149461, -111818, -1036, 103782, -219338, -193765, -282375, 310679, -213433, 247918, 99122, 121614, -248772, -205607, -194071, 117460, -43972, 35018, 70216, -226550, 61884, -132795, -157707, 56202, -77368]
18274C00589j40325n6018J30360a53698N4714q9421P8227C76744b21100K8875
18264a92225P9327e4638j03342A02751a8717C6042j4819a339A19737b54400E0041
18252D3038N8612b6897g081k74176A00566b46009d2641C2733g1293j70366b4881
18240B54416e1512I7820a32670d4101D8230Q4660c6625C35213I9989c2847l18228
18229c51075e861o6900F2144b5054j34209L3166G8418J32801b45125D6709b41801
18217a9936j26876k28784J76700a1564B40767a47906A29960a4622A09409o294
18207A03115D2230K368a00109A31622f4613q3832j45978J45215k4472A59107b35025
18195D8065A8927i8700B61155b60330e2239D4460K15846Q8604i4367A44070a39235
$$ y = [300589, 160264, 104246, 234606, -153698, -98984, -188405, -110178, 376744, -221100, -192225, -112898, -54638, -157980, 102751, -18717, 36042, 21223, -1339, 119737, -254400, 50041, 43038, 101650, -26897, -7081, -281257, 100566, -246009, -42641, 32733, -71293, -241659, -24881, 254416, -51512, 97820, -132670, -44101, 48230, 132890, -36625, 335213, 99989, -32847, -351075, -5861, -72761, 62144, -25054, -159263, -126097, 78418, 211219, -245125, 46709, -241801, -19936, -146812, -375596, -198896, -11564, 240767, -147906, 129960, -14622, 109409, 103115, 42230, 44598, -100109, 131622, -64613, -148445, -294423, -149208, -173680, 159107, -235025, 48065, 18927, -98700, 261155, -260330, -52239, 44460, 260306, 348910, -94367, 144070, -139235]
18183b18660G6993b21161B2728a92760R0462k7535A11238a20162j13410n0262
18173b83834h7326j32661C34716A51755b07530A96095a04580j74975h9362B45717
18162a59165m2391A07763K69090a44619j9515K8564B59582j626b32614J06898
18152a25716B77612f3796A82045b3305k64037m9710c0328k5466k21740A50427
18141A69867M23067B307a90316e398j63544C8132J81635a90483G2008A9762K7104
18130D6866N8081h4079k03785A71884J12351j9670o7980a32772j6639j17876f7223
18118A58205p5549e1205r2443r6392e0481j3418o5526j75879b2329A70420c10021
18106B01537B0347g2360p7578L2059q7990A75387a33948r7938e4491B14472b01622
$$ y = [-218660, 76993, -221161, 22728, -192760, -102298, -129833, 111238, -120162, -233572, -283834, -87326, -219987, 334716, 151755, -207530, 196095, -104580, -279555, -89362, 245717, -159165, -201556, 107763, 376853, -144619, -164134, -135570, 259582, 257956, -232614, -125716, 277612, -63796, 182045, -23305, -287342, -337052, -30328, -55794, -277534, 150427, 169867, 592934, 2307, -190316, -5398, -168942, 38132, 219767, -190483, 72008, 19762, 46866, 104947, -84079, -287864, 171884, 284235, 264565, 196585, -132772, -149411, -267287, -67223, 158205, 82656, -51205, -143648, -240040, -50481, -63899, -129425, -305304, -22329, 170420, -310021, 201537, 20347, -72360, -149938, -117879, -205869, 175387, -133948, -231886, -54491, 214472, -201622]
18094e03580A05987b5738I0498a57050K0566k967G5703i2891K8470m4352d6797
18082B3769Q9261a65135C5281a43098J5875j61240A32421a16742j94423A09047
18071b18622A36168b62905F4342L8072a99086d4215j8643n9574j41609a15460
18060g086D7916K05771p6224a39418K7696E6671a37351A42355m8444A2013b22620
18048A12637b8296F1889i2608r1478n025D4002d56396a31837d085B8189a21193
18036a76681I9874O079a12849B96760L607b17187A25588E8172a18587g878j43731
18025a51609E1318a61641j87579L5788O7649R0207A6879a79485P1470k48374A03095
18013f9458A78316D1938P5361a34100B34550b8337A23049h5574A4277i4552L3260
$$ y = [-503580, 105987, -25738, 90498, -157050, -136484, -139451, 75703, -92891, -64421, -108773, -46797, 23769, 113030, -165135, 35281, -143098, -127223, -288463, 132421, -116742, -311165, 109047, -218622, 136168, -262905, 64342, 102414, -199086, -44215, -62858, -122432, -264041, -115460, -7086, 47916, 253687, 177463, -139418, -111722, 56671, -137351, 142355, 93911, 12013, -222620, 112637, -28296, 61889, -92608, -184086, -189111, 44002, -456396, -131837, -4085, 28189, -121193, -176681, 99874, 105953, -112849, 296760, 300367, -217187, 125588, 58172, -118587, -7878, -151609, 51318, -161641, -349220, -313432, -245783, -155576, 16879, -179485, -108015, -356389, 103095, -69458, 178316, 41938, 117299, -134100, 234550, -28337, 123049, -85574, 14277, -94552, -61292]
18002f1292D5512a19357e1264k50094J48004r608c9434A39510b91700g6799A72901
17990f5088D4807a36778c6013D1594J4503e6229o0292a0395B19477b68187E4623
17978a68394f7311C432a00468i900j29168K4049o8279P7730k94295J48687M3957
17967b07219A62806m3884P8989N875d9129q0661F4662A8857h293F6382J14718
17956A81100I559K70259J49499k03360C3454g4198B34915I5237d35822G6056b63463
17944b7287A12175G062P5373r042L5564a94241B8848b4733j7624A82035j2911
17933A69124J60554C9734a80840A30513a51826j06869E3354O9138C0577h6433
17922f7606I8270L12307A37925c03894f0610j02670B13157c84509J62123j01480
$$ y = [-61292, 45512, -119357, -51264, -301358, -153354, -162962, -39434, 139510, -291700, -76799, 172901, -65088, 44807, -136778, -36013, 41594, 56097, -56229, -116521, -10395, 219477, -268187, 54623, -168394, -67311, 3432, -100468, -9900, -139068, -115019, -183298, -105568, -399863, -251176, -207219, 162806, 118922, 197911, 203786, -49129, -129790, 64662, 18857, -8293, 66382, 181100, 9559, 279818, 429317, 225957, 33454, -74198, 234915, 95237, -435822, 76056, -263463, -27287, 112175, 7062, 82435, 73393, 108957, -194241, 28848, -24733, -42357, 182035, 169124, 329678, 39734, -180840, 130513, -151826, -258695, 53354, 122492, 30577, -86433, -67606, 98270, 410577, 137925, -303894, -60610, -163280, 213157, -384509, -222386, -323866]
17912c23866C49510a66244l0218O3914O953B53691a14674C37394b43304B2315
17901a74921I8428C0101a15264A57444o1822a6852k61865a2269A7706a49196c0618
17889a16679K6986r2526b0711j1312h178B04621K48064b01678D1244K24665b41794
17877d4662E3999a13322K6604B0729h8311B69120F2800J50110n7107a55854N4069
17866a01785k46626e4709@c5899m0604o5234N9329C2928K8243a6817r3494j97378
17854c07689B2825d16751A09848h9426A89564g9132B34356k4514a23076j50505
17844b73581A53190b9169q8808A6153d0838q3466F2940J39281C5582J90679E0089
17832i2106k30521B51532E4945a763j49765p6134J01489E4114n758K2765r990
$$ y = [-323866, 349510, -166244, -196462, -132548, -125595, 253691, -114674, 337394, -243304, 22315, -174921, 98428, 30101, -115264, 157444, 95622, -16852, -278717, -12269, 17706, -149196, -30618, -116679, -89693, -182219, -20711, -32023, -8178, 204621, 452685, -201678, 41244, 265909, -241794, -44662, 53999, -113322, -86718, 20729, -88311, 269120, 62800, 212910, 155803, -155854, -101785, -348411, -54709, 0, -35899, -76503, -141737, -82408, 32928, 61171, -16817, -110311, -307689, 22825, -416751, 109848, -89426, 189564, -79132, 234356, 209842, -123076, -273581, 153190, -29169, -117977, 16153, -40838, -124304, 62940, 202221, 35582, 226261, 50089, -92106, -322627, 251532, 54945, -1763, -151528, -227662, -126173, 54114, 48356, 71121, 61131]
17821F1131M3957a57904I5117J20743b36933g0480H2186l9833K93052b05632D7620
17809B56489a23197C0950J68862n683a02910C3546K39278a23352c8085n7604a6553
17797E7720K28881c3890B9283L37656A6914J68315Q3309a1558m3168A68700C3832
17785H8826J2052l7550B5559R1911D7864K4772b32101B55484A16346M5444a06369
17773a95248M6517A55798h1483L9385A60340l7576d8759C10994f7936E598J84651
17762A90249a05814q5248d4682q0497p2611d396k9939C07492P9675c7525j05047
17751a42572A7486i0394k8572J8982F4313e9642D4723h6483C58575f9605l5523
17740a05128d6597A91995m4201a65410O8285j12043a03318A46693c2690F5197
$$ y = [61131, 105088, -157904, 95117, 215860, -236933, -70480, 82186, 42353, 335405, -205632, 47620, 256489, -123197, 30950, 199812, 194129, -102910, 33546, 272824, -123352, -38085, -95689, -16553, 57720, 286601, -33890, 29283, 366939, 16914, 185229, 268538, -11558, -54726, 168700, 33832, 88826, 100878, 63328, 25559, 117470, 47864, 72636, -232101, 255484, 116346, 161790, -106369, -195248, -148731, 155798, -81483, -42098, 160340, 122764, -48759, 310994, -67936, 5598, 190249, -105814, -191062, -44682, -125179, -197790, -4396, -34335, 307492, 387167, -37525, -142572, 17486, -90394, -118966, -99984, 64313, -59642, 44723, -86483, 358575, -69605, -105128, -46597, 191995, 147794, -165410, -97125, -209168, -103318, 146693, -32690, 65197]
17729A6135K67834b97r3609A06077b1624B9860J58023g4768o061c8821A96441
17717A01943B2547J2745K03760r809A07918c46268E8637Q1693a28755J1220r1545
17706b09080O9434B40536K3805J87751h706A04618a86210A28273a62180A7124
17695b7255C71215J13565k30452r7398o8714a55959P6810b9481o2989A7409N0318
17684F7727b03196i1772m1265A34938R3180a4238A82827l5469O1655l1832l7287
17673A39894M2992f3587j66991B21988d35231g8155j25563f1694m6201A88021
17662C04547B2254J71280a25541e1965B9547M3796A3806K27451A18109d1371l3707
17651g5078B79039a58682B00534a8061B02490Q6932i5545A55447L578e4791B4320
$$ y = [16135, 283969, -297, -93906, 106077, -21624, 29860, 187883, -74768, -80829, -38821, 196441, 101943, 22547, 35292, 239052, 229243, 107918, -346268, 58637, 140330, -128755, -117535, -209080, -139646, 240536, 264341, 452092, -8706, 104618, -186210, 128273, -162180, 17124, -27255, 371215, 484780, 254328, 156930, 88216, -155959, -79149, -29481, -92470, 17409, 67727, -203196, -91772, -133037, 134938, 228118, -14238, 182827, 147358, 209013, 177181, 139894, 182886, -63587, -230578, 221988, -435231, -78155, -203718, -61694, -107895, 188021, 304547, 22254, 193534, -125541, -51965, 29547, 73343, 13806, 241257, 118109, -41371, -75078, 279039, -158682, 200534, -18061, 202490, 289422, -95545, 155447, 159025, -54791, 24320]
17639b28060i4925D6548h2636o2608c1300I6719b21281A34633a86412k90539a19787
17627c24961a00292d9215k23289B96959R5762a09990K5254j75501H2675M5581
17617A28256E4429c50540A69489b11769B21820F961K23137A02941A907a89177
17606E0869a42463d0261l7748C3499D804f8102j09452M5726B54471a35919L7459
17595i8460k8922p5283J4631A31882D0462L8366a28917a3033K376k29222e3136
17583D9809a37831b479A23866l4342M8631c2342B9875a45008j6508A09608j8749
17572I0859d41B34837d1284A90009F8754N2013e1791l504A725K6713J55403E465
17559c847A83776E3416R3662C7203J11997d5444E7918e6130H4302P5688L8318
$$ y = [-228060, -94925, 46548, -82636, -145244, -31300, 96719, -221281, 134633, -186412, -476951, -119787, -324961, -100292, -49215, -272504, 296959, 392721, -109990, -84736, -260237, 82675, 128256, 54429, -350540, 169489, -211769, 221820, 6961, 230098, 102941, 1907, -189177, 50869, -142463, -40261, -78009, 33499, 4804, -68102, -177554, -131828, 254471, -135919, -98460, -127382, -202665, -188034, 131882, 40462, 78828, -128917, -13033, -10657, -239879, -53136, 49809, -137831, -2479, 123866, 89524, 138155, -32342, 29875, -145008, -161516, 109608, 90859, -441, 234837, -41284, 190009, 68754, 120767, -51791, -55295, 1725, 28438, 183841, 5465, -3847, 183776, 53416, 147078, 37203, 149200, -45444, 57918, -56130, 84302, 159990, 198308]
17548A98308P0733n7369I0115J14925p4483J87578h2987l00796B14321b6140A6216
17536C09121j45219E812a07497A89768a77219D35235D2528K95015D166a45065
17525a00464C31461l6668j43300p5266n178K9696a01707I7125F785k868M4226
17514D8143i1666A56469g6105d547A8646a8584D825b55066a27482H8348D2361
17502A81948i9940D0305b7134p1553B86200D6800e5950j80816R0273B1416a32321
17490c630C64757a55458F6129k1102d42869D32401A02983b65859B13448J35706
17480C49154g7318h978A31823a85956G5487l4585M72363D2112J46192k7149F5383
17468E64716b10063a7943H4524P5208d0505H5872a35117D19452I9064e9600C47648
$$ y = [198308, 269041, 211672, 90115, 205040, 130557, 318135, -82987, -383783, 214321, -26140, 16216, 309121, 163902, 5812, -107497, 189768, -177219, 435235, 42528, 337543, 4166, -145065, -100464, 331461, 294793, 151493, 76227, 71049, 100745, -101707, 97125, 6785, 3917, 48143, -91666, 156469, -76105, -4547, 18646, -18584, 4825, -255066, -127482, 88348, 42361, 181948, -99940, 40305, -27134, -98687, 286200, 46800, -55950, -236766, -146493, 21416, -132321, -3630, 364757, -155458, 66129, 45027, -442869, 432401, 102983, -265859, 213448, 349154, -77318, -8978, 131823, -185956, 75487, 40902, 513265, 42112, 188304, 161155, 65383, 564716, -210063, -17943, 84524, 159732, -40505, 85872, -135117, 419452, 99064, -59600, 347648]
17456C21476A03791m3701g1025B63796h0634A03642a900C18167J13514b703B82729
17444G3787K47723G7009N9080K56429A29635L34162j15677l0422J6347a05921
17433C3650J19830B1527a29262O1654k11740B2669K53236M5338K45211p1986k12479
17422B81989J22029A9747K68350f7912B78578o2443r4326L1615m5854C6766e0121
17410A28635d0427A68865J23830A5657J69119k7088J33085A25732l5915J20810
17400B10627o9109J8842d1535B02666K0412Q6030j02365K6412F5346K24636a61544
17388d366A19436k4652L24208A54923i990j75127b2698j67243I3912e2580I3088
17376A07529K39995b127l24101E16351k43399c9331H2602N3868c5396A57341a37136
$$ y = [321476, 103791, 60090, -71025, 263796, -80634, 103642, -1900, 318167, 431681, -2703, 282729, 73787, 321510, 77009, 136089, 392518, 129635, 463797, 348120, 317698, 334045, -105921, 33650, 153480, 21527, -129262, -67608, -279348, 22669, 275905, 321243, 566454, 494468, 281989, 404018, 19747, 288097, -67912, 278578, 216135, 121809, 153424, 107570, 36766, -50121, 128635, -40427, 168865, 292695, 15657, 184776, 157688, 290773, 125732, 89817, 210627, 141518, 160360, -41535, 202666, 223078, 309108, 206743, 233155, 65346, 289982, -161544, -4366, 119436, 94784, 418992, 154923, -9990, -185117, -22698, -189941, 93912, -52580, 93088, 107529, 347524, -2127, -326228, 516351, 272952, -39331, 82602, 136470, -35396, 157341, -137136]
17364A77597C7920O5875P5940e9684A52377E0405K88579j66773G0922k5511l524
17353D1887e6033j06356A92828K44349b86467A27856O5679o8996k7938K54150
17343C50751A65765l6150B138J2091P079R4380M8900B9761K17888l9743A7381
17331a116l8075j50497c5835B50747b6208C39784A50668h110E6370e1217H8240
17319A77244P682N4662j7772L4166i3846A45248J16787M3659j30024J90503B5024
17307B27717d85C70039A84936J83151j52750i8426B69725a66533B42191a3010
17296C85795G0794a97224A90267d2493B53632c8825B39980M07363A51676J18210
17286B69886d2530A73210k9998M1070A6475J61760J53856J8963E7186K93757j1027
$$ y = [177597, 37920, 103795, 179735, -59684, 152377, 50405, 338984, 172211, 70922, 45411, 41887, -56033, -162389, 192828, 437177, -286467, 127856, 193535, 124539, 96601, 350751, 165765, 129615, 2138, 14229, 21308, 115688, 164588, 29761, 247649, 207906, 17381, -1116, -39191, -189688, -35835, 250747, -26208, 339784, 150668, -8110, 56370, -51217, 88240, 177244, 184926, 239588, 221816, 255982, -93846, 145248, 262035, 305694, 175670, 366173, 25024, 227717, -485, 370039, 184936, 368087, 215337, -98426, 269725, -166533, 242191, -13010, 385795, 70794, -197224, 190267, -42493, 253632, -38825, 239980, 647343, 151676, 269886, -42530, 173210, 143212, 184282, 16475, 178235, 332091, 351054, 57186, 350943, 339916]
17275C39916n9201N6675b42457A40667L14846b45861G2948a58772L0063A18902
17264F6415C0781A2697R5965O6135K20194A36630f1823A50274J07803j08325G2684
17252A19635j2485k5472j3166Q340g2459I2016J1459m8598J81712G4317J31132
17241B05449d809D6931j7639J17424K22506A54728E0389g9163A63095n2809R8667
17230B08953J23524D582J33355l5391a67391B23374E914K07719I4643J85437F7946
17218g129B12717o7793c6110C48653N3369j80211P2562O8090G6535h0310F28828
17206D09595f9607B72282A23968J68642A09535m5294J56725L0439b2437B45991
17195F11474k94343q8808A06780K47231o0579f0508C30877J27209k18196j14705
$$ y = [339916, 280715, 337390, -242457, 140667, 455513, -245861, 72948, -158772, -128709, 118902, 66415, 30781, 12697, 108662, 174797, 394991, 136630, -61823, 150274, 258077, 149752, 72684, 119635, 107150, 81678, 68512, 76852, -72459, 92016, 103475, 54877, 236589, 74317, 205449, -4809, 46931, 29292, 146716, 369222, 154728, 50389, -79163, 163095, 110286, 208953, 332477, 4582, 137937, 102546, -167391, 223374, 5914, 213633, 94643, 280080, 67946, -7129, 212717, 144924, -36110, 348653, 402022, 221811, 294373, 362463, 76535, -80310, 628828, 409595, -69607, 272282, 123968, 292610, 109535, 64241, 220966, 251405, -22437, 245991, 611474, 317131, 228323, 106780, 354011, 293432, -60508, 330877, 458086, 239890, 125185]
17185A25185K53699A63772L02658a5679B72409J20904j84180Q6273A46953R5627
17175B42580K41124j94836A00901K62297D8985L31346J48971C9967J09605e8785
17164A69624J99937k7363B3391Q6744J28282J1854j03851R2350m8226K586E8925
17152E4187K23709A1316J98490G2401O5787J46492J19302j20160N4636K02356
17142E40814B61601J06412k9115K1965A29932J84622F3787L01725j74727J47686
17132C38471K81783a14734C68329A12596J69388o805J35640e5113C44278o6835
17122B77443H7720K78504a03965D10551j90184H2762L09187K2817J84171k62209
17112C36728Q5521p1927j73442o9753K86915o4171N9732l2629A62019M9919R2720
$$ y = [125185, 378884, 163772, 466430, -15679, 272409, 393313, 209133, 295406, 146953, 242580, 483704, 288868, 100901, 363198, 48985, 380331, 529302, 39967, 149572, -58785, 169624, 369561, 342198, 23391, 110135, 238417, 250271, 146420, 238770, 190544, 193130, 58925, 54187, 277896, 11316, 209806, 72401, 138188, 284680, 403982, 283822, 338458, 540814, 261601, 368013, 338898, 360863, 129932, 314554, 63787, 365512, 190785, 338471, 620254, -114734, 368329, 112596, 281984, 275179, 410819, -55113, 344278, 277443, 87720, 366224, -103965, 410551, 220367, 82762, 391949, 414766, 598937, 336728, 422249, 350322, 176880, 107127, 394042, 329871, 389603, 356974, 162019, 211938, 304658]
17101C04658L85782A69284N21941k47372j787G721M20055K5291L4985j44050E6503
17089E67611k60366N7213j16204L13282B31484a06711C65477n2631K24895A81726
17078C16370B9066K61717R3195j34598M0241r1537K62276L4818p1625j37175O1050
17067C47428m4695J98010J39139B66119J32905j28329J72489n9683P0550N0532
17057E04583A70763P10654C32828J98269p9894P4887j45770J82423k59151J62839
17047D66431P3197B64331L1180J41829k00608J0142K11796J19496A99332O46656
17037H45988k64801J76019C33546R8257R533R4350A51432L18692P3224k45284
17027B98064L47410K1090j89303O880a20879E57746L07648l93584K107J55553
$$ y = [304658, 690440, 169284, 691225, 443853, 442066, 7721, 427776, 453067, 488052, 344002, 56503, 567611, 307245, 364458, 248254, 561536, 231484, -106711, 365477, 312846, 537741, 181726, 316370, 29066, 290783, 383978, 249380, 289621, 198084, 460360, 495178, 423553, 286378, 347428, 302733, 500743, 639882, 266119, 399024, 270695, 443184, 383501, 454051, 504583, 170763, 881417, 332828, 531097, 451203, 526090, 380320, 562743, 303592, 466431, 539628, 264331, 295511, 437340, 236732, 246874, 458670, 578166, 199332, 845988, 581187, 757206, 333546, 431803, 441336, 535686, 151432, 470124, 543348, 298064, 645474, 666564, 477261, 484141, -120879, 557746, 865394, 471810, 473917, 629470]
17017F29470L06588k45558j91477P8786B13256N76872k44095J65168j2955O952
17007G05198k67124L9871r192J5841K02590l13108M25388C30188O3806N8529J36184
16996E88707K9628j23639M7558L64034k20825k79811K04479K27556L2408n0485
16986H19610l54167p1511K74128k01038L45270D01683J41226J57262J66469l04065
16976E62575K51534Q0448M2245k71971L58176j94789j31840P2794j0693K51254
16966A009733P6936k95820P1889m5783K69937k36961R9900j63516J23478l0540
16956H79253k96897N08793l73794L30491r3716K90756k25991k3003j50609K34271
16946A079554k05578k94612N72602j40709Q8848P7577j74712p755j09983M9557
$$ y = [629470, 936058, 690500, 499023, 577809, 213256, 790128, 546033, 711201, 698246, 705198, 438074, 477945, 468753, 484594, 687184, 374076, 799464, 330188, 393994, 452523, 588707, 618335, 494696, 542254, 906288, 685463, 405652, 610131, 837687, 870095, 819610, 465443, 393932, 668060, 467022, 812292, 401683, 542909, 700171, 866640, 562575, 814109, 894557, 936802, 664831, 1023007, 828218, 696378, 769172, 758479, 1009733, 1086669, 790849, 862738, 816955, 1086892, 849931, 949831, 786315, 909793, 879253, 582356, 1091149, 717355, 1047846, 954130, 1244886, 1018895, 995892, 845283, 1079554, 873976, 579364, 1151966, 1011257, 1100105, 1177682, 1002970, 995215, 885232, 934789]
16936I34789j50169R0247J35819Q2205J48198j79366J85701p4062k52083J58889
16926A080168P8642J30365m0842k7160K04855l99931J65715j62483J08415K04003
16916A341747k77054K34214M6328j91226N4292K02840L55837o29222q2136N27654
16906A583274j20650J0863m79253N52458j54857m6458M9650M52077q19955L74261
16896A401410M78651n69028K09322j9348L56960n00516K36568L18280k03872k797
16886A705630J36117M1527R5543j4240Q2780j78415l073r1847P0029M7745O7876
16875A959672N4892L1394J58236j34929N1758r7015l7759P1644L4131J48511L626
16864B244161R1998J60593k19557j00429K13911P2221Q6869K59695l81477J16433
$$ y = [934789, 784620, 874867, 1010686, 1092891, 1241089, 1061723, 1247424, 1173362, 921279, 1080168, 1158810, 1289175, 1248333, 1221173, 1426028, 1026097, 1191812, 1029329, 1137744, 1341747, 1064693, 1298907, 1345235, 1154009, 1208301, 1411141, 1766978, 1137756, 1055620, 1583274, 1462624, 1473487, 994234, 1546692, 1391835, 1345377, 1395027, 1847104, 1027149, 1401410, 1880061, 1311033, 1520355, 1501007, 1857967, 1357451, 1594019, 1912299, 1708427, 1705630, 1841747, 1883274, 1978817, 1964577, 2047357, 1868942, 1865869, 1774022, 1844051, 1891796, 1959672, 2014564, 2045958, 2204194, 2069265, 2121023, 2024008, 1986249, 2057893, 2092024, 2240535, 2244161, 2336159, 2496752, 2277195, 2176766, 2390677, 2462898, 2549767, 2809462, 2427985, 2544418]
16854B544418K00189k79363L9968J94816m5934K96685L5203j06218J15174K73232
16844C268170l26537n4503K36019j03200P4385K38967j7825N2170P5249p847L4695
16833C469743o4949K97548j151q4852L52673o3480M0061N0817L78160p464k18392
16822D148714K12430K15843j58984L26719l3865m4172k909J09587J25568L47857
16812E246788K98326j66895O4102R1633l42247L31888K86798J07319K60222k3418
16802F154516J46794L66192K11496j81527O75571j50933j0686M30742M02447j32707
16792G911905J52871L17190N10073l52614L03934J50197N88335k803M82382L7337
16782A0098807N71027L4968L12548P64627J30511L38484K27466M45406K54462
$$ y = [2544418, 2744607, 2465244, 2505212, 2700028, 2654094, 2950779, 2985982, 2879764, 2994938, 3268170, 2941633, 2887130, 3123149, 3019949, 3094334, 3333301, 3315476, 3367646, 3442895, 3435048, 3469743, 3404794, 3702342, 3701191, 3616339, 3969012, 3905532, 3945593, 3996410, 4374570, 4367106, 4148714, 4361144, 4576987, 4418003, 4744722, 4710857, 4666685, 4663776, 4773363, 4898931, 5246788, 5545114, 5378219, 5442321, 5533954, 5191707, 5523595, 5810393, 5917712, 6177934, 6154516, 6301310, 6667502, 6878998, 6697471, 7373042, 7222109, 7211423, 7642165, 8044612, 7911905, 8064776, 8381966, 8892039, 8539425, 8843359, 8993556, 9581891, 9579088, 10061470, 10098807, 10669834, 10704802, 11017350, 11781977, 11912488, 12250972, 12478438, 12923844, 13178306]
16773A3178306P46618M85325L74366N00204M45891P69929J78518Q23442P07364
16764A8209963N94649O94982N49056J216642L36124J211042J081331Q37297Q39924
16755B5571010J609379J099820J077845J244472J387672J562392J849136J446895
16747C6848621J905496J890072K404931J851291K763861K418755K736699L659842
16739E6479568K980160L389262L741543M112471M748072M324338N361636N016830
16731I0153880N983920N893573O929274O412376P016270P741494P696890P213293
16723A45040970P814619P657399O479464O645005N616906M277144L420563K463703
16715A89415773N19773n21819k001700l507717m255688n333745o397608o971579
$$ y = [13178306, 13924924, 14410249, 14784615, 15284819, 15730710, 16500639, 16679157, 17502599, 18209963, 18804612, 19499594, 20048650, 21265292, 21601416, 22812458, 23893789, 24731086, 25571010, 27180389, 28280209, 29358054, 30602526, 31990198, 33552590, 35401726, 36848621, 38754117, 40644189, 43049120, 44900411, 47664272, 50083027, 52819726, 56479568, 59459728, 62848990, 66590533, 70703004, 75451076, 79775414, 85137050, 90153880, 96137800, 102031373, 108960647, 115373023, 122389293, 130130787, 137827677, 145040970, 152855589, 160512988, 166992452, 173637457, 179254363, 183531507, 186952070, 189415773, 189935546, 189413727, 187412027, 183904310, 179648622, 174314877, 167917269, 160945690]
16707A60945690p387191p644165q240994p172287p853887p404489o994546o863903
16699A01384228n834069o196319n633712m971421m860869m421824m527293l551105
16691F1387616l715191l117142l117411k797039k656656k170961k701452j823709
16683C9288055k160656j823082j673630j709606j429499j532421j314586j259555
16675B6385020q81735j283072q09340j220398q46592q66604r80896n43086p02019
16666A8251278r51309m06924o74416n65675n41484o15356m37161m24172o12656
16657A3022125m58705l76211m95643o2161j09864o14579l36540j64970p17273
16648I686179J00452l79941m18667j77464j34840l20027l94226j06411N13n01313
$$ y = [160945690, 153558499, 145914334, 137673340, 130501053, 122647166, 115242677, 108248131, 101384228, 95550159, 89353840, 83720128, 78748707, 73887838, 69466014, 64938721, 61387616, 57672425, 54555283, 51437872, 48640833, 45984177, 43813216, 41111764, 39288055, 37127399, 35304317, 33630687, 31921081, 30491582, 28959161, 27644575, 26385020, 25503285, 24220213, 23410873, 22190475, 21343883, 20477279, 19496383, 18953297, 18251278, 17299969, 16893045, 16218629, 15652954, 15111470, 14496114, 14058953, 13634781, 13022125, 12563420, 12187209, 11691566, 11629405, 11519541, 10904962, 10568422, 10403452, 9686179, 9786631, 9406690, 8988023, 8810559, 8675719, 8355692, 7961466, 7855055, 7855568, 7354255]
16638G354255j03096M5901n09376O9495k09865j28192l96790K02128n38798M10295
16628F195957l57343P2963m79860m4888j81643M1712J4926j40550l12349j67892
16618D641033l7245j50784j05043J71126m25630j15656n5719M9664l9779j63825
16608C768142j14033R9259p7341n62570L12583K34512j10582l79894l4382J45386
16598C281080l142k87433Q2846k00190R394P6338k69714k33145M50101j67798
16588B738337j91610j15785N6170m12799N62420l76853L0223Q0142l30527K14633
16578B254351k56082N4380L87206n26702P1613Q5608j96136K24604k27104m3290
16568A828448k08059P2379m2322L35513m24652o6630L52398j99465O7122o8766
$$ y = [7354255, 7251159, 7297060, 6787684, 6857179, 6647314, 6519122, 6122332, 6324460, 5785662, 6195957, 5838614, 5911577, 5431717, 5386829, 5205186, 5246898, 5261824, 5121274, 4808925, 4641033, 4603788, 4453004, 4347961, 4519087, 4093457, 3977801, 3922082, 3971746, 3931967, 3768142, 3654109, 3753368, 3676027, 3113457, 3426040, 3660552, 3549970, 3170076, 3135694, 3281080, 3277938, 2990505, 3073351, 2873161, 2882555, 2958893, 2689179, 2456034, 2906135, 2738337, 2546727, 2430942, 2487112, 2074313, 2636733, 2259880, 2290103, 2370245, 2039718, 2254351, 1998269, 2052649, 2439855, 1913153, 1984766, 2070374, 1874238, 2098842, 1871738, 1828448, 1620389, 1692768, 1650446, 1985959, 1561307, 1494677, 1847075, 1647610, 1714732, 1645966]
16558A645966l24120J88636M16306k91471j56058j23450K06012o0696j22404k1308
16548A357413K91M45637l18964p5518p1833j38087J35610l3612J31120j54342
16538A277715q8960j80514K37594k09533K57458o8043l62001L49912j03895K56535
16528A366268j75312J54713k33883l11743L23582o4227k85906Q4271M2934J55222
16518A055919k71698K06285m3957O3827j86423J89252m17045L84538J85628o2890
16508A103436n43642M21426o8905L15600m77047J55394l96755K50761L16793n3902
16498A023159k02440J27296j73531j04221P6217K64461J44802j56513m42809J04450
16488F60871J76164j36325j66033L61111l48780J49114J01962n7831l0476k30174
$$ y = [1645966, 1321846, 1510482, 1926788, 1635317, 1479259, 1355809, 1561821, 1501125, 1378721, 1357413, 1357704, 1803341, 1484377, 1408859, 1337026, 1198939, 1334549, 1300937, 1432057, 1277715, 1188755, 1008241, 1245835, 1036302, 1293760, 1225717, 863716, 1213628, 1109733, 1366268, 1190956, 1345669, 1111786, 800043, 1123625, 1059398, 773492, 857763, 900697, 1055919, 784221, 990506, 946549, 1010376, 823953, 1013205, 596160, 980698, 1166326, 1103436, 559794, 981220, 912315, 1227915, 750868, 906262, 509507, 760268, 1077061, 1023159, 820719, 948015, 774484, 670263, 746480, 1010941, 1155743, 999230, 556421, 660871, 837035, 700710, 534677, 895788, 547008, 696122, 798084, 740253, 709777, 479603]
16478D79603J87920j24521J38350K45940j24117j64638O5377j1890o1486j43792
16468D86746L2883J24045k21649R0589J62922k15320K66215j28746Q7257p1460
16458F13482k81828K74272k25576R6266Q7618r0147P0372R3286k09063J09107
16448E37789k30826L29897L47093k48184r0700B12237K07142j69181M11442C26846
16437C22586L88875n2769l8808j77009j30717j21756J15467J55549j29460p4156
16427B57802A22549K11899m942n7821R8785K4353l6065R5385j33633O3233q1468
16416C02275K57659k63477J63798M1977A65721O9697J75525j68513J1984J67090
16406D21504M9141f5078C71613A14785J08157i8087C49915q3630O4825J42640
$$ y = [479603, 667523, 543002, 681352, 927292, 803175, 638537, 703914, 692024, 630538, 486746, 519629, 643674, 422025, 512614, 675536, 460216, 726431, 597685, 684942, 613482, 331654, 605926, 380350, 476616, 564234, 474087, 544459, 637745, 428682, 537789, 306963, 636860, 983953, 735769, 645069, 212237, 419379, 250198, 661640, 326846, 322586, 711461, 658692, 619884, 442875, 312158, 190402, 305869, 461418, 331958, 257802, 122549, 334448, 329506, 271685, 370470, 394823, 358758, 454143, 320510, 383743, 302275, 559934, 296457, 460255, 502232, 165721, 235418, 410943, 242430, 254414, 421504, 470645, -65078, 371613, 114785, 222942, -98087, 349915, 266285, 331110, 473750]
16396D73750j36655M7890j36792H3884J26795J39380l5443k3174J24949q7155
16386C29236J03337I9626P781L4730Q4798L61989A03159J18390C5617O7274J11108
16375B13999J2686K05594A8149M99330B8946K64934J23663J16463H6602J82713
16365B69315p8149k2586J07311M2292A34603J73107p0117J18163A53874J28642
16355B82516n7534J75043j79728J34415j15068K25608k24510m9646I4796M95034
16345E89830k45233j64734p2283J50234a2773C24303J01217D061R3441a69784
16334f8891B92118Q6165A07964N7157J55062A15494H749P1946N3127F1184J62826
16323B24010d3904B40470c4730A54885a31627d096A19844J0906J54562b32647
$$ y = [473750, 337095, 384985, 248193, 83884, 210679, 350059, 314616, 291442, 416391, 329236, 432573, 99626, 107407, 142137, 226935, 588924, 103159, 221549, 35617, 102891, 213999, 226685, 432279, 18149, 517479, 28946, 293880, 417543, 534006, 86602, 269315, 191166, 168580, 275891, 318183, 134603, 307710, 237593, 355756, 153874, 282516, 224982, 400025, 220297, 354712, 239644, 465252, 240742, 191096, 94796, 589830, 344597, 179863, 107580, 257814, -12773, 324303, 425520, 4061, 97502, -169784, -68891, 292118, 378283, 107964, 165121, 320183, 115494, 8749, 80695, 133822, 61184, 224010, -43904, 240470, -34730, 154885, -131627, -4096, 119844, 130750, 285312, -232647]
16312A85009J51300C1192K11635H8274a54572C92213k9695A75039K5334K56718
16302D57091B3920R1807N7323D3756a67070B02098A1581J3699K8511O2130j2933
16291A02988L24367A30079m994M3499H0674a38436B34894L7492L8381b9941l0473
16280f0414A27573J42930c6703A41591J31406C532N0416j3214a01700C49496a54901
16268D03926I0047J20329n3058N7261m0571a10712n453A89157p855Q4579a16294
16256B22615A03788L03408a29794D4740a98173B02005P1752r2959O7524j364c4625
16244A14662A2907R8252j2256K2393a17411B37821a19029e4958A09156g1851b5202
16232C9579M3790R2800P9360a34509H4726K51220l2357j02146c107C08598a51244
$$ y = [185009, 336309, 31192, 242827, 88274, -154572, 392213, 362518, 175039, 200373, 457091, 23920, 115727, 173050, 43756, -167070, 202098, 11581, 25280, 53791, 115921, 102988, 427355, 130079, 125085, 168584, 80674, -138436, 234894, 272386, 310767, -29941, -60414, 127573, 270503, -36703, 141591, 272997, 3532, 53948, 40734, -101700, 349496, -154901, 403926, 90047, 210376, 157318, 214579, 174008, -110712, -116165, 189157, 181302, 265881, -116294, 222615, 103788, 407196, -129794, 44740, -198173, 202005, 273757, 180798, 248322, 246958, -34625, 114662, 12907, 111159, 98903, 121296, -117411, 237821, -119029, -54958, 109156, -71851, -25202, 39579, 83369, 176169, 255529, -134509, 84726, 335946, 303589, 201443, -3107, 308598, -151244]
16220C48788j27091D2637a45917F3021a344D4345J90637l7404N1157q3610L2117
16209A97242A9464K33119G2392b7057A01121J34537l9507a66068a0981D7492K35586
16198B83078G6082J66717r3176a23236A4479K20122d8159K2148F0972R5682R7344
16187B53998f3373B4578L23216A04979a12703L949c5015C621L39936c63645a44298
16175A0060e4440a9910j35663a4025k00928J1444B47084a5555B04644j2781K654
16164A94517n5072o5168J166L89193i7374G2973a05244G5656b8560j55118C27191
16152C2656K12347B2496b76162C00044j16349d6780j19645B2607c10668C9317
16141b44790C3672L1406j2735M4459A1314J85787k3832a08501d3774j06668i038
$$ y = [348788, 221697, 42637, -145917, 63021, -1344, 44345, 234982, 197578, 248735, 165125, 197242, 19464, 252583, 72392, -27057, 101121, 235658, 196151, -166068, -10981, 47492, 283078, 76082, 242799, 149623, -123236, 14479, 234601, -48159, -26011, 60972, 156654, 253998, -63373, 24578, 347794, 104979, -112703, -108754, -35015, 3621, 343557, -363645, -144298, 10060, -54440, -19910, -155573, -14025, -214953, -203509, 247084, -15555, 204644, 191863, 194517, 139445, 74277, 75443, 464636, -97374, 72973, -105244, 75656, -28560, -183678, 327191, 32656, 245003, 22496, -276162, 300044, 183695, -46780, -166425, 22607, -310668, 39317, -244790, 33672, 65078, 52343, 96802, 11314, 197101, 173269, -108501, -43774, -150442, -9038]
16129C12318b93995A24082Q748d6157n5228p0714M592j77964A45355D1564d137
16117A280i5134E5501P6155D0501a6720k86457D316Q8791a69266l0757D970a93377
16104b15121F0111J41864g3884C55208a41376C40109q3431A7940b91006D9226
16093C41362b1866k091k30759I4261a81118j63258H0006A6300a31068j57809g8634
16081h6433H332K08548A7433R7388b26210E5827b34456J00392G5576b38084J00123
16070a37961B3508e7894A1795M8684a8816n9737n8989A30097a29104n5741H0373
16058a09189N3577A73764F2294K25807D3937h5988F5628e4990j47804a8849o0585
16047g9434B31525A11167d2050A56920l614k1792f6546b1212l94738A57569J02620
$$ y = [312318, -293995, 124082, 132830, -46157, -101385, -172099, -167507, -345471, 145355, 41564, -4137, 1280, -95134, 55501, 131656, 40501, -16720, -303177, 4316, 93107, -169266, -200023, 4970, -193377, -215121, 60111, 201975, -73884, 355208, -141376, 340109, 256678, 17940, -291006, 49226, 341362, -21866, -23957, -254716, 94261, -181118, -344376, 80006, 16300, -131068, -288877, -78634, -86433, 8332, 216880, 17433, 114821, -226210, 55827, -234456, -134064, 75576, -238084, -137961, 23508, -57894, 11795, 60479, -18816, -78553, -137542, 130097, -129104, -184845, 80373, -109189, -55612, 173764, 62294, 288101, 43937, -85988, 65628, -54990, -202794, -18849, -79434, 231525, 111167, -42050, 156920, 153306, 131514, -66546, -21212, -415950, 157569, 260189]
16036B60189a99878A68598J42535a77063B86711a69242b9405j4597j5198j36220
16026a95420A45069b63590A24838a69538F3798a730B7862b6310H5272J17212H6658
16014c98608J88537I1826a508A30310K5729h5965a6333l93669B17003b32998j2545
16003b45543j7409C11110A20775c26649B15659A1545a16872g559A28642A3614
15992h8301L576k16359K0883L0942B41762A3385K09248a84629H9059K558c2790
15980B49209L81138D0153h736A6022R1438L7583F5679b59427H9905a44878B0050
15968A38299c77267a03426n7531C67344e1662j56367l36455C0849a79555l5451
15958b15006H3291B431f2394o5583A18423k6202a46053b378j25764K4127F1664
$$ y = [260189, -199878, 168598, 311133, -177063, 286711, -169242, -29405, -44002, -59200, -195420, 145069, -263590, 124838, -169538, 63798, -1730, 27862, -26310, 85272, 202484, 86658, -398608, -210071, 91826, -1508, 130310, 156039, -85965, -16333, -410002, 217003, -232998, -245543, -262952, 311110, 120775, -326649, 215659, 11545, -116872, -7559, 128642, 13614, -88301, -84725, -301084, -280201, -249259, 241762, 13385, 222633, -184629, 89059, 91617, -32790, 249209, 630347, 40153, -8736, 16022, 107460, 145043, 65679, -259427, 89905, -144878, 20050, 138299, -377267, -103426, -160957, 367344, -51662, -208029, -544484, 30849, -179555, -215006, 83291, 2431, -62394, -127977, 118423, 92221, -146053, -2378, -128142, -104015, 61664]
15946b26148A22563d4809n0738b4661k2913k05933d6639n511k66784J26903B01337
15934d2567r657A5739J93113i9269B12309r4893g9363o1001D03329C333b3220
15922A55619g8143A23313J4946b0237B0659h2924I4106k2292H288a3696p4593
15911h8289E3565D585M3315J1281I622a6300l6395C90570a94136e5755o2441B11647
15898c78084B23950b61104a28564l2495k30933a76961d3532A16539G441L15431
15888C22872c07549J06122C3249a53933B1746P5739d13126a7266j4958l27844
15878c60068J79814e3219H823b36444m135e9604m1966I1088o282C5111a13410
15866d05150a4233E4658k2662c2086j51798N6289A71271a11322A28987b50677
$$ y = [-226148, 122563, -44809, -95547, -24661, -47574, -253507, -46639, -52150, -318934, -192031, 201337, -42567, -52224, 15739, 208852, -99269, 212309, 117416, -79363, -140364, 403329, 3333, -23220, 155619, -78143, 123313, 138259, -20237, 20659, -82924, 94106, 71814, 8288, -13696, -88289, 53565, 4585, 47900, 59181, 9622, -16300, -52695, 390570, -194136, -55755, -118196, 211647, -378084, 223950, -261104, -128564, -161059, -391992, -176961, -43532, 116539, 7441, 322872, -307549, -201427, 33249, -153933, 21746, 97485, -413126, -17266, -32224, -360068, -180254, -53219, 8823, -236444, -240579, -59604, -101570, 91088, 84806, 35111, -113410, -405150, -14233, 54658, 31996, -32086, -183884, -127595, 171271, -111322, 128987, -250677]
15855A06510N205J0356h8516D1307J74460A8354J25655L1466a65873m4076B81611
15843G1029N504c52696B87926j32160H040L60974D0704j7470a91675A42836d4794
15831A89690b36065a10073c5839r0296D4867a71418B5630b99967B11333K1747
15821B33080k5234i3943m394I536a50295B1664a99854A78151b02719K3920O342
15810a72457g5689l8104e3173A46822b34338A4304a36476F2040j2619J05565d55084
15798a69099N7556H7293a23284k89350F4015C1743a24961l6716A85714F2289a08119
15786b68005O8345g3367c1955N581m4468D8316K62923a8427j35535C1551a89094
15774G9524a37698e5291A24274h3563n279A97652D4324a01395n896k2009j55145
$$ y = [106510, 111715, 122071, -88516, 41307, 215767, 18354, 144009, 175475, -165873, -209949, 281611, 71029, 76533, -352696, 287926, 155766, 8040, 369014, 40704, 23234, -191675, 142836, -44794, 189690, -236065, -110073, -35839, -126135, 44867, -171418, 25630, -299967, 211333, 233080, 207846, -93943, -98337, 9536, -150295, 21664, -199854, 178151, -202719, -178799, -172457, -75689, -113793, -53173, 146822, -234338, 14304, -136476, 62040, 49421, 154986, -455084, -169099, -111543, 87293, -123284, -412634, 64015, 31743, -124961, -161677, 185714, 62289, -108119, -268005, -199660, -73367, -31955, -26374, -70842, 48316, 311239, -18427, -153962, 31551, -189094, 79524, -137698, -55291, 124274, -83563, -88842, 197652, 44324, -101395, -107291, -129300, -284445]
15763b84445A51474D9480e1742l00858B19312r1589B7596a90029R1799c8115l60320
15752c98435O6812a45608j24714D6494O0918L1833b22515b1209B9059i8878F9747
15740e0647D11011c06877c5536C6811P2412c99233B92184h6232M1169H2201C8817
15728A1840b53475g3984C6528a99577B06288b59193h9687j39622J09627G2650
15717d7740E7696J36244o6100a53052l36720A8686L6659a73595q4539R5814P01
15706a61619e019A2918K95184a27411B27546b59479B18318b41901B9944b57590
15695c46746e2541h373n4232B26336a14778L5652K4945k34268G8451b22506L2918
15684a89588D4904M2853B8516a30739B554c92870A19124c46232J56698F0666O0799
$$ y = [-284445, 151474, 49480, -51742, -352600, 219312, 127723, 27596, -190029, -98230, -38115, -398435, -331623, -145608, -270322, 46494, 107412, 139245, -222515, -21209, 29059, -98878, 69747, -50647, 411011, -306877, -35536, 36811, 109223, -399233, 292184, -86232, -45063, 82201, 38817, 11840, -253475, -73984, 36528, -199577, 206288, -259193, -89687, -229309, -119682, 72650, -47740, 57696, 193940, 127840, -153052, -489772, 18686, 55345, -173595, -258134, -162320, -161619, -5019, 12918, 308102, -127411, 227546, -259479, 218318, -241901, 29944, -257590, -346746, -52541, -8373, -62605, 226336, -114778, -79126, -54181, -288449, 78451, -222506, -189588, 44904, 87757, 28516, -130739, 2554, -392870, 119124, -346232, -189534, 60666, 121465]
15673A21465a73317A18427a67469f9766c1650B07670A01237a49454F092b58800
15662B17317n0832b22223i8596B30114j12240f7659A66705J36878a97107B47434
15651a25647A87364a7863O658r5036A45743d80833A55349P9643a62594g2957A2952
15639A04170a80087A43642J7667J84001b31496E474K1535c18730n1754J40386
15629b30098M8086D0064g9732A7658a07468L7235A7795J2687a65020N9553l5536
15618a41003l8099c770A6378N2068J43913a4656l18167h9346A88641e7249B10802
15606c6364j5965n0675b9370H581f605l5054n3696k784l2379e3298m8782d8205
15593b26104C23894b20153B22685a41304e1550l16772h7053B70717b27704A33786
$$ y = [121465, -173317, 118427, -167469, -69766, -31650, 207670, 101237, -149454, 6092, -258800, 217317, 166485, -222223, -98596, 230114, 117874, -67659, 166705, 303583, -197107, 247434, -125647, 187364, -17863, -11205, -106241, 145743, -480833, 155349, 234992, -162594, -72957, 12952, 104170, -180087, 143642, 161309, 345310, -231496, 5474, 27009, -318730, -370484, -230098, -182012, 40064, -79732, 17658, -107468, -70233, 17795, 30482, -165020, -105467, -141003, -179102, -3770, 16378, 68446, 212359, -14656, -332823, -89346, 188641, -57249, 210802, -36364, -52329, -103004, -29370, 8581, -6605, -41659, -95355, -98139, -130518, -53298, -102080, -48205, -226104, 323894, -220153, 222685, -141304, -51550, -368322, -87053, 270717, -227704, 133786]
15582F3241J46154Q7838a35554H4946d0425D7746N178G161b12424F8156L3783
15571A01939a24543N1954q2954a3392A67705d768l869C19548e7391n6982D8993
15559A19670J56721j05749b02446K1874G7210g5681k2923o02360a01195m1382
15549a42577A09066g2224o1025k2398J5871B02527e6526o8805e1202k21194C71100
15537A80902k2151K4152H1223N6727F8665K43214C0911M8775a0677j49717c038
15525b00183A42J48924i5123D0468i0261C9759a06143k03874J24636l52750A07571
15513I7496g9778H8085b9096a1235o9017j7024d3185H9341B3847a84782B11831
15501I9731c7105I8466J08124h3238A58626J9888a48506p4482h3129C0362P2469
$$ y = [63241, 209395, 297233, -135554, 84946, -40425, 47746, 52924, 7161, -212424, 68156, 101939, -124543, -72589, -155543, -13392, 167705, -4768, -8637, 319548, -57391, -114373, 48993, 119670, 276391, 170642, -202446, -180572, 77210, -75681, -98604, -700964, -101195, -142577, 109066, -72224, -133249, -155647, -139776, 202527, -56526, -125331, -51202, -272396, 371100, 180902, 158751, 182903, 81223, 137950, 68665, 311879, 30911, 79686, -10677, -160394, -3038, -200183, 142, 149066, -95123, 40468, -90261, 39759, -106143, -310017, -185381, -538131, 107571, 97496, -79778, 88085, -29096, -11235, -80252, -97276, -43185, 89341, 23847, -184782, 211831, 99731, -37105, 98466, 206590, -83238, 158626, 178514, -148506, -222988, -83129, 30362, 102831]
15490A02831a86859h88l20128G5664g0469B54689c30890a26607B90897F328a34835
15478I7765J8124a11111C5442M8821a04660k67085a48380A16674e0471C13669
15467H7306N9801b2341r8586A81264o8417l0199i0511B97354R2721m3353a30791
15455f0762j11153q3233A34798a8989B97677c9019B35312a16727A46995D9184
15444B7362b15385H5207a5008A90795n0718b46559A28988a71707A28485b90289
15433A1453a34992A8131b07046K6970A28653l0937E344b10616F6770J25895a9521
15421a59021H9129f4939B3113a51200B3141a58615j4741a7191H8799b05815i849
15409A20171b00379A88952b86791J33150I9316m6937c4146F6396h0354A66828
$$ y = [102831, -186859, -888, -321016, 75664, -70469, 254689, -330890, -126607, 290897, 6328, -134835, 97765, 115889, -111111, 35442, 84263, -104660, -371745, -148380, 116674, -50471, 313669, 87306, 147107, -22341, -120927, 181264, 112847, 82648, -90511, 297354, 390075, 346722, -130791, -60762, -171915, -255148, 134798, -18989, 297677, -39019, 235312, -116727, 146995, 49184, 27362, -215385, 85207, -15008, 190795, 140077, -246559, 128988, -171707, 128485, -290289, 11453, -134992, 18131, -207046, -180076, 128653, 97716, 5344, -210616, 66770, 192665, -19521, -159021, 89129, -64939, 23113, -151200, 23141, -158615, -173356, -17191, 88799, -205815, -9849, 120171, -200379, 188952, -286791, -153641, 99316, 52379, -34146, 66396, -80354, 166828]
15398a95335L3699h456j54397A22432a46955C28255f1050A2536e261A1346g4890
15386a34096F0874f1792G4378a89926C35484e5664D1183b06106B7857J40877a06260
15374H6611b29182B93319i187p9975m18363J34326B46016j10094b28369N3451
15364a74918k6327e0028F7412K8388J54296d5641C60968b15634E7733f8183j9703
15353h7886k03644a37120q134j36025I5217J57902a22561F1912f5942l0383j82755
15342b79080H8255c8807B5572J00731C9885c41667J66638A34678J51479j25788
15332A60369m9217b7538E2760K30980A04778a51740A28520d5461k03588a15317
15321b8249j72122D0857a27414j01204h4345C27362a64010F1338f492A42945a48666
$$ y = [-195335, -161636, -8456, -162853, 122432, -146955, 328255, -61050, 12536, -5261, 11346, -74890, -134096, 60874, -61792, 74378, -189926, 335484, -55664, 41183, -206106, 27857, 168734, -106260, 86611, -229182, 293319, -9187, -89162, -507525, -373199, 246016, 135922, -228369, -174918, -201245, -50028, 67412, 95800, 250096, -45641, 360968, -215634, 57733, -68183, -87886, -291530, -137120, -145254, -281279, 95217, 253119, -122561, 61912, -65942, -96325, -279080, 88255, -38807, 25572, 126303, 39885, -341667, -175029, 134678, 286157, 160369, 111152, -27538, 52760, 283740, 104778, -151740, 128520, -45461, -249049, -115317, -28249, -200371, 40857, -127414, -228618, -84345, 327362, -164010, 61338, -6492, 142945, -148666]
15309b14804F3346M4609N040J71688p6309D5860J55752p6847J76227A06291P9362
15298A85653H1870E757a91002g7334B13259R81a17283j03828C6013J35751F3490
15286b1340q926m18910a02425c9024j3986B51184k3527A9768R2750a93027g7839
15274C12329a93929C8809K72751h5167B33387E2854C20J12967J39079b33967g7387
15262A23444M6701G9162J44790n6186A9013b9480B05920J35940L4976g8703B88342
15250i3533A59298b00515C39644J3173N93342R88630r4145k123K33323A018256
15239B65164a33501B94533o3339p395C0780J93340J6704a23956M0856A84700b51759
15227A00261C2680J71812r712J91511A24268k7107J18666b843r3629k49282a02671
$$ y = [-214804, 63346, 107955, 112995, 284683, 208374, 45860, 201612, 124765, 300992, 106291, 185653, 81870, 5757, -191002, -77334, 213259, 214240, -117283, -221111, 36013, 171764, 63490, -21340, -30266, -449176, -102425, -39024, -53010, 251184, 227657, 19768, 112518, -193027, -77839, 312329, -193929, 38809, 311560, -85167, 233387, 52854, 320, 113287, 252366, -233967, -77387, 123444, 170145, 79162, 223952, 167766, 19013, -29480, 205920, 341860, 376836, -78703, 288342, -93533, 159298, -200515, 339644, 352817, 946159, 1934789, 1840644, 1838521, 2071844, 1018256, 265164, -133501, 294533, 231194, 223799, 30780, 224120, 240824, -123956, -83100, 184700, -251759, 100261, 32680, 204492, 194780, 386291, 124268, 97161, 215827, -2843, -96472, -345754, -102671]
15215I7330R4682G3966N5169f6495I7343h962k12221b3443A75470i7955A28727
15203h7745H7075i4380A43276L2495J63289A53719b40187M9830Q2398B54548B0079
15191D4217J39314N293h299B9439a25201b8458A33853R8585J2125b922j02891
15180a05813I3237Q7928J45927I2653c6036j77938l4097d9156D594P904Q4459
15169I6957e03A19260a10790a7371A04103E79c18911d0626I0649J37725q2873
15158A45501J59720c01305J04832B74505G6397c3742m9110D2144K7946A6357M05218
15147D21575A42813K5203D8534a48566g1981a7537B55455J34293A52144K8374
15137A80518m0353k4510j8407J80077J8717J26223A13280Q284R9777C4622J45596
$$ y = [97330, 192012, 73966, 129135, -66495, 97343, -8962, -221183, -23443, 175470, -97955, 128727, -87745, 87075, -94380, 143276, 175771, 339060, 153719, -240187, -190357, -107959, 254548, 20079, 44217, 183531, 188824, -8299, 29439, -125201, -28458, 133853, 232438, 244563, -2922, -105813, 93237, 181165, 327092, 92653, -36036, -213974, -248071, -49156, 4594, 12498, 96957, -503, 119260, -110790, -17371, 104103, 579, -318911, -40626, 90649, 228374, 145501, 305221, -301305, -196473, 274505, 76397, -33742, -82852, 42144, 70090, 16357, 421575, 142813, 168016, 48534, -148566, -71981, -17537, 255455, 389748, 152144, 180518, 140165, 115655, 97248, 277325, 296042, 422265, 113280, 121564, 221341, 34622, 180218]
15126A80218a7903H3062K85529o8598a8781B2498J05982Q2923j8697H7423B3281
15114B82915a18588G8448J38457o5719a06249j9615a0168A00076b66833A49750
15103D12303D3955Q6319K13133H5185j2558k4892L44191A88435b0240j57070A09628
15091d555J02B24918q3682J35572j10129a612B19926g9119C48648j6491F2470
15079a58105B28598J36189A62742O0799O4379o0775r0236m2078c2115B10398A5592
15067B40280M0326D7455J4437J11009A1307O6578J14098b2442B90578b1424B41089
15055C75281j35029D3942K77446A8084K40742G3997R9616K11142G8860J27778
15045B06638p7192Q909K01611A41014L41127B35517A09339L729f3676A06623k5742
$$ y = [180218, -17903, 83062, 368591, 299993, -18781, 22498, 128480, 211403, 192706, 87423, 23281, 282915, -118588, 78448, 216905, 151186, -106249, -125864, -10168, 100076, -266833, 149750, 412303, 43955, 130274, 343407, 85185, 72627, 47735, 391926, 188435, -20240, -177310, 109628, -4555, -4453, 224918, 141236, 276808, 166679, -1612, 219926, -79119, 348648, 332157, 62470, -158105, 228598, 364787, 162742, 223541, 287920, 227145, 136909, 94831, -32115, 210398, 15592, 240280, 280606, 47455, 61892, 172901, 11307, 77885, 191983, -22442, 290578, -21424, 241089, 375281, 240252, 43942, 321388, 18084, 258826, 73997, 173613, 384755, 78860, 206638, 129446, 138355, 339966, 141014, 482141, 235517, 109339, 113068, -63676, 106623, 80881]
15034H0881M13213A6115J82483a06789A6871h79A82635E6334d5502q5953B25818
15022C36471H3846L1703J24517C2852M1590R2269P6219B9118J54834O1146O3122
15011C08220d51277C56478G5891M16145k06402c9158A69180F9397R4271h4206
15000A03773a20382L9165E4717K24893r5583J97032B0815M40798j58574O2257
14990C65296n1034n8224B2527M4115K84126j58369g4992A36874K21256r1446n070
14979B61614h1195l2419D33684B06653k4636K17255j98232J59971k3531K27898
14969E65378A69512J37560g1145H1173K35965j39156a76682A81448L4416F8521
14958E69712A17814Q5055n4527h5663C3238M18497B1379b6825C74507o8339o6600
$$ y = [80881, 494094, 16115, 198598, -106789, 16871, -879, 182635, 56334, -45502, -131455, 225818, 336471, 83846, 115549, 240066, 32852, 74442, 166711, 242930, 29118, 183952, 245098, 308220, -451277, 356478, 75891, 492036, 285634, -39158, 169180, 69397, 163668, -84206, 103773, -120382, -81217, 54717, 279610, 184027, 381059, 20815, 461613, 303039, 365296, 314262, 256038, 22527, 66642, 350768, 192399, -74992, 136874, 358130, 266684, 261614, -81195, -113614, 433684, 206653, 182017, 399272, 201040, 361011, 337480, 565378, 169512, 307072, -71145, 81173, 317138, 177982, -176682, 181448, 215864, 68521, 569712, 117814, 202869, 148342, -85663, 33238, 451735, 21379, -26825, 374507, 306168, 239568]
14947B39568c38455A02466L69137k10889o3981C6792M52441A89026d5449A67737
14936C33233K04350f1125A59908o1290K30331N313K751p212p9278K59767B52662
14924D66093r9969r9287r0486M01093A72474b69351A50896E6951L71669E7403
14913B96738j48082K27985c2059D56494r9371q7357A1674K44677H1554M97025
14903E78579A73821l2128K72888r5510I2904M1093K95128K73010A19985J73167
14893B93152m5985L78169G3850P8578B7480J01141J74802A08264L54375n7208
14883D05431j30792J98024j90757K23872B23739a04483B25090K2178Q2262o6904
14873B62626J09074m5970j40307N9444K38162Q2178k42142J58910L22841C37889
$$ y = [239568, -338455, 102466, 471603, 260714, 196733, 36792, 489233, 189026, -45449, 167737, 333233, 537583, -61125, 159908, 98618, 328949, 334262, 337013, 329801, 250523, 510290, 252662, 466093, 366124, 266837, 176351, 577444, 172474, -269351, 150896, 56951, 428620, 57403, 296738, 148656, 376641, -32059, 456494, 357123, 269766, 11674, 256351, 81554, 578579, 173821, 141693, 414581, 319071, 92904, 133997, 429125, 702135, 119985, 293152, 247167, 625336, 73850, 152428, 27480, 128621, 303423, 108264, 462639, 405431, 274639, 472663, 281906, 505778, 223739, -104483, 225090, 247268, 329530, 262626, 371700, 325730, 185423, 244867, 483029, 565207, 323065, 481975, 804816, 337889]
14862D17743B01038K31008j07065j30080L79641B74578M15062k92202J55256j00544
14852D52150k07571K05036j14475A21896J48846J07692j82427J32867A57205J65143
14842C22348j17760K27579j27456j12654k080L90279B07022n1670L68223p2184
14832D51391A63053K26072M0836A67469q2458N35885k24534E7387L40888j78406
14822B19869J43448l7831j09047K44300j52962L88773B92281K10514o4174A24754
14811D14267M9164J6755j51068J96327J56690L2985J2070k99523q9617m9940Q1496
14800C69606J60020j95117J68575R6300k18075O7596J93534B38274M21469j31929
14790E27814B62898K03760J53863O4380j93332J32556K315B21221L88576m8834
$$ y = [417743, 201038, 432046, 324981, 194901, 574542, 274578, 689640, 397438, 552694, 452150, 244579, 449615, 335140, 121896, 270742, 378434, 196007, 328874, 157205, 322348, 204588, 432167, 304711, 192057, 189977, 580256, 207022, 155352, 523575, 451391, 163053, 389125, 429961, 167469, 85011, 620896, 396362, 57387, 398275, 219869, 363317, 325486, 216439, 460739, 307777, 696550, 292281, 502795, 438621, 124754, 414267, 463431, 480186, 329118, 525445, 682135, 715120, 727190, 427667, 338050, 288110, 369606, 529626, 334509, 503084, 599384, 381309, 448905, 642439, 238274, 659743, 527814, 262898, 466658, 620521, 684901, 491569, 624125, 626440, 221221, 609797, 560963]
14780E60963L9544k24289J9116P6605j14834P9868K21549N6569l09682r4399L28024
14769F39034n5722l7806p3989P6351m4815j12854o9976C1772M34315m455K83245
14758G44877B11274M10911N5134k2724j64266L81126j78378l02619N8712L2823
14748D81993K12937J55819q7414j68203J43722A60391N51850k51636K67550p4946
14738F53209j48130k9501M22110C97930M71171j72075m5889o4729k68345J33003
14728D51066K84379P735J12634l84597K00876B81453M26185N7575k26334L76546
14718I15425j22283K73542E03644O0160B24431P64597l59304R7787Q8334J8782
14708H34627J7708k46022o2285J85245o7710n3567K48960j99291J35157J8806
$$ y = [560963, 600507, 376218, 395334, 471939, 357105, 436973, 658522, 715091, 405409, 311010, 639034, 583312, 545506, 471517, 547868, 503053, 390199, 320223, 31772, 466087, 461632, 744877, 211274, 622185, 677319, 654595, 490329, 871455, 693077, 390458, 449170, 481993, 694930, 850749, 763335, 595132, 738854, 160391, 712241, 460605, 728155, 653209, 505079, 475578, 897688, 397930, 869101, 697026, 651137, 586408, 318063, 451066, 735445, 743180, 855814, 471217, 672093, 281453, 707638, 765213, 538879, 915425, 793142, 1066684, 503644, 563804, 224431, 989028, 629724, 727511, 815845, 834627, 852335, 606313, 544028, 729273, 661563, 607996, 856956, 657665, 792822, 811628]
14698H11628N0976q1061k52331N23959k39818n4927R7226K3547m6116m2979K57422
14687A047526j47544m27838M40162j23067q8663J74461l6058O529K99840n16058
14677F29290L22935l5281j13843j52969K01403N3414q628j8461j10009J26864
14667H94715M54886n95777J78398j00512J33132l11333O57977o04635K21447J77458
14657A105756k58816J26240k26934L55429l67317K48421l60253K10428J08352
14648I41306r8139J00048J00147l1172k1795R353J96156J23086j18707j26780
14638A073503J36768l4966J55906j07234M115j12253l01667K92968J46499J08154
14628A361793j83599K86271k56699k24941L46627k25764K44519m44217l3024K11037
$$ y = [811628, 862604, 781543, 529212, 1053171, 813353, 758426, 855652, 879199, 833083, 790104, 1047526, 899982, 472144, 912306, 789239, 700576, 875037, 838979, 845508, 1145348, 629290, 952225, 916944, 803101, 650132, 851535, 904949, 896321, 877860, 767851, 894715, 1349601, 753824, 932222, 831710, 964842, 653509, 1311486, 706851, 928298, 1105756, 846940, 973180, 746246, 1101675, 734358, 982779, 622526, 832954, 941306, 843167, 943215, 1043362, 1012190, 990395, 999748, 1195904, 1318990, 1200283, 1073503, 1210271, 1175305, 1331211, 1223977, 1228092, 1115839, 814172, 1107140, 1253639, 1361793, 1178194, 1464465, 1207766, 982825, 1329452, 1103688, 1348207, 903990, 870966, 1082003]
14618A082003l8443j46424J48573M46356K39138m72131k5672L66656l02709k42261
14608A055086M31741k16253L12014k53201R4878J56296m18265J39903J65738j62399
14598A305538j20673J88550J26950J91931k55044o8898J00232k16488L89485k4371
14588A617212O6518l4027L2036O3231k64437N84674n09094J62561q7518k20513
14578A410643M06838j68448K44359O5605J93044m82343K03948k39502L95036j48774
14568A880406q6215k1656L04045J34352k84833R9883r0251K40422P988R5409m1199
14557B238351O93581j50408J35978j09210L37611K92512M47301P01444J090966
14548E678126L485190J1483940J7782064L423436B0379285I040688k845450m50537
$$ y = [1082003, 1043560, 897136, 1045709, 1492065, 1731203, 1259072, 1233400, 1600056, 1297347, 1055086, 1486827, 1270574, 1582588, 1329387, 1424265, 1580561, 1162296, 1302199, 1467937, 1305538, 1184865, 1373415, 1500365, 1692296, 1437252, 1368354, 1468586, 1252098, 1641583, 1617212, 1683730, 1649703, 1681739, 1744970, 1480533, 2065207, 1556113, 1718674, 1631156, 1410643, 1817481, 1649033, 1893392, 1958997, 2152041, 1669698, 1873646, 1634144, 2029180, 1880406, 1794191, 1772535, 2076580, 2210932, 1926099, 2025982, 1935731, 2176153, 2184141, 2279550, 2238351, 2931932, 2781524, 2917502, 2808292, 3145903, 3438415, 3885716, 4587160, 5678126, 9163316, 20647256, 38429320, 41852756, 20379285, 9040688, 6195238, 5744701]
14540E744701j147961k075844p26956l81351P7038L73817k20284j1545J43915
14531A775530l28601L57363K42376j85903L3035j31387K46677j90142K67956k5155
14521B061749L14279k40369j3324Q6249q2470J60582n9850K3613K8731J11708
14511B390898m4783J10762K24739j58397K26755l80341j5033J50998k4468K96466
14501B777596J19707l40653J99355j0449j49733O5477K27253J02330k24950K24749
14491B990682N6616L44417k62455l53365P51643k28089k57384K09220J28542l0154
14481C349673Q5097j89153L69351j4058k60646J42936M64168j83715m81662N65265
14471C847256j74114j5456R9589j36443J11104M09142q8726j28877q4209K67157
$$ y = [5744701, 4596740, 2520896, 1793940, 1412589, 1489627, 1863444, 1643160, 1631615, 1775530, 1446929, 1804292, 2046668, 1860765, 1893800, 1762413, 2009090, 1818948, 2086904, 2061749, 2376028, 2135659, 2122335, 2208584, 2126114, 2286696, 2226846, 2250459, 2279190, 2390898, 2346115, 2456877, 2681616, 2523219, 2749974, 2369633, 2354600, 2505598, 2481130, 2777596, 2897303, 2556650, 2756005, 2745556, 2595823, 2661300, 2888553, 2990883, 2765933, 2990682, 3047298, 3391715, 3129260, 2775895, 3527538, 3299449, 3042065, 3251285, 3379827, 3349673, 3434770, 3245617, 3614968, 3600910, 3340264, 3483200, 3947368, 3763653, 3281991, 3847256, 3673142, 3657686, 3757275, 3620832, 3731936, 4141078, 4052352, 3923475, 3839266, 4106423]
14461D106423N6233j18676K09688K11932m53688P54909k79668m0176R2958K08544
14451D748479j50428J94935R4570j56268M06625K80218o01282K72041J95541l64159
14441D920272K51960L16939l00173M47518l5722m01823L36966j81006L43172N28482
14431F226585r7855k2417k53561Q213L85769J86533L4904K69831k20307J74436
14421F692131K8277K62902k1045R4326J45715J68037J66477Q0077J29347K32359
14411G978603m25576N10160r200j94705M96685Q6788M38054j60442Q9580k9906
14401H780041O61045j26304p4059J76293L56451N1357L73808l59272L88397L51787
14391A0579544k41j86530P47612K8639L2473K25675K58017J12755J93335J65536
$$ y = [4106423, 4162656, 4043980, 4253668, 4465600, 4011912, 4766821, 4487153, 4446977, 4539935, 4748479, 4598051, 4792986, 4887556, 4731288, 5137913, 5418131, 4816849, 5088890, 5284431, 4920272, 5172232, 5489171, 5188998, 5636516, 5600794, 5198971, 5535937, 5354931, 5698103, 6226585, 6128730, 6106313, 5852752, 5860965, 6246734, 6433267, 6468171, 6738002, 6517695, 6692131, 6720408, 6983310, 6962265, 7056591, 7202306, 7370343, 7536820, 7616897, 7746244, 7978603, 7553027, 8063187, 8053987, 7859282, 8355967, 8442755, 8880809, 8720367, 8809947, 8780041, 9441086, 9314782, 9240723, 9417016, 9773467, 9824824, 10198632, 9839360, 10227757, 10579544, 10579303, 10392773, 11140385, 11169024, 11201497, 11427172, 11685189, 11797944, 11991279, 12156815]
14381A2156815M07132o3546O18927K77564l8065m403N37596P11907K03051N0804
14371A4857782K74940N69452j8183N32309L80409L11863N99622L46272l14007
14362A7540459O27259M61389M49444O97748K21350M04185Q20589K01325J77403
14353B1601151Q46324P92703N91416M15113O66179L24534Q81393P97876P01481
14344B7618170K62085R34177P93639Q01366Q53164Q30977J219694R05900M26745
14335C4645917J577690O81247J001074J436100J478342J122249J091119J476440
14327D4510178J870073R36197K053455J269934J972774J792722J837620K055129
14319E8298082K618399J499364K512286K706632K723134K687413K931839L019087
$$ y = [12156815, 12563947, 12500401, 13119328, 13396892, 13358827, 13354424, 13892020, 14603927, 14806978, 14857782, 15132722, 15702174, 15683991, 16216300, 16596709, 16908572, 17508194, 17854466, 17540459, 18167718, 18629107, 19078551, 19776299, 19997649, 20401834, 21222423, 21423748, 21601151, 22447475, 23240178, 23831594, 24246707, 24912886, 25237420, 26118813, 26916689, 27618170, 27880255, 28814432, 29608071, 30409437, 31262601, 32093578, 33313272, 34219172, 34645917, 36223607, 36904854, 37905928, 39342028, 40820370, 41942619, 43033738, 44510178, 46380251, 47316448, 49369903, 50639837, 52612611, 54405333, 56242953, 58298082, 60916481, 62415845, 64928131, 67634763, 70357897, 73045310, 75977149, 78996236]
14311G8996236L196419L768920L504791L697500L921687M890085M578615M713113
14303A11267366N460771N286899N927011O676995O667214P284109P938698P751831
14295A64260894Q479180Q978873R973048J0409242J1094688J1890215J2327270
14288B37413410J2624407J3901038J4174629J4805217J5562710J5545141J6197810
14281C40224362J6325451J5859690J5766254J5617781J4370894J3042065J1609621
14274D42816118R466096P196924L540249k493924o943337j799537l109207l287532
14266D45385850m340926q414632j2343074j4538328j5280099j6107573j6468722
14259C57892496j6299078j6605844j6180635j5314817j5397053j4624817j4032233
$$ y = [78996236, 82192655, 85961575, 89466366, 93163866, 97085553, 101975638, 106554253, 111267366, 116728137, 122015036, 127942047, 134619042, 141286256, 148570365, 156509063, 164260894, 172740074, 181718947, 191691995, 202101237, 213195925, 225086140, 237413410, 250037817, 263938855, 278113484, 292918701, 308481411, 324026552, 340224362, 356549813, 372409503, 388175757, 403793538, 418164432, 431206497, 442816118, 452282214, 459479138, 463019387, 460525463, 453582126, 451782589, 448673382, 445385850, 441044924, 432630292, 420287218, 405748890, 390468791, 374361218, 357892496, 341593418, 324987574, 308806939, 293492122, 278095069, 263470252, 249438019]
14252B49438019j2745478j1157672j2003728j0911688j1222092r694958r365482
14245A72336921q601090p999431p495738p428361o846679o385424n798328n161792
14237A16620078n286618n061640m975710m070710m604812l766239l424179k863484
14229H2566686l674289l081822l346900k634168k510055l013031k179824j842464
14221F0284133k129593j927966j830435j817146j978753j848835j457118j392061
14213D5902226r71228j445736k054603j117874p69574j415977n84426p29568j233052
14204C5580188j240402q11731r03238p15502q22860q41586j018861o85718p34663
14195B7805627p66818n22398o74062p17182q83033k92630q09896m13157m29884
$$ y = [249438019, 236692541, 225534869, 213531141, 202619453, 191397361, 181702403, 172336921, 163735831, 155736400, 148240662, 140812301, 133965622, 127580198, 121781870, 116620078, 111333460, 106271820, 101296110, 97225400, 92620588, 88854349, 85430170, 82566686, 78892397, 75810575, 72463675, 69829507, 67319452, 64306421, 62126597, 60284133, 58154540, 56226574, 54396139, 52578993, 50600240, 48751405, 47294287, 45902226, 44930998, 43485262, 41430659, 40312785, 39543211, 38127234, 37542808, 36813240, 35580188, 34339786, 33528055, 32624817, 31909315, 31086455, 30244869, 29226008, 28540290, 27805627, 27038809, 26516411, 25842349, 25125167, 24242134, 23949504, 23139608, 22726451, 22296567]
14186B2296567o11418m80943o17849l40397k99469n73388l06233l38073k14745
14177A8514052r50286J9054m91584l63268j68694l68345P7654p47842l04188j20534
14167A5096019o02182j81732o7714o05489j01652Q247j67475m34620m06845l48098
14157A2188459l1569N5693j51539n64059K25722l93957j02379m67403P3879l89793
14147A0443054N1172k66671j14185l14424j29045j07717j1219k64590k77176N9989
14137I069188j32515n12807K26227l67943l1199M11661o60563J12019j14879l68931
14127G630258m39657N21722o54634K59198q827k80599j21044K3375j0485k34096
14117F685211k24639L15066l49953N7614N6081k17828m7705l24193o6944l4392
$$ y = [22296567, 21685149, 21204206, 20586357, 20245960, 19946491, 19373103, 19066870, 18728797, 18514052, 17563766, 17582820, 17091236, 16727968, 16559274, 16190929, 16268583, 15520741, 15216553, 15096019, 14493837, 14312105, 14244391, 13638902, 13537250, 13545497, 13378022, 12943402, 12536557, 12188459, 12156890, 12212583, 12061044, 11496985, 11722707, 11328750, 11226371, 10758968, 10832847, 10443054, 10494226, 10227555, 10113370, 9798946, 9669901, 9562184, 9550965, 9286375, 9009199, 9069188, 8936673, 8423866, 8650093, 8282150, 8250951, 8662612, 8002049, 8114068, 7999189, 7630258, 7190601, 7712323, 7057689, 7316887, 7308060, 7027461, 6906417, 6929792, 6919307, 6685211, 6460572, 6775638, 6425685, 6483299, 6539380, 6321552, 6273847, 5949654, 5882710, 5848318]
14107E848318n2454R6787k03145M5338j58465j04089J36550j60185k64170K86254
14097E470739j88379j76597Q9214m67369L88856j78851J385k28903K74406n96559
14087D387942j25525K68067L01943k21170l2130l763j39393k08153j71206n247
14077D051365J39650L7730l09368q2844L75061k56263P8811j33365q4306L21521
14067D137992m88182L34862n94649N05273m03643J7569j568j84494J11930J08357
14057C543447K05163j36169k36294M49258k59371J752m60156O12402n67910j38057
14047C014065O6717q7764j9686K42479k44499L3009n7800J3744o1537j72310P5401
14036B801819m4972q0054K05540m43515K60982K4857q3230J55897N01783o44239
$$ y = [5848318, 5795864, 5892651, 5689506, 5734844, 5576379, 5472290, 5608840, 5448655, 5184485, 5470739, 5282360, 5105763, 5194977, 4727608, 5116464, 4937613, 4938998, 4710095, 4984501, 4387942, 4262417, 4530484, 4832427, 4611257, 4579127, 4575364, 4435971, 4227818, 4056612, 4051365, 4191015, 4228745, 3919377, 3836533, 4211594, 3955331, 4034142, 3900777, 3816471, 4137992, 3649810, 3984672, 3390023, 3895296, 3491653, 3509222, 3507654, 3323160, 3435090, 3543447, 3748610, 3612441, 3376147, 3825405, 3566034, 3567786, 3107630, 3720032, 3152122, 3014065, 3080782, 2993018, 2973332, 3215811, 2971312, 3004321, 2946521, 2960265, 2898728, 2726418, 2801819, 2756847, 2676793, 2882333, 2438818, 2699800, 2724657, 2641427, 2797324, 3299107, 2654868]
14026B654868K8677r6367L5867n1973j3950k10080J16748j42857M18403m21513
14016B317823J22566j23564n32913N71962k40377k59972M18517k27448K893l8017
14006B011470k18178L68360J11587l11279j97220K05265K15707m56832J90865
13997A919745J18797n44241M80835k07705J17391m40669N37932O4363O59765J822947
13987D529160Q670208K0046004J0458928j7997050j1878357o205229k142489j288060
13979D193115m08408p68926r8268j20151l91164j05625j04375J11088L9340J46489
13969B493115k57882J44972k54719K17350N8295p4162j49841o8480m4558J98928
13959B263018l84182j8139j98916J20358J02359k6893N3046J85765k46424o5816
$$ y = [2654868, 2683545, 2587178, 2623045, 2571072, 2557122, 2347042, 2463790, 2320933, 2739336, 2317823, 2440389, 2316825, 1783912, 2355874, 2115497, 1855525, 2274042, 2046594, 2049487, 2011470, 1793292, 2161652, 2273239, 1961960, 1764740, 1970005, 2185712, 1728880, 1919745, 2038542, 1494301, 1975136, 1767431, 1884822, 1444153, 1982085, 2046448, 2706213, 4529160, 13199368, 33245372, 43704300, 25707250, 13828893, 7623664, 5481175, 4193115, 3784707, 3015781, 2917513, 2797362, 2406198, 2300573, 2196198, 2307286, 2346626, 2493115, 2235233, 2380205, 2125486, 2342836, 2401131, 2326969, 2177128, 2108648, 2064090, 2263018, 1878836, 1860697, 1661781, 1782139, 1884498, 1857605, 1910651, 2096416, 1849992, 1784176]
13949A784176j18166n3159P7341J00243j43888k09202K26062l6880k9504L3553
13939A630576k32163K58573L9235k52796J63793l27418o3040K82152J76776j41715
13929A533973j19367Q1341k37970K19143r4935J77459k82581K6784j16132k3464
13919A164251K15565j06680o358q6979M6194K79210k49391l1833J90249l85623
13909A028605L99518k01424K93344m47553J94315K77090k69382k98337N25322
13900A501498l26833N6651j87054J26268j38985L65130j48967n8656J71552k19498
13890A141106l0012o2580K44643l13654K0064J78789o1620M4929J73071l26725
13880A008011J41153p9640J04436l2818j06437j08682K95828l90995M96865j97303
$$ y = [1784176, 1666010, 1612851, 1690192, 1790435, 1646547, 1437345, 1663407, 1626527, 1597023, 1630576, 1398413, 1656986, 1696221, 1443425, 1607218, 1279800, 1216760, 1498912, 1675688, 1533973, 1414606, 1495947, 1257977, 1477120, 1382185, 1559644, 1277063, 1303847, 1187715, 1164251, 1379816, 1273136, 1266778, 1179799, 1225993, 1505203, 1255812, 1223979, 1414228, 1028605, 1428123, 1226699, 1520043, 1072490, 1266805, 1543895, 1274513, 976176, 1501498, 1174665, 1231316, 1044262, 1170530, 1031545, 1396675, 1247708, 1189052, 1360604, 1141106, 1111094, 1048514, 1293157, 979503, 999567, 1178356, 1116736, 1161665, 1334736, 1008011, 1149164, 1069524, 1173960, 1141142, 1034705, 926023, 1221851, 830856, 1327721, 1130418]
13870A130418P4460J51346m25683N2142J29163j00493k3586J7915J33042l62587
13860G76137L65416l39702j22736K91203J64366j22974R8910q5920j86595M94710
13850A332815F36784N3290L73358k09901k17121K28435P6827j41600K05320j18380
13840H87012J0779j98884K61990J09087k12167j42833P3740p1777K68261j81420
13830H03788O7634k03184K93517j64287p5971K30084j51269M55450E95604m3633
13820E51971J44883P9972k7283K1166M22703k98198k96718L28513l58583J04744
13810F73170M81584l14230k38207K105J55018q4543L0780l06327J08714M47719
13800I55783k35349K9047p0504j47054M49426m21095J08969l01157N36489p0281
$$ y = [1130418, 1204878, 1356224, 930541, 982683, 1111846, 1011353, 987767, 1005682, 1138724, 776137, 1141553, 801851, 679115, 970318, 1134684, 1011710, 1110620, 1024700, 838105, 1332815, 636784, 690074, 1063432, 853531, 636410, 864845, 941672, 800072, 1005392, 887012, 897791, 698907, 960897, 1069984, 857817, 714984, 788724, 716947, 985208, 803788, 871422, 668238, 961755, 797468, 721497, 951581, 800312, 1255762, 595604, 551971, 696854, 776826, 749543, 770709, 1193412, 895214, 598496, 927009, 568426, 673170, 1154754, 840524, 602317, 604422, 759440, 674897, 705677, 399350, 508064, 955783, 720434, 749481, 678977, 531923, 981349, 560254, 669223, 368066, 904555, 834274]
13790H34274K4721l49791K00728J56547l06401o3216K48113C15681J96943M8795
13780E61419R6953l0004M2219l6767j32132J8520L9826J56791k26028L82110B20223
13768E72837M665K35631m02547L62487K5143B85625K50669L1127R137L68058j37982
13757H06634P0679C97358J05509J08165k09784K25800K00199l00972N6557j96404
13747C86428P0873K52617j80570j22347L5894K83407q7314j15054k34757M66833
13737G56010k17775k49589J64704o267L3034l3946J00031j54593J74900j96447
13727C70062k2050m2841O25911C94547J82113B68067J46399K00717C00986L44125
13717F45111J20590j87337j87154L0963o2520J77246j80697J40872J97274C33907
$$ y = [834274, 858995, 509204, 709932, 866479, 560078, 496862, 744975, 315681, 512624, 561419, 658372, 628368, 670587, 633820, 501688, 520208, 560034, 716825, 490797, 872907, 220223, 572837, 577502, 813133, 410586, 773073, 798216, 285625, 536294, 567421, 576558, 944616, 806634, 877313, 397358, 502867, 611032, 401248, 627048, 827247, 526275, 582832, 386428, 457301, 709918, 529348, 407001, 442895, 726302, 638988, 523934, 289177, 756010, 538235, 288646, 453350, 447083, 480117, 446171, 546202, 391609, 566509, 370062, 348012, 305171, 931082, 394547, 576660, 268067, 414466, 615183, 300986, 645111, 765701, 578364, 391210, 422173, 359653, 536899, 356202, 497074, 694348, 333907]
13706F83067k82432F6300M32346J3570l3699m3802L01920j88309p324L387j08245
13695D36144A74103K86988j00292A45219L24947j89691J94572J2548k12143J12467
13685C87919J82475k47735L6791J19780J28852K16999J3215j64427r1771k19782
13675C62316J06650J12612A84979J51338L14153k49111K12327j49915p3978A17799
13664D65161j96543J33779Q3758A48277L65783m491l3966j14540B8253N24630
13654E52883B27615L11679k66433l5413l9718K66276J09086r1501j56111J47588
13644D73068k07691q450J05771K4025m4972j12289K33844O8087l783N1985B7445
13632C78219J52544J48472k61529j12340j09723o6964K56050n8254q3062L02042
$$ y = [683067, 400635, 66300, 498646, 512216, 478517, 434715, 736635, 548326, 541002, 544389, 436144, 174103, 461091, 360799, 145219, 470166, 280475, 475047, 487595, 275452, 387919, 570394, 322659, 359450, 479230, 608082, 825081, 838296, 673869, 582098, 362316, 468966, 581578, 184979, 336317, 650470, 401359, 613686, 463771, 389793, 117799, 465161, 268618, 402397, 486155, 148277, 514060, 509569, 475603, 361063, 28253, 552883, 227615, 539294, 272861, 237448, 197730, 464006, 573092, 481591, 325480, 473068, 265377, 256927, 362698, 386723, 341751, 229462, 463306, 531393, 527610, 579595, 27445, 378219, 530763, 679235, 417706, 305366, 195643, 128679, 384729, 326475, 243413, 545455]
13622E45455k03039q4550j561J43794j09779i3108C84942j40417M5371A02749
13611D53792J03460j25055j48469J34484A89189K6664J82728J2448J21499k36865
13601B95663N8500A46755J31245o8182K84070A53793L37065h3143D29136o8909
13591C60227l9067J33083k7956a3259F11185B32769N7626N736C7893K43207K89632
13580E70732A53120K03846A65028J9202K24165j57325K35621q0741o6928P8225
13570D17247j47298J07002j30640K2761n8065O56J22646k1327q4501K48814N8832
13559E36127B21508r6667J3408M28Q9476k6321m266K50877H426K1523K15677J33972
13547C79598j43739Q4376A41215J12273K40721A34273J27539K65575k49712J89606
$$ y = [545455, 342416, 257866, 256305, 400099, 290320, -93108, 384942, 244525, 289896, 102749, 453792, 557252, 432197, 283728, 418212, 189189, 215853, 398581, 411029, 532528, 295663, 354163, 146755, 278000, 209818, 493888, 153793, 490858, -83143, 429136, 360227, 321160, 454243, 426287, -13259, 611185, 232769, 290395, 296131, 37893, 281100, 570732, 153120, 356966, 165028, 184230, 408395, 251070, 486691, 405950, 339022, 417247, 269949, 376951, 246311, 269072, 211007, 211663, 334309, 312982, 228481, 477295, 536127, 221508, 124841, 138249, 138677, 228153, 201832, 197566, 448443, 8426, 29949, 245626, 379598, 235859, 320235, 141215, 253488, 494209, 134273, 261812, 527387, 277675, 467281]
13537D67281G4076j4350K25102j3982l7823l7562J04994J97933B7346J38267H1078
13525A90348E3544L17266J04659B17821Q3905m4680K02178k01111A13682M84582
13515E98264k89024q6484a14172C32979D7298J94078K05051B09881N0743R9494
13505C60118A15716Q7690M301J41054n6034a0541D18435c3263E4541J22868J98702
13494C76111L31706B58957L65507k80096K74165A34571R8611K50170A40186B2241
13483B2278P42346B49247a0573m748B20976k4154a05732B73176P8279A34091R7386
13472B31477J04086A48848J77608A48137K25678A50658J63385E6969L11365A42350
13461D14747j51735J03228j55150J6310j5559K33547I2383M0195P5764C0980K88429
$$ y = [467281, 74076, 59726, 284828, 270846, 233023, 195461, 300455, 498388, 27346, 165613, 81078, 190348, 53544, 370810, 475469, 217821, 301726, 257046, 459224, 258113, 113682, 598264, 309240, 222756, -114172, 332979, 47298, 241376, 446427, 209881, 260624, 360118, 115716, 203406, 207707, 348761, 292727, -10541, 418435, -33263, 54541, 177409, 376111, 707817, 258957, 624464, 344368, 618533, 134571, 233182, 483352, 140186, 22241, 22278, 764624, 249247, -10573, -15321, 220976, 196822, -105732, 273176, 351455, 134091, 231477, 335563, 148848, 326456, 148137, 373815, 150658, 314043, 56969, 368334, 142350, 414747, 263012, 366240, 211090, 227400, 211841, 445388, 92383, 132578, 208342, 30980, 319409]
13450C19409J95902B00229c7571q8037e5341A8119M4588K36605G9459l3464K18693
13439B64688J48188d9825a4032E5873J39132M1624o8445K76087a92348D55401
13428B50964j18251L60344I8124N3876J81620H4455K00740A0834O4321R2291C6367
13416A18562k257h6655A57601J42008j7399g1171A08200R4032B2430K45111j0580
13405B56961P4888c6905H94R9307r834O761K2598M2821M6521J04135J52276E8086
13392D35792B12149a82050A09440m7151j6817j6458J31786K7335q4733M3500F5787
13380C73870j26446j11720b9520A057d3526C23994j54125J81578a06528C55071
13369B71220B6360L98142A01666J61582q6536b0077j7894B01624c7685c712D1547
$$ y = [319409, 515311, 200229, -37571, -125608, -55341, 18119, 62707, 299312, 79459, 45995, 264688, 412876, -49825, -14032, 55873, 195005, 236629, 168184, 444271, -192348, 455401, 250964, 132713, 493057, 98124, 152000, 333620, 84455, 285195, 10834, 75155, 167446, 36367, 118562, 116305, -86655, 157601, 299609, 282210, -71171, 108200, 202232, 22430, 267541, 256961, 331849, -36905, 894, 100201, 90367, 97128, 119726, 162547, 209068, 313203, 465479, 58086, 435792, 212149, -182050, 109440, 62289, 45472, 29014, 160800, 188135, 103402, 146902, 65787, 373870, 247424, 135704, -29520, 1057, -43526, 323994, 169869, 351447, -106528, 355071, 271220, 26360, 424502, 101666, 263248, 176712, -20077, -37971, 201624, -37685, -3712, 41547]
13357c2348B97586j09540N0017K7453l5062A02602C8837L84763r4156B6951b6194
13345G6314J20796J56475A8099J61562K18030A97577j5584b39598A28582Q0738
13335B09320C9428O6728K82232C904O1853e3692B18705m8322J90200G9902L50655
13324D30557j39750p2119R711k1839P0018J19191j3881r938I2259K0098J10830
13313B23187o6266a23883B21157a49881A78662a18810p5488M1849b6862C73926
13302A94353i4749B14725K79105A64208J00038p775j5258C4401K8461g2493L3154
13291c9339D21230j74909K674A07387K51208A61664n2626b35079I8230a14138
13280C79409h478j62826f8802A59447a26681N4191C80946D2654c8336B9718J73542
$$ y = [-32348, 297586, 188046, 238063, 265516, 230454, 102602, 38837, 423600, 329444, 26951, -26194, 76314, 197110, 353585, 18099, 179661, 397691, 197577, 181993, -239598, 128582, 209320, 39428, 106156, 388388, 3904, 65757, -53692, 218705, 170383, 360583, 79902, 430557, 290807, 218688, 228399, 206560, 276578, 395769, 381888, 371950, 92259, 112357, 223187, 156921, -123883, 221157, -149881, 178662, -118810, -194298, -152449, -26862, 373926, 194353, -94749, 214725, 493830, 164208, 264246, 256471, 241213, 34401, 62862, -72493, -39339, 421230, 246321, 248995, 107387, 358595, 161664, 109038, -235079, 98230, -114138, 379409, -8478, -171304, -68802, 159447, -126681, -72490, 380946, 42654, -38336, 29718, 203260]
13269B03260M3226B6811a37466H8790J02571K33944F0136N417a53250A67420a36725
13257D5924a54302E08453A34476J62977j30598j4934c0696q0827b3240A93148
13246A26989c4723k33474A49093p79K42342Q1004d2839j82772B79676K0441d9167
13234A78251A9311L2700J65941D8845K85756p4926m5929a43278B54272G3165J79209
13223B52374H1047J65155n9360g5106j52978A24238A3175J9505j0283b7850a3260
13211A80899K06485A31673j0011C112L1899q724N815J33314J25993i7588l9293
13200a36881A78146B5711R6855R9104L5660A27101n6002b11500b4456j77807A53590
13188F6905f1218I9448N1210Q7916r1254J06151A20003K9494c52787B25866l6895
$$ y = [203260, 246486, 26811, -137466, 88790, 191361, 425305, 60136, 65553, -153250, 167420, -136725, 45924, -154302, 508453, 134476, 297453, 166855, 151921, -30696, -111523, -23240, 193148, 126989, -34723, -268197, 149093, 148314, 390656, 471660, -42839, -225611, 279676, 300117, -49167, 178251, 19311, 52011, 217952, 48845, 334601, 259675, 213746, -143278, 254272, 73165, 252374, 81047, 246202, 186842, -75106, -228084, 124238, 13175, 32680, 22397, -27850, -13260, 180899, 387384, 131673, 121662, 3112, 35011, 26287, 32102, 165416, 291409, -97588, -136881, 178146, 25711, 122566, 221670, 257330, 127101, 71099, -211500, -24456, -202263, 153590, 66905, -61218, 99448, 150658, 238574, 147320, 253471, 120003, 149497, -352787, 225866, 188971]
13177A88971J29853D3266b8798B22683a28588A99647J00829R0794A57011P7819
13167B34830d0918j76069A33786a53833F16828k41101j09689m4440N6948J98145
13157D76691a29940m882B88716D1439J09953b406A2726J51202k5673b11747I719
13145a79773C17053j12206h7165A05328j2581J32828B0523J29089M2553l0516
13135A61649L2870a7498C45328A25558b43306A66734L83210k68734k0686a06193
13124a7983A18919n1093a10655o7547o5075A96245K73270H0270a76463B9454b5563
13112B98754l1435a7476C57187a43176A28822H579O6441a19590C34488r744j51554
13101A73190n9618P2799B2588Q6849R7457B4117a01132A92137c7790A17562O1288
$$ y = [188971, 318824, 43266, -28798, 222683, -128588, 199647, 300476, 391270, 157011, 234830, -40918, -216987, 133786, -153833, 616828, 375727, 266038, 221598, 278546, 476691, -129940, -134822, 288716, 41439, 151392, -2406, 12726, 163928, 138255, -211747, 9719, -179773, 317053, 204847, -87165, 105328, 92747, 225575, 20523, 149612, 192165, 161649, 194519, -17498, 345328, 125558, -243306, 166734, 549944, 281210, 260524, -106193, -17983, 118919, 67826, -110655, -178202, -243277, 196245, 469515, 80270, -176463, 29454, -25563, 298754, 267319, -17476, 357187, -143176, 128822, 8579, 75020, -119590, 334488, 324744, 173190, 113572, 186371, 22588, 109437, 206894, 24117, -101132, 192137, -37790, 117562, 178850]
13090A78850F8605k9566J21315p1249a5407l2510m0053M0046j87339A47122L5934
13079A83056K70860d3012C6838b53229P4501B28490m7158D8466J21049f9840b9297
13067a3784B34057G1396A5019Q9326J26684H3193J0904c8479J5780G3302K94477
13056C67779A1523a08042B98839j41686p0578L72821b94938d8929A37027n2752
13046H4275L9008C2681g4610B12673o9156i9664m0308K8148B38159m532D3080
13034A49951m8604C8822j3073J35608a97240B68911A29600E0833R9635a31772
13023H0672h8129F9406n869i0351A58280B374i2956C87483f7811l82198A2702
13011D25908D2022Q0709a65268A23080b82333C9353H495M7799L4590c10414C6083
$$ y = [178850, 68605, 39039, 160354, 89105, -15407, -47917, -87970, -47924, -235263, 147122, 183056, 453916, -43012, 36838, -253229, -178728, 228490, 181332, 48466, 169515, -69840, -29297, -13784, 234057, 71396, 15019, 104345, 231029, 83193, 94097, -38479, -22699, 73302, 367779, 11523, -108042, 298839, 157153, 86575, 459396, -294938, -48929, 137027, 84275, 123283, 32681, -74610, 212673, 143517, -99664, -139972, -111824, 238159, 233627, 43080, 149951, 101347, 38822, 25749, 161357, -197240, 268911, 129600, 50833, 150468, -131772, 80672, -88129, 69406, 63537, -90351, 158280, 2374, -92956, 387483, -67811, -450009, 12702, 425908, 42022, 122731, -165268, 123080, -282333, 39353, 8495, 56294, 90884, -310414, 36083]
12999B38441C4215L370J57046k0708a64518K5705J0959G6413L3884K17687l5460
12988B92524n8544D7735L42022A03033g1303k30049A29296k8893P0216P2923c8236
12976i6583d0585A89768c8272l2301k65952c7402l3431I0897H763c8202E2595
12964C95945A08815J85366G2025Q8891b35962B87018A19262Q7116J09462F5786
12953B56167P5945G6165k8723f8227C6046j282P4086c6945A74936M9793J2970
12942B37699Q2077m8936m6217b86136A41769b6032k10459C11126d17454D4367
12931A3111b31884B16246a92858b7138B78390j32282a61876P0291M5155r0029
12921a36459C30376D3806J469d79999B43861E6072B4857L12936b18583n4211A94954
$$ y = [238441, 34215, 37585, 194631, 173923, -164518, -138813, -127854, 76413, 110297, 327984, 292524, 233980, 47735, 389757, 103033, -71303, -301352, 129296, 100403, 170619, 243542, -38236, -96583, -40585, 189768, -38272, -70573, -336525, -37402, -70833, 90897, 8763, -38202, 52595, 395945, 108815, 294181, 72025, 160916, -235962, 287018, 119262, 206378, 315840, 65786, 256167, 332112, 76165, 47442, -68227, 36046, 34764, 108850, -36945, 174936, 224729, 237699, 319776, 270840, 224623, -286136, 141769, -26032, -236491, 311126, -417454, 44367, 13111, -231884, 216246, -192858, -27138, 278390, 146108, -161876, -91585, -46430, -136459, 330376, 43806, 45275, -479999, 243861, 56072, 24857, 337793, -218583, -272794, 194954]
12909C40299j2080I0540J24601q7537f759E2432J82762g5650r6070G9159H589
12897f1583b5195F0301a99916Q2466D643K7648a10606l9560C20748c532I5510
12885A73755c3061I0952C9302L3835K13477b39930A35952b65346L8182f2334C9118
12873b8008A23140i1323B75213F0800N5377J33597H9135E320Q8835l3443a29046
12861G6373a12472C1628j1712J2597K65916f2682q0859e6560q4311n6476A28279
12849c01070D61437c6841k29373C02806J05596e7763Q992C58557A18548J28024
12839B46572K36553k02318A2256D997J22394c29908a42141I0046i7025B6836K0817
12828D7653a66797E3883d0453r4254I5964J80780j00735R260b54361A940N6177
$$ y = [340299, 328219, 90540, 215141, 127604, -6759, 52432, 235194, -75650, -171720, 79159, 8589, -61583, -25195, 60301, -199916, -117450, 4643, 32291, -110606, -150166, 320748, -3532, 95510, 173755, -33061, 90952, 39302, 73137, 286614, -239930, 135952, -265346, -227164, -62334, 39118, -28008, 123140, -91323, 275213, 60800, 116177, 249774, 89135, 5320, 94155, 60712, -129046, 76373, -112472, 31628, 19916, 32513, 298429, -62682, -143541, -56560, -140871, -197347, 128279, -301070, 461437, -36841, -266214, 302806, 408402, -57763, -48771, 358557, 118548, 246572, 483125, 280807, 12256, 4997, 127391, -329908, -142141, 90046, -97025, 26836, 47653, -166797, 53883, -40453, -134707, 95964, 276744, 176009, 185269, -254361, 1940, 58117]
12817E8117J81980N1333j33891a30179H0799d7589J7315I0566B2383b10462P8190
12806a32272B75476i9816B99293A2742f7792A07348P6348f8959j85857A65131
12795B49079a91447B47512h9719B09831c92464g8115G1186L6894d2503A74980
12784a95459A04659C4584b15626B2606J31985M9848e8598m8757e2974k68179a17067
12772C48531a50830E4472K41148b64799C2723R2375e4470o971j11366P0856k8284
12761a30235q3174A547K86597b06984c0344D45882a00474B43847j13365a45299
12750A48208a01673L1031l6457d8413a6752A36445n4286N4870F7883L2802a63142
12738A24409a39102B8863O1171D2145K49988g4645j92570f5288B26381a45413
$$ y = [58117, 240097, 291430, 157539, -130179, 80799, -47589, -30274, 90566, 22383, -210462, -132272, 275476, -99816, 299293, 12742, -67792, 107348, 183696, -68959, -254816, 165131, 249079, -191447, 247512, -89719, 209831, -392464, -78115, 71186, 108080, -42503, 174980, -195459, 104659, 34584, -215626, 22606, 154591, 204439, -58598, -107355, -52974, -321153, -117067, 348531, -150830, 54472, 295620, -264799, 32723, 125098, -54470, -61441, -172807, -101951, -130235, -213409, 1547, 288144, -206984, -30344, 445882, -100474, 243847, 130482, -145299, 148208, -101673, -70642, -107099, -48413, -16752, 136445, 82159, 137029, 67883, 100685, -163142, 124409, -139102, 28863, 90034, 42145, 292133, -74645, -267215, -65288, 226381, -145413]
12727A75988e4174A23313j3898J77301q7468f6903j65688C70772g7080b2758j69749
12716a92507b3169A78846B4728a99238d0269j47590I1095e243j11387A73803a16457
12704c9338A5099J76950k1266M2695I1354k5m0935b61804Q7788b0663p3362M2557
12692e1468A27298J58555j01881I1646J91209j39120m4050K84330b11709f4917
12681F9715a37000A09053f4760b7755j503A75145k4655C7616h5711K6533A33880
12669E2638h5802i793B2849a7452H607J75297C6909a55510n0079A63681K31683
12658C95364j10082d934F0636a46136A51279L7097p9587A1450M28548B13557l2437
12647A81120j0346E9050a49971n0412F3945L04964r6690B9569b68359A64008G9470
$$ y = [175988, -54174, 123313, 109415, 286716, 199248, -66903, -232591, 370772, -77080, -22758, -192507, -23169, 178846, 24728, -199238, -40269, -187859, 91095, -5243, -116630, 173803, -116457, -39338, 15099, 192049, 170783, 213478, 91354, 91329, 50394, -261804, -174016, -20663, -94025, -51468, 127298, 285853, 183972, 91646, 282855, 143735, 99685, 384015, -211709, -64917, 69715, -137000, 109053, -64760, -27755, -29258, 175145, 150490, 37616, -85711, -59178, 133880, 52638, -85802, -9793, 22849, -17452, 8607, 183904, 36909, -155510, -205589, 163681, 395364, 285282, -4934, 60636, -146136, 151279, 188376, 108789, 11450, 439998, 213557, 181120, 170774, 59050, -149971, -200383, 63945, 368909, 272219, 29569, -268359, 164008, 79470]
12635e9601l3178k2978o2658A27529D6665K77893K2460K07523A11114m0642k9276
12624D1196A2642O6635P6569h0194E4033J52686o2959J62599j25971e2663B06795
12612g0814L1727B6697Q6654k0887a74584A30501b2990C7617b26669A35781F791
12600e3009I4124J34178a32689B23345A10444D2264J3320d37741A12879K20734
12590C33613c49552B62571R6853r6128a37423I6064B1225Q2490R7229m8366M8446
12579B01024D227R210P2233r174b71461Q3016N5911A15450a10931e4951l32654
12568c87605B21224b16110J0049C69041a17486p1413j23872A08310d45A40561
12557f0494m6693F5015a65401B29203a07647H9154D0639b2206A73268h3243n8714
$$ y = [-59601, -92779, -115757, -178415, 127529, 46665, 324558, 347018, 554541, 111114, 70472, 41196, 12642, 79277, 155846, -80194, 54033, 206719, 143760, 306359, 180388, -52663, 206795, -70814, -39087, 26697, 113351, 92464, -174584, 130501, -22990, 37617, -226669, 135781, 6791, -53009, 94124, 228302, -132689, 223345, 110444, 42264, 55584, -437741, 112879, 333613, -349552, 262571, 359424, 263296, -137423, 96064, 21225, 103715, 200944, 152578, 201024, 4227, 13437, 85670, 76496, -271461, -188445, -132534, 115450, -110931, -54951, -387605, 221224, -216110, -206061, 369041, -117486, -188899, -312771, 108310, -445, 140561, -60494, -107187, 65015, -165401, 229203, -107647, 89154, 40639, -22206, 173268, -83243, -141957]
12546a41957C22076I9017J27452p5349m6261j6826Q3498H4828B5364f9601G6726
12534B5542p272J00455M218a21958e3508C25570a6948n8192D64787B3935g2070
12522A4080R9661a24608D969a30438r247b6574j79011f2895l00911e4397j68674
12511b23071L9002O4045A42813o7172R6348d6387K89A6211b39436E7227k5410
12500C1817O736a31210L7544a7319C56076b4678A34399J86219b30642g8187B04099
12488B90671a81194d5115M573J102A47461F9382k4619h7200a9419E8509c045k70875
12476b73920F2929J79201k7849M1815m1342b5889m1705D3744L18187j23367a75926
12464b93270A78063L8092a65326I2283K6832a03630r2009A40411q713f6618j16963
$$ y = [-141957, 322076, 99017, 226469, 151120, 104859, 88033, 171531, 84828, 25364, -69601, 76726, 25542, 18270, 118725, 122943, -121958, -53508, 325570, -16948, -75140, 464787, 23935, -72070, 14080, 113741, -124608, 4969, -130438, -139685, -26574, -205585, -62895, -363806, -54397, -223071, -184069, -120024, 142813, 75641, 171989, -46387, -46098, 16211, -239436, 57227, 31817, 38553, -131210, -93666, -17319, 356076, -24678, 134399, 320618, -230642, -78187, 204099, 290671, -181194, -45115, -40542, -39440, 147461, 69382, 44763, -87200, -19419, 58509, -3045, -273920, 62929, 242130, 214281, 256096, 214754, -25889, -67594, 43744, 361931, 238564, -175926, -293270, 178063, 216155, -165326, 92283, 119115, -103630, -195639, 140411, 131698, -66618, -183581]
12453a83581B62643O8710C4016j5975a70174A25304g3648D6186c4447k2546F5275
12441c54823a37631B48206J55520H6265b63693L6561h7135A78514J59778P7202
12431D15494A89286Q2462a35194A38178B7755a22905j12144D2175b61128P9019
12421a82109L8626j38285E2572k4558K15167F8601B9093b6857k54864G0002R7623
12410A67625p1176b00634e8148E5101c8068A63457n5763A561d509n8280L441p9128
12398a38476C49482I9196a76914f7124k19882A78105C9521M7234g5670A44002
12387a17824k7760n4947c4061m179B35145c0941j43411G2573d1704C3214e3119
12375B8549b1478C61643D7803b3292o6149N1j44310A28092n1663b03231d8334
$$ y = [-183581, 262643, 331353, 34016, 18041, -170174, 125304, -73648, 46186, -34447, -56993, 65275, -354823, -137631, 248206, 403726, 86265, -263693, -227132, -87135, 178514, 338292, 415494, 189286, 271748, -135194, 138178, 27755, -122905, -235049, 42175, -261128, -182109, -143483, -281768, 52572, 28014, 243181, 68601, 29093, -26857, -281721, 70002, 167625, 96449, -200634, -58148, 55101, -38068, 163457, 107694, 1561, -4509, -62789, -59348, -138476, 349482, 99196, -176914, -67124, -287006, 178105, 39521, 86755, -75670, 144002, -117824, -145584, -200531, -34061, -38240, 235145, -30941, -174352, 72573, -41704, 33214, -53119, 28549, -21478, 361643, 47803, -23292, -89441, -89390, -233700, 128092, 76429, -203231, -48334]
12363A132O0359a88463n2449R8901N8809A88308I488b18787A05550K15890i3812
12351b24218Q5850B38174B8960P0488b10753A39032C2275a6044D87952A40208
12340A43135L2116c91916B20836e4066m3609k44126a10331A57244b8053A77041
12329b06839A79297F0410B8425K2614f8760B3838g5750k4087A66898J31413d9394
12317a78840K9640G0181i4238C29238j54582b72366J35285B6889g157A37325b54884
12305I2028J61332g6299I1225J8931d9883E8666b667j14179A41639k0800b42787
12293A89376a81945D1957O5443a33767k34194e3714A13652L7737d0084j26445
12283a66529B980h1223B33517H9835c01388b5778j654L827D56278B16906K05859
$$ y = [1132, 61491, -188463, -240912, -142011, -83202, 188308, 9488, -218787, 105550, 321440, -93812, -224218, -138368, 238174, 28960, 99448, -210753, 139032, 32275, -16044, 487952, 140208, 143135, 175251, -391916, 220836, -54066, -97675, -341801, -110331, 157244, -28053, 177041, -206839, 179297, 60410, 28425, 51039, -68760, 23838, -75750, -99837, 166898, 298311, -49394, -178840, -149200, 70181, -94238, 329238, 174656, -272366, -137081, 26889, -7157, 137325, -254884, 92028, 253360, -76299, 91225, 110156, -49883, 58666, -2667, -116846, 141639, 120839, -242787, 189376, -181945, 41957, 107400, -133767, -367961, -53714, 113652, 151389, -40084, -166529, 2980, -81223, 233517, 89835, -301388, -25778, -27432, -23605, 456278, 216906, 422765]
12272D22765j15591e9454A15624d6549j22701l33812B54023b30302H3701J81157
12262B64858A24964B4042b9282A24858a30790A68292a68440a2211A04022e4982
12251E6413b44950D09644j53490H6215b78065C50997b9688B21675K11754A12691
12240A93996I227K0540a93505E9787J43795J91207A01i3470A61656Q4238D8716
12228A6174J5343d5322D7561M32193A29007J06535m641a91452d1639E16524I6801
12216A21124P8918b66364A96433a37929A29291N4296H3968k9523L46387q0042
12206C20790A6307h1733B09761l8602J87436A43651J7360R1717p5799k6144D0200
12194C7660J63153G9297J89383H9645L49204g524E17805A92875b444j3792I4531
$$ y = [422765, 307174, -59454, 115624, -46549, -169250, -503062, 254023, -230302, 83701, 264858, 124964, 24042, -29282, 124858, -130790, 168292, -168440, -12211, 104022, -54982, 56413, -244950, 409644, 256154, 86215, -278065, 350997, -29688, 221675, 433429, 112691, 193996, 9227, 29767, -193505, 59787, 203582, 394789, 101, -93470, 161656, 245894, 48716, 16174, 31517, -45322, 47561, 479754, 129007, 235542, 230901, -191452, -41639, 516524, 96801, 121124, 200042, -266364, 196433, -137929, 129291, 183587, 83968, 54445, 400832, 320790, 16307, -81733, 209761, 171159, 358595, 143651, 161011, 252728, 176929, 150785, 40200, 37660, 200813, 79297, 268680, 89645, 438849, -7524, 517805, 192875, -2444, -16236, 94531]
12182A93843o3420J00208B7714J64353k5188a8495A94824C6847a29157H9608C5274
12170B19476d0645A64994a49705H8444P3678e1728B92847a13228A6508J99497
12160B16005j03473l7101J47913d4614m0727G9260J67384P0262o1483A00832J478
12149A02310a35576C18160A17877c05731B3745L5956e2169A94072c55996E6908
12138e6258I341L25928F7731K30962F0469b74881A38084F4236d68140b30481C91039
12126A19680O6375o9775a07405r0642A022e3024H6975e966k38031J19494H9309
12114b51548c5442e171l50932A1740K87115A20525l8276K62893b2272A5698N6149
12103G1847J37695F4305b31424a0992j28557B11342a02040F5757O7012F3880h4821
$$ y = [193843, 130423, 230631, 27714, 192067, 166879, -18495, 194824, 36847, -129157, 89608, 35274, 219476, -40645, 164994, -149705, 88444, 162122, -51728, 292847, -113228, 16508, 216005, 112532, 75431, 223344, -44614, -85341, 79260, 246644, 316906, 255423, 100832, 102310, -135576, 318160, 117877, -305731, 23745, 59701, -52169, 194072, -355996, 56908, -56258, 9341, 335269, 67731, 298693, 60469, -274881, 138084, 64236, -468140, -230481, 391039, 119680, 186055, 116280, -107405, -198047, 1022, -53024, 86975, -5966, -243997, -124503, 89309, -251548, -35442, -5171, -356103, 11740, 298855, 120525, 82249, 345142, -22272, 15698, 71847, 209542, 64305, -231424, -10992, -139549, 211342, -102040, 65757, 132769, 63880, -84821]
12091i1263C117a49500E3942a60987B97556b76895D0366a72044K7467A22671K89133
12080D11804A23091N7681b7699k67996J26848D3305L44451a98652C8410b77361
12069b3151l7579B41632b11567c464A82958O8899K1885J37193M12584J301724
12059B125243p47151E10876B04343H5361K2115a43040A50534a24451H2259M9991
12049A32250g1184k37608d6237A69436L0975m9707e6218j67306H7537D372J31391
12038A35763a93648a3927A16803n1666c26045H7784J2195M180m9193O8707h147
12026b49051B65944e5996p5634e6196B5788O1977a04802A37960i1821L0050H8573
12014g9789B5532A2095N9002B6136a24676G9605e1554k8211k6395D017a83491
$$ y = [-91263, 3117, -149500, 53942, -160987, 297556, -276895, 40366, -172044, -144577, 122671, 411804, 123091, 180772, -27699, -295695, -168847, 43305, 387756, -198652, 38410, -277361, -23151, -60730, 241632, -211567, -3464, 182958, 251857, 273742, 410935, 823519, 2125243, 1378092, 510876, 204343, 85361, 107476, -143040, 150534, -124451, 82259, 132250, -71184, -308792, -46237, 169436, 200411, 150704, -56218, -223524, 87537, 4372, 135763, -193648, -13927, 116803, 65137, -326045, 87784, 99979, 104159, 54966, 123673, -8147, -249051, 265944, -55996, -131630, -56196, 25788, 87765, -104802, 137960, -91821, -61771, 88573, -79789, 25532, 12095, 71097, 26136, -124676, 79605, -51554, -79765, -106160, 4017, -183491]
12002G8687J23642a48632j68132J08548A41837c0195A03343M6721C3707N7875
11992I1582d09634a61675J1946k7854b3425C10797j51589N8214N7292b03575B62131
11980A6836N0011a55126j7561P1157k8443A17060a68687A31847g0070A79378n5463
11969A23915n5292b31838P1260A61005g1855k27762H4921a25871l5895A37816
11958f9894B87114e4488n445B20981c95634b211j25104I2837J49541b90676L1891
11947b58785b7923j17440B21382K0421b7120B37445a39906j88155H8679C1520
11936C5538j249a83618A34829a47375A28786a88493p3354L3679G265J3890K05960
11925B27115a95717P5776B52695b25394C27070j63332p6578d5677j50291o3478
$$ y = [78687, 202329, -148632, -316764, -208216, 141837, -30195, 103343, 150064, 33707, 91582, -409634, -161675, -149729, -177583, -23425, 310797, 159208, 217422, 274714, -203575, 262131, 16836, 66847, -155126, -172687, -101530, -129973, 117060, -168687, 131847, -70070, 179378, 123915, 68623, -231838, -160578, 161005, -71855, -299617, 84921, -125871, -161766, 137816, -69894, 287114, -54488, -59933, 220981, -395634, -2211, -127315, 92837, 242378, -290676, -258785, -27923, -145363, 221382, 241803, -27120, 237445, -139906, -328061, 88679, 31520, 35538, 34289, -183618, 134829, -147375, 128786, -188493, -261847, -228168, 7265, 21155, 227115, -195717, -119941, 252695, -225394, 327070, 163738, 87160, -45677, -195968, -259446]
11915b59446o6846B77381H2597a06596l3264j87635F8094a65645A43542h0768
11904E9480K09042H8037a80383Q0728D3035a34061K1944B83245b68013D0874N4339
11893I5213b17669l9710A3138N9895J16889a58361c3313D6716c70373G5349R0258
11882A65607n5892k3707g5996q1420n2791g4111j11583m9702J01134C8009K0299
11871E8308K00032b85390A04782O796a44966l44216F6834b8712A63214Q2034b29763
11859A57236d5756A32837a83972F6384j016a03022A50122C5808a52586r9406c7837
11847h8370a219q4203B16124a5500C6982L3197B6304J42318a32133j20340G9399
11835A8926M5434K0901i7045j13663A6723L07452b62787d1522C8513g1173A1274
$$ y = [-259446, -326292, 277381, 82597, -106596, -139860, -327495, 68094, -165645, 143542, -80768, 59480, 268522, 88037, -180383, -99655, 43035, -134061, -112117, 283245, -268013, 40874, 95213, -217669, -257379, 13138, 73033, 189922, -158361, -33313, 46716, -370373, 75349, 165607, 109715, 86008, -75996, -157416, -210207, -74111, -185694, -235396, -134262, 38009, 58308, 258340, -285390, 104782, 111578, -144966, -489182, 66834, -28712, 163214, 245248, -229763, 157236, -45756, 132837, -183972, 66384, 65368, -103022, 150122, 35808, -152586, -251992, -37837, -88370, -1219, -85422, 216124, -15500, 36982, 70179, 26304, 168622, -132133, -252473, 79399, 18926, 64360, 85261, -97045, -210708, 16723, 324175, -262787, -41522, 38513, -71173, 11274]
11823A00381a65428F8209a54232A05309b17840B05359E3888J40208B9669b27025
11812a12375F0832J55677G1289a31280a0929C4799a7362m4927j72161R0305O9677
11801g4468A81049C9492a57333N9749C08988c29933o1299D2508A1950a03574K261
11790a01313j42116G1341O7111B0057a24230A52843c3773k4483q9038L0476B37784
11778H1544j2604c53093A60370G4685L6762k0916b31078E0014a6427l20860p048
11767c44335A89031F5100J15801c03046N6475A55403b96232a27792p4254g8908
11756B5506L4023N7433F816b24788N3957O4710k71666E3176c24575e869p3927
11745g9796o5951g205H0412a37187A0155a12550l1484N0606D378b227B52445b08150
$$ y = [100381, -165428, 68209, -154232, 105309, -217840, 205359, 53888, 194096, 29669, -227025, -112375, 60832, 216509, 71289, -131280, -10929, 34799, -17362, -62289, -234450, -144145, -74468, 181049, 39492, -157333, -97584, 308988, -329933, -391232, 42508, 11950, -103574, -101313, -243429, 71341, 138452, 20057, -124230, 152843, -33773, -58256, -147294, -116818, 237784, 81544, 68940, -353093, 160370, 74685, 111447, 90531, -231078, 50014, -16427, -337287, -344335, 189031, 65100, 180901, -303046, -246571, 155403, -296232, -127792, -202046, -78908, 25506, 59529, 116962, 6816, -224788, -170831, -106121, -377787, 53176, -324575, -5869, -79796, -145747, -7205, 80412, -137187, 10155, -112550, -144034, -93428, 4378, -2227, 252445, -208150]
11732a67766c9115A34986c34284C2227b79555g899A88235b73784A31780K17017
11722C48797A69185k3497c24330o0312N5759D8047E50g2880Q603I1249h9489k13269
11710c02758b6498m0608A01235e3056A01012b19381A65573d791A22253c4286j0852
11699d5138j73053B64250d0692p0277G899P4975J35305d6753C2733b43016J2136
11688b30880A81527J2588@C50514A68599b35577i6365B12809C7669c40701k6519
11677c67220A54314c39452a24669e7004K2352C1548a6913A58594i8108c916j6916
11666b0832m0887B60755N9850a86430A13056i8269D8237J53337a42739p0605D7198
11654g9299k70968e8319A99411l3854m6573J92443d06449C158J93318D8189e5952
$$ y = [-167766, -39115, 134986, -334284, 32227, -279555, -7899, 188235, -273784, 131780, 348797, 169185, 145688, -324330, -384642, -328883, 48047, 550, -72880, -64277, 91249, -89489, -302758, -26498, -67106, 101235, -53056, 101012, -219381, 165573, -4791, 122253, -34286, -45138, -218191, 264250, -40692, -110969, 7899, 82874, 218179, -46753, 32733, -243016, -230880, 181527, 194115, 0, 350514, 168599, -235577, -96365, 212809, 37669, -340701, -367220, 154314, -339452, -124669, -57004, -34652, 31548, -16913, 158594, -98108, -3916, -20832, -61719, 260755, 320605, -186430, 113056, -98269, 48237, 201574, -142739, -213344, 47198, -79299, -350267, -58319, 199411, 165557, 118984, 311427, -406449, 3158, 196476, 48189, -55952]
11642G6890b37809R1424B9817P137a40298e6822j52947d7832G2970J26652M5391
11631B45013c97975D57695E3556L26459j39066A9044N6625b90697d2371j64593
11621b06964G129a00394B94113C165a96482k35138a59220A36407d0934B53655
11610h1012C99401F5977a44093n4480d8087B43607I0730b5451A19944a43051A43073
11598a88827L2129L4763B46484a29835I6299J11400J64713b07092n9609A37192
11587I8705K6620i404A92979N2207a48838G3317Q1443a72378l143j22746O6151
11576b32116b6040A05330c968n2895A23513c32208B2182J7915J34466a95885G9569
11564A99205a26603p5191b7815b21p6240B37126a63089D6388b30095F8207J56214
$$ y = [76890, -237809, -146385, 29817, 36954, -140298, -56822, -209769, -47832, 72970, 199622, 245013, -397975, 457695, 53556, 380015, 240949, 19044, 75669, -290697, -42371, -206964, 7129, -100394, 294113, 3165, -196482, -431620, -159220, 136407, -40934, 253655, -81012, 399401, 65977, -144093, -198573, -48087, 243607, 90730, -25451, 119944, -143051, 143073, -188827, -156698, -121935, 246484, -129835, 96299, 207699, 372412, -207092, -266701, 137192, 98705, 125325, -9404, 192979, 245186, -148838, 73317, 154760, -172378, -175521, -298267, -232116, -26040, 105330, -3968, -56863, 123513, -332208, 22182, 40097, 174563, -195885, 79569, 199205, -126603, -201794, -27815, -221, -76461, 237126, -163089, 46388, -230095, 68207, 224421]
11553B24421Q511G0086d7483B52155p9069K0610J0764o5124a4625k6304P200o4670
11541i8399C74602g8859K8978B54715j03078c07686A64356J23406e2550B2441
11530G135b36041C13303i775A14144k1485d32198C4671J90113G6765g5608C42624
11518C02476A33881b05073Q4972D08722b2059A57118c448B57385q1082M1104B8969
11506D0399P5048a97862A78109L366H1564L7007g3902B48035J0967F7334K03630
11495B70964m9401R6557J81765F8621K4003A9657a26213n1465B13360A01671e6656
11483A00889a17658A02215O6188R1585c6312D54027b43435C28904j07018o0651
11473A61235O3132I8486m0800J3458N1099a78069E4976b15187C8545i3823L2058
$$ y = [224421, 232932, 70086, -47483, 252155, 173086, 193696, 204460, 139336, -14625, -40929, -33729, -98399, 374602, -78859, -49881, 254715, 151637, -307686, 164356, 287762, -52550, 22441, 7135, -236041, 313303, -9775, 114144, 92659, -432198, 34671, 224784, 76765, -75608, 342624, 302476, 133881, -205073, -120101, 408722, -22059, 157118, -3448, 257385, 176303, 217407, 28969, 40399, 115447, -197862, 178109, 181475, 81564, 118571, -73902, 248035, 259002, 67334, 270964, 221563, 318120, 499885, 68621, 92624, 19657, -126213, -177678, 213360, 101671, -56656, 100889, -117658, 102215, 168403, 259988, -36312, 454027, -243435, 328904, 221886, 161235, 224367, 98486, 57686, 71144, 122243, -178069, 54976, -215187, 38545, -93823, -61765]
11462f1765b7410q2154A14893a9717C1407K63832m0613a66435a6346o9465q4633
11451a70444g880C05022g7245L1309B25606D4976i5931A76221k7002E2945e1415
11439b60400d2243F6872d1439H3643c28525B00834p4539b25478A11311J26202
11429B37513G1199J8184b4180A11509a80132A77018B8120R1496j1532L00475f5236
11417a48388r3847J03361M0486d4123k1083C49723a04194p8013B13938a93837
11406C76350b24315h162j51261C5033c80011a2300r9171C8689K65877b69400B6330
11394b23678Q7095A73214b91047C31282A05219K11984b8585j00653L8883A66593
11383I7806d5973B14118a09724G8649d5194A53406g7103K9062I5020a14446c3604
$$ y = [-61765, -27410, -109564, 114893, -19717, 31407, 295239, 254626, -166435, -16346, -85811, -170444, -7880, 305022, -77245, -45936, 225606, 44976, -95931, 176221, 149219, 52945, -51415, -260400, -42243, 66872, -41439, 83643, -328525, 200834, 126295, -225478, 111311, 237513, 71199, 89383, -24180, 111509, -180132, 177018, 28120, 119616, 108084, 408559, -65236, -148388, -242235, -138874, -98388, -44123, -65206, 349723, -104194, -182207, 213938, -193837, 376350, -224315, -8162, -159423, 35033, -380011, -12300, -111471, 38689, 304566, -269400, 26330, -223678, -136583, 173214, -291047, 331282, 105219, 317203, -28585, -129238, -90355, 166593, 97806, -45973, 214118, -109724, 78649, -45194, 153406, -77103, -48041, 95020, -114446, -33604]
11371A61062A639c48924C33775b28688r6547G0103k4385R7478J923Q2690p1397
11360A56412d1294F137P4453b67382a27354C01584f4303C37757a70408b9297C08774
11348A19028h0324c7658B11670H773a5379n5327b1951j76534m6117J2239b6531
11336E34709d6339J8033Q65k34786H3172J58442A5820a86919N7371h465j20944
11325a29409F8287J02606b16497A10390a2842j59590j52567A66071B1476c13308
11314E5754A0951L2283J26344j3721a00665k62547a03635j10286A17687D2792
11303I3677d4890A6895a1137A03505n0119a42917A41293a07357A90410a78028
11292g3164G3991J27532n9613h7178A04329a80254F6070a8486j17081A09321d2377
$$ y = [161062, 1639, -348924, 333775, -228688, -325235, 70103, 45718, 143196, 145119, 227809, 156412, -41294, 6137, 80590, -267382, -127354, 301584, -64303, 337757, -170408, -29297, 308774, 119028, -80324, -37658, 211670, 8773, -15379, -70706, -21951, -198485, -244602, -232363, -26531, 534709, -46339, -28306, -27441, -262227, 83172, 241614, 15820, -186919, -129548, -8465, -129409, 68287, 170893, -216497, 110390, -12842, -172432, -324999, 166071, 21476, -313308, 55754, 10951, 43234, 169578, 155857, -100665, -363212, -103635, -213921, 117687, 42792, 93677, -44890, 16895, -11137, 103505, 53386, -142917, 141293, -107357, 190410, -178028, -73164, 73991, 201523, 141910, -87178, 104329, -180254, 66070, -18486, -135567, 109321, -42377]
11280c4888A59578P660J43740D1774b9267B31830a89558i0130j1462n474k42447
11269c49513h8457j91367a071G3581g1749A02030q346i7395j15842G353a70760
11257g3474j58449a08519J0913j48698C5910c80906A11371K49447F7553K88322
11247C55875F2133a46017d9485p3306N4293G0862d40908E2871b45918J2760C1485
11235A43593E2297e6264K6054k1705k45157G1001c02081P963Q7924b3948I3320
11223g4141D5841a66366B9741J37513C2447a00950M415j20663E575b39931D6168
11211B87475b21949A51105a12648j4213r0342e4347o0944K8469A1266e2110k8044
11200h0154b7087C2120c8041c012A15477P1258c08156D18581j53697c66763A72095
$$ y = [-34888, 159578, 167238, 310978, 41774, -29267, 231830, -189558, -90130, -101592, -107066, -349513, -88457, -279824, -1071, 73581, -71749, 102030, 93684, -97395, -213237, 7353, -170760, -73474, -231923, -108519, -97606, -246304, 35910, -380906, 111371, 360818, 67553, 355875, 62133, -146017, -49485, -122791, -68498, 70862, -440908, 52871, -245918, -233158, 31485, 143593, 52297, -56264, -30210, -51915, -297072, 71001, -302081, -294118, -206194, -23948, 93320, -74141, 45841, -166366, 29741, 167254, 32447, -100950, -96535, -217198, 5575, -239931, 46168, 287475, -221949, 151105, -112648, -126861, -217203, -54347, -115291, -86822, 11266, -52110, -80154, -27087, 32120, -38041, -3012, 115477, 186735, -308156, 418581, 264884, -366763, 172095]
11188g8760j63664H8596b1010k06545H6017B543a35383p9234P4831m5484H5832
11176d3830I1515j6542a48647p1078d6463J8888j79068j38815F3946b59977M1226
11165b18751g8265L1998O294B64392G8997b76188A37454O5932K980n3015a46568
11153C20877L520c28209a51833l2540A97636q9003P1948q8156k3871a49138c8339
11141C216h176j02516j46287p4610a16720f584l77630B3629R902j907A2323P4449
11129H6772d4777A59756G9202J18407F8038K5373J11207J75298H9542N0501a15632
11117f8636c0653A14227N5029e0285B67838A31256l6789M45792A78018c7554a2325
11105a387q6008A96020H2207a7473B65347a20520A93000N2820L4103H7743K07139
$$ y = [-78760, -242424, 88596, -21010, -227555, 86017, 2543, -135383, -214617, -139786, -185270, 85832, -43830, 91515, 74973, -148647, -219725, -46463, -27575, -206643, -345458, 63946, -259977, -218751, -78265, -46267, -39973, 264392, 78997, -276188, 137454, 203386, 206366, 153351, -146568, 320877, 324397, -328209, -151833, -184373, 197636, 108633, 180581, 92425, 68554, -149138, -38339, 3216, -8176, -110692, -256979, -331589, -116720, -6584, -384214, 23629, 33531, 31624, 12323, 86772, -44777, 159756, 79202, 197609, 68038, 93411, 204618, 379916, 89542, 140043, -115632, -68636, -30653, 114227, 169256, -50285, 267838, 131256, 94467, 540259, 178018, -37554, -12325, -1387, -87395, 196020, 82207, -17473, 265347, -120520, 193000, 245820, 279923, 87743, 294882]
11094B94882C5048M1311O1238K6235c2395A28703L15498a09582d7098H2274K4333
11083A06607J87778K4139K9634J2517p1551j20824J028J72748P8935J36638j67813
11072C89836F7557L04063A43298k2120J83483A51492M2525n0803J50551L28246
11062F22011j46379j01259J25199J08702n6286m6045k4787j27123K02393J25515
11052F81941k13195J83892J01895j61164R3051j34710J76676j53658R5471J34952
11042H05151B60585N07941j23009j56419J85467k8419P1162j48457R805N5418
11032F34074j58880J16304j61095N5191j27736P6637n5369J77061M6333j31161
11022D71359p9626R6690J26443k02273K30168l11152I2095N19695B91384I0170
$$ y = [294882, 35048, 76359, 137597, 163832, -32395, 128703, 444201, -109582, -47098, 82274, 106607, 294385, 318524, 348158, 360675, 289124, 168300, 169328, 342076, 421011, 557649, 389836, 67557, 371620, 143298, 121178, 304661, 151492, 194017, 143214, 293765, 622011, 475632, 374373, 499572, 608274, 551988, 505943, 481156, 354033, 556426, 681941, 468746, 652638, 754533, 593369, 686420, 551710, 728386, 574728, 670199, 805151, 260585, 768526, 645517, 489098, 674565, 646146, 717308, 568851, 578656, 634074, 475194, 591498, 430403, 485594, 357858, 434495, 379126, 556187, 602520, 471359, 391733, 488423, 614866, 412593, 642761, 331609, 92095, 611790, 291384, 90170]
11011I37601l90230A75914L63501j20559J19340J27557N6473A04944N17269K60938
11001H83151l03179J12340K34850l44491J83033k86657J76921B34841K54324j18613
10991C70552J6849K11215r3586J75326j77688K26210J1829R980M21099E15962
10980A094408j33680j9143L09309j33608O29810j58297O46533L56965n4309J6833
10970B554821l61382M69575k95520j71908n63166k04806L03489k03763n03892
10961A023448L16570n66362R9384K47152j0228m64924J31647L1565j97246K34158
10951H45164B66541M57611B90562n6770M9687Q5280I1479J57697K7860O814r973
10940B73877b06935N0292B46121h882l7377B18866M3859C5930J548O9020P4071
$$ y = [937601, 547371, 175914, 539415, 418856, 538196, 665753, 722226, 104944, 622213, 883151, 579972, 692312, 927162, 582671, 765704, 479047, 655968, 234841, 489165, 370552, 387401, 598616, 505030, 680356, 502668, 728878, 740707, 750687, 1171786, 515962, 1094408, 960728, 941585, 1250894, 1117286, 1747096, 1588799, 2235332, 2592297, 2537988, 2554821, 2193439, 2663014, 2367494, 2195586, 1632420, 1427614, 1731103, 1527340, 1023448, 1340018, 773656, 873040, 1120192, 1109964, 645040, 776687, 808252, 611006, 845164, 266541, 724152, 290562, 233792, 283479, 368759, 91479, 249176, 277036, 283850, 273877, -206935, -156643, 246121, -8882, -46259, 218866, 262725, 35930, 37478, 106498, 180569]
10929A80569a38681m9092A78612A9031K96180J9079j09161e7802m5569K9886K031
10918g1454C608K7266O9361g1210j92267g6827n4466B2558b9801k87519a39651
10906c920C8862h9798B17932b12199F1660J29126F8050A7279J34033d21468D7230
10894F5702d79852A94651o0805b67027j03113B17400H2951m1396b28319A25787
10883F5360b63417E0624a64789c7032j64041i768k21678e9767J5554D044J79659
10872A83703a21852c4633A33327i6475j09788j20562B74785A22012k4132L2329
10862A30209m6049k4958a73974A09463Q4643D7205J18105o9048h8220I2581a80906
10850f9448L3008A38167P0632n5852e6775A4203g0542p0215A7158N4749j2740
$$ y = [180569, -138681, -187773, 178612, 19031, 315211, 334290, 225129, -57802, -103371, -73485, -71454, 3608, 30874, 100235, -71210, -263477, -76827, -131293, 22558, -29801, -317320, -139651, -3920, 38862, -89798, 217932, -212199, 61660, 190786, 68050, 17279, 151312, -421468, 47230, 65702, -479852, 194651, 133846, -267027, -370140, 217400, 82951, 41555, -228319, 125787, 65360, -263417, 50624, -164789, -37032, -201073, -9768, -231446, -59767, -44213, 4044, 183703, -121852, -34633, 133327, -96475, -206263, -326825, 274785, 122012, 97880, 130209, 84160, 59202, -173974, 109463, 194106, 47205, 165310, 96262, -88220, 92581, -180906, -69448, -36440, 138167, 208799, 152947, -56775, 14203, -70542, -140757, 17158, 71907, 59167]
10839E9167a124k96108J33999A06480m9771a16650j07060A52413e2778A01187
10828A10876E0682L9346Q9515d5657E21969a55313e5159C1035b0517i786G7047
10816a6171j05357B20521d30986a02631B16811b28880O4899l3222aj30833A14797
10804b67907g5798F1678c8920k05853l2028G2141A8789K98917f520B05410a90698
10792C8443h7979A52368c99595I5003a60241O1880r9907o227A12997h2267k43198
10781c25465E4731J12743a7098A772P7894Q4927a47652d2618F2352J00060d90
10769C23364A37234B5740d5518j69580J03289j8501A97621a71200g9889C5432
10758b25369I9048K29686j44200b49285j85680A05732a762j70789j58910b6451
$$ y = [59167, -1124, -297232, -163233, 106480, 56709, -116650, -223710, 152413, -52778, 101187, 110876, 50682, 90028, 179543, -45657, 521969, -155313, -55159, 31035, -20517, -9786, 77047, -16171, -121528, 220521, -430986, -102631, 216811, -228880, -163981, -197203, -1, -130834, 114797, -267907, -75798, 61678, -38920, -244773, -276801, 72141, 18789, 317706, -6520, 205410, -190698, 38443, -87979, 152368, -399595, 95003, -160241, -98361, -198268, -204495, 112997, -82267, -325465, 54731, 167474, -17098, 1772, 79666, 164593, -147652, -42618, 62352, 162412, -490, 323364, 137234, 25740, -45518, -215098, -111809, -130310, 197621, -171200, -79889, 35432, -225369, 99048, 328734, 184534, -249285, -434965, 105732, -1762, -172551, -331461, -26451]
10747A99857F7321a75174A69767E5495a19694B44718H4377J40960e9836D3476
10736A92394a96405k69941E7652b02511D8045m768b92155A24095A5808b36306
10725c8208A04813M475P3536a03390A59289J56553j57428b45075A97111D4710
10714i1265J9241J7484l8322r9444B57728c22300h2818a2344E4567J4290f0651
10702i8879j70744B2022a00697C6496f8213n4488q4068j70766e2085q9815j19832
10691b61732a23998I9348m9595F30f4669j04227O0278n5646j66063B34131Q3672
10680C17803a73803A993b92800B33409e996j35107b6348A35347L809d87947D1540
10668B21510A06623J58b41490I734J85308N9533h2749H9175c00351M3998A59553
$$ y = [199857, 67321, -175174, 169767, 55495, -119694, 244718, 84377, 225337, -59836, 43476, 192394, -196405, -466346, 57652, -202511, 48045, 43277, -292155, 124095, 15808, -236306, -38208, 104813, 109288, 182824, -103390, 159289, 315842, 158414, -245075, 197111, 44710, -91265, -72024, -54540, -92862, -192306, 257728, -322300, -82818, -12344, 54567, 68857, -60651, -98879, -269623, 22022, -100697, 36496, -68213, -122701, -206769, -377535, -52085, -141900, -261732, -123998, 99348, 49753, 630, -64669, -168896, -108618, -164264, -330327, 234131, 317803, -173803, 1993, -292800, 233409, -5996, -141103, -26348, 135347, 139156, -487947, 41540, 221510, 106623, 106781, -241490, 9734, 195042, 254575, -82749, 89175, -300351, -256353, 159553]
10656C41448a73066C8033a42139e5640d060F0139g9258A21648h6777L2758J1887
10645d2132l6503k54372R1194c9136A68711m8217f3208A2735a89486J0583C35276
10633A55357a85559N3843H6890b06957N2149k7116Q1866l31642g1835M293a037
10621c783j58392m438A46872b8308k00800J9832J02305H6321N0445b37909A52951
10609B72985c2044G454b7062l43932F7825a14140A68656n8106b51710l47431a46259
10597g1103k84348B79850a60248A3917c3977j90834N8617M1781j69620j3628H8964
10585A18740a3414D45513A24304J98084i9617a5047k1843k55667A4048e26768
10574b43540a19059A68572a44336J6679j54232C17654A07467d1482o7003k45944
$$ y = [341448, -173066, 38033, -142139, -55640, -4060, 60139, -79258, 121648, -86777, -54019, -42132, -78635, -333007, -241813, -39136, 168711, 120494, -63208, 12735, -189486, -178903, 335276, 155357, -185559, -131716, 86890, -206957, -154808, -181924, -100058, -431700, -71835, -67542, -1037, -3783, -162175, -166613, 146872, -28308, -229108, -209276, -106971, 86321, 136766, -237909, 152951, 272985, -32044, 7454, -27062, -370994, 67825, -114140, 168656, 110550, -251710, -599141, -146259, -71103, -355451, 279850, -160248, 13917, -33977, -224811, -166194, -124413, -294033, -307661, 88964, 118740, -13414, 445513, 124304, 322388, -99617, -15047, -36890, -292557, 14048, -526768, -243540, -119059, 168572, -144336, -127657, -281889, 317654, 107467, -41482, -108485, -354429]
10564c54429D12752a66180j92100F902M095L39599b03648D04311h3078c8320k34159
10553b72479a09642l57577B2909K60218i6091p7030B26083r5587a27565O2415
10543f5150A08283L7671c9372k44567P8384g4175E6428J85088f0915k7702A67011
10531c1651k20084H5273g5786c3713A84559H6802g3757a624l0867B69536a32427
10519c91305a69934B11652e0577l358m0095A91121P9251e4851l14591J22893A62792
10507c40535a25164A06769a44212j89248f9236A11063J58746J17246G0916J80370
10497B51286h9204k40184a42522q8143J08851F2807a18071A61496j2890J71454
10487C20060b00103f9821a242j99532d6657A28964D9923Q547J1569J5613j4889
$$ y = [-354429, 412752, -166180, -358280, 6902, 10997, 350596, -203648, 404311, -83078, -38320, -272479, -109642, -467219, 22909, 283127, -96091, -173121, 226083, 130496, -127565, -65150, 108283, 145954, -39372, -283939, -205555, -74175, 56428, 241516, -60915, -88617, 167011, -31651, -251735, 85273, -75786, -33713, 184559, 86802, -73757, -1624, -32491, 269536, -132427, -391305, -169934, 211652, -50577, -53935, -94030, 191121, 270372, -54851, -369442, -246549, 162792, -340535, -125164, 106769, -144212, -333460, -69236, 111063, 269809, 387055, 70916, 251286, -89204, -329388, -142522, -230665, -121814, 62807, -118071, 161496, 148606, 320060, -200103, -69821, -1242, -200774, -46657, 128964, 49923, 58470, 70039, 85652, 70763]
10476G0763N8298a48627c4264C3686K5884g1504A14925b76200h7877B59312F1655
10464I1465J07705a92178B58749a4128q326j61590E6097J55115g5148j5848j15450
10453b06446O7233C00479A35222e0341H6518R8365b8408R703i137n9547r5265
10442a63949P9739n7687A72085a30413R429A55643Q536a8162k1024F1048a67779
10430a80790Q7477E0112i482p1041j52557J02067B11726q8414C015b29624b766
10418a27384A27391O907a99922A05278i4963G2707J50684a86814n6369A68404
10407A67992c4082q8176b126B1640k076J19828n4432J39021p7721h9289j76298
10396b65587A40023c4267A45962J752J00097F6429J21392a39922I2052j0867N71564
$$ y = [70763, 129061, -148627, -34264, 33686, 59570, -71504, 114925, -276200, -87877, 259312, 61655, 91465, 199170, -192178, 258749, -14128, -22454, -184044, 56097, 211212, -75148, -90996, -206446, -139213, 300479, 135222, -50341, 86518, 184883, -28408, -18705, -9137, -68684, -163949, -84210, -141897, 172085, -130413, -120984, 155643, 164179, -18162, -39186, 61048, -167779, -180790, -93313, 50112, -9482, -80523, -233080, -131013, 211726, 123312, 3015, -229624, -2766, -127384, 127391, 134298, -199922, 105278, -94963, 72707, 223391, -186814, -243183, 168404, 167992, -34082, -122258, -2126, 21640, 19564, 139392, 84960, 223981, 146260, -89289, -265587, 140023, -34267, 145962, 147714, 247811, 66429, 187821, -139922, 92052, 81185, 652749]
10385F52749k41329D2993K45802o3663a57503B75858b4264H6807K13354m1287
10375B58874J26118b05527A39926J43281j41594C8947J93567M19972j16019C3387
10364B63918J23140j40271J06437a10979F31784g0088C17295o6902K6952A4270
10353b4571B1664J89521J01754k8440K94594F4069J11935l1125N9749a67708B77821
10341h7070C96277A97247q8605L2985O7054H1040J61944A01476J9009d60240b16890
10329C32922b62460G7185k4973K80449j43281f1980A55438Q7300A7890a03301
10318A74187G3857A701J77254i8579E320K02650R2563a87186C9769e4916b164
10306F8968g5650A947g046j70301A92957b19398B2062b97644R8088K1461I0654
$$ y = [652749, 411420, 42993, 288795, 225132, -157503, 275858, -24264, 86807, 300161, 258874, 384992, -205527, 139926, 283207, 141613, 38947, 232514, 652486, 536467, 33387, 263918, 387058, 246787, 353224, -110979, 631784, -70088, 317295, 250393, 277345, 14270, -24571, 21664, 211185, 312939, 284499, 579093, 64069, 176004, 144879, 204628, -167708, 277821, -87070, 396277, 197247, 108642, 141627, 208681, 81040, 242984, 101476, 120485, -460240, -216890, 332922, -262460, 77185, 52212, 332661, 189380, -61980, 155438, 242738, 17890, -103301, 174187, 73857, 1701, 178955, -98579, 5320, 207970, 300533, -187186, 39769, -54916, -2164, 68968, -75650, 1947, -7046, -177347, 192957, -219398, 22062, -297644, -199556, -178095, 90654]
10294i2080C4677c4763k8462j1023A42376F5240Q1176d0410E055h3136l715H4174
10281a56104A03227k3117a18516p9909B4108N1911a45583A92976g0063k66595
10271c36658D6877c93424a21322K7222B01176D226P3933k8231e8336A2737J20586
10260A33323C9438L4892k7939P9030l4432J94590D3434L77360a90126R3286F9156
10248E6767F257R8269b43860B03882c19662j4571a62994A6501e4093j02950I9404
10236g1005k6226K7974K0162A62734F8368K53653a12772j19474B55694J0647b09774
10224A00784b9901j15493j3552k06945B8938a77908k4716Q6664A59964a18443
10213F8063I41J61296b30338P7212b7313A23745a88261A70947e28383E2201h3531
$$ y = [-92080, 34677, -34763, -63225, -74248, 142376, 65240, 146416, -40410, 5055, -83136, -86851, 84174, -156104, 103227, 80110, -118516, -198425, 24108, 76019, -145583, 192976, -70063, -336658, 46877, -393424, -121322, -94100, 201176, 4226, 78159, 49928, -58336, 12737, 133323, 39438, 74330, 46391, 125421, 90989, 285579, 43434, 420794, -190126, -96840, 69156, 56767, 6257, 104526, -243860, 203882, -319662, -334233, -162994, 16501, -54093, -157043, 99404, -71005, -97231, -69257, -49095, 162734, 68368, 322021, -112772, -232246, 255694, 266341, -209774, 100784, -29901, -145394, -158946, -365891, 28938, -177908, -202624, -115960, 159964, -118443, 68063, 941, 162237, -230338, -153126, -27313, 123745, -188261, 170947, -528383, 52201, -83531]
10201b20977o0323B79467A08092a41835E7238e4405A73038l9559a04953B02510
10190c50946f2345A06272C2719Q1627a97936d8307E996R9549f7191l51463G4680
10178A76310a31505B94833h6441j10733R2738M8029B28648G3389P5591a03372
10167b36170A65603b31382E840a21387j13032c2125j5383j15003A06245a63131
10156b02430R0913K8456I3206a67903L1102N7288I1590j1147c32188h3561F5967
10144d9225l07726a71076M4786b3418K200A98141c64710E5762J48384k300b78491
10132a67219A07046b95065f2498G562J16306f2835r4174k16929B16019a77152
10121a12746r175K1363B90558h0017k93692J06910J18649r6591O2955j04514A83797
$$ y = [-220977, -281300, 279467, 108092, -141835, 57238, -54405, 173038, 133479, -104953, 202510, -350946, -62345, 106272, 32719, 114346, -197936, -48307, 5996, 105545, -67191, -418654, 74680, 176310, -131505, 294833, -86441, -197174, -104436, -56407, 228648, 73389, 148980, -103372, -236170, 165603, -231382, 5840, -121387, -234419, -32125, -47508, -162511, 106245, -163131, -202430, -111517, -83061, 93206, -167903, -136801, -79513, 91590, 80443, -332188, -83561, 65967, -49225, -356951, -171076, -126290, -23418, -21218, 198141, -364710, 55762, 204146, 201846, -278491, -167219, 107046, -295065, -62498, 7562, 123868, -62835, -157009, -373938, 216019, -177152, -112746, -121921, -100558, 290558, -80017, -373709, -266799, -148150, -244741, -181786, -286300, 183797]
10109F8867a95420R457M8980E1321a55596j8461g639j09700j5928j12986G8164
10097B825b3346j31637k04758G7133N1025a13k15256L6518N6836k15548C4142
10085h7845A6646a84103C0151a27186b3523k20301i5753k1445M9968j23062q977
10074a99269q6656b962E12501a61474k2102F0768d7198m4306A60957n1668d715
10062g5855p1637n4473a2307q4522c9409j15568I1215f0172l8036A24893E111
10050A56058A5569a97736G0292K2787h2648k29858K3150A70035f535k09944a7863
10038C8509H728h2126A0396b86121e6521f179l1844k02747f7608C1060a30147
10026d64075b20821b0940r0304k48070D28136h360j03120M3813o7910A803R7298
$$ y = [68867, -195420, -185963, -136983, 51321, -155596, -174057, -7639, -117339, -133267, -246253, 78164, 2825, -23346, -154983, -359741, 77133, 128158, -113, -215369, -178851, -122015, -337563, 34142, -87845, 16646, -184103, 30151, -127186, -23523, -243824, -95753, -117198, -67230, -190292, -199269, -285925, -2962, 512501, -161474, -183576, 60768, -47198, -91504, 160957, 109289, -4715, -75855, -147492, -201965, -12307, -96829, -39409, -154977, 91215, -60172, -98208, 124893, 5111, 156058, 15569, -197736, 70292, 93079, -82648, -312506, -289356, 170035, -6535, -216479, -17863, 38509, 8728, -82126, 10396, -286121, -56521, -6179, -38023, -240770, -67608, 31060, -130147, -464075, -220821, -20940, -111244, -359314, 428136, -8360, -111480, -67667, -135577, 1803, 99101]
10015I9101D3731a16139A32763D0058a01776C393L9384i9953j7750A04524e3965
10003A95571f096l74534b7433A28332N614M0589b4490j07700C25857a63135j92422
9992c55557i5841J4246G1363b31462h915j2802j37197H6978c72135A81418a35368
9980a53627O8958q2376k09891K7923e8737D1385a63350j47351a946k53658f9466
9968e8727a2568j93593J936C8158J9977k2484a02608B16317A4153h0283j30519
9957b10802a9722k85012b4915r4913o3329m73643b21825B73470N8930b72415f8587
9945i9799p0364M4386c5345j38883k1654A45531f8887A85485J9967a14952h848
9933b5440B74003i3936b0110D7310P4848m9425Q3432C3013J52980L3604c1040
$$ y = [99101, 43731, -116139, 132763, 40058, -101776, 3393, 42777, -99953, -117703, 104524, -53965, 195571, -6096, -380630, -27433, 128332, 133946, 174535, -24490, -132190, 325857, -163135, -355557, -95841, -81595, 71363, -231462, -8915, -21717, -158914, 86978, -372135, 181418, -135368, -153627, -84669, -167045, -376936, -349013, -58737, 41385, -163350, -310701, -1946, -255604, -69466, -58727, -12568, -206161, -204225, 38158, 58135, 35651, -102608, 216317, 14153, -80283, -210802, -19722, -304734, -24915, -119828, -183157, -656800, -221825, 273470, 332400, -272415, -68587, -99799, -170163, -125777, -35345, -174228, -195882, 145531, -68887, 185485, 205452, -114952, -8848, -25440, 274003, -93936, -20110, 47310, 122158, 72733, 156165, 33013, 185993, 219597, -31040]
9921e8321A20472a40472E732a54706c3993G4927J54796o8591g4039j36482H8745
9909A82885q0892d15386b04692j12310c1973k5809E4551a39543l2737f1491E3452
9897c4546m6376I3243c10421J38531f31j76133l89673h3847j32857A51001a97412
9885a17392b4406F0106g3493l8117L3125C76777d7465B0025C681b05117C3786
9873a73917G296b15130C38157a67264Q3378l1488H2329d2025j47424j76037G9359
9861F8586c51514J47514A86493C8952b35330g1454A21561a18809m4310C3112a44059
9849E7868L9705a68027j2576A87384C8606a17094o1990q4953h4901j8651c4525
9837c46912H4849h5870n156L1671A03383a14345K4224I8569c97309d4550G154
$$ y = [-58321, 120472, -140472, 5732, -154706, -33993, 74927, 229723, 161132, -74039, -210521, 88745, 182885, 101993, -415386, -204692, -317002, -31973, -57782, 54551, -139543, -172280, -61491, 53452, -34546, -80922, 93243, -310421, -171890, -631, -176764, -566437, -83847, -216704, 151001, -197412, -117392, -24406, 60106, -73493, -111610, -78485, 376777, -47465, 20025, 3681, -205117, 33786, -173917, 7296, -215130, 338157, -167264, -83886, -115374, 82329, -42025, -189449, -365486, 79359, 68586, -351514, -204000, 186493, 38952, -235330, -71454, 121561, -118809, -163119, 33112, -144059, 57868, 97573, -168027, -180603, 187384, 38606, -117094, -179084, -264037, -84901, -103552, -34525, -346912, 84849, -85870, -91026, -59355, 103383, -114345, -90121, 98569, -397309, -44550, 7154]
9825c0883k16884A04522g3288n0530B88170j22427a4764A06643a42525f82B42658
9813e9361A3766N6977F625a6031j08888d6351A03924b1608k93995g6433l8581
9802a15014B94747a11413j97961A53521a93526O1393j01582M3752j13880J01396
9792b02447m9932H713L02713g6592K1387H4083h2243A64343C6853R9870M2238
9781A78961i453I4163B116c0186m4439j46760i5247o3508R719A9860K2428B076
9768c23918b7182I1597a19239c2698E6351b74375c2776j46772g4419j08624G1729
9756B56997a34037A91282a30293c4960B56436a2490j19882p4733B51837a40469
9745a31819A16185L9978A0992K1467f4511k99874A05868D1642b14421i7077j87680
$$ y = [-30883, -247767, 104522, -73288, -123818, 288170, 165743, -14764, 106643, -142525, -682, 242658, -59361, 13766, 70743, 6625, -16031, -124919, -46351, 103924, -21608, -315603, -76433, -115014, 294747, -111413, -309374, 153521, -193526, -132133, -233715, -189963, -303843, -202447, -252379, 8713, 311426, -76592, -55205, 84083, -82243, 164343, 36853, 136723, 178961, -9453, 94163, 2116, -30186, -74625, -221385, -95247, -158755, -149036, 19860, 42288, 2076, -323918, -27182, 91597, -119239, -32698, 56351, -274375, -32776, -179548, -74419, -183043, 71729, 256997, -134037, 191282, -130293, -34960, 256436, -12490, -132372, -207105, 251837, -140469, -131819, 116185, 156163, 10992, 32459, -64511, -364385, 105868, 41642, -214421, -97077, -284757]
9734b84757m8866I1886b69952a33016a6029r2130b498j49972A22665L80099B3909
9722d8766A06035f4666j48511G4669a51341P2161k46509e7968A57418b1013r7567
9711a18580B7977g4271r1060l75848K16823a54245d590C5220Q775c88340C2370
9699a772l90327c4217k79821N794d7610l05781a16202o5986k71921b16515k01645
9688d18160F5276A8885i6741j11444d5165A04050b38409K5761A71037b6866j08867
9677a35733j86058A06086A4274J41319C8017a8460A6566H26a34970j2271A88133
9665A05926a90690o7886h3765K1335F8851K65980C4081J70537a04550D7005a35607
9653i8042C4659b17727O9127l8692j04655M6837i3149I0563f3146E0971a27760
$$ y = [-284757, -333623, 91886, -269952, -133016, -16029, -108159, -2498, -152470, 122665, 502764, 23909, -48766, 106035, -64666, -213177, 74669, -151341, -79180, -325689, -57968, 157418, -21013, -118580, 27977, -74271, -165331, -541179, -324356, -154245, -4590, 35220, 43995, -388340, 32370, -1772, -392099, -34217, -314038, -308244, -47610, -353391, -116202, -182188, -454109, -216515, -418160, 65276, 18885, -96741, -208185, -45165, 104050, -238409, -212648, 171037, -26866, -135733, -321791, 106086, 14274, 155593, 38017, -18460, 16566, 826, -134970, -147241, 188133, 105926, -190690, -258576, -83765, -62430, 68851, 334831, 34081, 204618, -104550, 47005, -135607, -98042, 34659, -217727, -148600, -187292, -291947, -245110, -93149, 90563, -63146, 50971, -127760]
9641i8690A2693c22080a8284A5229O6478b9038j34082j34992A16491a1027E7803
9629A95503k3247e8951b8200A87140i7557M3250m68244A76553q1754b07723D8760
9617A02802b19333i3543E467N4005c5822I398R5676b57157A139J32487L49261
9606D82887d2909B5657a31396C20816a28720e6457j05372l630A31937a9798j00685
9595a20483A04295J44546d44673B34676d21930B4414b16801B6370L248N0430b33500
9583A0048b7154A91778e277B27814b85668h9358B22754G2982b01414b2762k9150
9572e1912n7912k02850J48933j12573m9719B05248O6171f7417q4685n929H5796
9560a12034l8934L5673A19250c22141h5631C2690L296L59772p9885a01271A77051
$$ y = [-98690, 12693, -322080, -18284, 15229, 81707, -29038, -163120, -298112, 116491, -11027, 57803, 195503, 172256, -58951, -28200, 187140, -97557, -54307, -522551, 176553, 94799, -207723, 48760, 102802, -219333, -93543, 5467, 59472, -35822, 9398, 105074, -257157, 1139, 133626, 482887, -42909, 25657, -131396, 320816, -128720, -56457, -161829, -165459, 131937, -19798, -120483, 104295, 248841, -444673, 234676, -421930, 24414, -216801, 26370, 29618, 80048, -233500, 10048, -27154, 191778, -5277, 227814, -285668, -89358, 222754, 72982, -201414, -22762, -51912, -109824, -312674, -163741, -276314, -326033, 205248, 271419, -67417, -152102, -158031, 85796, -112034, -150968, -115295, 119250, -322141, -85631, 32690, 35986, 395758, 315873, -101271, 177051]
9548a48450O5619I713J68767a31733j49355b9528a1547j26921j30472J12238d5716
9536B10698J27224c8745k22782o7382I1594c40424j1572B23071b1994A9088h7626
9524G5210A1121M9838K24237a85284Q1624e135j35059E9057d5289K2049L474l1855
9512e1621B79178a97722j0743B11060b0286q439R325l08198A6034a04136k0762
9501a24898K5350L3399D2839a36760A42342i603A74994a32236b7383j33887b9088
9489g0175j5418n0305p7224f6241M181j6165A50905f4118I2194a63707B701b9684
9476B14937c05879r4992A35403L0263C7907A2763J65624a62595m3868n3684h0824
9464a61201m979C96717a37150k2149D3580b18975j98590g5368n324j19666J8404
$$ y = [-148450, -82831, 9713, 178480, -131733, -281088, -29528, -11547, -138468, -268940, -156702, -45716, 210698, 337922, -38745, -261527, -328909, 91594, -340424, -351996, 223071, -21994, 19088, -87626, 75210, 11121, 60959, 285196, -185284, -103660, -5135, -140194, 59057, -45289, -23240, -19766, -51621, 279178, -197722, -208465, 211060, -20286, -28725, -19400, -327598, 16034, -104136, -124898, -99548, -66149, 42839, -136760, 142342, -9603, 174994, -132236, -27383, -161270, -29088, -70175, -85593, -135898, -213122, -66241, -62060, -78225, 150905, -64118, 92194, -163707, 2701, -29684, 214937, -305879, -400871, 135403, 165666, 37907, 12763, 178387, -162595, -206463, -260147, -80824, -161201, -166180, 396717, -137150, -159299, 43580, -218975, -417565, -75368, -80692, -200358, -181954]
9453a81954G4966b28096i4348k11078a36316j93484a07587A18814a07823D3515
9442b55111D7248e80686a60604F6831a52415K0182I4167b35925a0028j2441k00769
9431b23238g6917k24808a01165I6188a20286J2721m963A35447a35354L5581d8159
9419C3466g255k65372n1526h9535D665J93376i5057j34371j76845J16201A95428
9407E1745P5750C0049c62315J51168k417l21523f7631E7385c34530I1768a09621
9395a70558I0964a1264j16320k07701J27848A29124h2816n3783D5115b72562f0016
9383F4448f625A54115k4604a95206P8667A30914j8717b77842a23243F3046J71588
9372B34634B5647b23398g7416a8372j49884e0469D50821a8634B30109b68214A3636
$$ y = [-181954, 74966, -228096, -94348, -305426, -136316, -329800, -107587, 118814, -107823, 43515, -255111, 47248, -580686, -160604, 66831, -152415, -132233, 94167, -235925, -10028, -22469, -223238, -76917, -301725, -101165, 96188, -120286, -107565, -112528, 135447, -135354, -99773, -48159, 33466, -7255, -272627, -324153, -89535, 4665, 198041, -95057, -229428, -406273, -290072, 195428, 51745, 127495, 30049, -362315, -211147, -213564, -535087, -67631, 57385, -334530, 91768, -109621, -170558, 90964, -11264, -127584, -335285, -207437, 129124, -82816, -136599, 45115, -272562, -60016, 64448, -6625, 154115, 129511, -195206, -116539, 130914, 112197, -277842, -123243, 63046, 234634, 25647, -223398, -77416, -18372, -168256, -50469, 450821, -18634, 230109, -268214, 13636]
9360a04460j14109A8792a12591A63839i4864K4099A28640a85555F6407J78503
9350B44910c307j65547f2769p7646A59254b52573Q3867A02691c44750a33881A4540
9338i8178A50801e2754B9317b03206D7278c72079a07551j37699k5398a23890k84169
9327d08059N1304B02697d50172e2869k58850e2642k8119B27257l4224e962j31279
9316a37241A30355a10820I2466B6275a7588A74552E1888b16037m418a0388j98909
9305b09297r3827A28104n0509a85362M9272G3183b15579A23719r413i4732o5221
9294a59953a945E9659a16210m7841A20339E1783b00798E9582J0145K8168G371
9282c34045a12091A53407J03867c07095a43274A04438c08480c778j71416B8962
$$ y = [-104460, -218569, 18792, -112591, 163839, -94864, -70765, 128640, -185555, 66407, 244910, -3307, -168854, -62769, -140415, 159254, -252573, -168706, 102691, -344750, -133881, 14540, -98178, 150801, -52754, 29317, -203206, 47278, -372079, -107551, -245250, -270648, -123890, -408059, -356755, 202697, -450172, -52869, -311719, -52642, -80761, 227257, 193033, -5962, -137241, 130355, -110820, 92466, 26275, -17588, 174552, 51888, -216037, -220455, -10388, -209297, -303124, 128104, 77595, -185362, -136090, 73183, -215579, 123719, 114306, -94732, -159953, -1945, 59659, -116210, -164051, 120339, 51783, -200798, 59582, 69727, 97895, 7371, -334045, -112091, 153407, 257274, -307095, -143274, 104438, -308480, -3778, -175194, 28962]
9271E3861a60169j25153D6293b89799B66248b06822P1144j69061F4385K72730
9261C37115a54830j8224D9658c01691C51356A05764a42173B17897b46718A66682
9250c15948G5110b11698A85557a5881l00202A74563N5926a60499A77187b16788
9239D9068c7529q5087a8052B3201E426P4023e1974k545C9197c00036A06088a30099
9226g4574A2584d74054J43095e4556j34625j93828J88937M9706f0381A02582D4745
9214c3939k6737R204k69606I7332c6974B54176a49604e6626k21795A25610b66861
9202b48115K9065i6086A75390j3955G5198c25649A01245b84284A27082a7893j43138
9191a61031A8168b58445B36824b26676O6998B38942c0350q597j7428l41O783H0600
$$ y = [53861, -160169, -285322, 46293, -289799, 266248, -206822, -135678, -304739, 64385, 337115, -154830, -173054, 49658, -301691, 351356, 105764, -142173, 217897, -246718, 166682, -315948, 75110, -211698, 185557, -15881, -316083, 174563, 230489, -160499, 177187, -216788, 49068, -37529, -122616, -18052, 23201, 5426, 79449, -51974, -54519, 39197, -300036, 106088, -130099, -74574, 12584, -474054, -330959, -54556, -189181, -383009, -194072, -144366, -60381, 102582, 44745, -33939, -60676, -51472, -321078, 97332, -36974, 254176, -149604, -56626, -278421, 125610, -266861, -248115, -219050, -96086, 175390, 161435, 75198, -325649, 101245, -284284, 127082, -17893, -161031, 18168, -258445, 236824, -226676, -159678, 238942, -30350, -38947, -56375, -56716, -49933, 80600]
9178B0452J09742J47898a35353A96271a88862e8497m2957B9740M9337k5163J89860
9167B43774b08417O5214F4262d62387A2339a58681D8684a37097F5404d55680H315
9155a80412G3656b01062F9567b01346B18301a51630d9464n0974G5866A0532a67496
9143B08718d7266j65359H7603b52037A42588B295a14089k99042A64369b68844
9132a99207Q7296C14212a84140B2415a86875h7304j19550l21178G7933a29456
9121B42540A08716B3211a06964p6009o755B11691c5486A38926K1594B5898K02239
9110B28137B7203a91543h3433E8532a30133j31291M5089g9734l49125j02945b311
9098h5757l11568C0357J55315F2793a32470H4507J56892K4629j01778B9451q949
$$ y = [20452, 130194, 278092, -135353, 196271, -188862, -58497, -101454, 29740, 79077, 53914, 243774, -208417, -143203, 64262, -462387, 12339, -158681, 48684, -137097, 65404, -455680, 8315, -180412, 73656, -201062, 69567, -201346, 218301, -151630, -49464, -100438, 75866, 10532, -167496, 208718, -47266, -212625, 87603, -252037, 142588, 2295, -114089, -413131, 164369, -268844, -199207, -111911, 314212, -184140, 22415, -186875, -87304, -206854, -528032, 77933, -129456, 242540, 108716, 23211, -106964, -182973, -189728, 211691, -35486, 138926, 160520, 25898, 228137, 27203, -191543, -83433, 58532, -130133, -261424, -216335, -79734, -428859, -531804, -2311, -85757, -397325, 30357, 185672, 62793, -132470, 84507, 241399, 266028, 164250, 29451, 20502]
9087B0502a24243L148N3422C2734M9752d23126c4174l30236B3172a21818p6014
9076a97832A48783G1535P2618e2359j11573K3654o3248E7470f3357A16023E7837
9064a07089k97056M1110a9586G8886b01974h4692L1091A25042K6914J8683C5876
9052A97367b20134A04605L77687A50486i7534D8158h7963A99211b38680B10753
9041a87737j51314A14735b71563I1015b62862A48525h8438j11721f3501j0908
9031g4409a139j16627F7438b76058I0241b94090R5318g5272p0401C5796a5736
9019f08907c0973A2135a85835K1362r2808I2040J9103a86531k55160A50734A8804
9007A58517a75306j22946G0399f0025a6354G1586i4124p7500j14991J19679B86375
$$ y = [20502, -124243, -121095, -67673, 32734, 82486, -423126, -34174, -364410, 23172, -121818, -197832, 148783, 71535, 144153, -52359, -163932, -140278, -203526, 57470, -63357, 116023, 57837, -107089, -404145, -363035, -19586, 78886, -201974, -84692, -53601, 125042, 151956, 170639, 35876, 197367, -220134, 104605, 482292, 150486, -97534, 48158, -87963, 199211, -238680, 210753, -187737, -339051, 114735, -271563, 91015, -262862, 148525, -88438, -200159, -63501, -74409, -1139, -117766, 67438, -276058, 90241, -294090, -198772, -75272, -145673, 35796, -15736, -608907, -30973, 12135, -185835, -164473, -257281, 92040, 111143, -186531, -441691, 150734, 18804, 158517, -175306, -298252, 70399, -60025, -16354, 71586, -94124, -171624, -286615, -166936, 286375]
8995A19207g2105r7553F4398i8799a1922k75126A11890N9231f7322k51293i4356
8983h4250o9465F3660Q1315k2150d0174q7920B56590A0649a16890e4325p9035
8972a33360j42122L0384E4071J81503A26b91758R4392j28014B78079F1121a8612
8960a07652I3053l4434J28508A9551b9593A36088C8751d2499I3348a05958k2694
8949a28652a5743a952j28026b57n6800r5843k90620a10561A40891M0815f8952
8937E8460b29194d4779F9188J16142j4036c6738F8366b1259j41125A91968C757
8925g2142A96961L647J253761L771170L276345B905063A124756C64125f983A90708
8914D76868d9613j75113A0892L44893a21642G9585B1991a55732d5788A10883f9117
$$ y = [119207, -72105, -169658, 64398, -98799, -11922, -287048, 111890, 171121, -67322, -318615, -94356, -84250, -153715, 63660, 144975, 122825, -40174, -128094, 256590, 10649, -116890, -54325, -133360, -275482, -245098, 54071, 235574, 126, -291758, -197366, -325380, 278079, 61121, -18612, -107652, 93053, 58619, 187127, 19551, -29593, 136088, 38751, -42499, 93348, -105958, -128652, -15743, -1952, -129978, -257, -57057, -152900, -443520, -110561, 140891, 181706, -68952, 58460, -229194, -44779, 69188, 185330, 171294, -36738, 68366, -21259, -162384, 191968, 3757, -72142, 196961, 200608, 1454369, 5225539, 8501884, 2905063, 1124756, 364125, -6983, 190708, 476868, -49613, -224726, 10892, 355785, -121642, 79585, 21991, -155732, -45788, 110883, -69117]
8902a2568q4288B48809a37084j15343a17110A39343F6261g9544j30862E176O8885
8891G4061c26363G7338J40549A6125b66305A07853b98108D9980f8468j71455a01658
8879B43692D6094h1831B20105G2311a89665A04972b04402A27515i5650k52454
8869c48104H3579c02333J03578c5638F0313j3655M2659f6561K1693b0804j41087
8858a61891N3865j04009B1364J86485h7042p2266F489L9190b26105r4324A0998
8846H5090c15338A57861f5021n7753n5298L7131j13648d7001l980A38063a22391
$$ y = [-12568, -96856, 248809, -137084, -252427, -117110, 139343, 66261, -79544, -210406, 5176, 74061, -326363, 77338, 217887, 16125, -266305, 107853, -298108, 49980, -68468, -239923, -101658, 243692, 46094, -81831, 220105, 72311, -189665, 104972, -204402, 127515, -95650, -348104, 83579, -302333, -198755, -35638, 60313, 46658, 89317, -66561, -44868, -20804, -161891, -108026, -212035, 21364, 207849, -87042, -159308, 6489, 45679, -226105, -320429, 10998, 85090, -315338, 157861, -65021, -122774, -178072, -140941, -254589, -47001, -50981, 138063, -122391]
$$ [...]
##END NTUPLES=NMR SPECTRUM
##END=
