##TITLE=AC1423_MEXR_12233_7764356_ZsiqsYwX4C
##JCAMPDX= 6.0         $$ Bruker NMR JCAMP-DX V2.0
##DATA TYPE= NMR SPECTRUM
##DATA CLASS= NTUPLES
##ORIGIN= BRUKER
##OWNER= Administrator
$$ 1.72 TOPSPIN		Version 2.1
$$ 2013-04-11 20:44:52.183 -0700  Administrator@X
$$ Compression mode = diff/dup
##.OBSERVE FREQUENCY= 400.02188249412
##.OBSERVE NUCLEUS= ^1H
##.ACQUISITION MODE= SIMULTANEOUS (DQD)
##.ACQUISITION SCHEME= undefined
##.AVERAGES= 64
##.DIGITISER RES= 22
##SPECTROMETER/DATA SYSTEM= spect
##.PULSE SEQUENCE= noesygpps1d.comp
##.SOLVENT NAME= COFFEE_meoh
##.SHIFT REFERENCE= INTERNAL, COFFEE_meoh, 1, 14.96107
##AUDIT TRAIL= $$ (NUMBER, WHEN, WHO, WHERE, PROCESS, VERSION, WHAT)
$$ ##TITLE= Audit trail, TOPSPIN		Version 2.1
$$ ##JCAMPDX= 5.01
$$ ##ORIGIN= Bruker BioSpin GmbH
$$ ##OWNER= Administrator
$$ $$ E:\/data/COFFEE/nmr/AC1423_MEXR_12233_7764356_ZsiqsYwX4C/22/pdata/1/auditp.txt
$$ ##AUDIT TRAIL=  $$ (NUMBER, WHEN, WHO, WHERE, PROCESS, VERSION, WHAT)
(   1,<2013-04-11 20:44:46.308 -0700>,<Administrator>,<X>,<go>,<TOPSPIN 2.1>,
      <created by zg
	started at 2013-04-11 20:33:16.783 -0700,
	POWCHK enabled, PULCHK disabled,
       configuration hash MD5:
       33 CF 6A 21 5C D3 B9 40 6C 15 AA 8D 27 A2 4F 13
       data hash MD5: 64K
       9D 85 57 67 3E E3 64 55 EC 7D 36 C3 E7 BB E6 66>)
(   2,<2013-04-11 20:44:49.386 -0700>,<Administrator>,<X>,<proc1d>,<TOPSPIN 2.1>,
      <Start of raw data processing
       efp LB = 0.3 FT_mod = 6 PKNL = 1 PHC0 = 0 PHC1 = 0 SI = 128K 
       data hash MD5: 128K
       47 50 87 3D C6 60 F0 5D EF CC F4 2D B5 3B 19 79>)
(   3,<2013-04-11 20:44:50.402 -0700>,<Administrator>,<X>,<proc1d>,<TOPSPIN 2.1>,
      <pk PHC0 = -81.97998 PHC1 = 0 
       data hash MD5: 128K
       DE 1F 52 8C E2 CC 91 4F 28 98 38 12 E2 B7 91 B5>)
(   4,<2013-04-11 20:44:51.121 -0700>,<Administrator>,<X>,<proc1d>,<TOPSPIN 2.1>,
      <abs ABSG = 1 
       data hash MD5: 128K
       59 E6 04 F1 C3 CD 3A 9B 55 99 6D 0A 66 14 D9 74>)
(   5,<2013-04-11 20:44:51.292 -0700>,<Administrator>,<X>,<proc1d>,<TOPSPIN 2.1>,
      <abs ABSG = 2 
       data hash MD5: 128K
       53 FC 46 A6 35 B7 CA 65 BF 38 CB B2 02 1C 70 1E>)
(   6,<2013-04-11 20:44:51.480 -0700>,<Administrator>,<X>,<proc1d>,<TOPSPIN 2.1>,
      <abs ABSG = 3 
       data hash MD5: 128K
       D7 78 35 0A 78 3C 35 E4 B0 CB A6 37 AD 9F 64 03>)
(   7,<2013-04-11 20:44:51.667 -0700>,<Administrator>,<X>,<proc1d>,<TOPSPIN 2.1>,
      <abs ABSG = 4 
       data hash MD5: 128K
       95 3A 54 60 AE 39 86 81 C9 8A D5 DE DD AE C8 FC>)
(   8,<2013-04-11 20:44:51.839 -0700>,<Administrator>,<X>,<proc1d>,<TOPSPIN 2.1>,
      <abs ABSG = 5 
       data hash MD5: 128K
       97 E5 EB EC 06 77 52 43 FB FB 1E C2 56 40 4F 99>)
$$ ##END=
$$ 
$$ $$ hash MD5
$$ $$ FD 26 8E 34 3E 7F 34 A4 6D 9D D6 14 A4 F3 2F 3B
##$RELAX= 
##$RELAX= 
##$RELAX= 
##$RELAX= 
##$RELAX= 
##$RELAX= 
##$RELAX= 
##$RELAX= 
$$ Bruker specific parameters
$$ --------------------------
##$DU= <E:\>
##$EXPNO= 22
$$ [...]
##$TP07= 0
##$TPNAME0= <>
##$TPNAME1= <>
##$TPNAME2= <>
##$TPNAME3= <>
##$TPNAME4= <>
##$TPNAME5= <>
##$TPNAME6= <>
##$TPNAME7= <>
##$TPOAL= (0..7)
0.5 0.5 0.5 0.5 0.5 0.5 0.5 0.5
##$TPOFFS= (0..7)
0 0 0 0 0 0 0 0
##$TUNHIN= 0
##$TUNHOUT= 0
##$TUNXOUT= 0
##$USERA1= <user>
##$USERA2= <user>
##$USERA3= <user>
##$USERA4= <user>
##$USERA5= <user>
##$V9= 5
##$VALIST= <valist>
##$VCLIST= <CCCCCCCCCCCCCCC>
##$VD= 0
##$VDLIST= <DDDDDDDDDDDDDDD>
##$VPLIST= <PPPPPPPPPPPPPPP>
##$VTLIST= <TTTTTTTTTTTTTTT>
##$WBST= 2048
##$WBSW= 25
##$XGAIN= (0..3)
0 0 0 0
##$XL= 0
##$YL= 0
##$YMAX_a= 5280598
##$YMIN_a= -11655123
##$ZGOPTNS= <>
##$ZL1= 120
##$ZL2= 120
##$ZL3= 120
##$ZL4= 120
##$ABSF1= 14.96107
##$ABSF2= -5.597112
##$ABSG= 5
##$ABSL= 3
##$ALPHA= 0
##$AQORDER= 0
##$ASSFAC= 0
##$ASSFACI= 0
##$ASSFACX= 0
##$ASSWID= 0
##$AUNMP= <proc_prof1d_extract.lims>
##$AXLEFT= 0
##$AXNAME= <>
##$AXNUC= <1H>
##$AXRIGHT= 0
##$AXTYPE= 0
##$AXUNIT= <>
##$AZFE= 0.1
##$AZFW= 0.1
##$BCFW= 0
##$BC_mod= 0
##$BYTORDP= 0
##$COROFFS= 0
##$CY= 15
##$DATMOD= 1
##$DC= 0
##$DFILT= <>
##$DTYPP= 0
##$F1P= 0
##$F2P= 0
##$FCOR= 0.5
##$FTSIZE= 131072
##$FT_mod= 6
##$GAMMA= 0
##$GB= 0
##$INTBC= 1
##$INTSCL= 1
##$ISEN= 128
##$LB= 0.3
##$LEV0= 0
##$LPBIN= 0
##$MAXI= 10000
##$MC2= 0
##$MEAN= 0
##$ME_mod= 0
##$MI= 0
##$NCOEF= 0
##$NC_proc= -2
##$NLEV= 6
##$NOISF1= 0
##$NOISF2= 0
##$NSP= 0
##$NTH_PI= 0
##$NZP= 0
##$OFFSET= 14.96107
##$PC= 1
##$PHC0= -81.97998
##$PHC1= 0
##$PH_mod= 1
##$PKNL= yes
##$PPARMOD= 0
##$PPDIAG= 0
##$PPIPTYP= 0
##$PPMPNUM= 2147483647
##$PPRESOL= 1
##$PSCAL= 4
##$PSIGN= 0
##$PYNMP= <proc.py>
##$REVERSE= no
##$SF= 400.020009608304
##$SI= 131072
##$SIGF1= 0
##$SIGF2= 0
##$SINO= 400
##$SIOLD= 131072
##$SPECTYP= <>
##$SREGLST= <1H.CDCl3>
##$SSB= 0
##$STSI= 131072
##$STSR= 0
##$SW_p= 8223.68421052631
##$SYMM= 0
##$S_DEV= 0
##$TDeff= 65536
##$TDoff= 0
##$TI= <>
##$TILT= no
##$TM1= 0
##$TM2= 0
##$TOPLEV= 0
##$USERP1= <user>
##$USERP2= <user>
##$USERP3= <user>
##$USERP4= <user>
##$USERP5= <user>
##$WDW= 1
##$XDIM= 131072
##$YMAX_p= 384351342
##$YMIN_p= -12939
##$CURPLOT= <Network HP LaserJet P1505>
##$CURPRIN= <$Network HP LaserJet P1505>
##$DFORMAT= <normdp>
##$LAYOUT= <+/1D_H.xwp>
##$LFORMAT= <normlp>
##$PFORMAT= <normpl>
##$SURQMSG= 1
$$ End of Bruker specific parameters
$$ ---------------------------------
##NTUPLES= NMR SPECTRUM
##VAR_NAME=  FREQUENCY,     SPECTRUM/REAL,   SPECTRUM/IMAG
##SYMBOL=    X,             R,               I
##VAR_TYPE=  INDEPENDENT,   DEPENDENT,       DEPENDENT
##VAR_FORM=  AFFN,          ASDF,            ASDF
##VAR_DIM=   131072,        131072,          131072
##UNITS=     HZ,            ARBITRARY UNITS, ARBITRARY UNITS
##FACTOR=    0.0627417313425164, 1,          1
##FIRST=     8223.62146879497, 944,          -51133
##LAST=      0,             2786,            -51797
##MIN=       0,             -12939,          0
##MAX=       8223.62146879497, 384351342,    0
$$ Real data points
##PAGE= N=1
##DATA TABLE= (X++(R..R)), XYDATA
$$ [...]
61594E16154m278l411l038l239l391l246l120l013k577k027k089k844l521l637
$$ 516154 511876 508465 505427 502188 498797 495551 492431 489418 486841 484814 482725 479881 476360 472723
61580D72723l529l479l215k667k359k611k967k930k610k329k099j834j635j535
$$ 472723 469194 465715 462500 459833 457474 454863 451896 448966 446356 444027 441928 440094 438459 436924
61566D36924j466j604k116k576k306j470r22q97p83m11m24r31r82n4J013J268
$$ 436924 435458 433854 431738 429162 426856 425386 424464 423567 422784 422373 421949 421018 420036 419982 420995 422263
61550D22263R28N94J57n10p21P5J163J457J001O50P30J044J652K605L261K959
$$ 422263 423191 423785 423942 423432 422711 422786 423949 425406 426407 427057 427787 428831 430483 433088 436349 439308
61534D39308K067J453J294J260J440J999K322J682M70l21o43j188j945k244k097
$$ 439308 441375 442828 444122 445382 446822 448821 451143 452825 453295 452974 452331 451143 449198 446954 444857
61519D44857k135k248j738r51j209k732m055m062l313k682k035j147p04j206j758
$$ 444857 442722 440474 438736 437785 436576 433844 429789 425727 422414 419732 417697 416550 415846 414640 412882
61504D12882j241j07K13o70j780k295k267j918j227m31p5k51m21k51j09l62o69
$$ 412882 411641 411534 411747 411077 409297 407002 404735 402817 401590 401159 401084 400833 400412 400161 400052 399690 399021
61487C99021m68J40N24M02J59K21N12P15P97Q82Q80N96J73j6L1l1j45K53J217
$$ 399021 398553 398693 399217 399619 399778 399999 400511 401226 402023 402905 403785 404381 404554 404538 404569 404538 404393 404646 405863
61468D05863J800J199rn95m09m17j083j634j324n50j23j01L8L84M84J42k61l00
$$ 405863 407663 408862 408853 408258 407849 407432 406349 404715 403391 402841 402718 402617 402655 403039 403523 403665 403404 403104
61450D03104M3N13Q93J038Q89N84M30N90Q56Q89P30Q48J558K501K994K889K687
$$ 403104 403147 403660 404553 405591 406480 407064 407494 408084 408940 409829 410559 411407 412965 415466 418460 421349 424036
61433D24036K791L009L089L286L900M500M307L237K054J368J044P67O87J100J822
$$ 424036 426827 429836 432925 436211 440111 444611 448918 452155 454209 455577 456621 457388 458075 459175 460997
61418D60997K298K259K012K060K522K904K513J190l55j179j046o02n86j106j806
$$ 460997 463295 465554 467566 469626 472148 475052 477565 478755 478400 477221 476175 475573 474987 473881 472075
61403D72075k355k662k741k705k783l169l713l974l632k828k030j514j115n69
$$ 472075 469720 467058 464317 461612 458829 455660 451947 447973 444341 441513 439483 437969 436854 436285
61389D36285P7N26O47N44K92o7l35l39l03n81r22o31L08R05M94k02k7J014J897
$$ 436285 436362 436888 437535 438079 438371 438304 437969 437630 437327 436746 435824 435193 435501 436406 436900 436698 436671 437685 439582
61370D39582K051J837J665J501J366J612K319L020L268L113K810K492K294K418
$$ 439582 441633 443470 445135 446636 448002 449614 451933 454953 458221 461334 464144 466636 468930 471348
61356D71348K827L185L276L240L320L686M485N740P066P946Q359Q835R787J1142
$$ 471348 474175 477360 480636 483876 487196 490882 495367 501107 508173 516119 524478 533313 543100 554242
61342E54242J2690J4282J5619J6256J6062J5268J3930J1794Q919N882L071K41
$$ 554242 566932 581214 596833 613089 629151 644419 658349 670143 679062 684944 688015 688256
61330F88256k790n454o999p477p669q086q523q549q044p195o284n546n050m576
$$ 688256 685466 680012 673013 665536 657867 649781 641258 632709 624665 617470 611186 605640 600590 596014
61316E96014l833k833j990j707j939k188k000j398p82m30j46M67J557K863L989
$$ 596014 592181 589348 587358 585651 583712 581524 579524 578126 577344 576914 576768 577235 578792 581655 585644
61301E85644M718N268O221P959J0011J1306J1409J1053J1051J0946R535O533K966
$$ 585644 590362 595630 601851 609810 619821 631127 642536 653589 664640 675586 685121 691654 694620
61288F94620k06k992n644p743q678q592q207p866p273o087m440k789j576j046
$$ 694620 694414 691422 685778 678035 669357 660765 652558 644692 637419 631332 626892 624103 622527 621481
61274F21481j074j116n29Q95K701M203N128N797O620P555Q215Q484Q785R550J0696
$$ 621481 620407 619291 618762 619657 622358 626561 631689 637486 644106 651661 659876 668360 677145 686695 697391
61259F97391J1792J2559J3012J3311J3644J4113J4569J4834J5172J6074J7205
$$ 697391 709183 721742 734754 748065 761709 775822 790391 805225 820397 836471 853676
61248H53676J7191J4971J1009O517J955k809p305j0526j2328j3627j4962j5825
$$ 853676 870867 885838 896847 903364 905319 902510 895205 884679 872351 858724 843762 827937
61236H27937j5740j5143j4609j3912j2546j0595q549o622m829l380k457j828j122
$$ 827937 812197 797054 782445 768533 755987 745392 736843 730221 725392 722012 719555 717727 716605
61223G16605k87N16J283K024K588K885L099L377L578L523L212K591J511J95o93
$$ 716605 716318 716834 718117 720141 722729 725614 728713 732090 735668 739191 742403 744994 746505 746700 746007
61208G46007q39p71j115j661j679r09K49J296J940K066J879K099L411N680Q083
$$ 746007 745168 744397 743282 741621 739942 739033 739282 740578 742518 744584 746463 748562 751973 757653 765736
61193G65736J0063J1811J3681J5558J7098J8389K0006K2302K4794K6530K7017
$$ 765736 775799 787610 801291 816849 833947 852336 872342 894644 919438 945968 972985
61182I72985K6537K5456K3595K0658J7061J3705J0986Q543O043L716J904N55o22
$$ 972985 999522 1024978 1048573 1069231 1086292 1099997 1110983 1119526 1125569 1129285 1131189 1131744 1131122
61169A131122j892l554n860q662j1447j3936j6289j8567k0493k1948k3206k4331
$$ 1131122 1129230 1125676 1119816 1111154 1099707 1085771 1069482 1050915 1030422 1008474 985268 960937
61157I60937k4819k4303k3218k2210k1144j9313j6529j3517j1086r334p766o084
$$ 960937 936118 911815 888597 866387 845243 825930 809401 795884 784798 775464 767698 761614
61145G61614m506l289k095k62K216M434N660O227O772O999O094M170K203M75j746
$$ 761614 757108 753819 751724 751462 753678 758112 763772 769999 776771 783770 789864 794034 796237 796712 794966
61130G94966m589o729o879n416l688k333r72R23L580P036J0929J4434J6948J8738
$$ 794966 790377 783648 776769 771353 767665 765332 764360 765283 768863 775899 786828 801262 818210 836948
61116H36948K0483K2443K4422K6147K7309K7615K7286K7155K7709K8343K8022
$$ 836948 857431 879874 904296 930443 957752 985367 1012653 1039808 1067517 1095860 1123882
61105A123882K6394K3858K0942J8059J5541J3418J1339R079O776M425J647j631
$$ 1123882 1150276 1174134 1195076 1213135 1228676 1242094 1253433 1262512 1269288 1273713 1275360 1273729
61093A273729m877p837j1070j5063j9360k3224k6578k9539l1626l2346l2150l1869
$$ 1273729 1268852 1261015 1249945 1234882 1215522 1192298 1165720 1136181 1104555 1072209 1040059 1008190
61081A008190l1454l0165k7858k5273k3099k1437k0075j8715j7026j4960j2893
$$ 1008190 976736 946571 918713 893440 870341 848904 828829 810114 793088 778128 765235
61070G65235j1059r257p515o425o189n922m788l228k186j650r21R0R31J609K488
$$ 765235 754176 744919 737404 730979 724790 718868 714080 710852 708666 707016 706095 706185 707116 708725 711213
61055G11213L451M193M976O079O892O836O794Q225J0998J3526J5047J6316J7922
$$ 711213 714664 718857 723833 729912 736804 743640 750434 758659 769657 783183 798230 814546 832468
61042H32468J9438K0571K1770K3158K4102K4385K4734K5625K6511K6721K6339
$$ 832468 851906 872477 894247 917405 941507 965892 990626 1016251 1042762 1069483 1095822
61031A095822K5797K5309K5010K4956K4762K4074K3350K3360K3989K4562K5263
$$ 1095822 1121619 1146928 1171938 1196894 1221656 1245730 1269080 1292440 1316429 1340991 1366254
61020A366254K6904K9291L1267L2566L4141L6416L8677M0561M2628M5071M7530
$$ 1366254 1393158 1422449 1453716 1486282 1520423 1556839 1595516 1636077 1678705 1723776 1771306
61009A771306N0672N6176O4446P4071Q4231R5761J08975J22634J36353J52055
$$ 1771306 1821978 1878154 1942600 2016671 2100902 2196663 2305638 2428272 2564625 2716680
60999B716680J71722J95922K26229K66909L22230L94646M88712O15219P88721
$$ 2716680 2888402 3084324 3310553 3577462 3899692 4294338 4783050 5398269 6186990
60990F186990J021445J318423J669638K038752K365529K594735K706872K708776
$$ 6186990 7208435 8526858 10196496 12235248 14600777 17195512 19902384 22611160
60982B2611160K588641K299701J815865J207531O38434K63056J22436J42211K17816
$$ 22611160 25199801 27499502 29315367 30522898 31161332 31424388 31546824 31689035 31906851
60973C1906851K77927K66229J01818k93756r13991j629349k251747k644677k779653
$$ 31906851 32184778 32451007 32552825 32259069 31345078 29715729 27463982 24819305 22039652
60964B2039652k709663k511479k250585j973604j708501j466284j248152j053930
$$ 22039652 19329989 16818510 14567925 12594321 10885820 9419536 8171384 7117454
60956G117454q84043p37125o10567n03306m15458l45454k89860k45756k11343
$$ 7117454 6233411 5496286 4885719 4382413 3966955 3621501 3331641 3085885 2874542
60947B874542j84499j62738j44626j29631j16757j04802r3807q4761p7832p2273
$$ 2874542 2690043 2527305 2382679 2253048 2136291 2031489 1937682 1852921 1775089 1702816
60937A702816o7990o5624o4990o4741o3899o2453o0336n7086n2861m8633m4936
$$ 1702816 1634826 1569202 1504212 1439471 1375572 1313119 1252783 1195697 1142836 1094203 1049267
60926A049267m1402l7811l4522l1458k7860k3640j9970j7788j6552j5200j3597
$$ 1049267 1007865 970054 935532 904074 876214 852574 832604 814816 798264 783064 769467
60915G69467j2192j0938r381p450n382l228j110M03R29J050J701K943L991M359
$$ 769467 757275 746337 736956 729506 724124 720896 719786 720189 721118 722168 723869 726812 730803 735162
60901G35162M254L853K920J391k19j321j937k734m398o977r619j1211j1437j1115
$$ 735162 739416 743269 746189 747580 747361 746040 744103 741369 736971 729994 720375 709164 697727 686612
60887F86612j1261j1967j2593j2733j2461j1808j0680r363q524q427q592q477
$$ 686612 675351 663384 650791 638058 625597 613789 603109 593746 585222 576795 568203 559726
60875E59726q045p456o631n499m349l529k968k284j292j79O44P87K30l42P5J724
$$ 559726 551681 544225 537594 532095 527746 524217 521249 518965 517673 517494 518138 518925 519155 518813 518888 520612
60859E20612L645M759N105N538O395P154P437P639Q185Q712Q479P363O032N173
$$ 520612 524257 529016 534121 539659 546054 553208 560645 568284 576469 585181 593660 601023 607055 612228
60845F12228M890M823M586M020L251K604K301K221J971J244K2j548l349n227o853
$$ 612228 617118 621941 626527 630547 633798 636402 638703 640924 642895 644139 644161 642613 639264 634037 627184
60830F27184p875q191q021p595o947o138n530n530o030o409o288n984o033o398
$$ 627184 619309 611118 603097 595502 588555 582417 576887 571357 565327 558918 552630 546646 540613 534215
60816E34215o520o106n507n239n378n560n448n006m428l883l361k731j984j385
$$ 534215 527695 521589 516082 510843 505465 499905 494457 489451 485023 481140 477779 475048 473064 471679
60802D71679j248j510j647j113J56J728L079L986M507M715M549M047L609L741
$$ 471679 470431 468921 467274 466161 466317 468045 471124 475110 479617 484332 488881 492928 496537 500278
60788E00278M517N446O052O340O536O618O488O438O928P905Q737Q977Q823Q659
$$ 500278 504795 510241 516293 522633 529169 535787 542275 548713 555641 563546 572283 581260 590083 598742
60774E98742Q568Q513Q599Q801Q696P981P103O889P533Q354Q689Q654Q810R406
$$ 598742 607310 615823 624422 633223 641919 649900 657003 663892 671425 679779 688468 697122 705932 715338
60760G15338J0227J1016J1705J2283J2696J3035J3563J4408J5341J5960J6152
$$ 715338 725565 736581 748286 760569 773265 786300 799863 814271 829612 845572 861724
60749H61724J6300J7013J8601K0728K2592K3553K3714K3824K4450K5368K5801
$$ 861724 878024 895037 913638 934366 956958 980511 1004225 1028049 1052499 1077867 1103668
60738A103668K5181K3412K0591J6815J2370P730L121j661o781j1943j6618k0518
$$ 1103668 1128849 1152261 1172852 1189667 1202037 1209767 1212888 1211227 1204446 1192503 1175885 1155367
60726A155367k3601k5902k7612k9096l0399l0901k9979k7917k5673k3782k2032
$$ 1155367 1131766 1105864 1078252 1049156 1018757 987856 957877 929960 904287 880505 858473
60715H58473k0289j8948j8182j7351j5738j3620j2003j1332j1029j0407r606r335
$$ 858473 838184 819236 801054 783703 767965 754345 742342 731010 719981 709574 699968 690633
60703F90633r897j0854j1623j2115j2561j2861j2494j1228r666q708q603q799
$$ 690633 680736 669882 658259 646144 633583 620722 608228 597000 587334 578626 570023 561224
60691E61224q788q571q278p777p031o485o557o903o668n542m118l088k471j866
$$ 561224 552436 543865 535587 527810 520779 514294 507737 500834 494166 488624 484506 481418 478947 477081
60677D77081j119m30M9M02P91J324K009K628K761K238J510J224J386J310N56n01
$$ 477081 475962 475532 475581 475983 476774 478098 480107 482735 485496 487734 489244 490468 491854 493164 493720 493219
60661D93219j237j534j625j559j274r53p81m69M01J604K454K828L358M403N385
$$ 493219 491982 490448 488823 487264 485990 485037 484256 483787 484188 485792 488246 491074 494432 498835 504220
60646E04220N601N152M686M510M444M285M019L706L438L329L332L238K982K732
$$ 504220 509821 514973 519659 524169 528613 532898 536917 540623 544061 547390 550722 553960 556942 559674
60632E59674K555K298J914J536J091L40n88j232j587k175l025l416l131l080l921
$$ 559674 562229 564527 566441 567977 569068 569408 568820 567588 566001 563826 560801 557385 554254 551174 547253
60617E47253m869m870m215l837l643k912j977j910k614k743j816r06r05j322j451
$$ 547253 542384 537514 533299 529462 525819 522907 520930 519020 516406 513663 511847 510941 510036 508714 507263
60602E07263j478j700j719j208p39r98j748k276k285j841r78mM72L61L97J025
$$ 507263 505785 504085 502366 501158 500419 499421 497673 495397 493112 491271 490293 490289 490761 491122 491519 492544
60586D92544J634J499R34P36R80J153J112J143J320J444J486J602J869K381L217
$$ 492544 494178 495677 496611 497347 498327 499480 500592 501735 503055 504499 505985 507587 509456 511837 515054
60571E15054M063M328M103M343N612P300Q732J0343J2846J5842J8263J9777K0764
$$ 515054 519117 523445 527548 531891 537503 544803 553535 563878 576724 592566 610829 630606 651370
60558F51370K1235K0819J9633J8049J5694J1766O470J124l303o865r661j1166
$$ 651370 672605 693424 713057 731106 746800 758566 765036 766160 762857 755992 746331 735165
60546G35165j1011r715q101o387m231j374K024N472Q570J1463J4785J8791K2781
$$ 735165 724154 714439 706338 699951 695720 694346 696370 701842 710412 721875 736660 755451 778232
60533G78232K5825K7704K8544K7890K5080K0381J4889R289L655j559n439p802
$$ 778232 804057 831761 860305 888195 913275 933656 948545 957834 961489 959930 954491 946689
60521I46689r454j0810j1237j0259q542p033n875m934m571m974n256m293k247
$$ 946689 937235 926425 915188 904929 896387 889354 883479 878545 873974 869000 863744 859451 857204
60508H57204l65P03J481K566L778M703N455O498Q114J0376J3420J7440K2522K8641
$$ 857204 856839 857542 859023 861589 865367 870070 875525 882023 890137 900513 913933 931373 953895 982536
60494I82536L5741M3716N2439O1843P1744Q1348Q9105R3477R3913R0820Q4453
$$ 982536 1018277 1061993 1114432 1176275 1248019 1329367 1418472 1511949 1605862 1696682 1781135
60483A781135P4157N9107L9545J7043o423k9210m9915o7260q0409q9157r3607
$$ 1781135 1855292 1914399 1953944 1970987 1964564 1935354 1885439 1818179 1737770 1648613 1555006
60472A555006r4043r1271q6538q0657p3631o5532n7318n0200m4496l9721l5556
$$ 1555006 1460963 1369692 1283154 1202497 1128866 1063334 1006016 955816 911320 871599 836043
60461H36043l2017k8844k5510k1915j8488j5549j3100j1172r821q802p817p117
$$ 836043 804026 775182 749672 727757 709269 693720 680620 669448 659627 650825 643008 635891
60449F35891p157p610p440o123m212k578j737j926l016m101m037k846j853j956
$$ 635891 628734 621124 613684 607561 603349 600771 599034 597108 594092 589991 585954 583108 581255 579299
60435E79299k471k321j600j163j146q81j22N50N95J55l27p11j131j676k185k382
$$ 579299 576828 574507 572907 571744 570598 569717 569595 570145 570740 570895 570568 569857 568726 567050 564865 562483
60419E62483k207j986k006k015j506n81P1J99L66R05J270J012P61J284K073J889
$$ 562483 560276 558290 556284 554269 552763 552182 552253 552452 552818 553723 554993 556005 556766 558050 560123 562012
60403E62012N94n89p86m29k18p4L80R79J329J513J864K272K300J880J432J324
$$ 562012 562606 562017 561231 560802 560584 560510 560890 561869 563198 564711 566575 568847 571147 573027 574459 575783
60387E75783J554J968K423K706K579K129J784J856K125K052J428O51L14N23Q17
$$ 575783 577337 579305 581728 584434 587013 589142 590926 592782 594907 596959 598387 599038 599352 599875 600692
60372F00692P57M98N36J039J694K250K878L718M363M236L402K643K539K849K974
$$ 600692 601449 601947 602483 603522 605216 607466 610344 614062 618425 622661 626063 628706 631245 634094 637068
60357F37068K774K583K543K322J565M01o48j134r96n78l31l68l10L04J436K580
$$ 637068 639842 642425 644968 647290 648855 649256 648608 647474 646478 645900 645569 645201 644891 645195 646631 649211
60341F49211L348L815M199M475M513M409M362M318L866K567L91k061l773m062
$$ 649211 652559 656374 660573 665048 669561 673970 678332 682650 686516 689083 689474 687413 683640 679578
60327F79578l245k389k214k454k432j959j348p79j62M60P80O85N65R52J906K914
$$ 679578 676333 673944 671730 669276 666844 664885 663537 662758 662596 663056 663836 664521 665086 666038 667944 670858
60311F70858L448L584L938M916O211P262Q197R869J2890J6977K1389K5643K9621
$$ 670858 674306 677890 681828 686744 692955 700217 708414 718283 731173 748150 769539 795182 824803
60298H24803L3240L6273L8125L7631L3568K5844J5843N261n048j4671k2681k7924
$$ 824803 858043 894316 932441 970072 1003640 1029484 1045327 1050588 1045540 1030869 1008188 980264
60286I80264l0142l0086k8587k6112k3244k0777j9086j7818j6485j5083j3950
$$ 980264 950122 920036 891449 865337 842093 821316 802230 784412 767927 752844 738894
60275G38894j3252j2755j1997j0709r154p878p037o256n388m851m821m605l536
$$ 738894 725642 712887 700890 690181 681027 673149 666112 659856 654468 649617 644796 640191 636655
60262F36655k058j138q34m66mj96j108j600q17N99J368J099M23RNK18M19N23O26
$$ 636655 634597 633459 632625 632159 632155 631959 630851 629251 628434 629033 630401 631500 631923 631932 631937 632155 632574 633097 633723
60243F33723Q02Q25M11l28r52j267j440j583j595j437j164o85P1Q37J289J549
$$ 633723 634525 635350 635761 635433 634481 633214 631774 630191 628596 627159 625995 625310 625381 626218 627507 629056
60227F29056J933K346K569K899L733M578M490L525K803K887L094K768K283K278
$$ 629056 630989 633335 635904 638803 642536 647114 651604 655129 657932 660819 663913 666681 668964 671242
60213F71242K718L307M024M741N000M792M810N346N676N243M697M896N461N338
$$ 671242 673960 677267 681291 686032 691032 695824 700634 705980 711656 716899 721596 726492 731953 737291
60199G37291M378L401K903K585K047J211J00j150k054k145j640j249j393j931
$$ 737291 741669 745070 747973 750558 752605 753816 753916 752766 750712 748567 746927 745678 744285 742354
60185G42354k547l068l474l882m426m950n139n106n325n751n537m201k539j709
$$ 742354 739807 736739 733265 729383 724957 720007 714868 709762 704437 698686 693149 688948 686409 684700
60171F84700j790j940j667j195p05NJ040K096K749K781K324J820J654J639J238
$$ 684700 682910 680970 679303 678108 677403 677408 678448 680544 683293 686074 688398 690218 691872 693511 694749
60156F94749M92K28Q92J796K068J876K015K690L468M076M517M623M278L915M107
$$ 694749 695241 695469 696361 698157 700225 702101 704116 706806 710274 714350 718867 723490 727768 731683 735790
60141G35790M786N482O133O985P902Q542R058R880J0889J1536J1665J1525J1041
$$ 735790 740576 746058 752191 759176 767078 775620 784678 794558 805447 816983 828648 840173 851214
60128H51214R902Q202O214L648Q4l818o520p335p076o736o305n317l757k002m05
$$ 851214 861116 869318 875532 879180 879264 875446 868926 861591 854515 847779 841474 836157 832400 830398 829993
60113H29993O42Q42N36N99J337K005J815R60J55m11j053j834k506l048l761m704
$$ 829993 830635 831477 832013 832612 833949 835954 837769 838729 838884 838473 837420 835586 833080 830032 826271 821567
60097H21567n462n642n297m807m442m246m160m054l622k495o50J407L097M314
$$ 821567 816105 810463 805166 800359 795917 791671 787511 783457 779835 777340 776690 778097 781194 785508
60083G85508N254N867O045O237P154Q630R421Q600O546M148J650j054l635n723
$$ 785508 790762 796629 802674 808911 816065 824695 834116 842716 849262 853410 855060 854006 850371 844648
60069H44648p614r722j1556j2226j1771j1083j0554r735q387p000o065n562n371
$$ 844648 837034 827312 815756 803530 791759 780676 770122 760387 752000 745000 738935 733373 728002
60056G28002n509n826o061o333o884p288o732n249l843l196k959k631k273j926
$$ 728002 722493 716667 710606 704273 697389 690101 683369 678120 674277 671081 668122 665491 663218 661292
60042F61292j089N46K438L766M305M282L865L271K941L086L254K835J777N19n62
$$ 661292 660203 660749 663187 666953 671258 675540 679405 682676 685617 688703 691957 694792 696569 697088 696526
60027F96526j361j949k557l426m470n389o244p489r148j0397j0372r185p815p123
$$ 696526 695165 693216 690659 687233 682763 677374 671130 663641 654493 644096 633724 624539 616724 609601
60013F09601p163p279o659n113l366k341k106j875j130j76O00J398K509L572L931
$$ 609601 602438 595159 588500 583387 580021 577680 575574 573699 572569 572393 572993 574391 576900 580472 584403
59998E84403L497K861K661L151M186N261N727N254M141L057K605L098M407N820
$$ 584403 587900 590761 593422 596573 600759 606020 611747 617001 621142 624199 626804 629902 634309 640129
59984F40129O409N849M726L857L491L310K934K206J166n6j363k769m133m929m665
$$ 640129 646538 652387 657113 660970 664461 667771 670705 672911 674077 674021 672658 669889 665756 660827 656162
59969F56162l610k665k392k508k543k439k254j782q31L87J516K467L240L603L296
$$ 656162 652552 649887 647495 644987 642444 640005 637751 635969 635138 635525 637041 639508 642748 646351 649647
59954F49647K426J425P57O91J099J401J075L76J10N14Q63N02k77p98r78j156j347
$$ 649647 652073 653498 654255 654946 656045 657446 658521 658897 659007 659521 660384 660886 660609 659811 658833 657677 656330
59937F56330j371j476k116l089l555l082k172j523j198p98k36R2j41o78r66p39
$$ 656330 654959 653483 651367 648278 644723 641641 639469 637946 636748 635950 635714 635806 635665 634987 634021 633282
59921F33282j80M44J026J387J193M98M2N23J661K563K914L232L828M353M535M691
$$ 633282 633102 633546 634572 635959 637152 637650 637692 638215 639876 642439 645353 648585 652413 656766 661301 665992
59905F65992N019M988M062K638J624J363J488J724K186K900L533L786L768L914
$$ 665992 671011 675999 680061 682699 684323 685686 687174 688898 691084 693984 697517 701303 705071 708985
59891G08985M531N407N800N117L701K674K770L588M289M662N118N847O541O901
$$ 708985 713516 718923 724723 729840 733541 736215 738985 742573 746862 751524 756642 762489 769030 775931
59877G75931O944O722O114N055L758K508J284k71k459m988o985p726p432p097
$$ 775931 782875 789597 795711 800766 804524 807032 808316 808045 805586 800598 793613 785887 778455 771358
59863G71358p419q135q435p895o787n700n042m801m669m388l984l568l027k147
$$ 771358 763939 755804 747369 739474 732687 726987 721945 717144 712475 708087 704103 700535 697508 695361
59849F95361j019K4Q42J538K134K537K942L773N107O567P953R480J1229J2755
$$ 695361 694342 694366 695208 696746 698880 701417 704359 708132 713239 719806 727759 737239 748468 761223
59835G61223J3648J4048J4270J4202J3456J1954J0023Q083O449N258M377L465
$$ 761223 774871 788919 803189 817391 830847 842801 852824 860907 867356 872614 876991 880456
59823H80456K222M35k174n700r641j3185j6045j8485k0362k0807j9336j6757j4424
$$ 880456 882678 883113 880939 875239 865598 852413 836368 817883 797521 776714 757378 740621 726197
59810G26197j2833j1489r889q149o711n848n382m771l592k053q05j93m1k14q52
$$ 726197 713364 701875 691986 683837 677126 671278 665896 661125 657533 655480 654675 654482 654441 654227 653375
59795F53375j810k526k790l023l366l156k000p58o74j825l242m293n097n683n615
$$ 653375 651565 649039 646249 643226 639860 636704 634704 633946 633272 631447 628205 623912 618815 613132 607517
59780F07517m630l090j644q24q78j609k318k375j816j074l19N05J169J342J292
$$ 607517 602887 599797 598153 597329 596451 594842 592524 590149 588333 587259 586940 587445 588614 589956 591248
59765E91248J714K736L580L516K749K136K201K701L005K869K761L338M566N676
$$ 591248 592962 595698 599278 602794 605543 607679 609880 612581 615586 618455 621216 624554 629120 634796
59751F34796O167O447P063P708P567O542N428M851M583M106L299K362J428N86
$$ 634796 640963 647410 654473 662181 669748 676290 681718 686569 691152 695258 698557 700919 702347 702933
59737G02933kk97n85j220k155k891k938k344j646j288j226j208j287j617j903
$$ 702933 702931 702634 702049 700829 698674 695783 692845 690501 688855 687567 686341 685133 683846 682229 680326
59722F80326j550n76K10K00k92o47p69q58q22n16k57l81n27J4J270K541L335L721
$$ 680326 678776 678200 678410 678610 678318 677671 676902 676044 675222 674706 674449 674068 673541 673555 674825 677366 680701 684422
59704F84422L781L358K581K043K115K454K557K525K909L881M945N584N923O411
$$ 684422 688203 691561 694142 696185 698300 700754 703311 705836 708745 712626 717571 723155 729078 735489
59690G35489O910O465M369J179j750l621m553m743m067k751j579r09j23J293K730
$$ 735489 742399 748864 753233 754412 752662 749041 744488 739745 735678 732927 731348 730439 730316 731609 734339
59675G34339L171K488J225m23k497m362n005m442l979m641n984o831o778o471
$$ 734339 737510 739998 741223 740800 738303 733941 728936 724494 720515 715874 709890 703059 696281 689810
59661F89810o572o844o401m807k683j046j51O15J672K680L289L841M733N530N379
$$ 689810 683238 676394 669993 665186 662503 661457 661306 661921 663593 666273 669562 673403 678136 683666 689045
59646F89045M107K391R99K77J47Q6o58k328m255n539n912n587m695l398k116j091
$$ 689045 693152 695543 696542 696819 696966 697052 696394 694066 689811 684272 678360 672773 668078 664680 662564 661473
59630F61473m6J114J803J658J401J860K550K369J415R06J300J729J483R83Q51
$$ 661473 661427 662541 664344 666002 667403 669263 671813 674182 675597 676503 677803 679532 681015 681998 682849
59615F82849J009J079Q61J29j291k876l608l177k294j545p46J89O58L25j17J98
$$ 682849 683858 684937 685798 685927 684636 681760 678152 674975 672681 671136 670390 670579 671237 671562 671445 671643
59599F71643J064J475Q47m80j631j748n97J001J716J111J31j44K20M20J04m03
$$ 671643 672707 674182 675029 674549 672918 671170 670573 671574 673290 674401 674532 674388 674608 675028 675132 674729
59583F74729p41q51q53j004j584k478l131l272l351l823m330m153l292k497k308
$$ 674729 673988 673137 672284 671280 669696 667218 664087 660815 657464 653641 649311 645158 641866 639369 637061
59568F37061k598k981l153k775j662l35J86l69r35l44J063J795J234M84P54J569
$$ 637061 634463 631482 628329 625554 623892 623557 623743 623374 622439 622095 623158 624953 626187 626671 627425 628994
59552F28994J452R9j183j231l27O76J531K293K599K155J569J839L229N336P992
$$ 628994 630446 630545 629362 628131 627804 628480 630011 632304 634903 637058 638627 640466 643695 649031 657023
59537F57023J1260J4588J6883J7647J7476J7125J6451J4477J0373M596q65l761
$$ 657023 668283 682871 699754 717401 734877 752002 768453 782930 793303 797899 797034 793273
59525G93273l587j938m40R69L024N212O199N817N187M854M121K458L05j893m257
$$ 793273 789686 787748 787308 788277 791301 796513 802712 808529 813716 818570 822691 825149 825454 823561 819304
59510H19304o542p815p750p375p758q676r259r197q614p397n534l709k742k641
$$ 819304 812762 804947 797197 789822 782064 773388 764129 754932 746318 738921 733387 729678 726936 724295
59496G24295k715k393j545l42P66J325J456J779K426K771K532K531L658N620P469
$$ 724295 721580 719187 717642 717300 718066 719391 720847 722626 725052 727823 730355 732886 736544 742164 749633
59481G49633R001J0879J3572J6839K0211K3405K6261K8714L0728L1966L1641K9038
$$ 749633 758634 769513 783085 799924 820135 843540 869801 898515 929243 961209 992850 1021888
59469A021888K4149J7500R670J323o481j2488j5828j6336j4535j1422p947m369
$$ 1021888 1046037 1063537 1073207 1074530 1068049 1055561 1039733 1023397 1008862 997440 989493 985124
59457I85124l02M491R692J4903K0025K4914K9200L2939L6928M1787M6977N1144
$$ 985124 984822 989313 999005 1013908 1033933 1058847 1088047 1120986 1157914 1199701 1246678 1297822
59445A297822N3214N2568M8621M0866K9431J5081j185j8084l3660m5671n2743
$$ 1297822 1351036 1403604 1452225 1493091 1522522 1537603 1536418 1518334 1484674 1439003 1386260
59434A386260n5060n3924n0825m6908m3025l9907l7977l6874l5387l2403k8033
$$ 1386260 1331200 1277276 1226451 1179543 1136518 1096611 1058634 1021760 986373 953970 925937
59423I25937k3413j9294j5300j0728n536k10M917R745J4212J8506K3124K8078
$$ 925937 902524 883230 867930 857202 851666 851456 856373 866118 880330 898836 921960 950038
59411I50038L2242L4178L3592L1374K7977K2371J3131M65j3047k3730k8826k7716
$$ 950038 982280 1016458 1050050 1081424 1109401 1131772 1144903 1145368 1132321 1108591 1079765 1052049
59399A052049k1884j4068o899j617K127M747N004N86r094k1257l1570l7347l8549
$$ 1052049 1030165 1016097 1009198 1007581 1009708 1014455 1019459 1020045 1010951 989694 958124 920777 882228
59386H82228l6406l2288k7624k3575k0267j7115j4045j1665j0134q821p331n930
$$ 882228 845822 813534 785910 762335 742068 724953 710908 699243 689109 680288 672957 667027
59374F67027m635k891p23P09N89l07n25K83J356K089K558K983L339L532L520L341
$$ 667027 662392 659501 658778 659487 660076 659769 659244 659527 660883 662972 665530 668513 671852 675384 678904 682245
59358F82245L220L478M213N307O796Q714J0583J1766J2525J4000J6716J9773K1985
$$ 682245 685465 688943 693156 698463 705259 713973 724556 736322 748847 762847 779563 799336 821321
59345H21321K3179K3938K4653K5396K6101K6366K5498K3357K0545J7387J3373
$$ 821321 844500 868438 893091 918487 944588 970954 996452 1019809 1040354 1057741 1071114
59334A071114Q251K990j214m449p725j1453j5010j7675j9258j9939k0026j9758
$$ 1071114 1079365 1082355 1081141 1076692 1068967 1057514 1042504 1024829 1005571 985632 965606 945848
59322I45848j9005j7419j5209j3301j2319j1828j1155j0360r863r543q913p877
$$ 945848 926843 909424 894215 880914 868595 856767 845612 835252 825389 815846 806933 799056
59310G99056o724n600m549l706l062k428k013k374l272l415k093l96K35j8J12
$$ 799056 792332 786732 782183 778477 775415 772987 770974 768600 765328 761913 759820 759424 759659 759641 759753
59295G59753R53J731K283L550O181R679J3254J6688J9959K2705K4428K4841K3722
$$ 759753 760706 762437 764720 768270 774451 784130 797384 814072 834031 856736 881164 906005 929727
59282I29727K0735J5701R001J706m707r057j1116j1354j0115p438l743Q1L564
$$ 929727 950462 966163 975164 976870 972163 963106 951990 940636 930521 923083 919340 919421 922985
59269I22985O878R874J1760J2249J2068J1682J0408P693M307J160k173o421j0843
$$ 922985 929863 939737 951497 963746 975814 987496 997904 1005597 1009904 1011064 1008891 1002470 991627
59256I91627j3989j5810j7492j9324k0266j9715j8380j7126j6043j4920j3676
$$ 991627 977638 961828 944336 925012 904746 885031 866651 849525 833482 818562 804886
59245H04886j2114j0093q026o432n041l179r51R53K487M212O030P155P495P895
$$ 804886 792772 782679 774653 768221 763180 760001 759050 760003 762490 766702 772732 779887 787382 795277
59231G95277Q730R285Q935P869O303L945P98k347m829o817q684j0313j1493j2343
$$ 795277 804007 813292 822227 830096 836399 840344 841142 838795 833966 827149 818465 808152 796659 784316
59217G84316j2844j2547j1266r619q413p800p407o944o342n515m382l041j761
$$ 784316 771472 758925 747659 738040 729627 721827 714420 707476 701134 695619 691237 688196 686435
59204F86435q81n76n80l29L81J084J298J212J349J859K621L670M918N793N860
$$ 686435 685554 684978 684398 684069 684450 685534 686832 688044 689393 691252 693873 697543 702461 708254 714114
59189G14114N545N613O141O631O812O668O021M933M135M244M820N044M950N053
$$ 714114 719659 725272 731413 738044 744856 751524 757545 762478 766613 770857 775677 780721 785671 790724
59175G90724N162M741M142M317N399O685P903R280J0570J1217J1454J1980J2604
$$ 790724 795886 800627 804769 809086 814485 821170 829073 838353 848923 860140 871594 883574 896178
59162H96178J2502J1714J1010J0331Q808O379L827J116k556o786r934j1525j2866
$$ 896178 908680 920394 931404 941735 950543 956922 960749 961865 959309 952523 942589 931064 918198
59149I18198j4548j5285j4322j3120j3213j3828j3283j1558r869q570p177n831
$$ 918198 903650 888365 874043 860923 847710 833882 820599 809041 799172 790602 783425 777594
59137G77594n156m917m220k910j677r04l96j16k70n73l10Q48K484L928M810N294
$$ 777594 772438 767521 763301 760391 758714 757810 757414 757298 757028 756455 756145 756993 759477 763405 768215 773509
59121G73509N981P254Q640R336R537J0323J1965J3279J3242J2328J1536J0999
$$ 773509 779490 786744 795384 804720 814257 824580 836545 849824 863066 875394 886930 897929
59109H97929J0424J0065J0203J0213R271P608O092M972L903K870K110J355R6j517
$$ 897929 908353 918418 928621 938834 948105 955713 961805 966777 970680 973550 975660 977015 977111 975594
59095I75594k803l539l988m129l665k771k071j785j522j034o27p70j690l389n623
$$ 975594 972791 969252 965264 961135 957470 954699 952628 950843 949321 948287 947660 946890 945200 941811 936188
59080I36188p900r736j1016j1890j2453j2692j2615j2260j1739j1253j0832j0062
$$ 936188 928288 918552 907536 895646 883193 870501 857886 845626 833887 822634 811802 801740
59068H01740q661p241o709o759n931l648j323o45j461k230j996j029L5P66Q00
$$ 801740 793079 785838 779129 772370 766439 762791 761468 760823 759362 757132 755136 754107 754142 754908 755708
59053G55708J03o77p80l03Nk11o14q69r96j025p39M9J331K933M518N600N949N886
$$ 755708 755811 755134 754354 754051 754056 753845 753231 752362 751366 750341 749602 749651 750982 753915 758433 764033 769982 775868
59035G75868N911O019N651M334K314N17j62K91J044J585K534M776Q018J1037J3267
$$ 775868 781779 787798 793449 797783 800097 800614 800452 800743 801787 803372 805906 810682 818700 829737 843004
59020H43004J5136J6692J7077J5843J3744J1551R021N838K710N21r80k596m202
$$ 843004 858140 874832 891909 907752 921496 933047 942068 947906 950616 951137 950157 947561 943359
59007I43359m869m298l166k163j420p70J17J737M202O760Q460R274R963J0917
$$ 943359 938490 934192 931026 928863 927443 926673 926790 928527 932729 939489 947949 957223 967186 978103
58993I78103J1682J1681J0933R882Q826P582N589K482j399n216q503j1476j4363
$$ 978103 989785 1001466 1012399 1022281 1031107 1038689 1044278 1046760 1045361 1040145 1031642 1020166 1005803
58980A005803j6801j8178j8252j7149j5103j2449r624o919m421k154K3K581N779
$$ 1005803 989002 970824 952572 935423 920320 907871 898247 891328 886907 884753 884776 887357 893136
58967H93136R017J1462J3307J5578J8551K1228K2665K2815K1833J9589J6335J2740
$$ 893136 902153 913615 926922 942500 961051 982279 1004944 1027759 1049592 1069181 1085516 1098256
58955A098256Q740L485k924q833j3096j6586k0506k4206k6065k5780k4408k2602
$$ 1098256 1106996 1110481 1107557 1098724 1085628 1069042 1048536 1024330 998265 972485 948077 925475
58943I25475k0188j7275j4495j2137r990p978o217m598l058j988j727j982k388
$$ 925475 905287 888012 873517 861380 851390 843412 837195 832597 829539 827551 825824 823842 821454
58930H21454l133m301n251n522n743o606p512p451o708o371o421n821m367l045
$$ 821454 818321 814020 808769 803247 797504 790898 783386 775935 769227 762856 756435 750614 746247 743202
58916G43202k356j617l10J062J911K505L376M531N669O738P845R021J0311J1824
$$ 743202 740846 739229 738919 739981 741892 744397 747773 752304 757973 764711 772556 781577 791888 803712
58902H03712J3590J5622J7982K0480K2521K3610K3962K4108K4099K3551K2358
$$ 803712 817302 832924 850906 871386 893907 917517 941479 965587 989686 1013237 1035595
58891A035595K1052K0569K1870K5296K9956L4171L7032L9016M0625M1143L9428
$$ 1035595 1056647 1077216 1099086 1124382 1154338 1188509 1225541 1264557 1305182 1346325 1385753
58880A385753L5476L0218K4221J7426R900K014o030j4106k1701k8132l3113l6636
$$ 1385753 1421229 1451447 1475668 1493094 1502994 1505008 1498978 1484872 1463171 1435039 1401926 1365290
58868A365290l8586l8947l8079l6313l3744l0758k8141k6116k4060k1831k0459
$$ 1365290 1326704 1287757 1249678 1213365 1179621 1148863 1120722 1094606 1070546 1048715 1028256
58857A028256k0614k1239k0851j9522j8364j7616j6526j4795j2928j1338j0108
$$ 1028256 1007642 986403 965552 946030 927666 910050 893524 878729 865801 854463 844355
58846H44355r441r335r215q685q354q877r734r957r609r359r167q558p739p231
$$ 844355 834914 825579 816364 807679 799325 790448 780714 770757 761148 751789 742622 734064 726325 719094
58832G19094o817o114n626n870o048n126l721l240l544l283k253j514j214l35
$$ 719094 712277 706163 700537 694667 688619 683493 679772 676532 672988 669705 667452 665938 664724 664389
58818F64389J263K435K786L275M278M825M308L451K916K376J606J061P67J4j222
$$ 664389 665652 668087 670873 674148 678426 683251 687559 691010 693926 696302 697908 698969 699736 699750 698528
58803F98528j866j436q48r02j194j277j527k106k237j533r00j169j806j821j159
$$ 698528 696662 695226 694378 693476 692282 691005 689478 687372 685135 683602 682702 681533 679727 677906 676747
58788F76747k76Q47K305L602M304M862N966P463Q583Q910Q602Q027P551P354P093
$$ 676747 676471 677318 679623 683225 687529 692391 698357 705820 714403 723313 731915 739942 747493 754847 761940
58773G61940O173M558K859J497L37p75j698k404k995l297l120k927l400m294m597
$$ 761940 768113 772671 775530 777027 777364 776589 774891 772487 769492 766195 763075 760148 756748 752454 747857
58758G47857l931k864j836p90K6L2n28n67L18J243J403J121J098J525K320L449
$$ 747857 743926 741062 739226 738436 738462 738494 737966 737399 737717 738960 740363 741484 742582 744107 746427 749876
58742G49876M619N401N918O598P163O855N812N135N323N793O184O949Q188R192
$$ 749876 754495 759896 765814 772412 779575 786430 792242 797377 802700 808493 814677 821626 829814 839006
58728H39006R696J0435J1839J3235J3957J4257J4404J4000J2890J1918J1890J2587
$$ 839006 848702 859137 870976 884211 898168 912425 926829 940829 953719 965637 977527 990114
58716I90114J3407J4307J5370J6134J5950J4604J2272R359O525M081J362k503
$$ 990114 1003521 1017828 1033198 1049332 1065282 1079886 1092158 1101517 1108042 1112123 1113485 1110982
58704A110982p150j1338j4693j7920k1220k4000k6289k8805l1197l1937l0618
$$ 1110982 1103832 1092494 1077801 1059881 1038661 1014661 988372 959567 928370 896433 865815
58693H65815k8711k7215k5287k2247j9261j7565j6399j4306j1508r446q680q643
$$ 865815 837104 809889 784602 762355 743094 725529 709130 694824 683316 673870 665190 656547
58681F56547q876r156q889p633n989m908m365l568k195o37P54K001L289M909P099
$$ 656547 647671 638515 629626 621993 616004 611096 606731 603163 600968 600331 601085 603086 606375 611284 618383
58666F18383R628J1885J3565J4815J5627J5836J5712J5561J4664J1879P586L678
$$ 618383 628011 639896 653461 668276 683903 699739 715451 731012 745676 757555 765141 768819
58654G68819J125j035l703o161p434p903q397q806q656q204p905p558o873o162
$$ 768819 769944 768909 765206 759045 751611 743708 735311 726505 717849 709645 701740 694182 687309 681147
58640F81147n595m621k963j340l49M74J710K978L653L840L840L400K310R40m44
$$ 681147 675552 670931 667968 666628 666279 666753 668463 671441 675094 678934 682774 686174 688484 689424 688980
58625F88980k007l423l678k540j187n81j87R27K818N224Q245J1637J4498J6430
$$ 688980 686973 683550 679872 677332 676145 675564 675377 676304 679122 684346 692591 704228 718726 735156
58611G35156J7898J8801J8056J5473J2458R871O726K244k336n500p586r561j1017
$$ 735156 753054 771855 789911 805384 817842 827713 834439 836683 834347 828847 821261 811700 800683
58598H00683j1099j0438j0275j0480j0004q766p577o720n881m872l417r08K562
$$ 800683 789584 779146 768871 758391 748387 739621 732044 725324 719443 714571 711154 710246 712808
58585G12808N842Q281J0561J3011J4578J4729J4804J5903J6827J5979J3954J2315
$$ 712808 718650 726931 737492 750503 765081 779810 794614 810517 827344 843323 857277 869592
58573H69592J0963Q938O889O523Q065J0237J2296J4323J6078J7434J9367K2677
$$ 869592 880555 889493 896382 902905 910970 921207 933503 947826 963904 981338 1000705 1023382
58561A023382K6176K7875K7523K6290K4577K1817J8042J3791Q948L275k343o784
$$ 1023382 1049558 1077433 1104956 1131246 1155823 1177640 1195682 1209473 1218421 1221696 1219353 1212569
58549A212569j0214j3161j4950j4879j4135j4412j5373j5537j5137j5726j7353
$$ 1212569 1202355 1189194 1174244 1159365 1145230 1130818 1115445 1099908 1084771 1069045 1051692
58538A051692j8556j8994j9775k1122k1892k1564k0732j9511j7389j4706j2449
$$ 1051692 1033136 1014142 994367 973245 951353 929789 909057 889546 872157 857451 845002
58527H45002j0460p747m536k069l73J705M118N370N023M449M611M970N029N133
$$ 845002 834542 826795 822259 820190 819817 821522 825640 831010 836033 840482 845093 850063 855092 860225
58513H60225N197M379K716J526J512J806J527R80P38O82N36L85K53q8o92j509
$$ 860225 865422 869801 872517 874043 875555 877361 878888 879868 880606 881288 881824 882209 882462 882374 881682 880173
58497H80173k697m096m811m381l857m443n613n979n489n103m736l419j331K29
$$ 880173 877476 873380 868569 864188 860331 855888 850275 844296 838807 833704 828968 825549 824218 824447
58483H24447R87K096M254O967R761J2619J5200J6958J8014J8528J7562J4151R223
$$ 824447 825434 827530 831784 838751 848512 861131 876331 893289 911303 929831 947393 961544 970767
58470I70767M797J422j852n258p982r946j1975j4034j5046j4596j3274j1375q824
$$ 970767 975564 976986 975134 969876 961894 951948 939973 925939 910893 896297 883023 871648 862824
58457H62824o267m441k677K47L856O437P544Q153Q473P656N667L413R70k322n927
$$ 862824 856557 852116 849439 849686 853542 859979 867523 875676 884149 891805 897472 900885 901855 899533 893606
58442H93606q270q944q892q388o843m622k943j858l72J395K225K109K414L575
$$ 893606 885336 876392 867500 859112 852269 847647 844704 842846 842474 843869 846094 848203 850617 854192
58428H54192M754N855P709J0055J1571J2093J2700J3420J3060J1524J0017Q769
$$ 854192 858946 864801 872510 882565 894136 906229 918929 932349 945409 956933 966950 975719
58416I75719O839M371K676J798M11j616l013l703n056p216q763r423j0434j1695
$$ 975719 982558 986929 989605 991403 991814 990198 987185 983482 978426 971210 962447 953024 942590 930895
58402I30895j1443r436p745p433p095n625l879k617j260K30P01N4k21K37j85k177
$$ 930895 919452 910016 902271 894838 887743 882118 878239 875622 874362 874592 875293 875347 875126 875363 875178 873001
58386H73001m069m450l999l669l127k051j030k01J049K424K738K163K267L407
$$ 873001 868932 864482 860483 856814 853687 851636 850606 850405 851454 853878 856616 858779 861046 864453
58372H64453M347M799N807P204P517O883P227Q898J0077J0173J0739J2244J3123
$$ 864453 868800 873599 879406 886610 894127 901010 908237 917135 927212 937385 948124 960368 973491
58359I73491J2942J3302J4488J4488J2549J0551R600Q365O174M439L716K489M03
$$ 973491 986433 999735 1014223 1028711 1041260 1051811 1061411 1069776 1075950 1080389 1084105 1086594 1086997
58346A086997o08J45P66M73J202L806O107O702P351R501J1735J2776J3812J5660
$$ 1086997 1086389 1086534 1087300 1087773 1088975 1092781 1098888 1105590 1112941 1122442 1134177 1146953 1160765 1176425
58332A176425J6741J6114J5437J5803J5654J3962J2363J1990J1336R355P491O496
$$ 1176425 1193166 1209280 1224717 1240520 1256174 1270136 1282499 1294489 1305825 1315180 1322671 1329167
58320A329167M726J772K42J417K740K236J840L396N016M634L886N099P322Q601
$$ 1329167 1333893 1335665 1335907 1337324 1340064 1342300 1344140 1347536 1352552 1357186 1361072 1366171 1373493 1382094
58306A382094R456J1035J2459J2890J3541J5063J5727J4712J4033J4825J5076
$$ 1382094 1391550 1402585 1415044 1427934 1441475 1456538 1472265 1486977 1501010 1515835 1530911
58295A530911J3612J2704J3930J5220J4972J5220J7508J9479J9052J8223J9195
$$ 1530911 1544523 1557227 1571157 1586377 1601349 1616569 1634077 1653556 1672608 1690831 1710026
58284A710026K0501K0479K0825K3020K4994K4986K4951K6508K7585K6737K6478
$$ 1710026 1730527 1751006 1771831 1794851 1819845 1844831 1869782 1896290 1923875 1950612 1977090
58273A977090K8469K9848K8581K7844L0569L4278L6053L7977M2542M7250M9179
$$ 1977090 2005559 2035407 2063988 2091832 2122401 2156679 2192732 2230709 2273251 2320501 2369680
58262B369680N0517N4085N7725N8582N8593O0109O0620N7655N4350N4168N4697
$$ 2369680 2420197 2474282 2532007 2590589 2649182 2709291 2769911 2827566 2881916 2936084 2990781
58251B990781N2856N1414N3884N7710N9323O1166O6685P3217P7032Q0616Q7522
$$ 2990781 3043637 3095051 3148935 3206645 3265968 3327134 3393819 3467036 3544068 3624684 3712206
58240C712206R5015R9416J03718J11904J21033J27165J33669J44904J57270J65684
$$ 3712206 3807221 3906637 4010355 4122259 4243292 4370457 4504126 4649030 4806300 4971984
58230D971984J73398J85769K00063K11406K23063K40259K59720K76274K93728
$$ 4971984 5145382 5331151 5531214 5742620 5965683 6205942 6465662 6741936 7035664
58221G035664L17918L45301L70407L97819M34150M75267N14987N58956O15473
$$ 7035664 7353582 7698883 8069290 8467109 8901259 9376526 9891513 10450469 11065942
58212A1065942O80483P47196Q22334R16151J025229J143441J280846J452083J656193
$$ 11065942 11746425 12493621 13315955 14232106 15257335 16400776 17681622 19133705 20789898
58203B0789898J890001K171535K527182K968242L508409M194752N096375O283298
$$ 20789898 22679899 24851434 27378616 30346858 33855267 38050019 43146394 49429692
58195D9429692P858619J0000240J2919696J6752148K1448682K6665392L1677513
$$ 49429692 57288311 67288551 80208247 96960395 118409077 145074469 176751982
58188A76751982L5517740L7417687L7144842L4730409K9844833K1772357J0356200
$$ 176751982 212269722 249687409 286832251 321562660 351407493 373179850 383536050
58181C83536050l051839j5867596k5676611l1423321l3443466l2719164l0252680
$$ 383536050 380484211 364616615 338940004 307516683 274073217 241354053 211101373
58174B11101373k6858782k3118200j9354149j5727201j2398450r550860p266379
$$ 211101373 184242591 161124391 141770242 126043041 113644591 104093731 96827352
58167I6827352n498162m224330l559379l629090m341217n331974o158172o541412
$$ 96827352 91329190 87104860 83545481 79916391 75575174 70243200 64085028 57543616
58159E7543616o456390o041508n459444m824038m202992l636967l140842k705830
$$ 57543616 51087226 45045718 39586274 34762236 30559244 26922277 23781435 21075605
58151B1075605k319056j979244j688839j441443j227424j044858q94807p71752
$$ 21075605 18756549 16777305 15088466 13647023 12419599 11374741 10479934 9708182
58143I708182o68397n84577n21804m73810m31952l95573l67849l45632l22633
$$ 9708182 9039785 8455208 7933404 7459594 7027642 6632069 6264220 5918588 5595955
58134E595955k98901k77972k57951k34500k09769j89538j73740j58154j43158
$$ 5595955 5297054 5019082 4761131 4526631 4316862 4127324 3953584 3795430 3652272
58125C652272j32745j26721j21731j18139j18359j20041j18268j13079j08052
$$ 3652272 3519527 3392806 3271075 3152936 3034577 2914536 2796268 2683189 2575137
58116B575137j03170r5946q7833q2422p8684p2767o5239n9972n6985n3055m8314
$$ 2575137 2471967 2376021 2288188 2205766 2127082 2054315 1989076 1929104 1872119 1819064 1770750
58105A770750m5801m5205m3429m0686m0026m1323m1512m0255l9719l9477l7288
$$ 1770750 1724949 1679744 1636315 1595629 1555603 1514280 1472768 1432513 1392794 1353317 1316029
58094A316029l4256l3432l3797l1381k6081k1747j9704j7644j4951j3624j3703
$$ 1316029 1281773 1248341 1214544 1183163 1157082 1135335 1115631 1097987 1083036 1069412 1055709
58083A055709j2982j1706j2592j5720j8071j8519j8798j9297j8390j6365j5569
$$ 1055709 1042727 1031021 1018429 1002709 984638 966119 947321 928024 909634 893269 877700
58072H77700j6197j6046j4801j4484j5320j5266j3998j3387j3610j2681j0294
$$ 877700 861503 845457 830656 816172 800852 785586 771588 758201 744591 731910 721616
58061G21616q411p586o369m726m370n378n998o127p421r651j0520r480q302p635
$$ 721616 713205 705619 699250 694524 690154 684776 678778 672651 665230 655579 645059 635579 627277 619642
58047F19642o454n085n171o239n918m025k983l693m467m491m866n637n256l785
$$ 619642 613188 608103 602932 596693 590775 586750 583767 580074 575607 571116 566250 560613 555357 551572
58033E51572l306m381n263n274n843p416q499q605r058r995r607p348n102m289
$$ 551572 548266 543885 538622 533348 527505 520089 511590 502985 493927 483932 474325 466977 461875 457586
58019D57586m311m591n422o134n231l056j749j907j964j353j416k426k667j485
$$ 457586 453275 448684 443262 437128 431897 428841 427092 425185 423221 421868 420452 418026 415359 413874
58005D13874m93p38j137p35p5M93J509K693K888K353K657L742L722K300J565K522
$$ 413874 413381 412643 411506 410771 410696 411189 412698 415391 418279 420632 423289 427031 430753 433053 434618 437140
57989D37140L538L308K740K799K883K474K134J791M12j692k579j757j166k013
$$ 437140 440678 443986 446726 449525 452408 454882 457016 458807 459219 457527 454948 453191 452025 450012
57975D50012l008k936k632k926k890j657r9O84R20J078Q76M33P19J915K880L004
$$ 450012 447004 444068 441436 438510 435620 433963 433864 434548 435468 436546 437422 437855 438574 440489 443369 446373
57959D46373K939K911K252J154Q08J126N06j411k981l370l706m526m588l430k662
$$ 446373 449312 452223 454475 455629 456437 457563 458069 456658 453677 450307 446601 442075 437487 434057 431395
57944D31395l233l662k554q61k9J72M35L32m01o87K65J634K628L876N779P105
$$ 431395 428162 424500 421946 421085 421056 421228 421663 421995 421594 420907 421172 422806 425434 429310 435089 442194
57928D42194O703N296M322M230M944O466Q015Q142O819N775N830N676M324K747
$$ 442194 448897 454193 458515 462745 467689 474155 482170 490312 497131 502906 508736 514412 518736 521483
57914E21483J825P25j152k646k912l179m570n999o136n861o647p988q555q740
$$ 521483 523308 524033 522881 520235 517323 514144 509574 503575 497439 491578 484931 476943 468388 459648
57900D59648r758j1242j1822j1480j1299j1357j0645q949p242o394o473p060p412
$$ 459648 449890 438648 426826 415346 404047 392690 382045 373096 365854 359460 352987 345927 338515
57887C38515o845n611m732m343l309j103J144K309K688K817K376J376J014J980
$$ 338515 331670 326059 321327 316984 313675 312572 313716 316025 318713 321530 323906 325282 326296 328276
57873C28276L089K951J902J004L01o16j344j391j232j432j574j258j156j904k860
$$ 328276 331365 334316 336218 337222 337523 336907 335563 334172 332940 331508 329934 328676 327520 325616 322756
57858C22756l109k803k554k376k133j959j458J79K547M010M219M874O892Q787
$$ 322756 319647 316844 314290 311914 309781 307822 306364 306543 309090 313100 317319 322193 329085 337872
57844C37872R241R305J0238J1111J0651R791J0043J0712J0096Q377O958N873M132
$$ 337872 347113 356418 366656 377767 388418 398209 408252 418964 429060 437437 444395 450268 454400
57831D54400J892J29j251k926m479n163n624o801p884p533o432o380p290p436
$$ 454400 456292 456421 455170 452244 447765 442602 436978 430177 422293 414760 408328 401948 394658 387222
57817C87222o396n428m965m039k290o50K64P71J010P70M60P16J074N64o39j542
$$ 387222 380826 375398 370433 366394 364104 363454 363718 364489 365499 366269 366729 367445 368519 369083 368444 366902
57801C66902k091k987l985m139l650l719m579n250n277n066m602l425j939j180
$$ 366902 364811 361824 357839 353700 350050 346331 341752 336502 331225 326159 321557 318132 316193 315013
57787C15013j220j204r28q85q52j21R21J116M26q4k15q02j824k103j227j11O99
$$ 315013 313793 312589 311661 310776 309924 309803 310724 311840 312266 312182 311967 311165 309341 307238 306011 305900 306599
57770C06599J637K672K940K494K771M519O507P145O316M956L700K642J665M44
$$ 306599 308236 310908 313848 316342 319113 323632 330139 337284 343600 348556 352256 354898 356563 357007
57756C57007j321l356n028o118o797o966o508o019o283p087p488p172o628o061
$$ 357007 355686 352330 347302 341184 334387 327421 320913 314894 308611 301524 294036 286864 280236 274175
57742B74175n237m301l735l560l486l607l981l935k927j666j144r99l15N17M06
$$ 274175 268938 264637 260902 257342 253856 250249 246268 242333 239406 237740 236596 235597 235282 235799 236205
57727B36205k70k1J324K347K316J885J423N54m17l91O49J400J284J125J404J546
$$ 236205 235935 235914 237238 239585 241901 243786 245209 245763 245346 244955 245604 247004 248288 249413 250817 252363
57711B52363J428J799K577K560J493P08Q47P51l12j000K07K768N004O238O823
$$ 252363 253791 255590 258167 260727 262220 262928 263775 264526 264214 263214 263421 266189 271193 277431 284254
57696B84254P043P072P230P383O785N250L514J927j57k988n522o839p359p853
$$ 284254 291297 298369 305599 312982 319767 325017 328531 330458 330301 327313 321791 314952 307593 299740
57682B99740q181p932p277o358m767k553o84M93K262N966J1242J7036K3453L1286
$$ 299740 291559 283627 276350 269992 265225 262672 261988 262481 264743 270709 281951 298987 322440 353726
57668C53726M0207M8648N5205N9122N9676N5989M7456L3865J5631n325k5417m0905
$$ 353726 393933 442581 497786 556908 616584 672573 720029 753894 769525 764200 738783 697878
57656F97878m9822n2412n0435m6258m1742l7225l2054k6343k1423j8109j5694
$$ 697878 648056 595644 545209 498951 457209 419984 387930 361587 340164 322055 306361
57645C06361j3251j0985r372p970o222m677m166m290l873k662j474q99p94r53
$$ 306361 293110 282125 272753 264783 258561 253884 249718 245428 241555 238893 237419 236520 235726 234773
57631B34773j301j432q17L49J134Q86q4r57j236j138j230j707k099j883j287r92
$$ 234773 233472 232040 231223 231572 232706 233592 233508 232551 231315 230177 228947 227240 225141 223258 221971 220979
57615B20979j212j548j688j584j060o5P27M98l66n69K63J076J011M60R1j51m82
$$ 220979 219767 218219 216531 214947 213887 213822 214549 215047 214681 214112 214375 215451 216462 216922 217013 216862 216380
57598B16380o87o52o28o03k64L9n28j800k532k343k313k983l240k272j160j234
$$ 216380 215693 215041 214413 213810 213546 213585 213057 211257 208725 206382 204069 201086 197846 195574 194414 193180
57582A93180k056k460k528k910l201k591j562j257j640j794j662j877k205j760
$$ 193180 191124 188664 186136 183226 180025 177434 175872 174615 172975 171181 169519 167642 165437 163677
57568A63677p67n08j358k177j977j081l05K6o2m91r82j184j121j093j119j039
$$ 163677 162910 162402 161044 158867 156890 155809 155504 155530 155468 154977 153995 152811 151690 150597 149478 148439
57552A48439r87j138j188p31o2J33k70p57r22o87K9J188K356L093L476L631L107
$$ 148439 147452 146314 145126 144395 144333 144466 144196 143439 142517 141830 141859 143047 145403 148496 151972 155603 158710
57535A58710J520n14j889k370k679l342m201n007n743o242o157n443m401l234
$$ 158710 160230 159716 157827 155457 152778 149436 145235 140228 134485 128243 122086 116643 112242 109008
57521A09008k005r60l92j73J97J040K233L347L926L819L454L377L433K945J899
$$ 109008 107003 106043 105651 105478 105675 106715 108948 112295 116221 120040 123494 126871 130304 133249 135148
57506A35148J224J492K059K034J397N44n45j892k910l029k469j729q70k6R3q70
$$ 135148 136372 137864 139923 141957 143354 143898 143353 141461 138551 135522 133053 131324 130454 130428 130521 129651
57490A29651k004k131j356p49r14j632k460k926k563j612j116j584k186k091j740
$$ 129651 127647 125516 124160 123411 122497 120865 118405 115479 112916 111304 110188 108604 106418 104327 102587
57475A02587j799j725p41N26Q52L70J71M59N58M54O51Q35K81n06l12O86J099P34
$$ 102587 100788 99063 98322 98848 99700 100070 100241 100700 101258 101712 102363 103198 103479 102973 102661 103347 104446 105180
57457A05180R84K338L342K772J374N00L05J77l1j18j24p0K86Q87J167Q43K81j70
$$ 105180 106164 108502 111844 114616 115990 116490 116795 116972 116941 116823 116699 116629 116915 117802 118969 119812 120093 119923
57439A19923n11n28K27J464K011J212j39p94m03M53J073J064M64k20m41k05J17
$$ 119923 119412 118884 119111 120575 122586 123798 123659 122865 122462 122915 123988 125052 125516 125296 124855 124650 124767
57422A24767M53Q99J090N23m87r94p00j80J49L94L98l63j696k490k077j097n85
$$ 124767 125220 126119 127209 127732 127245 126251 125551 125371 125520 125914 126312 125949 124253 121763 119686 118589 118004
57405A18004q27j397j747j483o33J46J40n13j068j269j416j432q55J66Q17Q26
$$ 118004 117177 115780 114033 112550 111917 112063 112203 111690 110622 109353 107937 106505 105650 105816 106633 107459
57389A07459P54Q68O99R4k95MO03R86J139J110P19J12j46P4K45J37J96O97J230
$$ 107459 108213 109081 109780 109874 109579 109583 110186 111172 112311 113421 114140 114252 114106 114180 114425 114562 114758 115455 116685
57370A16685J353J064M12n48j207p93M23J273J272J129J309J290P39L13N82J063
$$ 116685 118038 119102 119514 118966 117759 116966 117389 118662 119934 121063 122372 123662 124401 124714 125296 126359
57354A26359J071P46N29L48nl22l43j18L45J090J623J212J40l91OL57N2j55L42
$$ 126359 127430 128176 128705 129053 129048 128726 128383 128265 128610 129700 131323 132535 132675 132284 132290 132647 132699 132544 132886
57335A32886P53K23o45q10m96o39j241j549j468j594k067k358k098j369l35P16
$$ 132886 133639 133862 133217 132407 131911 131272 130031 128482 127014 125420 123353 120995 118897 117528 117193 117909
57319A17909J173O60l65j078j153q39m73l15n09q60r91r47j116j461j453r96n58
$$ 117909 119082 119742 119377 118299 117146 116307 115834 115519 115010 114150 113159 112212 111096 109635 108182 107186 106628
57302A06628k58K78Q85Q36K67K99J166J562P46o8L86J378J422O24K06M33N57L59
$$ 106628 106370 106648 107533 108369 108636 108935 110101 111663 112409 112341 112727 114105 115527 116151 116357 116790 117347 117706
57284A17706K31Q5m73j011o37N58J568J958K237K823L571M292M910N160M883M467
$$ 117706 117937 118022 117549 116538 115901 116459 118027 119985 122222 125045 128616 132908 137818 142978 147861 152328
57268A52328M383M509M571M815N396N605M705L189K219J960J522M14q66j640j651
$$ 152328 156711 161220 165791 170606 176002 181607 186312 189501 191720 193680 195202 195616 194750 193110 191459
57253A91459r83p1L37p9o79p09l25j54k74l85n50q91j007n61r5k52o48m63K05
$$ 191459 190476 190405 190742 190663 189984 189275 188950 188796 188522 188137 187587 186696 185689 185128 185033 184781 184133 183670 183875
57234A83875O43Q13J215J753J803J272O04k8n82n96J51P44J67j050j487q76k26
$$ 183875 184518 185331 186546 188299 190102 191374 191978 191950 191368 190772 190923 191667 191834 190784 189297 188421 188195
57217A88195k6K14O58Q41Q11J219K032K434K321K536L317L719L140K311K143K573
$$ 188195 188169 188383 189041 189882 190693 191912 193944 196378 198699 201235 204552 208271 211411 213722 215865 218438
57201B18438L113L769M730N831O817P680Q420Q922R303R828J0438J0811J1011
$$ 218438 221551 225320 230050 235881 242698 250378 258798 267720 277023 286851 297289 308100 319111
57188C19111J1387J1861J1993J1821J1880J2343J2749J2722J2359J1882J1477
$$ 319111 330498 342359 354352 366173 378053 390396 403145 415867 428226 440108 451585
57177D51585J1379J1683J2195J2942J4404J6548J8325J8956J9184K0146K1581
$$ 451585 462964 474647 486842 499784 514188 530736 549061 568017 587201 607347 628928
57166F28928K2421K2659K3216K4211K4955K5395K6039K6595K6293K5601K5809
$$ 628928 651349 674008 697224 721435 746390 771785 797824 824419 850712 876313 902122
57155I02122K6773K6868K5534K4114K3646K3524K3069K2839K3508K4713K5842
$$ 902122 928895 955763 981297 1005411 1029057 1052581 1075650 1098489 1121997 1146710 1172552
57144A172552K6889K7871K8468K8804K9517L0567L1113L0978L1090L2072L3582
$$ 1172552 1199441 1227312 1255780 1284584 1314101 1344668 1375781 1406759 1437849 1469921 1503503
57133A503503L5322L7372L9280M0397M1380M3729M7304N0142N1319N2096N3546
$$ 1503503 1538825 1576197 1615477 1655874 1697254 1740983 1788287 1838429 1889748 1941844 1995390
57122A995390N5130N6579N9092O3271O7791P1607P5780Q1531Q8192R4751J01999
$$ 1995390 2050520 2107099 2166191 2229462 2297253 2368860 2444640 2526171 2614363 2709114 2811113
57111B811113J11265J22396J34657J48524J64934J84030K06172K32999K65977
$$ 2811113 2922378 3044774 3179431 3327955 3492889 3676919 3883091 4116090 4382067
57102D382067L05228L51434M07633M77771N65152O73986Q10728R81943J192361
$$ 4382067 4687295 5038729 5446362 5924133 6489285 7163271 7973999 8955942 10148303
57093A0148303J446265J747498K094036K472550K859093L223476L534430L769549
$$ 10148303 11594568 13342066 15436102 17908652 20767745 23991221 27525651 31295200
57085C1295200L928051M031665M108587M180075M262759M362638M436160M353648
$$ 31295200 35223251 39254916 43363503 47543578 51806337 56168975 60605135 64958783
57077F4958783L935553L065839J787520K88401j203853k517166l559400m297127
$$ 64958783 68894336 71960175 73747695 74036096 72832243 70315077 66755677 62458550
57069F2458550m738077m925755m926764m806928m612221m365348m074146l743340
$$ 62458550 57720473 52794718 47867954 43061026 38448805 34083457 30009311 26265971
57061B6265971l383118l010041k641262k289344j962657j667948j409907j189154
$$ 26265971 22882853 19872812 17231550 14942206 12979549 11311601 9901694 8712540
57053H712540j002815q47075p18191o12011n24456m52509l93700l44934l03076
$$ 8712540 7709725 6862650 6144459 5532448 5007992 4555483 4161783 3816849 3513773
57044C513773k66538k35198k08737j86058j66254j49071j34236j21100j09223
$$ 3513773 3247235 3012037 2803300 2617242 2450988 2301917 2167681 2046581 1937358
57035A937358r8673q9591q1873p5317o9620o4290n9090n4459n0879m7877m4335
$$ 1937358 1838685 1749094 1667221 1591904 1522284 1457994 1398904 1344445 1293566 1245689 1201354
57024A201354l9821l4850k9654k3487j5486n511O390K0714L7768N6375P4090Q8794
$$ 1201354 1161533 1126683 1097029 1073542 1058056 1052545 1058935 1079649 1117417 1173792 1247882 1336676
57012A336676R9502J05050J02303Q6569N4977J0295l8650q1105j09898j23788
$$ 1336676 1436178 1541228 1643531 1730100 1785077 1795372 1756722 1675617 1565719 1441931
57002A441931j25635j19414j08803r6858q5374p4549o4024n4294m6356m0112l4125
$$ 1441931 1316296 1196882 1088079 991221 905847 831298 767274 712980 666624 626512 592387
56991E92387k7435k0770j5399j1338p538l563j05K242L824N066N367L631l38n550
$$ 592387 564952 544182 528783 517445 509907 506344 506239 508481 512305 517371 522738 526369 526031 520481
56977E20481j0824j5439j8784k0216j9714j8165j6481j4757j2700j0494q587o827
$$ 520481 509657 494218 475434 455218 435504 417339 400858 386101 373401 362907 354320 347493
56965C47493m586j692J454M666Q242J2182J5806J8465K0057K0534J9395J6079
$$ 347493 342907 341215 342669 347335 355577 367759 383565 402030 422087 442621 462016 478095
56953D78095J0524L194n051j2853j8705k1881k2733k1907j9765j6869j4260j2528
$$ 478095 488619 491813 486762 473909 455204 433323 410590 388683 368918 352049 337789 325261
56941C25261j1007q550m855n32L827Q135J2560J7284K2224K6692K9626L0515K9519
$$ 325261 314254 305704 300849 300317 304144 312279 324839 342123 364347 391039 420665 451180 480699
56928D80699K6382K0010J0013j949j3177k1865k7372k9458k8535k6278k4533k3510
$$ 480699 507081 527091 537104 535155 521978 500113 472741 443283 414748 388470 363937 340427
56916C40427k2062j9701j7173j5050j2994j0763q887p889p546p286o711n607m116
$$ 340427 318365 298664 281491 266441 253447 242684 233797 225908 218362 211076 204365 198758 194642
56903A94642k950k728l018k764j606K9J975M414O883Q390Q849R390J0930J3353
$$ 194642 191692 188964 185946 183182 181576 181605 183580 187994 194877 203267 212116 221506 232436 245789
56889B45789J6260J9453K2367K4167K4730K4464K2770J8072J0116J122o249j1186
$$ 245789 262049 281502 303869 328036 352766 377230 400000 418072 428188 429310 423061 411875
56877D11875j4302j5980j6193j5194j3368j0797p694m648j841J416N758J1018
$$ 411875 397573 381593 365400 350206 336838 326041 318347 313699 311858 313274 319032 330050
56865C30050J6973K3980L2034L9972M6478N1243N4224N4322M9866M0147K5828
$$ 330050 347023 371003 403037 443009 489487 540730 594954 649276 699142 739289 765117
56854G65117Q430r707k5497l6427m1932m3022m0887l6385l0468k4106j7732j1195
$$ 765117 773547 763840 738343 701916 659984 616962 576075 539690 509222 485116 467384 456189
56842D56189m125L870J3118K3725L5822M9717O4869P8670Q7643R0383Q8010Q0972
$$ 456189 452064 455934 469052 492777 528599 578316 643185 721855 809498 899881 987891 1068863
56830A068863O7077M4343J4794j6141m3378o4042p6756q1396p9655p4148o6512
$$ 1068863 1135940 1180283 1195077 1178936 1135558 1071516 994760 913364 833709 759561 693049
56819F93049n7307m7458l8185k9415j9835q875K559J3756K5271L7590M9634N9356
$$ 693049 635742 588284 550099 520684 500849 491974 494533 508289 533560 571150 620784 680140
56807F80140O5269O6737O3134N3452L6984J4575j0646l4029n1597o1808o5393
$$ 680140 745409 812146 875280 928732 965716 980291 969645 935616 884019 822211 756818
56796G56818o4028n9521n3639m7596m1609l5285k8452k1252j3854o497N80P681
$$ 756818 692790 633269 579630 532034 490425 455140 426688 405436 391582 385085 385665 393346
56784C93346J5445K3511L0049L3459L3865L2017K7414J8957P121n861j7862k7770
$$ 393346 408791 432302 462351 495810 529675 561692 589106 608063 615184 609323 591461 563691
56772E63691l4730l8093l8360l7007l4944l2063k8461k4931k1957j9165j6261
$$ 563691 528961 490868 452508 415501 380557 348494 320033 295102 273145 253980 237719
56761B37719j3669j1748j0202q658p255o215n426m755m310m051l587k656j491
$$ 237719 224050 212302 202100 193442 186187 179972 174546 169791 165481 161430 157843 155187 153696
56748A53696o22n04j207k120k195j097J41K88m48p70j76N07M85k4m46o67q07q29
$$ 153696 153074 152570 151363 149243 147048 145951 146092 146380 145932 145162 144986 145493 145978 145954 145508 144841 144034 143205
56730A43205p44p82j034j218j009l51N03J049Q17k5o20l44M81J210J688J900J488
$$ 143205 142461 141679 140645 139427 138418 138067 138570 139619 140436 140411 139791 139447 139928 141138 142826 144726 146214
56713A46214M29l51o6O63P33L21M17R11O32o71j771j733r96l94j20m4j35j47K44
$$ 146214 146643 146292 146226 146889 147622 147943 148360 149271 149903 149232 147461 145728 144732 144338 144218 144174 144039 143892 144136
56694A44136P61P97M67M67P83O82R1j38L07O53M32K59O01R63R24J046J823K556
$$ 144136 144897 145694 146161 146628 147411 148093 148184 148046 148353 149006 149438 149697 150298 151261 152185 153231 155054 157610
56676A57610K208Q37o38j652k242k428k090j316m60J55L24Q6j66j5L82M30n4n45
$$ 157610 159818 160655 160017 158365 156123 153695 151605 150289 149829 149984 150308 150394 150228 150213 150595 151025 150971 150426
56658A50426m91M3N76O92L07j78j07O96J630K175K631L386L948L647K936K843
$$ 150426 149935 149978 150554 151246 151553 151375 151268 151964 153594 155769 158400 161786 165734 169381 172317 175160
56642A75160L306L257K399J666J682J957J875J471R05J61m84o25o19j287k486
$$ 175160 178466 181723 184122 185788 187470 189427 191302 192773 193678 193839 193355 192730 192111 190824 188338
56627A88338l109k800k542l056l685l549k799k049j314l36O66J191J135Q84R65
$$ 188338 185229 182429 179887 176831 173146 169597 166798 164749 163435 163099 163765 164956 166091 166975 167940
56612A67940J609K298J985M53r49r15n8P8m74k92P54R95m31k196k809k452j882
$$ 167940 169549 171847 173832 174285 173336 172421 172363 172441 171967 171675 172429 173424 172993 170797 167988 165536 163654
56595A63654j017L49J594K102K108J908J276M25L10J133J695J248P52J237J995
$$ 163654 162637 162986 164580 166682 168790 170698 171974 172399 172709 173842 175537 176785 177537 178774 180769
56580A80769J759P45J40K69M80K97l04j254k027j592K19J991K359J750J433J586
$$ 180769 182528 183273 183413 183682 184162 184459 184155 182901 180874 179282 179501 181492 183851 185601 187034 188620
56564A88620J571J518K214L693N111O023O684P198P329P074O640N857M429K669
$$ 188620 190191 191709 193923 197616 202727 208750 215434 222632 229961 237035 243675 249532 253961 256630
56550B56630J354Q11P25P34O60L22l50j066j413j294r21n62m79p53j056j007p91
$$ 256630 257984 258795 259520 260254 260914 261236 260886 259820 258407 257113 256192 255630 255151 254398 253342 252335 251544
56533B51544r38j380j466j051p75j004j293j277j220j314j269j056j160j636j828
$$ 251544 250606 249226 247760 246709 245934 244930 243637 242360 241140 239826 238557 237501 236341 234705 232877
56518B32877j519j444k018k486k051j116n71n99q43j146j427j407j087r24j139
$$ 232877 231358 229914 227896 225410 223359 222243 221672 221073 220230 219084 217657 216250 215163 214239 213100
56503B13100j367j359j293j147o32l6j25q28j071m24K26J20l96q43j321j597q79
$$ 213100 211733 210374 209081 207934 207302 207266 207141 206313 205242 204818 205044 205164 204768 203925 202604 201007 200128
56486B00128O76J554Q60m37j100j207j186o89L64Q80J07r58r58q6N85Q31J094
$$ 200128 200804 202358 203218 202781 201681 200474 199288 198599 198963 199843 199950 198992 198034 197948 198533 199364 200458
56469B00458J370J457J558J674J255L83K77J480K626K258R02R7K52P09J087J380
$$ 200458 201828 203285 204843 206517 207772 208155 208432 209912 212538 214796 215698 215795 216047 216756 217843 219223
56453B19223J413J281J465J762J225L2j15J346K472J677K98M18J536J658N99k00
$$ 219223 220636 221917 223382 225144 226369 226401 226286 227632 230104 231781 232079 232497 234033 235691 236290 236090
56437B36090l17n39q38l96N95J114J059J101J084L41o84q52j90K46J78J84K58
$$ 236090 235773 235234 234396 234000 234595 235709 236768 237869 238953 239294 238610 237758 237568 237814 237992 238176 238434
56420B38434j29p16p01j10L93P71J345J745J412P82O23P21N19L58P12R30L36k41
$$ 238434 238305 237589 236888 236778 237171 237942 239287 241032 242444 243226 243849 244570 245089 245447 246159 247089 247425 247184
56402B47184J98Q16K12r13n78J353K920K913K014J150M98J29J00r6q45j490j400
$$ 247184 247382 248198 248410 247497 246919 248272 251192 254105 256119 257269 257767 257896 257996 257900 257055 255565 254165
56385B54165j289j941k406j387L13P88L4k83L09P22O12Q27J499J776J572J642
$$ 254165 252876 250935 248529 247142 247455 248243 248277 247994 248303 249025 249637 250464 251963 253739 255311 256953
56369B56953J869J373L53l0L71O52O95J160J765J528O84M25P86P49L05L40N78
$$ 256953 258822 260195 260548 260518 260889 261541 262236 263396 265161 266689 267373 267798 268584 269333 269638 269978 270556
56352B70556j61j602k102j251k67J94N98Q50L00m69j44Q53Q02k54l58J003J998
$$ 270556 270395 268793 266691 265440 265173 265367 265965 266815 267115 266646 266502 267355 268157 267903 267545 268548 270546
56335B70546J505O72N67O34M09O16J495J997J652J492K197L006L256L317L331
$$ 270546 272051 272723 273290 273924 274333 274949 276444 278441 280093 281585 283782 286788 290044 293361 296692
56320B96692K720J702J564K596L396K946J923J247Q91P39J083J627J459N53JL57
$$ 296692 299412 301114 302678 305274 308670 311616 313539 314786 315677 316416 317499 319126 320585 321138 321139 321496
56304C21496J096J944L242M733N571N681N671N450M555L555L236K718O21k095
$$ 321496 322592 324536 327778 332511 338082 343763 349434 354884 359439 362994 366230 368948 369569 367474
56290C67474k999j908j096j588j926j105m9N49J251J991J709O56N85J863K753
$$ 367474 364475 362567 361471 359883 357957 356852 356803 357352 358603 360594 362303 362959 363544 365407 368160
56275C68160K428K160K697K993K563K615L672M465M307M297N034N423M859M365
$$ 368160 370588 372748 375445 378438 381001 383616 387288 391753 396060 400357 405391 410814 415673 420038
56261D20038M518M469M071M565O108P050O808P024Q611J0244J1033J2119J4193
$$ 420038 424556 429025 433096 437661 443769 450819 457627 464651 473262 483506 494539 506658 520851
56248E20851J6029J7091J9044K2853K6752K8967L0299L2144L4082L5272L6322
$$ 520851 536880 553971 573015 595868 622620 651587 681886 714030 748112 783384 819706
56237H19706L7817L8735L8095L6588L5060L2977K9699K5604K0814J4716P808J915
$$ 819706 857523 896258 934353 970941 1006001 1038978 1068677 1094281 1115095 1129811 1137619 1139534
56225A139534k546p289j2988j7891k0872k3259k6037k7835k7571k6617k6408k6155
$$ 1139534 1136988 1129699 1116711 1098820 1077948 1054689 1028652 1000817 973246 946629 920221 894066
56213H94066k4890k3545k3096k2709k1653k0895k1025k0675j8902j6964j6002
$$ 894066 869176 845631 822535 799826 778173 757278 736253 715578 696676 679712 663710
56202F63710j5184j3844j3060j3197j2406r634o700n282m322k609j451k203l495
$$ 663710 648526 634682 621622 608425 596019 586385 579685 574403 570081 567472 566021 563818 560323
56189E60323l528l010l254l394k149m86Nk76k78m43j291j681p53K32O8k63K91
$$ 560323 556795 553785 550531 547137 544988 544502 544507 544231 543953 543510 542219 540538 539785 540017 540085 539822 540113
56172E40113P59L23K83J613K765K296J440J708K230J957K099L703N113M737M050
$$ 540113 540872 541195 541478 543091 545856 548152 549592 551300 553530 555487 557586 561289 566402 571139 575189
56157E75189M985O471O543N872O172O972O970O817P765R187J0041J0960J2497
$$ 575189 580174 586645 593188 599060 605232 612204 619174 625991 633756 642943 652984 663944 676441
56144F76441J3338J2807J2828J4832J7097J7861J8494K0632K2918K3831K5186
$$ 676441 689779 702586 715414 730246 747343 765204 783698 804330 827248 851079 876265
56133H76265K9383L5681M2675N1888O5081Q0294R4426J07647J21281J33409J40634
$$ 876265 905648 941329 984004 1035892 1100973 1181267 1275693 1383340 1504621 1638030 1778664
56122A778664J42508J40333J33458J20853J04911Q9692P6525O4625N4352M6304
$$ 1778664 1921172 2061505 2194963 2315816 2420727 2510419 2586944 2651569 2705921 2752225
56112B752225L8824K9900K0128J0767J001r626j8627k4146k8764l6013m5659n6289
$$ 2752225 2791049 2820949 2841077 2851844 2852845 2843219 2824592 2800446 2771682 2735669 2690010 2633721
56100B633721o9571q7022j04952j17745j24364j27060j25784j18985j08267r7069
$$ 2633721 2564150 2477128 2372176 2254431 2130067 2003007 1877223 1758238 1649971 1552902
56090A552902q5897p3495o1278n1834m4419l6532k8659k2905j8512j3327q263
$$ 1552902 1467005 1393510 1332232 1280398 1235979 1199447 1170788 1147883 1129371 1116044 1107781
56079A107781n695m901l538j981j685j243J260L957M191L645N452Q345R080Q578
$$ 1107781 1102086 1097185 1093647 1091666 1089981 1088738 1089998 1093955 1098146 1101791 1107243 1115588 1124668 1133246
56065A133246J0053J2875J4010J3779J4558J5513J4295J2303J2470J3614J2712
$$ 1133246 1143299 1156174 1170184 1183963 1198521 1214034 1228329 1240632 1253102 1266716 1279428
56054A279428J0865J1115J2304J1398R844J1242J4441J5506J4835J5799J8131
$$ 1279428 1290293 1301408 1313712 1325110 1334954 1346196 1360637 1376143 1390978 1406777 1424908
56043A424908J9175J9793K2298K4662K3677K1686K2924K5513K4798K2294K3086
$$ 1424908 1444083 1463876 1486174 1510836 1534513 1556199 1579123 1604636 1629434 1651728 1674814
56032A674814K6419K7472K6646K8298L1729L2496L1456L3458L7991M0205M0263
$$ 1674814 1701233 1728705 1755351 1783649 1815378 1847874 1879330 1912788 1950779 1990984 2031247
56021B031247M2525M6376M7187M5666M6824N0402N1731N1369N4125N9264O1558
$$ 2031247 2073772 2120148 2167335 2213001 2259825 2310227 2361958 2413327 2467452 2526716 2588274
56010B588274O1415O4004O9139P2104P3520P7937Q3786Q5671Q5499Q9994R8319
$$ 2588274 2649689 2713693 2782832 2854936 2928456 3006393 3090179 3175850 3261349 3351343 3449662
55999C449662J03904J07217J14312J24108J30154J33875J42451J54625J62777
$$ 3449662 3553566 3660783 3775095 3899203 4029357 4163232 4305683 4460308 4623085
55990D623085J68139J78981J94535K06390K15281K30170K50854K68464K83257
$$ 4623085 4791224 4970205 5164740 5371130 5586411 5816581 6067435 6335899 6619156
55981F619156L04356L31694L56501L80047M12730M54183M94258N34220N85953
$$ 6619156 6923512 7255206 7611707 7991754 8404484 8858667 9352925 9887145 10473098
55972A0473098O49754P15354P85374Q73856R81262J096660J225474J387385J586312
$$ 10473098 11122852 11838206 12623580 13497436 14478698 15575358 16800832 18188217 19774529
55963A9774529J812959K078575K413991K835262L348059L990052M832975N947691
$$ 19774529 21587488 23666063 26080054 28915316 32263375 36253427 41086402 47034093
55955D7034093P420801R414037J2149926J5800663K0371878K5598210L0832189
$$ 47034093 54454894 63868931 76018857 91819520 112191398 137789608 168621797
55948A68621797L5103061L7530260L7776837L5908950L1695751K4344842J3369844
$$ 168621797 203724858 241255118 279031955 314940905 346636656 370981498 384351342
55941C84351342k10106j3830925k4765311l1584586l4436798l4314312l2306309
$$ 384351342 384141236 370310311 345545000 313960414 279523616 245209304 212902995
55934B12902995k9315933k6008193k2766614j9732104j6946371j4444212j2235823
$$ 212902995 183587062 157578869 134812255 115080151 98133780 83689568 71453745
55927G1453745j0295084q604377p169499n977745m984820m155475l479287k937621
$$ 71453745 61158661 52554284 45384785 39407040 34422220 30266745 26787458 23849837
55919B3849837k492279k117601j811947j568478j364166j185946j039881r25814
$$ 23849837 21357558 19239957 17428010 15859532 14495366 13309420 12269539 11343725
55911A1343725q27755p36867o60412o00510n45864m91447m45820m12044l80383
$$ 11343725 10515970 9779103 9118691 8518181 7972317 7480870 7035050 6623006 6242623
55902F242623l46237l17191k96316k75513k51262k30686k16562k01709j83423
$$ 6242623 5896386 5579195 5282879 5007366 4756104 4525418 4308856 4107147 3923724
55893C923724j68658j59897j50154j36696j25985j20314j12947j01126r1016q5211
$$ 3923724 3755066 3595169 3445015 3308319 3182334 3062020 2949073 2847947 2756931 2671720
55883B671720p7681o5530n3789m4274l1460j3684K844J5283K8310M3034N2726
$$ 2671720 2594039 2528509 2474720 2430446 2398986 2385302 2388146 2403429 2431739 2474773 2527499
55872B527499N3716M9915M2727K7192K595k3566m6653o9909r4117j12418j20549
$$ 2527499 2581215 2631130 2673857 2701049 2703644 2680078 2633425 2563516 2469399 2356981 2236432
55861B236432j22939j23597j19908j10479j00428r3444q6456p7135o9029o4458
$$ 2236432 2113493 1989896 1869988 1759509 1659081 1565637 1479181 1402046 1333017 1268559
55851A268559n9758n2489m6217m3495m0948l6008l1771l0636k9542k6129k3308
$$ 1268559 1208801 1156312 1110095 1066600 1025652 989644 957873 927237 897695 871566 848258
55840H48258k3251k2865j9722j6661j6111j5484j2523r826r769j0059q523p337
$$ 848258 825007 802142 782420 765759 749648 734164 721641 711815 702046 691987 683464 676127
55828F76127q528r977r736r623j0940j1325r416q098r506j1224j0863r983j0163
$$ 676127 667599 657622 647886 638263 627323 615998 606582 598484 588978 577754 566891 556908 546745
55815E46745r663p329n518n707n392k643L57J549K603N216P808R012J0544J3471
$$ 546745 537082 529753 524235 518528 513136 510493 510850 512399 515002 520218 528026 537038 547582 561053
55801E61053J5555J5315J4858J5663J5470J2405Q390N385J961l301q512j1604
$$ 561053 576608 591923 606781 622444 637914 650319 658709 664094 666055 662754 654242 642638
55789F42638j3414j5000j5316j4108j3502j4122j3382j0208p655q016r226q994
$$ 642638 629224 614224 598908 584800 571298 557176 543794 533586 525931 517915 508689 499695
55777D99695q600r456r662p383m221j876J217O598J2194J5379J6762J7778J7244
$$ 499695 491095 481639 471977 464594 460373 458497 459714 466312 478506 493885 510647 528425 545669
55764E45669J3394O914p14r278j7816k3488k5049k4743k4408k2808j9111j5587
$$ 545669 559063 565977 565263 555985 538169 514681 489632 464889 440481 417673 398562 382975
55752C82975j4009j2766j0338q405q451q653p341o335p420q538p141m500l151
$$ 382975 368966 356200 345862 337457 329006 320353 313012 306677 299257 290719 283578 279078 275927
55739B75927k539r04Q92J048L41N58J199Q48M1j97p96k717m498m535l930m366
$$ 275927 273388 272484 273376 274424 274765 275323 276522 277370 277411 277214 276418 273701 269203 264668 260738 256372
55723B56372n190n189n197o100o441m870k875k260j915o6K340L482M014N508P326
$$ 256372 251182 245993 240796 234696 228255 223385 220510 218250 216335 216269 218609 222091 226105 231613 238939
55708B38939P954P813P949P570N661L228J414p90m267p279q096q093r240j0532
$$ 238939 246893 254706 262655 270225 275886 279114 280528 279738 275471 268192 260096 252003 242763 232231
55694B32231j0026q474p712p209n583l947m189n320m934l187k020j601o37O72
$$ 232231 222205 213731 206019 198810 193227 189280 185091 179771 174837 171650 169630 168029 167392 168064
55680A68064J186J410K553L866L694K395J506J051K08m79l02n03k345m219l749
$$ 168064 169250 170660 173213 177079 180773 183168 184674 185725 185933 185454 185152 184649 182304 178085 174336
55665A74336j658n06n31MJ182J467R08J184K591L794M436N383O650P389P694Q165
$$ 174336 172678 172172 171641 171645 172827 174294 175202 176386 178977 182771 187207 192590 199240 206629 214323 222488
55649B22488Q197O921N116L997K897N41k247l616l766m344n514o132o168o377
$$ 222488 230685 237606 242722 246719 249616 250157 247910 244294 240528 236184 230670 224538 218370 211993
55635B11993o292n126m012m584n958n878m321l215l028k529j661j716k659k963
$$ 211993 205701 200575 196563 191979 186021 180143 175822 172607 169579 167050 165389 163673 161014 158051
55621A58051k228j506j053j27R90J161N76M83Q43N29l59o53m45q57j588j243n0
$$ 158051 155823 154317 153264 153137 154127 155288 155864 156347 157190 157719 157360 156707 156262 155405 153817 152574 152524
55604A52524J49j144k462k874k988l205l073k526j953j024O73K042J620O4o53
$$ 152524 152673 151529 149067 146193 143205 140000 136927 134401 132448 131424 132097 134139 135759 135823 135170
55589A35170k53j10m10P3J333J821J117N83R13J223J052J134J720K135K462L691
$$ 135170 134917 134807 134397 134470 135803 137624 138741 139324 140237 141460 142512 143646 145366 147501 149963 153654
55573A53654N817P608Q684R985J1806J3217J3861J4525J5418J5564J4331J2130
$$ 153654 159471 167079 175763 185748 197554 210771 224632 239157 254575 270139 284470 296600
55561B96600R260N671K009p05k680n137q325j1208j3155j4330j4536j3417j1812
$$ 296600 305860 311531 313540 312835 310155 305018 296693 285485 272330 258000 243464 230047 218235
55548B18235j1069j0939r993q161o962o982p092o528n797n196m170k692j614j217
$$ 218235 207166 196227 186234 178073 171111 164129 157037 150509 144712 139516 135346 132654 131040 129823
55534A29823q87n00n52q29n49J8j86j010j164m41o0n03q60o68n93q82r23p17j076
$$ 129823 128936 128436 127884 127055 126506 126524 126338 125328 124164 123723 123663 123160 122300 121632 121039 120157 119234 118517 117441
55515A17441j977k396k161k191k582k350j437j093j650j821q87J94M95K96q4q90
$$ 117441 115464 113068 110907 108716 106134 103784 102347 101254 99604 97783 96896 97090 97585 97881 97797 96907
55499I6907j728j458j09Q01N32J82O38J209J164R94J117Q37k72j197r14Q5O61
$$ 96907 95179 93721 93612 94413 94945 95127 95765 96974 98138 99132 100249 101086 100814 99617 98703 98788 99449
55482I9449N60J78l54r53j178p05J58Q28Q29p0j360j716m71J176J619J174J334
$$ 99449 100009 100187 99833 98880 97702 96997 97155 97983 98812 98742 97382 95666 95195 96371 97990 99164 100498
55465A00498K123K166J353J144J871J961O18p77r20l83j75p9L95Q60R13Q74Q33
$$ 100498 102621 104787 106140 107284 109155 111116 111734 110957 110037 109654 109479 109400 109795 110655 111568 112442 113275
55448A13275K02r71j559j043l21n7L36J178J440L48j102j413m63Q22J722J872
$$ 113275 113477 112506 110947 109904 109583 109526 109862 111040 112480 112828 111726 110313 109850 110672 112394 114266
55432A14266J126O9k63J96M03l9k20L42P12K00l51L3R00J289J251J370J661J871
$$ 114266 115392 115461 115198 115394 115797 115758 115538 115880 116592 116792 116441 116474 117374 118663 119914 121284 122945 124816
55414A24816K157K575K730K598K833L529L652K502Q17l87j133j892k550k883l188
$$ 124816 126973 129548 132278 134876 137709 141238 144890 147392 148209 147822 146689 144797 142247 139364 136176
55399A36176l668l867l424k671j943j150n29p58j741k331j936j341j220j044k55
$$ 136176 132508 128641 125217 122546 120603 119453 118924 118166 116425 114094 112158 110817 109597 108553 108298
55384A08298N47O34L53L29L74J46J4K76L54j98o93k96O77J336J409J029P0j269
$$ 108298 108845 109479 109832 110161 110535 110681 110695 110971 111325 111127 110434 110138 110815 112151 113560 114589 114659 113390
55366A13390k005j463l37K47J30k20p28j413j703j084n0N17N74O43P53M63j71
$$ 113390 111385 109922 109585 109832 109962 109742 109014 107601 105898 104814 104764 105281 105855 106498 107251 107714 107543
55349A07543n49l06L31R19J134R29O48P67J254J574J347O68k68j234j716j341
$$ 107543 106994 106688 107019 107938 109072 110001 110649 111416 112670 114244 115591 116259 115991 114757 113041 111700
55333A11700o22m87r64j229j032r76j257j131j41J135J937K086J612O38j76q2
$$ 111700 111078 110591 109627 108398 107366 106390 105133 104002 103861 104996 106933 109019 110631 111269 111093 111011
55317A11011N56N96j23n50k17J14K0J47P93J114N18l41p51r06j042q01k41k12
$$ 111011 111567 112163 112040 111490 111273 111387 111407 111554 112347 113461 113979 113638 112887 111981 110939 110138 109897 109685
55299A09685r61j485j007p2O30J260J938K070J402O18J31n10j314j361m21L74
$$ 109685 108724 107239 106232 106160 106790 108050 109988 112058 113460 114078 114209 113699 112385 111024 110603 110977
55283A10977M33O60J478J544n2j832j862m97M78N02L21K72J11PK84N49K68l09
$$ 110977 111410 112070 113548 115092 115040 113208 111346 110849 111327 111829 112150 112422 112533 112540 112824 113373 113641 113332
55265A13332p42j151j516j158j6O63N4q53q33k81o5K70J486K779K790J770J080
$$ 113332 112590 111439 109923 108765 108749 109412 109466 108613 107780 107499 107434 107704 109190 111969 114759 116529 117609
55248A17609J049R23N31L52L32M3k77k01j30o13j172j085p31p92q26j30O54M46
$$ 117609 118658 119581 120112 120464 120796 120839 120562 120361 120231 119618 118446 117361 116630 115838 115012 114882 115536 115982
55230A15982l12k85O02J212J121Q69O11Q0l62j68K12N2j56M96J374R95n90j785
$$ 115982 115670 115385 115987 117199 118320 119189 119800 119880 119518 119350 119562 119614 119458 119954 121328 122323 121733 119948
55212A19948j769j116k30J015K021J686K61o66l42L84P62J072J526J641J206O37
$$ 119948 118179 117063 116833 117848 119869 121555 121816 121150 120808 121192 121954 123026 124552 126193 127399 128036
55196A28036O7p62j471j234k54K42j59n00j49K44k6o71j195j606j855j526o07
$$ 128036 128103 127341 125870 124636 124382 124624 124465 123965 123816 124060 124034 123363 122168 120562 118707 117181 116574
55179A16574J44K07r5l09m34m85j84N27J269J773K106K209J816R49n8r55j485
$$ 116574 116718 116925 116830 116521 116087 115602 115418 115945 117214 118987 121093 123302 125118 126067 126009 125054 123569
55162A23569j170Q4J358J603R51L45J00j93n30m72j84l74j050j381r60k37L34
$$ 123569 122399 122483 123841 125444 126395 126740 126840 126647 126117 125645 125461 125087 124037 122656 121696 121459 121793
55145A21793P52R47P41L39O4l42j210j962j662m88M67P56Q60R74P08R3l36n10
$$ 121793 122545 123492 124233 124572 124636 124294 123084 121122 119460 118972 119439 120195 121055 122029 122737 122830 122494 121984
55127A21984q09j039o34J04K41j87j50N79R92N50J4P3L71M58N20O48M33j46l69
$$ 121984 121175 120136 119502 119606 119847 119660 119510 120089 121081 121631 121645 121718 122089 122547 123067 123715 124148 124002 123633
55108A23633R2N94N64L03L18N85Q80J090R68L65k22j49K23j9p24p12L50J352J406
$$ 123633 123725 124319 124883 125186 125504 126089 126969 128059 129027 129392 129170 129021 129244 129225 128501 127789 128139 129491 130897
55089A30897Q72L17k16m38L01J681K252J415L72K76O25M34j09l05l18o93j187
$$ 130897 131769 132086 131870 131432 131733 133414 135666 137081 137453 137729 138354 138788 138679 138374 138056 137363 136176
55072A36176j158o84l11j62o1p8k09k8N59P99J16r05j273r71o70n84m04q9J44
$$ 136176 135018 134334 134023 133861 133800 133722 133513 133485 134044 134843 134959 134054 132781 131810 131140 130556 130152 130063 130207
55053A30207L59P17R07N05k73p87q47p93p33l19O32J665K005J295N4o54k18Q12
$$ 130207 130566 131283 132190 132695 132422 131635 130788 129995 129262 128943 129575 131240 133245 134540 134594 133940 133722 134534
55035A34534J346J043N63M81O01N46M36N58P48N93J2n93p55l83Q7O9m15o23j01
$$ 134534 135880 136923 137486 137967 138568 139114 139550 140108 140856 141449 141461 140868 140113 139730 139817 139886 139471 138848 138747
55016A38747N42M59j24l55k38o26j663k297j735n15K94K86k58q45r80m50L14O60
$$ 138747 139289 139748 139624 139269 139031 138405 136742 134445 132710 132195 132489 132775 132517 131672 130692 130242 130556 131216
54998A31216N76N53O47N09K67M94J170J641J724J850J983J553O96L51P31Q90K98
$$ 131216 131792 132345 132992 133501 133768 134262 135432 137073 138797 140647 142630 144183 144879 145230 145961 146851 147149
54981A47149l37l54j17m3J88O35M72o97j873j923j069k70J05J88L3n8N61J782
$$ 147149 146812 146458 146341 146298 146486 147121 147593 146896 145023 143100 142031 141761 141866 142054 142087 142029 142590 144372
54963A44372K366J526J13o95r77j325j395n24Q27J519J292P51K14l20m17L26J319
$$ 144372 146738 148264 148377 147682 146705 145380 143985 143461 144288 145807 147099 147850 148064 147744 147327 147653 148972
54946A48972J540R56M22L19K64N4p2m4nK07P91J301J112M54J71N24J011J311J525
$$ 148972 150512 151468 151890 152209 152473 152527 152455 152411 152406 152613 153404 154705 155817 156271 156442 156966 157977 159288 160813
54927A60813J549J155P10R63J928K821L341M105N473O675O668N409L744K334J189
$$ 160813 162362 163517 164227 165190 167118 169939 173280 177385 182858 189533 196201 201610 205354 207688 208877
54912B08877J21q69j708k506l406m201m413l900l167k806k803k834k969l489m084
$$ 208877 208998 208129 206421 203915 200509 196308 191895 187995 184828 182022 179219 176385 173416 169927 165843
54897A65843m030l251k485k072j478l60O87R95Q04P44R54J215J451J571J396J212
$$ 165843 161813 158562 156077 154005 152527 152167 152854 153849 154653 155397 156351 157566 159017 160588 161984 163196
54881A63196J785L245M663N292N495N789N799N063M109L680L489K834J872J118
$$ 163196 164981 168226 172889 178181 183676 189465 195264 200327 204436 208116 211605 214439 216311 217429
54867B17429J59j687l766m573l915l269l690m534m663l930k965k246j867j690
$$ 217429 217588 215901 212135 207562 203647 200378 196688 192154 187491 183561 180596 178350 176483 174793
54853A74793j407q26k76k74p95j282j460j531j609j504j243j183j465j751j684
$$ 174793 173386 172560 172284 172010 171215 169933 168473 166942 165333 163829 162586 161403 159938 158187 156503
54838A56503j248p16m65p91j479j785j289n74m60p67o16K01Q96Q81M88K56J50
$$ 156503 155255 154539 154074 153283 151804 150019 148730 148156 147696 146929 146313 146514 147410 148291 148779 149035 149185
54821A49185j79p21j082q91j28P56J202J141J077J272J226N40j62RP83J020L90
$$ 149185 149006 148285 147203 146312 146184 146940 148142 149283 150360 151632 152858 153398 153236 153245 154028 155048 155438
54804A55438j82j5M26M49J99J75L33K58q7l89m82m57m28m42n13n14k67P7%o94
$$ 155438 155256 155241 155667 156116 156315 156490 156823 157081 156994 156605 156123 155666 155238 154796 154283 153769 153502 153579 153579 152885
54784A52885j428j383m61N95J033Q09M17K40K84N17J079J981K832L255L494M118
$$ 152885 151457 150074 149613 150208 151241 152050 152467 152707 152991 153508 154587 156568 159400 162655 166149 170267
54768A70267N181O185O927P722Q547Q786Q256P742P786P623O193L777J651L55
$$ 170267 175448 181633 188560 196282 204829 213615 221871 229613 237399 245022 251215 254992 256643 256998
54754B56998o87k003l495n079o823q248q456p403o241n895n904n228l712k209
$$ 256998 256311 254308 250813 245734 238911 230663 222207 214804 208563 202668 196764 191536 187824 185615
54740A85615j481j495j660j414o60J71M90J50m66q79q73l88N86J843K940L496
$$ 185615 184134 182639 180979 179565 178905 179076 179566 179716 179250 178371 177498 177110 177696 179539 182479 185975
54724A85975L511L327L382L859M426M437L717K902K649K633J871P9j911l215l863
$$ 185975 189486 192813 196195 200054 204480 208917 212634 215536 218185 220818 222689 222768 220857 217642 213779
54709B13779m373m870n077m899m558m191l745l187k610k046j459r31o90q06j025
$$ 213779 209406 204536 199459 194560 190002 185811 182066 178879 176269 174223 172764 171833 171143 170337 169312
54694A69312j092j101j343j786j997j670r64j28P74J520J418J08j522k006j079
$$ 169312 168220 167119 165776 163990 161993 160323 159359 159231 160005 161525 162943 163051 161529 159523 158444
54679A58444m1m1o90r04n15k75n82r56q32k88J76L06L24N71R61R01J7j139j528
$$ 158444 158403 158362 157672 156768 156253 155978 155396 154440 153608 153320 153496 153802 154126 154697 155658 156559 156576 155437 153909
54660A53909q76K8L69K28J23K13L76O14R14J037Q65O62N94M19j0k93o6L81N42
$$ 153909 153033 153061 153430 153658 153781 153994 154370 154984 155898 156935 157800 158462 159056 159475 159465 159172 159106 159487 160029
54641A60029M04K31L6k11k20J60N18M49K34L24M98K69k28m91n68r26j464j507
$$ 160029 160433 160664 160700 160489 160269 160429 160947 161396 161630 161954 162452 162721 162493 162002 161434 160508 159044 157537
54623A57537p74K13P90P08J40m12l55K91O64Q4q92j094k31Q79J491J582J348Q54
$$ 157537 156763 156976 157766 158474 158614 158202 157847 158138 158802 158886 157994 156900 156669 157548 159039 160621 161969 162823
54605A62823L10J24L74O48N37P1l89m72j61N5l59j179j510r84k29K56Q83J972
$$ 162823 163133 163257 163631 164279 164816 164887 164498 164026 163865 163920 163561 162382 160872 159888 159659 159915 160798 162770
54587A62770K744K344J273O76O11K67m50p88o18o21r50q81q5P72J022P44K78j60
$$ 162770 165514 167858 169131 169807 170418 170685 170235 169447 168829 168208 167258 166377 166292 167064 168086 168830 169108 168948
54569A68948k71J60P26P96M95M09M12j46j032j151k44O29P48P47J371K209K432
$$ 168948 168677 168837 169563 170359 170854 171263 171675 171529 170497 169346 169102 169731 170479 171226 172597 174806 177238
54552A77238J913J028k6r81j255n99M25J090J216R73N25J83L01O65O53K73K87
$$ 177238 179151 180179 180153 179172 177917 177318 177743 178833 180049 181022 181547 181730 182031 182696 183349 183622 183909
54535A83909R82J648J713J546J564J420P96K45L66P56P17M81P56J359J294J83
$$ 183909 184891 186539 188252 189798 191362 192782 193578 193823 194189 194945 195662 196143 196899 198258 199552 199735
54519A99735j141j646j176l95Pj22l83l78j74j18k61l63m38p83j356j654j359
$$ 199735 198594 196948 195772 195377 195384 195262 194879 194501 194327 194209 193948 193585 193147 192364 191008 189354 187995
54502A87995o56K86J414K231J926N07q00r65m24l10q51j258j004m78k72l61j92
$$ 187995 187339 187625 189039 191270 193196 193703 192903 191938 191514 191204 190353 189095 188091 187613 187341 186980 186788
54485A86788N66J527J905J435P74O97J086J239R76Q15R67R71O00M03Q92J742K271
$$ 186788 187354 188881 190786 192221 192995 193692 194778 196017 196993 197808 198775 199746 200346 200749 201641 203383 205654
54468B05654K265J939J479J059R46J238J648J800J543R47L27K26Q28J389R45k88
$$ 205654 207919 209858 211337 212396 213342 214580 216228 218028 219571 220518 220845 221071 221899 223288 224233 223945
54452B23945r68l78O71J027N74j03o93j242j655j811j862k003k158k183k076j820
$$ 223945 222977 222599 223270 224297 224871 224768 224075 222833 221178 219367 217505 215502 213344 211161 209085 207265
54436B07265j394j053j089j209q11n7J30n58j182q66J1N42N84O55R24J040P84
$$ 207265 205871 204818 203729 202520 201709 201652 201782 201224 200042 199176 199187 199729 200313 200968 201892 202932 203716
54419B03716L51P8J18K87K29p4r3M48Q60L28p26j116o44k47l36l11j6j22o12l52
$$ 203716 204067 204145 204263 204550 204779 204705 204612 205060 205920 206248 205522 204406 203762 203515 203179 202868 202852 202730 202118 201766
54399B01766R39J817J315O07J140K200K063P36j07L62J237J412P92l4m60j94L64
$$ 201766 202705 204522 205837 206444 207584 209784 211847 212583 212476 212838 214075 215487 216279 216245 215785 215591 215955
54382B15955L58l70q72n10m7m38j237j362q50o60j047j419j455j280p31L60J419
$$ 215955 216313 215943 215071 214561 214514 214076 212839 211477 210627 209967 208920 207501 206046 204766 204035 204395 205814
54365B05814J705J451J457J728J627J064M95j6o19q53k70M58L05l72l25M68O85
$$ 205814 207519 208970 210427 212155 213782 214846 215341 215325 214706 213853 213583 214041 214346 213974 213649 214117 214802
54348B14802j99j160j365j269j501j868k067k260k397j953r34k10l08o36m97q3
$$ 214802 214603 213443 212078 210809 209308 207440 205373 203113 200716 198763 197829 197619 197311 196675 196178 196095
54332A96095P7l9j81l15m16l00m6n7m07o70o08m30j39N94J599J988J310K64j58
$$ 196095 196172 196133 195952 195637 195221 194921 194875 194818 194411 193741 193133 192703 192564 193158 194757 196745 198055 198319 198161
54313A98161J87P54J039P92%q76j127o03N6K97K91L82M10O3m63o70m57k31l38
$$ 198161 198348 199102 200141 200933 200933 200057 198930 198327 198383 198680 198971 199353 199763 199826 199363 198693 198236 198005 197667
54294A97667o39o64j42N65P94L83j04k61m72j173j920j911j187m96j51J40M05
$$ 197667 197028 196364 196222 196787 197581 197964 197860 197599 197127 195954 194034 192123 190936 190440 190289 190429 190834
54277A90834K93j27l27j90j50l23l30r1K2o5l6M5k72r02j119o27R7O65J185J633
$$ 190834 191127 191000 190673 190483 190333 190010 189680 189589 189611 189546 189510 189555 189283 188381 187262 186635 186732 187397 188582 190215
54257A90215J723J595J657J663R89j8l00J15k3r86j343l06P54L27q89j236o14
$$ 190215 191938 193533 195190 196853 197842 197824 197524 197639 197616 196630 195287 194981 195735 196062 195173 193937 193323
54240A93323k25m83p92r76j405j794j345j83O09M86L4j45j02oK35N53O99P48R95
$$ 193323 193098 192615 191823 190847 189442 187648 186303 186120 186729 187215 187249 187104 187002 186996 187231 187784 188483 189231 190226
54221A90226J218P93l21j289j377o67K81R74J120P38K82J46J26k00o33n21J01
$$ 190226 191444 192237 191916 190627 189250 188583 188864 189838 190958 191696 191978 192124 192250 192050 191417 190896 190997
54204A90997L51l04j316j822j665j249q92o56m92k24L76J102J255M31q20j474
$$ 190997 191348 191044 189728 187906 186241 184992 184100 183444 182952 182728 183104 184206 185461 185892 185072 183598
54188A83598j125k40N50J056J382J514J332Q14J23n86j259j775j829j179k7R79
$$ 183598 182473 182233 182783 183839 185221 186735 188067 188881 189004 188418 187159 185384 183555 182376 182349 183328
54172A83328J302R61L88p7m22p02p88m41L18J064J283R00L66J24R6j06n54p97
$$ 183328 184630 185591 185979 185902 185480 184778 183990 183549 183867 184931 186214 187114 187480 187604 187700 187594 187040 186243
54154A86243m48L03Q20O98J95n1K47O07K73q58k001k322j777r74m49l16l60j90
$$ 186243 185795 186098 186918 187616 187811 187760 188007 188614 188887 188029 186028 183706 181929 180955 180506 180190 179830 179640
54136A79640M52J229J378P83L88R54J790J612M43l89j33N41Q07P35O18K54m78
$$ 179640 180092 181321 182699 183482 183870 184824 186614 188226 188669 188280 188147 188688 189495 190230 190848 191102 190624
54119A90624j063j052p46n44k13N09J109R18K09j29J95O63P85N66K65J95O30J441
$$ 190624 189561 188509 187763 187219 187006 187515 188624 189542 189751 189622 189817 190480 191265 191831 192096 192291 192921 194362
54101A94362K047K069J758J422Q71j1o80o61m34o61r79n91J87J62q45j591j236
$$ 194362 196409 198478 200236 201658 202529 202518 201838 201177 200743 200082 199103 198512 198699 198861 198016 196425 195189
54084A95189m76k42k93R8Q05J096Q35N62N60N80M67M17N59P27P60O62M93L56M72
$$ 195189 194713 194471 194178 194276 195081 196177 197012 197574 198134 198714 199181 199598 200157 200884 201644 202306 202799 203155 203627
54065B03627R19J315J160N32K4p3j06l83n89k78L20N01O1m02k79L47R47J207J171
$$ 203627 204546 205861 207021 207553 207577 207504 207398 207015 206426 206148 206468 206969 207030 206628 206349 206696 207643 208850 210021
54046B10021R37O07M42P67J605K601L320L536L264K701K200K108K529L318M247
$$ 210021 210958 211565 212007 212774 214379 216980 220300 223836 227100 229801 232001 234109 236638 239956 244203
54031B44203N116N711N890N704N352M996M690M527M635M996N289N048M036K586
$$ 244203 249319 255030 260920 266624 271976 276972 281662 286189 290824 295820 301109 306157 310193 312779
54017C12779J503J349J803K009J660J337J548J926J816J315J067J285J606J853
$$ 312779 314282 315631 317434 319443 321103 322440 323988 325914 327730 329045 330112 331397 333003 334856
54003C34856K262K952L859N143P007Q994J0219J0422J0051R080O635K289k994
$$ 334856 337118 340070 343929 349072 356079 365073 375292 385714 395765 404845 411480 413769 410775
53990D10775p740j1250j3483j4377j4069j3305j2768j2193j0821q645o509n103
$$ 410775 403035 391785 378302 363925 349856 336551 323783 311590 300769 292124 285615 280512
53978B80512m434m159l848l055j746p17q67k002k920k838k195j838j932k014j719
$$ 280512 276078 271919 268071 265016 263270 262553 261686 259684 256764 253926 251731 249893 247961 245947 244228
53963B44228j070k71L98O41L98K2n7J52K90J94J71M89Q74Q67O26R05K000L135
$$ 244228 243158 242887 243285 243926 244324 244346 244289 244441 244731 244925 245096 245585 246459 247326 247952 248857 250857 253992
53945B53992L355K743K213K211K315K171K109K539L288L955M461M854M996M818
$$ 253992 257347 260090 262303 264514 266829 269000 271109 273648 276936 280891 285352 290206 295202 300020
53931C00020M578M464M222L625K972K636K431J958J360J142J314J352J080J002
$$ 300020 304598 309062 313284 316909 319881 322517 324948 326906 328266 329408 330722 332074 333154 334156
53917C34156J614K717L670M060M022M005M337M921N390N626N946O658P564Q065
$$ 334156 335770 338487 342157 346217 350239 354244 358581 363502 368892 374518 380464 387122 394686 402751
53903D02751P716O537M950L576K790K311J392k52j916k630k231j505j368k113
$$ 402751 410467 417004 421954 425530 428320 430631 432023 431771 429855 427225 424994 423489 422121 420008
53889D20008l293m054l872l184l071m036n331n920n748n575n780n970n765n320
$$ 420008 416715 412661 408789 405605 402534 398498 393167 387247 381499 375924 370144 364174 358409 353089
53875C53089m906m452l802l124k798k938l192l073k528k087k241k717k710j997
$$ 353089 348183 343731 339929 336805 334007 331069 327877 324804 322276 320189 317948 315231 312521 310524
53861C10524j335j425j931k044j645j345j548k085k691l269l634l592l257k929
$$ 310524 309189 307764 305833 303789 302144 300799 299251 297166 294475 291206 287572 283980 280723 277794
53847B77794k583j986j333j174j537j640q17N84J620J820J574J448J534J589J669
$$ 277794 275211 273225 271892 270718 269181 267541 266724 267308 268928 270748 272322 273770 275304 276893 278562
53832B78562K271L671N388O760P949R783J2372J4610J5434J5067J4317J3114J0542
$$ 278562 280833 284504 289892 296652 304601 314384 326756 341366 356800 371867 386184 399298 409840
53819D09840O192Q16m449q775j1647j2917j3090j2981j2852j2242j0868r146p623
$$ 409840 416032 416848 412399 403624 391977 379060 365970 352989 340137 327895 317027 307881 300258
53806C00258o294m823l156j563k74O69J264J554J730K098K816L644M102M005L795
$$ 300258 293964 289141 285985 284422 284148 284817 286081 287635 289365 291463 294279 297923 302025 306030 309825
53791C09825M036M598M808M465M148M212M130L360K313J757J659J412Q91M51O8
$$ 309825 313861 318459 323267 327732 331880 336092 340222 343582 345895 347652 349311 350723 351614 352065 352133
53776C52133o00j384j739j704j873k355k680k811l239l840l708k647j837k330
$$ 352133 351533 350149 348410 346706 344833 342478 339798 336987 333748 329908 326200 323553 321716 319386
53762C19386l637m533m640m444m257l977l594l242k881k454k182k251k472k574
$$ 319386 315749 311216 306576 302132 297875 293898 290304 287062 284181 281727 279545 277294 274822 272248
53748B72248k543k329j682p12j62m97j121j196q08n73m44J16R50J229P84M00N04
$$ 272248 269705 267376 265694 264982 264820 264323 263202 262006 261198 260625 260181 260297 261247 262476 263260 263660 264164
53731B64164M93j44q30p56j02L19L26M36Q41J025O07p1l74j12L82O60N38K12R8
$$ 264164 264657 264513 263683 262927 262825 263144 263470 263906 264747 265772 266379 266308 265934 265822 266204 266864 267402 267614 267712
53712B67712M07Q57J006Q63Q55J173J488J466J284J281J429J448J264J073J076
$$ 267712 268119 268976 269982 270845 271700 272873 274361 275827 277111 278392 279821 281269 282533 283606 284682
53697B84682J461K384L599M349M129L414L013K835K080O57m58o71o83j276j915
$$ 284682 286143 288527 292126 296475 300604 304018 307031 309866 311946 312603 312145 311474 310791 309515 307600
53682C07600j505k15N47or92j019J15J299J408L77r00j590j643j553j570j508
$$ 307600 306095 305880 306427 306421 305429 304410 304525 305824 307232 307609 306709 305119 303476 301923 300353 298845
53666B98845j283j152j202j026l03O40J201J151N77m47j646k328j961q40K84J015
$$ 298845 297562 296410 295208 294182 293879 294519 295720 296871 297448 297001 295355 293027 291066 290226 290510 291525
53650B91525J335J125L80l46l53K17N14J02n25o53j47N80J009R67Q37J155J774
$$ 291525 292860 293985 294365 294019 293666 293883 294397 294499 293974 293321 293174 293754 294763 295730 296567 297722 299496
53633B99496J796Q06l07m46K22P15P71Q94J111R22N19P82J780K426K177J885K362
$$ 299496 301292 302098 301791 301345 301567 302282 303053 303947 305058 305980 306499 307281 309061 311487 313664 315549 317911
53616C17911L079L173K934L283M233M841M512L599K786K427K495K750L000L313
$$ 317911 320990 324163 327097 330380 334613 339454 343966 347565 350351 352778 355273 358023 361023 364336
53602C64336L831M333M322L688K863K147J411N83o3m41q07j184j176p67o05j016
$$ 364336 368167 372500 376822 380510 383373 385520 386931 387514 387451 387010 386203 385019 383843 383076 382471 381455
53586C81455j416j268r63j098j465j543j482j760k246k402k266k351k776l161
$$ 381455 380039 378771 377808 376710 375245 373702 372220 370460 368214 365812 363546 361195 358419 355258
53572C55258l277l107k455j272j87O4k73k51L90R32R12P52Q63R58P28N65R54J524
$$ 355258 351981 348874 346419 345147 344960 345024 344751 344500 344890 345822 346734 347486 348349 349307 350035 350600 351554 353078
53554C53078J444N62l46n01P5P81J106J000P81Q63J532K685L800M260L901L243
$$ 353078 354522 355084 354738 354237 354312 355093 356199 357199 357980 358843 360375 363060 366860 371120 375021 378264
53538C78264L011L452M203M794N077N192N379N917P037Q743J0739J2542J3603
$$ 378264 381275 384727 388930 393724 398801 403993 409372 415289 422326 431069 441808 454350 467953
53525D67953J3595J2807J2103J2010J1993J1159R625Q506Q528R316J0291J1427
$$ 467953 481548 494355 506458 518468 530461 541620 551245 559751 568279 577595 587886 599313
53513E99313J2706J3662J4118J4868J6740J9337K1421K2417K2765K2996K3186
$$ 599313 612019 625681 639799 654667 671407 690744 712165 734582 757347 780343 803529
53502H03529K3323K3522K3644K3208K1935K0173J8606J7728J7567J7775J7995
$$ 803529 826852 850374 874018 897226 919161 939334 957940 975668 993235 1011010 1029005
53491A029005J8201J8578J8949J8733J7765J6800J6717J7381J7800J7295J6111
$$ 1029005 1047206 1065784 1084733 1103466 1121231 1138031 1154748 1172129 1189929 1207224 1223335
53480A223335J4874J3907J3158J2471J1810J1293J0943J0369Q932O504L764J471
$$ 1223335 1238209 1252116 1265274 1277745 1289555 1300848 1311791 1322160 1331092 1337596 1341360 1342831
53468A342831l47k186m303o568q880j1225j3375j4965j5927j6572j7261j8131
$$ 1342831 1342484 1340298 1335995 1329427 1320547 1309322 1295947 1280982 1265055 1248483 1231222 1213091
53456A213091j9059j9810k0346k1002k2051k2999k2901k1669k0454k0208k0454
$$ 1213091 1194032 1174222 1153876 1132874 1110823 1087824 1064923 1043254 1022800 1002592 982138
53445I82138k0136j9178j8330j7800j7054j5916j4910j4275j3447j1845r669p578
$$ 982138 962002 942824 924494 906694 889640 873724 858814 844539 831092 819247 809578 802000
53433H02000n955m676l400j919m57M92Q82J405K686M444O036P522R485J1873J3936
$$ 802000 796045 791369 787969 786050 785593 786085 786967 788372 791058 795502 801538 809060 818545 830418 844354
53418H44354J5387J6767J8418J9884K0761K1542K3016K5230K7450K8998K9839
$$ 844354 859741 876508 894926 914810 935571 957113 980129 1005359 1032809 1061807 1091646
53407A091646L0524L1673L3415L5299L6887L8309L9914M1618M3140M4676M6601
$$ 1091646 1122170 1153843 1187258 1222557 1259444 1297753 1337667 1379285 1422425 1467101 1513702
53396A513702M8535M9581M9635M9723N0658N2107N3309N4014N4267N3922N2945
$$ 1513702 1562237 1611818 1661453 1711176 1761834 1813941 1867250 1921264 1975531 2029453 2082398
53385B082398N1693N0301M8269M5275M1966L9254L7092L4605L1278K7388K3373
$$ 2082398 2134091 2184392 2232661 2277936 2319902 2359156 2396248 2430853 2462131 2489519 2512892
53374B512892J9420J5612J1943Q152L983l97m697r156j4374k0408k6563l2222
$$ 2512892 2532312 2547924 2559867 2568019 2572002 2571605 2566908 2557752 2543378 2522970 2496407 2464185
53362B464185l7471m2648m7697n2156n5620n7868n8869n8866n8347n7654n6738
$$ 2464185 2426714 2384066 2336369 2284213 2228593 2170725 2111856 2052990 1994643 1936989 1880251
53351A880251n5520n4287n3399n2646n1384m9423m7418m6097m5409m4738m3750
$$ 1880251 1824731 1770444 1717045 1664399 1613015 1563592 1516174 1470077 1424668 1379930 1336180
53340A336180m2630m1489m0038l8017l5638l3336l1325k9555k7898k6216k4352
$$ 1336180 1293550 1252061 1212023 1174006 1138368 1105032 1073707 1044152 1016254 990038 965686
53329I65686k2228j9917j7530j5220j3236j1703j0302q555o592n110m364l687
$$ 965686 943458 923541 906011 890791 877555 865852 855550 846995 840403 835293 830929 827242
53317H27242k459j088l89l46j04R28K548M227N553O391P095Q446J0733J3037J4213
$$ 827242 824783 823695 823306 822960 822856 823784 826332 830559 836112 842503 849598 858044 868777 881814 896027
53302H96027J4428J4926J6190J7448J8202J9227K1299K3793K5441K6075K6620
$$ 896027 910455 925381 941571 959019 977221 996448 1017747 1041540 1066981 1093056 1119676
53291A119676K7619K8596K8993K8940K8848K8702K8155K7036K5490K3647K1448
$$ 1119676 1147295 1175891 1204884 1233824 1262672 1291374 1319529 1346565 1372055 1395702 1417150
53280A417150J8831J5938J3055J0303P543M598J549j323l787n799p493r117j0888
$$ 1417150 1435981 1451919 1464974 1475277 1482820 1487418 1488967 1487644 1483857 1478058 1470565 1461448 1450560
53267A450560j2781j4630j6509j8745k1281k3406k4491k4892k5574k6885k8254
$$ 1450560 1437779 1423149 1406640 1387895 1366614 1343208 1318717 1293825 1268251 1241366 1213112
53256A213112k9182k9981l1206l2725l3781l3882l3328l2744l2226l1185k9247
$$ 1213112 1183930 1153949 1122743 1090018 1056237 1022355 989027 956283 924057 892872 863625
53245H63625k7095k5908k5847k5817k4983k3877k3327k3054k2220k0955k0106
$$ 863625 836530 810622 784775 758958 733975 710098 686771 663717 641497 620542 600436
53234F00436j9646j8619j6765j5047j4125j3412j2224j0872r949r301q452p449
$$ 600436 580790 562171 545406 530359 516234 502822 490598 479726 469777 460476 452024 444575
53222D44575o593n900n407n509o235o749o353n473m913m630m148l787m300n423
$$ 444575 437982 432082 426675 421166 414931 408182 401829 396356 391443 386813 382665 378878 374578 369155
53208C69155n962n369m368l729l368l048l027l472l747l137j911j104j229j788
$$ 369155 363193 357824 353456 349727 346359 343311 340284 336812 333065 329928 328017 326913 325684 323896
53194C23896k033j863j735j977k444k834l119l451l790l825l402k784k301j928
$$ 323896 321863 320000 318265 316288 313844 311010 307891 304440 300650 296825 293423 290639 288338 286410
53180B86410j406p08j47Jj56k45nM84Q77R19N79p9r84j805j954j244m02l33q04
$$ 286410 285004 284296 284149 284150 283994 283749 283744 284228 285105 286024 286603 286524 285540 283735 281781 280537 280135 279802 278998
53161B78998n96Q35K477L002K346J424P36R7m67n05o6J0q42k007k341j526l14
$$ 278998 278402 279237 281714 284716 287062 288486 289222 289319 288852 288347 288281 288291 287449 285442 283101 281575 281261
53144B81261M28M43p2r05j801k363k366k094j990j985j578o89L5R8j78k48j72
$$ 281261 281689 282132 282060 281155 279354 276991 274625 272531 270541 268556 266978 266289 266324 266422 266244 265996 265824
53127B65824k48j59N78J469J386K28o97m66J87R1n71n95N10J941K709K555J769
$$ 265824 265576 265417 265995 267464 268850 269078 268381 267915 268102 268193 267622 267027 267537 269478 272187 274742 276511
53110B76511P21j90n86l89J25N27M84q3r04j522j763j860k010k036j685j057m70
$$ 276511 277232 277042 276456 276067 276192 276719 277203 277120 276216 274694 272931 271071 269061 267025 265340 264283 263813
53093B63813j09j7j90m78o60p81j102j577j774j600j540j822j926j447q87q78
$$ 263813 263704 263687 263497 263019 262359 261578 260476 258899 257125 255525 253985 252163 250237 248790 247903 247025
53077B47025j119q48j06L98M78O40J076J327J115P21L96R8p5J59O36P42L29l0
$$ 247025 245906 245058 244952 245350 245828 246468 247544 248871 249986 250707 251103 251201 251126 251285 251921 252663 252992 252962
53059B52962M1J36j43m10k1R49J757J857J343O93L50M08N39L84N2M4M61P51M14
$$ 252962 253003 253139 252996 252586 252565 253514 255271 257128 258471 259164 259514 259922 260461 260845 260897 260941 261402 262153 262567
53040B62567l21r07j264j802k705l508l494k418q20L74O27J93l68r02j570k180
$$ 262567 262246 261339 260075 258273 255568 252060 248566 246148 245328 245702 246329 246522 246154 245252 243682 241502
53024B41502k105j147J0N06K52j24q6M05J049J395J011j25j286j474n02O52Q02
$$ 241502 239397 238250 238260 238766 239018 238894 238808 239213 240262 241657 242668 242543 241257 239783 239281 239933 240735
53007B40735j78j308j651j221o21j24M46J070J291Q40J11l16l77l84m54m57l79
$$ 240735 240557 239249 237598 236377 235756 235632 236078 237148 238439 239279 239390 239074 238697 238313 237859 237402 237023
52990B37023l35k61M2N32R35J108J067P53J53l60k71M43J249J673J641J165K57
$$ 237023 236688 236427 236469 237001 237936 239044 240111 240864 241017 240657 240386 240829 242078 243751 245392 246557 246814
52973B46814p82j358j153m37L05P50P36L65K10Q58K016K544J786M42k91q9M50
$$ 246814 246032 244674 243521 243084 243389 244139 244875 245240 245450 246308 248324 250868 252654 253096 252805 252716 253166
52956B53166P64Q10P36O10M66J95n29j760k811k755j569k99Q7l36q15r30q55q27
$$ 253166 253930 254740 255476 256086 256552 256747 256218 254458 251647 248892 247323 247024 247111 246775 245960 245030 244175 243348
52938B43348p79o11m77n96q57r30p94q66j446k180k438k095j525q90K8J086J513
$$ 243348 242569 241958 241481 240885 240028 239098 238304 237438 235992 233812 231374 229279 227754 226864 226892 227978 229491
52921B29491Q69j17l56J28K64m60j180q52L00J091Q85K45L7M30R37J182J232J258
$$ 229491 230360 230243 229887 230015 230279 229819 228639 227787 228087 229178 230063 230308 230345 230775 231712 232894 234126 235384
52903B35384J117M99n30j326j242m06L41M18K05M48J147J468Q46k32q35o67k41
$$ 235384 236501 237000 236470 235144 233902 233496 233837 234255 234460 234908 236055 237523 238369 238137 237302 236635 236394
52886B36394j20l68o93p83n10o1P8m45j336j834j570j016q83j309j733j531n74
$$ 236394 236274 235906 235213 234430 233920 233859 233937 233492 232156 230322 228752 227736 226853 225544 223811 222280 221706
52869B21706P62J922K515K408J709P78J92M16J304K129K348K119J807J271K56
$$ 221706 222468 224390 226905 229313 231022 231800 231992 232408 233712 235841 238189 240308 242115 243386 243642
52854B43642p73r21o8R34J431J589J589J084K0q07p92n31r39j848k414k529k752
$$ 243642 242869 241948 241880 242814 244245 245834 247423 248507 248527 247720 246928 246397 245458 243610 241196 238667 235915
52837B35915k985k480j289n82j034j803j655n03P67J408J334R00P02J178K045
$$ 235915 232930 230450 229161 228579 227545 225742 224087 223584 224351 225759 227093 227993 228695 229873 231918
52822B31918K417J835P86m1n11p22n43m4J13m80j080o04P90J824J842J588J970
$$ 231918 234335 236170 236956 236915 236404 235682 235139 235095 235208 234728 233648 233044 233834 235658 237500 239088 241058
52805B41058K747L046K678K232K073J817R45m70j851k719k987k814k407k055k073
$$ 241058 243805 246851 249529 251761 253834 255651 256596 256126 254275 251556 248569 245755 243348 241293 239220
52790B39220k477k793k449j455m77j29l77p13q37q63r47r23m31O36J868K579K394
$$ 239220 236743 233950 231501 230046 229569 229440 229063 228350 227513 226650 225703 224780 224349 224985 226853 229432 231826
52773B31826J579O97J8n56r72q64j02P91J139Q89N19K74K1j93n3L30J85q68j944
$$ 231826 233405 234102 234120 233564 232592 231728 231626 232417 233556 234445 234964 235238 235259 235066 235013 235343 235528 234660 232716
52754B32716j767l29J032J314R28P05O14J64l82j91P78J491J224N25L68Q90J503
$$ 232716 230949 230620 231652 232966 233894 234599 235213 235377 234995 234804 235582 237073 238297 238822 239190 240080 241583
52737B41583J817J859J624R60j1q61j233j026l59M19P79N35K07M60J230J791J652
$$ 241583 243400 245259 246883 247843 247832 246971 245738 244712 244353 244772 245551 246086 246293 246753 247983 249774 251426
52720B51426R55L8r50j830k266k125j675j276j059r51q09m92m4J86p2n12m80J67
$$ 251426 252381 252419 251469 249639 247373 245248 243573 242297 241238 240287 239478 238986 238942 239128 239056 238544 238064 238231
52702B38231Q51R73N36n6m56m93k13N2m4l60m52l09m21q83j041l92O10J191J307
$$ 238231 239082 240055 240591 240535 240079 239586 239373 239425 239381 239021 238569 238260 237839 236956 235915 235523 236133 237324 238631
52683B38631J459J776J909J707J367R68M57Q3K52Q19J055N56k25o09m24Q7P06
$$ 238631 240090 241866 243775 245482 246849 247817 248274 248357 248609 249428 250483 251039 250814 250205 249781 249868 250574
52666B50574J207J252P17j9m75o18o94o42j53O92J311J285Q88O86Q56J112J187
$$ 250574 251781 253033 253750 253731 253256 252638 251944 251302 251149 251841 253152 254437 255325 256011 256867 257979 259166
52649B59166J191J478K184K898K829J563l14j639j864j519j328j283r80m94k85
$$ 259166 260357 261835 264019 266917 269746 271309 270995 269356 267492 265973 264645 263362 262382 261888 261603
52634B61603l79l39r3j10n82r88p42J89J544L081M386M906M545L716K558P35j515
$$ 261603 261224 260885 260792 260682 260100 259112 258370 258559 260103 263184 267570 272476 277021 280737 283295 284030 282515
52617B82515k941k725j805j719k529k942k338j483j128j055q70p67r63j094q14
$$ 282515 279574 276849 275044 273325 270796 267854 265516 264033 262905 261850 260980 260213 259250 258156 257342
52602B57342m15l41m71m09j04K79P23J143J107L62n56p75j41N80O09K8l95p3Q17
$$ 257342 256927 256586 256115 255706 255602 255881 256604 257747 258854 259216 258660 257885 257744 258324 258933 258961 258566 258493 259310
52583B59310J549J632J276J052J252J789K456K971K898J954M59q76j585j651j213
$$ 259310 260859 262491 263767 264819 266071 267860 270316 273287 276185 278139 278598 277722 276137 274486 273273
52568B73273n26o7j14l35k82k37p97j700j963j354q06r95j384j250q23p06p52
$$ 273273 272747 272680 272566 272231 271949 271712 270915 269215 267252 265898 265092 264097 262713 261463 260640 259934 259182
52551B59182l99K97P39O93M35J58j48l51k33J57N66Q08P30K05m95p23k76J73j9
$$ 259182 258783 259080 259819 260512 260947 261105 260957 260606 260373 260530 261096 261904 262634 262839 262344 261621 261345 261518 261499
52532B61499n39o27j75L69Q26J313J625J337N40j91m88k93M40J512K103J546M97
$$ 261499 260960 260333 260158 260527 261353 262666 264291 265628 266168 265977 265489 265196 265636 267148 269251 270797 271294
52515B71294M14J660K986L223K665K256K225K170J968J825J666J228O10J64k09
$$ 271294 271708 273368 276354 279577 282242 284498 286723 288893 290861 292686 294352 295580 296190 296354 296145
52500B96145j033k297l084k550j136k84q76k225k863k189j033n89j085j659j420
$$ 296145 295112 292815 289731 287181 286045 285761 284885 282660 279797 277608 276575 275986 274901 273242 271822
52485B71822l61O81R15L95q8Q5O68J008J035J305K009K482K064J003J40j11N9
$$ 271822 271461 272142 273057 273452 273364 273449 274117 275125 276160 277465 279474 281956 284020 285023 285163 285052 285111
52468B85111M59J158K151L169L881M119L867L220K378J528P76K41k3k58q55j781
$$ 285111 285570 286728 288879 292048 295929 300048 303915 307135 309513 311041 311817 312058 312035 311777 310922 309141
52452C09141k491k639k556k680k841k578j921j339j079r98j000j134j281j136
$$ 309141 306650 304011 301455 298775 295934 293356 291435 290096 289017 288019 287019 285885 284604 283468
52438B83468o12oK77k2q58j783k158j706p34K72J008J152M06q44j489r54l9J91
$$ 283468 282856 282850 283127 283105 282247 280464 278306 276600 275866 276138 277146 278298 278704 277860 276371 275417 275378 275569
52420B75569m4K72J240J836J475P27K71P2q3pM55J089J789K799M048M890N002
$$ 275569 275525 275797 277037 278873 280348 281075 281346 281418 281335 281328 281783 282872 284661 287460 291508 296398 301400
52403C01400N088O066P920R803J1048J1450J0853R031O146K794m63l406n930p736
$$ 301400 306488 312554 320474 330277 341325 352775 363628 372659 378805 381599 381136 377730 371800 364064
52389C64064q465q122p257o571o220n695m475k769j312n41k70j34K3K57O69J234
$$ 364064 355599 347477 340220 333649 327429 321734 317259 314490 313178 312637 312367 312233 312256 312513 313182 314416
52373C14416J770K157K388K378K003J453J209J430J642J226J56r47j392j071n28
$$ 314416 316186 318343 320731 323109 325112 326565 327774 329204 330846 332072 332228 331281 329889 328818 328290
52358C28290m52j009j744k157k208k071j661q47M0L94J53l8L71J130J529J213
$$ 328290 327838 326829 325085 322928 320720 318649 316988 316141 316181 316575 316728 316690 317061 318191 319720 320933
52342C20933N06om8J79L89O65J278K054K305J742J026R97J686K585L579M930O442
$$ 320933 321439 321433 321385 321564 321953 322618 323896 325950 328255 329997 331023 332020 333706 336291 339870 344800 351242
52325C51242P440P636P430P243P055O759O356N715M646L388K514K181J999J726
$$ 351242 358682 366318 373748 380991 388046 394805 401161 406876 411522 414910 417424 419605 421604 423330
52311D23330J574J657J738J783K169L018L841M230M475N104O163P241P900P800
$$ 423330 424904 426561 428299 430082 432251 435269 439110 443340 447815 452919 459082 466323 474223 482023
52297D82023O914N866N485N680N314L709J729O54L77l35j870l034k605j001K33
$$ 482023 488937 494803 500288 505968 511282 514991 516720 517374 517751 517416 515546 512512 509907 508906 509139
52282E09139L22nK57R81J258Q20M10N55P35L57n2N03J929L077L321L141L044K903
$$ 509139 509461 509456 509713 510694 511952 512772 513182 513737 514472 514829 514777 515280 517209 520286 523607 526748 529792 532695
52264E32695K673K840L569M187M095L668L616L973M335M579M750M734M681N238
$$ 532695 535368 538208 541777 545964 550059 553727 557343 561316 565651 570230 574980 579714 584395 589633
52250E89633O611P768P490N974M542L835L242K198J131P42J047J584K135K761
$$ 589633 596244 604012 611502 617476 622018 625853 629095 631293 632424 633166 634213 635797 637932 640693
52236F40693L339L528L171K491J840J387J060Q18Q29J327K249L180L723L817L683
$$ 640693 644032 647560 650731 653222 655062 656449 657509 658327 659156 660483 662732 665912 669635 673452 677135
52221F77135L546L480L311K717J626N14j6O9L54P78J702L001L750L396K651K645
$$ 677135 680681 684161 687472 690189 691815 692329 692313 692382 692736 693514 695216 698217 701967 705363 708014 710659
52205G10659L432M104M166M076M276M450M027L059K184J944K362L078L689M014
$$ 710659 714091 718195 722361 726437 730713 735163 739190 742249 744433 746377 748739 751817 755506 759520
52191G59520M189M531N199N944O241N779M783L753K852J792M29q26j518j827k398
$$ 759520 763709 768240 773439 779383 785624 791403 796186 799939 802791 804583 805012 804186 802668 800841 798443
52176G98443l530m919o106o738o529n523m412l956l965l464k045m85L39N68R92
$$ 798443 794913 789994 783888 777150 770621 765098 760686 756730 752765 749301 747256 746771 747110 747678 748670
52161G48670J874K674K755K130J519J695K553K963J961k4j649k164j798q32O33
$$ 748670 750544 753218 755973 758103 759622 761317 763870 766833 768794 768770 767121 764957 763159 762327 762960
52146G62960J978K328J939K083L096L679K930J790J412J264K19j336k086j912
$$ 762960 764938 767266 769205 771288 774384 778063 780993 782783 784195 785459 785678 784342 782256 780344
52132G80344j812j971j561m57M54R09J782L484N159O084O795Q029R488J0427J0845
$$ 780344 778532 776561 775000 774543 774997 775906 777688 781172 786331 792415 799210 807239 816727 827154 837999
52117H37999J1212J1412J0764R039O844M978L686K594J243l20j510j850j509r19
$$ 837999 849211 860623 871387 880426 887270 892248 895934 898528 899771 899451 897941 896091 894582 893663
52103H93663p8J355L332N321O921Q150R136R966J0822J1738J2185J1365R150O235
$$ 893663 893585 894940 898272 903593 910514 918664 927800 937766 948588 960326 972511 983876 993026 999261
52089I99261L299M85k177m401n993p174q154q697q369p103n327l643k448j740
$$ 999261 1002560 1003045 1000868 996467 990474 983300 975146 966449 958080 950977 945650 942007 939559 937819
52075I37819j244q78r55j690k616k924k370j495q68m39J65R77J554J403N72k24
$$ 937819 936575 935697 934742 933052 930436 927512 925142 923647 922779 922340 922505 923482 925036 926439 927011 926787
52059I26787k45M45J100J306J456J928K391K464K496K970L421K899J383j33j011
$$ 926787 926542 926987 928087 929393 930849 932777 935168 937632 940128 943098 946519 949418 950801 950668 949657
52044I49657j610k417l327m020m424m445l815k518j064l2M24N05M95O02P74P63
$$ 949657 948047 945630 942303 938283 933859 929414 925599 923081 922017 921985 922409 922914 923409 924011 924785 925548
52028I25548N66N95J041J398J175P70Q94J524K195L012M319N574N783N107M786
$$ 925548 926114 926709 927750 929148 930323 931093 931987 933511 935706 938718 943037 948611 954394 959501 964287
52013I64287N269N725N782O359Q047R831J0401R795Q738P155M398M50m089q803
$$ 964287 969556 975281 981063 987422 995469 1005300 1015701 1025496 1034234 1041389 1045787 1046237 1042148 1033345
51999A033345j3368j7079j9369k0558k1280k1430k0462j8543j6572j5154j4262
$$ 1033345 1019977 1002898 983529 962971 941691 920261 899799 881256 864684 849530 835268
51988H35268j3812j3850j4115j4122j3751j3233j2586j1623j0603j0221j0766
$$ 835268 821456 807606 793491 779369 765618 752385 739799 728176 717573 707352 696586
51977F96586j1718j2412j2720j2896j3046j2986j2460j1313r527p176m427j572
$$ 696586 684868 672456 659736 646840 633794 620808 608348 597035 587508 580332 575905 574333
51965E74333R89L105N138P614J0407J2601J3394J2869J1699J0292Q508O002K643
$$ 574333 575322 578427 583565 591179 601586 614187 627581 640450 652149 662441 670949 676951 679594
51952F79594j259m976p793r564j0593j0966j0357q673o318l658o43K657N689Q026
$$ 679594 678335 673359 665566 656002 645409 634443 624086 615413 609095 605437 604794 607451 613140 621166
51938F21166R900J1651J3037J3601J3395J2754J1647R846P506N016K391n31l460
$$ 621166 631066 642717 655754 669355 682750 695504 707151 716997 724503 729519 731910 731379 727919
51925G27919n802p479r036j0881j2853j4621j6072j7182j7834j7820j6908j5014
$$ 727919 722117 714638 705602 694721 681868 667247 651175 633993 616159 598339 581431 566417
51913E66417j2551j0416r206q499p313n183k536r7J792L366N278Q043J1335J4035
$$ 566417 553866 543450 534244 525745 518432 513249 510713 510616 512408 515774 521052 529095 540430 554465
51899E54465J5448J6093J6712J6755J4806J0502N117m4m914r732j3701j5593j5454
$$ 554465 569913 586006 602718 619473 634279 644781 649898 649854 644940 635208 621507 605914 590460
51886E90460j4703j4381j4015j2609j0158p500m984k061J634N535Q965J2192J5918
$$ 590460 575757 561376 547361 534752 524594 517094 512110 510049 511683 517218 526183 538375 554293
51873E54293K0023K3595K6216K8358L0182L0788K9194K5601K1045J6196J1067
$$ 554293 574316 597911 624127 652485 682667 713455 742649 768250 789295 805491 816558
51862H16558N610l8n820j1652j7080k1415k4189k5225k4495k2379j9752j7332
$$ 816558 822168 822130 816310 804658 787578 766163 741974 716749 692254 669875 650123 632791
51850F32791j4993j2242r254o886n751n770o550p639q433q571q452q754r282r024
$$ 632791 617798 605556 596302 589416 583665 577895 571345 563706 555273 546702 538250 529496 520214 511190
51836E11190p595n927n047m688l749j802N27K482L906M936N513N410M559L127
$$ 511190 503595 497668 492621 487933 484184 482382 482909 485391 489297 494233 499746 505156 509715 512842
51822E12842J354n41k326l686m267l841k542q35Q15K298L781N261O346O604O059
$$ 512842 514196 513655 511329 507643 503376 499535 496993 496158 496973 499271 503052 508313 514659 521263 527322
51807E27322N026L561J409j349l909n411n804n714n621n589n635n781n695m870
$$ 527322 532348 535909 537318 535969 532060 526649 520845 515131 509510 503921 498286 492505 486810 481940
51793D81940l341j820r25o84q95j370j717j405m57M09O04K55k73q48j337j521
$$ 481940 478599 476779 475854 475170 474275 472905 471188 469783 469326 469735 470339 470594 470321 469473 468136 466615
51777D66615j634k318l490l979k908r09Q36K143L590N303P016Q970J1530J4039
$$ 466615 464981 462663 459173 455194 452286 451377 452213 454356 457946 463249 470265 479235 490765 504804
51763E04804J5103J4195J2117R759P270M482J352k128n721q607j0017j0317j0576
$$ 504804 519907 534102 546219 555978 563248 567730 569082 566954 561233 552626 542609 532292 521716
51750E21716j1009j0781r557q206p519p202o583n579m303k542k44K007L648M818
$$ 521716 510707 499926 490369 482163 474644 467442 460859 455280 450977 448435 448191 450198 453846 458664
51736D58664N907O990Q186R886J1953J3293J3011J1591J0131Q789O902M411K192
$$ 458664 464571 471561 479747 489633 501586 514879 527890 539481 549612 558401 565303 569714 571906
51723E71906R34M88N74J310K689M029M391L323J034j957m973p244q190p758o413
$$ 571906 572840 573328 573902 575212 577901 581930 586321 589644 590678 588721 583748 576504 568314 560556 554143
51708E54143m699k897j167J46O40M95O64K016M351O631Q147Q899Q834P416M478
$$ 554143 549444 546547 545380 545526 546166 546661 547325 549341 553692 560323 568470 577369 586203 593619 598097
51693E98097J082j082j192J35J666K732L561M552N180L931j81o007j0835j2906
$$ 598097 599179 598097 596905 597040 598706 601438 604999 609551 614731 618662 618481 612474 601639 588733
51679E88733j2794j1993j0832q646n511k617q14K63J225J769J153n36k132k420
$$ 588733 575939 563946 553114 544468 538957 536340 535526 535789 537014 538783 539936 539400 537268 534848
51665E34848j036J519M415O935Q693R711J0232J0371R833Q063M726P7n005r335
$$ 534848 533812 535331 539746 546681 555374 565085 575317 585688 595521 603584 608310 608387 603382 594047
51651E94047j1821j1883r748o405l023k88J770L338M264L989K022j507n761r747
$$ 594047 582226 570343 560595 554190 551167 550879 552649 555987 560251 564240 566262 564755 558994 549247
51637E49247j2906j5081j6044j5540j3835j1813j0163q810p442o210n392m716
$$ 549247 536341 521260 505216 489676 475841 464028 453865 445055 437613 431403 426011 421295
51625D21295l694k460j596j173p00lN51Q27J137J464J258L72n42j008j443k240
$$ 421295 417601 415141 413545 412372 411672 411669 412220 413047 414184 415648 416906 417278 416736 415728 414285 412045
51609D12045k814k308r62N0M2n68r50p02L9Q05J136J039J105J905L363M945O365
$$ 412045 409231 406923 405961 406011 406053 405485 404535 403833 403872 404677 405813 406852 407957 409862 413225 418170 424535
51592D24535P763R345J1108J2795J3862J3727J2281R955P126L806K69k514l671
$$ 424535 432298 441643 452751 465546 479408 493135 505416 515371 522497 526303 526572 524058 520387
51579E20387l384k402q25J987O201J0985J5251J8574K1292K4097K7514L1281L4252
$$ 520387 517003 514601 513776 515763 521964 532949 548200 566774 588066 612163 639677 670958 705210
51566G05210L5449L5261L5149L5990L7260L7907L7530L6493L5519L5521L7315
$$ 705210 740659 775920 811069 847059 884319 922226 959756 996249 1031768 1067289 1104604
51555A104604M0844M4740M7107M6708M3231L6649K6815J3808j518j7456l2026
$$ 1104604 1145448 1190188 1237295 1284003 1327234 1363883 1390698 1404506 1402988 1385532 1353506
51544A353506m3803n2460n8521o2586o4808o5038o3295n9937n5486n0359m4803
$$ 1353506 1309703 1257243 1198722 1136136 1071328 1006290 942995 883058 827572 777213 732410
51533G32410l9047l3461k8445k4109k0247j6744j3831j1695j0082q591p225o239
$$ 732410 693363 659902 631457 607348 587101 570357 556526 544831 534749 526158 518933 512694
51521E12694n561m846m138l911m234m352l534k017p43l03n09q77j150j315j452
$$ 512694 507133 502287 498149 494238 490004 485652 482118 480101 479358 479055 478546 477669 476519 475204 473752
51506D73752j655k013k501k993l385l629l673l462l017k468j927j377p26PN69
$$ 473752 472097 470084 467583 464590 461205 457576 453903 450441 447424 444956 443029 441652 440926 440933 441502
51491D41502O65L31N6M00J441K633L203K694J240o07k279l496m213m360l873k988
$$ 441502 442167 442498 442554 442954 444395 447028 450231 452925 454165 453558 451279 447783 443570 439210 435337 432349
51475D32349k270k116k293k245j720r39k13L30O67Q39J014J406J987K478K629
$$ 432349 430079 427963 425670 423425 421705 420766 420553 420883 421550 422389 423403 424809 426796 429274 431903
51460D31903K448K069J661J383J285J143O56k15j184j973k454k523k052j087J76
$$ 431903 434351 436420 438081 439464 440749 441892 442548 442333 441149 439176 436722 434199 432147 431060 431236
51445D31236J653L410N444P725J0418J3691J7109J9682K0815K0789J9942J7866
$$ 431236 432889 436299 441743 449468 459886 473577 490686 510368 531183 551972 571914 589780
51433E89780J4064R239N162L085K767L118L264K651P10k883p622j2250j5594j7185
$$ 589780 603844 613083 618245 621330 624097 627215 630479 633130 633840 630957 623335 611085 595491 578306
51419E78306j7196j6104j4448j2690j1044r498p980o427m683k620m57J182J843
$$ 578306 561110 545006 530558 517868 506824 497326 489346 482919 478236 475616 475159 476341 478184
51406D78184J811J813K082K061J190j68r79p05J51P33P80O93Q81J448K412L854
$$ 478184 479995 481808 483890 485951 487141 486973 485994 485289 485440 486173 486953 487646 488527 489975 492387 496241
51390D96241N618P233Q365R294J0650J2764J5520J8816K2832K7698L3182L9020
$$ 496241 501859 509092 517457 526751 537401 550165 565685 584501 607333 635031 668213 707233
51378G07233M5369N2507O0072O6900P1903P4872P6158P5607P2222O5000N3945
$$ 707233 752602 805109 865181 932081 1003984 1078856 1155014 1230621 1302843 1367843 1421788
51367A421788M0029K4308P444r799k6121m0144n1309n9864o5965o9324o9942o8707
$$ 1421788 1461817 1486125 1493569 1483770 1457649 1417505 1366196 1306332 1240367 1171043 1101101 1032394
51355A032394o6677o3949n9861n4313m8326m3003l8468l4131k9681k5363k1480
$$ 1032394 965717 901768 841907 787594 739268 696265 657797 623666 593985 568622 547142
51344E47142j8119j5402j3560j2606j2091j1409j0240q685p078n726m756m079
$$ 547142 529023 513621 500061 487455 475364 463955 453715 445030 437952 432226 427470 423391
51332D23391l489k812k030j265o40r2N65J290J614J089m0r38j078p84n94m84j04
$$ 423391 419902 417090 415060 413795 413155 413063 413628 414918 416532 417621 417581 416643 415565 414781 414187 413703 413599
51315D13599M32N99L07J32M98J139J595J837K017K001J643J266J328J630J503
$$ 413599 414031 414630 414937 415069 415567 416706 418301 420138 422155 424156 425799 427065 428393 430023 431526
51300D31526P87R8j37l81j287k704l914m612n091n523n630n208m512l835l141
$$ 431526 432313 432411 432274 431893 430606 427902 423988 419376 414285 408762 403132 397924 393412 389577 386436
51285C86436k341j564q77l7J120K228K847L152L781M936O123O774O834O581O274
$$ 386436 384095 382531 381654 381617 382737 384965 387812 390964 394745 399681 405804 412578 419412 425993 432267
51270D32267O121O282O640O732O085M664K868J230J08m73p35r23j146j501k157
$$ 432267 438388 444670 451310 458042 464127 468791 471659 472889 472997 472524 471789 470866 469720 468219 466062
51255D66062l087l892m155l984l900m196m656m889m630l763k506j503j314j682
$$ 466062 462975 459083 454928 450944 447044 442848 438192 433303 428673 424910 422404 420901 419587 417905
51241D17905j788j322q21p78r66r96j013j316j654j444o10L04P65P39N51N65R30
$$ 417905 416117 414795 413974 413196 412230 411234 410221 408905 407251 405807 405197 405501 406266 407005 407556 408121 409051
51224D09051J445J745J644J269P58J68k71k25K95Q53J199J529J954K191K127K173
$$ 409051 410496 412241 413885 415154 415912 416080 415809 415584 415879 416732 417931 419460 421414 423605 425732 427905
51208D27905K604L062L209L377L967M607M679M318M122M080L652K784J999J489
$$ 427905 430509 433571 436780 440157 444124 448731 453410 457728 461850 465930 469582 472366 474365 475854
51194D75854R34K47l18q27j616k404k394j515p50q42j382j641j584j497j250o25
$$ 475854 476788 477035 476717 475890 474274 471870 469476 467961 467211 466369 464987 463346 461762 460265 459015 458390
51178D58390MK9m80p78l05P34J592J613Q47J07J49P27Q40j2j331k477l359l925
$$ 458390 458394 458423 457943 457165 456860 457594 459186 460799 461646 461753 461902 462629 463469 463457 462126 459649 456290 452365
51160D52365l748k718j590j171j313j385j303j418j665j665j466j375j234o10
$$ 452365 448617 445899 444309 443138 441825 440440 439137 437719 436054 434389 432923 431548 430314 429704
51146D29704K69O14K48j40j12j07n96j284j610j546j318q07K38J549K449K545
$$ 429704 429973 430587 430835 430695 430583 430476 429880 428596 426986 425440 424122 423315 423553 425102 427551 430096
51130D30096J982J087J17p04j167j193p76J9Q79J290J132J068J924L605N049N397
$$ 430096 432078 433165 433282 432578 431411 430218 429442 429461 430340 431630 432762 433830 435754 439359 444408 449805
51114D49805M878M377M368M642M772M530L873K880J816R70L06n04j610k687l299
$$ 449805 454683 459060 463428 468070 472842 477372 481245 484125 485941 486911 487217 486713 485103 482416 479117
51099D79117l372l155k889k704k684k760k592j914r72m13o13j347k080k330j823
$$ 479117 475745 472590 469701 466997 464313 461553 458961 457047 456075 455662 455049 453702 451622 449292 447469
51084D47469o58N16Q99M04j21K03J334K513L203L471L597L622L354K607J452M12
$$ 447469 446811 447327 448226 448630 448509 448712 450046 452559 455762 459233 462830 466452 469806 472413 473865 474277
51068D74277J47P51J460J526J175J248J933K568K848L495N249P622R398J0089
$$ 474277 474424 475175 476635 478161 479336 480584 482517 485085 487933 491428 496677 504299 513697 523786
51054E23786J0233J0258R759Q229O005M196L744M817O848Q993J0687J1908J2832
$$ 523786 534019 544277 554036 562265 568270 572466 576210 581027 587875 596868 607555 619463 632295
51041F32295J3331J3072J2145J1120J0280R209P519N502L685K067L24j514l307
$$ 632295 645626 658698 670843 681963 692243 701452 708971 714473 718158 720225 720549 719035 715728
51028G15728n447q514j2283j5771j8278j9670j9690j8005j5170j2564j0772q899
$$ 715728 710281 701767 689484 673713 655435 635765 616075 598070 582900 570336 559564 550665
51016E50665o148l201j212j39Q78K022K869L605M822O137O295N012L675L715N046
$$ 550665 544517 541316 540104 539965 540843 542865 545734 549339 554161 560298 566593 571605 575280 578995 584041
51001E84041O531P286P094O204N184M526M000K935J467P95J731L640N471P199
$$ 584041 590572 597858 604952 611156 616340 620866 624866 627801 629268 630063 631794 635434 640905 648104
50987F48104R419J1913J3644J4174J4217J4590J5260J5739J5925J6053J5998J5092
$$ 648104 657523 669436 683080 697254 711471 726061 741321 757060 772985 789038 805036 820128
50975H20128J2796R339N475J556k759p659j2333j5554j6970j7267j6973j5769
$$ 820128 832924 842263 847738 849294 846535 838876 826543 810989 794019 776752 759779 744010
50963G44010j3214r546n399j272K329M805O061O806P739Q801R708J0720J2129
$$ 744010 730796 721250 715851 714579 716908 721713 727774 734580 742319 751120 760828 771548 783677
50950G83677J3449J3906J3639J3537J4008J4783J5906J8002K1240K4820K7844
$$ 783677 797126 811032 824671 838208 852216 866999 882905 900907 922147 946967 974811
50939I74811L0105L1669L2250L1505K9421K5968K0821J4104P104J530k037m435
$$ 974811 1004916 1036585 1068835 1100340 1129761 1155729 1176550 1190654 1197758 1199288 1197251 1192816
50927A192816o661q810j0550j2078j4064j6680j9232k1013k2179k3447k5040k6403
$$ 1192816 1186155 1177345 1166795 1154717 1140653 1123973 1104741 1083728 1061549 1038102 1013062 986659
50915I86659k6963k6721k5908k4497k2461k0198j8284j6805j5341j3623j1851
$$ 986659 959696 932975 907067 882570 860109 839911 821627 804822 789481 775858 764007
50904G64007j0350r201q344p776p496p354p017o164m754l212k153j818j922k063
$$ 764007 753657 744456 736112 728336 720840 713486 706469 700305 695551 692339 690186 688368 686446 684383
50890F84383k104j995j582q98l37j78j92q5n3l99p90n80J65O64N08J38R9L39N78
$$ 684383 682279 680284 678702 677804 677467 677289 677097 677012 676959 676560 675770 675190 675355 676019 676527 676665 676764 677103 677681
50871F77681P90R95R68O10L53P54J868L228M372N094N363N252N016N043N629O734
$$ 677681 678471 679466 680434 681044 681397 682151 684019 687247 691619 696713 702076 707328 712344 717387 723016 729750
50855G29750P961Q870R526J0542J2285J4182J5348J5881J6970J9417K2584K5145
$$ 729750 737711 746581 756107 766649 778934 793116 808464 824345 841315 860732 883316 908461
50843I08461K6573K7456K8543K9952L1225L1855L1705L1129L0693L0575L0304
$$ 908461 935034 962490 991033 1020985 1052210 1084065 1115770 1146899 1177592 1208167 1238471
50832A238471K9180K6983K4223K1801K0414K0149K0614K1451K2686K4460K6601
$$ 1238471 1267651 1294634 1318857 1340658 1361072 1381221 1401835 1423286 1445972 1470432 1497033
50821A497033K8809L1125L3739L6282L7894L8121L7258L5526L2472K7625K1269
$$ 1497033 1525842 1556967 1590706 1626988 1664882 1703003 1740261 1775787 1808259 1835884 1857153
50810A857153J4032O060k755j1902k0303k7329l3216l8376m2707m5771m7349m7573
$$ 1857153 1871185 1877245 1874490 1862588 1842285 1814956 1781740 1743364 1700657 1654886 1607537 1559964
50798A559964m6682m4783m1861l7997l3589k9143k4696j9821j4420r277n274k267
$$ 1559964 1513282 1468499 1426638 1388641 1355052 1325909 1301213 1281392 1266972 1257695 1252421 1250154
50786A250154P68M446Q299J1394J3150J3490J2747J1654J0865J0206Q747O046
$$ 1250154 1250922 1255368 1263667 1275061 1288211 1301701 1314448 1326102 1336967 1347173 1355920 1361966
50774A361966K965Q34n2o56k053m517p711j1262j4846j8070k0666k2819k4955
$$ 1361966 1364931 1365765 1365713 1365057 1363004 1358487 1350776 1339514 1324668 1306598 1285932 1263113 1238158
50761A238158k7098k8665k9139k8785k8305k7836k6716k4553k2009k0037j8689
$$ 1238158 1211060 1182395 1153256 1124471 1096166 1068330 1041614 1017061 995052 975015 956326
50750I56326j7281j5612j4168j3024j1441q997o382m387k663l09K628N137O711
$$ 956326 939045 923433 909265 896241 884800 875803 869421 865034 862371 862062 864690 869827 876538
50737H76538P878R169J0366J1238J2280J4113J6507J8596J9903K0703K1460K2351
$$ 876538 884416 893585 903951 915189 927469 941582 958089 976685 996588 1017291 1038751 1061102
50725A061102K3293K4084K4434K4189K3568K2926K2226K0949J8663J5589J2427
$$ 1061102 1084395 1108479 1132913 1157102 1180670 1203596 1225822 1246771 1265434 1281023 1293450
50714A293450R641O972L858L35k668m183m217l505k342k74K882O397R527J2528
$$ 1293450 1303091 1310063 1313921 1314256 1311588 1307405 1303188 1299683 1297341 1297067 1299949 1306346 1315873 1328401
50700A328401J6011J9598K2042K2730K2219K1219J9630J6990J3288Q973M615Q17
$$ 1328401 1344412 1364010 1386052 1408782 1431001 1452220 1471850 1488840 1502128 1511101 1515716 1516533
50688A516533j915l586m725n657o069n579m381l023j811p61J69J130K441M228
$$ 1516533 1514618 1511032 1506307 1500650 1494581 1489002 1484621 1481598 1479787 1479026 1479195 1480325 1482766 1486994
50674A486994O311Q765J2156J6797K2026K6864L1106L5122L8733M1089M1754M1236
$$ 1486994 1493305 1502070 1514226 1531023 1553049 1579913 1611019 1646141 1684874 1725963 1767717 1808953
50662A808953M0202L8738L6684L4260L1970L0158K8822K7686K6319K4454K2319
$$ 1808953 1849155 1887893 1924577 1958837 1990807 2020965 2049787 2077473 2103792 2128246 2150565
50651B150565K0408J8802J7083J5043J3133J2016J1954J2901J4845J7817K1753
$$ 2150565 2170973 2189775 2206858 2221901 2235034 2247050 2259004 2271905 2286750 2304567 2326320
50640B326320K6598L2234L8088M3097M6494M8438M9528M9835M8867M6437M3076
$$ 2326320 2352918 2385152 2423240 2466337 2512831 2561269 2610797 2660632 2709499 2755936 2799012
50629B799012L9478L5943L2530K9365K6412K3088J8563J2476N122l290j3326k5874
$$ 2799012 2838490 2874433 2906963 2936328 2962740 2985828 3004391 3016867 3021989 3018699 3005373 2979499
50617B979499m0724n5726o7522p3387p2525o5931n5409m2811k9911j8401r534
$$ 2979499 2938775 2883049 2815527 2742140 2669615 2603684 2548275 2505464 2475553 2457152 2447618
50606B447618l736p00oj622n718j2093j9962k8402l6828m5018n2792n9784o5454
$$ 2447618 2443882 2443182 2443176 2441554 2435836 2423743 2403781 2375379 2338551 2293533 2240741 2180957 2115503
50593B115503o9261p1006p1006o9806o7708o4741o1149n7476n3960n0209m5774
$$ 2115503 2046242 1975236 1904230 1834424 1766716 1701975 1640826 1583350 1529390 1479181 1433407
50582A433407m0801l5731l0655k5441k0293j5575j1122o357j201L654P567J0531
$$ 1433407 1392606 1356875 1326220 1300779 1280486 1264911 1253789 1247432 1246231 1249885 1257452 1267983
50570A267983J2853J4657J5945J6639J6353J4552J1371P873N095L140J653P95
$$ 1267983 1280836 1295493 1311438 1328077 1344430 1358982 1370353 1378226 1383321 1386461 1388114 1388909
50558A388909J217L174O269J0161J4927K0575K6586L2249L7248M1667M5504M8468
$$ 1388909 1390126 1393300 1399569 1409730 1424657 1445232 1471818 1504067 1541315 1582982 1628486 1676954
50546A676954N0183N0466M9334M6993M3989M1297M0003M0702M3185M6732N0624
$$ 1676954 1727137 1777603 1826937 1873930 1917919 1959216 1999219 2039921 2083106 2129838 2180462
50535B180462N4465N8308O2659O8149P4924Q2404Q9832R6919J03875J10985J18503
$$ 2180462 2234927 2293235 2355894 2424043 2498967 2581371 2671203 2768122 2871997 2982982 3101485
50524C101485J26651J35260J43451J50131J54761J57278J57363J54407J48160
$$ 3101485 3228136 3363396 3506847 3656978 3811739 3969017 4126380 4280787 4428947
50515D428947J38747J25875J08746Q7242O2601L6460R564j7971m5549p1862r5611
$$ 4428947 4567694 4693569 4802315 4889557 4952158 4988618 4998182 4980211 4934662 4862800 4767189
50504D767189j15886j31888j42839j48320j48302j42877j32258j17130r8630p7869
$$ 4767189 4651303 4519415 4376576 4228256 4079954 3937077 3804819 3687689 3589059 3511190
50494C511190n5742l3245j1654P695K3650L5095M0888M0277L3369K1000M149j6260
$$ 3511190 3455448 3422203 3410549 3418244 3441894 3476989 3517877 3558154 3591523 3612523 3616672 3600412
50482C600412l8893o1602q2019r8673j11354j20331j25656j27488j26650j24193
$$ 3600412 3561519 3499917 3417898 3319225 3207871 3087540 2961884 2834396 2707746 2583553
50472B583553j20533j15557j09518j03228r7322r1799q6394q0908p5111o8971
$$ 2583553 2463020 2347463 2237945 2134717 2037395 1945596 1859202 1778294 1703183 1634212
50462A634212o3080n8195n4171m9930m4929l9864l5507l1515k7119k2478j8544
$$ 1634212 1571132 1512937 1458766 1408836 1363907 1324043 1288536 1257021 1229902 1207424 1188880
50451A188880j5761j3655j1618r527p668o386n712n066l622j331Q04J960K572
$$ 1188880 1173119 1159464 1147846 1138319 1130651 1124265 1118553 1113487 1109865 1108534 1109338 1111298 1113870
50438A113870L624N245O765P850Q733R566J0291J1095J2200J3306J4026J4785
$$ 1113870 1117494 1122739 1129504 1137354 1146087 1155653 1165944 1177039 1189239 1202545 1216571 1231356
50426A231356J6407J8830K1142K3044K5260K8206L1286L3969L6689M0022M3791
$$ 1231356 1247763 1266593 1287735 1310779 1336039 1364245 1395531 1429500 1466189 1506211 1550002
50415A550002M7649N1919N6934O2077O6364O9834P3521P7955Q2441Q6000Q8406
$$ 1550002 1597651 1649570 1706504 1768581 1834945 1904779 1978300 2056255 2138696 2224696 2313102
50404B313102R0038R1008R0868Q9127Q5798Q1143P4988O6592N5457M1966K6797
$$ 2313102 2403140 2494148 2585016 2674143 2759941 2841084 2916072 2982664 3038121 3080087 3106884
50393C106884R973q780k8667m7645o3971p7315q7932r5427r9082r8928r5722q9886
$$ 3106884 3116857 3108077 3079410 3031765 2967794 2890479 2802547 2707120 2608038 2509110 2413388 2323502
50381B323502q1322p0296n7857m5117l2608k0605r695o47O086J0453J2435J1809
$$ 2323502 2242180 2171884 2114027 2068910 2036302 2015697 2006002 2005355 2011441 2021894 2034329 2046138
50369B046138Q311K043o370j5958k5743l4948m3007m9671n5060n9300o1969o2310
$$ 2046138 2054449 2056492 2050122 2034164 2008421 1973473 1930466 1880795 1825735 1766435 1704466 1642156
50357A642156o0356n7462n5155n3546n1422m7998m3899m0214l7150l4260l1565
$$ 1642156 1581800 1524338 1469183 1415637 1364215 1316217 1272318 1232104 1194954 1160694 1129129
50346A129129k9615k8431k7173k5250k3127k1561k0408j8917j6956j5197j4050
$$ 1129129 1099514 1071083 1043910 1018660 995533 973972 953564 934647 917691 902494 888444
50335H88444j3138j2067j1087j0534j0163r550q804q283p851p012n742m565l861
$$ 888444 875306 863239 852152 841618 831455 821905 813101 804818 796967 789955 784213 779648 775787
50322G75787l480l052k275j010N50J861K659L404M643O074O909P109P384Q048
$$ 775787 772307 769255 766980 765970 766520 768381 771040 774444 779087 785161 792070 799179 806563 814611
50308H14611Q657R039R757J1098J2463J3290J3975J5152J6736J8289J9824K1420
$$ 814611 823268 832307 842064 853162 865625 878915 892890 908042 924778 943067 962891 984311
50296I84311K2494K2411K1549K0761J9777J7106J1797M590k948r657j4935j8383
$$ 984311 1006805 1029216 1050765 1071526 1091303 1108409 1120206 1124796 1121848 1112191 1097256 1078873
50284A078873k0007k0367k0000j8834j6705j4190j2391j1781j1723j1279j0121
$$ 1078873 1058866 1038499 1018499 999665 982960 968770 956379 944598 932875 921596 911475
50273I11475q503o606m395j993K37K060L551M790N686O286O809P145O621M905
$$ 911475 902972 896366 891971 889978 890215 892275 895826 900616 906302 912588 919397 926542 933163 938068
50259I38068K912K106K849M016M465M301M378N069N933O285N656M023J941K30
$$ 938068 940980 943086 945935 949951 954416 958717 963095 968164 974097 980382 986038 990061 992002 992232
50245I92232p76j515k478l573m487n273o155p008p576p880q004p707o837n868
$$ 992232 991456 989941 987463 983890 979403 974130 967975 960967 953391 945511 937507 929800 922963 917095
50231I17095n378n197m717l976l603l744l809l449k980k577j899q44O8O39J658
$$ 917095 911717 906520 901803 897827 894224 890480 886671 883222 880242 877665 875766 874922 874990 875629 877287
50216H77287L786O346Q078Q892R960J2089J4903J7748K0653K3853K6994K9374
$$ 877287 881073 887419 895497 904389 914349 926438 941341 959089 979742 1003595 1030589 1059963
50204A059963L0697L1052L0372K8492K5756K3075K1189K0138J9572J9180J8575
$$ 1059963 1090660 1121712 1152084 1180576 1206332 1229407 1250596 1270734 1290306 1309486 1328061
50193A328061J7080J4132R833M786p39p151j4812k3137l0560l5552l7707l7898
$$ 1328061 1345141 1359273 1369106 1373892 1373153 1366002 1351190 1328053 1297493 1261941 1224234 1186336
50181A186336l7344l6428l4444l0599k5081j8964j3192q056l677m73J056P86j108
$$ 1186336 1148992 1112564 1078120 1047521 1022440 1003476 990284 982228 978551 978078 979134 979920 978812
50168I78812m371q471j2327j4713j5100j3975j2303j0782r535q281o727m882l050
$$ 978812 974441 965970 953643 938930 923830 909855 897552 886770 877235 868954 862227 857345 854295
50155H54295j465K1J758L802N696O865P233P350P781Q333Q106O513M025J612m11
$$ 854295 852830 852851 854609 858411 864107 870972 878205 885555 893336 901669 909775 916288 920313 921925 921514
50140I21514k551n129p600r131r479q976p943o474m611k484l10J540K695L112
$$ 921514 918963 913834 906234 897103 887624 878648 870705 864231 859620 857136 856826 858366 861061 864173
50126H64173L137L009K541J521K17p90j189j161j112j314j717k013k006j839j642
$$ 864173 867310 870319 872860 874381 874598 873808 872619 871458 870346 869032 867315 865302 863296 861457 859815
50111H59815j037M57K492M034M644M994N726O645P574R180J1971J5046J7053J8162
$$ 859815 858778 859235 861727 865761 870405 875399 881125 887770 895344 904524 916495 931541 948594 966756
50097I66756J9895K2967K6481K9602L2950L7674M3762M9936N4894N8181O0091
$$ 966756 986651 1009618 1036099 1065701 1098651 1136325 1180087 1230023 1284917 1343098 1403189
50086A403189O1073O1154N9940N7375N4401N2287N1162M9841M7299M3728L9687
$$ 1403189 1464262 1525416 1585356 1642731 1697132 1749419 1800581 1850422 1897721 1941449 1981136
50075A981136L4750K7693J7979O455n456j6986k8201l9119m8907n6336o1011o3769
$$ 1981136 2015886 2043579 2061558 2068013 2062557 2045571 2017370 1978251 1929344 1873008 1811997 1748228
50063A748228o5556o6302o5344o2716n9258n5522n1262m6184m0560l4902k9524
$$ 1748228 1682672 1616370 1551026 1488310 1429052 1373530 1322268 1276084 1235524 1200622 1171098
50052A171098k4701k0846j8240j6817j6301j6291j6224j5689j4723j3464j1635
$$ 1171098 1146397 1125551 1107311 1090494 1074193 1057902 1041678 1025989 1011266 997802 986167
50041I86167r071o528n038m398l247r89J348K656L203L891M813N471N844O412
$$ 986167 977096 970568 965530 961132 957885 956896 958244 960900 964103 967994 972807 978278 984122 990534
50027I90534P341Q299Q860Q685P755O772O734P537P745O515N033M932N773N470
$$ 990534 997875 1006174 1015034 1023719 1031474 1038246 1044980 1052517 1060262 1066777 1071810 1076742 1082515 1087985
50013A087985L052l72l477o336r538j2786j5133j6131j6049j5280j4065j2716
$$ 1087985 1091037 1090665 1087188 1080852 1071314 1058528 1043395 1027264 1011215 995935 981870 969154
50001I69154j1622j0898j0168q726o086k514J065L904O105Q186J0099J1018J0219
$$ 969154 957532 946634 936466 927740 921654 919140 920205 924109 930214 938400 948499 959517 969736
49988I69736P940N303L439K544J778K15k068m157n515o430o988o378l825K35M670
$$ 969736 977676 982979 986418 988962 990740 990955 988887 984730 979215 972785 965797 959419 955594 955829 960499
49973I60499Q951J3243J7525K1510K5298K9164L2658L4734L5060L4392L3455L2148
$$ 960499 969450 982693 1000218 1021728 1047026 1076190 1108848 1143582 1178642 1213034 1246489 1278637
49961A278637L0245K8348K7528K8129K9270K9563K8304K5917K3034J9223J3246
$$ 1278637 1308882 1337230 1364758 1392887 1422157 1451720 1480024 1505941 1528975 1548198 1561444
49950A561444M884m238j2341j9300k5816l1445l4921l6276l7083l8202l8660l7347
$$ 1561444 1566328 1562090 1549749 1530449 1504633 1473188 1438267 1401991 1364908 1326706 1288046 1250699
49938A250699l4782l2437l1152l0883l1349l2152l2704l2617l1921l0699k8972
$$ 1250699 1215917 1183480 1152328 1121445 1090096 1057944 1025240 992623 960702 930003 901031
49927I01031k7066k5383k3680k1368j8687j6576j5040j2887r655o616m884l703
$$ 901031 873965 848582 824902 803534 784847 768271 753231 740344 730689 724073 719189 715486
49915G15486j722Q77K888L968M611M797M144L254L440N042P109Q936J0794J3004
$$ 715486 713764 714641 717529 721497 726108 730905 735049 738303 741743 746785 753894 762830 773624 786628
49901G86628J5267J7191J8666J9578J9845J9786J9690J9047J7106J4122J1075
$$ 786628 801895 819086 837752 857330 877175 896961 916651 935698 952804 966926 978001
49890I78001Q100M368l25m988q913j2506j6010j8526j9297j9159j9562k0574k0915
$$ 978001 986101 990469 990144 985156 976243 963737 947727 929201 909904 890745 871183 850609 829694
49877H29694j9785j7857j6349j5861j6069j6117j5165j2999j0247p822o134m926
$$ 829694 809909 792052 775703 759842 743773 727656 712491 699492 689245 681423 675289 670363
49865F70363l789k561j327k14Q54K144L755N370O676Q049J0227J3199J5895J7369
$$ 670363 666574 664013 662686 662472 663326 665470 669225 674595 681271 689320 699547 712746 728641 746010
49851G46010J7827J8041J8123J7494J5868J3681J1467R230O697L930J441l87j948
$$ 746010 763837 781878 800001 817495 833363 847044 858511 867741 874438 878368 879809 879422 877474
49838H77474m193p573j1269j3876j4835j4818j4632j4259j3230j1520r649q159
$$ 877474 873281 865708 854439 840563 825728 810910 796278 782019 768789 757269 747620 739461
49826G39461p231o584n535l523q42J527L125M629O827R441J1587J3061J4415J5881
$$ 739461 732230 725646 720111 716588 715746 717273 720398 725027 731854 741295 752882 765943 780358 796239
$$ [...]
##END NTUPLES=NMR SPECTRUM
##END=
