##TITLE=AC1426_HONAH13238_7764444_YZCY4IfKzg
##JCAMPDX= 6.0         $$ Bruker NMR JCAMP-DX V2.0
##DATA TYPE= NMR SPECTRUM
##DATA CLASS= NTUPLES
##ORIGIN= BRUKER
##OWNER= Administrator
$$ 1.72 TOPSPIN		Version 2.1
$$ 2013-04-11 22:21:37.421 -0700  Administrator@X
$$ Compression mode = diff/dup
##.OBSERVE FREQUENCY= 400.02188249412
##.OBSERVE NUCLEUS= ^1H
##.ACQUISITION MODE= SIMULTANEOUS (DQD)
##.ACQUISITION SCHEME= undefined
##.AVERAGES= 64
##.DIGITISER RES= 22
##SPECTROMETER/DATA SYSTEM= spect
##.PULSE SEQUENCE= noesygpps1d.comp
##.SOLVENT NAME= COFFEE_meoh
##.SHIFT REFERENCE= INTERNAL, COFFEE_meoh, 1, 14.96098
##AUDIT TRAIL= $$ (NUMBER, WHEN, WHO, WHERE, PROCESS, VERSION, WHAT)
$$ ##TITLE= Audit trail, TOPSPIN		Version 2.1
$$ ##JCAMPDX= 5.01
$$ ##ORIGIN= Bruker BioSpin GmbH
$$ ##OWNER= Administrator
$$ $$ E:\/data/COFFEE/nmr/AC1426_HONAH13238_7764444_YZCY4IfKzg/12/pdata/1/auditp.txt
$$ ##AUDIT TRAIL=  $$ (NUMBER, WHEN, WHO, WHERE, PROCESS, VERSION, WHAT)
(   1,<2013-04-11 22:21:31.499 -0700>,<Administrator>,<X>,<go>,<TOPSPIN 2.1>,
      <created by zg
	started at 2013-04-11 22:10:01.270 -0700,
	POWCHK enabled, PULCHK disabled,
       configuration hash MD5:
       33 CF 6A 21 5C D3 B9 40 6C 15 AA 8D 27 A2 4F 13
       data hash MD5: 64K
       CF EC 73 98 59 EB 1C E6 16 27 40 D3 B6 1B 36 D5>)
(   2,<2013-04-11 22:21:34.640 -0700>,<Administrator>,<X>,<proc1d>,<TOPSPIN 2.1>,
      <Start of raw data processing
       efp LB = 0.3 FT_mod = 6 PKNL = 1 PHC0 = 0 PHC1 = 0 SI = 128K 
       data hash MD5: 128K
       9A 04 9E 4F F6 5A ED 30 F0 C0 66 E3 AD 2B 25 44>)
(   3,<2013-04-11 22:21:35.655 -0700>,<Administrator>,<X>,<proc1d>,<TOPSPIN 2.1>,
      <pk PHC0 = -79.22791 PHC1 = 0 
       data hash MD5: 128K
       D3 16 96 70 B2 BF 95 A1 1F EE 30 C1 F1 92 DE F3>)
(   4,<2013-04-11 22:21:36.358 -0700>,<Administrator>,<X>,<proc1d>,<TOPSPIN 2.1>,
      <abs ABSG = 1 
       data hash MD5: 128K
       AB 81 21 A8 1E 60 CF 76 E7 AB 55 77 5F 42 EB D3>)
(   5,<2013-04-11 22:21:36.530 -0700>,<Administrator>,<X>,<proc1d>,<TOPSPIN 2.1>,
      <abs ABSG = 2 
       data hash MD5: 128K
       81 1B 45 C6 A7 58 B2 CB E1 5A 03 E1 FE 8D 67 B6>)
(   6,<2013-04-11 22:21:36.718 -0700>,<Administrator>,<X>,<proc1d>,<TOPSPIN 2.1>,
      <abs ABSG = 3 
       data hash MD5: 128K
       39 EC 01 0E 6C AC 71 84 C1 65 57 EF 54 9D 39 21>)
(   7,<2013-04-11 22:21:36.921 -0700>,<Administrator>,<X>,<proc1d>,<TOPSPIN 2.1>,
      <abs ABSG = 4 
       data hash MD5: 128K
       97 70 72 FF FA 72 3B 89 24 11 29 D4 C8 AA 17 92>)
(   8,<2013-04-11 22:21:37.077 -0700>,<Administrator>,<X>,<proc1d>,<TOPSPIN 2.1>,
      <abs ABSG = 5 
       data hash MD5: 128K
       6E BF 38 96 D1 9D CF 24 48 78 71 7A 7B 40 DB AC>)
$$ ##END=
$$ 
$$ $$ hash MD5
$$ $$ 55 51 B1 01 0B 1D 69 D4 A7 38 11 58 F3 22 11 9D
##$RELAX= 
##$RELAX= 
##$RELAX= 
##$RELAX= 
##$RELAX= 
##$RELAX= 
##$RELAX= 
##$RELAX= 
$$ Bruker specific parameters
$$ --------------------------
##$DU= <E:\>
##$EXPNO= 12
$$ [...]
##$TP07= 0
##$TPNAME0= <>
##$TPNAME1= <>
##$TPNAME2= <>
##$TPNAME3= <>
##$TPNAME4= <>
##$TPNAME5= <>
##$TPNAME6= <>
##$TPNAME7= <>
##$TPOAL= (0..7)
0.5 0.5 0.5 0.5 0.5 0.5 0.5 0.5
##$TPOFFS= (0..7)
0 0 0 0 0 0 0 0
##$TUNHIN= 0
##$TUNHOUT= 0
##$TUNXOUT= 0
##$USERA1= <user>
##$USERA2= <user>
##$USERA3= <user>
##$USERA4= <user>
##$USERA5= <user>
##$V9= 5
##$VALIST= <valist>
##$VCLIST= <CCCCCCCCCCCCCCC>
##$VD= 0
##$VDLIST= <DDDDDDDDDDDDDDD>
##$VPLIST= <PPPPPPPPPPPPPPP>
##$VTLIST= <TTTTTTTTTTTTTTT>
##$WBST= 2048
##$WBSW= 25
##$XGAIN= (0..3)
0 0 0 0
##$XL= 0
##$YL= 0
##$YMAX_a= 5635853
##$YMIN_a= -12403730
##$ZGOPTNS= <>
##$ZL1= 120
##$ZL2= 120
##$ZL3= 120
##$ZL4= 120
##$ABSF1= 14.96098
##$ABSF2= -5.597201
##$ABSG= 5
##$ABSL= 3
##$ALPHA= 0
##$AQORDER= 0
##$ASSFAC= 0
##$ASSFACI= 0
##$ASSFACX= 0
##$ASSWID= 0
##$AUNMP= <proc_prof1d_extract.lims>
##$AXLEFT= 0
##$AXNAME= <>
##$AXNUC= <1H>
##$AXRIGHT= 0
##$AXTYPE= 0
##$AXUNIT= <>
##$AZFE= 0.1
##$AZFW= 0.1
##$BCFW= 0
##$BC_mod= 0
##$BYTORDP= 0
##$COROFFS= 0
##$CY= 15
##$DATMOD= 1
##$DC= 0
##$DFILT= <>
##$DTYPP= 0
##$F1P= 0
##$F2P= 0
##$FCOR= 0.5
##$FTSIZE= 131072
##$FT_mod= 6
##$GAMMA= 0
##$GB= 0
##$INTBC= 1
##$INTSCL= 1
##$ISEN= 128
##$LB= 0.3
##$LEV0= 0
##$LPBIN= 0
##$MAXI= 10000
##$MC2= 0
##$MEAN= 0
##$ME_mod= 0
##$MI= 0
##$NCOEF= 0
##$NC_proc= -2
##$NLEV= 6
##$NOISF1= 0
##$NOISF2= 0
##$NSP= 0
##$NTH_PI= 0
##$NZP= 0
##$OFFSET= 14.96098
##$PC= 1
##$PHC0= -79.22791
##$PHC1= 0
##$PH_mod= 1
##$PKNL= yes
##$PPARMOD= 0
##$PPDIAG= 0
##$PPIPTYP= 0
##$PPMPNUM= 2147483647
##$PPRESOL= 1
##$PSCAL= 4
##$PSIGN= 0
##$PYNMP= <proc.py>
##$REVERSE= no
##$SF= 400.020009645557
##$SI= 131072
##$SIGF1= 0
##$SIGF2= 0
##$SINO= 400
##$SIOLD= 131072
##$SPECTYP= <>
##$SREGLST= <1H.CDCl3>
##$SSB= 0
##$STSI= 131072
##$STSR= 0
##$SW_p= 8223.68421052631
##$SYMM= 0
##$S_DEV= 0
##$TDeff= 65536
##$TDoff= 0
##$TI= <>
##$TILT= no
##$TM1= 0
##$TM2= 0
##$TOPLEV= 0
##$USERP1= <user>
##$USERP2= <user>
##$USERP3= <user>
##$USERP4= <user>
##$USERP5= <user>
##$WDW= 1
##$XDIM= 131072
##$YMAX_p= 393269451
##$YMIN_p= -10815
##$CURPLOT= <Network HP LaserJet P1505>
##$CURPRIN= <$Network HP LaserJet P1505>
##$DFORMAT= <normdp>
##$LAYOUT= <+/1D_H.xwp>
##$LFORMAT= <normlp>
##$PFORMAT= <normpl>
##$SURQMSG= 1
$$ End of Bruker specific parameters
$$ ---------------------------------
##NTUPLES= NMR SPECTRUM
##VAR_NAME=  FREQUENCY,     SPECTRUM/REAL,   SPECTRUM/IMAG
##SYMBOL=    X,             R,               I
##VAR_TYPE=  INDEPENDENT,   DEPENDENT,       DEPENDENT
##VAR_FORM=  AFFN,          ASDF,            ASDF
##VAR_DIM=   131072,        131072,          131072
##UNITS=     HZ,            ARBITRARY UNITS, ARBITRARY UNITS
##FACTOR=    0.0627417313425164, 1,          1
##FIRST=     8223.62146879497, -1930,        -57819
##LAST=      0,             -483,            -58122
##MIN=       0,             -10815,          0
##MAX=       8223.62146879497, 393269451,    0
$$ Real data points
##PAGE= N=1
##DATA TABLE= (X++(R..R)), XYDATA
$$ [...]
67834 82289 83202 84329 85198 85900 86580 87217 88107 89870 92625 95701 98558 101470 104880 108549 111906 114852
67818 114852 117597 119936 121323 121650 121423 121045 120313 118766 116304 113328 110403 107842 105572 103318 100839
67803 100839 97982 94707 91263 88198 85886 84158 82717 81713 81389 81236 80284 78435 76771 76182 76294
67788 76294 76255 75928 75621 75150 74010 72330 70935 70430 70735 71496 72436 73284 73803 74016 74105 74152 74218 74534 75180
67769 75180 75722 75597 74912 74470 75032 76788 79467 82525 85272 87258 88610 89774 90956 92121 93387 94914
67753 94914 96435 97386 97554 97196 96470 95272 93707 92279 91379 90999 91116 91908 93322 94750 95451 95111 93821
67736 93821 91801 89411 87172 85403 83916 82288 80407 78627 77412 76909 76708 76042 74477 72470 70971
67721 70971 70391 70292 70173 70104 70297 70512 70386 70095 70166 70682 71123 70982 70177 68943 67722 67130 67521 68504 69327
67702 69327 69867 70736 72174 73383 73408 72362 71236 70691 70520 70255 69746 69057 68252 67468 66901 66555 66265 66073
67684 66073 66292 67018 67860 68378 68511 68393 68020 67394 66789 66553 66774 67329 68070 68725 69006 69165 70086 72209 74625
67665 74625 75983 76260 76776 78253 79728 79896 78890 78006 78043 78592 78878 78679 78330 78241 78573 79146 79591 79713
67647 79713 79666 79661 79600 79202 78381 77322 76285 75541 75415 76096 77316 78366 78509 77504 75873 74651 74593 75512
67629 75512 76667 77840 79623 82338 85227 87199 88072 88465 88720 88666 88382 88395 88904 89443 89658 89874 90483 91181
67611 91181 91298 90655 89667 88789 88270 88301 88931 89782 90202 89825 88813 87557 86369 85453 84903 84584 84214 83694
67593 83694 83220 82909 82440 81319 79459 77368 75680 74585 73730 72621 71092 69450 68253 67881 68228 68741
67577 68741 68830 68300 67460 66921 67192 68331 69875 71172 71917 72286 72509 72486 71996 71211 70685 70752 71206 71673 72117
67558 72117 72745 73508 73982 73799 73077 72257 71551 70742 69624 68426 67504 66686 65432 63865 63097 64000 65921
67541 65921 67326 67612 67578 67976 68418 68201 67563 67401 68012 68738 68874 68427 67901 67678 67689 67546 66997 66316 66085
67522 66085 66432 66770 66601 66326 66805 68160 69456 69594 68235 65882 63375 61402 60180 59475 59072 59190 60172
67505 60172 61836 63446 64445 64888 65052 64919 64288 63222 62128 61398 61144 61273 61647 62123 62507 62661 62753 63269
67487 63269 64571 66396 68024 68951 69185 68836 67853 66452 65422 65461 66294 66866 66460 65319 64192 63600 63604 63931
67469 63931 64142 63856 63001 61825 60713 60025 59991 60519 61217 61835 62557 63575 64532 64848 64600 64617 65530 67113
67451 67113 68734 70129 71442 72746 73803 74258 73888 72793 71480 70652 70772 71830 73506 75344 76790
67436 76790 77372 77108 76617 76648 77522 79025 80594 81530 81363 80354 79472 79533 80339 80899 80477 79127 77284 75243
67418 75243 73261 71792 71201 71316 71617 71823 71909 71605 70478 68768 67575 67660 68419 68666 68208 67834 67875 67757
67400 67757 67256 67211 68282 69701 70111 69274 68145 67518 67377 67493 67805 68108 68042 67642 67409 67650 68189 68829 69581
67381 69581 70285 70496 70048 69375 69010 69033 69168 69085 68467 67132 65386 63969 63407 63585 64068 64616 65231 65886 66432
67362 66432 66646 66390 65850 65547 65799 66261 66412 66393 66813 67663 68140 67780 67123 66835 66778 66501 66190 66340 66756 66679
67342 66679 65926 65306 65665 66955 68449 69583 70375 71145 72049 72926 73612 74333 75637 77864 80839 84144 87472
67325 87472 90587 93159 94929 95947 96457 96622 96426 95711 94204 91753 88733 86013 84276 83495 83239 83225
67309 83225 83297 83139 82462 81471 80738 80597 80915 81509 82489 84061 86137 88323 90210 91609 92497 92812 92432 91477
67291 91477 90507 90155 90508 91048 91195 90639 89166 86647 83487 80691 79077 78591 78612 78636 78385 77639 76529 75827
67273 75827 76367 78137 80324 82240 83810 85191 86402 87480 88592 89773 90785 91407 91719 91992 92400 92871
67257 92871 93063 92577 91403 90068 89104 88432 87578 86398 85180 84049 82763 81293 80137 79804 80203 80818
67241 80818 81265 81467 81508 81548 81719 81961 82097 82154 82351 82668 82749 82436 82012 81678 81191 80445 80044 80651 81990 83133
67221 83133 83745 84332 85125 85484 84807 83486 82432 82012 81968 82102 82467 82943 83207 83207 83288 83718 84380 84989 85331 85266
67201 85266 84786 84156 83699 83361 82795 81974 81384 81424 81909 82409 82795 83235 83847 84601 85332 85686 85281 84266 83429
67182 83429 83409 83968 84441 84703 85239 86304 87523 88405 88863 89060 89052 88820 88473 88253 88352 88740 89144 89325 89450 90013
67162 90013 91201 92492 93191 93168 92810 92404 91959 91497 91105 90723 90284 90020 90262 90951 91730 92427 93075 93595 93988
67143 93988 94716 96296 98451 100317 101508 102341 102947 102949 102230 101295 100531 99816 99200 99191 99831 100250 99817 99184 99430
67124 99430 100608 101888 102749 103274 103508 103322 102870 102581 102781 103732 105789 108844 111890 113853 114759 115475 116426
67107 116426 117324 118025 118812 119698 120256 120379 120571 121272 122462 124105 126322 128787 130556 130971 130349 129451 128643
67090 128643 127940 127465 127398 127765 128586 130005 131881 133532 134331 134449 134611 135199 135985 136717 137552 138758 140294
67073 140294 141915 143514 145105 146523 147381 147511 147322 147564 148718 150691 153018 155211 156951 158190 159105
67058 159105 159771 159930 159461 159042 159731 161621 163464 164157 164143 164690 166129 167640 168672 169704 171385 173610
67042 173610 175785 177535 178855 179937 181122 182664 184384 185912 187410 189594 192726 196020 198436 199760
67028 199760 200549 201313 202207 203329 204826 206667 208626 210559 212450 214227 215778 217176 218706 220550 222538
67013 222538 224321 225814 227426 229758 233026 236877 240850 244875 249164 253771 258524 263338 268230 273041
66999 273041 277449 281321 284818 288174 291606 295379 299544 303665 307254 310508 314079 318014 321595 324548
66985 324548 327708 331902 336738 341202 345139 349322 354205 359413 364553 369749 375071 380134 384707 389288
66971 389288 394496 400156 405545 410475 415577 421389 427632 433689 439525 445727 452760 460517 468630 476873
66957 476873 485108 493161 501038 509090 517676 526706 535763 544632 553468 562484 571813 581698 592469 604122
66943 604122 616085 627688 638822 650090 662306 675829 690249 704715 718733 732638 747167
66932 747167 762590 778514 794530 810703 827283 844258 861456 878997 897329 916775 937136
66921 937136 957765 978067 998029 1018287 1039524 1061843 1084919 1108723 1133720 1160211 1187760
66910 1187760 1215553 1243170 1270829 1299033 1328170 1358308 1389192 1420558 1452619 1486050 1521226
66899 1521226 1557619 1594242 1630641 1667186 1704432 1742531 1781343 1820815 1861014 1901899 1943231
66888 1943231 1984653 2025829 2066590 2107070 2147661 2188710 2230195 2271700 2312699 2352840 2392051
66877 2392051 2430416 2467997 2504610 2539734 2572710 2603233 2631647 2658676 2684771 2709745 2732992
66866 2732992 2753868 2771868 2786699 2798424 2807459 2814263 2819036 2821713 2822084 2819743 2814105 2804755 2791825
66853 2791825 2775919 2757691 2737537 2715522 2691425 2665034 2636578 2606732 2575960 2544001 2510221
66842 2510221 2474370 2436824 2398267 2359311 2320118 2280098 2238392 2195144 2151942 2110310 2069933
66831 2069933 2029141 1987036 1944321 1902030 1860416 1819442 1779449 1740670 1702718 1665206 1628498
66820 1628498 1593222 1559354 1526273 1493450 1460612 1427548 1394346 1361672 1330255 1300198 1271143
66809 1271143 1242985 1215941 1190012 1164794 1139809 1114712 1089304 1063723 1038521 1014170 990588
66798 990588 967460 944909 923400 903118 883913 865794 848937 833118 817611 801812 785692
66787 785692 769530 753523 737781 722429 707539 693124 679216 665749 652432 639103 626203
66776 626203 614522 604313 594957 585639 576044 566277 556457 546696 537200 528054 519056 510043 501279 493203
66762 493203 485788 478431 470582 462305 454153 446609 439786 433530 427640 421946 416311 410633 404830 398792
66748 398792 392439 385925 379710 374265 369626 365348 360924 356186 351277 346367 341511 336743 332170 327944
66734 327944 324160 320792 317735 314867 311965 308645 304615 300133 295942 292494 289439 286174 282688 279445
66720 279445 276598 273886 271293 269139 267316 265039 261775 257962 254404 251299 248291 245198 242169 239311
66706 239311 236618 234162 231989 229895 227619 225198 222872 220721 218656 216618 214578 212506 210593 209208
66692 209208 208344 207350 205657 203583 201966 201120 200559 199676 198248 196382 194323 192292 190173 187534 184318
66677 184318 181222 178939 177249 175493 173695 172436 171742 170993 170011 169265 168689 167333 164804 162204 160823
66662 160823 160453 159878 158632 157347 156497 155826 155150 154915 155458 156216 156194 155085 153603 152729 152764 153063 152667 151268
66644 151268 149563 148497 148163 147711 146434 144670 143305 142581 141793 140239 138076 135972 134223 132641 131230
66629 131230 130434 130488 130885 130801 129894 128410 126713 125098 123957 123691 124294 125300 126220 126793 126781 125871 124012 121678
66611 121678 119549 117981 116893 116106 115573 115270 114933 114105 112599 110987 110339 111182 112793 113817 113622 112748
66595 112748 112032 111670 111359 110916 110391 109728 108766 107613 106637 106011 105474 104801 104278 104388 105012 105309 104655 103546
66577 103546 103103 103613 103960 102820 100202 97431 95737 95255 95378 95574 95638 95554 95486 95751 96449 97173 97351 96855
66559 96855 96054 95292 94568 93827 93303 93323 93842 94399 94635 94703 95028 95754 96587 97166 97396 97316 96834 95820 94430
66540 94430 93097 92091 91212 90098 88820 87977 88076 88912 89743 90080 90103 90172 90228 89971 89496 89290 89536 89784 89507
66521 89507 88730 87873 87167 86480 85672 84928 84656 85067 85788 86008 85249 83961 83068 82930 83083 83024 82780 82509 82034
66502 82034 81156 80112 79312 78852 78649 78798 79404 80224 80828 80974 80574 79572 78185 76977 76264 75736 75089 74708
66484 74708 75096 75914 76314 76173 76210 76798 77385 77299 76593 75790 75268 75140 75354 75640 75647 75330 75026 75069 75585 76613
66464 76613 78089 79670 80895 81519 81432 80474 78818 77350 77004 77679 78455 78846 79154 79532 79581 79147 78721 78690
66446 78690 78880 79281 80350 82014 83092 82581 81082 80156 80545 81719 82923 83835 84314 84252 83845 83483 83207
66429 83207 82624 81405 79654 77839 76618 76504 77381 78477 79181 79650 80227 80536 79740 77663 75094 72959
66413 72959 71637 71083 71074 71199 71038 70637 70472 70773 71158 71122 70660 70176 69975 70069 70445 71282 72783 74786 76626
66394 76626 77581 77523 77081 77046 77713 78803 79781 80178 79871 79302 79207 79811 80452 80274 79222 78072 77566 77826 78553
66375 78553 79437 80258 80872 81265 81572 81961 82468 82904 82888 82149 80818 79264 77645 75933 74473 73970 74557 75299
66357 75299 75164 74263 73585 73686 74241 74835 75494 76273 76837 76800 76145 75111 73982 73128 72883 73191 73602 73859 74251
66338 74251 75199 76764 78724 80830 82691 83630 83111 81348 79230 77591 76628 76041 75600 75468 75983 77145
66322 77145 78457 79364 79826 80274 81066 82181 83424 84607 85392 85299 84222 82824 82071 82288 82868 83010 82636
66305 82636 82432 82987 84010 84564 84042 82763 81440 80275 78931 77399 76397 76566 77536 78226 78055 77498 77350
66288 77350 77873 78829 79971 81089 81766 81614 80824 80073 79763 79663 79470 79364 79686 80348 80951 81301 81430 81233
66270 81233 80619 80016 80157 81149 82191 82552 82534 83073 84518 86160 86946 86464 85259 84320 84244 84788 85247 85259 85012
66251 85012 84671 83940 82504 80692 79326 78918 79255 79812 80348 80982 81796 82509 82601 81825 80578 79591 79234 79284
66233 79284 79452 79863 80771 81944 82690 82573 81878 81274 81099 81179 81268 81495 82159 83125 83748 83546 82750 81885 81043
66214 81043 79987 78878 78311 78465 78725 78421 77649 77040 77004 77476 78179 78842 79274 79459 79507 79449 79263 79170 79532 80314
66194 80314 81008 81334 81634 82274 83065 83684 84250 84990 85646 85849 85893 86439 87463 88152 87997 87470 87360 87847 88461
66175 88461 88753 88758 88910 89600 90785 92028 92983 93671 94140 94127 93395 92295 91571 91581 92027 92441 92626 92592 92354 91896
66155 91896 91192 90232 89161 88289 87833 87726 87871 88308 88890 89103 88651 87979 87667 87459 86606 85161 84214 84603
66137 84603 86043 87844 89861 92156 94180 95007 94378 93048 92008 91714 92067 92816 93783 94892 96145 97550
66121 97550 98962 99999 100242 99552 98214 96743 95572 94943 94955 95569 96543 97514 98189 98398 98050 97281 96589 96518
66103 96518 97088 97781 98169 98324 98573 99230 100636 102906 105402 106963 107111 106647 106643 107209 107720 107863 107803 107617 107267
66084 107267 107026 107238 107631 107513 106755 106053 106102 106921 108031 108880 109029 108398 107421 106674 106284 105975 105574 105134 104740
66065 104740 104662 105491 107503 109966 111705 112315 112220 111669 110527 109119 108359 108671 109479 110078 110359 110354 109829 108793
66047 108793 107807 107248 106802 106231 106119 107181 109152 111025 112245 113109 114123 115414 116717 117580 117597 116723 115350
66030 115350 113920 112678 111871 111835 112600 113740 114959 116536 118813 121473 123782 125395 126574 127720 129055
66015 129055 130677 132521 134210 135227 135372 134980 134701 135114 136432 138400 140544 142618 144830 147610 151201
66000 151201 155375 159483 162974 166152 170178 175896 182737 189192 194221 197690 199695 200359 200428 201063 202509
65985 202509 203677 203603 202652 201653 200434 198088 194375 190053 185844 181758 177449 172752 167774 162842 158404
65970 158404 154726 151705 149162 147059 145244 143315 141159 139321 138335 137878 137094 135711 134370 133854 134410
65955 134410 135835 137818 140071 142364 144543 146446 147952 149226 150731 152761 155142 157613 160286 163412
65941 163412 166943 170593 174119 177246 179575 181007 182048 183242 184500 185417 186077 187007 188421 190044 191680
65926 191680 193420 195237 196899 198487 200526 203377 206817 210436 214188 218306 222861 227660 232524 237440
65912 237440 242436 247392 252066 256302 260120 263542 266404 268482 269694 270021 269352 267831 266242 265542 265824
65897 265824 266209 265989 265389 264889 264192 262329 258520 252710 245600 238436 232285 227072 221711 215580 209376
65882 209376 204010 199203 194004 188384 183352 179516 176394 173314 170313 167853 166073 164612 162985 161104
65868 161104 159570 159253 160265 161555 161932 161291 160377 159638 158897 157997 157075 156215 155425 154936 154938 155106 155044 155143 156220
65849 156220 158187 159889 160498 160412 160411 160609 160685 160616 160663 160889 161134 161321 161578 162200 163538 165591 167674 168954 169544
65830 169544 170612 173125 176853 180935 185095 189868 195777 202670 209845 216681 223170 229878 237270 245048
65816 245048 252182 257531 260339 260435 258345 255137 251707 248142 243997 239110 233740 228091 222220 216408 211061
65801 211061 206225 201713 197800 195197 194111 193851 193503 192593 191028 188978 187058 186118 186486 187757 189465
65786 189465 191516 193883 196525 199860 204733 211497 219622 228515 238235 248990 260464 272103 283634
65773 283634 294855 305270 314385 321911 327290 329522 328032 323316 316221 307055 296070 284313 273130
65760 273130 262980 253607 245240 238768 234681 232620 232227 233715 237343 242943 250335 259726 271279 284654
65746 284654 299405 315507 333000 351234 368956 385274 400136 413621 425016 433004 436761 436478
65734 436478 432623 425133 413843 399517 383727 367512 350692 332831 314367 296317 279225 263036
65722 263036 247828 234050 221953 211263 201608 192932 185334 178730 172874 167636 163164 159739 157362
65709 157362 155456 153211 150411 147760 146083 145383 144997 144541 144251 144387 144757 145088 145480 146172 147080 147875 148432
65692 148432 148919 149447 149921 150360 151101 152476 154426 156656 159159 162232 165941 169883 173707 177635 182185
65677 182185 187566 193723 200842 209367 219517 231206 244548 259973 277610 296867 316909 337383
65665 337383 358450 380191 402103 423027 441587 456973 469459 479887 488590 495121 499100 500856
65653 500856 500986 499773 497571 495493 495054 497016 500871 505489 510005 514040 517353 519433 519421 516489 510339
65638 510339 501247 489510 474963 457157 435955 411966 386501 361124 336989 314438 293277 273438
65626 273438 255179 238741 224166 211511 200802 191684 183525 176077 169637 164352 159869 155987 153118
65613 153118 151570 150737 149607 147888 146083 144585 143287 142031 140918 140088 139576 139441 139655 139893 139779 139428
65597 139428 139422 140157 141433 142685 143455 143702 143868 144541 145822 147212 148386 149831 152274 155654 159233 162742
65581 162742 166839 172306 179284 187576 197327 209058 223150 239463 257368 276112 295275 314870
65569 314870 334860 354723 373759 391674 408400 423261 434801 441720 443763 441476 435356 425548
65557 425548 412304 396419 379068 361156 342859 323913 304395 285092 266925 250248 234952
65546 234952 221143 209263 199521 191542 184769 178991 174343 170973 168836 167754 167563 168145 169301 170653
65532 170653 171900 173243 175178 177659 179793 180758 180705 180287 179546 177936 175352 172383 169379 165995 161981
65517 161981 157884 154513 152096 150416 149392 149060 149116 149064 148804 148727 149096 149554 149411 148331 146731 145489 145228
65500 145228 145875 146941 148073 149168 150098 150681 150998 151428 152252 153486 155147 157392 160222 163399 166813 170644
65484 170644 174915 179223 183190 186851 190230 192814 194009 194018 193704 193515 192992 191529 189189 186469 183563 180254
65468 180254 176470 172580 169038 165910 162898 159745 156488 153325 150381 147683 145332 143529 142319 141396
65454 141396 140267 138669 136765 134962 133614 132952 133136 134174 135741 137280 138429 139294 140218 141327 142452
65439 142452 143430 144342 145441 147003 149217 152067 155306 158743 162458 166460 170102 172270 172461 171408 170303
65424 170303 169502 168309 165944 162476 158807 155942 154289 153533 153150 153005 153309 154001 154525 154387 153681 152852 152237
65407 152237 152052 152437 153120 153375 152862 152321 152853 154592 156707 158643 160719 163392 166561 169890 173349 177050
65391 177050 180856 184385 187210 188913 189172 187999 185700 182636 179246 176170 173903 172278 170797 169462
65377 169462 168732 168574 168252 167373 166474 166207 166510 167079 168112 169952 172410 175054 177859 180977 184193 187280
65361 187280 190666 195012 200247 205758 211520 218257 226401 235591 245470 256240 267979 279849 290490
65348 290490 298984 305186 309391 312019 313426 313676 312511 309724 305480 300185 294183 287691 280852 273694
65334 273694 266161 258295 250287 242321 234560 227276 220639 214336 207813 201182 195472 191555 189108 187134
65320 187134 185280 184028 183591 183326 182497 181091 179466 177569 175048 171979 168967 166468 164402 162575 161118
65305 161118 160254 159811 159269 158280 156997 155943 155648 156391 158080 160374 162948 165657 168384 170903 173086 175215
65289 175215 177773 180764 183456 184950 184911 183548 181166 178084 174932 172498 171049 170099 169073 167934 166891
65274 166891 165819 164472 163138 162486 162641 162973 163055 163333 164411 165995 167127 167345 167046 166706 166292 165691 165261
65257 165261 165547 166612 167979 169219 170390 171838 173618 175199 175828 175285 174059 172619 170730 167907 164432
65242 164432 161280 158945 156921 154660 152445 150813 149624 148402 147351 147246 148284 149732 150892 151836 152900
65227 152900 153903 154331 154088 153705 153778 154318 154644 153956 152130 149983 148553 148144 148285 148525 148917 149653 150687
65210 150687 151974 153718 155985 158225 159577 159649 158782 157595 156544 155889 155725 155913 156138 156187 156010 155489 154406
65193 154406 152860 151501 150996 151269 151628 151735 152044 153091 154680 156212 157586 159240 161340 163428 164985
65178 164985 165900 166273 166259 166323 167116 168655 170041 170420 169927 169214 168410 167232 165930 165348 165978 167503 169409
65161 169409 171475 173516 175190 176409 177594 179219 181371 183921 186821 189984 193195 196446 200215 205097
65147 205097 211269 218514 226733 236215 247402 260521 275453 291885 309503 327935 346523 364376
65135 364376 380816 395690 409142 421294 432402 442978 453302 462877 470750 476320 479452 480015 477948
65122 477948 473878 468972 463848 457982 450433 440775 429123 415662 400497 383780 365839 347381 329602
65109 329602 313605 299483 286319 273314 260603 248808 238245 228909 220779 213733 207404 201496
65097 201496 196064 191283 187214 183993 181800 180290 178471 175657 172372 169877 168996 169705 171530 173783 175610
65082 175610 176452 176542 176619 177107 177814 178309 178309 177815 177188 176936 177104 177088 176457 175779 176066 177439 178918 179694 180095 181032
65062 181032 182711 184205 184294 182688 180478 179281 179860 181661 183665 185353 186624 187259 187055 186263 185318 184168
65046 184168 182426 180196 178202 176915 175997 174828 173237 171584 170389 170005 170292 170500 169826 168241 166475
65031 166475 164960 163196 160508 157184 154426 153155 153144 153349 152946 151958 151012 150618 150763 151174 151770 152660 153808
65014 153808 154981 156082 157264 158670 160217 161738 163178 164585 166099 167991 170527 173613 176773 179643
65000 179643 182407 185481 188818 191720 193409 193704 193071 192184 191588 191689 192715 194430 196107 197176 197970 199506
64984 199506 202360 206022 209563 212691 215830 219256 222516 224770 225478 224697 222834 220186 216741 212403 207437
64969 207437 202523 198289 194881 192035 189367 186510 183265 179880 176947 174697 172638 170258 167956 166695
64955 166695 166727 167193 167153 166530 165716 164690 163132 161252 159917 159755 160495 161486 162548 163939 165616 167068 168019
64938 168019 168807 169751 170478 170371 169513 168688 168485 168848 169455 169959 169844 168721 167024 165861 165797 166258 166457 166358
64920 166358 166315 166278 166015 165745 165901 166454 167016 167414 167632 167431 166725 166166 166664 168356 170682 173436 177103 182039
64902 182039 187904 194051 200045 205751 211433 217807 225442 234001 242523 250453 257871 264751 270819 276321
64888 276321 282122 288631 295202 301002 305854 309841 312654 313917 313682 312018 308537 302979 295974 288593
64874 288593 281255 273693 265918 258669 252847 248913 246819 246069 245821 245360 244638 244099 243871 243400 241996 239437
64858 239437 235879 231406 225967 219783 213557 208120 203850 200555 197873 195636 193723 191841 189726 187489
64844 187489 185425 183543 181658 179944 178969 178977 179549 180161 180739 181386 181953 182243 182388 182645 182959 183107 183129 183213 183243
64825 183243 182879 182115 181438 181337 181926 183143 185093 188013 191974 196743 201949 207419 213377 220225 228061
64810 228061 236469 244919 253328 262081 271447 281036 289871 297022 302153 305357 306482 304876 300131 292933
64796 292933 284752 276629 268620 260531 252731 245904 240327 235754 231813 228168 224496 220764 217498 215390
64782 215390 214558 214447 214473 214536 214927 216007 218037 221044 224731 228704 232840 237334 242397 248099 254509 261709
64766 261709 269579 277756 285959 294161 302293 309947 316634 322316 327490 332641 337717 342260 346035 349452
64752 349452 353271 357891 362953 367644 371312 373745 374893 374497 372051 367153 359840 350630 340274 329498
64738 329498 318845 308624 298936 289859 281659 274749 269312 265038 261410 258272 255957 254834 254819 255438
64724 255438 256221 256935 257517 257990 258565 259715 261970 265570 270351 275980 282199 288699 294924 300239 304358
64709 304358 307361 309218 309550 308035 304789 300070 293791 285761 276359 266625 257486 249139 241331 234081
64695 234081 227902 223312 220204 217760 215077 211903 208708 206068 204241 203405 203975 206273 209913 213898 217446
64680 217446 220631 224180 228767 234476 240814 247267 253948 261550 270558 280673 291161 301531 311527
64667 311527 320585 327711 331927 332683 329949 324262 316664 308293 299907 291854 284291 277218 270565 264581
64653 264581 259952 257105 255620 254780 254529 255290 256954 258749 260203 261706 263994 267575 272727 279552 287893
64638 287893 297629 309075 322556 337518 352691 367240 381130 394217 405718 414917 421757 426292
64626 426292 428129 426824 422356 414869 404489 391808 378030 364107 350198 336325 323022 310748
64614 310748 299273 288301 278339 270176 263810 258575 254079 250304 246973 243601 240218 237392 235429 234066
64600 234066 233069 232668 233233 234768 236874 239102 241377 244191 248203 253502 259500 265654 271975 278609 285356
64585 285356 292013 298815 306176 314316 323478 333962 345414 356541 366208 374467 381817 387912 391908
64572 391908 393829 394543 394351 392495 388237 381637 373091 362887 351521 339762 328034 316186 304133
64559 304133 292296 281134 270756 261242 252950 246165 240695 236073 231964 228359 225630 224381 224859 226461
64545 226461 228208 229701 231163 232622 233755 234663 236063 238342 240905 242863 243908 244102 243214 240824 236931
64530 236931 232158 227410 223513 220914 219484 218772 218531 218745 219102 218965 218154 217343 217335 218249 219770 221819 224439
64513 224439 227250 229596 231273 232703 234405 236611 239424 243005 247438 252608 258325 264538 271437 279381
64499 279381 288590 298778 309188 319112 328198 336072 341868 344590 343992 340856 336310 331078 325475 319811
64485 319811 314536 310031 306445 303747 301835 300586 299921 299798 299987 299877 298723 296231 292779 288954 285019
64470 285019 281025 277218 273999 271499 269524 268022 267352 268016 270280 274017 278600 282983 286275 288365 289686
64455 289686 290314 289752 287771 284989 282318 280200 278611 277395 276319 275249 274627 275324 277657 280957 284517
64440 284517 288402 292873 297684 302718 308749 316592 325855 335608 346098 358717 374279 392428 412922
64427 412922 436413 463624 494726 530077 570842 618336 673469 737379 811996 899174 999392
64416 999392 1111651 1234174 1364477 1498777 1631807 1757795 1872281 1973726 2063246 2142012
64406 2142012 2208458 2258425 2288099 2296199 2283344 2250409 2198502 2129975 2048300 1956481 1855655
64395 1855655 1745298 1624962 1496429 1364472 1235173 1113207 1000842 899210 809424 732028
64385 732028 666238 610564 563763 524716 492036 464684 442542 425489 412158 400517 389624
64374 389624 379979 372041 365187 358382 351229 343972 336824 329643 322122 314108 305807 297709 290250 283586
64360 283586 277727 272673 268309 264432 261127 258813 257663 257340 257663 259159 262365 266857 271595 276083 280531
64345 280531 284954 288861 291943 294384 296179 296732 295485 292559 288490 283722 278721 274189 270640 267930
64331 267930 265673 264034 263605 264467 265847 266951 267866 269319 271683 274592 277470 280063 282267 283810 284475
64316 284475 284507 284455 284624 284941 285295 285607 285503 284337 281766 278069 273758 269066 263941 258247 251857 244816
64300 244816 237634 231194 226144 222523 220073 218584 217728 216975 216044 215285 215281 216204 217838 219997 222640 225708
64284 225708 229145 232978 237171 241575 246302 251890 258731 266502 274499 282331 289960 297259 304063 310528
64270 310528 316911 322899 327613 330438 331500 331267 330042 328007 325488 322948 320930 320022 320538 322031 323359
64255 323359 323499 322199 319692 315952 310528 303129 294164 284625 275536 267488 260514 254234 248222 242435
64241 242435 237360 233549 230987 229146 227791 227429 228599 230875 233021 234174 234566 235030 236125 237807 239638
64226 239638 241154 242250 243239 244339 245200 245267 244576 243710 242976 242160 241162 240255 239406 237968 235474 232334 229331
64209 229331 226791 224608 222762 221365 220536 220544 221755 224020 226435 228114 228978 229506 230137 231275 233442 236904
64193 236904 241432 246840 253409 261381 270504 280525 291631 303803 316279 328368 340309 352429
64181 352429 363869 372998 378808 381000 379153 373079 363926 353653 343170 331979 319838 307683 296576
64168 296576 286710 277915 270244 263630 257720 252498 248323 244911 241223 236946 233266 231352 230793 230372 229841
64153 229841 229964 231108 232837 234842 237381 240627 244227 247801 251460 255581 260240 264967 269017 271925
64139 271925 273828 275076 275569 274865 273068 271043 269429 267853 265667 263010 260564 258553 256745 255331 254988
64124 254988 255905 257400 258832 260442 262944 266614 271191 276509 282810 290379 299114 308604 318569 329069
64110 329069 340204 351664 362662 372381 380372 386485 390662 393004 394021 394543 395300 396673 398904 402382
64096 402382 407527 414291 421904 429208 435320 439920 442927 444103 443121 439948 434991 428856 422057 414842
64082 414842 407174 398925 390236 381636 373660 366404 359621 353169 347141 341593 336389 331387 326617 322253
64068 322253 318524 315610 313589 312543 312700 314141 316149 317314 316781 315203 313922 313417 313276 313581 315379
64053 315379 319372 324827 330349 335329 340192 345539 351621 358498 366223 374865 384609 395778 408515 422458
64039 422458 436910 451285 465266 478544 490519 500216 506613 509280 508768 506125 502028 496641 490252
64026 490252 483555 477086 470865 464951 459972 456663 455015 454239 453433 451946 449246 444870 438635 430769 421824
64011 421824 412558 403716 395719 388594 382292 376914 372430 368387 364191 359687 355303 351600 348793 346679
63997 346679 344992 343838 343721 344996 347356 350066 352687 355308 358127 361176 364507 368189 371969 375377
63983 375377 378440 381951 386734 392921 400225 408486 417587 427111 436559 445815 455136 464856 475306 486700
63969 486700 498760 510810 522656 535131 549311 565475 583305 602792 624261 647650 672521
63958 672521 698916 727692 759873 796154 837150 883689 936730 997428 1067469 1148893 1243423
63947 1243423 1352302 1476885 1618852 1779564 1959635 2159402 2379251 2618784 2875834
63938 2875834 3146856 3428332 3717335 4010594 4303368 4589401 4861737 5113475 5338101
63929 5338101 5529793 5683830 5796846 5866779 5892597 5874107 5811837 5707017 5561681 5378989
63919 5378989 5163580 4921493 4659582 4384754 4103439 3821311 3543055 3272223 3011383
63910 3011383 2762636 2528208 2310632 2112200 1934011 1775540 1635284 1511775 1403881
63901 1403881 1310319 1229383 1159387 1099081 1047403 1003062 964687 931290 902317 877260 855373
63890 855373 835741 817529 800229 783786 768347 753737 739340 724638 709754 695265 681648
63879 681648 669161 658149 649109 642462 638513 637663 640370 646771 656543 669278 684909 703663 725600
63866 725600 750255 776791 804523 833311 863346 894582 926527 958577 990333 1021546 1051958
63855 1051958 1081358 1109424 1135264 1157380 1174516 1186572 1194323 1198248 1197918 1192537 1181815 1166211
63843 1166211 1146550 1123484 1097184 1067480 1034429 998743 961538 923636 885249 846393 807464
63832 807464 769259 732502 697410 663785 631519 600882 572223 545528 520564 497485 476858
63821 476858 458858 442753 427550 412971 399435 387261 376348 366615 358274 351460 345883 341039
63809 341039 336646 332773 329682 327535 326104 324693 322580 319613 316268 313104 310307 307795 305484 303320
63795 303320 301146 298719 295847 292501 288856 285275 282150 279666 277664 275714 273334 270271 266720 263243
63781 263243 260388 258361 257009 255967 254812 253262 251453 249865 248864 248388 248181 248101 248025 247709 247077 246455
63765 246455 246152 245912 245191 243948 242758 242064 241728 241447 241228 241199 241224 240934 240017 238337 236039 233754 232525
63748 232525 233182 235739 239455 243426 247087 250282 253076 255516 257499 258934 260054 261434 263561 266471
63734 266471 269880 273589 277545 281550 285144 287970 290176 292311 294802 297611 300471 303293 306253 309562
63720 309562 313342 317653 322349 326884 330593 333346 335657 337945 339878 340682 339951 337917 335120 332131 329431
63705 329431 327193 325199 323321 322014 321942 323092 324731 326360 328294 331007 334246 337150 339123 340304 341262
63690 341262 342551 344526 347271 350481 353505 355668 356709 356899 356666 356052 354703 352524 350183 348663 348271
63675 348271 348374 348236 347883 347973 349036 351028 353458 355663 357055 357417 357059 356539 356180 355993 355933 355899 355363 353386
63657 353386 349403 343926 338167 332973 328427 324421 321136 318668 316574 314258 311704 309488 308137 307843
63643 307843 308660 310456 312619 314330 315405 316483 318204 320567 323370 326804 331113 335918 340433 344363
63629 344363 348230 352784 358384 364818 371453 377602 383170 388989 396177 405115 415342 426485 438895
63616 438895 453130 469126 486293 504386 523989 545954 570489 596962 624586 653108 682678
63605 682678 713297 744582 775828 805748 832273 853334 868258 877913 883115 883471 878477 869341 858756
63592 858756 848799 839735 830910 821936 812505 801672 788139 771242 751288 728990 704964 679834
63580 679834 654482 629909 606862 585721 566707 550023 535665 523349 512908 504721 499357 496751
63568 496751 496185 497151 499704 503650 507963 511609 514683 518181 522864 528858 536020 543988 552013 559622 567548
63553 567548 577324 589895 605297 623709 645873 672103 701811 734653 771398 812721 857421 902595
63541 902595 945303 983196 1013681 1033724 1041476 1037956 1026648 1011365 994628 977878 962484 949859
63529 949859 940449 933033 925350 915375 901827 883911 861172 833762 802454 768265 732339 696135
63517 696135 661221 628560 598316 570529 545569 523653 504271 486566 470165 455273 442041
63506 442041 430236 419588 410152 402156 395538 389774 384265 378961 374465 371271 368997 366725 364147 361920
63492 361920 360654 359953 358900 357263 355743 355098 355436 356444 357887 359663 361612 363577 365635 368074 371095
63477 371095 374600 378280 381800 384885 387383 389389 391246 393142 394674 395032 393766 391189 387872 383992
63463 383992 379439 374414 369561 365511 362487 360335 358705 357312 356237 355915 356580 357807 358965 360045 361667
63448 361667 364294 367803 371906 376621 382161 388638 396036 404336 413606 424061 435993 449539 464722
63435 464722 482031 502655 527629 556792 589017 623221 658345 692303 721877 744357 759117
63424 759117 767474 771594 773835 776546 781721 790717 804362 823073 846704 874626 906128 940393 975888
63411 975888 1010292 1041365 1067559 1087535 1099795 1103583 1100008 1091647 1080959 1069387 1057687 1046402
63399 1046402 1035682 1024900 1012759 997847 979192 956421 929537 898761 864839 829296 793896
63388 793896 759693 726897 695639 666305 638966 613177 588918 567311 549834 536846 527263 519560
63376 519560 512890 507447 504095 503478 505271 508449 512368 517327 523905 532286 542471 554679 569046 585317
63362 585317 603380 623793 647187 673374 701576 731413 763196 797342 833862 872165 910900
63351 910900 948202 982613 1013507 1040135 1060681 1073185 1077462 1075377 1069131 1059953 1048568 1036064
63339 1036064 1023667 1011921 1000414 988083 973628 955942 934487 909261 880516 848817 815286
63328 815286 781361 748185 716544 687339 661584 639751 621606 606918 595881 588512 584111 581743
63316 581743 580851 580637 578974 572760 559917 540957 518457 495281 473387 453823 437021 422835 410724
63303 410724 400305 391642 384824 379481 375064 371361 368355 365718 362979 360225 357998 356384 354734 352551
63289 352551 350038 347384 344126 339896 335470 332309 331045 330927 330734 329796 328147 326180 324383 323155 322624
63274 322624 322612 322716 322466 321692 320823 320536 320950 321555 322127 323267 325586 328771 331967 334764 337258 339490 341459
63257 341459 343524 346076 348906 351538 354120 357310 361260 365432 369486 373697 378304 383142 388164 393721
63243 393721 399998 406743 413912 422084 431737 442534 453829 465591 478304 492154 506797 521941
63231 521941 537713 554382 572069 590803 610611 631307 652331 672986 692886 712168 731251
63220 731251 750454 769821 789229 808584 827929 847422 867105 886565 904958 921525 935953
63209 935953 947899 956320 959841 957914 951135 940255 925436 906814 885256 862050 838154 814211
63197 814211 790952 769083 748968 730869 715299 702746 693303 686972 683984 684368 687532 692830 700285
63184 700285 710228 722634 737444 755078 775677 798096 820670 843052 866301 891000 916176 940380
63172 940380 963106 984710 1005559 1025596 1044348 1061073 1075227 1086898 1096315 1102931 1105488 1103066
63160 1103066 1095468 1082593 1064204 1040614 1012901 982112 948751 913367 877050 840978 805893
63149 805893 772320 740851 711906 685549 661717 640326 621073 603649 588188 574989 563759
63138 563759 553810 545110 538327 533610 530135 527213 525008 523721 522908 522236 522167 523144 524700 526203 528040
63123 528040 531218 536031 541799 547711 553335 558518 563373 568245 573204 577753 581416 584299 586678 588481
63109 588481 589721 591068 593231 595981 598429 600135 601348 602275 602774 602788 602444 601624 599907 597131 593753 590631
63093 590631 588613 588150 588965 590207 591207 591980 592818 593739 594689 595943 597749 599798 601548 602964 604460 606198
63077 606198 607942 609534 611109 612939 615453 619232 624520 630847 637604 644888 653285 662925 673270 683825
63063 683825 694620 706007 718494 732721 749114 767575 787945 810693 836574 865622 897144
63052 897144 930786 966956 1005943 1047281 1090349 1135103 1181729 1229933 1279030 1328524 1378199
63041 1378199 1427817 1477140 1526154 1574895 1623009 1669867 1715272 1759876 1804604 1849610 1893829
63030 1893829 1935576 1973468 2006644 2034183 2054674 2066521 2068485 2059776 2039903 2008932 1967960 1919069
63018 1919069 1864652 1806792 1747153 1687138 1628037 1571178 1518019 1469958 1427961 1392396 1363247
63007 1363247 1340495 1324379 1315368 1313849 1319752 1332428 1350870 1374019 1400975 1431192 1464533 1500891
62995 1500891 1539592 1579350 1619035 1658360 1697731 1737585 1778021 1818818 1859419 1898851 1935885
62984 1935885 1969421 1998729 2023263 2042222 2054305 2058015 2052327 2036929 2011709 1976387 1931120 1877270
62972 1877270 1816992 1752006 1683353 1612309 1540805 1470673 1403127 1339284 1280406 1226964 1178003
62961 1178003 1132168 1089103 1049291 1012886 979383 948295 919398 892325 866532 841814 818499
62950 818499 796998 777318 758921 740889 722507 703983 686377 670497 656142 642689 630016
62939 630016 618329 607470 597138 587647 579764 573728 568913 564505 560129 555838 551893 548537 545671
62926 545671 542888 540099 537773 536177 534749 532862 530871 529634 529182 528683 527628 526214 524524 522239 519402
62911 519402 516645 514354 512277 510259 508710 507894 507348 506483 505386 504537 504042 503565 502877 502181 501955 502550 503780
62894 503780 504898 505243 504989 504907 505318 505631 505056 503458 501426 499750 498878 498561 498044 496956 495977 496240 498068
62877 498068 500694 503177 505040 506006 505885 505013 504247 504101 504186 503764 502568 500925 499496 498995 499742 501225 502529
62860 502529 503336 504084 505043 505933 506721 508082 510469 513250 515451 517072 519028 521896 525267 528319 530613
62845 530613 532291 533757 535239 536495 537031 536730 536121 535863 536094 536419 536427 536075 535654 535505 535715 536129 536757 537948
62827 537948 539878 542109 544119 546097 548507 550927 552194 551968 551377 551625 552592 553339 553448 553294 553378 553976 555095
62810 555095 556306 556977 557117 557565 558813 560158 560745 560996 562144 564622 567845 571512 576074 581803 588313
62795 588313 595371 603310 612159 621122 629670 638745 650128 664740 682194 702010 724641 751055 781803
62782 781803 816882 856302 900325 949156 1002756 1061070 1124098 1191489 1262272 1335295 1409742
62771 1409742 1484876 1559373 1631269 1698438 1758696 1809587 1848867 1875509 1889733 1891775 1881117
62760 1881117 1857352 1821284 1774635 1719041 1655934 1587219 1515353 1442613 1370529 1299934 1231180
62749 1231180 1164417 1100114 1039289 982929 931281 884064 841213 802864 768637 737555 708940
62738 708940 683021 660399 641172 624775 610493 597915 586991 577741 569906 563009 556906 552107
62726 552107 549179 547884 547291 546792 546681 547600 549813 553157 557386 562258 567552 573303 579910 587843 597420
62711 597420 609047 623341 640597 660297 681628 704584 730162 759388 792604 829904 871748
62700 871748 918626 970331 1026158 1085811 1149512 1217195 1288234 1362267 1439623 1520272 1602632
62689 1602632 1683968 1761730 1833858 1898060 1951725 1992862 2020418 2033457 2030773 2011847 1977719
62678 1977719 1930329 1871360 1802285 1725259 1643211 1558991 1474828 1392511 1313377 1237881 1165726
62667 1165726 1096888 1032363 973588 921196 874533 832402 794026 759283 728242 700773 676605
62656 676605 655492 637139 621076 606778 593826 581873 570620 560002 550158 540960 531852 522635
62644 522635 514134 507426 502458 498225 494425 492015 491647 492398 492823 492760 493192 494581 496247 497334 497622 497244
62628 497244 496297 495039 493976 493421 493199 492969 492576 491935 490869 489313 487630 486596 487041 489362 493205 497678
62612 497678 502045 506194 510374 514705 519253 524358 530400 537257 544398 551639 559504 568779 579928 593003
62598 593003 607827 624220 642337 662870 686724 714350 745504 779559 815783 853310 891235
62587 891235 928844 965528 1000361 1032087 1059643 1082361 1099492 1109928 1112796 1108175 1096855 1079502
62575 1079502 1056443 1028297 996410 962338 927045 890843 854143 817982 783643 751833 722491
62564 722491 695378 670633 648524 628855 610922 594130 578515 564566 552677 542847 534818 528265
62552 528265 522669 517163 510841 503527 496120 489897 485427 482336 480077 478519 477652 477112 476417 475587 475256
62537 475256 476069 478027 480362 482043 482579 482414 482415 482999 484060 485740 488742 493595 500002 507325 515456 524842
62521 524842 535953 549206 565183 584341 606497 631062 657856 687347 720112 756485 796642
62510 796642 840548 887633 936853 987138 1037517 1086845 1133816 1177379 1216793 1251213 1279506
62499 1279506 1300602 1313809 1318905 1316392 1307736 1294883 1279380 1262271 1244924 1229440 1217984 1212072
62487 1212072 1212651 1220309 1234968 1255778 1281892 1313219 1350001 1391713 1436735 1482950 1528225 1570260
62475 1570260 1606403 1633989 1651040 1656856 1652042 1637737 1614412 1581345 1537364 1482230 1417492 1346264
62463 1346264 1272185 1198129 1125454 1054554 986185 921975 863430 810890 763966 722643 687244
62452 687244 657411 632028 610439 593050 580223 571109 564196 558689 554733 552471 551597 551876 553391
62439 553391 555991 559014 561965 565133 569095 573789 578415 582144 584592 585675 585335 583427 579705 574018
62425 574018 566764 558964 551516 544384 536921 528979 521253 514420 508420 502831 497583 492963 489139 486002
62411 486002 483280 480538 477277 473365 469273 465612 462577 460031 457944 456371 455115 453872 452715 452072
62397 452072 452162 452799 453842 455486 457861 460603 463131 465302 467527 470216 473224 475987 478151 480029 482382
62382 482382 485809 490360 495628 501119 506564 512110 518204 525095 532384 539316 545600 551728 558420 566051
62368 566051 574773 584806 596216 608722 622241 637555 655949 678127 703845 732702 764958 801415
62356 801415 842733 888974 939591 993604 1049792 1106813 1163123 1216904 1266237 1309401 1345010
62345 1345010 1372028 1389940 1398936 1399708 1393035 1379650 1360410 1336274 1307954 1275777 1240070 1201645
62333 1201645 1161827 1121982 1083049 1045530 1009882 976768 946727 919657 894892 871854 850315
62322 850315 829882 809630 788730 767277 746074 725572 705410 685052 664551 644535 625652
62311 625652 608185 592090 577269 563810 551957 541876 533535 526868 521854 518265 515532 513159 511219
62298 511219 510162 510074 510346 510218 509586 509235 510242 513029 516928 520770 523948 526786 529872 533322 536780 539834
62282 539834 542216 543878 545166 546684 548709 550917 552871 554529 556104 557868 560408 564530 570273 576402
62268 576402 581723 586799 593597 603439 616016 630514 646932 665992 688431 714916 746172 782653
62256 782653 824156 870080 919949 973471 1030230 1089430 1149753 1209273 1265680 1316733 1360491
62245 1360491 1395263 1419780 1433697 1437785 1433406 1421694 1403051 1377150 1343440 1301919 1253632 1200435
62233 1200435 1144368 1087318 1030943 976499 924769 876432 832351 793174 758790 728677 702763
62222 702763 681450 664721 651721 641389 633147 626830 622283 619201 617178 615854 615242 615812 617909 621115
62208 621115 624551 627743 630796 633833 636793 639789 643015 646112 648212 648799 648105 646510 644115 641164 638366
62193 638366 636426 635613 635931 637200 638732 639590 639680 640211 642568 647020 652936 659845 667663 676066 684221 691259
62177 691259 696798 701086 704840 708832 713414 718560 724467 731876 741671 754511 771076 792230 818461
62164 818461 849378 884148 922272 963506 1007060 1051236 1093918 1133170 1167493 1195849 1217599
62153 1217599 1232307 1239648 1239620 1232906 1220836 1204754 1185188 1161626 1133283 1100286 1064009 1026238
62141 1026238 988313 951276 916397 884876 857151 833023 812428 795490 781891 770861 761860
62130 761860 754675 748742 743106 737404 732286 728523 726155 724779 724145 724158 724809 726503 730001 735663 743065
62115 743065 751575 760802 770241 779134 787107 794367 800801 805390 807065 805790 802390 797797 792963 788988
62101 788988 786570 785394 784421 782551 778987 773623 767577 762663 759667 757674 755633 753953 753766 755293 757936
62086 757936 761601 766805 773668 781770 790977 801469 812997 825054 837934 852703 869899 888957
62074 888957 909101 930086 951817 973951 996262 1018874 1041826 1064850 1087855 1111311 1135922
62063 1135922 1162139 1190009 1219130 1248650 1277684 1305762 1332447 1356512 1376034 1389577 1396977
62052 1396977 1398901 1396098 1389224 1378858 1365223 1347950 1326353 1299899 1268480 1232498 1192787 1150353
62040 1150353 1106182 1061346 1017031 974141 932985 893589 856166 820985 788057 757384 729316
62029 729316 704136 681439 660569 641647 625510 612467 601673 591939 582660 573650 564526 554740
62017 554740 544145 533301 523189 514601 507624 501664 496011 490316 484562 478934 474003 470644 469298
62004 469298 469495 470545 472473 475765 480443 485959 491910 498156 504306 509780 514433 518512 521887 524027
61990 524027 524810 524676 523733 521415 517429 512462 507440 502471 496979 490614 483654 476748 470549 465484 461639
61975 461639 458937 457385 456877 456823 456506 455957 455971 456959 458250 458880 458759 458635 459168 460419 462051 463594 464489
61958 464489 464268 462926 461094 459724 459445 460116 461112 462102 463387 465299 467624 469975 472491 475640 479517
61943 479517 484036 489753 497667 507898 519253 530535 541770 553693 566476 579527 592278 604565
61931 604565 616329 627420 637802 647658 657184 666362 674911 682376 688304 692397 694482 694402 692126 687992
61917 687992 682653 676796 671011 665873 661870 659264 658286 659393 663019 669056 676885 685908 695711 705764
61903 705764 715446 724439 732653 739640 744492 746516 745687 742323 736760 729495 721154 711982 701736 690403
61889 690403 678720 667629 657498 648172 639601 632034 625650 620154 614715 608239 600035 590347 580056
61876 580056 569742 559318 548695 538427 529368 521923 515925 511056 507119 503995 501649 500149 499558
61863 499558 499820 500841 502638 505443 509801 516386 525404 536140 547520 559252 572193 587440 605339
61850 605339 625483 647304 670382 694436 719310 744927 771069 797146 822189 844964 864284
61839 864284 879476 890604 898012 901782 901921 898930 893727 887025 879293 871366 864528 859815 857722 858706
61825 858706 863325 871477 881939 893122 904037 914281 923442 930926 936123 938328 936552 929768 917480
61812 917480 900128 879075 856055 832265 807998 783420 759485 737480 717684 699253 681651
61801 681651 665443 651300 638929 627548 616857 606904 597446 588141 579187 571185 564455 558901 554343
61788 554343 550558 547213 544180 541700 539847 538074 535810 533292 531230 529734 528173 526150 524034 522373
61774 522373 521189 520131 519045 518159 517791 518070 518855 519811 520589 521048 521433 522255 523820 525798 527532 529001
61758 529001 531171 534973 540135 545492 550353 554911 559347 563273 566270 568271 569074 568185 565641 562432 559488
61743 559488 556611 553020 548629 544200 540394 537280 534657 532297 529832 526957 523903 521478 520401 520658
61729 520658 521558 522409 523126 524120 525574 527127 528519 530187 532627 535445 537836 539933 542685 546204 549283
61714 549283 551037 552069 553317 554585 555085 554775 554161 553195 551431 549037 546682 544444 541692 538127 534305
61699 534305 531035 528777 527582 527056 526383 524923 522832 520741 518863 516865 514468 511687 508555 505161 501855
61684 501855 498947 496264 493509 490914 488940 487384 485519 483184 481084 479695 478426 476243 472839 468879
61670 468879 465277 462494 460487 459069 458126 457446 456571 455148 453397 451821 450428 448769 446918 445734 445672
61655 445672 445888 445219 443717 442606 442930 444791 447630 450611 452936 454442 455846 457874 460292 462276 463548
61640 463548 464512 465443 466182 466576 466631 466232 465263 463978 462770 461623 460258 458672 457035 455249 453145 450939
61624 450939 448873 446611 443693 440346 437127 433969 430474 427061 424808 423998 423708 423063 422000 420582 418377
61609 418377 415029 410758 405907 400561 394929 389506 384449 379329 373927 368858 364995 362545 360959 359438
61595 359438 357369 354603 351488 348355 345030 341304 337723 335172 333587 331895 329466 326878 324933 323621
61581 323621 322541 321640 320909 319899 318137 315806 313543 311867 311055 311124 311547 311429 310421 309107 308148 307507
61565 307507 306939 306732 307311 308474 309629 310530 311243 311664 311706 311739 312170 312722 312785 312496 312766 314069 315812 317163
61547 317163 318065 319050 320368 321697 322664 323313 324004 325014 326350 327831 329243 330457 331597 333163 335758
61532 335758 339505 343770 347637 350533 352296 352882 352386 351190 349667 347755 345198 342177 339265 336709 334228
61517 334228 331683 329519 328285 328022 328307 328627 328596 328077 327239 326278 325016 323173 321068 319564 319093 319143 318964
61500 318964 318368 317599 316854 316315 316266 316786 317623 318761 320703 323660 326727 328506 328541 327617 326709 326208 326230 326974
61482 326974 328290 329375 329472 328871 328756 329999 332381 335064 337420 339183 340183 340437 340385 340515 340759 340719 340565
61465 340565 341081 342527 344013 344460 343793 342711 341684 340755 340038 339696 339536 339225 338866 338833 339147 339574 340262 341600
61447 341600 343444 345148 346491 347909 349617 351159 352089 352647 353409 354671 356430 358660 361331 364324 367399
61432 367399 370100 371846 372482 372652 373146 373983 374638 375039 375645 376597 377561 378515 379922 381889 383904 385667 387554
61415 387554 389905 392475 394903 397094 398823 399566 399165 398171 397173 396271 395442 394806 394171 392970 391077 389133
61399 389133 387637 386313 384835 383579 383043 383038 383034 382883 382634 382057 381022 380032 379759 380223 380885 381342 381543 381618 381888
61380 381888 382713 383957 384999 385650 386593 388386 390530 392106 392980 393717 394659 395747 397013 398562 400209 401695
61364 401695 403137 404722 406161 406999 407370 407934 409176 411197 413962 417281 420733 424168 428105 433110 438968
61349 438968 445075 451502 458961 467694 476965 485727 493357 499695 504876 509228 512944 515807 517571 518648
61335 518648 519974 522054 524417 526150 526788 526579 525986 525018 523168 520169 516684 513866 512178 511136 510333
61320 510333 510103 510804 512063 513354 514871 517148 520120 523274 526567 530514 535429 541248 548121 556534 566637
61305 566637 577921 589825 602369 615955 630624 645608 659579 671391 680591 687145 690831 691282
61293 691282 688605 683497 676596 668216 658810 649045 639114 628659 617835 607746 599203 591643 584027
61280 584027 576332 569373 563554 558635 554511 551349 549085 547530 546910 547627 549529 552012 554743 557719 560785
61265 560785 563749 566813 570273 573907 577332 580858 585326 591205 598526 607453 618004 629199 639415
61252 639415 647823 654734 660358 664049 665196 664220 662215 659975 657692 655245 652402 648901 644593 639571
61238 639571 634305 629778 627097 626556 627292 628328 629692 631944 634905 637673 639877 642147 645228 649331 654522
61223 654522 660992 668605 676674 684569 692214 699767 707090 713770 719480 724187 728183 731871 735421 738781
61209 738781 742143 745956 750014 753044 753975 753495 753543 755291 758308 761741 765543 770339 776739 785083 795392
61194 795392 807344 820601 835219 851384 868775 886576 903974 920122 933799 943905 950444 954418
61182 954418 956617 957029 955526 952481 948467 943823 938699 933079 926653 919055 910342 900873 890721 879635
61168 879635 867527 854567 840809 826206 810915 795157 778945 762430 746278 731050 716497
61157 716497 702192 688550 676298 665219 654586 644807 637385 632963 630645 629559 629958 632196 635698
61144 635698 639636 643667 647185 648679 646847 641954 635349 628084 620754 614224 609566 607199 606675 607362 609087
61129 609087 612187 617112 623966 632363 641960 653016 665971 680607 696305 713228 732426 754405
61117 754405 778274 802828 827876 853926 880992 908335 935235 961554 987523 1013162 1037778
61106 1037778 1060107 1079294 1095753 1110640 1124476 1136782 1147002 1154908 1159793 1160111 1154608 1143497
61094 1143497 1128069 1109383 1087699 1062967 1035560 1006558 977297 948472 919842 891098 862785
61083 862785 835846 810590 786791 764569 744264 725540 707623 690538 675192 662104 650934
61072 650934 641406 633677 627587 622548 618535 616158 615374 615066 614349 613424 612776 612521 612991 614950 618634 623437
61056 623437 629045 635934 644228 653092 661890 671110 681508 693251 706468 721653 738896 757523 777113
61043 777113 797978 820139 842970 866425 891347 917854 944715 971213 998300 1026860 1056120
61032 1056120 1085006 1113849 1143482 1173811 1204721 1237239 1272275 1309098 1346563 1384921 1424941
61021 1424941 1466174 1507684 1549631 1592636 1636655 1682354 1732698 1791191 1859183 1936664 2024737
61010 2024737 2125190 2238744 2366419 2512430 2683694 2887465 3132169 3429773 3794318
61001 3794318 4238941 4778110 5432323 6226696 7185913 8335884 9707999 11328135 13190508
60992 13190508 15243053 17398118 19542345 21521107 23129680 24171170 24573875 24467394
60984 24467394 24127746 23826247 23710552 23794420 24006292 24209179 24192005 23709097 22594393
60975 22594393 20866735 18725577 16440313 14231806 12225856 10471518 8973349 7711490
60967 7711490 6655277 5775062 5046505 4447339 3955307 3550630 3217695 2943184 2714405
60958 2714405 2520225 2352211 2204336 2072636 1955176 1851085 1759212 1678213 1607311 1545710
60948 1545710 1491591 1442977 1399247 1360426 1325198 1291113 1256824 1222740 1189389 1156572 1124454
60937 1124454 1094154 1066571 1041491 1018308 996858 977170 959101 942567 927559 913789 900984
60926 900984 889615 880532 873693 868072 863051 859085 856637 855320 854592 854604 855803 858268 861998 867339 874468
60911 874468 882742 891155 899361 907799 916956 926862 937294 948086 959145 970291 981166 991341 1000587
60898 1000587 1009001 1016702 1023462 1028822 1032515 1034530 1034858 1033488 1030672 1026862 1022339 1017189 1011666 1006155
60884 1006155 1000595 994246 986328 976765 966155 955103 943708 931617 918481 904387 889862 875427
60872 875427 861263 847385 833937 821120 808950 797379 786566 776689 767558 758704 749879 741183
60860 741183 732746 724651 717152 710566 704772 699156 693236 687092 680973 674737 667947 660466 652787 645761
60846 645761 639975 635277 630875 625994 620456 614524 608284 601420 593623 584993 575959 566959 558213 549623
60832 549623 540896 531970 523370 515913 510069 505771 502854 501264 500752 500716 500690 500793 501404 502475 503350 503329 502323
60815 502323 500960 500057 499883 499966 499730 499205 498884 498959 499093 498971 498668 498326 497923 497567 497476 497364 496373 494217 491983
60796 491983 491032 491290 491423 490636 489443 488461 487356 485484 482942 480391 478201 476320 474591 472637 469726
60781 469726 465428 460336 455580 451623 448004 444212 440263 436399 432773 429591 427077 425075 423075 420884
60767 420884 418910 417588 416849 416446 416480 417257 418736 420414 421711 422372 422629 423056 424107 425664 427169 428226
60751 428226 428896 429422 430058 431227 433417 436624 440175 443296 445636 447138 447822 447989 448165 448464 448303 447090
60735 447090 444879 441995 438382 433879 428871 424094 419883 416079 412510 409093 405597 401867 398238 395242
60721 395242 392905 390815 388822 387188 386016 384992 383740 382025 379615 376489 373206 370519 368550 366839
60707 366839 365294 364448 364564 365052 365174 364883 364569 364396 364314 364415 364770 365082 364974 364632 364773 365859 367535 369050
60689 369050 370119 371245 373081 375548 377848 379437 380710 382507 385208 388701 392993 398244 404168 409975
60675 409975 415110 419711 424141 428430 432360 435853 439113 442499 446230 449926 452523 453045 451541 448913
60661 448913 445889 442638 439414 436886 435465 434730 433885 432611 431226 430284 430120 430528 430814 430500 430025 430285
60645 430285 431368 432316 432320 431508 430200 428112 424855 420727 416292 411532 406179 400721 396371 393889 392914 392501
60629 392501 391942 391057 390054 389234 388657 388099 387451 386954 386828 386886 386846 386833 387114 387435 387154 386109 384982 384630 385269
60610 385269 386397 387335 387744 387763 387744 387814 387766 387434 387013 386864 387102 387610 388334 389273 390211 390770 390857 390905 391521 392961
60590 392961 394964 397094 399191 401427 403835 405898 406920 406897 406769 407525 409168 410767 411506 411478 411409 411814 412597
60573 412597 413532 414943 417627 422007 427679 434082 441316 449824 459413 469206 478662 488092 497965 508218
60559 508218 518408 527990 536071 541492 543675 543127 540670 536592 531013 524659 518599 513417 509324 506874
60545 506874 506805 509106 512931 517605 523176 529875 537642 546575 557357 570761 586810 604706 623414
60532 623414 642132 660300 677348 692420 704341 712036 715113 713905 708941 700663 689807 677776
60520 677776 666221 656191 647773 640445 633594 626766 619812 613039 607199 603131 601274 601442 602978 605152
60506 605152 607535 610193 613578 618239 624680 633489 645392 660945 680198 702992 729647 760984 797438
60493 797438 838391 882639 929271 977698 1027014 1075731 1122095 1164240 1200144 1227947 1246490
60482 1246490 1255272 1253875 1241852 1219269 1187014 1146495 1099429 1048001 994640 941275 889044 838893
60470 838893 792080 749830 712799 681053 654196 631223 610697 591585 573837 557981 544384
60459 544384 533110 524005 516479 509526 502504 495761 490001 485155 480388 475168 469754 464553 459539 454692
60445 454692 450634 448265 447667 447670 446799 444589 441797 439348 437405 435673 434219 433480 433522 433837 433974 433987 434126
60428 434126 434429 434763 434952 434761 434028 432923 431723 430348 428572 426729 425656 425726 426487 427427 428520 429736
60412 429736 430761 431678 433258 435835 438387 439529 439164 438410 438069 437962 437742 437600 437956 438944 440411 442168
60396 442168 444164 446599 449789 453627 457340 460147 462081 463845 466021 468767 472113 475997 480030 483733
60382 483733 487152 490858 495219 499903 504189 507572 510075 512205 514597 517460 520365 522739 524577 526407
60368 526407 528622 531066 533338 535291 537134 539061 540817 541711 541306 540110 539310 539648 540799 542002 543074
60353 543074 544614 547400 551784 557521 564097 571326 579584 589194 599635 609813 619056 627269 634131 638889
60339 638889 641249 641686 640459 637018 630980 623083 614570 606063 597636 589522 582094 575488 569778 565133
60325 565133 561267 557238 552417 547236 542385 537834 533283 529051 525625 522838 520381 518675 518255 518717 519410
60310 519410 520798 523980 529081 535408 543115 553338 566523 581912 599054 618714 641711 667691
60298 667691 695293 722598 747037 765851 777307 781010 776897 764937 746214 723353 699147 675284
60286 675284 652757 632605 615494 601122 588804 578308 569639 562452 556243 550797 545964 541327 536494
60273 536494 531448 526237 520699 514824 509049 503843 499295 495367 492116 489395 486861 484707 483813 484607 486127
60258 486127 486845 486237 485009 484003 483416 483058 482807 482644 482532 482420 482334 482431 482931 483841 484757 485171 484987 484492 483832
60239 483832 482921 481958 481568 482122 483235 484248 485007 485918 487415 489575 492160 494872 497621 500583 503892 507381
60223 507381 510827 514339 518143 522032 525425 528096 530535 533487 537367 542146 547591 553580 560331 568159
60209 568159 576852 585588 593827 601993 610815 620269 629677 638546 646661 653687 659468 664549 669542 674140
60195 674140 677637 680249 682798 685106 685924 684704 682298 679551 676361 672625 668948 665635 661934 657126
60181 657126 651642 646356 641433 636635 632090 627921 623719 619213 615038 611984 609863 607854 605622 603380
60167 603380 601204 599109 597547 597010 597154 596964 595789 593816 591708 590180 589728 590265 591195 592179 593552 595585
60151 595585 597712 599055 599518 599859 600811 602538 604743 606908 608638 610136 612100 614927 618345 622107 626543
60136 626543 632039 638437 645448 653178 661696 670517 679047 687168 694759 701145 705666 708399 709599 708932
60122 708932 706175 702433 699623 698705 699168 700264 701900 704150 706649 708855 710536 711779 712805 713820 714769
60107 714769 715224 714741 713243 710793 707214 702266 696053 688993 681610 674647 669013 665100 662375 660078 658087
60092 658087 656704 655959 655660 655830 656495 657298 657936 658757 660288 662332 664146 665330 665947 665986 665478 665030 665414
60075 665414 666515 667262 666645 664303 660183 654305 647009 638852 630184 621226 612444 604262 596503 588763 581313
60060 581313 574862 569387 564000 558232 552708 548200 544662 541585 538792 536466 534806 534061 534536 536145 538257
60045 538257 540334 542541 545424 549254 554035 559926 567162 575499 584030 591744 598155 603381 607687 611052
60031 611052 613145 613594 612233 609206 604968 600075 594782 588881 582144 574740 566893 558362 548829 538825
60017 538825 529572 521742 514997 508980 503997 500334 497592 495310 493648 492873 492691 492707 492963 493304 492798 490768
60001 490768 487985 485892 484883 484300 483883 484131 485271 486821 488301 489622 490767 491896 493724 496901 501014
59986 501014 505047 508853 513209 518309 523278 527449 531050 534218 536297 536766 536025 534598 532252 528585 523968
59971 523968 519162 514477 509945 505974 503081 501221 500012 499500 500109 501961 504771 508369 512743 517482 521703
59956 521703 524891 527555 530741 534861 539204 542651 544758 546035 547251 548718 550291 551779 553124 554371
59942 554371 555643 556993 558075 558251 557251 555509 553582 551549 549376 547515 546648 546957 548063 549468 550654
59927 550654 551162 551175 551711 553450 555563 556588 556397 556372 557587 559768 562348 565602 570137 575879 582154 588427
59911 588427 594558 600629 606809 613082 618865 623290 626106 627924 629304 629969 629180 626629 622749 618497 614976
59896 614976 612868 611974 611602 611585 612496 614667 617564 620616 624237 629337 635862 642424 647589 651241 654459
59881 654459 658198 662416 666508 670301 674218 678548 683027 687273 691132 694287 696012 695826 694071 691354
59867 691354 687738 683064 677707 672229 666435 659605 651690 643600 636231 629873 624625 620672 617995 616321
59853 616321 615547 615653 616232 616719 617237 618603 621447 625963 632546 641757 653278 665613 677278 687753
59839 687753 696943 704299 709057 711056 710991 710074 709588 710430 712764 716165 719911 722781 722973 719133 711597 701985
59823 701985 691512 680444 669168 658718 649811 642166 635243 628965 623360 618261 613879 610974 609880
59810 609880 609875 609962 609765 609259 608271 606729 604803 602365 598933 594678 590812 588324 586865 585491 583896 582225
59794 582225 580262 577729 575030 572872 571329 569964 568649 567586 566691 565674 564576 563577 562374 560406 557733
59779 557733 555081 552947 551082 548985 546558 544190 542394 541388 540930 540611 540342 540305 540467 540636 541121 542713
59763 542713 545573 548681 550904 552298 553873 556411 560061 564747 570385 576757 583599 590732 597892 604841
59749 604841 611957 620209 629889 639738 648021 654296 659515 664546 669351 673564 677058 679680 681018 680904
59735 680904 679910 679014 678796 679081 679298 679141 678862 678939 679550 680509 681610 682795 684066 685570 687651 690383 693045
59718 693045 694662 695160 695441 696153 697009 697529 697703 697552 696775 695459 694512 694694 695608 696378 696922 697872 699479 701365
59700 701365 703247 705309 707914 711483 716548 723387 731604 740494 749702 759134 768276 776022 781187 782991
59686 782991 781356 777100 771688 766387 761688 757624 754231 751324 748246 744391 739820 734948 729835 724155
59672 724155 717601 709935 700946 690867 680603 671116 662735 655398 649174 643994 639261 634395 629683 626065
59658 626065 624224 624329 626394 630205 634992 639784 644070 647733 650598 652688 654750 657635 661051 663552
59644 663552 664002 662549 659940 656415 651644 645457 638319 631121 624655 619266 614924 611516 608910 606785
59630 606785 604789 603001 601879 601548 601434 600881 599725 597975 595406 591930 588023 584275 580722 577080 573329
59615 573329 569616 565836 561848 557899 554344 551199 548469 546641 546219 546935 548031 549237 550859 552982 555239
59600 555239 557362 559311 560803 561365 561097 560935 561810 563796 566241 568532 570554 572578 574804 577017 578703
59585 578703 579555 579671 579187 577942 575676 572357 568182 563446 558543 553777 549030 543935 538544 533414 528897
59570 528897 524816 521113 518294 516795 516350 516361 516503 516630 516541 516291 516267 516532 516661 516671 517449 519569 522227 524180
59552 524180 525303 526408 527876 529443 531120 533399 536474 540019 543880 548394 553924 560536 568244 577258
59538 577258 587963 600746 615658 632097 649156 666262 682731 696449 704175 704205 698272 690083 682459
59525 682459 676562 672987 672095 673361 675607 678091 680720 683339 685513 686839 686762 684415 679418 672605 665096
59510 665096 656918 647424 636795 626164 616389 607604 599822 593027 586848 581090 576399 573464 571755 570188
59496 570188 568915 569194 571446 574636 577736 580630 583286 585212 586296 587302 589085 591958 596106 601882
59482 601882 609335 618029 627606 638097 649702 662882 678461 696746 716536 735868 753733 770184
59470 770184 784742 795768 801677 801976 797096 788282 777785 768020 760008 753407 748278 745856 747259 752397
59456 752397 760605 771491 784747 799869 816544 834695 853950 873753 894184 915773 938194 959893
59444 959893 979200 994932 1005639 1009367 1004861 992505 973883 951156 927005 904080 883730 865720
59432 865720 849340 834089 819244 803869 787774 771727 756425 742082 729321 719488 713597 711760
59420 711760 713950 720441 731065 744980 761600 781007 803210 827930 855249 885311 917007 948080
59408 948080 976609 1000685 1016278 1017872 1003225 976647 946273 918921 898327 886341 883274 887424
59396 887424 896197 907597 919094 925480 920234 900215 868310 831122 794705 762402 735214 712947
59384 712947 695058 681012 670221 661994 655790 651401 648693 647387 647253 648198 649923 651874 653859 656327
59370 656327 659703 663835 668399 673401 678868 684480 689909 695187 700382 705378 710363 716075 723055 731065
59356 731065 739649 748941 759512 771746 785664 800950 816882 832791 848927 866326 885478 905696
59344 905696 926152 946746 967396 987155 1004760 1019631 1031629 1040258 1044772 1044825 1040528 1032196 1020423
59331 1020423 1006037 989573 971130 951086 930449 910115 890269 870860 852101 834174 817080
59320 817080 801266 787734 776997 768465 761317 755323 750363 745926 741744 738291 735975 734389 732960
59307 732960 731708 730739 729684 728390 727603 728202 730258 733434 737763 743420 750372 758820 769243 781279
59293 781279 793341 804101 813468 821073 824684 821583 811307 796018 778525 760881 744513 730391
59281 730391 718872 710024 704026 700838 699959 701166 704985 711777 720932 731716 744266 758819 774595
59268 774595 790442 805991 821075 834624 845466 853778 860402 864978 866091 863170 856934 847974 836249
59255 836249 822178 807105 792237 777942 764291 751503 739688 728826 719150 711020 704483 699539
59243 699539 696567 695750 696302 697186 698467 701093 705390 710691 716378 722353 728378 733864 738529 742548 745892
59228 745892 748110 748843 748036 745676 741899 737229 732065 726053 718648 710214 701926 694668 688685 684113 681127
59213 681127 679588 679220 680011 681863 684084 685923 687385 688828 689982 690181 689400 688263 687188 686232 685538 685051
59197 685051 684066 681986 679414 677579 676772 676270 675692 675418 675653 676078 676593 677544 678980 680409 681478 682333 683263
59180 683263 684477 686134 688064 689718 690971 692597 695243 698347 701012 703569 707205 712339 718463 725482
59166 725482 734042 744479 756425 769430 782973 795906 806886 815504 822157 826930 829479 829820 828191
59153 828191 824275 817696 809189 800077 790654 780288 769002 757599 746204 734216 721899 710466
59141 710466 700163 689802 678860 668614 660321 653463 646754 639954 633660 628114 623197 619140 616368
59128 616368 614852 614216 614269 615090 616859 619825 624079 629237 634835 641097 648817 658373 669368 681209 693451
59113 693451 705638 717536 729537 742062 754536 765713 775006 782720 789069 793935 797623 800833 803676
59100 803676 805660 806707 807227 807034 805295 801760 797098 791851 786170 780695 776392 773095 769449 764953 760950
59085 760950 758877 758376 757762 755589 751213 744663 736654 728224 719849 711310 702563 694004 685803 677868 670631
59070 670631 664817 660153 655336 649749 644179 639468 635535 632212 629840 628293 626405 623273 619414 615950
59056 615950 613372 611643 610684 610121 609334 608433 608464 610046 612536 615045 617390 619341 619913 618396 615498 612600
59040 612600 610305 608307 606121 603291 599483 595131 591562 589869 590037 591573 594330 598227 602892 608317
59026 608317 615351 624847 636697 650197 664858 680315 695963 711259 725977 739740 751824 761836
59014 761836 770064 776688 781212 783143 782754 780702 777401 773101 768085 762495 756506 750936 746989 745186
59000 745186 745261 747300 751905 758796 766280 772813 778307 783313 787821 791603 794983 798385 801618 804156 805592
58985 805592 805422 803174 799360 795542 792772 790643 788452 786552 785889 786870 789389 793365 798674 805145 813138
58970 813138 823419 835984 849786 864126 879382 895784 912455 928453 943799 958579 971949
58959 971949 982961 991620 998088 1001574 1001061 996532 988486 976896 961666 943605 923895 902980 880947
58946 880947 858613 837276 817687 800011 784460 771083 759338 748683 739395 732162 727195 724305
58934 724305 723319 723737 724425 724403 723656 722631 721433 720013 718477 716577 713575 709418 705368 702602 700761 698691
58918 698691 696096 693580 691574 690159 689545 689860 690807 692232 694622 698302 702669 707034 711764 717791 725455
58903 725455 734680 745847 759582 775863 794030 813340 832907 851565 868609 884449 899937 915390
58891 915390 930777 946359 962557 979717 998493 1019787 1043594 1068473 1092821 1115989 1137485
58880 1137485 1155878 1169526 1177917 1181509 1180693 1175630 1166563 1153474 1136015 1114556 1090801 1066626
58868 1066626 1042780 1019369 996903 976103 957254 940513 926221 914172 903194 892190 881010
58857 881010 869810 858478 847360 837475 829100 821114 812648 804340 796916 789660 781597 773207 765571
58844 765571 758609 751558 744368 737222 729391 720183 710509 702014 695049 688764 682659 676714 670518 663769
58830 663769 657232 651874 647471 643386 640181 638991 639639 640844 641988 643397 645216 647408 650527 655059
58816 655059 660231 664788 668692 672781 677110 680980 684289 687408 689951 691064 690765 689740 688044 685303
58802 685303 681911 678704 675665 672182 668257 664242 659875 654893 650031 645919 641576 635726 629162 623962
58788 623962 620679 618211 616248 615801 617236 619780 623207 628194 634626 641297 647742 654743 662518 669944
58774 669944 676066 681057 685119 687703 688301 686905 683347 677281 669238 660675 652664 645373 638801 632999
58760 632999 627559 622048 617067 613744 612146 611277 610634 610630 611435 612547 613532 614196 614196 613591 613609 615693 619920 625407
58742 625407 631841 639364 647470 655507 663870 673173 682685 691219 699115 707434 715661 722250 727209 731984
58728 731984 736858 740766 743686 746862 750307 752467 752849 752759 752871 752364 751204 750993 752610 755104 757951 762270
58712 762270 768525 774944 779686 782967 785651 787227 786700 784268 780626 775568 768500 759498 748819 736169
58698 736169 721437 705381 688829 671950 655000 638836 624024 610288 597498 586339 577396 570415
58686 570415 564922 560669 557085 553248 548889 544507 540171 535261 529714 524419 520052 516621 514340 513686
58672 513686 514270 515082 516205 518958 523893 530052 536696 544351 553677 564701 577647 592901 609399 624470
58658 624470 636114 644227 649024 649820 646297 639711 631779 623300 614498 605707 597021 588268 579825 572447
58644 572447 566009 559631 553409 548684 546186 545307 545547 547110 549584 551688 553114 555111 558471 562274 565288
58629 565288 567200 567847 566763 564272 561655 559487 557158 554613 553028 553047 553866 554842 556546 559492 563385
58614 563385 568398 575597 585177 595669 605706 615177 623973 631222 636549 640525 643101 643292 641238 638762
58600 638762 636929 634785 631514 628015 625178 622409 619157 616277 614544 613398 612469 612834 615407 619544 624533
58585 624533 631035 639812 650418 662363 676051 691187 705796 718270 729138 739413 748541 755419
58573 755419 760281 764235 768012 772336 778356 786503 796033 806662 819438 835141 853253 873423 896299
58560 896299 921777 948009 973307 997432 1019893 1038737 1052432 1061379 1066262 1066597 1062358 1055438 1047993
58547 1047993 1040697 1033760 1027924 1023067 1017562 1010407 1002253 993053 980745 963946 944025 922811 900237
58534 900237 876097 852105 830013 809426 789664 772063 758147 747094 737321 729161 723693 720272
58522 720272 717588 715963 716243 717497 718128 718319 719186 720401 720747 720214 719567 718688 717200 715807 715210 714633 713171
58505 713171 711522 710622 709736 707787 705460 704086 703488 702777 702178 702247 702307 701479 700246 699403 698634 697705 697663 699231
58487 699231 701537 704137 708537 715812 724502 733092 742753 755280 769975 785132 801139 819384 839263
58474 839263 858772 876899 892979 904878 910472 910138 905647 897732 886777 874467 862338 849989
58462 849989 837056 825562 817840 813522 811061 810806 813930 819780 827042 836229 848294 862016 875396
58449 875396 888193 900302 909118 911673 908255 901049 890503 876206 860084 845310 832737 821360
58437 821360 811392 803967 798734 794725 792661 793526 795972 798130 800840 806038 813122 820154 827505 836940
58423 836940 848109 859265 870361 881920 891869 897184 898064 897083 894997 890722 884563 877886 870344 860903
58409 860903 850864 842342 834606 825505 815683 807673 801625 795756 790286 787003 785510 783825 782276 782925
58395 782925 785551 787983 789972 792962 796555 799026 800823 803624 806522 807165 806143 806125 807196 807328 807039
58380 807039 809064 813533 817823 821233 825606 831344 836985 842669 849884 857900 864599 870629 878464 887667
58366 887667 895593 902509 911343 922474 933557 944497 957616 972663 986584 998725 1011386 1024710
58354 1024710 1035826 1043689 1050058 1055091 1056757 1055373 1054049 1053832 1052924 1051360 1051794 1054885 1058440 1061893
58340 1061893 1067141 1074352 1081572 1089167 1099977 1114339 1129412 1144055 1159896 1177147 1193941 1210163
58328 1210163 1227250 1243963 1257117 1266669 1275221 1282669 1286622 1287953 1290245 1293620 1294918 1294187 1294994 1298022
58314 1298022 1300520 1302423 1306711 1313247 1318801 1323714 1331854 1343275 1353832 1362895 1374312 1388712 1402205
58301 1402205 1414077 1428346 1445929 1462588 1476548 1490994 1507172 1522267 1536009 1551971 1570311
58290 1570311 1586691 1600483 1616478 1636319 1656023 1674245 1694962 1719358 1743091 1764504 1787624
58279 1787624 1814122 1840325 1865146 1892892 1925070 1957448 1988270 2021277 2057675 2093630 2128789
58268 2128789 2168420 2213785 2259243 2302334 2347624 2397116 2446324 2493753 2544632 2601041 2657820
58257 2657820 2712369 2768861 2828596 2886276 2940257 2996342 3057044 3117535 3176662 3240981 3313189
58246 3313189 3387795 3463041 3545320 3636734 3730641 3825013 3927451 4041068 4158611 4276940
58236 4276940 4403816 4543633 4690299 4841302 5004463 5183164 5369736 5561440 5767839
58227 5767839 5994121 6233002 6481856 6751405 7048229 7365785 7702311 8069667 8474439
58218 8474439 8909253 9373546 9883157 10448253 11063096 11729635 12468630 13294771 14205357
58209 14205357 15207906 16333575 17609039 19044075 20664371 22528164 24696055 27221780
58201 27221780 30195325 33759558 38063203 43240005 49461416 56968345 66030983 76937669
58193 76937669 90056144 105840864 124743937 147182508 173563127 204074049 238196003
58186 238196003 274427915 310559905 343992787 371529104 389196891 393269451 382331750
58179 382331750 358552451 326753366 292087281 258302357 227436277 200225443 176460539
58172 176460539 155351163 136101454 118376707 102283649 88030270 75692064 65199248
58165 65199248 56381521 48997700 42796107 37576475 33183718 29470728 26305915 23599373
58157 23599373 21285946 19294080 17556829 16036074 14707968 13537390 12489322 11550187
58149 11550187 10714604 9963536 9275623 8646738 8078442 7559298 7076047 6631191 6231505
58140 6231505 5870046 5536072 5231618 4961762 4718732 4491455 4281268 4093078 3920054
58131 3920054 3751641 3588259 3434470 3286082 3137541 2994142 2863715 2743327 2626315
58122 2626315 2515224 2415835 2325378 2238273 2156900 2085532 2020016 1954293 1890941 1834885 1782822
58111 1782822 1729055 1675691 1627074 1580120 1530155 1480611 1437024 1396792 1354474 1312040 1274389
58100 1274389 1239693 1203509 1167840 1137144 1109703 1081530 1054370 1031530 1010301 986800 963840
58089 963840 945825 930212 912282 894023 879933 868083 853633 837409 822963 808831 791778
58078 791778 774189 760234 747935 732804 716141 701998 689019 673045 655110 639318 625377
58067 625377 610544 596389 586323 578773 569904 560916 555676 553237 549508 544343 540340 536608 530282
58054 530282 522386 515872 509688 500969 491160 483862 478487 472055 465297 460948 457906 453156 447693 444587
58040 444587 442997 439951 436102 433791 431374 425659 418158 412721 408633 402319 394318 388106 383270 376327
58026 376327 367465 360151 354614 347861 339788 333314 328619 322890 315798 309986 306166 302647 299470 298130
58012 298130 297558 295198 291720 289999 289959 289201 288008 288797 291043 291756 290798 290988 293155 295586 298026 301615
57996 301615 305248 306673 306954 309342 313991 318229 321557 325707 330067 331874 330985 329893 329016 326468 322506
57981 322506 319657 318244 316051 312601 309585 306990 303074 298263 294901 293042 290598 287673 286489 287020
57967 287020 287041 286630 288087 291028 292108 290383 288659 288643 288805 287980 287296 287476 287628 287537 287951 288146 286513 283841
57949 283841 282573 282606 281465 278921 277632 278694 280376 282012 285363 291204 298052 305277 314235 325343
57935 325343 337021 348383 360157 372418 384254 396014 408879 421844 432174 439072 443915 446790
57923 446790 446205 442437 437677 432480 425438 416733 408473 400969 392176 381496 370734 360755 350689 341066
57909 341066 334156 330265 327052 323401 320657 319221 317325 314143 310815 307501 302724 296618 291494 288138
57895 288138 284768 280679 277601 276348 275473 274508 275240 278352 281920 284667 287722 291856 295963 299627 304114
57880 304114 309458 313572 315717 317803 320751 322606 321933 320089 318327 315520 310818 305921 302607 300214
57866 300214 297503 294850 292843 290802 288383 286716 286370 286129 285160 284431 284668 285008 284987 285763 288003 290624
57850 290624 292880 295577 298921 301326 301761 301174 300361 298528 295297 291983 289473 286887 283608 280532 278031
57835 278031 274903 270677 266851 264456 262545 260397 258983 258856 258864 258485 259167 261729 264612 266421 268099 270856
57819 270856 273996 276578 279272 282666 285633 287271 288765 291417 294432 296430 297700 299127 300229 299887
57805 299887 297865 294281 288991 282765 277586 274453 272269 269974 268172 267530 267373 267145 267478 268571 269288
57790 269288 269137 269240 270027 270027 268421 266770 266525 266824 266503 266366 267483 268994 269681 270221 271939 274604 277244
57773 277244 279842 282604 284847 286232 287724 289860 291468 291606 291122 290737 289304 285825 281598 278385 275831
57758 275831 272625 268937 265789 263214 260861 259353 259235 259608 259454 259249 259794 260653 261279 262388 264585 266888
57742 266888 268207 269030 270061 270567 269731 268325 267307 266069 263784 261136 258967 256596 253324 250240 248568
57727 248568 247535 245878 244150 243448 243072 241738 240084 239652 240188 240170 239346 238662 238278 237626 236929 236784 236776 236275
57709 236275 236002 237049 238903 240141 240533 240913 241694 243132 246289 252001 259535 267807 277085 287843 298860
57694 298860 308309 315933 322227 326220 326075 321462 313625 303609 292155 280684 270513 261520 253202
57681 253202 246466 242711 241817 242941 246715 254803 267717 284973 306991 335006 369456 410326 458828
57668 458828 516760 584050 658245 735999 813053 882458 934514 959630 951851 911366 845292 765346
57656 765346 682630 603784 531742 468382 414838 370479 333712 303639 279776 260957 245921
57645 245921 234239 225333 217610 210057 203652 199459 196375 192636 188532 185563 183753 182016 180460 180105
57631 180105 180727 181168 181415 182303 183433 183453 182140 180340 178182 175286 172319 170327 168845 166730 164474 163504
57615 163504 163433 162357 159865 157472 155872 153998 151146 148082 145606 143771 142827 143201 144265 144715 144437 144440
57599 144440 144831 144535 143151 141504 140142 138782 137341 136019 134359 131754 128791 126488 124398 121248 117367
57584 117367 114497 113137 112002 110385 109119 108809 108873 108766 108561 107946 106247 103782 101628 99736 96830 92492
57568 92492 87785 83522 79568 76177 74309 74001 73885 72946 71530 70286 69368 68928 69098 69195 68307 66899 66555
57551 66555 67908 70114 72420 74775 76787 77688 77663 77820 78583 79479 80621 82835 86061 89223 92011 95288
57535 95288 99381 103364 106363 108177 108397 106418 102671 98490 94537 90654 87210 84955 83447 81378 78699
57520 78699 76781 76243 76392 77005 78701 81169 83015 83981 85464 88160 91015 93193 95239 97382 98482
57505 98482 97755 96119 94829 94078 93730 94042 94761 94764 93451 91393 89070 86187 82737 79333 75993 72054
57489 72054 67848 64860 63576 62700 61200 59523 58071 56299 54258 53293 53910 54465 53317 51030 49207
57474 49207 48292 47718 47123 46244 44581 42333 40784 40752 41488 41960 42299 43087 44175 45148 46104 47172 48070 48741
57456 48741 49477 49858 48819 46508 44727 44551 44725 43548 41216 39122 37841 37095 36936 37667 38979 40174
57440 40174 40981 41529 41917 42274 42676 42789 42346 42096 43136 45039 46011 45385 44555 44772 45544 46068 46753 48084
57422 48084 49248 49231 48371 47614 46995 46002 44694 43431 42081 40426 38748 37283 35767 34192 33249 33311 33783
57405 33783 34120 34600 35435 36011 35717 34697 33197 31159 29053 28024 28444 29344 29839 30023 29905 28918 27346
57388 27346 26776 28047 30005 31347 32395 33812 34939 34918 34409 34598 35329 35633 35444 35412 35667 36089 37162
57371 37162 39249 41458 42438 41904 40438 38355 35763 33265 31541 30616 30230 30344 30603 30101 28542 26861
57355 26861 25965 25718 25935 27205 29715 32335 34057 35397 37187 38977 39916 40248 40558 40417 39280 37987
57339 37987 37773 38383 38645 38388 38350 38571 38382 37664 36841 35931 34881 34365 34853 35240 33882 30972 28522 27903
57321 27903 28523 28963 28414 26883 24940 23353 22404 21560 20281 18769 17364 15808 13897 12292 11760 11999
57305 11999 12131 11997 12072 12429 12650 12532 12163 11513 10514 9255 7781 6247 5510 6591 9024 10828 10894 10324
57287 10324 10537 11247 11439 11211 11252 11358 10932 10316 10276 10737 11281 12271 14160 16252 17509 18128 19048 20388
57269 20388 21621 22841 24570 26744 29039 31696 34840 37540 38891 39569 40979 43272 45514 47304 48859
57254 48859 49926 50149 50219 51196 52814 53764 53552 52860 52242 51670 51217 50970 50446 49207 47817 47109 46857 46347
57236 46347 45879 46383 47809 49162 49935 50307 50197 49392 48407 47982 47961 47837 48066 49449 51486 52800 53118 53462
57218 53462 54457 55759 57108 58585 59853 60429 60716 61552 62765 63389 63237 62971 62678 61797 60552 60064 60748
57201 60748 61780 62506 63310 64814 67078 69833 72697 75128 76925 78708 81168 84046 86711 89386 92773
57186 92773 96782 100754 104705 109126 113777 117955 121940 126918 133357 140565 147904 155422 163245 171378
57172 171378 180209 190359 202032 215154 229741 245269 260179 273224 284965 296827 309128 321343
57160 321343 333842 347744 363165 379210 395787 414004 434618 457395 482136 508990 537518
57149 537518 566619 595657 624701 653584 681856 709730 737939 766539 794894 822889 851075
57138 851075 879455 907260 934152 960709 987606 1015200 1043993 1074612 1107191 1141639 1178534
57127 1178534 1218904 1263013 1310145 1359642 1411486 1465920 1523174 1583547 1647251 1714409 1785807
57116 1785807 1863421 1949552 2045321 2149995 2261206 2375854 2492082 2611302 2737826 2876268
57106 2876268 3030091 3202772 3398965 3624154 3884941 4190937 4555739 4996299 5533593
57097 5533593 6195381 7017866 8045197 9328610 10923405 12880396 15236689 18014320
57089 18014320 21223313 24857500 28885132 33246500 37851256 42552676 47111765 51212404
57081 51212404 54561197 57009668 58593340 59457568 59743500 59520680 58787062 57507376 55660327
57072 55660327 53273931 50430451 47240406 43812337 40243304 36625349 33048524 29596021
57064 29596021 26339377 23335274 20620420 18208291 16093389 14258730 12679416 11324391
57056 11324391 10161536 9162733 8303467 7560417 6912956 6345639 5846391 5403484 5006684
57047 5006684 4649441 4326815 4032584 3761116 3510712 3282090 3074528 2886041 2715947
57038 2715947 2564176 2428779 2306806 2196947 2098933 2011323 1932391 1862335 1802136 1751028
57028 1751028 1707613 1672641 1648203 1634965 1632682 1642642 1666635 1703707 1750116 1801523 1851821 1889737
57016 1889737 1900337 1872645 1806152 1710676 1601189 1491636 1390427 1299798 1219083 1147927 1086094
57005 1086094 1032103 984163 941804 905013 872624 843233 816852 793893 773339 753756 735333
56994 735333 718995 704191 689648 675857 664813 657573 653759 653049 655362 659907 665722 672874 681615
56981 681615 690756 698212 702462 702125 695252 681122 662081 641685 621616 602109 584258 569458 557228
56968 557228 546107 536428 529836 526368 524513 524140 526890 533397 542458 553427 567282 584604 604187
56955 604187 624167 642790 657499 664856 662405 649989 629288 603175 575357 549086 525749 505492
56943 505492 488845 476518 468036 462216 458988 459339 463571 471117 482065 497365 517345 541164 567752
56930 567752 596112 624661 651202 673213 687312 689412 677324 653178 622017 588300 554776 523608
56918 523608 496313 472670 451498 432616 416617 403097 390836 379584 369987 361916 354492 347667
56906 347667 342125 337760 333841 330463 328208 326699 325262 324686 326408 330131 334251 338525 344257 351910
56892 351910 360781 371238 384995 402675 423012 444929 468556 493641 518678 542018 562116 576356
56880 576356 581649 577110 564791 547432 527063 505987 487010 471645 459560 450516 445450 445037 448734
56867 448734 456113 467916 485065 507764 536180 570876 611949 658511 709285 762565 815145 862077
56855 862077 897673 916392 913952 889890 849428 801244 752798 708323 670144 639482 615850 598092
56843 598092 586800 584164 591177 606888 630861 664440 708961 764521 831039 908524 995202 1086708
56831 1086708 1177439 1260705 1326997 1364827 1365988 1330177 1264483 1179805 1087762 998150 916660
56820 916660 844981 783586 733518 695249 667640 649347 640329 641150 651866 672450 703334 744601
56808 744601 795279 853823 918186 984611 1046863 1096988 1126630 1128803 1101037 1047870 978958 903859
56796 903859 828989 758644 696179 643074 598690 562230 533924 513753 500621 493670 493131 499132
56784 499132 511099 529068 553962 585454 620781 656579 690353 718958 737133 739544 724305 693937
56772 693937 653587 608851 564190 522093 483586 449430 420084 394738 371773 350538 331562
56761 331562 314966 300127 287105 276735 268840 261983 255507 250181 246249 242545 238357 234494 231590
56748 231590 228900 225790 222957 221139 219880 218537 217286 216288 215118 213771 212955 212624 211707 210030 209063
56733 209063 209848 211618 213283 214758 215974 216196 215366 214662 214710 214717 214243 214128 214659 214661 213626 212963 213734 214902
56715 214902 215435 216407 219089 222427 224470 225242 226220 227732 228834 229249 229802 231184 233432 236230 238775 240002
56699 240002 239810 239297 239106 238549 237146 235712 234941 234202 232912 231798 231528 231301 230124 228378 226779 224933
56683 224933 222273 219463 217530 216527 216130 216443 217075 216750 215182 214104 214905 216404 216504 215024 213349 212288
56667 212288 211841 212165 213239 214285 214858 215684 217259 218694 219242 219760 221251 223133 224526 226042 228591 231485
56651 231485 233495 234882 236637 238605 240147 241808 244531 247860 250646 252930 255537 258419 260931 263139
56637 263139 265378 267223 268256 269036 269936 270016 268553 266661 265710 265156 263734 261804 260539 259575 257529 254252
56621 254252 250724 247301 243879 241158 239811 238896 236919 234054 231608 229828 227982 226038 224538 223319
56607 223319 222081 221594 222596 224113 224650 224359 224194 223771 222202 220344 219888 220585 220653 219669 218824 218501 217891
56590 217891 217055 217182 218511 219833 220277 219996 219146 217893 217339 218597 220907 222372 222585 222819 223734 224677 225309
56573 225309 226127 227224 228145 229060 230591 232486 234007 235538 238242 242248 246805 252071 259006 267544 276564
56558 276564 285734 295659 306101 315604 322989 327875 329948 329335 327576 326530 326284 325631 324343 323301 322539
56543 322539 321049 318619 316138 314004 311803 309569 307731 305815 302826 298962 295443 292670 290067 287539
56529 287539 285475 283529 281075 278619 277012 275602 273144 270289 269029 269639 270299 269877 269044 268371 267316
56514 267316 265555 263548 261421 258898 256527 255309 254959 254214 252907 252051 251835 251335 250340 249686 249700 250016 250847
56497 250847 252577 254164 254010 252471 251426 251344 250949 249890 249412 249997 250557 250454 250240 249985 249033 247847 247949
56480 247949 249436 250644 250821 251026 251799 252172 251732 251571 252245 252803 252698 252810 253683 254554 254979 255660 256832 257545
56462 257545 257382 257200 257425 257280 256459 255852 255873 255780 255428 255971 257906 260022 261123 261357 261231 260869 260900 262383
56444 262383 265066 267253 268048 268261 268615 268718 268395 268334 268704 268787 268559 269006 270311 271340 271528 271633 272179 272788
56426 272788 273391 274279 274689 273428 271316 270775 272387 274165 274926 275998 278530 281431 283230 283992 284169 283456
56410 283456 281962 280747 280065 278787 276500 274403 273197 272059 270697 270316 271331 272091 271259 269710 268801
56395 268801 268443 268114 268119 268568 268674 268222 268224 269083 269731 269579 269667 270836 272450 273901 275642 277720 279076 279408
56377 279408 279991 281550 283054 283661 284088 285029 286031 286916 288458 290642 292161 292670 293547 295342 296641 296663
56361 296663 296832 298317 300055 300702 300684 300904 301232 301640 302913 304863 305710 304652 303228 302880 303098 303212 303854
56344 303854 305189 305838 305209 304897 306159 307901 308730 309068 309716 310311 310765 312206 314862 317059 317855 318586 320238
56327 320238 321606 321907 322825 325879 329846 332967 335741 339395 343412 346760 349823 353158 356039 358105 360596
56312 360596 364064 366807 367474 367281 367760 368480 369048 371132 376129 382808 389511 396716 405203 413893 421884
56297 421884 430432 440229 448735 453055 453699 452947 451454 449228 448000 449431 452386 454888 457394 461423 466445
56282 466445 470983 475467 481214 487802 494130 500759 508642 516928 524661 533167 544043 556174 567561
56269 567561 578698 591329 605277 619485 634919 653351 674259 695895 718604 744326 773712
56258 773712 806278 842494 883314 928714 979024 1036346 1102266 1175715 1255642 1344085 1443635
56247 1443635 1553463 1670869 1795201 1926905 2064087 2203449 2343583 2483938 2621317
56238 2621317 2750599 2868287 2972439 3060073 3127649 3173349 3196245 3194401 3166917 3116835 3049017
56227 3049017 2966108 2869395 2762233 2649132 2532250 2411999 2290304 2170194 2053081 1939401
56217 1939401 1831024 1729888 1635271 1545397 1460682 1382524 1310233 1242406 1179942 1124240 1073753
56206 1073753 1025892 981089 941264 905533 871382 839061 810776 786333 763563 742377 724408
56195 724408 709182 694601 680778 669538 660506 651448 642160 634364 628172 622304 617254 614494 612978
56182 612978 610157 606082 602881 600701 597886 594663 592853 592378 591693 591147 592280 594517 596319 598689 603460
56167 603460 609010 612047 612994 615192 619359 623364 627043 632502 639784 646784 653455 661757 671576 681092
56153 681092 691001 703853 719316 734652 749804 767465 788206 810281 834300 863337 898224 937410
56141 937410 981647 1034132 1095779 1165024 1242438 1330634 1429118 1533738 1641290 1749860 1854643
56130 1854643 1948919 2030158 2100750 2162563 2215728 2262781 2308250 2352867 2392817 2425162 2449200
56119 2449200 2462426 2460970 2445121 2419363 2386078 2344103 2293681 2236986 2172785 2096384 2006478
56108 2006478 1907216 1802746 1695147 1588650 1489996 1402741 1325923 1259228 1204249 1159819 1121836
56097 1121836 1089023 1063590 1045214 1030041 1016731 1007693 1003096 999461 995526 993716 994404 994574 993585
56084 993585 994430 997886 1001300 1004422 1010312 1019010 1026522 1031580 1037298 1044792 1051533 1057414 1065807 1077055
56070 1077055 1087642 1097327 1110160 1126761 1142776 1156850 1172730 1191440 1208855 1223426 1238822
56059 1238822 1256377 1272348 1285256 1298452 1312814 1324576 1333163 1343375 1356874 1369301 1378811 1389508
56047 1389508 1403306 1416494 1427725 1441336 1459249 1477675 1495192 1515750 1540240 1563726 1584721
56036 1584721 1608472 1637198 1666025 1692600 1721564 1755218 1788997 1820762 1855246 1894583 1933744
56025 1933744 1970166 2008443 2050678 2091908 2130016 2170253 2214899 2258728 2299936 2344934 2396790
56014 2396790 2449832 2501383 2557552 2621362 2686826 2751227 2821301 2900391 2981653 3061255 3145829
56003 3145829 3239299 3335176 3429993 3531275 3643672 3760439 3877555 4002717 4141103 4286035
55993 4286035 4433244 4590095 4760860 4937765 5117079 5308779 5519526 5742139 5973273
55984 5973273 6224612 6504352 6804986 7122225 7467841 7850336 8262108 8700376 9180940
55975 9180940 9716037 10299671 10931052 11630224 12413273 13276379 14223649 15285749 16491270
55966 16491270 17847929 19375382 21128795 23168624 25543287 28332330 31673420 35717151
55958 35717151 40594532 46465198 53559752 62144581 72501304 84985731 100046271 118131980
55950 118131980 139643701 164981739 194412593 227614837 263327844 299515488 333671554
55943 333671554 362646577 382383829 388736152 379497695 356008917 322699708 284940000
55936 284940000 247055708 211689193 180129611 152772535 129452685 109757968 93261634
55929 93261634 79557697 68216715 58823393 51041842 44596386 39224254 34696941 30858841
55921 30858841 27599210 24806445 22381820 20269505 18434196 16826249 15396731 14124968
55913 14124968 13001123 11998607 11089275 10268121 9537517 8882286 8283040 7738628 7252997
55904 7252997 6813847 6405328 6028627 5689852 5380094 5086788 4812978 4566524 4341088
55895 4341088 4125705 3923027 3740783 3574524 3415171 3264818 3129483 3004648 2882897
55886 2882897 2767791 2665874 2572827 2481373 2395181 2321404 2256840 2194664 2137598 2091176 2050601
55875 2050601 2007009 1960589 1915313 1867124 1809862 1747361 1687647 1630183 1570127 1510088 1456286
55864 1456286 1407696 1359777 1314564 1276746 1244048 1211469 1180674 1155464 1132443 1105916 1077842
55853 1077842 1053394 1030920 1005815 980164 958890 939994 918072 894109 872638 852480 829317
55842 829317 804457 782416 762719 742335 723026 707997 694473 678011 661104 649057 640326 629474
55830 629474 616931 607270 600185 591815 582983 577651 574757 569652 562349 556648 552344 545761 536904 528920
55816 528920 521620 512388 502377 495061 489791 483293 476332 472444 471348 469975 468793 470735 475065 478549
55802 478549 481604 487187 494729 501171 506798 514043 521662 526018 527001 526853 524501 517128 506221 495989
55788 495989 486780 475931 464103 454776 448350 442619 438213 437604 439479 440002 439038 439511 441469 442778 445100
55773 445100 453125 468044 487396 510886 540354 573994 606186 633015 652639 660816 652463 628419
55761 628419 595449 559132 521601 485784 455707 431662 410379 390866 375372 364160 354398 344899
55749 344899 337104 330767 323519 315434 309287 305490 301317 295933 291653 289476 287822 286499 287456 290623
55735 290623 293172 293829 293862 293088 289195 282037 274597 268621 262996 257233 252666 249285 245115 239722 234885
55720 234885 231134 227171 223306 221819 223231 225703 228748 233959 241575 249911 258675 269160 280641 290306
55706 290306 297229 302623 305714 303604 296132 286912 278399 269635 259896 250702 242782 234643 225619 217280
55692 217280 210603 204766 199671 196518 194958 192924 190279 189430 191430 194570 197696 201679 206738 211575
55678 211575 216093 221722 228181 233230 236491 240068 244374 246856 246110 243857 241598 238700 235172 232915
55664 232915 232592 232335 231056 230099 230287 230430 230167 231202 234191 237366 239702 242451 246065 248716 249528 250198
55648 250198 251631 251962 249786 246528 243628 240123 235088 229945 226207 223152 219640 216052 212667 208313
55634 208313 202457 196546 191676 187010 182009 177923 175430 173117 170020 167450 166540 166162 165076 164014 163795
55619 163795 163465 162210 161238 161837 163273 164308 165047 165673 165135 162802 159793 157199 154669 152084 150613 150496
55603 150496 149796 147167 144077 142497 142077 141409 140448 139829 139223 138160 137251 137046 136911 136375 136234 137053 138034
55586 138034 138677 140018 142888 146515 150149 154427 159750 165006 169495 174534 181590 190247 199558 209969
55572 209969 222347 236490 252066 269727 289808 311107 332131 352231 370322 384084 391827 393879
55560 393879 391048 383317 371254 356844 341381 324224 305130 286143 269397 254605 240517 227478
55548 227478 216687 208140 201043 195193 190381 185616 180501 176282 174038 172987 172028 171666 172783 174726
55534 174726 176313 177700 179528 181144 181302 179901 177661 174813 171374 167876 164618 160995 156587 151995
55520 151995 147712 143331 138790 135002 132219 129238 125398 121825 119413 117145 113935 110610 108453 107136
55506 107136 105756 104583 104075 103372 101533 99205 97428 95814 93564 91256 90024 89872 90311 91583 93733
55491 93733 95551 96058 96057 96685 97469 97370 96691 96306 96037 95405 94929 95016 94590 92651 90224 88944 88590 87841 86714
55472 86714 86305 86760 87340 88041 89492 91635 93925 96298 98646 100052 99957 99343 99366 99681 99548 99600 100801 102486
55454 102486 103235 103038 102939 103191 103386 103764 104690 105403 104960 103923 103563 103971 104425 104940 105835 106473 106191 105869 106797
55435 106797 108438 109114 108526 107903 107917 108146 108351 108784 109402 110124 111513 113833 115932 116520 116132 116360 117589
55418 117589 119008 120393 122264 124579 126791 128995 131608 134209 135993 137071 138012 138533 137909 136272 134196
55403 134196 131552 128097 124567 121733 119013 115593 112306 110682 110611 110646 110268 110152 110488 110730 110850 111318 112023
55386 112023 112595 113451 115071 116631 116951 116458 116619 117670 118437 118131 116867 114758 112039 109730 108654 108083
55370 108083 106845 105266 104394 103851 102316 99855 97902 97150 97235 98221 100485 103241 105076 105988 107086 108340
55354 108340 108508 107393 106350 106327 107053 108240 109894 111277 111232 109773 107888 105855 103374 101273 101051 102502
55338 102502 103696 103718 103631 104303 105077 105207 104988 104806 104467 104077 104312 105235 105960 105868 105126 103850 102002 100249
55320 100249 99605 100033 100630 101279 102706 104796 106361 106864 107002 107322 107649 108066 109053 110381 111224 111538 112054
55303 112054 112767 112842 112125 111278 110361 108891 107430 107308 108506 109484 109513 109459 109823 109819 109109 108757 109619 111105 112252
55284 112252 112814 112777 112139 111650 112398 114087 115076 114574 113449 112458 111286 109891 109211 109730 110684 111351 111753 111595
55266 111595 110144 107876 106599 106970 107369 106290 104501 103754 104573 106367 108558 110551 111601 111774 112121 113055
55250 113055 113565 112822 111514 110690 110318 109940 109732 109903 109930 109380 108726 108494 108370 107991 107814 108292 108897 108800 107970
55231 107970 106885 105753 104669 103956 103791 104025 104681 105975 107567 108653 109063 109299 109339 108580 107322 106899 107763
55214 107763 108755 108972 109038 109692 110479 110805 111151 112127 113322 114141 114876 115919 116753 116756 116297 116076 116053 115878 115688
55195 115688 115623 115233 114172 112829 111643 110494 109394 108890 109012 108765 107516 106089 105607 106053 106796 107760 109101
55178 109101 110413 111141 111269 110922 109939 108536 107644 107858 108739 109711 110843 112075 112679 112308 111785 111998 112842
55161 112842 113940 115453 117332 118778 119337 119603 119878 119191 116855 114069 112655 112857 113592 114204 114682 114728 113968
55144 113968 112871 112311 112491 113146 114379 116242 117923 118423 117818 116996 116438 116057 115840 115794 115643 115373 115673 116970
55126 116970 118408 118671 117511 115732 114026 112620 111702 111429 111740 112704 114568 116992 118859 119460 119208 118572
55110 118572 117184 114857 112652 111855 112513 113897 115743 117935 119703 120340 120317 120595 121268 121877 122490 123322 123813
55093 123813 123394 122779 123164 124391 125236 125371 125726 126798 127863 128104 127579 126816 126201 125969 126176 126539 126721 126687
55075 126687 126385 125446 123796 122221 121617 122002 122837 123888 124993 125502 124887 123652 122818 122755 123237 124205 125546
55058 125546 126530 126503 125956 125905 126368 126381 125437 123969 122521 121326 120689 120906 121709 122444 122803 122821 122382 121400 120339
55039 120339 119822 119829 119892 119899 120041 120187 120046 119793 119842 120152 120358 120381 120320 120008 119320 118655 118478 118656 118849 119185 119883
55018 119883 120600 120819 120555 119992 118929 117341 116003 115701 116254 117113 118452 120636 123129 125031 126417 128042
55002 128042 129947 131405 132115 132469 132766 133085 133733 134908 136089 136680 137027 137869 139063 139895 140374 141087 141930
54985 141930 142160 141713 141339 141356 141302 140933 140588 140411 140103 139551 138957 138311 137521 136978 137178 137877 138394 138610 138806
54966 138806 138814 138376 138154 139172 141224 142949 143571 143540 143357 142943 142378 142204 142594 143011 142952 142349 141186 139529
54948 139529 137980 137289 137361 137423 137122 136668 136018 134999 134220 134696 136348 137878 138441 138517 138901 139786 141155 143187
54930 143187 145833 148669 151503 154585 158088 161958 166278 171152 176349 181813 188271 196303 204915 212221
54916 212221 217594 221978 225934 228620 229091 227427 224091 219171 212878 205955 199085 192480 186341 180970
54902 180970 176153 171277 166410 162463 159964 158397 157053 155723 154264 152365 150231 148786 148684 149652 151096
54887 151096 152785 154680 156737 159130 162159 165842 170109 175298 181711 188762 195503 201956 208914 216353
54873 216353 223243 229052 234216 238682 241176 240547 236929 231059 223416 214601 205701 197595 190450 184291
54859 184291 179378 175641 172494 169618 167260 165554 164353 163870 164500 165653 165811 164193 161462 158509 155575
54844 155575 152975 151395 150754 149853 147925 145599 143652 141862 139924 138503 138352 139094 139758 139865 139287 137811
54828 137811 135750 134252 134082 134652 135035 135295 136003 137098 138126 139069 140087 140974 141665 142684 144231 145446
54812 145446 145566 145238 145623 146592 147027 146686 146636 147733 149609 151417 152897 154417 156298 158255 159477 159401 158409
54795 158409 157381 156520 155335 153925 153329 154070 155219 155647 155467 155344 155086 153999 152237 150785 150237 150449
54779 150449 151181 152311 153571 154868 156769 159975 164357 169108 173800 178823 184865 192405 201500 211605
54765 211605 221793 231608 241504 252009 262742 272688 281033 287236 290635 290760 287880 282686 275536 266493
54751 266493 255949 244721 233548 222808 212586 202786 193460 185245 179058 175023 172145 169446 166965
54738 166965 165264 164414 163972 163549 162958 162221 161852 162612 164504 166563 168174 170016 173092 177466 182689 188876
54722 188876 196400 204881 213381 221369 228697 234873 239125 241017 240377 236956 230908 223300 215356 207383
54708 207383 199172 191154 184269 178856 174548 171141 168690 166781 164635 162053 159566 157552 155892 154521
54694 154521 153585 152867 151711 149783 147515 145618 144537 144348 144739 145092 144997 144747 144946 145673 146392 146582 146116
54677 146116 145170 144125 143414 143029 142440 141409 140535 140484 140977 141281 141389 141893 142766 143173 142566 141268 139799 138308
54659 138308 136888 135890 135564 135710 135958 136154 136445 137147 138441 139929 140685 140197 139123 138667 139232 140174 140794
54642 140794 141047 141181 141206 140954 140428 139937 139920 140577 141516 141978 141614 140844 140257 139982 139909 140138 140734 141332 141519 141468
54622 141468 141734 142532 143524 144158 143918 142591 140610 138826 137575 136407 135094 134308 134646 135539 135972 135903 136096
54605 136096 136796 137529 138132 139014 140275 141372 141866 141956 142102 142570 143387 144283 144780 144741 144703 145156 145748 145806 145429
54586 145429 145304 145584 145762 145657 145671 145945 146071 145869 145741 145937 146066 145715 145163 145101 145875 147154 148197 148425 147955
54567 147955 147484 147425 147412 146982 146427 146446 147174 148163 149149 150220 151263 151931 152126 152062 151887 151715 151862 152454 152939
54548 152939 152639 151748 151176 151489 152593 154288 156429 158597 160337 161710 162983 163895 163972 163515 163467 164241 165403
54531 165403 166427 166978 166520 164701 162261 160561 159949 159473 158454 157366 156764 156303 155465 154446 153638 152859
54515 152859 151846 151042 151179 152256 153497 154165 154070 153461 152758 152277 152066 152102 152603 153803 155388 156643 157239
54498 157239 157479 157653 157679 157518 157434 157574 157707 157632 157492 157514 157754 158204 158751 158967 158416 157333 156556 156561 156956 157055 156658
54477 156658 156131 156042 156747 157998 159047 159516 159965 161049 162327 162675 161887 160993 160895 161523 162532 163963 165734
54460 165734 167183 167669 167227 166307 165325 164671 164589 164780 164623 163983 163264 162550 161424 159931 158869 158645 158578 157909
54442 157909 156888 156231 155971 155547 154714 153824 153364 153611 154471 155384 155726 155566 155673 156481 157497 158001 157940 157790
54424 157790 158017 158971 160779 162939 164521 165192 165619 166472 167511 168106 168124 167788 167113 166070 165014 164411 164375
54407 164375 164795 165543 166217 166230 165606 165173 165469 166016 166325 166981 168789 171264 172995 173391 173168 173112 173264 173443
54389 173443 173713 174030 174084 173903 174115 175216 176837 178036 178130 177102 175425 173721 172458 171771 171552 171616 171683 171319
54371 171319 170274 168930 168151 168488 169654 170904 171836 172643 173712 175213 177134 179412 181749 183494 184139
54356 184139 184028 184125 184938 186051 187000 188120 190083 192958 196270 199683 202984 205635 207121 207691 207981 207924
54340 207924 206860 204782 202551 200541 197962 194100 189545 185576 182747 180715 179047 177633 176485 175673
54326 175673 175392 175730 176440 177165 177701 177920 177667 177004 176372 176248 176720 177471 178057 178208 178020 177814 177563 176635 174577
54307 174577 172007 170223 169882 170505 171202 171347 170681 169469 168544 168464 168619 168051 167158 167557 169938 173052 175262
54290 175262 176125 175967 174877 172936 170779 169124 168143 167781 168108 168911 169670 170453 172060 174619 176846 177519
54274 177519 176968 176288 175805 175341 175305 176295 177917 179174 179844 180500 181292 181742 181731 181780 182241 182956 183757 184663 185549
54255 185549 186264 187012 188015 188859 188896 188256 187759 187768 187761 187219 186308 185509 184976 184498 183764 182607 181211 180053 179413
54236 179413 179088 178816 178720 179009 179485 179812 180004 180240 180462 180600 180931 181661 182437 182780 182755 182624 182146 180969 179504
54217 179504 178673 178755 179213 179621 180130 180884 181618 181979 181841 181131 179768 177893 175946 174471 174009 174914 176916
54200 176916 179077 180562 181291 181587 181510 181002 180370 179969 179647 179005 178040 177019 175956 174832 174095 174270 175107
54183 175107 175741 175678 175148 174603 174388 174758 175707 176827 177802 178814 179983 180714 180270 178862 177515 176964 177209
54166 177209 177881 178399 177995 176415 174495 173290 172763 172064 170987 170254 170356 170972 171618 172123 172366 172315 172420 173240
54148 173240 174524 175333 175172 174421 173649 173237 173592 174858 176280 176734 176144 175588 175829 176552 177250 177936 178552 178560
54130 178560 177700 176527 175728 175431 175600 176439 177887 179279 180089 180549 181090 181584 181707 181648 181950 182857 184226 185864
54112 185864 187567 189058 190227 191318 192594 193910 194788 194800 193878 192488 191471 191347 191687 191519 190455 189131
54096 189131 188489 188965 190339 191975 193147 193585 193720 194054 194355 194001 193011 192120 191847 192157 193044 194615 196374
54079 196374 197278 196973 196352 196484 197484 198809 200135 201556 203372 206012 209778 214351 218983 223421 228164
54064 228164 233589 239383 245201 251247 257733 264180 269672 273389 274559 272523 267524 261087 254991 249969
54050 249969 245747 242008 238788 236147 233963 232163 230945 230762 232124 235115 239028 242776 245833 248524
54036 248524 251385 254696 258731 263851 270017 276601 282950 288792 294004 298526 302744 307307 312177 316410
54022 316410 319320 321305 323070 324606 325536 326025 326622 327424 327984 327861 326798 324584 321292 317491 313715 309821
54006 309821 305326 300285 295338 290923 286863 282794 278683 274839 271536 268649 265678 262335 259137 257068
53992 257068 256499 256718 256711 256030 254758 253091 251383 250203 249901 250283 251066 252429 254751 257974 261556 264864
53976 264864 267367 268741 269147 269207 269313 269067 267770 265345 262457 259748 257222 254426 251084 247575 244761
53961 244761 243228 242721 242560 242551 243106 244454 246233 247983 249609 251194 252813 254723 257235 260132 262666 264508
53945 264508 266268 268805 272392 276858 282059 287816 293781 299785 305980 312319 318259 323312 327511 330998
53931 330998 333564 335024 335651 335871 335904 336048 336883 338759 341475 344811 348928 353849 359148 364631 370812 378148
53915 378148 386369 395214 405310 417540 431967 448115 465869 485179 505218 524693 542734 558461
53903 558461 569906 574615 571715 562671 549898 535266 519972 504866 490434 476937 464803 454341
53891 454341 445004 435645 425823 416260 407607 399324 390300 380273 370169 361158 353746 347679 342386 337410
53877 337410 332498 327411 321853 315788 309717 304356 299988 296251 292595 288773 284904 281212 277774 274522
53863 274522 271514 269033 267170 265391 262936 259762 256608 253966 251513 248879 246391 244489 242856 240865
53849 240865 238641 236976 236233 235849 235048 233621 232028 230977 230862 231321 231489 230904 229896 228984 228289 227886 228076
53832 228076 228745 228952 228008 226631 226180 226865 227498 227018 225549 224028 223467 224463 226658 228669 229306 228981 229227
53815 229227 230832 233226 235769 238653 242210 246083 249611 252479 254616 256025 257111 258668 261098 264038
53801 264038 267162 270927 276072 282594 289656 296332 302189 307391 312506 318028 323780 328935 332875 335908
53787 335908 338902 342283 345572 347898 348805 348554 347695 346500 344983 343335 341859 340292 337742 333757 329123
53772 329123 324950 321265 317222 312532 307840 303640 299652 295541 291492 287676 283780 279572 275543 272429
53758 272429 270318 268530 266244 263028 259038 254911 251277 248179 245218 242333 240050 238746 238062 237424 236822
53743 236822 236713 237246 237956 238273 238120 237926 238080 238450 238625 238632 239085 240366 241944 242951 243190 243084 242839 242390
53725 242390 242119 242785 244471 246324 247724 249083 251005 253212 254862 255613 255728 255366 254398 252995 251921 252034
53709 252034 253666 256490 259876 263348 266791 270218 273395 275887 277521 278653 279929 281866 284638 288052
53695 288052 291663 295095 298290 301348 304214 306698 308669 309942 310207 309455 308361 307712 307528 307247 306729 306408
53679 306408 306386 306080 305081 303701 302357 300985 299525 298389 297901 297641 296991 296041 295397 295233 295095 294569 293657
53662 293657 292502 291177 289829 288677 287775 287018 286455 286371 286959 288000 288918 289147 288524 287414 286421 285926 285950
53645 285950 286436 287433 288852 290241 291046 291216 291443 292698 295307 298465 300868 302032 302774 304161 306236 308199
53629 308199 309605 310766 312022 313280 314482 315919 317740 319647 321452 323549 326431 330027 333858 337611
53615 337611 341199 344502 347555 350862 355107 360495 366602 372816 378680 383856 388059 391217 393664 396045
53601 396045 398878 402085 405077 407499 409791 412697 416235 419549 421900 423394 424577 425720 426792 427849
53587 427849 429033 430243 431043 430918 429596 427255 424519 422060 420073 418181 415822 412665 408747 404464 400341
53572 400341 396501 392465 387815 383034 379220 376989 376083 376016 376484 377040 377090 376561 376064 376024 376138 376016 375871 376156
53554 376156 376959 378190 379960 382241 384463 385987 386859 387630 388660 389981 391641 393702 396026 398483 401284
53539 401284 404751 408844 413242 417717 422098 426098 429661 433421 438339 444788 452257 460013 467791 475877
53525 475877 484768 494742 505657 517118 528982 541497 554879 568919 583242 597756 612663 628254
53513 628254 644928 663193 683276 704801 727123 749907 773194 797080 821574 846627 871986
53502 871986 897100 921415 944735 967160 988766 1009503 1029294 1048118 1066154 1083873 1101752
53491 1101752 1119801 1137711 1155517 1173645 1192091 1210178 1227576 1245015 1263353 1282329 1300895
53480 1300895 1318543 1335559 1352119 1367981 1383095 1397679 1411408 1423150 1431941 1437805 1441337 1442897
53468 1442897 1442546 1440399 1436462 1430283 1421298 1409616 1396138 1381757 1366721 1350947 1334720 1318668
53456 1318668 1303012 1287154 1270195 1251661 1231637 1210510 1188865 1167400 1146483 1125885 1105315
53445 1105315 1085096 1065895 1047884 1030729 1014410 999413 986057 974243 964056 955910 949789 944986
53433 944986 941017 938189 936798 936396 936460 937279 939465 942948 947210 952196 958298 965600 973890 983376 994686
53418 994686 1008107 1023383 1040237 1058618 1078403 1099388 1121588 1145168 1170121 1196374 1224113
53407 1224113 1253533 1284356 1316150 1349073 1383776 1420599 1459392 1500082 1542821 1587472 1633575
53396 1633575 1681039 1730392 1782013 1835434 1889605 1943611 1997072 2050127 2103119 2156098 2208599
53385 2208599 2260171 2310942 2361192 2410412 2457374 2501290 2542343 2580858 2616420 2648131 2675356
53374 2675356 2697891 2715717 2728963 2737944 2742918 2743822 2740329 2731939 2717816 2696905 2668640 2633633
53362 2633633 2593444 2549614 2503022 2454062 2403196 2351155 2298659 2246112 2193676 2141612 2090427
53351 2090427 2040698 1992881 1947271 1903833 1861983 1820773 1779570 1738440 1697716 1657378 1617079
53340 1617079 1576679 1536570 1497581 1460693 1426641 1395538 1366963 1340517 1316160 1293883 1273435
53329 1273435 1254621 1237644 1222778 1209787 1197859 1185930 1173065 1158953 1144355 1130652 1118500
53318 1118500 1107238 1096029 1085164 1075667 1067923 1061463 1055981 1051794 1049237 1048235 1048644 1050531 1053940
53305 1053940 1058709 1064615 1071486 1079235 1088130 1098897 1112100 1127507 1144463 1162731 1182453 1203435
53293 1203435 1225206 1247850 1272094 1298372 1326318 1355325 1385018 1414852 1443745 1470622 1495131
53282 1495131 1517552 1538070 1556304 1571518 1583283 1592029 1598721 1603721 1606167 1604909 1599952 1592481 1583477
53269 1583477 1572801 1559721 1543898 1525683 1505761 1484638 1462353 1438721 1413972 1388823 1363577
53258 1363577 1337506 1309781 1280800 1251908 1223854 1196222 1168436 1140571 1113018 1085954 1059420
53247 1059420 1033413 1007741 982211 957056 932720 909118 885669 862159 839066 816929 795889
53236 795889 775918 756922 738526 720440 703210 687929 674949 663443 652512 642120 632663 624192
53224 624192 616373 608714 600552 591308 581028 570232 559095 547335 534972 522468 509952 497127
53212 497127 484286 472509 462332 452982 443567 434346 426165 419225 413023 407030 400826 394101 387104
53199 387104 380596 374789 368928 362526 356328 351259 347040 342799 338547 334931 331816 328233 323742 318955
53185 318955 314604 310902 307826 305263 302832 300257 297972 296653 296138 295541 294519 293654 293388 293314 292804 291737
53169 291737 290313 288707 287242 286366 286037 285521 284218 282392 280736 279516 278473 277350 276085 274628 272964
53154 272964 271344 270239 269935 270296 270872 271154 270789 269772 268499 267457 266746 265962 264756 263453 262856 263291
53138 263291 264133 264536 264414 264351 264724 265447 266517 268174 270309 272244 273474 274280 275281 276662 278152 279385
53122 279385 280001 279694 278617 277564 277369 278184 279532 280842 281743 282142 282328 282765 283481 283964 283942 283917 284449 285145
53104 285145 284911 283143 280301 277397 275231 273979 273175 272127 270609 269036 267825 266872 265887 264844 263712
53089 263712 262153 260035 258009 256972 257086 257769 258501 259114 259476 259526 259596 260081 260768 260967 260383 259418 258602 258186
53071 258186 258306 259070 260310 261628 262755 263559 263762 263059 261602 259984 258677 257771 257212 256913 256608 256018 255287
53054 255287 254928 255262 256141 257230 258251 259030 259608 260302 261335 262461 263241 263553 263477 262865 261571 259994 258763
53037 258763 257926 256997 255870 255003 254566 254140 253509 253148 253467 254110 254481 254573 254804 255302 255830 256293 256886 257744 258724
53018 258724 259532 259945 259994 260021 260372 261016 261622 262108 262813 263980 265324 266325 266723 266570 266033 265408 265099 265325
53000 265325 265938 266693 267540 268432 269091 269294 269288 269543 270114 270611 270851 271176 271889 272696 273136 273420 274334 276153 278101
52981 278101 279296 279880 280744 282296 284154 286002 287993 290085 291730 292739 293797 295418 296847 296895 295676
52966 295676 294660 294930 296168 297575 299067 301108 303780 306486 308419 309160 308920 308300 307632 306521 304265
52951 304265 300762 296719 292954 289829 287414 285785 284923 284482 283891 282658 280677 278423 276753 276167 276303
52936 276303 276394 276173 276013 276215 276585 276739 276398 275388 273779 272137 271194 271082 271241 271238 271284 271729 272398 272777 272643
52917 272643 272220 271780 271266 270381 269089 267972 267806 268608 269445 269544 269204 269119 269197 268877 268363 268475 269188 269409 268561
52898 268561 267402 266754 266324 265498 264549 264155 264273 264377 264450 264858 265442 265570 265054 264291 263601 263085 263053 263816 265013
52879 265013 265869 266241 266696 267373 267539 266657 265315 264599 264973 266209 267989 269991 271644 272536 273074 274240 276549
52862 276549 279571 282568 285156 287174 288305 288262 287102 285098 282457 279531 277087 275796 275368 274741 273283
52847 273283 271384 269590 267687 265118 261952 258838 256154 253767 251628 250048 249275 249168 249386 249623 249619 249272
52831 249272 248766 248327 247916 247498 247442 248224 249768 251534 253145 254386 254745 253826 252335 251734 252492 253460 253500 252935
52813 252935 252719 252912 252952 253023 253992 256000 258081 259433 260308 261291 262283 262656 262034 260492 258201 255323 252272
52796 252272 249708 248073 247185 246436 245372 244005 242525 241022 239659 238860 238886 239346 239672 240121 241654 244528
52780 244528 247589 249465 249975 249888 249707 249467 249486 250411 252338 254506 256109 256935 257035 256298 254827 253374 252844
52763 252844 253294 253773 253273 251743 250076 249197 249260 249711 249967 249899 249759 249893 250546 251720 253056 254020 254344 254206
52745 254206 253945 253784 253957 254850 256736 259429 262335 264864 266729 268070 269389 271191 273440 275530 276933
52730 276933 277787 278697 280108 282060 284346 286652 288615 289979 290716 290886 290527 289766 288845 287858 286652 285148
52714 285148 283545 282038 280580 279167 278077 277522 277286 277037 276778 276590 276212 275370 274390 273873 273817 273627 273043
52697 273043 272485 272298 272266 272197 272516 273794 275955 278397 280738 282990 285033 286391 286738 286363 285912 285758 285808
52680 285808 285845 285847 285877 285808 285356 284351 282888 281275 279953 279352 279482 279655 278976 277320 275569 274641 274526 274571 274513
52661 274513 274751 275635 276911 278008 278660 279076 279677 280812 282631 285071 287974 291179 294476 297526 299936
52646 299936 301392 301708 300823 298878 296279 293547 291116 289223 287887 286849 285684 284180 282613 281521 281208
52631 281208 281575 282386 283506 284851 286195 287204 287711 287969 288426 289114 289410 288630 286874 284990 283685 282949
52615 282949 282376 281679 280761 279709 278976 279183 280353 281648 282256 282318 282557 283181 283735 283925 284042 284444 285131 286039
52597 286039 287307 288916 290299 290682 289843 288338 286974 286180 285905 285941 286228 286834 287823 289219 290922 292524
52581 292524 293392 293314 293040 293755 295843 298487 300553 301536 301510 300681 299407 298261 297538 296867 295748 294299 293080
52564 293080 292268 291511 290512 289350 288167 286939 285632 284314 283083 282084 281504 281302 281068 280509 279931 279843 280205
52547 280205 280504 280578 280800 281335 281751 281611 281084 280668 280557 280552 280411 280103 279820 279876 280386 280977 281067 280628 280496 281593
52527 281593 283888 286270 287485 287117 285689 284003 282558 281582 281316 281951 283331 285082 287150 289860 293250
52512 293250 296740 299787 302576 305644 309022 312240 314986 317296 319093 320041 319886 318574 316077 312567 308798
52497 308798 305788 303879 302483 300917 299105 297266 295363 293232 291007 289004 287309 285837 284830 284916 286446
52482 286446 288870 291027 292137 292458 292871 293984 295850 298345 301325 304295 306473 307532 307959 308439 309234
52467 309234 310466 312478 315334 318331 320716 322649 324774 327000 328511 328911 328595 327856 326375 323841 320436
52452 320436 316515 312313 308200 304649 301724 299095 296734 294976 293718 292232 290143 287964 286272 285011
52438 285011 284066 283854 284657 285843 286496 286525 286473 286484 286178 285436 284584 283826 283109 282596 282669 283328 284080 284629 285273 286396
52418 286396 287916 289450 290781 291965 293214 294887 297356 300556 303806 306467 308896 312420 318134 325806
52404 325806 334211 342447 350578 358922 367129 374269 379573 382624 382992 380262 374625 367131 359147 351664
52390 351664 345116 339506 334566 330019 325815 322056 318707 315737 313545 312844 313884 315991 318149 319935
52376 319935 321737 324162 327403 331108 334780 338285 341939 346052 350498 354831 358644 361631 363534 364396
52362 364396 364715 364982 365159 364970 364518 364137 363801 363234 362545 362116 361874 361375 360621 360167 360273 360722 361567 363254
52344 363254 365699 368064 369884 371706 374121 376858 379418 381936 384829 388151 391925 396591 402369 408708
52330 408708 415128 422184 430800 440992 452007 463459 475507 488140 501073 514278 527855 541496
52318 541496 554760 567787 580985 594125 606554 618314 630307 643267 657229 672050 687644
52307 687644 703568 719133 734295 749857 766545 784350 802899 821841 840591 858274 874286
52296 874286 888529 900904 911099 919107 925393 930148 932845 932991 930835 926976 921680 915155 908170 901686
52282 901686 895844 889858 883070 875861 869424 864771 862019 860514 859579 859093 859379 860698 863113 866743 871730
52267 871730 877864 884622 891787 899689 908554 917901 927053 936168 946282 958196 971624 985628 999717
52254 999717 1014192 1029425 1045132 1060578 1075282 1089104 1101672 1112153 1119870 1124864 1127652 1128727
52242 1128727 1128543 1127637 1126255 1124058 1120713 1116630 1112546 1108423 1103470 1097396 1090962 1084897 1078794 1071668
52228 1071668 1063321 1054657 1046709 1039844 1033881 1028598 1023914 1019801 1016220 1013119 1010441 1008151 1006294 1005022
52214 1005022 1004520 1004900 1006157 1008239 1011126 1014782 1019119 1024164 1030107 1036848 1043543 1049161 1053701 1058363
52200 1058363 1064065 1070220 1075606 1080144 1085022 1091171 1098329 1105781 1113255 1120811 1128395 1135899 1143222 1149935
52186 1149935 1155258 1158721 1160538 1161005 1159905 1156832 1151837 1145323 1137549 1128577 1118589 1107912 1096919 1086205
52172 1086205 1076587 1068515 1061652 1055482 1050184 1046360 1043960 1042124 1040322 1039182 1039818 1042566 1046660 1050989
52158 1050989 1054868 1058110 1060647 1062233 1062552 1061588 1059859 1058105 1056674 1055340 1053849 1052468 1051746 1051787 1052105
52143 1052105 1052344 1052854 1054208 1056252 1058041 1058759 1058399 1057442 1056194 1054723 1053206 1052009 1051534 1052260 1054801 1059551
52127 1059551 1066300 1074623 1084678 1097181 1112398 1129530 1147472 1165953 1185564 1206744 1229064 1251562
52115 1251562 1273509 1294695 1315151 1334778 1353245 1370148 1385301 1398934 1411637 1424060 1436598
52104 1436598 1449412 1462650 1476494 1490881 1505341 1519306 1532522 1544925 1556093 1565121 1571211 1574234
52092 1574234 1574575 1572542 1567992 1560419 1549370 1535029 1518514 1501436 1484970 1469502 1455091 1441901
52080 1441901 1430041 1419415 1410027 1402082 1395436 1389371 1383413 1378137 1374602 1373197 1373606 1375756 1380059 1386607
52066 1386607 1394705 1403467 1412516 1422009 1432342 1443879 1456565 1469706 1482462 1494704 1507032 1519867
52054 1519867 1532830 1545036 1555662 1564254 1570864 1575869 1579246 1580134 1577706 1572369 1565316 1556819 1545883
52041 1545883 1532007 1516420 1500861 1485833 1470830 1455868 1441823 1429262 1417655 1405944 1393619
52030 1393619 1381172 1369662 1359736 1350951 1342310 1333498 1325109 1317483 1310000 1302072 1294195 1287160 1280647
52017 1280647 1273612 1265974 1258874 1253074 1247970 1242643 1237156 1232262 1228213 1224333 1219547 1212942 1203931 1192229
52003 1192229 1177723 1160332 1140184 1117966 1094850 1071886 1049623 1028358 1008415 989900 972396
51992 972396 955245 938161 921313 904876 888679 872364 855743 838913 822087 805333 788544
51981 788544 771662 754868 738480 722646 707270 692198 677355 662726 648459 635100 623492
51970 623492 614162 606930 601417 597900 597309 600178 605907 613263 621388 629953 638517 646258 652439 656679
51956 656679 658591 657711 654145 648905 643031 636592 629154 621116 613901 608674 605438 603687 603447 605287 609625
51941 609625 616427 625396 636142 648288 661604 675892 690517 704305 716232 726103 734264 740668
51929 740668 744490 744656 740608 732585 721359 707762 692453 676067 659386 643070 627203 611512
51917 611512 596186 582153 570314 560814 553302 547604 543798 541943 542218 545197 551413 560663 572171
51904 572171 585560 601251 619652 640115 660863 679841 695518 706952 713301 713529 706821 693289
51892 693289 674070 650755 625008 598775 574222 552926 535227 520810 509694 502239 498311 497047
51880 497047 497589 499591 502892 507201 512510 519466 528780 540173 552208 563322 572839 580845 587194 590991
51866 590991 591215 587688 581246 573132 564492 556246 548890 542328 536389 531636 529136 529108 530323 531292 531586
51851 531586 531488 530824 528989 525979 522577 519388 516223 512520 507890 502257 496009 490045 485028 480520 475497
51836 475497 469956 465225 462362 460970 460153 460014 461340 464148 467396 470136 472224 473796 474697 474690 473725 471725
51820 471725 468476 464134 459617 456145 454411 454297 455236 456633 458113 459698 461694 464116 466278 467299 467055
51805 467055 466241 465364 464124 462112 459706 457780 456716 456244 456124 456337 456609 456507 456212 456510 457555 458218 457238
51788 457238 454674 451667 449090 446980 445015 442872 440251 437290 434932 434212 434996 436015 436352 436345 436825 438061
51772 438061 439918 442610 446693 452411 459490 467680 477141 488112 500237 512347 523007 531298 537036
51759 537036 540274 540890 538845 534552 528643 521517 513430 504890 496518 488612 481263 474850 469857 466126
51745 466126 462804 459317 456022 453720 452845 453337 455029 457892 462081 467823 475024 482981 490793 498144 505325
51730 505325 512449 519066 524626 528836 531449 532382 532351 532794 534675 537671 540850 543564 545185 544590 540852
51715 540852 534385 526788 519604 513618 509054 505690 502742 499341 495331 491256 487485 483883 480432 477687
51701 477687 476388 476861 478868 481634 483926 484598 483420 481207 478963 477147 475827 475141 475236 475949 476830 477372
51685 477372 476967 474917 470909 465549 460123 455647 452276 449663 447661 446518 446490 447602 449773 452886 456499
51670 456499 459750 462032 463811 466432 470963 477543 485975 496426 509021 522988 536720 548641 557537
51657 557537 562164 561353 555050 545016 534061 524546 517626 513578 512339 513629 516833 521071 525474 529280
51643 529280 531569 531005 526277 517137 504944 491921 479844 469500 461078 454459 449119 444308 439691
51630 439691 435542 432104 429114 426285 423890 422410 421768 421408 421096 421127 421583 421783 420780 418296 415008 412025
51614 412025 410144 409473 409578 409948 410382 410896 411403 411629 411405 410930 410697 411256 413011 416030 419944 424195 428493
51597 428493 432999 438020 443770 450498 458596 468244 478970 489791 499702 507804 513018 514199 510940 504168
51583 504168 495690 487133 479464 473330 469409 468081 469014 471542 475672 482476 493140 507682 524850 543236
51569 543236 562159 581486 601200 621631 643673 667976 693834 719518 744043 768277 794168
51558 794168 823334 856578 894061 935036 977478 1018516 1055294 1085141 1105327 1113674 1109809 1095271
51546 1095271 1072083 1041553 1004682 963051 918620 872921 827102 782637 741286 704130 671098
51535 671098 641722 616014 594294 576463 561833 549577 539001 529374 519922 510249 500742 492325
51523 492325 485759 481074 477530 474118 470280 466358 463267 461513 460525 459170 456990 454684 453227 452780 452740
51508 452740 452713 453004 454015 455575 457133 458523 460227 462792 466073 469126 470907 471151 470573 470136 470081 469827
51492 469827 468768 467030 465336 464287 463934 463862 463474 462226 459873 456571 452661 448343 443656 438752 433918
51477 433918 429228 424382 419099 413591 408453 404136 400677 397907 395629 393564 391361 388871 386269 383777
51463 383777 381378 378963 376619 374541 372777 371305 370297 370016 370433 371252 372367 374052 376600 380038 384223
51448 384223 388938 393784 398429 403199 409108 416955 426656 437780 450438 465058 481300 497621 511952
51435 511952 522593 528666 530325 528734 525495 521841 518291 514749 510469 504125 494747 482867 470351
51422 470351 458870 448905 440308 433163 427591 423259 419733 417160 415971 416031 416638 417454 418875 421256 424174
51407 424174 426768 428657 430232 432113 434563 437511 440950 445130 450252 456063 461908 467190 471737 475777
51393 475777 479710 483948 488800 494365 500736 508367 518075 530495 545680 563485 584225 608721 637671
51380 637671 671259 709481 752601 801006 854516 911922 971304 1030754 1088659 1143181 1191576
51369 1191576 1230296 1255999 1266630 1261860 1242822 1211497 1170028 1120337 1064333 1004295 942816
51358 942816 882170 823877 768917 718169 672496 632539 598567 570388 547261 528058 511720
51347 511720 497609 485455 475095 466311 458693 451625 444647 437962 432267 427831 424011 420003 415814
51334 415814 412109 409278 407106 405352 404030 402945 401371 398616 394836 390999 388043 386117 384568 382573
51320 382573 379890 377144 375350 375060 375869 376749 376889 376261 375492 375264 375829 377062 378917 381627 385372 389818
51304 389818 394153 397611 399938 401400 402487 403613 404901 406123 406925 407247 407427 407668 407459 405868 402624
51289 402624 398621 395021 392039 389110 386156 384047 383552 384444 386094 388478 391940 396263 400730 405027 409381
51274 409381 413722 417349 419660 420722 420965 420811 420742 421174 421958 422570 423015 423991 425826 427895 429531 430847
51258 430847 432029 432412 431191 428702 426085 423807 421445 418849 416550 414740 412752 410000 406785 403686
51244 403686 400707 397668 395061 393794 394093 395159 396048 396496 396722 396750 396329 395477 394732 394517 394445 393655 391936
51227 391936 390073 388792 387716 385898 383234 380807 379726 380059 381113 382393 383936 385852 387815 389161
51213 389161 389410 388694 387667 387018 387136 388230 390487 393950 398351 403281 408416 413463 418142 422510 427117
51198 427117 432416 438070 443152 447040 449773 451536 452171 451308 448782 444821 440066 435355 431211 427543 424151
51183 424151 421478 420369 420894 421867 421900 420732 419143 417748 416390 414742 412993 411561 410346 408865 407204
51168 407204 406256 406564 407332 407309 406574 406621 408538 411873 415634 419481 423242 426057 427168 427200 427511 428346 428669
51151 428669 427902 426708 425723 424576 422798 420909 419823 419673 419923 420276 420786 421269 421331 421022 420972 421714 423085
51134 423085 424344 424725 423909 422152 419991 417867 416088 414977 414659 414755 414677 414348 414265 414716 415432 416208 417392
51117 417392 419348 421785 424044 425825 427330 428929 431060 434106 437913 441565 444079 445347 446085 446982 448230
51102 448230 449847 452044 455119 459117 463627 467879 471173 473320 474514 474730 473587 471060 467952 465235
51088 465235 463040 460713 457861 454942 452775 451703 451328 450943 450143 449098 448222 447650 447191 446826 446880 447526 448412
51071 448412 449088 449562 450207 451372 453370 456597 461161 466551 472116 477868 484448 492411 501988 513486 527272
51056 527272 543070 559593 575215 588865 600272 609763 618221 627037 637625 650714 666103 682913
51044 682913 699881 715456 728108 736980 742258 744611 744137 740134 732177 721171 708978 696945 685205
51031 685205 673361 661331 649179 636481 622424 606670 589982 573967 560248 549729 542430 537923
51019 537923 535804 535758 537426 540571 545318 551898 560106 569358 579220 589456 599510 608498 616016 622644
51005 622644 629469 637400 646979 658183 670088 681282 691086 700101 709265 718902 728934 739299 749537
50992 749537 758604 765917 772197 778452 784487 789317 792758 795652 798570 801334 803936 806987 811040 816228
50978 816228 822845 831537 842461 854803 867460 879782 891549 902940 914955 929346 947616 970292
50966 970292 997246 1028316 1063388 1102333 1145095 1191494 1240885 1292576 1346610 1403396 1462230
50955 1462230 1520932 1577407 1630943 1681488 1728446 1770894 1808490 1841387 1869650 1893527 1913979
50944 1913979 1932210 1948859 1964309 1979441 1995193 2011478 2027380 2042303 2055970 2067188 2073696
50933 2073696 2073891 2068224 2058517 2046292 2031949 2014917 1994030 1968133 1936832 1900580 1859836 1814489
50921 1814489 1764401 1710204 1653135 1594343 1534779 1475580 1418059 1363277 1311902 1264417 1221120
50910 1221120 1181953 1146668 1115217 1087671 1063693 1042423 1023019 1005113 988692 973810 960557
50899 960557 948976 938751 929195 919905 911371 904597 900101 897474 895846 894486 892966 891261 889987 890160
50885 890160 892207 895254 897863 899527 901103 903620 907081 910658 913767 916506 919258 922387 926415 931985
50871 931985 939330 947973 957204 966711 976563 986836 997645 1009506 1023238 1039400 1058031 1079018
50859 1079018 1102446 1128521 1157552 1190241 1227740 1271038 1320446 1375948 1437864 1506768 1582837
50848 1582837 1665778 1755480 1852293 1956447 2067463 2184308 2305853 2430972 2558427 2686879
50838 2686879 2814785 2940040 3059911 3171511 3272319 3360216 3433492 3491332 3534188 3563379
50828 3563379 3580373 3586774 3584853 3577654 3568376 3559797 3554147 3553143 3557937 3569107 3586606 3609355 3634837
50815 3634837 3659333 3678739 3689145 3686868 3668615 3632195 3577135 3504391 3415394 3311392 3193681
50804 3193681 3064325 2926486 2783898 2640057 2498067 2361092 2232335 2114109 2007108
50795 2007108 1911010 1825695 1751440 1688031 1634322 1588929 1551019 1520241 1496217 1478344 1465837
50784 1465837 1457679 1452681 1449807 1448400 1448003 1448136 1448316 1448086 1446958 1444624 1441390 1438010 1434729 1430655 1424490
50769 1424490 1415790 1405193 1393435 1380544 1366051 1349650 1331459 1311885 1291503 1270973 1250798
50758 1250798 1231109 1211808 1192988 1175131 1158797 1144280 1131702 1121319 1113432 1107990 1104645 1103409
50746 1103409 1104899 1109576 1116957 1126163 1137263 1151621 1170641 1194520 1222477 1254049 1289846 1331040
50734 1331040 1378292 1431206 1488724 1549939 1614372 1681437 1750036 1819009 1887824 1956301 2023677
50723 2023677 2088483 2149534 2206527 2259388 2307479 2349730 2385107 2412475 2430380 2437739 2434765 2422836
50711 2422836 2403542 2378400 2349470 2319597 2291704 2268099 2250543 2240436 2238376 2243642 2254476 2268963
50699 2268963 2285483 2302403 2317570 2328252 2331625 2325372 2307918 2278220 2235609 2180229 2113739 2039251
50687 2039251 1960245 1879462 1798903 1720595 1646884 1579847 1520657 1469619 1426567 1391064 1362565
50676 1362565 1340834 1326126 1318667 1317996 1323157 1333485 1348743 1368355 1391016 1415396 1440863 1467040
50664 1467040 1492941 1517107 1538642 1557681 1574784 1590304 1604486 1617886 1631356 1645631 1660928
50653 1660928 1676818 1692558 1707826 1723117 1739230 1756437 1774515 1793703 1815180 1840377 1869970
50642 1869970 1903768 1941390 1982791 2028067 2076835 2127890 2179677 2231239 2282552 2333683 2383770
50631 2383770 2431189 2474631 2513679 2548512 2579681 2608187 2634985 2659952 2681542 2697438 2704926
50620 2704926 2700591 2681022 2645238 2596607 2541758 2487378 2438016 2396090 2362821 2338715 2323630
50609 2323630 2316697 2316108 2319173 2323039 2325469 2324747 2319017 2306227 2284760 2253709 2212601 2161453 2101420
50596 2101420 2034916 1964599 1892257 1818898 1745763 1674798 1607955 1546184 1489385 1437379 1390617
50585 1390617 1349635 1314022 1282503 1254216 1229389 1208391 1190565 1174534 1159481 1145535 1132996
50574 1132996 1121729 1111416 1101988 1093719 1087250 1083506 1083130 1085827 1090580 1096611 1103869 1112659 1123271
50561 1123271 1136071 1151403 1169079 1188387 1208953 1231314 1256345 1284332 1314822 1347038 1380054
50550 1380054 1412815 1444431 1474466 1502665 1528576 1551803 1572627 1592098 1611478 1631840 1654135
50539 1654135 1679334 1708387 1742187 1781574 1827140 1878961 1936711 2000223 2069879 2146496 2230932
50528 2230932 2323767 2425075 2534280 2650357 2772326 2899495 3031017 3165283 3299905 3432242
50518 3432242 3559740 3679798 3789644 3886543 3967961 4031419 4074549 4095724 4094656 4072073 4028925
50507 4028925 3966245 3885791 3790377 3683459 3568824 3450788 3334108 3223178 3121524 3032341
50497 3032341 2959006 2904271 2868999 2852296 2852943 2870128 2902571 2947388 3000042 3055009 3106306 3147827
50485 3147827 3173836 3179579 3161810 3119312 3053180 2966320 2862411 2745323 2619342 2489190 2359176
50474 2359176 2232246 2110035 1993613 1883934 1781836 1688080 1603424 1528355 1462645 1405330
50464 1405330 1355191 1311175 1272478 1238517 1208930 1183482 1161977 1144397 1131012 1122072 1117290 1115864
50452 1115864 1117092 1120842 1127301 1136399 1147572 1159971 1172734 1185238 1197368 1209601 1222612 1236626
50440 1236626 1251162 1265405 1278661 1290445 1300365 1308270 1314431 1319271 1322866 1325028 1326053 1327091 1329481
50427 1329481 1333858 1340201 1348612 1359538 1373084 1388545 1405057 1422661 1442415 1465431 1492003 1521802
50415 1521802 1554745 1591326 1632048 1676778 1725000 1776646 1832259 1892112 1955352 2020244 2085089
50404 2085089 2148666 2209956 2267889 2321525 2370233 2413566 2450972 2481560 2503888 2516038 2516233 2503544
50392 2503544 2478004 2440140 2390660 2330605 2261556 2185701 2105993 2026089 1949554 1878855 1815386
50381 1815386 1760518 1716010 1683041 1661323 1649706 1647339 1653635 1667341 1686360 1708570 1732195 1755163
50369 1755163 1774607 1787398 1791012 1783829 1765082 1735052 1695209 1647752 1594876 1538470 1480324 1422268
50357 1422268 1365945 1312463 1262208 1214927 1170119 1127530 1087312 1049712 1014755 982404 952896
50346 952896 926651 903885 884615 869019 857365 849364 843986 840347 838639 839689 843648 849658 856957
50333 856957 865778 876755 889863 904481 920287 937387 955416 973062 988692 1001118 1009539 1013255
50321 1013255 1012058 1006875 999603 992166 985802 981036 977850 975727 973895 971841 969651 967808 966794 966889
50307 966889 968125 970217 972662 975105 977606 980423 983593 986906 990242 993715 997433 1001363 1005556 1010219
50293 1010219 1015334 1020372 1024714 1028268 1031326 1033855 1035397 1035798 1035542 1034981 1033498 1029885 1023461 1014543 1004066
50278 1004066 993233 983473 976136 971886 970587 971814 975210 980346 986715 994072 1002412 1011402 1020158 1027912
50264 1027912 1034543 1040168 1044516 1047165 1048219 1048270 1047799 1046973 1045887 1044549 1042660 1039858 1036231 1032179 1027886
50249 1027886 1023462 1019606 1017435 1017372 1018818 1021271 1025207 1031428 1040148 1051388 1065685 1083488 1103996
50236 1103996 1125641 1147826 1171240 1196116 1221091 1244411 1265641 1285519 1304533 1322419 1338793
50225 1338793 1353436 1365843 1375127 1380484 1381341 1376952 1366491 1349810 1327786 1301678 1272495 1241269
50213 1241269 1209595 1179435 1152381 1129242 1110119 1094552 1081681 1070528 1060164 1049497 1037013
50202 1037013 1021077 1000711 976152 948798 920667 893699 869211 847715 829153 813231 799640
50191 799640 788146 778489 770160 762359 754418 746288 738370 730854 723592 716698 710825 706460 703168 699960
50177 699960 696304 692449 688810 685418 682071 678775 675872 673762 672571 672028 671671 671163 670316 668961 667203
50162 667203 665839 666070 668410 672075 675757 678819 681508 684319 687647 691845 697137 703464 710672 718671
50148 718671 727008 734503 739945 743127 744705 745110 744247 742299 740048 738041 736043 733742 731553 730285 730428
50133 730428 732261 736394 743564 753967 767214 782986 801372 822486 846043 871515 898663 927918
50121 927918 960171 996076 1035421 1077226 1120379 1164031 1207474 1250049 1291400 1331639 1371094
50110 1371094 1410058 1448780 1487326 1525070 1560424 1591254 1615419 1630846 1635548 1628252 1609221 1580297
50098 1580297 1544008 1502608 1457677 1410298 1361439 1312302 1264346 1218997 1177356 1140161 1107874
50087 1107874 1080682 1058465 1040758 1026618 1014578 1003136 991611 980517 970929 963491 958055 954136
50075 954136 951469 950072 949890 950555 951693 953440 956346 960514 965088 968908 971491 972960 973265 972156 969866
50060 969866 967003 963498 958468 951581 943851 936430 929129 921001 912037 903347 895722 888931 882677 877431
50046 877431 873802 871579 870034 869086 869699 872947 878901 886595 895037 904092 914227 925588 937681 950078
50032 950078 962970 976693 991009 1005311 1019385 1033399 1047093 1059457 1069463 1076873 1082151 1085802
50020 1085802 1088007 1088781 1088268 1086834 1084906 1082663 1079852 1075909 1070255 1062508 1052661 1041332 1029920 1020253
50006 1020253 1013817 1011188 1012149 1016358 1023903 1035207 1050525 1069691 1092441 1118674 1148013 1179231
49994 1179231 1210517 1240412 1268203 1293479 1315868 1335407 1352577 1367475 1379191 1386246 1387342 1381276
49982 1381276 1366654 1342469 1309068 1268211 1222269 1173669 1124835 1077901 1034199 994234 958168
49971 958168 926042 897630 872600 850933 832831 818065 805695 794606 784189 774441 765643 758101
49959 758101 752067 747777 745474 745240 746784 749696 754126 760927 770675 782701 795441 807642 818839
49946 818839 828741 836796 842555 846074 847696 847626 845940 842862 838830 834142 828432 820601 809658 795841
49932 795841 780577 765077 749397 733298 717376 702540 688702 675019 661521 649523 640199 633537
49920 633537 628944 626037 624394 623358 622787 623396 625723 629219 633057 637347 642708 648939 655003 660344 665573
49905 665573 671812 679998 690743 704054 718944 733950 748435 762934 777946 792891 806624 818461
49893 818461 828134 835113 838705 838846 836117 830858 822762 811533 797503 781365 763762 745585 728200
49880 728200 712715 699101 686553 674681 663771 653920 644623 635533 627098 620038 614559 610437 607486
49867 607486 605577 604495 604248 605286 608021 612305 617742 624213 631632 639600 647919 657308 668877 682826
49853 682826 698172 713745 728907 743281 756379 767672 776619 782644 785536 785918 784794 782602 779152
49840 779152 774339 768151 759992 748933 735098 720115 705829 693121 682272 673587 666989 661658 656933
49827 656933 653224 651321 651034 651286 651471 652069 653941 657602 663281 671176 681420 693921 708286 723795
49813 723795 739581 754988 769517 782292 792102 798513 802688 806423 810341 813445 814390 812708 808785
49800 808785 803271 796830 790097 783503 777128 770798 764173 756696 747731 736988 724853 712221 699999
49787 699999 688690 678436 669398 661951 656367 652418 649594 647727 647031 647447 648421 649596 651312 653996
49773 653996 657409 661011 664944 670096 677148 685900 695529 705167 714251 722632 730415 737415 742845 745926
49759 745926 746863 746827 746823 746799 745965 743646 739608 733715 725656 715142 702396 688425 674738 662623 652606
49744 652606 644532 638039 632918 629149 626783 625738 625621 625831 625929 625808 625460 624803 623973 623640 624729 627819
49728 627819 632856 639293 646294 653033 659193 665267 672188 680605 690577 701825 714072 727132 740818
49715 740818 754710 767950 779423 788311 794311 797207 796476 791709 783273 772258 759841 746994 734644
49702 734644 723565 713977 705581 698175 692049 687629 684874 683061 681072 678014 673844 669539 666459 665421
49688 665421 666392 668946 672820 677975 684330 691586 699333 707446 716410 727126 740267 755887 773724
49675 773724 793602 815278 838084 861065 883268 903498 919840 930009 932605 928112 918800 907832
49663 907832 898225 892021 889907 891390 895257 899942 903830 905648 904495 899301 888565 871270 848230
49650 848230 822141 796100 772157 751126 733141 718098 705842 696350 689635 685408 683002 681812
49638 681812 681611 682312 683600 684957 685891 685989 684953 682807 679894 676454 672283 667071 661035 654965 649514
49623 649514 644629 639825 634945 630450 626892 624276 622172 620372 619116 618566 618354 617978 617521 617582 618481 619841
49607 619841 621086 622155 623468 625267 627192 628621 629377 629934 630877 632248 633558 634343 634487 634103 633506 633357
49591 633357 634394 636690 639456 641883 643905 645859 647711 649161 650299 651615 653307 655022 656364 657298
49577 657298 657975 658488 658942 659550 660599 662477 665657 670396 676450 683386 691190 700319 711133 723479 736763
49562 736763 750125 762600 773398 782166 788772 792986 794581 793605 790264 784719 777487 769829 763113 757742
49548 757742 753254 749457 746835 745708 745687 746314 747596 749520 751507 752896 753661 754238 754926 755860 757310 759567
49532 759567 762628 766382 771048 777231 785632 796827 811056 827990 846963 867688 890561 915957
49520 915957 943383 971469 998410 1022109 1040377 1051859 1056951 1057583 1056024 1054122 1053326 1054762 1058931
49507 1058931 1065543 1073733 1082243 1089403 1093180 1091559 1083060 1067258 1045184 1019144 991769 964957 939701
49494 939701 916717 896814 880471 867309 856250 846313 837173 829072 822306 816902 812718 809657 807639
49481 807639 806474 805999 806324 807631 809646 811578 812765 813211 813337 813406 813495 813869 815027 817331 820781 825167
49465 825167 830249 835741 841292 846630 851673 856443 860915 864929 868235 870588 871783 871636 869987 866759
49451 866759 862021 856010 849185 842179 835373 828425 820639 812116 804156 797932 793088 788435 783962 781166
49437 781166 781096 783038 785760 789275 794560 802095 811660 823205 836896 852459 869521 888631 910938
49424 910938 936773 965609 997668 1034087 1074710 1116968 1158085 1197077 1232453 1258538 1267097 1254328
49412 1254328 1225251 1190058 1156939 1129247 1107894 1093746 1087193 1087318 1092768 1102708 1116237 1131711
49400 1131711 1147562 1163326 1179089 1194294 1207927 1219635 1229895 1239182 1247586 1255110 1261565 1266195
49388 1266195 1268114 1267208 1263984 1258564 1250482 1239613 1226610 1212218 1196827 1180918 1165261 1150317
49376 1150317 1136084 1122983 1112309 1105149 1101199 1099218 1098385 1098792 1100842 1104628 1109739 1115221 1119864 1122895
49362 1122895 1124326 1124453 1123274 1120624 1116502 1110838 1103299 1093876 1083472 1073404 1064345 1056131 1048502 1041563
49348 1041563 1035627 1030985 1027810 1025916 1024675 1023567 1022702 1022428 1022504 1022119 1020696 1018238 1014886 1010632 1005516
49333 1005516 999679 993104 985817 978508 972478 968571 966398 964932 963692 963030 963408 964807 966997 970092
49319 970092 974540 980483 987332 994195 1000677 1007040 1013568 1020134 1026549 1032987 1039761 1046907 1054368 1062365
49305 1062365 1071157 1080504 1089882 1099245 1109152 1120088 1132105 1145334 1160321 1177365 1195755 1214119
49293 1214119 1231424 1247135 1260217 1268475 1269485 1262393 1248719 1231425 1213409 1196675 1182205 1169987
49281 1169987 1159283 1149493 1140856 1133929 1128423 1123200 1117631 1112336 1108126 1104798 1101619 1098677 1096957 1097138
49267 1097138 1098948 1101807 1105448 1109635 1113766 1117293 1120446 1124192 1129413 1136301 1144572 1154056 1164946 1177557
49253 1177557 1192179 1209202 1228874 1250408 1271611 1290052 1304545 1314773 1319494 1316279 1303793 1283630
49241 1283630 1259087 1232568 1204988 1177160 1150494 1126172 1104597 1085964 1070692 1058950 1050350
49230 1050350 1044521 1041620 1041875 1044856 1049469 1054652 1060053 1066152 1073656 1082546 1091805 1100361 1108168 1115975
49216 1115975 1124171 1132333 1139892 1146690 1152843 1158590 1164465 1171109 1178589 1186296 1193868 1202063 1212396 1225843
49202 1225843 1241904 1258933 1275478 1291417 1307571 1324087 1339624 1352620 1363032 1372191 1381125 1389768
49190 1389768 1397733 1404986 1411472 1416731 1420352 1422483 1423752 1425119 1427840 1432984 1440639 1450082 1461043 1474505
49176 1474505 1492047 1514808 1543230 1577333 1616901 1661641 1711304 1765261 1821827 1878305 1931532
49165 1931532 1977835 2012704 2032044 2034827 2024334 2006357 1986431 1968506 1954839 1945824 1940204 1936315
49153 1936315 1933173 1930179 1926515 1921663 1916195 1911239 1907400 1904844 1904126 1906028 1910573 1916931 1924353 1932588
49139 1932588 1941456 1950730 1960576 1971503 1983652 1996599 2010008 2024003 2038761 2054219 2070378 2087444
49127 2087444 2105378 2123633 2141646 2159463 2177632 2196612 2216536 2237576 2260394 2286002 2315017
49116 2315017 2347176 2381920 2419560 2461572 2509695 2565264 2629738 2705437 2795148 2901038 3024034
49105 3024034 3163795 3318588 3484891 3656891 3826133 3982873 4120589 4240807 4351110
49096 4351110 4454103 4536973 4574900 4548586 4460225 4332685 4193204 4056753 3921824 3778913
49086 3778913 3622465 3456936 3294051 3145418 3017230 2910225 2822610 2752083 2696001 2651236
49076 2651236 2614681 2583867 2557179 2533782 2513283 2495182 2478627 2462932 2448150 2434819 2423203
49065 2423203 2413096 2404291 2396771 2390358 2384511 2378646 2372484 2366016 2359402 2353090 2347797 2344011 2341520 2339562
49051 2339562 2337561 2335558 2333884 2332554 2331281 2330097 2329681 2330788 2333463 2337156 2341594 2347287 2355098 2365531
49037 2365531 2378456 2393161 2408518 2423302 2436614 2447924 2456741 2462627 2465791 2467312 2468415 2469536
49025 2469536 2470293 2470096 2468526 2465398 2460973 2456059 2451470 2447431 2443893 2441308 2440466 2441436 2443330 2445502 2448514
49010 2448514 2453343 2459914 2466978 2473420 2479203 2484957 2491096 2497534 2503907 2509781 2514803 2518951 2522586 2526097
48996 2526097 2529487 2532402 2534467 2535497 2535529 2534876 2534097 2533534 2532816 2531137 2528216 2524735 2521472 2518292 2514468
48981 2514468 2509930 2505571 2502117 2499204 2496019 2492424 2488882 2485534 2482039 2478275 2474493 2470549 2465684 2459554
48967 2459554 2453037 2447463 2443294 2439992 2436987 2434283 2432256 2431452 2432587 2436145 2441826 2448800 2456686 2465845
48953 2465845 2476623 2488762 2501885 2516057 2531485 2547981 2565245 2583431 2602892 2623405 2644065
48942 2644065 2664037 2683124 2701645 2720188 2739594 2760814 2784524 2810908 2839835 2871054 2904315
48931 2904315 2939608 2977462 3018706 3063739 3112056 3162636 3214705 3268054 3322752 3378730 3435728
48920 3435728 3493528 3552121 3611566 3671758 3732450 3793366 3854008 3913346 3970183 4024138 4075987
48909 4075987 4126608 4175796 4222580 4266538 4308184 4348028 4385825 4421016 4453466 4483406 4510972
48898 4510972 4536098 4558787 4579278 4598048 4615662 4632356 4647611 4660455 4670411 4677874 4683321 4686352
48886 4686352 4685866 4681126 4672378 4660466 4646084 4629366 4610057 4587959 4563252 4536350 4507516 4476785
48874 4476785 4444159 4409571 4372630 4332742 4289650 4243593 4194860 4143596 4090245 4035791 3981214
48863 3981214 3927041 3873700 3821869 3771977 3723708 3676588 3630898 3587435 3546537 3507967 3471709
48852 3471709 3438108 3407093 3377976 3350304 3324441 3301002 3280243 3262322 3247573 3235963 3226685
48841 3226685 3218917 3212839 3209385 3209152 3212086 3218127 3227455 3239884 3254502 3270257 3286669 3303821 3321924
48828 3321924 3341092 3361271 3382197 3403629 3425750 3448991 3473220 3497486 3521011 3544206 3568132
48817 3568132 3593065 3618190 3642777 3667031 3691438 3715802 3739402 3761941 3783863 3805842 3828247
48806 3828247 3851077 3874156 3897473 3921484 3947006 3974570 4003975 4034610 4065939 4097372 4127988
48795 4127988 4157004 4184536 4211331 4237532 4262110 4283780 4302248 4318386 4333402 4347967 4361822
48784 4361822 4373934 4383061 4388295 4389013 4384431 4373677 4356567 4334084 4307754 4278562 4246642 4211812
48772 4211812 4174076 4133503 4089996 4043578 3994996 3945696 3896779 3847963 3798015 3746385 3694136
48761 3694136 3642974 3593760 3546343 3500472 3456150 3413295 3371796 3332015 3294632 3259912 3227677
48750 3227677 3198040 3171398 3147487 3125210 3103782 3083426 3064579 3047199 3031441 3018289 3008639
48739 3008639 3002201 2998170 2996664 2998514 3003551 3009895 3015142 3017785 3017579 3015282 3012345 3010314 3010014 3011251
48725 3011251 3013302 3015539 3017755 3020260 3023613 3027914 3032427 3036220 3039081 3041391 3043212 3044104 3043924 3043268 3042835
$$ [...]
##END NTUPLES=NMR SPECTRUM
##END=
