##TITLE=AC1435_CAUAH13244_8011448_WKsL3sx1ML
##JCAMPDX= 6.0         $$ Bruker NMR JCAMP-DX V2.0
##DATA TYPE= NMR SPECTRUM
##DATA CLASS= NTUPLES
##ORIGIN= BRUKER
##OWNER= Administrator
$$ 1.72 TOPSPIN		Version 2.1
$$ 2013-07-05 15:54:34.061 -0700  Administrator@X
$$ Compression mode = diff/dup
##.OBSERVE FREQUENCY= 400.02188249412
##.OBSERVE NUCLEUS= ^1H
##.ACQUISITION MODE= SIMULTANEOUS (DQD)
##.ACQUISITION SCHEME= undefined
##.AVERAGES= 64
##.DIGITISER RES= 22
##SPECTROMETER/DATA SYSTEM= spect
##.PULSE SEQUENCE= noesygpps1d.comp
##.SOLVENT NAME= COFFEE_meoh
##.SHIFT REFERENCE= INTERNAL, COFFEE_meoh, 1, 14.96104
##AUDIT TRAIL= $$ (NUMBER, WHEN, WHO, WHERE, PROCESS, VERSION, WHAT)
$$ ##TITLE= Audit trail, TOPSPIN		Version 2.1
$$ ##JCAMPDX= 5.01
$$ ##ORIGIN= Bruker BioSpin GmbH
$$ ##OWNER= Administrator
$$ $$ E:\/data/COFFEE/nmr/AC1435_CAUAH13244_8011448_WKsL3sx1ML/12/pdata/1/auditp.txt
$$ ##AUDIT TRAIL=  $$ (NUMBER, WHEN, WHO, WHERE, PROCESS, VERSION, WHAT)
(   1,<2013-07-05 15:54:28.373 -0700>,<Administrator>,<X>,<go>,<TOPSPIN 2.1>,
      <created by zg
	started at 2013-07-05 15:42:58.996 -0700,
	POWCHK enabled, PULCHK disabled,
       configuration hash MD5:
       C8 4E 4E 5D D3 5C D8 9E 9F 52 82 E0 59 8A DE 15
       data hash MD5: 64K
       41 79 6F 7A FF AC 80 BC 96 FA F8 C7 35 B8 0C 3A>)
(   2,<2013-07-05 15:54:32.045 -0700>,<Administrator>,<X>,<proc1d>,<TOPSPIN 2.1>,
      <Start of raw data processing
       efp LB = 0.3 FT_mod = 6 PKNL = 1 PHC0 = 0 PHC1 = 0 SI = 128K 
       data hash MD5: 128K
       D1 FE D1 BF 42 73 3F 97 9C 0D F1 6E A1 94 1B 97>)
(   3,<2013-07-05 15:54:32.998 -0700>,<Administrator>,<X>,<proc1d>,<TOPSPIN 2.1>,
      <pk PHC0 = -84.28711 PHC1 = 0 
       data hash MD5: 128K
       B8 41 13 1C 9F E6 98 19 B5 D4 90 E9 61 73 59 94>)
(   4,<2013-07-05 15:54:33.436 -0700>,<Administrator>,<X>,<proc1d>,<TOPSPIN 2.1>,
      <abs ABSG = 1 
       data hash MD5: 128K
       B8 38 F3 23 6A AE 62 A4 30 87 7B 9B 20 6E C5 28>)
(   5,<2013-07-05 15:54:33.561 -0700>,<Administrator>,<X>,<proc1d>,<TOPSPIN 2.1>,
      <abs ABSG = 2 
       data hash MD5: 128K
       5A 94 02 76 E8 D8 E5 C8 BD 41 CE D5 7B B2 3E F3>)
(   6,<2013-07-05 15:54:33.670 -0700>,<Administrator>,<X>,<proc1d>,<TOPSPIN 2.1>,
      <abs ABSG = 3 
       data hash MD5: 128K
       4B C6 91 8C FB 80 8E 59 1A E4 81 8C EB A5 3E 55>)
(   7,<2013-07-05 15:54:33.795 -0700>,<Administrator>,<X>,<proc1d>,<TOPSPIN 2.1>,
      <abs ABSG = 4 
       data hash MD5: 128K
       86 69 84 B0 8B 67 F7 5B 30 6D 44 E9 D8 A0 C0 29>)
(   8,<2013-07-05 15:54:33.873 -0700>,<Administrator>,<X>,<proc1d>,<TOPSPIN 2.1>,
      <abs ABSG = 5 
       data hash MD5: 128K
       4F CB 06 A4 F9 55 97 71 0A 50 EA 87 80 DE 8A EF>)
$$ ##END=
$$ 
$$ $$ hash MD5
$$ $$ 45 88 3F 9A 25 26 55 EA 23 9C BA F9 EC B9 60 13
##$RELAX= 
##$RELAX= 
##$RELAX= 
##$RELAX= 
##$RELAX= 
##$RELAX= 
##$RELAX= 
##$RELAX= 
$$ Bruker specific parameters
$$ --------------------------
##$DU= <E:\>
##$EXPNO= 12
$$ [...]
##$TP07= 0
##$TPNAME0= <>
##$TPNAME1= <>
##$TPNAME2= <>
##$TPNAME3= <>
##$TPNAME4= <>
##$TPNAME5= <>
##$TPNAME6= <>
##$TPNAME7= <>
##$TPOAL= (0..7)
0.5 0.5 0.5 0.5 0.5 0.5 0.5 0.5
##$TPOFFS= (0..7)
0 0 0 0 0 0 0 0
##$TUNHIN= 0
##$TUNHOUT= 0
##$TUNXOUT= 0
##$USERA1= <user>
##$USERA2= <user>
##$USERA3= <user>
##$USERA4= <user>
##$USERA5= <user>
##$V9= 5
##$VALIST= <valist>
##$VCLIST= <CCCCCCCCCCCCCCC>
##$VD= 0
##$VDLIST= <DDDDDDDDDDDDDDD>
##$VPLIST= <PPPPPPPPPPPPPPP>
##$VTLIST= <TTTTTTTTTTTTTTT>
##$WBST= 1024
##$WBSW= 4
##$XGAIN= (0..3)
0 0 0 0
##$XL= 0
##$YL= 0
##$YMAX_a= 6055142
##$YMIN_a= -12125274
##$ZGOPTNS= <>
##$ZL1= 120
##$ZL2= 120
##$ZL3= 120
##$ZL4= 120
##$ABSF1= 14.96104
##$ABSF2= -5.597142
##$ABSG= 5
##$ABSL= 3
##$ALPHA= 0
##$AQORDER= 0
##$ASSFAC= 0
##$ASSFACI= 0
##$ASSFACX= 0
##$ASSWID= 0
##$AUNMP= <proc_prof1d_extract.lims>
##$AXLEFT= 0
##$AXNAME= <>
##$AXNUC= <1H>
##$AXRIGHT= 0
##$AXTYPE= 0
##$AXUNIT= <>
##$AZFE= 0.1
##$AZFW= 0.1
##$BCFW= 0
##$BC_mod= 0
##$BYTORDP= 0
##$COROFFS= 0
##$CY= 15
##$DATMOD= 1
##$DC= 0
##$DFILT= <>
##$DTYPP= 0
##$F1P= 0
##$F2P= 0
##$FCOR= 0.5
##$FTSIZE= 131072
##$FT_mod= 6
##$GAMMA= 0
##$GB= 0
##$INTBC= 1
##$INTSCL= 1
##$ISEN= 128
##$LB= 0.3
##$LEV0= 0
##$LPBIN= 0
##$MAXI= 10000
##$MC2= 0
##$MEAN= 0
##$ME_mod= 0
##$MI= 0
##$NCOEF= 0
##$NC_proc= -2
##$NLEV= 6
##$NOISF1= 0
##$NOISF2= 0
##$NSP= 0
##$NTH_PI= 0
##$NZP= 0
##$OFFSET= 14.96104
##$PC= 1
##$PHC0= -84.28711
##$PHC1= 0
##$PH_mod= 1
##$PKNL= yes
##$PPARMOD= 0
##$PPDIAG= 0
##$PPIPTYP= 0
##$PPMPNUM= 2147483647
##$PPRESOL= 1
##$PSCAL= 4
##$PSIGN= 0
##$PYNMP= <proc.py>
##$REVERSE= no
##$SF= 400.020009622029
##$SI= 131072
##$SIGF1= 0
##$SIGF2= 0
##$SINO= 400
##$SIOLD= 131072
##$SPECTYP= <>
##$SREGLST= <1H.CDCl3>
##$SSB= 0
##$STSI= 131072
##$STSR= 0
##$SW_p= 8223.68421052631
##$SYMM= 0
##$S_DEV= 0
##$TDeff= 65536
##$TDoff= 0
##$TI= <>
##$TILT= no
##$TM1= 0
##$TM2= 0
##$TOPLEV= 0
##$USERP1= <user>
##$USERP2= <user>
##$USERP3= <user>
##$USERP4= <user>
##$USERP5= <user>
##$WDW= 1
##$XDIM= 131072
##$YMAX_p= 448261534
##$YMIN_p= -11002
##$CURPLOT= <Network HP LaserJet P1505>
##$CURPRIN= <$Network HP LaserJet P1505>
##$DFORMAT= <normdp>
##$LAYOUT= <+/1D_H.xwp>
##$LFORMAT= <normlp>
##$PFORMAT= <normpl>
##$SURQMSG= 1
$$ End of Bruker specific parameters
$$ ---------------------------------
##NTUPLES= NMR SPECTRUM
##VAR_NAME=  FREQUENCY,     SPECTRUM/REAL,   SPECTRUM/IMAG
##SYMBOL=    X,             R,               I
##VAR_TYPE=  INDEPENDENT,   DEPENDENT,       DEPENDENT
##VAR_FORM=  AFFN,          ASDF,            ASDF
##VAR_DIM=   131072,        131072,          131072
##UNITS=     HZ,            ARBITRARY UNITS, ARBITRARY UNITS
##FACTOR=    0.0627417313425164, 1,          1
##FIRST=     8223.62146879497, 3223,         -50667
##LAST=      0,             4204,            -49933
##MIN=       0,             -11002,          0
##MAX=       8223.62146879497, 448261534,    0
$$ Real data points
##PAGE= N=1
##DATA TABLE= (X++(R..R)), XYDATA
$$ [...]
$$ plain form
63916 3960113 3661828 3375715 3105109 2852238 2618525 2404806 2211228 2037241 1881869
63907 1881869 1743918 1621851 1513842 1418315 1334311 1260984 1196849 1139890 1088443 1041619 998901
63896 998901 959861 924372 892543 864011 837565 811940 786862 763027 741140 721220 702775
63885 702775 685429 669386 655355 643954 635201 628741 624556 623026 624193 627476 632470 639610 649559
63872 649559 662201 676743 692655 709982 728762 748651 769163 789902 810462 830420 849481
63861 849481 867438 883974 898708 911354 921627 929086 933375 934555 932936 928700 921928 912803 901380
63848 901380 887330 870358 850818 829479 806726 782469 756808 730311 703545 676767 650165
63837 650165 623983 598393 573596 550077 528249 507811 487995 468622 450457 434275 419972
$$ packed form
63916C960113k98285k86113k70606k52871k33713k13719j93578j73987j55372
63907A881869j37951j22067j08009r5527q4004p3327o4135n6959n1447m6824m2718
63896I98901l9040l5489l1829k8532k6446k5625k5078k3835k1887j9920j8445
63885G02775j7346j6043j4031j1401q753o460m185j530J167L283M994P140R949
63872F49559J2642J4542J5912J7327J8780J9889K0512K0739K0560J9958J9061
63861H49481J7957J6536J4734J2646J0273P459M289J180j619m236o772r125j1423
63848I01380j4050j6972j9540k1339k2753k4257k5661k6497k6766k6778k6602
63837F50165k6182k5590k4797k3519k1828k0438j9816j9373j8165j6182j4303
$$ plain form
63826 419972 406840 394330 382339 371107 361078 352583 345403 338896 332697 327011 322104 317867 314076
63813 314076 310698 307734 305076 302742 300904 299480 297981 296028 293689 291142 288383 285545 283042 281006
63799 281006 278874 275977 272381 268743 265511 262617 259837 257125 254635 252609 251166 250034 248710 247040
63785 247040 245409 244117 242860 241186 239259 237752 237030 236774 236409 235617 234450 233208 232239 231720 231528 231394
63769 231394 231149 230841 230690 230881 231237 231146 230118 228457 227058 226471 226504 226830 227532 228728 230086 231112 231700
63752 231700 232084 232392 232646 233089 234239 236544 240062 244349 248599 252054 254413 255784 256391 256618 257162 258564
63736 258564 260543 262372 264013 266175 269063 271850 273862 275589 277919 281030 284649 288812 293547 298253
63722 298253 302260 305689 309002 312034 314327 316070 317791 319283 319791 319195 318063 316613 314687 312748 311728
$$ packed form
63826D19972j3132j2510j1991j1232j0029q495p180o507o199n686m907m237l791
63813C14076l378k964k658k334j838j424j499j953k339k547k759k838k503k036
63799B81006k132k897l596l638l232k894k780k712k490k026j443j132j324j670
63785B47040j631j292j257j674j927j507p22k56l65p92j167j242r69n19j92j34
63769B31394k45l08j51J91L56r1j028j661j399n87L3L26P02J196J358J026N88
63752B31700L84L08K54M43J150K305L518M287M250L455K359J371O07K27N44J402
63736B58564J979J829J641K162K888K787K012J727K330L111L619M163M735M706
63722B98253M007L429L313L032K293J743J721J492N08n96j132j450j926j939j020
$$ plain form
63707 311728 311545 310889 309012 306791 305436 305015 305005 305551 307201 309800 312548 315028 317458 320039 322698 325457
63691 325457 328497 331754 334830 337363 339179 340083 339903 338801 337249 335608 333933 332301 331127 330906 331632
63676 331632 332619 333035 332634 331879 331416 331548 332291 333579 335159 336489 337110 337049 336560 335641 334227 332710 331615
63659 331615 330688 328912 325732 321756 317911 314351 310583 306402 302214 298614 295940 294157 292903 291808
63645 291808 290973 290961 292096 293958 295849 297561 299367 301445 303715 306200 309183 312937 317520 322855 328822
63630 328822 335244 341956 348924 356192 363764 371695 380296 390024 401073 413127 425706 438810 453224
63617 453224 470034 489703 511729 535351 560440 587425 616400 646681 677255 707131 734985
63606 734985 758946 777348 789701 796681 799267 798210 794235 788302 781432 774335 767231 759905 751916
$$ packed form
63707C11728j83o56j877k221j355m21j0N46J650K599K748K480K430K581K659K759
63691C25457L040L257L076K533J816R04j80j102j552j641j675j632j174k21P26
63676C31632R87M16m01p55m63J32P43J288J580J330O21o1m89r19j414j517j095
63659C31615r27j776l180l976l845l560l768m181m188l600k674j783j254j095
63645B91808q35j2J135J862J891J712J806K078K270K485K983L754M583N335N967
63630C28822O422O712O968P268P572P931Q601R728J1049J2054J2579J3104J4414
63617D53224J6810J9669K2026K3622K5089K6985K8975L0281L0574K9876K7854
63606G34985K3961J8402J2353O980K586j057l975n933o870p097p104p326p989
$$ plain form
63593 751916 742820 732223 719668 704687 687150 667520 646644 625374 604459 584547 565978 548629
63581 548629 532257 517097 503944 493536 485904 480360 476095 472751 470533 469826 470778 473210 476803 481251
63567 481251 486325 491944 498188 505036 512169 519286 526645 534985 544864 556371 569592 584971 602966
63554 602966 623694 647269 674231 705213 740240 778505 818418 857366 891671 917718 933669
63543 933669 940059 938794 931936 921418 909218 897147 886377 877294 869725 863189 857080 850779 843561
63530 843561 834367 821886 805081 783750 758640 731174 703009 675483 649150 623831 599205 575339
63518 575339 552620 531348 511581 493299 476555 461476 448201 436746 426784 417616 408585 399619
63506 399619 391287 384285 378894 374889 371792 369162 366770 364660 363007 361840 360892 359801 358425 356902
$$ packed form
63593G51916r096j0597j2555j4981j7537j9630k0876k1270k0915j9912j8569j7349
63581E48629j6372j5160j3153j0408p632n544m265l344k218p07R52K432L593M448
63567D81251N074N619O244O848P133P117P359Q340R879J1507J3221J5379J7995
63554F02966K0728K3575K6962L0982L5027L8265L9913L8948L4305K6047J5951
63543I33669O390j265o858j0518j2200j2071j0770r083p569o536o109o301p218
63530H43561r194j2481j6805k1331k5110k7466k8165k7526k6333k5319k4626k3866
63518E75339k2719k1272j9767j8282j6744j5079j3275j1455r962r168r031q966
63506C99619q332p002n391m005l097k630k392k110j653j167r48j091j376j523
$$ plain form
63492 356902 355460 354330 353821 354198 355243 356087 355819 354433 353004 352758 354040 356263 358715 361155 363662
63477 363662 366233 368652 370617 371867 372342 372290 372100 371873 371321 370211 368725 367122 365274 362925 360283 357830
63461 357830 355537 352911 350043 347982 347540 348211 348950 349689 351339 354443 358734 364074 370888 379234 388202
63446 388202 396867 405443 414997 426403 440073 456348 475564 497873 523403 552195 583327 614319
63434 614319 642115 664801 681983 693955 701390 705898 709870 715198 722480 731734 743369 758185 776899
63421 776899 799990 827567 858905 892281 925584 956895 984417 1006390 1021638 1030139 1032819 1030912
63409 1030912 1025622 1017999 1008793 998594 988219 978448 968944 957901 943424 925158 904064 880888
63397 880888 855507 827718 797920 766891 735532 705048 676734 651085 627488 605201 584389
$$ packed form
63492C56902j442j130n09L77J045Q44k68j386j429k46J282K223K452K440K507
63477C63662K571K419J965J250M75n2j90k27n52j110j486j603j848k349k642k453
63461C57830k293k626k868k061m42O71P39P39J650L104M291N340O814Q346Q968
63446C88202Q665Q576R554J1406J3670J6275J9216K2309K5530K8792L1132L0992
63434F14319K7796K2686J7182J1972P435M508L972N328P282R254J1635J4816J8714
63421G76899K3091K7577L1338L3376L3303L1311K7522K1973J5248Q501K680j907
63409A030912n290p623r206j0199j0375r771r504j1043j4477j8266k1094k3176
63397H80888k5381k7789k9798l1029l1359l0484k8314k5649k3597k2287k0812
$$ plain form
63386 584389 565821 549852 536260 524953 516196 510019 505937 503609 503349 505505 509589 514629 520404
63373 520404 527697 537034 547756 558890 570586 584002 599770 617286 635740 655334 677107 701865
63361 701865 729585 759622 791207 823787 857053 890326 921784 948648 968653 981319 987628 988790
63349 988790 985717 979408 971124 961914 952304 942571 932960 923327 912713 899604 882839 862356 839051
63336 839051 813834 786923 758278 728689 699931 673569 649975 628881 610571 595936 585552
63325 585552 579295 576746 577141 578683 578595 574493 565639 552783 537233 520328 503262 486771 471034
63312 471034 456217 442881 431503 421758 412850 404511 397248 391492 387005 383324 380408 378480 377421
63299 377421 376655 375635 374236 372641 370953 368952 366217 362623 358712 355377 352970 350860 348127 344601
$$ packed form
63386E84389j8568j5969j3592j1307q757o177m082k328k60K156M084N040N775
63373E20404P293R337J0722J1134J1696J3416J5768J7516J8454J9594K1773K4758
63361G01865K7720L0037L1585L2580L3266L3273L1458K6864K0005J2666O309J162
63349I88790l073o309q284r210r610r733r611r633j0614j3109j6765k0483k3305
63336H39051k5217k6911k8645k9589k8758k6362k3594k1094j8310j4635j0384
63325E85552o257k549L95J542q8m102q854j2856j5550j6905j7066j6491j5737
63312D71034j4817j3336j1378r745q908q339p263n756m487l681k916j928j059
63299C77421p66j020j399j595j688k001k735l594l911l335k407k110k733l526
$$ plain form
63285 344601 340997 338047 335830 334000 332290 330570 328692 326639 324727 323344 322526 322028 321779 321993 322782
63270 322782 323915 325008 325784 326132 326140 326182 326714 327869 329438 331295 333587 336308 338977 341102 342876 345093
63254 345093 348354 352588 357369 362476 368022 374212 381065 388334 395624 402630 409350 416055 423092 430786
63240 430786 439574 450105 462997 478352 495542 513646 532159 551228 571208 592185 614021 636653
63228 636653 660062 683982 707838 731032 753210 774317 794647 814750 835131 856042 877674
63217 877674 900384 924367 949192 974015 998192 1021190 1041897 1058580 1069849 1075299 1075030 1069027
63205 1069027 1057377 1040696 1019907 995769 969017 940722 912111 884094 857202 831759 807871
63194 807871 785527 765101 747468 733200 721863 712663 705659 701745 701466 704395 709766 717182 726523
$$ packed form
63285C44601l604k950k217j830j710j720j878k053j912j383q18m98k49K14P89
63270C22782J133J093P76L48QM2N32J155J569J857K292K721K669K125J774K217
63254C45093L261M234M781N107N546O190O853P269P290P006O720O705P037P694
63240D30786Q788J0531J2892J5355J7190J8104J8513J9069J9980K0977K1836K2632
63228F36653K3409K3920K3856K3194K2178K1107K0330K0103K0381K0911K1632
63217H77674K2710K3983K4825K4823K4177K2998K0707J6683J1269N450k69o003
63205A069027j1650j6681k0789k4138k6752k8295k8611k8017k6892k5443k3888
63194H07871k2344k0426j7633j4268j1337r200p004l914k79K929N371P416R341
$$ plain form
63181 726523 737644 750478 765091 781274 798268 815185 831697 848173 865118 882549 899910
63170 899910 916623 932656 948372 963688 977611 988808 996521 1000719 1001514 998713 991876 980586 964816
63157 964816 945261 923161 899490 874442 847986 820634 793277 766500 740591 716073 693620
63146 693620 673454 655297 638885 624029 610313 597451 585958 576710 569632 563577 557752 552518
63134 552518 548401 545125 542226 540029 539256 540024 541952 544987 549410 555131 561580 568331 575300 582239 588480
63119 588480 593355 596675 598813 600472 602269 604267 606016 607234 608290 609757 611654 613455 614647 614962
63105 614962 614259 612645 610658 608955 607777 606993 606485 606132 605508 604133 602082 599953 598159 596572 594924
63090 594924 593146 591233 589174 587231 586056 586300 588176 591378 595212 598901 602083 605058 608273 611660
$$ packed form
63181G26523J1121J2834J4613J6183J6994J6917J6512J6476J6945J7431J7361
63170H99910J6713J6033J5716J5316J3923J1197P713M198P95k801o837j1290j5770
63157I64816j9555k2100k3671k5048k6456k7352k7357k6777k5909k4518k2453
63146F93620k0166j8157j6412j4856j3716j2862j1493r248p078o055n825n234
63134E52518m117l276k899k197p73P68J928L035M423N721O449O751O969O939O241
63119E88480M875L320K138J659J797J998J749J218J056J467J897J801J192L15
63105F14962p03j614j987j703j178p84n08l53o24j375k051k129j794j587j648
63090E94924j778j913k059j943j175K44J876L202L834L689L182K975L215L387
$$ plain form
63076 611660 614904 618305 622733 628512 634921 641134 647146 653411 660124 667482 676249 687284 700547 715278
63062 715278 731210 748920 768833 790546 813547 838171 865305 895446 928577 964874 1004932
63051 1004932 1049035 1096533 1146212 1197152 1249054 1301897 1355590 1409959 1464761 1519466 1573193
63040 1573193 1625170 1675370 1724532 1773504 1822644 1871872 1921041 1969972 2018171 2064663 2108157
63029 2108157 2147177 2180037 2204877 2219993 2224198 2216954 2198277 2168635 2128921 2080323 2024129 1961617
63017 1961617 1894262 1824066 1753477 1684738 1619221 1557602 1500629 1449369 1404569 1366159 1333806
63006 1333806 1307703 1288322 1275515 1268520 1266942 1271044 1280760 1294972 1312275 1332136 1354768 1380068
62994 1380068 1407205 1435141 1463168 1491041 1519084 1548054 1578356 1609297 1639452 1667734 1693665
$$ packed form
63076F11660L244L401M428N779O409O213O012O265O713P358Q767J1035J3263J4731
63062G15278J5932J7710J9913K1713K3001K4624K7134L0141L3131L6297M0058
63051A004932M4103M7498M9679N0940N1902N2843N3693N4369N4802N4705N3727
63040A573193N1977N0200M9162M8972M9140M9228M9169M8931M8199M6492M3494
63029B108157L9020L2860K4840J5116M205p244j8677k9642l9714m8598n6194o2512
63017A961617o7355p0196p0589o8739o5517o1619n6973n1260m4800l8410l2353
63006A333806k6103j9381j2807o995j578M102R716J4212J7303J9861K2632K5300
62994A380068K7137K7936K8027K7873K8043K8970L0302L0941L0155K8282K5931
$$ plain form
62983 1693665 1716648 1735600 1749428 1757363 1758637 1752396 1738251 1716505 1687598 1651794 1609766 1562957
62971 1562957 1512858 1460303 1405959 1351158 1297529 1245934 1196404 1149098 1104692 1063717 1026026
62960 1026026 991118 958629 928266 899632 872417 846628 822351 799326 776952 754818 733167
62949 733167 712762 694193 677358 661762 647208 633905 621849 610500 599238 587902 576760
62938 576760 566288 557148 549871 544176 539011 533739 528917 525414 523140 521362 519925 519266 519222 518738 517033
62923 517033 514402 511603 509013 506682 504635 502690 500319 497094 493112 488802 484549 480625 477225 474378
62909 474378 472009 470129 468699 467353 465690 463870 462460 461577 460668 459278 457541 455767 454071 452698 452126
62894 452126 452448 453051 453298 453211 453185 453385 453790 454451 455335 456210 457025 458031 459224 460018 459955 459379 458918 458619 458072
$$ packed form
62983A693665K2983J8952J3828P935J274o241j4145k1746k8907l5804m2028m6809
62971A562957n0099n2555n4344n4801n3629n1595m9530m7306m4406m0975l7691
62960A026026l4908l2489l0363k8634k7215k5789k4277k3025k2374k2134k1651
62949G33167k0405j8569j6835j5596j4554j3303j2056j1349j1262j1336j1142
62938E76760j0472r140p277n695n165n272m822l503k274j778j437o59m4m84j705
62923E17033k631k799k590k331k047j945k371l225l982m310m253l924l400k847
62909D74378k369j880j430j346j663j820j410q83r09j390j737j774j696j373n72
62894D52126L22O03K47q7k6K00M05O61Q84Q75Q15J006J193P94o3n76m61k99n47
$$ plain form
62875 458072 457195 456318 455625 454978 454232 453388 452473 451580 450845 450146 449066 447484 445914 444900 444370 444017 443985 444659
62857 444659 446093 448167 450979 454420 457651 459782 460931 461852 462645 462730 462128 461821 462550 464011 465515 466708
62841 466708 467309 466918 465696 464642 464555 465064 465167 464409 463060 461507 460039 459006 458622 458705 459040 459864 461506
62824 461506 463660 465492 466540 467113 467826 469101 471153 474027 477493 481199 485065 489306 494001 498919 503931
62809 503931 509285 515215 521441 527393 532912 538471 544585 551155 557537 563250 568513 574084 580669 588603
62795 588603 598090 609488 623134 638960 656619 676151 698278 723799 752871 785222 821055 861296
62783 861296 906785 957545 1013145 1073509 1138964 1209675 1285423 1365885 1450544 1538184 1626847
62772 1626847 1714489 1799354 1879536 1952556 2015813 2067326 2105814 2130344 2140290 2135588 2116680 2084191
$$ packed form
62875D58072q77q77o93o47p46q44r15q93p35o99j080j582j570j014n30l53l2O74
62857D44659J434K074K812L441L231K131J149R21P93Q5o02l07P29J461J504J193
62841D66708O01l91j222j054q7N09J03p58j349j553j468j033l84Q3L35Q24J642
62824D61506K154J832J048N73P13J275K052K874L466L706L866M241M695M918N012
62809E03931N354N930O226N952N519N559O114O570O382N713N263N571O585P934
62795E88603R487J1398J3646J5826J7659J9532K2127K5521K9072L2351L5833M0241
62783H61296M5489N0760N5600O0364O5455P0711P5748Q0462Q4659Q7640Q8663
62772A626847Q7642Q4865Q0182P3020O3257N1513L8488K4530R946m702j8908l2489
$$ plain form
62760 2084191 2038915 1982130 1915745 1842111 1763667 1682505 1600048 1517277 1435453 1356375 1281574
62749 1281574 1211446 1145545 1083648 1026059 972977 924149 879372 838799 802411 769544 739377
62738 739377 711747 687059 665422 646277 629084 614040 601743 592130 584062 576165 568017 560327
62726 560327 554046 549494 546327 544031 542340 541383 541551 543094 545775 549203 553509 559330 566919 575682 585009
62711 585009 595269 607494 622272 639455 658920 681047 706271 734573 765622 799216 835451
62700 835451 874673 917420 964279 1015690 1071812 1132368 1196454 1262640 1329541 1396135 1461235
62689 1461235 1522805 1578264 1625431 1662828 1689134 1703072 1704155 1693142 1671395 1640009 1599868
62678 1599868 1552249 1498879 1441287 1380408 1317016 1252475 1188793 1127731 1069925 1015083 963035
$$ packed form
62760B084191m5276n6785o6385p3634p8444q1162q2457q2771q1824p9078p4801
62749A281574p0128o5901o1897n7589n3082m8828m4777m0573l6388l2867l0167
62738G39377k7630k4688k1637j9145j7193j5044j2297r613q068p897q148p690
62726E60327o281m552l167k296j691r57J68J543K681L428M306N821P589Q763R327
62711E85009J0260J2225J4778J7183J9465K2127K5224K8302L1049L3594L6235
62700H35451L9222M2747M6859N1411N6122O0556O4086O6186O6901O6594O5100
62689A461235O1570N5459M7167L7397K6306J3938J083j1013k1747l1386m0141
62678A599868m7619n3370n7592o0879o3392o4541o3682o1062n7806n4842n2048
$$ plain form
62667 963035 914292 869443 828434 790819 756401 725173 696880 671148 648014 627769 610271
62656 610271 594848 580851 567789 554997 541892 528790 516827 506723 498007 489782 481905 475109
62644 475109 470230 467525 466387 465545 463932 461609 459524 458136 456769 454587 451662 448606 445617 442522
62630 442522 439423 436589 433789 430513 426965 424245 423266 423845 425132 426653 428573 431114 434045 436927 439701
62615 439701 442797 446596 450965 455474 459909 464286 468565 472804 477629 483998 492266 501882 512286 523756
62601 523756 537123 553072 571988 594105 619279 646948 676815 709387 745356 784554 825950
62590 825950 868529 911626 954475 995915 1034625 1069241 1098317 1120683 1135951 1144196 1145090 1137868
62578 1137868 1122433 1100076 1072786 1042093 1008799 973479 936772 899292 861669 824753 789487
$$ packed form
62667I63035m8743m4849m1009l7615l4418l1228k8293k5732k3134k0245j7498
62656F10271j5423j3997j3062j2792j3105j3102j1963j0104q716q225p877o796
62644D75109m879k705j138q42j613k323k085j388j367k182k925l056k989l095
62630D42522l099k834k800l276l548k720r79N79J287J521J920K541K931K882K774
62615D39701L096L799M369M509M435M377M279M239M825O369Q268R616J0404J1470
62601E23756J3367J5949J8916K2117K5174K7669K9867L2572L5969L9198M1396
62590H25950M2579M3097M2849M1440L8710L4616K9076K2366J5268Q245Q94p222
62578A137868j5435k2357k7290l0693l3294l5320l6707l7480l7623l6916l5266
$$ plain form
62567 789487 756398 725321 695818 667894 642194 619401 599538 582046 566501 552910 541224
62556 541224 530915 521395 512627 504937 498279 492126 486155 480687 476290 473168 471078 469665 468734 468300
62542 468300 468409 468820 468913 468146 466609 464906 463444 462152 460946 460119 459931 460132 460370 461052 463385 468330 475670
62525 475670 484308 493445 503281 514619 528039 543663 561543 581868 604636 629458 656046 684832
62513 684832 716722 752184 790801 831799 874619 918738 963165 1006544 1047695 1085736 1119674
62502 1119674 1148284 1170693 1186954 1197882 1204526 1208064 1209960 1211661 1214012 1217339 1222320 1230381 1242920
62489 1242920 1260461 1282978 1310728 1344181 1383172 1426703 1473429 1521524 1567845 1608269 1639901
62478 1639901 1662724 1678374 1687291 1687647 1676892 1653626 1617896 1570666 1513822 1450297 1383236 1314638
$$ packed form
62567G89487l3089l1077k9503k7924k5700k2793j9863j7492j5545j3591j1686
62556E41224j0309r520q768p690o658o153n971n468m397l122k090j413r31m34
62542D68300J09M11R3p67j537j703j462j292j206q27j88K01K38O82K333M945P340
62525D75670Q638R137R836J1338J3420J5624J7880K0325K2768K4822K6588K8786
62513F84832L1890L5462L8617M0998M2820M4119M4427M3379M1151L8041L3938
62502A119674K8610K2409J6261J0928O644L538J896J701K351L327M981Q061J2539
62489A242920J7541K2517K7750L3453L8991M3531M6726M8095M6321M0424L1632
62478A639901K2823J5650Q917L56j0755k3266l5730m7230n6844o3525o7061o8598
$$ plain form
62466 1314638 1245107 1175048 1105808 1039398 977362 920309 868397 821753 780201 743058 709669
62455 709669 680015 654425 632762 614322 598515 585219 574455 566136 560227 556680 555029 554459 554591
62442 554591 555755 558261 561795 565918 570656 576055 581439 585726 588372 589497 589299 587831 585252 581676
62428 581676 576883 570715 563712 556730 549931 542806 535258 527861 520857 513700 506078 498677 492305 486719
62414 486719 481076 475288 470148 466147 462816 459386 455684 452148 449267 447202 445788 444822 444405 444990 446894
62399 446894 449793 452880 455585 458023 460696 463924 467550 471098 474191 476944 479928 483658 488070 492709
62385 492709 497388 502509 508569 515501 522680 529567 536202 543027 550364 558214 566519 575383 584879 594781
62371 594781 604712 614615 624933 636319 649371 664730 683194 705371 731161 759856 790998 825204
$$ packed form
62466A314638o9531p0059o9240o6410o2036n7053n1912m6644m1552l7143l3389
62455G09669k9654k5590k1663j8440j5807j3296j0764q319n909l547j651n70J32
62442E54591J164K506L534M123M738N399N384M287K646J125j98j468k579l576
62428E81676m793o168p003o982o799p125p548p397p004p157p622p401o372n586
62414D86719n643n788n140m001l331l430l702l536k881k065j414r66m17N85J904
62399D46894K899L087K705K438K673L228L626L548L093K753K984L730M412M639
62385D92709M679N121O060O932P179O887O635O825P337P850Q305Q864R496R902
62371E94781R931R903J0318J1386J3052J5359J8464K2177K5790K8695L1142L4206
$$ plain form
62359 825204 863913 908073 956978 1008544 1060775 1112738 1163847 1212499 1256064 1292384 1320854
62348 1320854 1341855 1355669 1362514 1363145 1358557 1348968 1333810 1313024 1287756 1259394 1228415 1194815
62336 1194815 1159382 1123855 1089769 1057681 1027611 999735 974369 951595 931153 912576 895294
62325 895294 878863 863227 848524 834543 820638 806347 791821 777492 763699 750821 739297
62314 739297 729121 719660 710472 701891 694249 686978 679346 671845 665761 661193 656505 650168 642324 634029
62300 634029 625820 617795 610519 604801 600709 597525 594643 591979 589635 587773 586749 586825 587742 589032 590635
62285 590635 592737 595123 597328 599409 601869 604742 607436 609749 612369 616047 620769 626114 631944 638342
62271 638342 645275 652807 661366 671372 682887 696043 711555 730260 752296 777317 805498 837802
$$ packed form
62359H25204L8709M4160M8905N1566N2231N1963N1109M8652M3565L6320K8470
62348A320854K1001J3814O845O31m588r589j5158k0786k5268k8362l0979l3600
62336A194815l5433l5527l4086l2088l0070k7876k5366k2774k0442j8577j7282
62325H95294j6431j5636j4703j3981j3905j4291j4526j4329j3793j2878j1524
62314G39297j0176r461r188q581p642p271p632p501o084m568m688o337p844q295
62300F34029q209q025p276n718m092l184k882k664k344j862j024P6R17J290J603
62285E90635K102K386K205K081K460K873K694K313K620L678M722N345N830O398
62271F38342O933P532Q559J0006J1515J3156J5512J8705K2036K5021K8181L2304
$$ plain form
62259 837802 875104 917457 964371 1015349 1069810 1126643 1184063 1239817 1291382 1336317 1372964
62248 1372964 1401094 1421672 1435713 1443294 1443710 1436541 1422291 1401831 1375451 1342877 1304293 1261010
62236 1261010 1214830 1167026 1118316 1069731 1022849 978926 938173 900309 865603 834806 808136
62225 808136 784898 764310 746244 730802 717567 705787 695116 685618 677164 669391 662328 656484
62213 656484 652070 648588 645475 642736 640590 638909 637496 636684 637142 639101 642155 645773 649747 654175 659296
62198 659296 665257 671814 678341 684452 690516 697248 704878 713041 721435 730241 739887 750631 762302 774221
62184 774221 785512 795820 805580 815241 824433 832381 838991 844933 850681 856190 861647 867932 876004 886324
62170 886324 899211 915388 935793 961093 991503 1026652 1065239 1105058 1143682 1179087 1209794
$$ packed form
62259H37802L7302M2353M6914N0978N4461N6833N7420N5754N1565M4935L6647
62248A372964K8130K0578J4041P581M16p169j4250k0460k6380l2574l8584m3283
62236A261010m6180m7804m8710m8585m6882m3923m0753l7864l4706l0797k6670
62225H08136k3238k0588j8066j5442j3235j1780j0671r498q454p773p063n844
62213F56484m414l482l113k739k146j681j413q12M58J959L054L618L974M428N121
62198F59296N961O557O527O111O064O732P630Q163Q394Q806R646J0744J1671J1919
62184G74221J1291J0308R760R661R192P948O610N942N748N509N457O285Q072J0320
62170H86324J2887J6177K0405K5300L0410L5149L8587L9819L8624L5405L0707
$$ plain form
62159 1209794 1235008 1254869 1269985 1280329 1284993 1283469 1276686 1266131 1252180 1233946 1210675 1182773
62147 1182773 1151516 1118353 1084618 1051359 1019161 988308 959239 932599 908797 887750 869175
62136 869175 852875 838587 825764 813811 802533 792214 783174 775304 768101 761154 754511 748542 743566
62123 743566 739848 737871 738313 741601 747582 755582 764587 773320 780548 785572 788404 789454 789208 788147 786611
62108 786611 784643 782216 779607 777060 773964 768942 761149 751125 740084 728956 718561 710054 704185
62095 704185 700317 697113 694281 692880 693761 696438 699795 703226 706636 709866 712807 715859 719735 724799
62081 724799 730950 738160 746786 757265 769688 783790 799314 816254 834699 854442 874853 895292
62069 895292 915683 936729 959600 985299 1013903 1044143 1073973 1101878 1127510 1150744 1170484
$$ packed form
62159A209794K5214J9861J5116J0344M664j524o783j0555j3951j8234k3271k7902
62147A182773l1257l3163l3735l3259l2198l0853k9069k6640k3802k1047j8575
62136H69175j6300j4288j2823j1953j1278j0319r040p870p203o947o643n969m976
62123G43566l718j977M42L288N981Q000R005Q733P228N024K832J050k46j061j536
62108G86611j968k427k609k547l096n022p793j0024j1041j1128j0395q507n869
62095G04185l868l204k832j401Q81K677L357L431L410L230K941L052L876N064
62081G24799O151P210Q626J0479J2423J4102J5524J6940J8445J9743K0411K0439
62069H95292K0391K1046K2871K5699K8604L0240K9830K7905K5632K3234J9740
$$ plain form
62058 1170484 1185107 1194040 1198159 1198439 1194967 1187688 1177322 1164697 1149503 1130575 1107438 1080869
62046 1080869 1051913 1021027 988501 955138 922004 889747 858496 828278 799222 771515 745381
62035 745381 720957 697985 675896 654619 635080 618333 604173 591219 578586 566919 557348 549881
62023 549881 543444 537226 531232 525451 519295 512312 505026 498574 493587 489776 486407 482855 478827 474466
62009 474466 470323 466979 464630 463187 462703 463437 465478 468579 472391 476618 480866 484665 487808 490458 492679
61994 492679 494161 494661 494524 494327 494031 492834 489967 485368 479463 472591 464895 456606 448133 439922 432381
61979 432381 425841 420359 415596 411197 407300 404367 402434 400840 398962 397018 395862 396077 397509 399642
61965 399642 402075 404514 406530 407593 407440 406389 405237 404783 405399 407046 409587 412851 416373 419440 421761
$$ packed form
62058A170484J4623Q933M119K80l472p279j0366j2625j5194j8928k3137k6569
62046A080869k8956l0886l2526l3363l3134l2257l1251l0218k9056k7707k6134
62035G45381k4424k2972k2089k1277j9539j6747j4160j2954j2633j1667r571p467
62023E49881o437o218n994n781o156o983p286o452m987l811l369l552m028m361
62009D74466m143l344k349j443m84P34K041L101L812M227M248L799L143K650K221
61994D92679J482N00j37j97k96j197k867m599n905o872p696q289q473q211p541
61979D32381o540n482m763m399l897k933j933j594j878j944j156K15J432K133
61965C99642K433K439K016J063j53j051j152m54O16J647K541L264L522L067K321
$$ plain form
61950 421761 423971 427132 431708 437243 443061 449098 455981 464464 474759 486306 498237 510271 523050
61937 523050 537319 552851 568495 583340 597408 611106 624358 636614 647471 656956 665176 671906
61925 671906 676567 678587 677824 674711 670004 664445 658636 653057 647976 643490 639855 637641 637281 638673 641666
61910 641666 646778 654842 665844 678667 692127 705697 719010 731197 741172 748227 752050 752608 750390
61897 750390 746341 741020 734141 725380 715344 705188 695495 686140 677132 668949 661892 655606 649379 642627
61883 642627 635030 626500 617171 607297 597130 586968 577125 567678 558438 549435 541171 534095 528120 523074
61869 523074 519309 517292 516724 516767 517157 518519 521486 526082 532079 539427 548072 557866 568918 581615 596055
61854 596055 611879 628960 647846 669179 692949 718624 745623 773208 800208 825444 848435
$$ packed form
61950D21761K210L161M576N535N818O037O883Q483J0295J1547J1931J2034J2779
61937E23050J4269J5532J5644J4845J4068J3698J3252J2256J0857R485Q220O730
61925F71906M661K020p63l113m707n559n809n579n081m486l635k214l60J392K993
61910F41666N112Q064J1002J2823J3460J3570J3313J2187R975P055L823N58k218
61897G50390m049n321o879q761j0036j0156r693r355r008q183p057o286o227o752
61883F42627p597q530r329r874j0167j0162r843r447r240r003q264p076n975n046
61869E23074l765k017n68M3L90J362K967M596N997P348Q645R794J1052J2697J4440
61854E96055J5824J7081J8886K1333K3770K5675K6999K7585K7000K5236K2991
$$ plain form
61843 848435 869244 887588 902510 913022 918827 920285 917933 912253 903851 893719 883350 874499 868561
61830 868561 865930 866047 868278 872698 879850 889747 901396 913453 925003 935411 943693 948667 949732
61817 949732 947017 940630 930343 916335 899684 881599 862436 841988 820474 798649 777065 755892
61805 755892 735475 716461 699171 683272 668290 654114 640924 628963 618500 609684 602260 595698
61793 595698 589648 583995 578484 572823 567347 563043 560494 559088 557635 555572 553247 551249 549783 548583
61779 548583 547091 544771 541572 538109 535242 533419 532482 531972 531523 531079 530899 531293 532286 533627 535214 537340
61763 537340 540412 544548 549588 555354 561708 568455 575300 581862 587677 592332 595678 597776 598512 597493
61749 597493 594487 589815 584062 577523 570227 562451 554923 548400 543187 539107 535745 532650 529447 525997
$$ packed form
61843H48435K0809J8344J4922J0512N805J458k352n680q402j0132j0369q851n938
61830H68561k631J17K231M420P152R897J1649J2057J1550J0408Q282M974J065
61817I49732k715o387j0287j4008j6651j8085j9163k0448k1514k1825k1584k1173
61805G55892k0417j9014j7290j5899j4982j4176j3190j1961j0463q816p424o562
61793E95698o050n653n511n661n476m304k549j406j453k063k325j998j466j200
61779E48583j492k320l199l463k867j823r37n10m49m44j80L94R93J341J587K126
61763E37340L072M136N040N766O354O747O845O562N815M655L346K098P36j019
61749E97493l006m672n753o539p296p776p528o523n213m080l362l095l203l450
$$ plain form
61735 525997 522493 519300 516643 514489 512734 511384 510443 509762 509235 509102 509741 511044 512301 512901 512916 512772
61719 512772 512619 512357 512065 511964 512024 512018 511887 511681 511196 510115 508516 506754 504789 502131 498670 494995 491614
61702 491614 488254 484338 479874 475470 471595 468148 464669 460803 456638 452704 449483 446902 444506 442136
61688 442136 439996 437967 435452 432227 428958 426316 423984 421181 417940 415164 413394 412186 410875 409398
61674 409398 408082 406999 405887 404582 403275 402425 402479 403544 405262 407093 408798 410490 412246 413915 415419
61659 415419 416921 418550 420114 421380 422458 423578 424500 424535 423399 421807 420921 421320 422778 424959 427885
61644 427885 431580 435711 439938 444293 448779 452747 455274 456171 456147 455878 455362 454338 452809 450760 447786
61629 447786 443523 438313 433039 428340 424348 421081 418688 417198 416361 415860 415529 415206 414549 413161 410965
$$ packed form
61735E25997l504l193k657k154j755j350r41o81n27j33O39J303J257O00J5j44
61719E12772j53k62k92j01O0oj31k06m85j081j599j762j965k658l461l675l381
61702D91614l360l916m464m404l875l447l479l866m165l934l221k581k396k370
61688D42136k140k029k515l225l269k642k332k803l241k776j770j208j311j477
61674D09398j316j083j112j305j307q50N4J065J718J831J705J692J756J669J504
61659D15419J502J629J564J266J078J120R22L5j136j592q86L99J458K181K926
61644D27885L695M131M227M355M486L968K527Q97k4k69n16j024j529k049k974
61629D47786m263n210n274m699l992l267k393j490q37n01l31l23o57j388k196
$$ plain form
61614 410965 408422 406281 404966 404165 403182 401705 400018 398332 396169 392788 388176 383290 379171 375982 372990
61599 372990 369417 365228 361105 357724 355109 352783 350476 348446 346974 345791 344355 342639 341296 340896
61585 340896 341232 341570 341409 340735 339644 338130 336381 334931 334161 333775 333152 332182 331382 331135 331262 331501 331927
61568 331927 332554 332944 332721 332194 331938 331952 331818 331590 331861 332888 334281 335706 337257 338920 340264 341075 341804
61551 341804 342945 344303 345308 345831 346269 346995 348034 349172 350152 350869 351554 352561 353914 355365 357008 359351
61535 359351 362439 365390 367286 368258 369155 370388 371590 372251 372149 371213 369530 367541 365774 364264 362591
61520 362591 360634 358953 358193 358312 358596 358373 357602 356723 356076 355610 355238 355243 355912 356836 357070 356222 354997 354405
61502 354405 354787 355858 357322 359016 360772 362552 364518 366621 368425 369764 371245 373515 376288 378758
$$ packed form
61614D10965k543k141j315q01r83j477j687j686k163l381m612m886m119l189k992
61599C72990l573m189m123l381k615k326k307k030j472j183j436j716j343m00
61585C40896L36L38j61o74j091j514j749j450p70l86o23r70q00k47J27K39M26
61568C31927O27L90k23n27k56J4j34k28K71J027J393J425J551J663J344Q11P29
61551C41804J141J358J005N23M38P26J039J138R80P17O85J007J353J451J643K343
61535C59351L088K951J896R72Q97J233J202O61j02r36j683j989j767j510j673
61520C62591j957j681p60J19K84k23p71q79o47m66l72NO69R24K34q48j225n92
61502C54405L82J071J464J694J756J780J966K103J804J339J481K270K773K470
$$ plain form
61488 378758 380829 383281 386651 390582 394356 397530 399935 401542 402563 403272 403595 403210 402090 400516 398543
61473 398543 396025 393369 391671 391630 392696 393683 394007 393955 393955 393981 393673 392730 391157 389261 387420 385745 383994
61456 383994 381923 379681 377800 376767 376634 376970 377217 377145 377002 377177 377719 378278 378560 378781 379648 381804 385208
61439 385208 389139 392911 396515 400264 403893 406550 407898 408772 410350 412950 416042 419090 421852 424051
61425 424051 425429 426236 427196 428812 430973 433228 435166 436542 437378 438001 438664 439159 439109 438614 438208 438167 438179 437739
61407 437739 436554 434568 432072 429853 428767 428901 429399 429331 428548 427587 426962 426727 426559 426146 425545 425221 425716
61390 425716 427349 430200 434041 438075 441201 443015 444318 446156 448608 451047 453300 455729 458230 460094
61376 460094 461133 462237 464380 467538 470885 473586 475223 475907 476276 476972 477845 478050 477083 475331 473470 471888
$$ packed form
61488C78758K071K452L370L931L774L174K405J607J021P09L23l85j120j574j973
61473C98543k518k656j698m1J066R87L24n2%K6l08r43j573j896j841j675j751
61456C83994k071k242j881j033j33L36K47p2j43J75N42N59K82K21Q67K156L404
61439C85208L931L772L604L749L629K657J348Q74J578K600L092L048K762K199
61425D24051J378Q07R60J616K161K255J938J376Q36O23O63M95n0m95m06m1J2m40
61407D37739j185j986k496k219j086J34M98o8p83r61o25k35j68m13o01l24M95
61390D25716J633K851L841M034L126J814J303J838K452K439K253K429K501J864
61376D60094J039J104K143L158L347K701J637O84L69O96Q73K05r67j752j861j582
$$ plain form
61360 471888 470921 471021 472332 474599 477825 482457 488571 495475 502559 509907 517540 524715 530721 535798 540379
61345 540379 543840 545101 544389 543390 543481 544575 545856 546855 547475 547584 547113 546273 545255 543888 541843 539011
61329 539011 535590 531952 528526 525617 523282 521524 520569 520715 521907 523715 525821 528264 531222 534822 539238
61314 539238 544663 551075 558317 566510 576126 587497 600518 614962 630697 647137 662753 675772
61302 675772 685483 692469 697299 699469 698121 693626 687795 682291 677192 671391 664020 655110 645164 634826
61288 634826 625041 616910 610918 606470 602470 598287 594075 590360 587569 585876 585281 585761 587266 589566 592303
61273 592303 595459 599522 604652 609787 613288 614772 615718 617873 621585 626222 631676 638534 646938 656068
61259 656068 664900 672890 679807 685451 689728 692569 693610 692402 689190 685091 681149 677454 673492 669078
$$ packed form
61360D71888r67J00J311K267L226M632O114O904P084P348P633P175O006N077M581
61345E40379L461J261p12r99R1J094J281R99O20J09m71q40j018j367k045k832
61329E39011l421l638l426k909k335j758r55J46J192J808K106K443K958L600M416
61314E39238N425O412P242Q193R616J1371J3021J4444J5735J6440J5616J3019
61302F75772R711O986M830K170j348m495n831n504n099n801p371q910r946j0338
61288F34826r785q131n992m448m000m183m212l715k791j693n95M80J505K300K737
61273E92303L156M063N130N135L501J484R46K155L712M637N454O858Q404R130
61259F56068Q832P990O917N644M277K841J041j208l212m099l942l695l962m414
$$ plain form
61245 669078 664567 660256 656012 651607 647177 643235 640299 638481 637394 636480 635535 634880 634907 635508 636158 636679
61229 636679 637707 640168 644217 648905 653063 656410 659662 663624 668450 673834 679539 685445 691239 696528
61215 696528 701341 706244 711738 717646 723259 728013 731855 734989 737532 739520 741170 743004 745731 750034
61201 750034 756415 765084 776046 789366 805314 824026 844922 866585 887353 905998 921874 934676
61189 934676 944380 951364 956339 959943 962415 963624 963368 961605 958419 953829 947676 939793 930238 919255
61175 919255 907097 894084 880802 867861 855310 842572 829090 814815 799975 784750 769499
61164 769499 754930 741599 729446 718175 707900 698990 691529 685491 681276 679506 680281 683183 688015
61151 688015 694904 703501 712576 720622 726569 729800 730000 727311 722369 715922 708529 700694 693078 686472
$$ packed form
61245F69078m511m311m244m405m430l942k936j818j087r14r45o55K7O01O50N21
61229F36679J028K461M049M688M158L347L252L962M826N384N705N906N794N289
61215F96528M813M903N494N908N613M754L842L134K543J988J650J834K727M303
61201G50034O381Q669J0962J3320J5948J8712K0896K1663K0768J8645J5876J2802
61189I34676R704O984M975L604K472J209k56j763l186m590o153p883r555j0983
61175I19255j2158j3013j3282j2941j2551j2738j3482j4275j4840j5225j5251
61164G69499j4569j3331j2153j1271j0275q910p461o038m215j770P75K902M832
61151F88015O889Q597R075Q046N947L231K00k689m942o447p393p835p616o606
$$ plain form
61137 686472 681617 678937 678230 678808 680321 683340 688718 696552 706196 717176 729543 743536 759492 777923
61123 777923 798898 821435 844373 867867 893045 920071 947684 975017 1002752 1031801 1061833
61112 1061833 1091948 1122030 1152431 1182816 1212221 1239963 1265744 1289125 1309583 1326901 1340980
61101 1340980 1351559 1358606 1362613 1364001 1362683 1358739 1353008 1346323 1338657 1329758 1320215 1311102 1302895 1295535
61087 1295535 1289163 1283900 1279214 1274524 1270301 1267613 1266624 1266457 1266447 1266559 1266568 1265925 1264732 1263787 1263230 1261940 1258809
61070 1258809 1254054 1248770 1243669 1238660 1233286 1227162 1220174 1212488 1204227 1195212 1185425 1175677 1167219 1160483
61056 1160483 1154718 1149092 1143753 1139501 1136825 1135601 1135558 1136708 1139343 1143685 1149570 1156577 1164582 1173938
61042 1173938 1184932 1197293 1210528 1224440 1238980 1253889 1269059 1284992 1302420 1321580 1342273
$$ packed form
61137F86472m855k680p07N78J513L019N378P834R644J0980J2367J3993J5956J8431
61123G77923K0975K2537K2938K3494K5178K7026K7613K7333K7735K9049L0032
61112A061833L0115L0082L0401L0385K9405K7742K5781K3381K0458J7318J4079
61101A340980J0579P047M007J388j318l944n731o685p666q899r543r113q207p360
61087A295535o372n263m686m690m223k688r89j67j0J12Ro43j193r45n57j290l131
61070A258809m755n284n101n009n374o124o988p686q261r015r787r748q458o736
61056A160483n765n626n339m252k676j224m3J150K635M342N885P007Q005R356
61042A173938J0994J2361J3235J3912J4540J4909J5170J5933J7428J9160K0693
$$ plain form
61031 1342273 1364412 1388071 1413301 1440315 1469380 1499931 1530426 1559985 1589772 1621853 1657318
61020 1657318 1696802 1742315 1796712 1861133 1934497 2015846 2105847 2205843 2317381 2443816 2591301
61009 2591301 2767515 2980707 3240777 3560249 3954003 4440486 5045105 5801593 6749586
61000 6749586 7932815 9396541 11169545 13221854 15422278 17543071 19332628 20617682
60992 20617682 21366930 21682382 21743798 21750765 21876258 22217588 22747173 23300370 23632424 23523577
60982 23523577 22867439 21692991 20125373 18326518 16448853 14610326 12886764 11317105
60974 11317105 9915437 8681744 7607707 6680181 5884734 5207661 4635225 4152610 3744972
60965 3744972 3399293 3104719 2851933 2633137 2442436 2275412 2128223 1997479 1880882
$$ packed form
61031A342273K2139K3659K5230K7014K9065L0551L0495K9559K9787L2081L5465
61020A657318L9484M5513N4397O4421P3364Q1349R0001R9996J11538J26435J47485
61009B591301J76214K13192K60070L19472L93754M86483O04619P56488R47993
61000F749586J183229J463726J773004K052309K200424K120793J789557J285054
60992B0617682P49248L15452O1416O967J25493L41330N29585N53197L32054j08847
60982B3523577o56138j174448j567618j798855j877665j838527j723562j569659
60974A1317105j401668j233693j074037r27526p95447o77073n72436m82615m07638
60965C744972l45679k94574k52786k18796j90701j67024j47189j30744j16597
$$ plain form
60956 1880882 1777460 1686909 1608643 1541281 1482786 1431018 1384137 1340542 1298741 1257724 1217458
60945 1217458 1178663 1141920 1107159 1073979 1042192 1011904 983257 956148 930177 904994 880817
60934 880817 858407 838280 820095 803084 786869 771473 756805 742702 729453 717632 707281
60923 707281 697768 688650 680268 673212 667573 662970 659053 655720 653027 651086 649884 649108 648252 646992 645282
60908 645282 643123 640513 637679 634986 632477 629729 626385 622560 618572 614494 610150 605368 600098 594391
60894 594391 588362 581975 574922 567072 559151 552464 547620 543916 540359 536907 534053 531510 528180 523628
60880 523628 518832 514961 511904 508573 504439 500141 496616 494157 492467 491181 490082 489142 488658 489183 491028
60865 491028 493965 497589 501766 506458 511335 515960 520229 524232 527780 530500 532412 533924 535256 536332
$$ packed form
60956A880882j03422r0551p8266o7362n8495n1768m6881m3595m1801m1017m0266
60945A217458l8795l6743l4761l3180l1787l0288k8647k7109k5971k5183k4177
60934H80817k2410k0127j8185j7011j6215j5396j4668j4103j3249j1821j0351
60923G07281r513r118q382p056n639m603l917l333k693j941j202p76q56j260j710
60908F45282k159k610k834k693k509k748l344l825l988m078m344m782n270n707
60894E94391o029o387p053p850p921o687m844l704l557l452k854k543l330m552
60880E23628m796l871l057l331m134m298l525k459j690j286j099r40m84N25J845
60865D91028K937L624M177M692M877M625M269M003L548K720J912J512J332J076
$$ plain form
60851 536332 537380 539013 541400 543850 545582 546500 546760 546049 543936 540704 537145 533515 529231 523747 517282
60836 517282 510501 503809 497166 490421 483651 477197 471396 466210 461223 456073 450808 445736 441132 437280
60822 437280 434498 432818 431738 430605 429145 427370 425174 422385 419139 415754 412290 408579 404661 400863
60808 400863 397526 394972 393612 393547 394139 394475 394318 394050 393742 393063 392328 392751 394983 397932 399807 400079 399778
60791 399778 400037 401046 402447 403983 405454 406574 407326 408203 409688 411529 412800 412694 411189 409025 407194
60776 407194 406328 406329 406484 406030 404686 402647 400265 397969 396430 396294 397458 398870 399520 399502 399650 400181 400344
60759 400344 399632 398699 398533 399115 399591 399573 399482 399542 399191 397907 396154 395063 395391 397116 399772 402759 405386
60742 405386 407027 407342 406246 403738 399962 395365 390519 385807 381471 377940 375783 375170 375518 375832 375416
$$ packed form
60851E36332J048J633K387K450J732R18K60p11k113l232l559l630m284n484o465
60836E17282o781o692o643o745o770o454n801n186m987n150n265n072m604l852
60822D37280k782j680j080j133j460j775k196k789l246l385l464l711l918l798
60808D00863l337k554j360o5N92L36j57k68l08o79p35M23K232K949J875K72l01
60791C99778K59J009J401J536J471J120P52Q77J485J841J271j06j505k164j831
60776D07194q66JJ55m54j344k039k382k296j539j36J164J412O50j8J48N31J63
60759D00344p12r33j66N82M76j8r1O0l51j284j753j091L28J725K656K987K627
60742D05386J641L15j096k508l776m597m846m712m336l531k157o13L48L14m16
$$ plain form
60727 375416 374290 373079 372501 372850 373860 375094 376457 378210 380532 383264 386161 389127 392035 394460 395949
60712 395949 396576 396983 397715 398620 399097 398877 398410 398392 398944 399415 399074 397902 396553 395530 394682 393597 392216
60695 392216 390742 389179 387328 385169 382882 380531 378162 376209 375225 375082 375018 374856 375607 378283 382439 386499
60679 386499 389411 391492 393789 397079 401339 405695 408908 410411 410802 410939 410748 409521 407189 404482 401807
60664 401807 398819 395375 392120 389674 387862 386315 385357 385679 387348 389637 391769 393579 395512 398092 401294
60649 401294 404435 406982 409256 411800 414162 415156 414506 413231 412022 410213 407131 403618 401162 399961 398841
60634 398841 396813 393890 390634 387795 386195 386047 386453 386387 386062 386484 387725 388671 388594 388009 387654 387563 387543 387770
60616 387770 388385 389033 389368 389531 389732 389831 389752 389866 390470 391257 391709 391679 391162 389961 388183 386751 386674 387840 389191
$$ packed form
60727C75416j126j211n78L49J010J234J363J753K322K732K897K966K908K425J489
60712C95949O27M07P32R05M77k20m67j8N52M71l41j172j349j023q48j085j381
60695C92216j474j563j851k159k287k351k369j953r84j43o4j62P51K676M156M060
60679C86499K912K081K297L290M260M356L213J503L91J37j91j227k332k707k675
60664D01807k988l444l255k446j812j547r58L22J669K289K132J810J933K580L202
60649D01294L141K547K274K544K362R94o50j275j209j809l082l513k456j201j120
60634C98841k028k923l256k839j600j48M06o6l25M22J241R46p7n85l55r1k0K27
60616C87770O15O48L35J63K01R9p9J14O04P87M52l0n17j201j778j432p7J166J351
$$ plain form
60597 389191 390188 391531 394142 397900 401818 405251 408409 411666 414880 417695 420204 422808 425423 427367
60583 427367 428155 428021 427383 426261 424643 423061 422241 422341 423010 424101 425867 428605 432607 438322 446020 455341
60567 455341 465734 477247 490156 503836 516853 528442 539099 549297 558258 564528 567230 566390
60555 566390 562634 557199 551701 547091 543035 538880 534959 532298 531269 531349 532173 534095 537539 542464 548800
60540 548800 556868 567023 579257 593583 610542 630834 654416 680237 706874 733129 757936 779986
60528 779986 797813 810358 817435 819674 818098 813700 807252 799295 790185 780084 768975 756872 744139
60515 744139 731479 719460 708193 697784 688894 682329 678025 675127 673329 673539 676787 683072 691979
60502 691979 704011 720481 742262 769456 802157 840574 884204 931678 981730 1033664 1086581
$$ packed form
60597C89191R97J343K611L758L918L433L158L257L214K815K509K604K615J944
60583D27367P88j34o38j122j618j582q20J00O69J091J766K738M002N715P698R321
60567D55341J0393J1513J2909J3680J3017J1589J0657J0198Q961O270K702q40
60555E66390l756n435n498m610m056m155l921k661j029Q0Q24J922L444M925O336
60540E48800Q068J0155J2234J4326J6959K0292K3582K5821K6637K6255K4807K2050
60528G79986J7827J2545P077K239j576m398o448p957r110j0101j1109j2103j2733
60515G44139j2660j2019j1267j0409q890o565m304k898j798K10L248O285Q907
60502F91979J2032J6470K1781K7194L2701L8417M3630M7474N0052N1934N2917
$$ plain form
60491 1086581 1138771 1188316 1233910 1274890 1311010 1342442 1369327 1390827 1405035 1410210 1405664 1391127
60479 1391127 1366005 1330073 1284585 1231979 1174695 1114828 1054571 996024 940353 887754 838479
60468 838479 793459 753706 719376 689608 663145 639044 617010 597186 579664 564206 550437
60457 550437 538048 526777 516441 507184 499361 492936 487230 481564 475923 470754 466356 462782 460056
60444 460056 458045 456337 454640 453139 452051 451040 449576 447683 445791 443964 441927 439851 438392 437709
60430 437709 437095 435960 434705 434178 434557 435223 435576 435560 435397 435143 434650 433811 432775 431944 431761 432485 434122 436518
60412 436518 439375 442276 444889 447195 449376 451421 453015 453903 454245 454525 455174 456341 457941 459861 462108
60397 462108 464778 467828 470913 473586 475671 477393 479160 481303 483962 487016 490060 492631 494601 496329
$$ packed form
60491A086581N2190M9545M5594M0980L6120L1432K6885K1500J4208N175m546j4537
60479A391127k5122l5932m5488n2606n7284n9867o0257n8547n5671n2599m9275
60468H38479m5020l9753l4330k9768k6463k4101k2034j9824j7522j5458j3769
60457E50437j2389j1271j0336r257p823o425n706n666n641n169m398l574k726
60444D60056k011j708j697j501j088j011j464j893j892j827k037k076j459o83
60430D37709o14j135j255n27L79O66L53j6j63k54m93q39j036q31j83P24J637K396
60412D36518K857K901K613K306K181K045J594Q88L42K80O49J167J600J920K247
60397D62108K670L050L085K673K085J722J767K143K659L054L044K571J970J728
$$ plain form
60383 496329 498308 500720 503383 506030 508513 510789 512879 514930 517180 519783 522682 525753 528965 532274
60369 532274 535340 537597 538728 539021 539131 539534 540304 541285 542322 543397 544748 546845 550147 554821 560810
60354 560810 567996 576129 584627 592783 600224 606991 613104 618225 621822 623507 623148 620831 616849 611691
60340 611691 605976 600363 595296 590660 585830 580326 574408 568807 563990 559998 556797 554283 551911 548914
60326 548914 545121 541172 537729 534897 532634 531241 531008 531711 532917 534645 537321 541203 546253 552499 560139
60311 560139 569135 578953 588834 598277 607233 615915 624494 633058 641871 651394 661730 672091 681126 687830
60297 687830 691878 693175 691508 686731 678901 668249 655515 642370 630801 621633 613992 606505 598665
60284 598665 590855 583662 577580 572854 569023 564963 559866 553905 547592 540991 534146 527779 522729 518931
$$ packed form
60383D96329J979K412K663K647K483K276K090K051K250K603K899L071L212L309
60369E32274L066K257J131K93J10M03P70R81J037J075J351K097L302M674N989
60354E60810P186Q133Q498Q156P441O767O113N121L597J685l59k317l982n158
60340F11691n715n613n067m636m830n504n918n601m817l992l201k514k372k997
60326E48914l793l949l443k832k263j393k33P03J206J728K676L882N050O246P640
60311E60139Q996R818R881R443Q956Q682Q579Q564Q813R523J0336J0361R035O704
60297F87830M048J297j667m777p830j0652j2734j3145j1569r168p641p487p840
60284E98665p810p193o082m726l831m060n097n961o313o601o845o367n050l798
$$ plain form
60270 518931 515676 512639 509897 507129 503776 500090 497107 495294 493974 492427 490945 490301 490660 491513 492426
60255 492426 493356 494339 495280 496134 497114 498564 500589 502804 504600 505742 506592 507614 508791 509688 509840 508966
60239 508966 507137 505050 503794 503849 504529 504885 504897 505258 506288 507789 509853 512926 516955 521303 525716 530657
60223 530657 536301 541967 547074 552155 558326 566110 575179 584953 594891 604520 613755 623109 633103 643504
60209 643504 653510 662595 670849 678572 685925 693028 700015 706876 713451 719574 725045 729430 732196 733207
60195 733207 732911 731906 730377 728060 724671 720241 715020 709213 702948 696444 689992 683666 677131 669983
60181 669983 662314 654851 648450 643462 639578 636239 633197 630699 629118 628434 628160 627809 627279 626754 626375 626154
60165 626154 626011 625735 624999 623588 621622 619490 617705 616811 617105 618178 619058 619186 619117 619933 622061 625031 628216
$$ packed form
60270E18931l255l037k742k768l353l686k983j813j320j547j482o44L59Q53R13
60255D92426R30R83R41Q54R80J450K025K215J796J142Q50J022J177Q97J52q74
60239E08966j829k087j256N5O80L56J2L61J030J501K064L073M029M348M413M941
60223E30657N644N666N107N081O171P784R069R774R938R629R235R354R994J0401
60209F43504J0006R085Q254P723P353P103O987O861O575O123N471M385K766J011
60195G33207k96j005j529k317l389m430n221n807o265o504o452o326o535p148
60181F69983p669p463o401m988l884l339l042k498j581o84k74l51n30n25l79k21
60165F26154j43k76p36j411j966k132j785q94K94J073Q80J28o9Q16K128K970L185
$$ plain form
60148 628216 631319 634199 636784 639366 642528 646570 651272 656490 662653 670343 679523 689493 699626 709990
60134 709990 721246 734006 748226 762964 776589 787401 794466 798192 799987 801052 801511 800912 799407
60121 799407 797867 796787 795749 794282 792626 791169 789657 787680 785553 783943 782761 781142 778456 774680
60107 774680 769878 764074 757714 751521 745692 739814 733724 727871 722752 718642 715963 715128 715690 716464 716993
60092 716993 718186 720948 724734 728133 730470 732093 733481 734856 736624 739346 743060 747077 750653 753556
60078 753556 755852 757440 757934 756839 753753 748568 741547 733130 723567 712732 700381 686719 672786
60065 672786 660078 649467 640551 632284 624154 616385 609189 602476 596459 591791 588666 586287 583834 581586
60051 581586 580520 581077 582995 586180 590921 597136 604049 610966 617848 624738 631045 635970 639503 642493
$$ packed form
60148F28216L103K880K585K582L162M042M702N218O163P690R180R970J0133J0364
60134G09990J1256J2760J4220J4738J3625J0812P065L726J795J065M59n99j505
60121G99407j540j080j038j467j656j457j512j977k127j610j182j619k686l776
60107G74680m802n804o360o193n829n878o090n853n119m110k679q35N62P74N29
60092G16993J193K762L786L399K337J623J388J375J768K722L714M017L576K903
60078G53556K296J588M94j095l086n185p021q417r563j0835j2351j3662j3933
60065F72786j2708j0611q916q267q130p769p196o713o017m668l125k379k453k248
60051E81586j066N57J918L185M741O215O913O917O882O890O307M925L533K990
$$ plain form
60037 642493 645569 648336 649809 649438 647517 644773 641816 638911 635988 632744 628891 624308 618778 611712
60023 611712 602581 591790 580719 570581 561560 553339 546028 539957 534826 529820 524624 519748 515736
60010 515736 512584 510045 507992 506261 504629 503172 502213 501680 500965 499756 498664 498667 500170 502842 506098 509455
59994 509455 512694 515971 519584 523431 527028 530251 533701 537920 542555 546734 550096 552973 555640 557801
59980 557801 558859 558461 556774 554479 552466 551276 550797 550552 550252 549976 549964 550354 551092 552049 553373 555736 559999
59963 559999 566495 574862 584618 595504 607074 618382 628416 636614 642595 645796 645960 643788 640435
59950 640435 636293 630841 623903 616484 609901 604410 599184 593555 587794 582493 577686 572996 568488 564858
59936 564858 562613 561459 560758 560386 560826 562582 565775 570216 575481 581010 586394 591600 596614 600928 603753
$$ packed form
60037F42493L076K767J473l71j921k744k957k905k923l244l853m583n530p066
60023F11712r131j0791j1071j0138r021q221p311o071n131n006n196m876m012
60010E15736l152k539k053j731j632j457r59n33p15j209j092LJ503K672L256L357
59994E09455L239L277L613L847L597L223L450M219M635M179L362K877K667K161
59980E57801J058l98j687k295k013j190m79k45l00k76j2L90P38R57J324K363M263
59963E59999O496Q367R756J0886J1570J1308J0034Q198N981L201J64k172l353
59950F40435m142n452o938p419o583n491n226n629n761n301m807m690m508l630
59936E64858k245j154p01l72M40J756L193M441N265N529N384N206N014M314K825
$$ plain form
59921 603753 604815 604683 604276 604237 604792 605913 607571 610016 613733 618986 625616 633576 643301 654979 667638
59906 667638 679644 690066 698961 706363 711781 714857 715764 714724 711803 707437 702489 697403 691961 686192
59892 686192 680842 676491 672932 669946 668022 667664 668534 670051 672408 676186 681302 687102 693383 700584 708953
59877 708953 718049 727059 735258 742283 748369 754185 760087 765729 770659 774974 778973 782545 785464 787973
59863 787973 790490 792894 794622 795337 794999 793546 791016 787810 784311 780418 775997 771610 768255 766521 766508
59848 766508 768253 771504 775208 777962 779023 778340 775813 771389 765882 760842 757285 755092 753749 752956 752247
59833 752247 750725 747718 743365 738303 733130 728339 724274 720749 717071 712793 708184 703662 699116 694210
59819 694210 689159 684679 681063 677713 673869 669665 666119 663958 662719 661330 659475 657914 657398 657759 658317
$$ packed form
59921F03753J062j32m07l9N55J121J658K445L717N253O630P960R725J1678J2659
59906F67638J2006J0422Q895P402N418L076R07j040k921m366m948n086n442n769
59892F86192n350m351l559k986j924l58Q70J517K357L778N116N800O281P201Q369
59877G08953R096R010Q199P025O086N816N902N642M930M315L999L572K919K509
59863G87973K517K404J728P15l38j453k530l206l499l893m421m387l355j734j3
59848G66508J745L251L704K754J061o83k527m424n507n040l557k193j343p93p09
59833G52247j522l007m353n062n173m791m065l525l678m278m609m522m546m906
59819F94210n051m480l616l350l844m204l546k161j239j389j855j561n16L61N58
$$ plain form
59804 658317 658698 658839 658561 657725 656550 655198 653192 649811 645075 639879 635078 630831 626883 623089 619468
59789 619468 615958 612280 608088 603405 598895 595321 592582 589705 586104 582371 579450 577533 576345 575971
59775 575971 576616 577834 578915 579966 581864 585141 589592 594905 600977 607596 614550 622067 630485 639444
59761 639444 648114 656320 664802 674262 684816 696384 708908 722048 735431 749338 764394 780399
59749 780399 796274 811397 826199 841136 855905 870067 883630 896419 907593 916445 923098 927795
59737 927795 930053 929321 926096 921611 916542 910663 903634 895602 887041 878431 870088 862051 854190 846589
59723 846589 839567 833152 826897 820554 814588 809553 805175 800554 795243 789752 784988 781460 779029 777270
59709 777270 776034 775683 776655 778805 781438 784051 786737 789776 793143 796584 799858 802754 805182 807487 810331
$$ packed form
59804F58317L81J41k78q36j175j352k006l381m736n196m801m247l948l794l621
59789F19468l510l678m192m683m510l574k739k877l601l733k921j917j188l74
59775E75971O45J218J081J051J898L277M451N313O072O619O954P517Q418Q959
59761F39444Q670Q206Q482R460J0554J1568J2524J3140J3383J3907J5056J6005
59749G80399J5875J5123J4802J4937J4769J4162J3563J2789J1174Q852O653M697
59737I27795K258p32l225m485n069n879p029q032q561q610q343q037p861p601
59723H46589p022o415o255o343n966n035m378m621n311n491m764l528k431j759
59709G77270j236l51R72K150K633K613K686L039L367L441L274K896K428K305K844
$$ plain form
59694 810331 813965 817748 820534 821378 819953 816741 812938 809719 807314 805091 802559 799793 796755 792939
59680 792939 788125 782917 777926 772779 766506 758733 750105 741715 734406 728327 722829 717075 711073 705781
59666 705781 701965 699402 697571 696496 696349 696793 697475 698764 701131 704172 707164 710380 714770 720300 725698
59651 725698 730161 734274 738673 742610 744594 743918 740823 735454 727592 717530 706566 696260 687368 679651
59637 679651 672589 666051 660284 655399 651079 646887 642688 638571 634440 629976 625013 619677 613999 607702
59623 607702 600587 592968 585450 578354 571643 565368 559882 555494 552099 549315 546852 544663 542847 541631
59609 541631 541308 541905 542909 543620 543907 544404 545808 548097 550530 552226 552661 551948 550979 551062 552945 556150 559492
59592 559492 562221 564371 566096 567169 567329 566772 566033 565476 565049 564453 563448 562006 560179 557832 554703 550914
$$ packed form
59694H10331L634L783K786Q44j425l212l803l219k405k223k532k766l038l816
59680G92939m814n208m991n147o273p773q628q390p309o079n498n754o002n292
59666G05781l816k563j831j075j47M44O82J289K367L041K992L216M390N530N398
59651G25698M463M113M399L937J984o76l095n369p862j0062j0964j0306q892p717
59637F79651p062o538n767m885m320m192m199m117m131m464m963n336n678o297
59623F07702p115p619p518p096o711o275n486m388l395k784k463k189j816j216
59609E41631l23N97J004P11K87M97J404K289K433J696M35p13r69Q3J883L205L342
59592E59492K729K150J725J073J60n57p39n57m27n96j005j442j827k347l129l789
$$ plain form
59576 550914 547224 544461 542723 541451 540254 539278 538718 538389 538003 537622 537569 537996 538734 539541 540371 541322 542307
59559 542307 542899 542756 542204 542061 542673 543459 543753 543756 544229 545518 547429 549808 552644 555741 559040 563283 569694
59542 569694 578868 590614 604985 622601 643377 665274 684795 698690 705362 705324 700678 693889 686621
59529 686621 679702 673857 669905 668212 668524 670449 673565 677024 679800 681561 682666 683056 681899 678674 673876
59514 673876 668172 661523 653733 645267 636802 628419 619915 611576 603942 597043 590505 584246 578545 573569
59500 573569 569371 566211 564335 563508 563239 563398 564147 565308 566309 566880 567457 568730 570912 573476 575588 576851
59484 576851 577688 578883 580854 583581 587038 591148 595346 598871 601698 604594 607946 611201 613783 615903
59470 615903 617949 619725 620955 622036 623564 625418 626986 628085 629185 630923 633831 638193 643766 650013
$$ packed form
59576E50914l690k763j738j272j197r76n60l29l86l81n3M27P38Q07Q30R51R85
59559E42307N92j43n52j43O12P86K94LM73J289J911K379K836L097L299M243O411
59542E69694R174J1746J4371J7616K0776K1897J9521J3895O672l8m646o789p268
59529F86621o919n845l952j693L12J925L116L459K776J761J105L90j157l225m798
59514F73876n704o649p790q466q465q383q504q339p634o899o538o259n701m976
59500E73569m198l160j876q27k69J59P49J161J001N71N77J273K182K564K112J263
59484E76851Q37J195J971K727L457M110M198L525K827K896L352L255K582K120
59470F15903K046J776J230J081J528J854J568J099J100J738K908M362N573O247
$$ plain form
59456 650013 656988 665361 675007 684302 691756 697809 703966 710483 716062 719744 721874 722955 722580 720018
59442 720018 715281 709227 702962 697279 692292 687519 682667 678248 675027 673076 671963 671715 672823 675329
59428 675329 678691 682664 687581 693624 700652 709036 719883 733954 750928 770159 791616 815585 842037
59415 842037 870950 902751 937330 972248 1002612 1023413 1032410 1031078 1023181 1012637 1002395 994547
59403 994547 990760 992293 999616 1011797 1025947 1037487 1041927 1037157 1024103 1005196 982674 958397
59391 958397 934313 912068 892235 874541 858705 844604 831836 819832 808456 798124 789411 782807
59379 782807 778489 775766 773065 769168 764345 759748 755969 752969 751061 750901 752359 754402 756342 758514
59365 758514 761473 765373 770358 776747 784318 792136 799674 807572 816736 827114 837962 849049 861020
$$ packed form
59456F50013O975Q373R646R295P454O053O157O517N579L682K130J081l75k562
59442G20018m737o054o265n683m987m773m852m419l221j951j113k48J108K506
59428F75329L362L973M917O043P028Q384J0847J4071J6974J9231K1457K3969K6452
59415H42037K8913L1801L4579L4918L0364K0801Q997j332p897j0544j0242p848
59403I94547l787J533P323J2181J4150J1540M440m770j3054j8907k2522k4277
59391I58397k4084k2245j9833j7694j5836j4101j2768j2004j1376j0332q713o604
59379G82807m318k723k701l897m823m597l779l000j908j60J458K043J940K172
59365G58514K959L900M985O389P571P818P538P898R164J0378J0848J1087J1971
$$ plain form
59352 861020 874712 890512 908210 927065 946062 964445 982109 999373 1016480 1033300 1049232
59341 1049232 1063201 1073987 1080809 1083615 1082726 1078327 1070368 1058834 1044084 1026997 1008762 990264
59329 990264 971707 953001 934368 916281 898849 881747 864868 848791 834422 822292 812166
59318 812166 803147 794233 785108 776377 768765 762219 756122 750296 745227 741277 738236 735963 735043 736410
59304 736410 740501 747051 755632 766177 778919 793726 809298 823039 832012 834393 830252 821168 809161
59291 809161 795749 781647 767260 753402 741293 731754 724741 719876 717061 716255 717014 718866 721987
59278 721987 727100 734744 744953 757417 771591 786839 802926 820105 838296 856436 873230 888312
59266 888312 902104 914747 925923 935576 944052 951400 957206 961169 963322 963633 962020 958792 954557 949647
$$ packed form
59352H61020J3692J5800J7698J8855J8997J8383J7664J7264J7107J6820J5932
59341A049232J3969J0786O822K806q89m399p959j1534j4750j7087j8235j8498
59329I90264j8557j8706j8633j8087j7432j7102j6879j6077j4369j2130j0126
59318H12166r019q914r125q731p612o546o097n826n069l950l041k273r20J367
59304G36410M091O550Q581J0545J2742J4807J5572J3741Q973K381m141r084j2007
59291H09161j3412j4102j4387j3858j2109r539p013m865k815q06P59J852L121
59278G21987N113P644J0209J2464J4174J5248J6087J7179J8191J8140J6794J5082
59266H88312J3792J2643J1176R653Q476P348N806L963K153L11j613l228m235m910
$$ plain form
59252 949647 944186 938651 933734 929590 925855 922401 919446 916901 914363 911826 909637 907542 904551 900050
59238 900050 894505 888811 883502 878735 874375 869789 864138 857211 849537 841593 833418 825059 816626 807729
59224 807729 797639 786410 775206 765134 756306 748302 740833 733572 726064 718413 711535 706173 702075
59211 702075 698621 695838 694225 693833 694052 694209 694123 694172 694919 696400 697854 698531 698743 699517 701190 703033 704393
59194 704393 705385 706204 706589 706490 706536 707249 708375 709481 710714 712399 714410 716536 719022 722183 725756 729113
59178 729113 731826 733672 734509 734562 734432 734441 734317 733867 733450 733387 733434 733384 733695 734948 736976 738995 740297 740419 739046
59159 739046 736305 732770 728747 723801 717465 710016 702173 694408 686988 680186 673896 667431 660354 653218
59145 653218 646903 641484 636330 631137 626264 622119 618645 615391 611883 608077 604578 602154 600919 600422
$$ packed form
59252I49647n461n535m917m144l735l454k955k545k538k537k189k095k991m501
59238I00050n545n694n309m767m360m586n651o927p674p944q175q359q433q897
59224H07729j0090j1229j1204j0072q828q004p469p261p508p651o878n362m098
59211G02075l454k783j613l92K19J57q6M9P47J481J454O77K12P74J673J843J360
59194G04393R92Q19L85r9M6P13J126J106J233J685K011K126K486L161L573L357
59178G29113K713J846Q37N3j30Rj24m50m17o3M7n0L11J253K028K019J302J22j373
59159G39046k741l535m023m946o336p449p843p765p420o802o290o465p077p136
59145F53218o315n419n154n193m873m145l474l254l508l806l499k424j235m97
$$ plain form
59131 600422 600558 601713 603829 606194 608583 611757 616189 621078 625467 629714 634958 641672 649641 658861
59117 658861 669417 680747 692053 703314 715006 726974 738475 749277 759875 770599 781227
59106 781227 791378 800543 807803 812371 814520 815227 814901 813174 809978 805878 801198 795679 789394 783250
59092 783250 778064 773691 769591 765840 763040 761361 760109 758298 755423 751623 747203 742078 735894 728647
59078 728647 720882 713088 705264 697380 689939 683576 678223 673168 667955 662841 658390 654933 652372 650211
59064 650211 647820 644914 641721 638523 635235 631755 628417 625651 623301 620744 617733 614788 612718 611895
59050 611895 612000 612288 612233 611936 611752 611580 610982 610077 609698 610305 611341 612153 613047 614796 617498 620547 623521
59033 623521 626550 630101 634931 642037 651970 664339 678510 694593 713157 734147 756690 779933
$$ packed form
59131F00422J36J155K116K365K389L174M432M889M389M247N244O714P969R220
59117F58861J0556J1330J1306J1261J1692J1968J1501J0802J0598J0724J0628
59106G81227J0151R165P260M568K149P07l26j727l196m100m680n519o285o144
59092G83250n186m373m100l751k800j679j252j811k875l800m420n125o184p247
59078G28647p765p794p824p884p441o363n353n055n213n114m451l457k561k161
59064F50211k391k906l193l198l288l480l338k766k350k557l011k945k070q23
59050F11895J05K88n5k97j84j72n98r05l79O07J036Q12Q94J749K702L049K974
59033F23521L029L551M830P106R933J2369J4171J6083J8564K0990K2543K3243
$$ plain form
59021 779933 803373 826295 847370 864951 877565 884292 885115 880899 872757 861523 848018 833484
59009 833484 819253 806075 794062 783140 773379 765151 759189 756045 755239 755475 756021 757242 759340 761372
58995 761372 762309 762344 762228 761875 760739 759168 758146 757779 757126 755604 753564 751412 749077 746534 744056 741855
58979 741855 740234 740208 743118 749309 757749 767133 776824 786664 796544 806428 816321 826115 835870 846121
58965 846121 857255 868635 879028 887981 896107 903902 910949 916402 919651 920352 918393 913995 907353 898116
58951 898116 885766 870596 853768 836365 818956 802065 786362 772249 759822 749387 741372 735635
58939 735635 731460 728400 726562 725940 726114 726799 728135 730269 733189 737112 742271 747985 752521 754409 753633
58924 753633 751299 748375 744950 740422 734287 726963 719827 714143 710033 706784 703941 701556 699576 697758
$$ packed form
59021G79933K3440K2922K1075J7581J2614O727Q23m216q142j1234j3505j4534
59009H33484j4231j3178j2013j0922r761q228n962l144q06K36N46J221K098K032
58995G61372R37L5j16l53j136j571j022l67o53j522k040k152k335k543k478k201
58979G41855j621k6K910O191Q440R384R691R840R880R884R893R794R755J0251
58965H46121J1134J1380J0393Q953Q126P795P047N453L249P01j959m398o642r237
58951H98116j2350j5170j6828j7403j7409j6891j5703j4113j2427j0435q015n737
58939G35635m175l060j838o22J74O85J336K134K920L923N159N714M536J888p76
58924G53633k334k924l425m528o135p324p136n684m110l249k843k385j980j818
$$ plain form
58910 697758 696254 695666 696426 698684 702837 709463 718516 729156 740552 752428 764706 777144 789520
58897 789520 801741 813653 825141 836515 848414 861274 875198 890327 906925 925161 945038
58886 945038 966279 987814 1007760 1024594 1038190 1049141 1057492 1062923 1065755 1066634 1065345 1061033 1053656
58873 1053656 1044182 1033365 1021494 1009483 998925 990562 983711 977641 972523 968512 964884 960767 955956
58860 955956 950413 943703 935643 926895 918280 909932 901717 894024 887637 883169 880887 880497 880640 879202 874827
58845 874827 867844 859310 849487 837712 823435 806975 789422 772109 755899 740791 726368 712691
58833 712691 700382 689877 681157 674268 669429 666394 664292 662456 660974 660239 660486 661952 664825 668658
58819 668658 672345 675109 677166 679166 681428 683918 686527 689001 690930 692045 692241 691275 688895 685416 681751
$$ packed form
58910F97758j504n88P60K258M153O626R053J0640J1396J1876J2278J2438J2376
58897G89520J2221J1912J1488J1374J1899J2860J3924J5129J6598J8236J9877
58886I45038K1241K1535J9946J6834J3596J0951Q351N431K832Q79j289m312p377
58873A053656r474j0817j1871j2011j0558q363o851o070n118m011l628m117m811
58860I55956n543o710q060q748q615q348q215p693o387m468k282l90J43j438m375
58845H74827o983q534r823j1775j4277j6460j7553j7313j6210j5108j4423j3677
58833G12691j2309j0505q720o889m839l035k102j836j482p35K47J466K873L833
58819F68658L687K764K057K000K262K490K609K474J929J115J96r66k380l479l665
$$ plain form
58804 681751 678677 676331 674364 672154 669011 664756 660060 655676 651518 647129 642787 639212 636324 633359
58790 633359 630282 628017 627053 626915 627343 629001 632521 637674 643881 650777 657950 664968 672038 679793 688062
58775 688062 695702 701915 706794 710152 710970 708668 704099 698554 692535 686066 679451 673073 667124 662104
58761 662104 658880 657693 657785 658592 660529 663993 668300 672318 675495 677617 678218 676957 674165 670493 666495
58746 666495 662889 660515 659473 658968 658503 658588 659851 662247 665615 670169 675834 681899 687957 694413 701473
58731 701473 708508 715075 721602 728257 734093 738331 741645 745109 748548 751115 753019 755562 759715 765510
58717 765510 772489 779988 787321 794389 801686 809066 815160 818802 820390 820905 820146 816999 811063 802876 792716
58702 792716 780204 765147 748000 729526 710551 691964 674366 657797 642165 627732 614776
$$ packed form
58804F81751l074k346j967k210l143m255m696m384m158m389m342l575k888k965
58790F33359l077k265r64j38M28J658L520N153O207O896P173P018P070P755Q269
58775F88062P640O213M879L358Q18k302m569n545o019o469o615o378n949n020
58761F62104l224j187R2Q07J937L464M307M018L177K122O01j261k792l672l998
58746F66495l606k374j042n05m65Q5J263K396L368M554N665O065O058O456P060
58731G01473P035O567O527O655N836M238L314L464L439K567J904K543M153N795
58717G65510O979P499P333P068P297P380O094L642J588N15p59l147n936q187j0160
58702G92716j2512j5057j7147j8474j8975j8587j7598j6569j5632j4433j2956
$$ plain form
58691 614776 603147 592513 582700 573526 564858 557186 551416 547558 544303 540456 536184 532309 529080 526341
58677 526341 524202 522758 521697 520884 520833 521984 524133 527166 531628 537945 545848 555250 566908 581241
58663 581241 597163 612817 626818 638063 645278 647895 646773 643079 637065 628796 619312 609957 601110
58650 601110 592535 584357 576699 569107 561455 554775 550034 546774 544113 542355 542209 543072 543643 543905 544921
58635 544921 546845 548567 549369 549566 549451 548795 547597 546299 545056 543613 541964 540437 539143 537985 537031
58620 537031 536381 536013 536333 538325 542329 547205 551568 555399 559610 564545 569797 574957 579627 583316 586217
58605 586217 589415 593325 596694 598287 598711 599210 599493 598442 596414 595053 594983 595258 595081 594665 594562 595476 598600
58588 598600 604741 613095 622169 631821 643146 656461 670655 684489 697350 708889 719123 728731
$$ packed form
58691F14776j1629j0634r813r174q668p672n770l858l255l847m272l875l229k739
58677E26341k139j444j061q13n1J151K149L033M462O317P903R402J1658J4333
58663E81241J5922J5654J4001J1245P215K617j122l694o014q269r484r355q847
58650F01110q575q178p658p592p652o680m741l260k661j758j46Q63N71K62J016
58635E44921J924J722Q02J97j15o56j198j298j243j443j649j527j294j158r54
58620E37031o50l68L20J992M004M876M363L831M211M935N252N160M670L689K901
58605E86217L198L910L369J593M24M99K83j051k028j361p0K75j77m16j03R14L124
58588E98600O141Q354R074R652J1325J3315J4194J3834J2861J1539J0234R608
$$ plain form
58576 728731 738108 746369 752560 757525 763202 770366 778629 788422 801258 817905 837865 860911 887670
58563 887670 918356 952106 987724 1023881 1058486 1089159 1114614 1134711 1149235 1157824 1161021 1160172
58551 1160172 1156218 1149680 1141641 1133486 1125777 1118514 1112102 1106516 1099775 1089027 1073300 1053759 1031363
58538 1031363 1006083 978560 950638 923638 897537 872327 848798 827511 808266 791024 776169
58527 776169 763548 752423 742663 734856 728994 724184 719834 715947 712178 707889 703286 699225 695746 692050
58513 692050 688023 684428 681503 678772 676344 674984 674692 674659 674717 675360 676197 675987 674578 673249 672758 672497 671958
58496 671958 671566 671658 672038 672921 674965 678015 681208 684656 689614 696688 705303 715224 727105 741146 756720
58481 756720 773775 793101 814675 837043 858723 878913 896579 910359 919779 925232 926496 922749
$$ packed form
58576G28731R377Q261O191M965N677P164Q263R793J2836J6647J9960K3046K6759
58563H87670L0686L3750L5618L6157L4605L0673K5455K0097J4524Q589L197q49
58551A160172l954o538q039q155p709p263o412n586o741j0748j5727j9541k2396
58538A031363k5280k7523k7922k7000k6101k5210k3529k1287j9245j7242j4855
58527G76169j2621j1125r760p807n862m810m350l887l769m289m603m061l479l696
58513F92050m027l595k925k731k428j360k92l3N8O43Q37k10j409j329m91k61n39
58496F71958l92R2L80Q83K044L050L193L448M958P074Q615R921J1881J4041J5574
58481G56720J7055J9326K1574K2368K1680K0190J7666J3780R420N453J264l747
$$ plain form
58469 922749 914342 903095 890558 877425 864787 854198 846157 840160 836498 836303 839550 844956 852261
58456 852261 862678 876502 892102 907849 923192 937181 947830 953736 954805 950940 941895 928998
58444 928998 914981 901222 886941 871833 857525 845516 835505 826775 819479 813658 808663 804543
58432 804543 802414 802621 804162 806712 811442 818993 828318 838340 848960 859629 868710 875168 879214 880586
58418 880586 878172 872191 864762 857343 849470 840803 832303 824413 816220 807510 799597 793066 786816 780454
58404 780454 775353 772122 769317 766101 763898 763873 764969 766164 768557 773312 779327 784761 789237 793001 795651
58389 795651 797313 799364 802422 805228 806950 808815 812027 815839 819130 822070 824828 826579 827332 828790
58375 828790 831904 835516 838845 843213 849716 857389 865329 874500 885659 897687 909777 923133 938654
$$ packed form
58469I22749q407j1247j2537j3133j2638j0589q041n997l662j95L247N406P305
58456H52261J0417J3824J5600J5747J5343J3989J0649N906J069l865r045j2897
58444I28998j4017j3759j4281j5108j4308j2009j0011q730p296n821m995m120
58432H04543k129K07J541K550M730P551R325J0022J0620J0669R081O458M046J372
58418H80586k414n981p429p419p873q667q500p890q193q710p913o531o250o362
58404G80454n101l231k805l216k203k5J096J195K393M755O015N434M476L764K650
58389G95651J662K051L058K806J722J865L212L812L291K940K758J751P53J458
58375H28790L114L612L329M368O503P673P940R171J1159J2028J2090J3356J5521
$$ plain form
58362 938654 955086 971231 987666 1004358 1019021 1030022 1038654 1046440 1052548 1056083 1058452 1060915 1062158
58349 1062158 1060953 1059043 1058706 1059485 1060051 1061293 1064803 1070188 1076560 1084862 1096109 1109194 1122949 1138352
58335 1138352 1156102 1174173 1190605 1206628 1224055 1241621 1256845 1269546 1280508 1288709 1293155 1295592
58323 1295592 1298137 1299919 1299222 1297224 1296345 1296647 1297049 1298423 1302211 1307582 1313172 1319937 1329061 1338870 1347243
58308 1347243 1355422 1365991 1378686 1391590 1404818 1419561 1435053 1449890 1464829 1480994 1497067
58297 1497067 1511605 1526254 1543273 1561827 1580212 1599568 1621583 1644680 1666512 1688232 1712206
58286 1712206 1737442 1761520 1785133 1810447 1836819 1862411 1888269 1916534 1946441 1976332 2007708
58275 2007708 2042984 2081220 2120318 2161132 2204968 2249599 2292687 2336615 2384834 2435991 2487057
$$ packed form
58362I38654J6432J6145J6435J6692J4663J1001Q632P786O108L535K369K463J243
58349A062158j205j910l37P79N66J242L510N385O372Q302J1247J3085J3755J5403
58335A138352J7750J8071J6432J6023J7427J7566J5224J2701J0962Q201M446K437
58323A295592K545J782o97j998q79L02M02J374L788N371N590O765R124R809Q373
58308A347243Q179J0569J2695J2904J3228J4743J5492J4837J4939J6165J6073
58297A497067J4538J4649J7019J8554J8385J9356K2015K3097K1832K1720K3974
58286A712206K5236K4078K3613K5314K6372K5592K5858K8265K9907K9891L1376
58275B007708L5276L8236L9098M0814M3836M4631M3088M3928M8219N1157N1066
$$ plain form
58264 2487057 2539560 2596862 2657712 2718533 2779765 2843639 2907848 2968065 3025028 3082734 3141395
58253 3141395 3198543 3255204 3314434 3375579 3436588 3500041 3570106 3645714 3723699 3806374 3898528
58242 3898528 3999225 4104318 4214853 4334930 4463534 4596939 4737084 4889019 5052168
58233 5052168 5222832 5402917 5597084 5803921 6019621 6247672 6494784 6760141 7039545
58224 7039545 7337120 7661289 8012251 8385953 8787469 9227043 9705795 10219702 10775204
58215 10775204 11385886 12056354 12785575 13583962 14470391 15454936 16543060 17754840 19121028
58206 19121028 20662946 22397911 24362858 26611522 29194219 32169692 35638190 39740028
58198 39740028 44632978 50513096 57664384 66463473 77357424 90899310 107811606 128964666
$$ packed form
58264B487057N2503N7302O0850O0821O1232O3874O4209O0217N6963N7706N8661
58253C141395N7148N6661N9230O1145O1009O3453P0065P5608P7985Q2675R2154
58242C898528J00697J05093J10535J20077J28604J33405J40145J51935J63149
58233E052168J70664J80085J94167K06837K15700K28051K47112K65357K79404
58224G039545K97575L24169L50962L73702M01516M39574M78752N13907N55502
58215A0775204O10682O70468P29221P98387Q86429R84545J088124J211780J366188
58206A9121028J541918J734965J964947K248664K582697K975473L468498M101838
58198C9740028M892950N880118P151288Q799089J0893951J3541886J6912296K1153060
$$ plain form
58190 128964666 155291035 187711367 226870584 272346349 321571720 369493341 409762821
58183 409762821 436943901 448261534 443927640 426335589 398981116 365587869 329471546
58176 329471546 293161689 258349999 226063625 196845379 170866646 148047744 128196471
58169 128196471 111082840 96438533 83962068 73358968 64364394 56731061 50228553
58162 50228553 44666139 39896945 35794532 32242960 29150949 26454071 24095674 22019236
58154 22019236 20180543 18550006 17098347 15793488 14613872 13550577 12592811 11723440
58146 11723440 10930804 10212009 9561407 8967314 8422705 7927815 7479142 7066157 6681669
58137 6681669 6325610 5996072 5686310 5393410 5120853 4869595 4634835 4413973 4209473
$$ packed form
58190A28964666K6326369L2420332L9159217M5475765M9225371M7921621M0269480
58183D09762821K7181080J1317633m333894j7592051k7354473l3393247l6116323
58176C29471546l6309857l4811690l2286374k9218246k5978733k2818902j9851273
58169A28196471j7113631j4644307j2476465j0603100q994574p633333o502508
58162E0228553n562414m769194m102413l551572l092011k696878k358397k076438
58154B2019236j838693j630537j451659j304859j179616j063295r57766q69371
58146A1723440p92636p18795o50602n94093n44609m94890m48673m12985l84488
58137F681669l56059l29538l09762k92900k72557k51258k34760k20862k04500
$$ plain form
58128 4209473 4021373 3844837 3677705 3522939 3381125 3247755 3120269 3000903 2890256
58119 2890256 2784756 2682819 2587138 2498602 2414086 2332312 2255888 2185475 2117778 2051300 1988409
58108 1988409 1929853 1872869 1816653 1764063 1715884 1668804 1621062 1574966 1531980 1490526 1450492
58097 1450492 1414591 1383188 1352871 1322170 1293702 1268593 1243963 1218329 1194570 1174781 1156737
58086 1156737 1138182 1120370 1104528 1088725 1071045 1052407 1033776 1013922 992343 971172 952009
58075 952009 933894 916251 900510 886883 872900 857225 841824 828348 815521 802106 789397
58064 789397 778625 768768 758950 750291 743440 736919 729690 722705 716196 708229 697813 686830 677079
58051 677079 667879 658314 649235 641266 633323 624874 617200 610750 603743 595155 586688 579982 574204 568155
$$ packed form
58128D209473j88100j76536j67132j54766j41814j33370j27486j19366j10647
58119B890256j05500j01937r5681q8536q4516q1774p6424p0413o7697o6478o2891
58108A988409n8556n6984n6216n2590m8179m7080m7742m6096m2986m1454m0034
58097A450492l5901l1403l0317l0701k8468k5109k4630k5634k3759j9789j8044
58086A156737j8555j7812j5842j5803j7680j8638j8631j9854k1579k1171j9163
58075I52009j8115j7643j5741j3627j3983j5675j5401j3476j2827j3415j2709
58064G89397j0772r857r818q659o851o521p229o985o509p967j0416j0983r751
58051F77079r200r565r079p969p943q449p674o450p007q588q467o706n778o049
$$ plain form
58037 568155 562360 557288 551772 545142 538790 533793 528952 522896 516130 509321 501636 492571 483535 475864
58023 475864 468989 462044 455470 449526 443198 436213 430220 426406 423697 420858 418451 417139 415956 413965
58009 413965 411896 410504 409044 407007 405614 405840 406653 406942 407610 409928 413247 416115 418354 420319 421339
57994 421339 420561 418309 415199 411003 405664 400272 395824 392146 389044 387148 386515 385868 384389 382828 381761
57979 381761 380390 378211 376184 374888 373243 370508 367917 366793 366582 366309 366418 367498 368641 368825 368625
57964 368625 368908 369126 368578 368083 368634 369600 369945 370062 370636 370829 369485 367212 365368 363739 360994 356931 352694
57947 352694 349326 347446 347704 350156 353775 357812 362939 369983 378459 387630 397982 410136 423152 435429
57933 435429 446666 457493 467753 476425 482687 485842 484902 479560 471039 460835 449227 436058 422152
$$ packed form
58037E68155n795n072n516o630o352m997m841o056o766o809p685r065r036p671
58023D75864o875o945o574n944o328o985n993l814k709k839k407j312j183j991
58009D13965k069j392j460k037j393K26Q13K89O68K318L319K868K239J965J020
57994D21339p78k252l110m196n339n392m448l678l102j896o33o47j479j561j067
57979C81761j371k179k027j296j645k735k591j124k11k73J09J080J143J84k00
57964C68625K83K18n48m95N51R66L45J17N74J93j344k273j844j629k745m063m237
57947C52694l368j880K58K452L619M037N127P044Q476R171J0352J2154J3016J2277
57933D35429J1237J0827J0260Q672O262L155r40n342q521j0204j1608j3169j3906
$$ plain form
57920 422152 408694 395867 383342 371514 361071 351970 343918 337264 332313 328406 324754 321585 319521
57907 319521 318487 318198 318889 320563 322273 323158 323433 323433 322612 320513 317892 315799 314422 313759 314393 316529 319279
57890 319279 322008 325262 329290 332960 335563 338449 343162 348936 353677 356537 357925 357945 356676 355316 355176
57875 355176 355942 356423 356418 356388 356042 355069 354639 356347 360015 364204 368540 373729 379630 385146 389938 394622 399294
57858 399294 403489 407493 412116 417054 420997 423545 425632 427851 429506 429559 427544 423484 417854 411635 405595
57843 405595 399606 393356 387294 382024 377296 372672 368690 366254 365335 365346 366246 368047 369877 370917 371848
57828 371848 373949 377200 380680 384376 388979 394189 398824 402527 405858 408823 410849 412112 413373 414397
57814 414397 413885 411060 406049 398859 389395 378490 367483 356666 345449 334039 323554 314365 305732
$$ packed form
57920D22152j3458j2827j2525j1828j0443r101q052o654m951l907l652l169k064
57907C19521j034k89O91J674J710Q85K75%q21k099k621k093j377o63O34K136K750
57890C19279K729L254M028L670K603K886M713N774M741K860J388K0j269j360j40
57875C55176P66M81nl0l46r73m30J708L668M189M336N189N901N516M792M684M672
57858C99294M195M004M623M938L943K548K087K219J655N3k015m060n630o219o040
57843D05595n989o250o062n270m728m624l982k436r19J1R00J801J830J040R31
57828C71848K101L251L480L696M603N210M635L703L331K965K026J263J261J024
57814D14397n12k825n011p190r464j0905j1007j0817j1217j1410j0485r189q633
$$ plain form
57801 305732 297280 289566 282979 277275 272327 268196 264446 260627 257422 256020 256310 256992 257499 258428 260037
57786 260037 261848 263988 267461 272682 278976 285789 293168 300823 308080 315074 322630 330554 337357 342068
57772 342068 345052 346632 346308 343893 340265 336282 331991 327369 322793 318290 313367 308054 303097 298693
57758 298693 294230 289711 286247 284467 283572 282646 281865 281703 281974 282521 283956 286790 290482 294110 297460 300836
57742 300836 304422 308359 312833 317501 321441 324212 326377 328504 330264 331073 331086 330909 330757 330413 329734 328843
57726 328843 328097 327991 328746 329935 330959 331877 333130 334494 335065 334437 333188 332052 331261 330713 330056 328629
57710 328629 326174 323553 321819 320625 318712 316025 314008 313482 313630 313629 313984 315398 317448 319341 321098 323022
57694 323022 324653 325200 324576 323297 321752 320111 318487 316639 314004 310489 306813 303678 301153 299309 298809
$$ packed form
57801C05732q452p714o587n704m948m131l750l819l205j402K90O82N07R29J609
57786B60037J811K140L473N221O294O813P379P655P257O994P556P924O803M711
57772C42068K984J580l24k415l628l983m291m622m576m503m923n313m957m404
57758B98693m463m519l464j780q95r26p81j62K71N47J435K834L692L628L350L376
57742C00836L586L937M474M668L940K771K165K127J760Q09J3j77j52l44o79q91
57726C28843p46j06P55J189J024R18J253J364N71o28j249j136p91n48o57j427
57710C28629k455k621j734j194j913k687k017n26J48jL55J414K050J893J757J924
57694C23022J631N47o24j279j545j641j624j848k635l515l676l135k525j844n00
$$ plain form
57679 298809 300278 303589 308368 314893 324035 336654 353575 376008 405739 444948 495640 558609
57667 558609 632466 713330 794748 867510 920939 946819 943287 914689 867884 809400 745237 680862
57655 680862 620045 564489 515023 472217 435601 403796 376212 353517 335755 321254 308287
57644 308287 296744 287158 279105 271669 264797 259102 254820 251771 249759 248307 246582 244323 242219 240751
57630 240751 239492 238157 237425 237739 238121 237237 234958 231904 228176 223739 219498 216689 215383 214617 213810 213136
57614 213136 212685 212177 211418 210318 208587 206060 203117 200272 197653 195406 194125 194186 195064 195982 196760 197394
57598 197394 197331 196066 193987 191741 189100 185388 180788 176287 172513 169411 166891 164894 162976 160648 158169
57583 158169 156357 155594 155581 155909 156279 156253 155418 153734 151307 148101 144359 140988 138800 137535 136208 134286
$$ packed form
57679B98809J469L311M779O525R142J2619J6921K2433K9731L9209N0692O2969
57667E58609P3857Q0864Q1418P2762N3429K5880l532k8598m6805n8484o4163o4375
57655F80862o0817n5556m9466m2806l6616l1805k7584k2695j7762j4501j2967
57644C08287j1543r586q053p436o872n695m282l049k012j452j725k259k104j468
57630B40751j259j335p32L14L82q84k279l054l728m437m241k809j306p66q07o74
57614B13136m51n08p59j100j731k527k943k845k619k247j281O1Q78R18P78O34
57598A97394o3j265k079k246k641l712m600m501l774l102k520j997j918k328k479
57583A58169j812p63j3L28L70k6q35j684k427l206l742l371k188j265j327j922
$$ plain form
57567 134286 131976 129598 127206 124756 122180 119470 117028 115559 115233 115397 115516 115851 116653 117338 117268 116904
57551 116904 117342 119065 121822 125321 129208 132808 135766 138628 141926 145087 147245 148763 150803 153483
57537 153483 155583 156159 155493 154279 152782 150998 148949 146563 143889 141488 140044 139537 139343 139129 139052 139143
57521 139143 139198 139323 139979 141413 143470 145905 148395 150409 151715 152854 154480 156336 157606 158150 158637 159414
57505 159414 160071 160250 160178 160147 160019 159516 158611 157473 156335 155427 154752 153997 152980 152010 151430 151042 150438 149686
57487 149686 149159 148870 148374 147152 144791 141220 137226 134200 132687 131655 129900 127640 125859 124582 122955
57472 122955 120740 118613 117036 115883 115127 114868 114633 113734 112393 111530 111264 110660 109264 107935 107756 108798
57456 108798 110315 111513 111834 111080 109591 107953 106440 105158 104550 105072 106406 107709 108658 109572 110544 111220
$$ packed form
57567A34286k310k378k392k450k576k710k442j469l26J64J19L35Q02O85p0l64
57551A16904M38J723K757L499L887L600K958K862L298L161K158J518K040K680
57537A53483K100N76o66j214j497j784k049k386k674k401j444n07j94k14p7R1
57521A39143N5J25O56J434K057K435K490K014J306J139J626J856J270N44M87P77
57505A59414O57J79p2l1j28n03r05j138j138r08o75p55j017r70n80l88o04p52
57487A49686n27k89m96j222k361l571l994l026j513j032j755k260j781j277j627
57472A22955k215k127j577j153p56k59k35q99j341q63k66o04j396j329j79J042
57456A08798J517J198L21p54j489j638j513j282o08N22J334J303R49R14R72O76
$$ plain form
57440 111220 111471 111517 111325 110613 109513 108549 107946 107682 108084 109491 111311 112359 112232 111487 110491 109084 107509
57423 107509 106612 106813 107754 109131 110971 112890 114096 114420 114456 114444 114011 113264 113044 113741 114820 115899 117165
57406 117165 118300 118242 116739 115081 114482 114582 114348 113614 112870 112226 111447 110487 109325 107841 106455 106217 107511
57389 107511 109271 110220 110332 110382 110704 111245 112364 114558 117608 120724 123393 125534 127080 127992 128521 128981
57373 128981 129456 129981 130628 131078 130633 129182 127689 127202 127753 128683 129610 130525 131333 131911 132374 132815 133011 132743
57355 132743 132197 131792 131923 132990 135109 137563 139212 139830 140417 141785 143507 144675 144965 144374 142702 140122
57339 140122 137744 136793 137506 139306 141567 143620 144644 144355 143473 142865 142611 142432 142435 142755 142972 142691 142246 142127
57321 142127 142160 141986 141850 142075 142289 142107 142171 143409 145479 147001 147261 146765 146103 145240 144113 143121 142702 142875
$$ packed form
57440A11220K51M6j92p12j100r64o03k64M02J407J820J048j27p45r96j407j575
57423A07509q97K01R41J377J840J919J206L24L6j2m33p47k20O97J079J079J266
57406A17165J135n8j503j658n99J00k34p34p44o44p79r60j162j484j386k38J294
57389A07511J760R49J12N0L22N41J119K194L050L116K669K141J546R12N29M60
57373A28981M75N25O47M50m45j451j493m87N51R30R27R15Q08N78M63M41J96k68
57355A32743n46m05J31J067K119K454J649O18N87J368J722J168K90n91j672k580
57339A40122k378r51P13J800K261K053J024k89q82o08k54j79LL20K17k81m45j19
57321A42127L3j74j36K25K14j82O4J238K070J522K60m96o62q63j127r92m19J73
$$ plain form
57303 142875 143347 143760 143875 143876 144368 145687 147430 149020 150357 151448 151845 151210 150165 149832 150560 151742 152712
57286 152712 153302 153704 154381 155993 158736 161847 164280 165750 166655 167239 167465 167564 168092 169448 171827 175481
57270 175481 180453 186180 191848 197157 202412 208055 214363 221248 227997 233606 237820 241421 245094 248546
57256 248546 251350 253953 257118 260818 264539 268237 272198 276299 280251 284225 288403 292268 295203 297499
57242 297499 299952 302763 305689 308918 312833 317112 321025 324488 328043 331992 336225 340606 344783 348062
57228 348062 350347 352720 356185 360360 364413 368657 373891 379745 385176 390248 395847 401872 407400 412621
57214 412621 418870 426490 434198 440948 447074 453250 459718 466888 475325 484670 493730 502021 510075 518047
57200 518047 525433 532520 540681 550658 561881 574032 587915 604045 621641 639779 658496 677968
$$ packed form
57303A42875M72M13J15JM92J319J743J590J337J091L97o35j045l33P28J182R70
57286A52712N90M02O77J612K743L111K433J470R05N84K26R9N28J356K379L654
57270A75481M972N727N668N309N255N643O308O885O749N609M214L601L673L452
57256B48546K804K603L165L700L721L698L961M101L952L974M178L865K935K296
57242B97499K453K811K926L229L915M279L913L463L555L949M233M381M177L279
57228C48062K285K373L465M175M053M244N234N854N431N072N599O025N528N221
57214D12621O249P620P708O750O126O176O468P170Q437R345R060Q291Q054P972
57200E18047P386P087Q161R977J1223J2151J3883J6130J7596J8138J8717J9472
$$ plain form
57188 677968 697680 717090 736228 755083 773446 791944 812108 834710 858937 883753 909000
57177 909000 934694 960442 986236 1012599 1039172 1064378 1087308 1108804 1129863 1150161 1169195
57166 1169195 1187737 1207003 1227214 1247973 1269274 1291245 1313710 1336938 1361999 1389557 1419040
57155 1419040 1449704 1481484 1514012 1545944 1576310 1605686 1635127 1664853 1694806 1725402 1756724
57144 1756724 1787998 1818911 1850414 1883195 1916400 1948959 1981143 2013753 2046837 2080296 2114616
57133 2114616 2149836 2184964 2219629 2255102 2292489 2331240 2370776 2412126 2456292 2502286 2548569
57122 2548569 2595386 2644064 2695178 2749018 2806565 2868323 2933467 3001909 3075757 3157023 3245714
57111 3245714 3342252 3449889 3572304 3710810 3866870 4045693 4254481 4499233 4786972 5129733
$$ packed form
57188F77968J9712J9410J9138J8855J8363J8498K0164K2602K4227K4816K5247
57177I09000K5694K5748K5794K6363K6573K5206K2930K1496K1059K0298J9034
57166A169195J8542J9266K0211K0759K1301K1971K2465K3228K5061K7558K9483
57155A419040L0664L1780L2528L1932L0366K9376K9441K9726K9953L0596L1322
57144A756724L1274L0913L1503L2781L3205L2559L2184L2610L3084L3459L4320
57133B114616L5220L5128L4665L5473L7387L8751L9536M1350M4166M5994M6283
57122B548569M6817M8678N1114N3840N7547O1758O5144O8442P3848Q1266Q8691
57111C245714R6538J07637J22415J38506J56060J78823K08788K44752K87739L42761
$$ plain form
57101 5129733 5543113 6043184 6649362 7389075 8295552 9402857 10747667 12373385 14325663
57092 14325663 16643523 19358205 22495525 26068706 30066939 34455335 39181186 44170730
57084 44170730 49327334 54551349 59753572 64806937 69458000 73315755 75987562 77264231
57076 77264231 77185550 75946772 73767166 70836346 67327450 63405371 59211798 54860082
57068 54860082 50450439 46080562 41838877 37795250 34000598 30489286 27279368 24375138
57060 24375138 21772496 19460894 17421680 15629687 14058679 12684140 11482165 10429931
57052 10429931 9508471 8702617 7997694 7378535 6831915 6347516 5915967 5528036 5176054
57043 5176054 4853929 4555341 4274052 4006638 3753071 3513959 3288918 3077971 2882404
$$ packed form
57101E129733M13380N00071O06178P39713R06477J107305J344810J625718J952278
57092A4325663K317860K714682L137320L573181L998233M388396M725851M989544
57084D4170730N156604N224015N202223N053365M651063L857755K671807J276669
57076G7264231p8681j238778k179606k930820l508896l922079m193573m351716
57068E4860082m409643m369877m241685m043627l794652l511312l209918k904230
57060B4375138k602642k311602k039214j791993j571008j374539j201975j052234
57052A0429931r21460q05854p04923o19159n46620m84399m31549l87931l51982
57043E176054l22125k98588k81289k67414k53567k39112k25041k10947j95567
$$ plain form
57034 2882404 2703229 2540338 2394022 2265777 2156706 2066603 1995484 1944362 1912732 1895779
57024 1895779 1885004 1871201 1846702 1806596 1749965 1680115 1602576 1522404 1443092 1366970 1295531
57013 1295531 1229429 1168795 1113542 1063285 1017430 975705 938121 904164 872516 842100 812981
57002 812981 785836 760811 737260 714288 691217 667883 644825 622930 602645 583861 566688
56991 566688 551771 539554 529780 522137 516968 514915 516364 521595 530737 542708 554485 562319 563820
56978 563820 558671 547832 532902 516010 499210 483411 468304 453567 439756 427815 418151 410597
56966 410597 405048 401738 400979 403044 408400 417730 431418 449093 469913 493072 517495 540804 559293
56953 559293 569698 571088 564749 552507 535760 515890 494617 473476 453403 435106 419318 406381
$$ packed form
57034B882404j79175j62891j46316j28245j09071r0103p1119n1122l1630j6953
57024A895779j0775j3803k4499m0106n6631o9850p7539q0172p9312p6122p1439
57013A295531o6102o0634n5253n0257m5855m1725l7584l3957l1648l0416k9119
57002H12981k7145k5025k3551k2972k3071k3334k3058k1895k0285j8784j7173
56991E66688j4917j2217r774p643n169k053J449N231R142J1971J1777P834J501
56978E63820n149j0839j4930j6892j6800j5799j5107j4737j3811j1941r664p554
56966D10597n549l310p59K065N356R330J3688J7675K0820K3159K4423K3309J8489
56953E59293J0405J390o339j2242j6747j9870k1273k1141k0073j8297j5788j2937
$$ plain form
56941 406381 396105 388373 383527 381894 383501 388634 398198 413009 433212 458776 489817 525305 561543
56928 561543 592769 613653 621293 615579 598714 574375 546306 516985 487572 458876 431846 407167
56916 407167 384968 365092 347320 331330 316874 304045 293005 283511 275155 268015 262458 258235
56904 258235 254418 250492 247036 245022 244840 246238 248836 252323 256434 261076 266477 273120 281663 292869
56890 292869 307342 325302 346879 372443 402022 434157 465705 493094 513630 525786 529077 524182
56878 524182 512839 497153 479035 460360 443074 428593 417263 408806 403207 400940 402593 408718
56866 408718 419974 437140 461055 492826 533933 585637 647829 718004 790695 857756 910110
56855 910110 940832 947789 933835 904685 866406 824033 781209 740205 702277 668370 639677 617510
$$ packed form
56941D06381j0276p732m846j633J607N133R564J4811K0203K5564L1041L5488L6238
56928E61543L1226K0884P640n714j6865k4339k8069k9321k9413k8696k7030k4679
56916D07167k2199j9876j7772j5990j4456j2829j1040r494q356p140n557m223
56904B58235l817l926l456k014j82J398K598L487M111M642N401O643Q543J1206
56890B92869J4473J7960K1577K5564K9579L2135L1548K7389K0536J2156L291m895
56878E24182j1343j5686j8118j8675j7286j4481j1330q457n599k267J653O125
56866D08718J1256J7166K3915L1771M1107N1704O2192P0175P2691O7061N2354
56855I10110L0722O957j3954k9150l8279m2373m2824m1004l7928l3907k8693k2167
$$ plain form
56843 617510 602727 595550 596174 605518 625319 657575 704219 767298 848768 948955 1064277 1185894
56831 1185894 1300514 1393334 1452169 1471157 1452058 1402400 1331955 1250054 1164452 1080798 1002252
56820 1002252 930038 864956 808388 761766 725567 699351 682758 676242 680998 698530 730227 776972
56808 776972 838578 912917 994842 1075625 1144081 1189521 1205215 1190455 1150160 1092328 1024901
56797 1024901 953951 883772 817577 757416 703770 656135 614295 578729 549947 528141 513599
56786 513599 506842 508183 517745 536081 563878 600366 642237 684328 720941 746602 756922 750186
56774 750186 728217 695164 655398 612457 569051 526975 487057 449767 415799 385668 359092
56763 359092 335414 314477 296479 281140 267652 255422 244354 234480 225812 218536 212803 208276
$$ packed form
56843F17510j4783p177O24R344J9801L2256M6644O3079Q1470J00187J15322J21617
56831A185894J14620R2820N8835J8988j9099m9658p0445q1901q5602q3654p8546
56820A002252p2214o5082n6568m6622l6199k6216j6593o516M756J7532L1697M6745
56808G76972O1606P4339Q1925Q0783O8456M5440J5694j4760m0295n7832o7427
56797A024901p0950p0179o6195o0161n3646m7635m1840l5566k8782k1806j4542
56786E13599o757J341R562J8336K7797L6488M1871M2091L6613K5661J0320o736
56774G50186k1969l3053l9766m2941m3406m2076l9918l7290l3968l0131k6576
56763C59092k3678k0937j7998j5339j3488j2230j1068r874q668p276n733m527
$$ plain form
56751 208276 204275 200386 196573 192886 189477 186779 185055 183788 182078 179716 177402 175835 175030 174614 174338
56736 174338 174129 173982 173972 174181 174530 174894 175237 175423 175018 173722 171936 170549 170173 170851 172352 174303 176158
56719 176158 177503 178456 179407 180447 181427 182402 183523 184559 185089 185191 185406 185999 186759 187553 188532 189689 190734
56702 190734 191568 192391 193225 193778 193916 193847 193694 193354 192887 192576 192464 192344 192369 193107 194680 196380 197515 198229
56684 198229 199051 200017 200656 200671 200213 199613 199112 198751 198331 197621 196767 196313 196650 197636 198925 200394 202010 203523
56666 203523 204699 205779 207404 209939 213038 215937 218067 219382 220152 220613 220878 221073 221363 221826 222459 223291
56650 223291 224213 224703 224166 222771 221566 221416 222113 222814 223028 222804 222298 221667 221132 220647 219688 217869 215580
56633 215580 213527 211848 210175 208349 206490 204625 202817 201359 200133 198161 194757 190953 188669 188389
$$ packed form
56751B08276m001l889l813l687l409k698j724j267j710k362k314j567q05m16k76
56736A74338k09j47j0K09L49L64L43J86m05j296j786j387l76O78J501J951J855
56719A76158J345R53R51J040R80R75J121J036N30J02K15N93P60P94R79J157J045
56702A90734Q34Q23Q34N53J38o9j53l40m67l11j12j20K5P38J573J700J135P14
56684A98229Q22R66O39J5m58o00n01l61m20p10q54m54L37R86J289J469J616J513
56666B03523J176J080J625K535L099K899K130J315P70M61K65J95K90M63O33Q32
56650B23291R22M90n37j395j205j50O97P01K14k24n06o31n35m85r59j819k289
56633B15580k053j679j673j826j859j865j808j458j226j972l404l804k284k80
$$ plain form
56619 188389 188683 188206 187134 186338 186175 186671 188012 190145 192520 194765 197085 199484 201176 201414 200488 199342
56603 199342 198526 198050 197948 198422 199560 201225 203105 204708 205605 205921 206240 206806 207225 207207 207176 207747 208930 210197
56585 210197 211084 211431 211237 210581 209592 208458 207606 207675 208873 210402 211127 210889 210628 211176 212517 214288 216275
56568 216275 218272 220143 222293 225395 229444 233852 238673 244867 252952 262192 271512 280299 287837 292969
56554 292969 295203 295432 294728 293079 290147 286615 283660 281457 279183 276392 273540 271208 269521 268301 267279
56539 267279 266203 265089 264117 263000 260942 257757 254517 252389 251212 249937 248142 246326 244908 243795
56525 243795 242889 242308 242024 241852 241831 242124 242533 242556 241905 240666 238993 236974 234742 232485 230431 228857 227869
56508 227869 227108 226184 225491 225914 227420 228689 228701 227989 227688 227990 228358 228663 229219 230024 230840 231829 233312 235092
$$ packed form
56619A88389K94m77j072p96j63M96J341K133K375K245K320K399J692K38r26j146
56603A99342q16m76j02M74J138J665J880J603Q97L16L19N66M19j8l1N71J183J267
56585B10197Q87L47j94o56r89j134q52O9J198J529P25k38k61N48J341J771J987
56568B16275J997J871K150L102M049M408M821O194Q085R240R320Q787P538N132
56554B92969K234K29p04j649k932l532k955k203k274k791k852k332j687j220j022
56539B67279j076j114r72j117k058l185l240k128j177j275j795j816j418j113
56525B43795r06n81k84j72k1K93M09K3o51j239j673k019k232k257k054j574r88
56508B27869p61r24o93M23J506J269J2p12l01L02L68L05N56Q05Q16R89J483J780
$$ plain form
56490 235092 236706 238113 239478 240577 241138 241528 242298 243230 243611 243344 243096 243386 244157 245100 245780 245628 244548
56473 244548 243483 243707 245551 248259 250923 253029 254291 254651 254368 253674 252484 250877 249467 248786 248622 248516
56457 248516 248440 248364 247809 246672 245958 246578 247813 248127 247297 246553 246742 247596 248861 250858 253537 256015 257543
56440 257543 258171 258151 257445 256152 254780 253735 253043 252715 252769 252762 251974 250342 248666 247655 247232 246916 246451 245893
56422 245893 245479 245522 246126 247065 248158 249510 250971 251781 251469 250768 250848 251763 252475 252328 251690 251188 251131 251755 253200
56403 253200 255076 256686 257823 258836 259925 260987 262082 263460 265080 266688 268265 269893 271347 272425
56389 272425 273481 275017 276974 279058 281382 284023 286392 287906 288812 289374 288783 286233 282670 280032 278869
56374 278869 278152 277343 277020 277311 277373 276907 276699 277102 277328 276901 276483 276514 276235 274975 273463 272945 273712 275278
$$ packed form
56490B35092J614J407J365J099N61L90P70R32L81k67k48K90P71R43O80j52j080
56473B44548j065K24J844K708K664K106J262L60k83o94j190j607j410o81j64j06
56457B48516p6p6n55j137p14O20J235L14q30p44J89Q54J265J997K679K478J528
56440B57543O28k0p06j293j372j045o92l28N4pp88j632j676j011m23l16m65n58
56422B45893m14M3O04R39J093J352J461Q10l12p01Q0R15P12j47o38n02n7O24J445
56403B53200J876J610J137J013J089J062J095J378J620J608J577J628J454J078
56389B72425J056J536J957K084K324K641K369J514R06N62n91k550l563k638j163
56374B78869p17q09l23K91O2m66k08M03K26m27m18L1k79j260j512n18P67J566
$$ plain form
56356 275278 277365 279969 282952 286169 289586 292953 295857 298321 300706 302882 304329 305214 306360 307935
56342 307935 309237 310201 311897 314798 317704 319314 319996 320993 322533 323852 324674 325665 327434 329809 332158
56327 332158 334105 335946 338489 342265 346831 351140 354569 357184 359073 360106 360378 360290 360121 360082 360660 362092
56311 362092 363600 364094 363718 363702 364683 366219 368121 370995 374989 379167 382761 386150 389991 394149 398114
56296 398114 401794 405324 408687 411967 415475 419334 423398 427709 432467 437567 442897 449043 456704 465392
56282 465392 473715 481144 488491 496505 505058 513905 523205 533019 543250 554142 565814 577365 587818
56269 587818 597989 609984 624694 641305 659460 680070 703435 728445 754593 783260 816135
56258 816135 853763 896547 945720 1002231 1065815 1136154 1213917 1299868 1394016 1496386 1607392
$$ packed form
56356B75278K087K604K983L217L417L367K904K464K385K176J447Q85J146J575
56342C07935J302R64J696K901K906J610O82R97J540J319Q22R91J769K375K349
56327C32158J947J841K543L776M566M309L429K615J889J033K72q8j69l9N78J432
56311C62092J508M94l76j6R81J536J902K874L994M178L594L389L841M158L965
56296C98114L680L530L363L280L508L859M064M311M758N100N330O146P661Q688
56282D65392Q323P429P347Q014Q553Q847R300R814J0231J0892J1672J1551J0453
56269E87818J0171J1995J4710J6611J8155K0610K3365K5010K6148K8667L2875
56258H16135L7628M2784M9173N6511O3584P0339P7763Q5951R4148J02370J11006
$$ plain form
56247 1607392 1726612 1852273 1982536 2116042 2250655 2383114 2510548 2630726 2740186
56238 2740186 2834119 2909304 2965503 3002798 3019463 3014057 2987990 2944340 2885438 2813224 2730512
56227 2730512 2639950 2542697 2439806 2333971 2228177 2123516 2019951 1918418 1820558 1727099
56217 1727099 1638102 1554184 1475959 1402766 1333349 1267437 1205638 1148383 1095885 1048303 1004998
56206 1004998 964592 926735 892672 863052 836519 811677 788957 769090 751195 734177 718711
56195 718711 705936 695245 685327 676402 669462 664062 658840 653589 648996 644933 640744 636669 633266 630077
56181 630077 626439 623033 621002 620166 619612 619315 619681 620372 621238 623439 627896 633477 638542 643344 649031 655251
56165 655251 660967 666841 674505 683976 693962 704357 716292 730045 744897 760832 778446 797478
$$ packed form
56247A607392J19220J25661J30263J33506J34613J32459J27434J20178J09460
56238B740186R3933P5185N6199L7295J6665n406k6067m3650n8902p2214q2712
56227B730512r0562r7253j02891j05835j05794j04661j03565j01533r7860r3459
56217A727099q8997q3918p8225p3193o9417o5912o1799n7255n2498m7582m3305
56206A004998m0406l7857l4063k9620k6533k4842k2720j9867j7895j7018j5466
56195G18711j2775j0691r918q925o940n400n222n251m593m063m189m075l403l189
56181F30077l638l406k031q36n54k97L66O91Q66K201M457N581N065M802N687O220
56165F55251N716N874P664R471R986J0395J1935J3753J4852J5935J7614J9032
$$ plain form
56153 797478 817253 838374 862263 889416 919754 954257 994598 1041819 1097187 1163674 1244506
56142 1244506 1340641 1451280 1575810 1712712 1856919 2000607 2136790 2260804 2369550 2462178
56132 2462178 2541708 2613649 2682284 2748906 2812366 2869285 2914619 2944760 2960372 2964884 2960908 2949683
56120 2949683 2932329 2908579 2874707 2825393 2757644 2671135 2565986 2443336 2307909 2167134
56110 2167134 2027410 1893027 1767907 1655401 1556284 1469279 1393542 1328672 1272995 1224493
56100 1224493 1183105 1149609 1122728 1099893 1080351 1064799 1052500 1041706 1032567 1026604 1023522 1021523
56088 1021523 1020534 1022046 1025793 1029622 1032744 1036269 1040574 1044965 1049856 1056379 1063952 1071109 1078441 1087746
56074 1087746 1098664 1109375 1120231 1133244 1148221 1163041 1177630 1193997 1212208 1230033 1246700
$$ packed form
56153G97478J9775K1121K3889K7153L0338L4503M0341M7221N5368O6487Q0832
56142A244506R6135J10639J24530J36902J44207J43688J36183J24014J08746R2628
56132B462178P9530P1941O8635O6622O3460N6919M5334L0141J5612M512l976j1225
56120B949683j7354k3750l3872m9314o7749q6509j05149j22650j35427j40775
56110B167134j39724j34383j25120j12506r9117q7005p5737o4870n5677m8502
56100A224493m1388l3496k6881k2835j9542j5552j2299j0794r139n963l082j999
56088A021523r89J512L747L829L122L525M305M391M891O523P573P157P332R305
56074A087746J0918J0711J0856J3013J4977J4820J4589J6367J8211J7825J6667
$$ plain form
56063 1246700 1263373 1279766 1294093 1306654 1319739 1333613 1346267 1357423 1369044 1381718 1394374
56052 1394374 1407699 1423692 1441562 1458356 1474078 1491829 1512368 1532998 1552512 1572714 1594201
56041 1594201 1615313 1636275 1659817 1686475 1713653 1740474 1769095 1800153 1831530 1862858 1896638
56030 1896638 1933523 1970987 2008003 2046480 2086870 2126993 2166443 2207487 2250536 2293595 2337225
56019 2337225 2384810 2436762 2489820 2543233 2599908 2660130 2720223 2779141 2840375 2905461 2971780
56008 2971780 3038824 3110406 3188383 3270261 3355150 3445842 3542981 3643703 3748192 3860730 3982132
55997 3982132 4108300 4238580 4377963 4528508 4686545 4851123 5026927 5215685 5413266
55988 5413266 5618873 5838539 6075931 6328566 6596745 6886829 7201801 7538408 7897803
$$ packed form
56063A246700J6673J6393J4327J2561J3085J3874J2654J1156J1621J2674J2656
56052A394374J3325J5993J7870J6794J5722J7751K0539K0630J9514K0202K1487
56041A594201K1112K0962K3542K6658K7178K6821K8621L1058L1377L1328L3780
56030A896638L6885L7464L7016L8477M0390M0123L9450M1044M3049M3059M3630
56019B337225M7585N1952N3058N3413N6675O0222O0093N8918O1234O5086O6319
56008B971780O7044P1582P7977Q1878Q4889R0692R7139J00722J04489J12538J21402
55997C982132J26168J30280J39383J50545J58037J64578J75804J88758J97581
55988E413266K05607K19666K37392K52635K68179K90084L14972L36607L59395
$$ plain form
55979 7897803 8288747 8716098 9177148 9673943 10217554 10815323 11466551 12176324 12960393
55970 12960393 13830702 14790772 15852195 17040659 18379393 19884492 21585456 23533057
55962 23533057 25780224 28378540 31406805 34984276 39250723 44368109 50564868 58159913
55954 58159913 67542915 79184148 93695933 111848187 134501158 162539509 196726366
55947 196726366 237135168 282113589 327546639 367443382 395903876 409250179 406976602
55940 406976602 391255050 365723921 334330342 300523357 266833052 234832858 205368827
55933 205368827 178822553 155271972 134598064 116595983 101047861 87723452 76365741
55926 76365741 66712642 58523467 51575284 45657030 40587565 36228678 32469182 29208580
$$ packed form
55979G897803L90944M27351M61050M96795N43611N97769O51228P09773P84069
55970A2960393Q70309R60070J061423J188464J338734J505099J700964J947601
55962B3533057K247167K598316L028265L577471M266447N117386O196759P595045
55954E8159913R383002J1641233J4511785J8152254K2652971K8038351L4186857
55947A96726366M0408802M4978421M5433050L9896743K8460494J3346303k273577
55940D06976602j5721552k5531129l1393579l3806985l3690305l2000194k9464031
55933B05368827k6546274k3550581k0673908j8002081j5548122j3324409j1357711
55926G6365741r653099q189175o948183n918254n069465m358887l759496l260602
$$ plain form
55918 29208580 26364359 23878827 21704873 19793688 18103410 16606843 15280610 14096373
55910 14096373 13030297 12070598 11207493 10424906 9709138 9056012 8461851 7916098 7409995
55901 7409995 6943995 6519339 6130104 5770280 5440871 5142798 4869898 4615915 4381864
55892 4381864 4169752 3975122 3792463 3622397 3467182 3324318 3190733 3068373 2959613
55883 2959613 2861262 2768278 2679199 2593219 2506575 2417028 2327803 2242353 2159180 2076181 1995718
55872 1995718 1920674 1849535 1780046 1713970 1653677 1597653 1543823 1493754 1449144 1407492 1365613
55861 1365613 1324344 1285690 1248544 1211393 1176277 1145821 1118968 1093473 1069881 1049318 1030023
55850 1030023 1009849 989712 970953 951834 930147 906909 884059 860990 836724 813049 791999
$$ packed form
55918B9208580k844221k485532k173954j911185j690278j496567j326233j184237
55910A4096373j066076r59699q63105p82587p15768o53126n94161n45753n06103
55901G409995m66000m24656l89235l59824l29409k98073k72900k53983k34051
55892D381864k12112j94630j82659j70066j55215j42864j33585j22360j08760
55883B959613r8351r2984q9079q5980q6644q9547q9225q5450q3173q2999q0463
55872A995718p5044p1139o9489o6076o0293n6024n3830n0069m4610m1652m1879
55861A365613m1269l8654l7146l7151l5116l0456k6853k5495k3592k0563j9295
55850A030023k0174k0137j8759j9119k1687k3238k2850k3069k4266k3675k1050
$$ plain form
55839 791999 772483 752749 733945 717927 703753 689635 676327 665359 655925 646531 637765 630543
55827 630543 623726 616354 610003 605916 601993 595680 587779 580314 572758 563586 553552 544166 534718 524053
55813 524053 513679 505977 500816 496867 494580 494845 496407 497774 500271 506031 514197 522122 529183 536496
55799 536496 543947 550337 555486 559512 561029 558531 552599 544496 533975 520886 507524 496652 488278
55786 488278 480779 473817 467583 460601 451235 440439 430431 421636 413442 406772 403256 402872 405054 411015
55772 411015 422065 436300 449606 459380 464986 465572 460310 450351 438039 424432 409578 394451 380456
55759 380456 367707 355859 345732 337887 330626 321819 311901 302739 294470 285998 277779 271344 266491
55746 266491 261575 256305 251890 248672 245878 243467 242108 241495 240584 239142 237429 235028 231836 229326 228800
$$ packed form
55839G91999j9516j9734j8804j6018j4174j4118j3308j0968r434r394q766p222
55827F30543o817p372o351m087l923o313p901p465p556r172j0034r386r448j0665
55813E24053j0374p702n161l949k287K65J562J367K497N760Q166P925P061P313
55799E36496P451O390N149M026J517k498n932q103j0521j3089j3362j0872q374
55786D88278p499o962o234o982r366j0796j0008q795q194o670l516l84K182N961
55772D11015J1050J4235J3306R774N606N86n262r959j2312j3607j4854j5127j3995
55759C80456j2749j1848j0127p845p261q807r918r162q269q472q219o435m853
55746B66491m916n270m415l218k794k411j359o13r11j442j713k401l192k510n26
$$ plain form
55731 228800 229222 228852 228020 227951 227873 225924 222257 218581 215157 210856 205825 201491 198280 195783 194791 196516
55715 196516 200045 203242 206081 210447 216623 222569 226867 229903 231949 232523 231983 231496 231068 229623 227097
55700 227097 224313 220781 215076 207604 200658 195398 191044 187279 184992 184090 183044 181359 180324 180555 180948
55685 180948 180930 181654 183965 187058 190171 193898 198772 204054 208901 213371 217368 219914 220371 219368 217805
55670 217805 215988 214228 213107 212572 211766 210251 208471 206800 205243 204272 204728 206610 209086 211874 215384
55655 215384 219349 222690 225031 227099 229327 231221 232283 232340 230914 227583 223093 218738 214527 209356 203071
55640 203071 196780 190960 184901 178379 172251 166913 161751 156636 152525 149931 148125 146405 144919 143712
55626 143712 142240 140401 138837 137755 136565 135115 134034 133484 132772 131667 130855 130671 130555 130149 129735 129225
$$ packed form
55731B28800M22l70q32o9p8j949l667l676l424m301n031m334l211k497r92J725
55715A96516L529L197K839M366O176N946M298L036K046N74n40m87m28j445k526
55700B27097k784l532n705p472o946n260m354l765k287r02j046j685j035K31L93
55685A80948j8P24K311L093L113L727M874N282M847M470L997K546M57j003j563
55670B17805j817j760j121n35q06j515j780j671j557r71M56J882K476K788L510
55655B15384L965L341K341K068K228J894J062N7j426l331m490m355m211n171o285
55640B03071o291n820o059o522o128n338n162n115m111k594j806j720j486j207
55626A43712j472j839j564j082j190j450j081n50p12j105q12j84j16m06m14n10
$$ plain form
55610 129225 128054 126441 125439 125251 124838 123607 122131 120771 119091 117248 116362 116657 116587 114790 111743 108673
55594 108673 105986 103709 102306 101986 102023 101696 101228 101135 101421 102010 103046 104120 104169 102952 101826 102269 104356
55577 104356 107293 110667 114375 118021 121210 124060 126947 130163 134077 138921 144082 148305 150989 152624
55563 152624 153739 154191 153712 152329 149974 146549 142598 138945 135491 131419 126846 123049 120679 119013 117461
55548 117461 116481 116278 115872 114445 112661 111656 111505 111599 111805 112384 113274 114273 115484 116953 118277 119062 119354
55531 119354 119300 118904 118347 117857 117079 115361 112948 110946 109801 108742 107132 105360 103881 102401 100643 99025
55515 99025 97870 96718 95073 93109 91055 88643 85773 82985 80721 78760 76933 75664 75303 75576 76168
55500 76168 77118 78215 78794 78605 78151 77787 77317 76870 77186 78483 79919 80791 81404 82252 83244 84298 85767
$$ packed form
55610A29225j171j613j002j88m13j231j476j360j680j843q86K95p0j797l047l070
55594A08673k687k277j403l20L7l27m68r3K86N89J036J074M9j217j126M43K087
55577A04356K937L374L708L646L189K850K887L216L914M844N161M223K684J635
55563A52624J115M52m79j383k355l425l951l653l454m072m573l797k370j666j552
55548A17461r80k03m06j427j784j005j51R4K06N79Q90R99J211J469J324P85K92
55531A19354n4l96n57m90p78j718k413k002j145j059j610j772j479j480j758j618
55515I9025j155j152j645j964k054k412k870k788k264j961j827j269l61K73N92
55500G6168R50J097N79j89m54l64m70m47L16J297J436Q72O13Q48R92J054J469
$$ plain form
55483 85767 87634 89211 90196 91144 92328 93215 93678 94576 96252 97555 97375 96199 95115 94152 92770 91211
55467 91211 90209 89851 89731 89723 89731 89271 88213 87354 87354 87698 87681 87766 88828 90524 91621 91631 91088 90383 89396 88198
55447 88198 87163 86321 85305 84064 83084 82916 83815 85641 87697 88997 89176 88909 89057 89715 90400 90764 90735
55430 90735 90366 89926 89794 89966 90095 90150 90386 90583 90191 89561 89941 91690 93513 94266 94567 95679 97573 99175
55412 99175 99951 100181 100035 99371 98304 97226 96372 95871 95886 96238 96317 95787 94940 93990 92687 91099 89995 89809
55394 89809 89948 89800 89657 89879 89959 89396 88831 89316 90850 92526 93687 94129 93688 92569 91721 91976 93060 94088
55376 94088 94632 94696 94146 93046 92095 91914 92200 92239 91812 90975 89605 87927 86889 87073 87682 87479 86321 85001
55358 85001 84122 83955 84804 86486 87915 88224 87919 87959 88172 87632 86269 84941 84119 83551 83070 82792 82589 82185
$$ packed form
55483H5767J867J577R85R48J184Q87M63Q98J676J303j80j176j084r63j382j559
55467I1211j002l58j20qQm60j058q59%L44j7Q5J062J696J097J0n43p05r87j198
55447H8198j035q42j016j241r80j68Q99J826K056J300J79k67J48O58O85L64k9
55430I0735l69m40j32J72J29N5K36J97l92o30L80J749J823P53L01J112J894J602
55412I9175P76K30j46o64j067j078q54n01J5L52P9n30q47r50j303j588j104j86
55394H9809J39j48j43K22Q0n63n65M85J534J676J161M42m41j119q48K55J084J028
55376I4088N44O4n50j100r51j81K86L9m27q37j370j678j038J84O09k03j158j320
55358H5001q79j67Q49J682J429L09l05M0K13n40j363j328q22n68m81k78k03m04
$$ plain form
55340 82185 81703 81427 81261 81124 81468 82626 84045 85044 85954 87497 89379 90526 90588 90202 89892 89590 89166 88630
55322 88630 87841 86683 85346 83915 82060 79773 77875 76996 76621 76031 75637 76275 77721 79087 80269 81712
55306 81712 83054 83371 82740 82257 82439 82732 82659 82378 82061 81693 81577 82059 82717 82731 82091 81575 81588 81957 82768 84371
55286 84371 86496 88343 89625 90706 91735 92547 93318 94352 95280 95466 95114 94917 94734 93762 92051 90618
55270 90618 89943 89516 89080 89113 89695 90029 89581 88782 88210 87869 87640 87660 87900 88073 88205 88566 88836 88173 86399
55251 86399 84399 82997 82137 81474 81154 81608 82931 84650 85866 85830 84807 84104 84604 85648 86030 85663 85283
55234 85283 84992 84343 83605 83571 84118 84266 83791 83502 83807 84241 84629 85362 86266 86536 86253 86684 88482 90720 92254
55215 92254 92982 93196 92786 91771 90703 89923 89217 88653 88834 89796 90672 90981 91282 91930 92249 91687 90869 90587
$$ packed form
55340H2185m82k76j66j37L44J158J419R99R10J543J882J147O2l86l10l02m24n36
55322H8630p89j158j337j431j855k287j898q79l75n90l94O38J446J366J182J443
55306H1712J342L17o31m83J82K93p3k81l17l68j16M82O58J4o40n16J3L69Q11J603
55286H4371K125J847J282J081J029Q12P71J034R28J86l52j97j83r72j711j433
55270I0618o75m27m36L3N82L34m48p99n72l41k29K0K40J73J32L61K70o63j774
55251H6399k000j402q60o63l20M54J323J719J216l6j023p03N00J044L82l67l80
55234H5283k91o49p38l4N47J48m75k89L05M34L88P33R04K70k83M31J798K238J534
55215I2254P28K14m10j015j068p80p06n64J81R62Q76L09L01O48L19n62q18k82
$$ plain form
55197 90587 90576 90187 89610 89514 89946 90426 90776 91189 91801 92747 94251 96147 97698 98399 98553 98682 98797 98650 98287
55178 98287 97956 97821 98006 98466 98691 98141 97128 96622 97008 97792 98642 99797 101154 102002 102179 102498 103426 104295
55160 104295 104577 104966 106263 107877 108476 107705 106380 105263 104408 103524 102399 101096 100102 99991 100639 101186 101116
55143 101116 100897 101186 101864 102220 101676 100100 97866 95827 94650 94023 93141 92062 91661 92104 92498 92459 92831
55126 92831 94199 95852 97008 97973 99082 99589 98844 97800 97944 99228 100246 100120 99092 97610 96039 95108
55110 95108 95471 96743 97836 98322 98714 99459 100390 101186 101692 101819 101684 101832 102740 104158 105398 106125 106449 106414
55092 106414 105960 105246 104553 104025 103884 104554 106029 107426 107732 106923 105842 105208 105187 105730 106740 107976 109210
55075 109210 110459 111769 112960 113803 114266 114433 114504 114985 116339 118189 119409 119288 118076 116272 114155 112287
$$ packed form
55197I0587j1l89n77r6M32M80L50M13O12R46J504J896J551P01J54J29J15j47l63
55178I8287l31j35J85M60K25n50j013n06L86P84Q50J155J357Q48J77L19R28Q69
55160A04295K82L89J297J614N99p71j325j117q55q84j125j303r94j11O48N47p0
55143A01116k19K89O78L56n44j576k234k039j177o27q82j079m01M43L94l9L72
55126I2831J368J653J156R65J109N07p45j044J44J284J018j26j028j482j571r31
55110I5108L63J272J093M86L92P45R31P96N06J27j35J48R08J418J240P27L24l5
55092A06414m54p14o93n28j41O70J475J397L06q09j081o34k1N43J010J236J234
55075A09210J249J310J191Q43M63J67P1M81J354J850J220j21j212j804k117j868
$$ plain form
55059 112287 111471 111583 111346 110030 108541 108013 108201 108256 108221 108524 108599 107492 105547 104143 103768 103519 102594 101227
55041 101227 99990 99057 98412 98105 98133 98525 99457 100770 101675 101641 101285 101601 102532 103222 103510 104146 105445 106679
55023 106679 107049 106594 105939 105680 106108 106983 107574 107423 106960 106863 106990 106683 105933 105447 105551 105868 106161 106772 107997
55004 107997 109567 110927 111631 111494 110801 110281 110410 110889 111254 111642 112375 113166 113560 113849 114652 115828 116759 117522
54986 117522 118685 120027 120637 120386 120133 120260 120132 119412 118826 119037 119646 119890 119639 119191 118745 118575 119080 120130
54968 120130 120945 121137 121319 122183 123492 124531 125077 125388 125614 125802 126188 126949 127779 128124 127767 126933 125956 125055
54950 125055 124264 123479 122708 122324 122713 123677 124541 124923 124943 124647 123810 122540 121521 121367 122056 123257 124764 126404
54932 126404 128015 129864 132701 136956 142142 147363 152230 157064 162466 168903 176429 184497 192193 198806
$$ packed form
55059A12287q16J12k37j316j489n28J88N5l5L03P5j107j945j404l75k49r25j367
55041A01227j237r33o45l07K8L92R32J313R05l4l56L16R31O90K88O36J299J234
55023A06679L70m55o55k59M28Q75N91j51m63r7J27l07p50m86J04L17K93O11J225
55004A07997J570J360P04j37o93n20J29M79L65L88P33P91L94K89Q03J176R31P63
54986A17522J163J342O10k51k53J27j28p20n86K11O09K44k51m48m46j70N05J050
54968A20130Q15J92J82Q64J309J039N46L11K26J88L86P61Q30L45l57q34r77r01
54950A25055p91p85p71l84L89R64Q64L82K0k96q37j270j019j54O89J201J507J640
54932A26404J611J849K837M255N186N221M867M834N402O437P526Q068P696O613
$$ plain form
54918 198806 203950 207106 207555 205137 200746 195653 190423 184755 178254 171108 164006 157593 152070 147330
54904 147330 143436 140706 139206 138449 137911 137535 137317 136697 135110 133033 131689 131590 132110 132690 133686 135590 138126
54887 138126 140725 143505 147106 151790 157208 162922 168763 174707 180700 186578 192015 196657 200359 203067
54873 203067 204364 203518 200250 195199 189317 183040 176330 169335 162585 156507 151031 145858 141076 137338
54859 137338 135267 134624 134367 133727 132977 132789 133080 133032 132102 130396 128064 125097 121916 119470 118259 117770 117254
54842 117254 116630 116157 115726 115071 114378 114032 113870 113371 112621 112497 113610 115458 116985 117743 118172 118767 119393 119587
54824 119587 119301 118988 118999 119232 119486 119765 120013 119917 119378 118947 119283 120240 121026 121277 121520 122384 123730 124817 125112
54805 125112 124802 124550 124855 125582 126216 126556 126942 127636 128337 128606 128390 127688 126111 123520 120853 119481 119680
$$ packed form
54918A98806N144L156M49k418m391n093n230n668o501p146p102o413n523m740
54904A47330l894k730j500p57n38l76k18o20j587k077j344r9N20N80R96J904K536
54887A38126K599K780L601M684N418N714N841N944N993N878N437M642L702K708
54873B03067J297q46l268n051n882o277o710o995o750o078n476n173m782l738
54859A37338k071o43k57o40p50j88K91m8r30j706k332k967l181k446j211m89n16
54842A17254o24m73m31o55o93l46j62m99p50j24J113J848J527P58M29N95O26J94
54824A19587k86l13J1K33K54K79K48r6n39m31L36R57P86K51K43Q64J346J087K95
54805A25112l10k52L05P27O34L40L86O94P01K69k16p02j577k591k667j372J99
$$ plain form
54788 119680 120473 121086 121812 123252 125417 127933 130512 132850 134614 135950 137602 140133 143308 146511 149471
54773 149471 152421 155911 160665 167173 175071 183283 190986 198056 204393 209383 212431 213640 213484 212103
54759 212103 209324 205200 200191 194880 189636 184352 178524 171991 165624 160709 157474 154855 152031 149483
54745 149483 148018 147357 146512 145165 143905 143207 142843 142344 141604 141009 141245 142861 145661 148668 151071 153113
54729 153113 155796 159921 165715 173002 181156 189030 195556 200541 204515 207798 210037 210633 209216 205755
54715 205755 200538 194095 186918 179315 171764 165146 160140 156518 153509 150870 149058 148281 147920 147157 145757
54700 145757 143972 142059 140228 138776 137803 136953 135790 134410 133335 132843 132756 132910 133364 133941 133984 133006 131369
54683 131369 129815 128472 126872 125002 123685 123582 124328 125101 125628 126141 126666 126970 127016 126844 126123 124478 122322
$$ packed form
54788A19680P93O13P26J440K165K516K579K338J764J336J652K531L175L203K960
54773A49471K950L490M754O508P898Q212P703P070O337M990L048J209j56j381
54759B12103k779m124n009n311n244n284n828o533o367m915l235k619k824k548
54745A49483j465o61q45j347j260o98l64m99p40n95K36J616K800L007K403K042
54729A53113K683M125N794P287Q154P874O526M985L974L283K239N96j417l461
54715B05755n217o443p177p603p551o618n006l622l009k639j812p77l61p63j400
54700A45757j785j913j831j452r73q50j163j380j075m92q7J54M54N77M3r78j637
54683A31369j554j343j600j870j317j03P46P73N27N13N25L04M6j72p21j645k156
$$ plain form
54666 122322 120674 119971 119660 119162 118717 118915 119874 121273 122852 124462 125790 126461 126387 125891 125493 125616 126357
54649 126357 127413 128278 128482 127694 125930 123933 122908 123288 124008 123726 122612 122027 122444 122802 122315 121849 122714
54632 122714 124785 126740 127752 128072 128157 128092 127910 127809 127892 128093 128385 128752 128960 128774 128368 128162 128192 127979 127215
54613 127215 126255 125723 125739 125778 125356 124706 124565 125257 126243 126771 126775 126811 127251 127889 128332 128452 128441 128706 129563 130746
54593 130746 131381 130890 129703 128536 127283 125493 123727 123317 124489 125861 126303 126325 126942 128012 128607 128496
54577 128496 128307 128514 129017 129567 129987 130082 129872 129796 130265 131190 132225 133206 133982 134199 133676 132697 131538 130091
54559 130091 128374 126982 126542 127052 128196 129837 131716 133188 133954 134614 135801 137180 138085 138734 139839 141207
54543 141207 141768 141062 139916 139445 139992 141175 142391 143172 143528 143997 144941 145819 145657 144272 142574 141637 141783
$$ packed form
54666A22322j648p03l11m98m45J98R59J399J579J610J328O71p4m96l98J23P41
54649A26357J056Q65K04p88j764j997j025L80P20k82j114n85M17L58m87m66Q65
54632A22714K071J955J012L20Q5o5j82j01Q3K01K92L67K08j86m06k06L0k13p64
54613A27215r60n32J6L9m22o50j41O92R86N28ML6M40O38M43J20j1K65Q57J183
54593A30746O35m91j187j167j253j790j766m10J172J372M42K2O17J070N95j11
54577A28496j89K07N03N50M20R5k10p6M69R25J035R81P76K17n23r79j159j447
54559A30091j717j392m40N10J144J641J879J472P66O60J187J379R05O49J105J368
54543A41207N61p06j146m71N47J183J216P81L56M69R44Q78j62j385j698r37J46
$$ plain form
54526 141783 142479 142712 141607 139159 136335 134125 132652 131548 130850 130937 131761 132720 133260 133204 132723 132384 132887
54509 132887 134242 135526 136044 136278 137009 138051 138789 139476 140720 141925 141650 139665 137429 136190 135754 135511
54493 135511 135534 136070 136901 137830 139051 140389 140954 140278 139224 139009 139754 140684 141366 142042 142902 143681 144007 143811
54475 143811 143447 143576 144730 146809 149209 151492 153561 155161 155852 155807 156044 157325 159149 160346 160386 159692
54459 159692 158904 158354 158168 158404 158943 159434 159415 158516 156721 154460 152279 150443 149035 148287 148309 148537 148036 146614
54441 146614 145144 144526 144746 145200 145504 145607 145505 145285 145246 145653 146480 147568 148810 149991 150748 150934 150844 150905
54423 150905 151343 152191 153271 154058 154014 153301 152701 152578 152363 151407 149928 148648 147865 147352 146971 146877 147199 147866
54405 147866 148709 149547 150300 151139 152211 153049 152783 151339 150034 150384 152537 155369 157913 160046 161880 163180
$$ packed form
54526A41783O96K33j105k448k824k210j473j104o98Q7Q24R59N40n6m81l39N03
54509A32887J355J284N18K34P31J042P38O87J244J205k75j985k236j239m36k43
54493A35511K3N36Q31R29J221J338N65o76j054k15P45R30O82O76Q60P79L26j96
54475A43811l64J29J154K079K400K283K069J600O91m5K37J281J824J197M0o94
54459A59692p88n50j86K36N39M91j9q99j795k261k181j836j408p48K2K28n01j422
54441A46614j470o18K20M54L04J03j02k20l9M07Q27J088J242J181P57J86r0O1
54423A50905M38Q48J080P87m4p13o00j23k15r56j479j280p83n13l81r4L22O67
54405A47866Q43Q38P53Q39J072Q38k66j444j305L50K153K832K544K133J834J300
$$ plain form
54389 163180 163620 163174 162028 160357 158405 156570 155273 154769 155109 156126 157483 158845 160035 160946 161477 161733
54373 161733 162196 163450 165711 168804 172479 176497 180440 183757 186233 188247 190318 192352 193556 193248 191673
54358 191673 189806 188334 187109 185698 184178 182980 182134 181162 179745 178102 176562 175130 173653 172118 170607
54343 170607 169174 167965 167193 166844 166591 166170 165629 165089 164501 163818 163207 162856 162746 162821 163210 164035 165088 165905
54325 165905 166197 166112 166100 166527 167357 168168 168535 168308 167514 166155 164393 162708 161482 160536 159491 158525 158202 158529
54307 158529 158780 158497 158121 158241 158685 158818 158481 158146 158212 158527 158658 158464 158342 158871 160095 161269 161596 161149
54289 161149 160677 160571 160537 160323 160122 160043 159792 159290 159050 159451 160054 160186 159909 159865 160340 160987 161370 161347 160957 160338
54269 160338 159762 159540 159854 160756 162140 163617 164746 165601 166828 168835 171173 172977 173819 173887 173650 173609 174052
$$ packed form
54389A63180M40m46j146j671j952j835j297n04L40J017J357J362J190R11N31K56
54373A61733M63J254K261L093L675M018L943L317K476K014K071K034J204l08j575
54358A91673j867j472j225j411j520j198q46r72j417j643j540j432j477j535j511
54343A70607j433j209p72l49k53m21n41n40n88o83o11l51j10P5L89Q25J053Q17
54325A65905K92q5j2M27Q30Q11L67k27p94j359j762j685j226r46j045r66l23L27
54307A58529K51k83l76J20M44J33l37l35O6L15J31j94j22N29J224J174L27m47
54289A61149m72j06l4k14k01p9k51n02k40M01O03J32k77m4M75O47L83k3l90o19
54269A60338n76k22L14R02J384J477J129Q55J227K007K338J804Q42O8k37m1M43
$$ plain form
54252 174052 174664 174639 173525 171769 170141 168923 167987 167329 167071 167122 167261 167404 167510 167502 167568 168175 169371 170492
54234 170492 171041 171446 172341 173480 174085 173994 173650 173126 172016 170317 168580 167088 165644 164341 163768 164131 164812
54217 164812 165153 165171 165102 164799 164036 163085 162506 162534 162966 163474 163789 163787 163634 163627 163685 163212 161799 159908 158582 158514 159547
54196 159547 160957 162053 162521 162448 162111 161738 161449 161334 161441 161681 161871 161956 162188 163046 164923 167733 170739 172941
54178 172941 173831 173674 172970 171887 170496 169311 169043 169750 170595 170745 170258 169872 170040 170400 170212 169179 167725
54161 167725 166455 165555 164923 164743 165500 167240 169217 170591 171282 171837 172637 173505 173937 173473 172008 170002 168122
54144 168122 166488 164679 162832 162160 163600 166283 168263 168722 168567 168762 169059 168765 167924 167066 166358 165753 165665
54127 165665 166768 169134 172002 174514 176386 177921 179603 181762 184516 187976 192392 197834 203819 209629
$$ packed form
54252A74052O12k5j114j756j628j218r36o58k58N1J39J43J06qO6O07J196J121
54234A70492N49M05Q95J139O05r1l44n24j110j699j737j492j444j303n73L63O81
54217A64812L41J8o9l03p63r51n79K8M32N08L15kj53pN8m73j413j891j326o8J033
54196A59547J410J096M68p3l37l73k89j15J07K40J90Q5K32Q58J877K810L006K202
54178A72941Q90j57p04j083j391j185k68P07Q45J50m87l86J68L60j88j033j454
54161A67725j270r00o32j80P57J740J977J374O91N55Q00Q68M32m64j465k006j880
54144A68122j634j809j847o72J440K683J980M59j55J95K97k94q41q58p08o05q8
54127A65665J103K366K868K512J872J535J682K159K754L460M416N442N985N810
$$ plain form
54113 209629 215115 220777 226805 232447 236668 239127 240140 239893 238159 234692 229558 223207 216532 210671
54099 210671 206293 203068 200206 197481 195318 193862 192533 190735 188623 186873 185935 185725 185753 185280 183695
54084 183695 181208 179042 178436 179422 180978 182339 183656 185269 186945 188194 188975 189611 190337 191302 192685 194266
54068 194266 195118 194453 192795 191625 191773 192677 193361 193482 193123 192264 190970 189716 188970 188710 188744 189244 190548
54051 190548 192623 195143 197891 200811 203912 207380 211459 215906 219968 223422 227200 232371 238766 245235
54037 245235 251037 256308 261406 266528 271908 277613 283161 288041 292596 297596 302899 307396 310487 312796
54023 312796 315102 317328 318996 319954 320174 319463 317939 316271 314884 313382 311251 308657 305967 302913 298919
54008 298919 293994 288677 283282 277808 272413 267427 263009 259281 256592 255027 253809 251906 249290 246890
$$ packed form
54113B09629N486N662O028N642M221K459J013k47j734l467n134o351o675n861
54099B10671m378l225k862k725k163j456j329j798k112j750r38k10K8m73j585
54084A83695k487k166o06R86J556J361J317J613J676J249P81O36P26R65J383J581
54068A94266Q52o65j658j170J48R04O84J21l59q59j294j254p46k60L4N00J304
54051A90548K075K520K748K920L101L468M079M447M062L454L778N171O395O469
54037B45235N802N271N098N122N380N705N548M880M555N000N303M497L091K309
54023C12796K306K226J668R58K20p11j524j668j387j502k131k594k690l054l994
54008B98919m925n317n395n474n395m986m418l728k689j565j218j903k616k400
$$ plain form
53994 246890 245188 243517 241011 237662 234058 230579 227418 225069 224175 224747 225916 226658 226674 226577 227330 229616
53978 229616 233694 239654 247590 257320 268006 278207 286442 291707 293605 292259 288279 282686 276548 270476
53964 270476 264455 258272 252165 246892 243045 240349 237916 235193 232487 230457 229357 228926 228874 229207 230171
53949 230171 232021 234767 237981 240979 243440 245789 248666 252041 255229 257889 260696 264736 270322 276657
53935 276657 282560 287346 291072 294223 297329 300719 304436 308286 311997 315336 318182 320614 322979 325730
53921 325730 329101 333014 337348 342199 347810 354325 361747 370040 379080 388559 398053 407164 415461 422441
53907 422441 427831 431831 434737 436336 436096 434106 431331 428663 426043 422938 419432 416309 413998 411825
53893 411825 408504 403272 396487 389170 382005 374828 367183 359189 351457 344198 336973 329551 322482 316389
$$ packed form
53994B46890j702j671k506l349l604l479l161k349q94N72J169P42J6r7P53K286
53978B29616M078N960P936R730J0686J0201Q235N265J898j346l980n593o138o072
53964B70476o021o183o107n273l847k696k433k723k706k030j100m31n2L33R64
53949B30171J850K746L214K998K461K349K877L375L188K660K807M040N586O335
53935B76657N903M786L726L151L106L390L717L850L711L339K846K432K365K751
53921C25730L371L913M334M851N611O515P422Q293R040R479R494R111Q297O980
53907D22441N390M000K906J599k40j990k775k668k620l105l506l123k311k173
53893D11825l321n232o785p317p165p177p645p994p732p259p225p422p069o093
$$ plain form
53879 316389 311171 306449 302329 299009 295894 292047 287529 283408 280216 277125 273077 268100 263054 258503
53865 258503 254383 250532 246960 243620 240287 236802 233339 230341 228178 226752 225562 224350 223582 223976 225540
53850 225540 227394 228612 228909 228473 227557 226418 225298 224224 223056 221917 221302 221567 222515 223626 224523 225076
53834 225076 225338 225524 225834 226169 226218 225889 225370 224738 223906 223053 222662 222866 223154 223049 222766 222930 223881 225520 227536
53815 227536 229448 230687 231008 230774 230640 231131 232617 235347 239236 243884 249005 254569 260407 266129 271717
53800 271717 277707 284360 291144 297488 303552 309589 315045 319202 322500 326179 330469 334050 335701 335755 335436
53785 335436 335293 334867 333642 331721 329515 327101 324086 320089 315301 310442 306040 301877 297390 292507 287733
53770 287733 283399 279260 275013 270855 267237 264322 261937 259922 258117 256059 253074 248966 244499 240877
$$ packed form
53879C16389n218m722m120l320l115l847m518m121l192l091m048m977n046m551
53865B58503m120l851l572l340l333l485l463k998k163j426j190j212p68L94J564
53850B25540J854J218K97m36r16j139j120j074j168j139o15K65R48J111Q97N53
53834B25076K62J86L10L35M9l29n19o32q32q53l91K04K88j05k83J64R51J639K016
53815B27536J912J239L21k34j34M91J486K730L889M648N121N564N838N722N588
53800B71717N990O653O784O344O064O037N456M157L298L679M290L581J651N4l19
53785C35436j43m26j225j921k206k414l015l997m788m859m402m163m487m883m774
53770B87733m334m139m247m158l618k915k385k015j805k058k985m108m467l622
$$ plain form
53756 240877 238626 237124 235351 232983 230542 228596 227167 225994 224979 224148 223463 223026 223263 224470 226221
53741 226221 227560 227866 227277 226300 225364 224848 225185 226547 228500 230162 230819 230463 229776 229600 230286 231450 232370
53724 232370 232653 232555 232660 233329 234431 235586 236623 237750 239275 241236 243424 245644 247775 249608 250906
53709 250906 251765 252750 254555 257560 261643 266186 270328 273527 276014 278469 281200 283948 286542 289304 292507
53694 292507 295861 298928 301793 304870 308137 310958 312672 313099 312527 311417 310124 308781 307499 306626 306525
53679 306525 306975 307203 306766 306114 305929 306235 306549 306603 306450 306064 305364 304556 303982 303684 303527 303601 304055 304618 304822
53660 304822 304664 304597 304843 305165 305241 304829 303678 301897 300360 300038 300810 301633 302039 302699 304167 305887 307015
53643 307015 307636 308427 309553 310661 311748 313241 315194 317087 318636 320311 322801 326261 330317 334503 338466
$$ packed form
53756B40877k251j502j773k368k441j946j429j173j015q31o85m37K37J207J751
53741B26221J339L06n89r77r36n16L37J362J953J662O57l56o87j76O86J164R20
53724B32370K83r8J05O69J102J155J037J127J525J961K188K220K131J833J298
53709B50906Q59R85J805L005M083M543M142L199K487K455K731K748K594K762L203
53694B92507L354L067K865L077L267K821J714M27n72j110j293j343j282q73j01
53679C06525M50K28m37o52j85L06L14N4j53l86p00q08n74k98j57P4M54N63K04
53660C04822j58o7K46L22P6m12j151j781j537l22P72Q23M06O60J468J720J128
53643C07015O21P91J126J108J087J493J953J893J549J675K490L460M056M186L963
$$ plain form
53628 338466 341964 344958 347633 350113 352137 353254 353426 353228 353294 353718 354300 355292 357436 361080 365606 370064
53612 370064 374081 377725 380737 382586 383463 384640 387394 391744 396499 400413 403164 405328 407674 410486
53598 410486 413442 416030 417962 419167 419642 419565 419361 419229 418669 416990 414395 412106 411122 411107 410826 409419 407031
53581 407031 404393 402112 400329 398812 397331 395947 394868 394060 393243 392254 391113 389716 387936 386157 385119
53566 385119 384863 384326 382562 380027 378026 377048 376441 375634 374883 374564 374482 374356 374509 375502 377340 379464 381326
53549 381326 382578 382932 382363 381417 380816 380756 381001 381661 383313 386165 389636 393084 396488 400009 403328 406062
53533 406062 408662 412146 416897 422279 427660 433314 440011 448075 457147 466629 476143 485764 496045 507622
53519 507622 520556 534221 547982 561756 575813 590346 605509 621573 638651 656463 674648
$$ packed form
53628C38466L498K994K675K480K024J117J72j98O6M24N82R92K144L644M526M458
53612C70064M017L644L012J849Q77J177K754M350M755L914K751K164K346K812
53598D10486K956K588J932J205M75p7k04j32n60j679k595k289r84j5k81j407k388
53581D07031k638k281j783j517j481j384j079q08q17r89j141j397j780j779j038
53566C85119k56n37j764k535k001r78o07q07p51l19q2j26J53R93J838K124J862
53549C81326J252L54n69r46o01o0K45O60J652K852L471L448L404L521L319K734
53533D06062K600L484M751N382N381N654O697Q064R072R482R514R621J0281J1577
53519E07622J2934J3665J3761J3774J4057J4533J5163J6064J7078J7812J8185
$$ plain form
53508 674648 693193 712280 731904 751878 771992 791878 811063 829549 848131 867622 887858
53497 887858 907896 926995 944984 961848 977636 992832 1008323 1024806 1042425 1060822 1079179
53486 1079179 1096480 1112376 1127688 1143481 1159724 1175623 1191131 1207131 1223922 1240474 1255595
53475 1255595 1269076 1281193 1291936 1301332 1309780 1317249 1322710 1325229 1325214 1323697 1320651 1315016 1306324 1295451
53461 1295451 1283662 1271608 1259444 1247199 1234733 1221801 1208399 1194668 1180340 1164775 1147802
53450 1147802 1130165 1112874 1096359 1080437 1064752 1049005 1032977 1016673 1000339 984266 968764
53439 968764 954430 942118 932318 924697 918559 913644 910177 908177 907105 906404 906165 906918 908828 911402
53425 911402 914203 917574 922346 928853 936686 945489 955622 967691 981696 997024 1013144 1029885 1047142
$$ packed form
53508F74648J8545J9087J9624J9974K0114J9886J9185J8486J8582J9491K0236
53497H87858K0038J9099J7989J6864J5788J5196J5491J6483J7619J8397J8357
53486A079179J7301J5896J5312J5793J6243J5899J5508J6000J6791J6552J5121
53475A255595J3481J2117J0743R396Q448P469N461K519j5j517l046n635q692j0873
53461A295451j1789j2054j2164j2245j2466j2932j3402j3731j4328j5565j6973
53450A147802j7637j7291j6515j5922j5685j5747j6028j6304j6334j6073j5502
53439I68764j4334j2312r800p621o138m915l467k000j072p01k39P53J910K574
53425I11402K801L371M772O507P833Q803J0133J2069J4005J5328J6120J6741J7257
$$ plain form
53412 1047142 1064804 1083070 1102406 1122971 1144399 1166369 1189098 1213015 1238252 1264831 1293110
53401 1293110 1323594 1356320 1390891 1427157 1465486 1506184 1549009 1593496 1639421 1686582 1734345
53390 1734345 1781946 1829255 1876807 1924944 1973335 2021498 2069391 2117058 2163892 2208699 2250548
53379 2250548 2289356 2325691 2360216 2393207 2424229 2452183 2475927 2494917 2509235 2519078 2524554 2525822
53367 2525822 2522965 2515576 2502831 2484227 2460029 2430883 2397293 2359711 2318855 2275626 2230795 2185008
53355 2185008 2138934 2093163 2048007 2003558 1959805 1916656 1874073 1832462 1792656 1755143 1719392
53344 1719392 1684256 1648994 1613604 1578302 1543149 1508334 1474446 1442215 1412084 1384156 1358394
53333 1358394 1334728 1313084 1293405 1275613 1259535 1244957 1231821 1220196 1209984 1200663 1191352 1181186
$$ packed form
53412A047142J7662J8266J9336K0565K1428K1970K2729K3917K5237K6579K8279
53401A293110L0484L2726L4571L6266L8329M0698M2825M4487M5925M7161M7763
53390A734345M7601M7309M7552M8137M8391M8163M7893M7667M6834M4807M1849
53379B250548L8808L6335L4525L2991L1022K7954K3744J8990J4318R843N476J268
53367B525822k857p389j2745j8604k4198k9146l3590l7582m0856m3229m4831m5787
53355B185008m6074m5771m5156m4449m3753m3149m2583m1611l9806l7513l5751
53344A719392l5136l5262l5390l5302l5153l4815l3888l2231l0131k7928k5762
53333A358394k3666k1644j9679j7792j6078j4578j3136j1625j0212r321r311j0166
$$ plain form
53321 1181186 1169756 1157377 1144891 1132990 1121660 1110423 1099084 1088047 1077909 1069044 1061660 1055922
53309 1055922 1051737 1048673 1046412 1045125 1045053 1045874 1047049 1048794 1052154 1057808 1065303 1073914 1083876 1096097
53295 1096097 1110744 1126777 1143104 1159717 1177441 1196920 1218184 1240859 1264320 1287676 1310007
53284 1310007 1330776 1349996 1368015 1385179 1401520 1416573 1429583 1440036 1447948 1453604 1457193 1458722
53272 1458722 1458026 1454746 1448629 1440057 1429977 1418954 1406599 1392214 1375709 1357464 1337617 1316079
53260 1316079 1293102 1269195 1244575 1219302 1193908 1169193 1145196 1120996 1095789 1069750 1043710
53249 1043710 1018540 994988 973417 953284 933321 912682 891540 870344 849059 827676 806980
53238 806980 788014 770942 754971 739363 723997 708952 694122 679529 665687 653343 642847
$$ packed form
53321A181186j1430j2379j2486j1901j1330j1237j1339j1037j0138q865p384n738
53309A055922m185l064k261j287p2Q21J175J745L360N654P495Q611R962J2221
53295A096097J4647J6033J6327J6613J7724J9479K1264K2675K3461K3356K2331
53284A310007K0769J9220J8019J7164J6341J5053J3010J0453P912N656L589J529
53272A458722o96l280o117q572j0080j1023j2355j4385j6505j8245j9847k1538
53260A316079k2977k3907k4620k5273k5394k4715k3997k4200k5207k6039k6040
53249A043710k5170k3552k1571k0133j9963k0639k1142k1196k1285k1383k0696
53238H06980j8966j7072j5971j5608j5366j5045j4830j4593j3842j2344j0496
$$ plain form
53227 642847 633911 626022 619043 613207 608415 603741 597978 590624 582021 572621 562580 552068 541367
53214 541367 530487 519234 507910 497348 487901 478954 469926 461247 453755 447427 441358 434781 427619
53201 427619 420160 412723 405497 398364 390929 383046 375048 367245 359581 352182 345691 340443 335731 330625
53187 330625 325194 320154 315596 310980 306254 301980 298303 294736 291175 288204 286074 284185 282039 279981
53173 279981 278541 277652 276946 276279 275413 273743 270998 267861 265311 263583 262242 261007 259919 258934 257930
53158 257930 257054 256558 256358 256238 256436 257427 258984 260000 259594 258038 256284 254767 253139 251118 249142 247914
53142 247914 247552 247526 247437 247488 248032 248933 249676 250036 250302 250846 251695 252637 253546 254500 255636 256967 258286 259315
53124 259315 259995 260615 261523 262794 264302 265990 267893 269974 272161 274439 276727 278739 280197 281125 281657
$$ packed form
53227F42847q936p889o979n836m792m674n763p354q603r400j0041j0512j0701
53214E41367j0880j1253j1324j0562r447q947r028q679p492o328o069o577p162
53201D27619p459p437p226p133p435p883p998p803p664p399o491n248m712n106
53187C30625n431n040m558m616m726m274l677l567l561k971k130j889k146k058
53173B79981j440q89p06o67q66j670k745l137k550j728j341j235j088r85j004
53158B57930q76m96k00j20J98R91J557J016m06j556j754j517j628k021j976j228
53142B47914l62k6q9N1N44R01P43L60K66N44Q49R42R09R54J136J331J319J029
53124B59315O80O20R08J271J508J688J903K081K187K278K288K012J458R28N32
$$ plain form
53109 281657 281675 280932 279505 277761 275951 274179 272718 271797 271021 269526 267014 264221 262045 260500 258905
53094 258905 256906 254924 253615 253159 253111 252829 252072 251214 250791 250870 251005 250794 250215 249404 248417 247429 246876 247118
53076 247118 248074 249346 250548 251371 251499 250813 249669 248746 248456 248515 248148 246819 244790 242898 241671 240800 239678
53059 239678 238282 237148 236531 236082 235521 235251 235917 237565 239555 241253 242609 244057 246009 248431 250793
53044 250793 252417 252910 252338 251079 249647 248509 247806 247255 246518 245670 245104 244976 245013 244969 245016 245535 246714 248422
53026 248422 250369 252302 254143 255886 257257 257714 257086 256055 255554 255654 255590 254960 254350 254528 255451 256426 256935
53009 256935 256991 256905 257034 257609 258628 259927 261376 262785 263737 263923 263693 263757 264230 264512 264325 264218 264660 265266
52991 265266 265487 265566 266114 267104 267997 268684 269644 271267 273584 276533 279842 282793 284756 285987 287274 288773
$$ packed form
53109B81657J8p43j427j744j810j772j461r21p76j495k512k793k176j545j595
53094B58905j999j982j309m56m8k82p57q58m23P9J35k11n79q11r87r88n53K42
53076B47118R56J272J202Q23J28o86j144r23k90N9l67j329k029j892j227q71j122
53059B39678j396j134o17m49n61k70O66J648J990J698J356J448J952K422K362
53044B50793J624M93n72j259j432j138p03n51p37q48n66j28L7m4M7N19J179J708
53026B48422J947J933J841J743J371M57o28j031n01J00o4o30o10J78R23R75N09
53009B56935N6q6J29N75J019J299J449J409R52J86k30O4M73K82j87j07M42O06
52991B65266K21P9N48R90Q93O87R60J623K317K949L309K951J963J231J287J499
$$ plain form
52975 288773 289890 290400 290917 291901 292891 293199 292894 292591 292579 292713 292998 293702 294822 295778 295838 294752 292962 291274
52957 291274 290249 289810 289385 288452 286946 285219 283735 282727 281930 280663 278498 275959 274211 273817 274076 273922
52941 273922 273204 272652 272648 272660 272115 271286 270886 271033 271183 271052 271058 271675 272752 273842 274889 276170 277706 279149
52923 279149 280238 281031 281609 281927 282039 282160 282316 282188 281497 280364 279127 277997 277027 276247 275602 274899 273989
52906 273989 272938 271918 271030 270328 269787 269139 267975 266282 264692 263935 264165 265069 266451 268313 270403 272111
52890 272111 273030 273433 273939 274756 275414 275359 274675 274056 273966 274106 273941 273566 273599 274257 275057 275588 276116 277093 278516
52871 278516 280160 282162 284848 288118 291438 294317 296482 297690 297823 297117 295926 294297 292161 289857 287962
52856 287962 286493 284724 282022 278563 275042 271922 269182 266558 263807 260798 257596 254498 251903 250103
$$ packed form
52975B88773J117N10N17R84R90L08l05l03j2J34K85P04J120R56O0j086j790j688
52957B91274j025m39m25r33j506j727j484j008p97j267k165k539j748l94K59j54
52941B73922p18n52mJ2n45q29m00J47J50j31OO17J077J090J047J281J536J443
52923B79149J089P93N78L18J12J21J56j28o91j133j237j130r70p80o45p03r10
52906B73989j051j020q88p02n41o48j164j693j590p57K30R04J382J862K090J708
52890B72111R19M03N06Q17O58n5o84o19r0J40j65l75L3O58Q00N31N28R77J423
52871B78516J644K002K686L270L320K879K165J208J33p06j191j629k136k304j895
52856B87962j469j769k702l459l521l120k740k624k751l009l202l098k595j800
$$ plain form
52842 250103 249069 248367 247427 246089 244837 244311 244624 245325 245997 246627 247337 247990 248291 248180 248026 248324 249148 249860
52824 249860 249578 248042 245976 244475 244109 244705 245761 246867 247887 249035 250689 252898 255157 256846 257725
52809 257725 257770 256778 254581 251576 248586 246140 244190 242535 241108 239850 238692 237792 237458 237733 238369 239246
52793 239246 240424 241630 242163 241645 240559 239751 239580 239843 240299 240902 241601 242300 243084 244222 245821 247541 248788
52776 248788 249193 248901 248434 248308 248764 249732 250825 251349 250650 248730 246391 244494 243122 241724 240043 238587
52760 238587 238112 238873 240449 242155 243590 244880 246382 248090 249520 250400 251201 252626 254726 256971 259090
52745 259090 261312 263775 266233 268440 270295 271493 271627 270952 270513 271002 271910 272297 272131 272310 273429 274997
52729 274997 275974 275724 274380 272458 270315 268018 265691 263803 262791 262490 262315 262056 262020 262287 262375 261952 261384
$$ packed form
52842B50103j034p02r40j338j252n26L13P01O72O30P10O53L01j11j54K98Q24P12
52824B49860k82j536k066j501l66N96J056J106J020J148J654K209K259J689Q79
52809B57725M5r92k197l005k990k446j950j655j427j258j158r00l34K75O36Q77
52793B39246J178J206N33n18j086q08j71K63M56O03O99O99P84J138J599J720J247
52776B48788M05k92m67j26M56R68J093N24o99j920k339j897j372j398j681j456
52760B38587m75P61J576J706J435J290J502J708J430Q80Q01J425K100K245K119
52745B59090K222K463K458K207J855J198J34o75m39M89R08L87j66J79J119J568
52729B74997R77k50j344j922k143k297k327j888j012l01j75k59l6K67Q8m23n68
$$ plain form
52712 261384 261162 261256 261510 262242 263743 265469 266485 266639 266626 266929 267425 268120 269394 271118 272247 271896 270479
52695 270479 269211 268633 268156 267046 265416 264131 263948 264868 266196 267134 267333 266913 266074 264894 263503 262240
52679 262240 261427 261106 261080 261129 261155 261253 261696 262597 263494 263598 262783 262077 262695 264604 266499 267276 267138 267036 267468
52660 267468 268267 269366 271183 274098 277853 281678 284872 287099 288270 288385 287604 286353 285207 284529 284187
52645 284187 283703 282777 281651 280844 280586 280626 280571 280219 279547 278568 277369 276207 275468 275524 276578 278443 280444 281753
52627 281753 282035 281683 281320 281152 280920 280334 279407 278487 278021 278122 278235 277505 275701 273568 271993 271093 270465 270022
52609 270022 270003 270285 270380 270248 270495 271513 272944 274299 275600 276997 278147 278555 278292 277878 277544 277109 276538
52592 276538 276144 276157 276520 277236 278518 280367 282313 283849 284935 285788 286381 286546 286542 287062 288419 290020 291013
$$ packed form
52712B61384k22R4K54P32J501J726J016J54j3L03M96O95J274J724J129l51j417
52695B70479j268n78m77j110j630j285j83R20J328R38J99m20q39j180j391j263
52679B62240q13l21k6M9K6R8M43R01Q97J04q15p06O18J909J895P77j38j02M32
52660B67468P99J099J817K915L755L825L194K227J171J15p81j251j146o78l42
52645B84187m84r26j126q07k58M0n5l52o72r79j199j162p39N6J054J865K001J309
52627B81753K82l52l63j68k32n86r27r20m66J01J13p30j804k133j575r00o28m43
52609B70022j9K82R5j32K47J018J431J355J301J397J150M08k63m14l34m35n71
52592B76538l94J3L63P16J282J849J946J536J086Q53N93J65mN20J357J601R93
$$ plain form
52575 291013 291303 291495 291796 291545 290194 288379 287365 287448 287525 286464 284435 282510 281255 280244 278878 277242
52559 277242 276009 275711 276280 277114 277496 277061 276087 275317 275336 275968 276392 276004 275149 274766 275216 275819 275783 275294 275167
52540 275167 275612 276008 275981 275960 276288 276420 275669 274377 273626 273905 274779 275814 277098 278611 279872 280655 281551 283231
52522 283231 285446 287323 288484 289293 290086 290796 291453 292538 294445 296920 299423 301819 304419 307465 310859
52507 310859 314271 317181 318955 319213 318199 316449 314094 310871 306872 302828 299417 296656 294252 292232
52493 292232 290783 289690 288389 286630 284716 283088 281999 281591 281950 282889 283898 284487 284557 284386 284399 284879 285792
52476 285792 286842 287810 288736 289680 290477 291018 291670 293081 295520 298651 302002 305363 308768 312329 316070 319681
52460 319681 322460 323838 323901 322999 320960 317307 312347 307325 303128 299418 295558 291911 289518 288717 288739 288662
$$ packed form
52575B91013K90J92L01k51j351j815j014Q3P7j061k029j925j255j011j366j636
52559B77242j233k98N69Q34L82m35r74p70J9O32M24l88q55l83M50O03l6m89j27
52540B75167M45L96k7k1L28J32p51j292p51K79Q74J035J284J513J261P83Q96J680
52522B83231K215J877J161Q09P93P10O57J085J907K475K503K396K600L046L394
52507C10859L412K910J774K58j014j750k355l223l999m044l411k761k404k020
52493B92232j449j093j301j759j914j628j089m08L59R39J009N89P0j71J3M80R13
52476B85792J050R68R26R44P97N41O52J411K439L131L351L361L405L561L741L611
52460C19681K779J378O3r02k039l653m960n022m197l710l860l647k393q01K2p7
$$ plain form
52444 288662 288171 287331 286144 284611 282962 281590 280842 280881 281486 281959 281517 280020 278267 277362 277746 278846 279656
52427 279656 279631 279066 278674 278878 279512 280105 280333 280290 280443 281339 283161 285619 288377 291506 295234 299365 303409
52410 303409 307384 312133 318567 326795 336092 345448 353963 361000 366144 368942 368662 364823 358144 350528
52396 350528 343684 337967 332797 327790 323039 318668 314710 311318 308608 306388 304482 303191 302963 303617 304407
52381 304407 304895 305333 306164 307545 309434 311754 314350 317105 320237 324203 329193 334864 340586 345735 349852
52366 349852 352832 354933 356316 356659 355610 353538 351366 349635 348218 346981 346181 345989 346148 346414 346942 347923
52350 347923 349165 350324 351286 352057 352654 353383 354874 357382 360309 362847 364896 366966 369353 371977 374947
52335 374947 378723 383550 389227 395554 402620 410387 418409 426410 434949 445062 457223 470928 485357
$$ packed form
52444B88662m91q40j187j533j649j372p48L9O05M73m42j497j753r05L84J100Q10
52427B79656k5n65l92K04O34N93K28m3J53Q96J822K458K758L129L728M131M044
52410C03409L975M749O434Q228R297R356Q515P037N144K798k80l839o679p616
52396C50528o844n717n170n007m751m371l958l392k710k220j906j291k28O54P90
52381C04407M88M38Q31J381J889K320K596K755L132L966M990N671N722N149M117
52366C49852K980K101J383L43j049k072k172j731j417j237q00j92J59K66N28R81
52350C47923J242J159R62P71N97P29J491K508K927K538K049K070K387K624K970
52335C74947L776M827N677O327P066P767Q022Q001Q539J0113J2161J3705J4429
$$ plain form
52322 485357 500086 514977 529683 543645 556626 568994 581406 594301 607721 621486 635513
52311 635513 650038 665554 682330 699985 717772 735388 753296 772056 791559 811169 830447
52300 830447 849340 867688 884937 900517 914264 926244 936298 943960 948841 951005 950927 949104 945801
52287 945801 941262 936065 931016 926524 922253 917578 912266 906598 901003 895861 891543 888311 886155 884910
52273 884910 884512 884931 885991 887528 889657 892547 895971 899530 903421 908565 915752 924881 935228 946228
52259 946228 957864 970554 984926 1001467 1020017 1039640 1059184 1077903 1095452 1111450 1125340
52248 1125340 1136653 1145199 1150987 1154107 1154747 1153207 1149868 1145230 1139864 1134074 1127549 1119585 1109849 1098867
52234 1098867 1087527 1076197 1064635 1052790 1041258 1030635 1020729 1010842 1000697 990599 980745 971032
$$ packed form
52322D85357J4729J4891J4706J3962J2981J2368J2412J2895J3420J3765J4027
52311F35513J4525J5516J6776J7655J7787J7616J7908J8760J9503J9610J9278
52300H30447J8893J8348J7249J5580J3747J1980J0054P662M881K164p8j823l303
52287I45801m539n197n049m492m271m675n312n668n595n142m318l232k156j245
52273H84910l98M19J060J537K129K890L424L559L891N144P187R129J0347J1000
52259I46228J1636J2690J4372J6541J8550J9623J9544J8719J7549J5998J3890
52248A125340J1313Q546N788L120O40j540l339m638n366n790o525p964r736j0982
52234A098867j1340j1330j1562j1845j1532j0623r906r887j0145j0098r854r713
$$ plain form
52222 971032 961674 953383 946585 940905 935788 931179 927181 923593 920422 918422 918331 919736 921409 922647 923558
52207 923558 924197 924407 924618 925864 928593 932192 936066 940484 945937 952363 959533 967596 976540 985581 993818
52192 993818 1001185 1008101 1014414 1019353 1022316 1023058 1021275 1016825 1010449 1003527 996889 990298 983268 975824
52178 975824 968231 960510 952710 945384 939297 934731 931329 928536 926008 923685 921749 920570 920454 921364 922940
52163 922940 924833 926953 929369 932023 934705 937275 939744 942001 943585 943965 943133 941842 941184 941917 944047
52148 944047 946831 949259 950840 952063 953803 956132 957951 958001 956134 953403 951102 949948 950006 951029 952774
52133 952774 955168 958327 962487 968003 975388 985069 996916 1010211 1024354 1039495 1056246 1074847 1094883
52120 1094883 1115745 1137077 1158804 1181017 1203849 1227211 1250575 1273305 1295259 1316779 1337906
$$ packed form
52222I71032r358q291o798n680n117m609l998l588l171k000r1J405J673J238R11
52207I23558O39K10K11J246K729L599L874M418N453O426P170Q063Q944R041Q237
52192I93818P367O916O313M939K963P42j783m450o376o922o638o591p030p444
52178I75824p593p721p800p326o087m566l402k793k528k323j936j179j16R10J576
52163I22940J893K120K416K654K682K570K469K257J584L80q32j291o58P33K130
52148I44047K784K428J581J223J740K329J819N0j867k731k301j154N8J023J745
52133I52774K394L159M160N516P385R681J1847J3295J4143J5141J6751J8601K0036
52120A094883K0862K1332K1727K2213K2832K3362K3364K2730K1954K1520K1127
$$ plain form
52109 1337906 1357957 1376201 1392814 1408777 1424810 1440734 1455958 1470229 1483565 1495536 1504983
52098 1504983 1510582 1511665 1508548 1502223 1493722 1483554 1471662 1457974 1442952 1427379 1411700 1395896
52086 1395896 1380055 1364601 1349792 1335450 1321571 1308809 1297834 1288472 1280041 1272302 1265552 1259955
52074 1259955 1255427 1252125 1250307 1249689 1249689 1250488 1253086 1257992 1264604 1272263 1281290 1292393 1305608 1320417
$$ packed form
52109A337906K0051J8244J6613J5963J6033J5924J5224J4271J3336J1971R447
52098A504983N599J083l117o325q501j0168j1892j3688j5022j5573j5679j5804
52086A395896j5841j5454j4809j4342j3879j2762j0975r362q431p739o750n597
52074A259955m528l302j818o18%P99K598M906O612P659R027J1103J3215J4809
$$ [...]
##END NTUPLES=NMR SPECTRUM
##END=
