##TITLE=AC1436_CPOAH13245_7790681_jLSF8JDTXy
##JCAMPDX= 6.0         $$ Bruker NMR JCAMP-DX V2.0
##DATA TYPE= NMR SPECTRUM
##DATA CLASS= NTUPLES
##ORIGIN= BRUKER
##OWNER= Administrator
$$ 1.72 TOPSPIN		Version 2.1
$$ 2013-04-16 19:42:22.041 -0700  Administrator@X
$$ Compression mode = diff/dup
##.OBSERVE FREQUENCY= 400.02188249412
##.OBSERVE NUCLEUS= ^1H
##.ACQUISITION MODE= SIMULTANEOUS (DQD)
##.ACQUISITION SCHEME= undefined
##.AVERAGES= 8
##.DIGITISER RES= 22
##SPECTROMETER/DATA SYSTEM= spect
##.PULSE SEQUENCE= zg30
##.SOLVENT NAME= COFFEE_meoh
##.SHIFT REFERENCE= INTERNAL, COFFEE_meoh, 1, 14.98509
##AUDIT TRAIL= $$ (NUMBER, WHEN, WHO, WHERE, PROCESS, VERSION, WHAT)
$$ ##TITLE= Audit trail, TOPSPIN		Version 2.1
$$ ##JCAMPDX= 5.01
$$ ##ORIGIN= Bruker BioSpin GmbH
$$ ##OWNER= Administrator
$$ $$ E:\/data/COFFEE/nmr/AC1436_CPOAH13245_7790681_jLSF8JDTXy/10/pdata/1/auditp.txt
$$ ##AUDIT TRAIL=  $$ (NUMBER, WHEN, WHO, WHERE, PROCESS, VERSION, WHAT)
(   1,<2013-04-16 19:42:15.041 -0700>,<Administrator>,<X>,<go>,<TOPSPIN 2.1>,
      <created by zg
	started at 2013-04-16 19:41:08.744 -0700,
	POWCHK enabled, PULCHK disabled,
       configuration hash MD5:
       33 CF 6A 21 5C D3 B9 40 6C 15 AA 8D 27 A2 4F 13
       data hash MD5: 64K
       3B 97 56 B7 3F 5E 37 63 C1 28 3B B9 DE 93 30 93>)
(   2,<2013-04-16 19:42:18.041 -0700>,<Administrator>,<X>,<proc1d>,<TOPSPIN 2.1>,
      <Start of raw data processing
       efp LB = 0 FT_mod = 6 PKNL = 1 PHC0 = 0 PHC1 = 0 SI = 32K 
       data hash MD5: 32K
       21 4B B8 E3 1D FC 47 9C 24 AE 01 D4 6B 75 0C 86>)
(   3,<2013-04-16 19:42:18.416 -0700>,<Administrator>,<X>,<proc1d>,<TOPSPIN 2.1>,
      <pk PHC0 = 98.82751 PHC1 = 0 
       data hash MD5: 32K
       5C B7 43 D2 3B 98 C2 80 40 67 38 0B D0 02 CC 11>)
(   4,<2013-04-16 19:42:18.619 -0700>,<Administrator>,<X>,<proc1d>,<TOPSPIN 2.1>,
      <abs ABSG = 1 
       data hash MD5: 32K
       6F 4B 61 18 EA C0 71 7F 33 AF F4 60 A7 F0 F4 90>)
(   5,<2013-04-16 19:42:18.682 -0700>,<Administrator>,<X>,<proc1d>,<TOPSPIN 2.1>,
      <abs ABSG = 2 
       data hash MD5: 32K
       63 C6 B0 1A 47 7A 73 14 D1 09 D5 48 3E 87 CD 11>)
(   6,<2013-04-16 19:42:18.744 -0700>,<Administrator>,<X>,<proc1d>,<TOPSPIN 2.1>,
      <abs ABSG = 3 
       data hash MD5: 32K
       92 27 BF C1 6F C1 3D 7A 86 82 A0 2D DD 06 36 C6>)
(   7,<2013-04-16 19:42:18.807 -0700>,<Administrator>,<X>,<proc1d>,<TOPSPIN 2.1>,
      <abs ABSG = 4 
       data hash MD5: 32K
       D3 B9 D4 DA E0 0A 2F 2B EA D0 01 13 3F F2 38 88>)
(   8,<2013-04-16 19:42:18.901 -0700>,<Administrator>,<X>,<proc1d>,<TOPSPIN 2.1>,
      <abs ABSG = 5 
       data hash MD5: 32K
       DA 3F 3B AE 50 A7 6A 28 2C E0 60 01 9D 25 05 3F>)
$$ ##END=
$$ 
$$ $$ hash MD5
$$ $$ 64 54 0F 1D 5F AD 81 03 A4 7B 3D A1 B6 6F B7 F8
##$RELAX= 
##$RELAX= 
##$RELAX= 
##$RELAX= 
##$RELAX= 
##$RELAX= 
##$RELAX= 
$$ Bruker specific parameters
$$ --------------------------
##$DU= <E:\>
##$EXPNO= 10
##$NAME= <AC1436_CPOAH13245_7790681_jLSF8JDTXy>
$$ [...]
150 150 150 150 150 150 150 150
##$TP07= 0
##$TPNAME0= <>
##$TPNAME1= <>
##$TPNAME2= <>
##$TPNAME3= <>
##$TPNAME4= <>
##$TPNAME5= <>
##$TPNAME6= <>
##$TPNAME7= <>
##$TPOAL= (0..7)
0.5 0.5 0.5 0.5 0.5 0.5 0.5 0.5
##$TPOFFS= (0..7)
0 0 0 0 0 0 0 0
##$TUNHIN= 0
##$TUNHOUT= 0
##$TUNXOUT= 0
##$USERA1= <user>
##$USERA2= <user>
##$USERA3= <user>
##$USERA4= <user>
##$USERA5= <user>
##$V9= 5
##$VALIST= <valist>
##$VCLIST= <CCCCCCCCCCCCCCC>
##$VD= 0
##$VDLIST= <DDDDDDDDDDDDDDD>
##$VPLIST= <PPPPPPPPPPPPPPP>
##$VTLIST= <TTTTTTTTTTTTTTT>
##$WBST= 2048
##$WBSW= 25
##$XGAIN= (0..3)
0 0 0 0
##$XL= 0
##$YL= 0
##$YMAX_a= 655976
##$YMIN_a= -559217
##$ZGOPTNS= <>
##$ZL1= 120
##$ZL2= 120
##$ZL3= 120
##$ZL4= 120
##$ABSF1= 14.98509
##$ABSF2= -5.573092
##$ABSG= 5
##$ABSL= 3
##$ALPHA= 0
##$AQORDER= 0
##$ASSFAC= 0
##$ASSFACI= 0
##$ASSFACX= 0
##$ASSWID= 0
##$AUNMP= <proc_prof1d_extract_pilot.lims>
##$AXLEFT= 0
##$AXNAME= <>
##$AXNUC= <1H>
##$AXRIGHT= 0
##$AXTYPE= 0
##$AXUNIT= <>
##$AZFE= 0.1
##$AZFW= 0.1
##$BCFW= 0
##$BC_mod= 0
##$BYTORDP= 0
##$COROFFS= 0
##$CY= 15
##$DATMOD= 1
##$DC= 0
##$DFILT= <>
##$DTYPP= 0
##$F1P= 0
##$F2P= 0
##$FCOR= 0.5
##$FTSIZE= 32768
##$FT_mod= 6
##$GAMMA= 0
##$GB= 0
##$INTBC= 1
##$INTSCL= 1
##$ISEN= 128
##$LB= 0
##$LEV0= 0
##$LPBIN= 0
##$MAXI= 10000
##$MC2= 0
##$MEAN= 0
##$ME_mod= 0
##$MI= 0
##$NCOEF= 0
##$NC_proc= -8
##$NLEV= 6
##$NOISF1= 0
##$NOISF2= 0
##$NSP= 0
##$NTH_PI= 0
##$NZP= 0
##$OFFSET= 14.98509
##$PC= 1
##$PHC0= 98.82751
##$PHC1= 0
##$PH_mod= 1
##$PKNL= yes
##$PPARMOD= 0
##$PPDIAG= 0
##$PPIPTYP= 0
##$PPMPNUM= 2147483647
##$PPRESOL= 1
##$PSCAL= 4
##$PSIGN= 0
##$PYNMP= <proc.py>
##$REVERSE= no
##$SF= 400.02
##$SI= 32768
##$SIGF1= 0
##$SIGF2= 0
##$SINO= 400
##$SIOLD= 32768
##$SPECTYP= <>
##$SREGLST= <1H.CDCl3>
##$SSB= 0
##$STSI= 32768
##$STSR= 0
##$SW_p= 8223.68421052631
##$SYMM= 0
##$S_DEV= 0
##$TDeff= 65536
##$TDoff= 0
##$TI= <>
##$TILT= no
##$TM1= 0
##$TM2= 0
##$TOPLEV= 0
##$USERP1= <user>
##$USERP2= <user>
##$USERP3= <user>
##$USERP4= <user>
##$USERP5= <user>
##$WDW= 1
##$XDIM= 32768
##$YMAX_p= 470608856
##$YMIN_p= -728577
##$CURPLOT= <Network HP LaserJet P1505>
##$CURPRIN= <$Network HP LaserJet P1505>
##$DFORMAT= <normdp>
##$LAYOUT= <+/1D_H.xwp>
##$LFORMAT= <normlp>
##$PFORMAT= <normpl>
##$SURQMSG= 1
$$ End of Bruker specific parameters
$$ ---------------------------------
##NTUPLES= NMR SPECTRUM
##VAR_NAME=  FREQUENCY,     SPECTRUM/REAL,   SPECTRUM/IMAG
##SYMBOL=    X,             R,               I
##VAR_TYPE=  INDEPENDENT,   DEPENDENT,       DEPENDENT
##VAR_FORM=  AFFN,          ASDF,            ASDF
##VAR_DIM=   32768,         32768,           32768
##UNITS=     HZ,            ARBITRARY UNITS, ARBITRARY UNITS
##FACTOR=    0.250966925370066, 1,           1
##FIRST=     8223.43324360094, 59858,        -63515
##LAST=      0,             -51204,          -47475
##MIN=       0,             -728577,         0
##MAX=       8223.43324360094, 470608856,    0
$$ Real data points
##PAGE= N=1
##DATA TABLE= (X++(R..R)), XYDATA
$$ [...]
19526a52747I0396g4205b6239k92321a49660n6501A07513k6420J8832a67391I9375
19514a05364m984o3008a0633E5263L75246a08035j02213A05907b9489A09189c8495
19502a23555j12067c5108l52416J51465r6620C4868c6147k1858B94967D9346m255
19491D5091h3788j16985N5716q1951k5409A67784g6985k7718A14232B7179c6184
19479H6768a62121j59387A8840c41593h4745r8476D9220j9017a94888N7347L696
19468a33845a0160C0249K32021h5678E0768J67626R552i0136L2546B84529A5638
19456B07078c03058g9390K6642l27047a28361I5303a82082p1206g7096k43245
19446c20341c5377A18764e1250k01557I6423d04956J43960c3442n7797L1572J3004
$$ plain form
19526 -152747 90396 -74205 -26239 -318560 -149660 -206161 107513 81093 99925 -167391 99375
19514 -105364 -110348 -173356 -10633 55263 430509 -108035 -210248 105907 -29489 109189 -38495
19502 -123555 -235622 -35108 -387524 -236059 -332679 34868 -36147 -58005 294967 49346 45091
19491 45091 -83788 -200773 -145057 -227008 -252417 167784 -76985 -104703 114232 27179 -36184
19479 86768 -162121 -321508 18840 -341593 -84745 -183221 49220 30203 -194888 -137541 -133845
19468 -133845 -10160 30249 262270 -85678 50768 218394 227946 -90136 -57590 284529 15638
19456 207078 -303058 -79390 -52748 -379795 -128361 95303 -182082 -253288 -77096 -320341
19446 -320341 -35377 118764 -51250 -252807 96423 -404956 -260996 -33442 -91239 -59667 -46663
19435d6663m05711B8470L6291N7465c02912J31848A04012e6211B48232a53669
19424b1608B7068a95055A42310e9891D0306i9246L0996n4445B51431b8360k06339
19413b34699A44111b22367q2057i5131a6578B86560a20244B6935O7088a9679m9829
19402f9508m4716j91384g1081J9783j04608B8009M4285N8959q66c92492G0411
19390A63692b56207M5042H0961K0670c35747J36478l8330h5537A11184K8690M972
19379A44846F3575J28624n3287C7177A015K21377a1641p9027A58911e6041j76511
19368b32552f6318k24593d2939j6268D19219h0791c2926d681n7972p1945l3578
19357a68176f7513j7591j61696C7820c4438j56552I2646J47266a01057j91328
$$ plain form
19435 -46663 -452374 28470 64761 122226 -302912 -171064 104012 -56211 248232 -153669
19424 -21608 27068 -195055 142310 -59891 40306 -99246 -68250 -122695 251431 -28360 -234699
19413 -234699 144111 -222367 -304424 -95131 -16578 286560 -120244 26935 94023 -19679 -69508
19402 -69508 -114224 -305608 -71081 -51298 -155906 28009 72294 131253 130387 -392492 70411
19390 163692 -256207 -211165 80961 101631 -335747 -199269 -237599 -85537 111184 139874 144846
19379 144846 63575 192199 138912 37177 1015 222392 -11641 -90668 158911 -56041 -232552
19368 -232552 -66318 -290911 -42939 -59207 419219 -80791 -32926 -4681 -62653 -134598 -168176
19357 -168176 -67513 -85104 -246800 37820 -34438 -190990 92646 239912 -101057 -292385
19347b92385e7937L927a7753m6638l015k23427R5413J1157J9647Q0630k66898
19336c50884J14354A78320e6745A20562h4005F0528b80639J25901L1161Q253e0652
19324e4021e260H9400c86897B1558a70236f6978r0856H8548b49919f1006q8439
19313a49445A53237J06889A2078a22093A00245f7978j66656k0491A8087P983c2470
19301A9302K4470b44597A25751R673i3721k30305A45183b45464J04657p0838a6612
19289g6468Q20j34136G0190a5313q9544M5170k41382b5926l3577A98108c8829
19277B2568d6283B79601b87668c2385k00791H3432c48139J42831B64890j18503
19267A46387B9074b50421j98897a59574A27517B2009h2362k63603H7902b06140
$$ plain form
19347 -292385 -57937 -54010 -17753 -64391 -67406 -290833 -195420 -184263 -164616 -83986 -350884
19336 -350884 -236530 178320 -56745 120562 -84005 60528 -280639 -154738 -123577 -115324 -50652
19324 -54021 -5260 89400 -386897 21558 -170236 -66978 -157834 88548 -249919 -61006 -149445
19313 -149445 153237 260126 12078 -122093 100245 -67978 -234634 -255125 18087 26070 -32470
19301 19302 43772 -244597 125751 135424 -93721 -324026 145183 -245464 -140807 -211645 -16612
19289 -76468 -75648 -209784 70190 -15313 -104857 -59687 -301069 -25926 -59503 198108 -38829
19277 22568 -46283 279601 -287668 -32385 -233176 83432 -348139 -205308 264890 146387
19267 146387 29074 -250421 -449318 -159574 127517 22009 -82362 -345965 87902 -206140
19256h7707J9700E20a31003k2841D1250c50807B49619b05561d1087p2551o2086
19245a75724M0265N1814k7234f851A02966c54561A71483j3327o4933K8594L6792
19234A58609a08190e128j14850E1544a91988A42919b86757b157j17666b0427l33110
19223c53537f49G0521H852J43678b45894A97186a73707F7601B9622a23882G1235
19211E0022N4026b83599d8141A47845O2953b03421B71696a63382C22686b27377
19200B7841L858c67286A12943a41657d5420C20902r8245a63762G1388a78866n7609
19189b36475M7229c6761j92585A24834d4634p6995j65507J04687k8033J01515
19179a08967k5870j69262A00432i78k32462c5419A47495a88336N4384A21234L63436
$$ plain form
19256 -87707 -68007 520 -131003 -153844 41250 -350807 249619 -205561 -41087 -113638 -175724
19245 -175724 -135459 -83645 -110879 -6851 102966 -354561 171483 158156 93223 121817 158609
19234 158609 -108190 -5128 -119978 51544 -191988 142919 -286757 -2157 -119823 -20427 -353537
19223 -353537 -649 70521 8852 152530 -245894 197186 -173707 67601 29622 -123882 71235
19211 50022 104048 -283599 -48141 147845 210798 -203421 271696 -163382 322686 -227377
19200 27841 31699 -367286 112943 -141657 -45420 320902 222657 -163762 71388 -178866 -236475
19189 -236475 -189246 -36761 -229346 124834 -44634 -121629 -287136 -182449 -210482 -108967
19179 -108967 -134837 -304099 100432 -978 -233440 -35419 147495 -188336 -133952 121234 484670
19168D84670a36371m9488k25861g2856j9836d6070A58891L4144E8813c33362A1554
19156d35838a75569O2353k03017A9694M5750c7224m8075m0876A95135a18029A30003
19144h5733A11928j9176g2085q6904A65350C2622j2814O7179a89926F1650d02214
19132f7267A22762c29750e2846B23524G3617O6569b5128F7360a1543n7725D3739
19120G3907a20089I534a63623a2523I3015a11759L8905A2065J28368B8344K35801
19109B64145a8720A22023a51213A49070J6486q1754J8118b99087e1267n3561p0679
19098a75507F1379b55663L1397b1046r6347l74883c8431l29468A42059J27758
19088B69817a43697l9804j28109F8648b86440g1896l4764K2667E7985L7702K001
$$ plain form
19168 484670 -136371 -185859 -411720 -72856 -92692 -46070 158891 193035 58813 -333362 11554
19156 -435838 -175569 -113216 -316233 19694 65444 -37224 -85299 -126175 195135 -118029 130003
19144 -85733 111928 92752 -72085 -158989 165350 32622 19808 86987 -189926 61650 -402214
19132 -67267 122762 -329750 -52846 223524 73617 140186 -25128 67360 -11543 -69268 43739
19120 73907 -120089 9534 -163623 -12523 93015 -111759 -72854 12065 140433 28344 264145
19109 264145 -18720 122023 -151213 149070 165556 83802 101920 -299087 -51267 -104828 -175507
19098 -175507 61379 -255663 -224266 -21046 -117393 -492276 -38431 -367899 142059 269817
19088 269817 -143697 -183501 -311610 68648 -286440 -71896 -106660 -83993 57985 95687 97688
19077I7688b42532E8968a32656k13125g0752J8872f83m64962B9643b32706j24017
19066c56723C9115J89947B9198f0604k66156i6719J6792m28101b1451k55707q25
19055b77983A23431b45463p5630G4237a04529b9913I1521d3741p5279p524j657
19044a28201F6430M5214O8523B740a2675A24270j4852b14761N9646D5248J72471
19033B17719r0832B0515a31050c769C2228h2384H6538J84681b9457C21286I1366
19021B61363p0285Q073d4794k2235j12424G7750k0616a72705A75670c67220H5040
19009a20289p0556M3800D9663g7078B53827c98603h5936r5404C26899E3041B1965
18997A22801b10033A3397h0347k63833b5424N689A72685G7141a51034B38098a93678
$$ plain form
19077 97688 -242532 58968 -132656 -345781 -70752 -51880 -683 -465645 29643 -232706 -356723
19066 -356723 39115 229062 29198 -60604 -326760 -96719 -79927 -508028 -21451 -277158 -277983
19055 -277983 123431 -245463 -321093 74237 -104529 -29913 91521 -43741 -119020 -126544 -128201
19044 -128201 66430 111644 180167 2740 -12675 124270 109418 -214761 -155115 45248 217719
19033 217719 126887 20515 -131050 -3769 32228 -82384 86538 271219 -29457 321286 91366
19021 261363 191078 199151 -44794 -67029 -179453 77750 57134 -172705 175670 -367220 85040
19009 -120289 -190845 -147045 49663 -77078 253827 -398603 -85936 -181340 326899 53041 21965
18997 122801 -210033 13397 -80347 -344180 -25424 -19735 172685 77141 -151034 238098 -193678
18985c20465B03470b20720R7109e8728m7907k17573B7832a81716g0153A50777
18974D7220R2998c9169j65245l367d1016p417j51933A15702b45968e2975A36247
18962c6858A05886b8799B782J23880h1052A03754J15016h0952l64958A0796M8110
18951E8906m088b54562h7803F5612b18128q5574L7301A06575j6948m0096c2277
18939D856h2691C1705b54192J1047A13243h7579A75688m7266L2384a12296A80507
18927f458F3027d345n4877B87559a10352a3752H8933j4625a58767A0200c0694
18915A13363a02302m6086o6975B3829J51066i2730k4834J4302K1413k0330F7030
18903c4998k10411e7673j03853B2708b06178A68239a552E3403J82377i6281j48620
$$ plain form
18985 -320465 203470 -220720 -123611 -58728 -106635 -324208 27832 -181716 -70153 150777
18974 47220 140218 -39169 -204414 -207781 -41016 -48433 -200366 115702 -245968 -52975 136247
18962 -36858 105886 -28799 2782 126662 -81052 103754 218770 -80952 -445910 10796 58906
18951 58906 54818 -254562 -87803 65612 -218128 -303702 -266401 106575 89627 49531 -32277
18939 4856 -82691 31705 -254192 -243145 113243 -87579 175688 128422 160806 -112296 180507
18927 -6458 63027 -4345 -59222 287559 -110352 -13752 88933 74308 -158767 10200 -30694
18915 113363 -102302 -148388 -215363 23829 174895 -92730 -117564 -103262 -81849 -102179 67030
18903 -34998 -245409 -57673 -161526 22708 -206178 168239 -1552 53403 235780 -96281 -244901
18892b44901I9176b11079K2689M8132D7100n974J03832G0033a33955F401a85494
18880b33353E6591B2923a52610g278A56030M490N7066r9913i3751A7216M6826
18869F4042F529K01520F9567c8993m1850b9155E6502h3337A19732c0933a091j96487
18857a97578A23765D753K10031a92045B1352b39803M2365B47997C3873a21429
18846A9608R6219m8404D234a33188j15370j42725e2740j08962E6071a6844j16205
18835a33049A70314a04610k6896p561f971F2499a83966P359N6260b412l8540j29872
18823a70824j08344H4327f1139o2393Q635B16530c7532A67716J49485a40887a3286
18811I1226L18838I0457L11979a59941A77967i3883j77928A5994a62410L8789
$$ plain form
18892 -244901 99176 -211079 -188390 -140258 47100 41126 144958 70033 -133955 6401 -185494
18880 -233353 56591 22923 -152610 -7278 156030 160520 217586 117673 -93751 17216 64042
18869 64042 6529 208049 69567 -38993 -80843 -29155 56502 -83337 119732 -30933 -1091 -197578
18857 -197578 123765 4753 214784 -192045 21352 -239803 -197438 247997 33873 -121429
18846 19608 115827 67423 4234 -133188 -248558 -391283 -52740 -161702 56071 -16844 -133049
18835 -133049 170314 -104610 -131506 -139067 -6971 62499 -183966 -176607 -120347 -2412 -40952 -170824
18823 -170824 -279168 84327 -61139 -123532 -114897 216530 -37532 167716 317201 -140887 -13286
18811 91226 410064 90457 402436 -159941 177967 -93883 -271811 15994 -162410 -123621
18801a23621A1903h4162E2426B6140O3644b84337a25458k9524k21961a63704A10283
18789a47167f7808h865j6935p8623l8286G6918a8723k7145j55214j79690A59444
18777G6520l939c2814F410a32664p6564m7010F8047c42425I9896f8989j68342
18766b37331I1763R8921c15667a54114m9131N165k47458L2744c8451k0828F2060
18754A54853d3163k93833e5227A78617b41194F1318b31291b3893D3596g8918F9679
18742b4096D7972c1951j25042j74065J30304k77404A02510a3724A383O8559a62358
18730a1746r8478G3308b64487C0112a68258A04909a13346e4007j80886O2797F5664
18718a06996j05561H699J66124a19883N3872l52878G0643J14764a42379j90959
$$ plain form
18801 -123621 11903 -84162 52426 26140 89784 -284337 -125458 -154982 -376943 -163704 110283
18789 -147167 -67808 -8865 -25800 -104423 -142709 76918 -18723 -45868 -201082 -380772 159444
18777 76520 72581 -32814 6410 -132664 -209228 -256238 68047 -342425 99896 -68989 -237331
18766 -237331 91763 190684 -315667 -154114 -203245 -198080 -445538 -412794 -38451 -59279 62060
18754 154853 -43163 -336996 -55227 178617 -241194 61318 -231291 -23893 43596 -78918 69679
18742 -24096 47972 -31951 -156993 -331058 -200754 -478158 102510 -13724 1383 69942 -162358
18730 -11746 -110224 73308 -264487 30112 -168258 104909 -113346 -54007 -234893 -172096 65664
18718 -106996 -212557 8699 174823 -119883 -66011 -418889 70643 185407 -142379 -333338
18708c33338a57576B1157b83498J40676O6041B11703M7869A3504c0446G9930a86681
18696f1828K6986A1450b13039L9146e3643A86909a45627K7114m4750A50405a25010
18684c27114A09034h5930L9264j87355a15523l60642f8654A7533b7599A13074
18673a80057n6011j5974I8029h1952A34457F6947a43095A3850h3983B29198q5923
18662A43275K8527b26807L5763F4388q954a46186B1045J14974Q198l9430A5908
18650b97250B9882c56859q0271O476F2921B499e7787j31801J1046g605j74981
18639a82586M2015j67864J49361H0128h4849k83797B4696K40763H7589a73172
18628b6594J0339n0880B46104b69600A86762a14906B56844f5890l29617a32245
$$ plain form
18708 -333338 -157576 21157 -283498 -142822 -76781 211703 259572 13504 -30446 79930 -186681
18696 -61828 -34842 11450 -213039 -173893 -53643 186909 -145627 -118513 -163263 150405 -125010
18684 -327114 109034 -85930 -46666 -234021 -115523 -476165 -68654 17533 -27599 113074
18673 -180057 -236068 -252042 98029 -81952 134457 66947 -143095 13850 -83983 229198 143275
18662 143275 171802 -226807 -191044 64388 55434 -146186 21045 136019 144217 104787 15908
18650 -297250 29882 -356859 -437130 -430654 62921 2499 -57787 -189588 -178542 -7605 -182586
18639 -182586 -140571 -308435 -159074 80128 -84849 -368646 24696 265459 87589 -173172
18628 -26594 -16255 -67135 246104 -269600 186762 -114906 256844 -65890 -395507 -132245
18617a32760k05976C834i1286j30530c4987J3470A670K06232A3206b27608H836
18605b12622b7786k69896a46509A85009J2634c4373j36302k5803B4080b5847q0282
18594a06129k59459H9453f8391k30829H5205A7117c15148B88502A42920b01322
18583b49988E9121c35884L8129E2372a91338R3495A32019i8437j04190A90413
18572B45159i9907r1793e7134k85124B42438K1731b00110O1816j14463j12321
18562c65078A57662c56062J42647c9733j63825J4189h3776C68461B4033J01946
18552A25979b58496J7065N0203j81905a11205A67869c49843J16078R8247k80675
18542d16193P6926e4864k89640K8436a3379j29776l69288b00931J2805i3215J1546
$$ plain form
18617 -132760 -338736 3834 -91286 -221816 -34987 -21517 1670 207902 13206 -227608 8836
18605 -212622 -27786 -297682 -146509 185009 197643 -34373 -170675 -196478 24080 -25847 -106129
18594 -106129 -365588 89453 -68391 -299220 85205 17117 -315148 288502 142920 -201322
18583 -249988 59121 -335884 -297755 52372 -191338 -97843 132019 -98437 -202627 190413
18572 245159 -99907 -191700 -57134 -342258 242438 264169 -200110 -138294 -252757 -365078
18562 -365078 157662 -356062 -213415 -39733 -203558 -189369 -83776 368461 24033 125979
18552 125979 -258496 -241431 -191228 -373133 -111205 167869 -349843 -233765 -135518 -416193
18542 -416193 -339267 -54864 -344504 -316068 -13379 -143155 -512443 -200931 -188126 -93215 -81669
18531h1669A96471M0023j08303c3489H1222c14104f3020R777C8020K02040a69277
18519A7935c82636f7896a4503A69102b17040k1648N5396K7455A68376a04017b9612
18507A58462a28470M7973A43938n9375l1119e6592J0565k70160a3950j44985K6553
18496a32382M9493A40716i6196B17994M5364F1297d7508I9758g6012A78663E2569
18484a96411i0426A84162a31047I4581D996b02760A26908a98616B5866C614L22536
18473C26150b34286B16859b06512p7944H1668c00579g491l0784q7739B4786i9063
18461a55643F3339K5426a03699o3025E0471c46718g3384k21741E4162c8351F2615
18449B15499b24825C55043g239l45865a43060e4496j64764j72631I8733J406N5011
$$ plain form
18531 -81669 196471 236494 128191 -33489 81222 -314104 -63020 -53243 38020 240060 -169277
18519 17935 -382636 -67896 -14503 169102 -217040 -238688 -183292 -155837 168376 -104017 -29612
18507 158462 -128470 -80497 143938 84563 53444 -56592 -46027 -316187 -13950 -158935 -132382
18496 -132382 -82889 140716 -96196 217994 263358 61297 -47508 99758 -76012 178663 52569
18484 -196411 -90426 184162 -131047 94581 4996 -202760 126908 -198616 25866 3614 326150
18473 326150 -234286 216859 -206512 -284456 81668 -300579 -7491 -38275 -126014 24786 -99063
18461 -155643 63339 88765 -103699 -166724 50471 -346718 -73384 -295125 54162 -38351 62615
18449 215499 -224825 355043 -7239 -353104 -143060 -54496 -219260 -391891 98733 100139 155150
18438A55150d12908a45661j08522L9533A26209d8954A4642a22497I8298L6422
18428A34720D5651N945j5253J16118a61383a3187F0173J98801d82799C35016j36105
18417A98911c71884a56025C7269b85734d5874A15791a78717C3943b03254b1889
18406A09476n0625p712J41110K52746a20694A49526a81838m032m6395R214a10936
18394A74584a6555I2909k6030e1176k6924K357k4402J5824p6647D36886b34412
18382b44875L0042g0512K4383H1083J3156d8787j33520C2901L1937i0372J9566
18371g0806k58298C3769N1303C4784J44547a00558k10484P4782D349h7413A6637
18359c3161j25090p2502D29782c5552A61960d88414A82611H4084g3064j99910
$$ plain form
18438 155150 -412908 -145661 -254183 -214650 126209 -48954 14642 -122497 98298 134720
18428 134720 45651 51596 36343 152461 -161383 -13187 60173 258974 -482799 335016 198911
18417 198911 -371884 -156025 37269 -285734 -45874 115791 -178717 33943 -203254 -21889
18406 109476 58851 51139 192249 444995 -120694 149526 -181838 -185870 -232265 -223051 -110936
18394 174584 -16555 92909 66879 -51176 -78100 -75743 -100145 -84321 -160968 436886 -234412
18382 -244875 -214833 -70512 -46129 81083 94239 -48787 -182307 32901 64838 -90372 -70806
18371 -70806 -329104 33769 85072 34784 179331 -100558 -311042 -236260 4349 -87413 16637
18359 -33161 -158251 -230753 429782 -35552 161960 -488414 182611 84084 -73064 -272974
18349b72974C1537J2656h870k16549B2808b35178B69323b7960j57124A63494b33167
18337H0774P4735B9208J17559J41425I8938K6235a2878l00547b439k9918G8216
18325b25748j03923m6707B23469d15319a64638h0214F6350L9515a70463q1066
18315b51529G1034C3263J31178a66921N1049L7174F0919f0947j64187A3897b22143
18303a90588Q8885C32956a41544C5313g1599j76211D473a76408e3448J0271j17328
18292a60505A08856l7321J14149q0660b23845P5261c176n81781c3017r5461A65469
18280b58135A37885h0210o1628c7569l81980B9296d52990a90946j8726A97936
18269a41968k0712B08208a8675m1164C79796A33441f0535E28a07941G0009K78476
$$ plain form
18349 -272974 31537 44193 -8870 -225419 22808 -235178 269323 -27960 -185084 163494 -233167
18337 80774 155509 29208 146767 288192 98938 125173 -12878 -313425 -2439 -32357 78216
18325 -225748 -329671 -376378 223469 -415319 -164638 -80214 66350 105865 -170463 -251529
18315 -251529 71034 33263 164441 -166921 -115872 -78698 60919 -60947 -225134 13897 -222143
18303 -190588 -101703 332956 -141544 35313 -71599 -247810 4473 -176408 -53448 -43177 -160505
18292 -160505 108856 71535 185684 105024 -223845 -148584 -3176 -584957 -33017 -128478 165469
18280 -258135 137885 -80210 -141838 -37569 -419549 29296 -452990 -190946 -209672 197936
18269 -141968 -162680 208208 -18675 -59839 379796 133441 -60535 528 -107941 70009 348485
18258C48485g9100d907A51426h058j69527j1250b6005C5921R7319a53186H1629
18246G2933a74933d611A9572k918Q5595b78559e0799m5750K682n769A25536f8363
18233a46933D3364K16342E1888J29829g6151E5166a50531P1613J6651j56514l6434
18222b55215a0013G779M9138a35278B45326b54464I1102R0695a2654E7112a3329
18210A8317R5844b568C8887a25095A07728a9570G4853b33760f4350L25D09892
18198c9732a0325F2477b70472h1067o1239B93274a36280F3791a93594R4372j7569
18187a16791H9983a48604A54446b74256A02409j5610a79296e107q832n2689l73246
18176d39874a88311A93888b09045C51745F4891J62319F2940A1969a44371e8231
$$ plain form
18258 348485 -79100 -4907 151426 -8058 -177585 -188835 -26005 35921 133240 -153186 81629
18246 72933 -174933 -4611 19572 16654 102249 -278559 -50799 -96549 -93867 -99636 125536 -68363
18233 -146933 43364 259706 51888 181717 -76151 55166 -150531 -78918 -62267 -218781 -255215
18222 -255215 -10013 7779 56917 -135278 245326 -254464 91102 181797 -12654 57112 -13329
18210 18317 114161 -2568 38887 -125095 107728 -19570 74853 -233760 -64350 -64025 409892
18198 -39732 -10325 62477 -270472 -81067 -142306 293274 -136280 63791 -193594 -99222 -116791
18187 -116791 89983 -148604 154446 -274256 102409 86799 -179296 -5107 -13939 -66628 -439874
18176 -439874 -188311 193888 -209045 351745 64891 227210 62940 11969 -144371 -58231
18165C42606F8692b47451c5726k18044k2511A5470g7202B67252f6486j90180A03779
18153i629D07512g95j43880d1919p8509E5764b24564A8013f7423j37633a3328
18141A01672c2746K816k80693a28417A44998d1511B84832f8749k5619B99548c5943
18129a67080N2845q4336Q6248B1835a55000A0933J55263d6654B68403j19889e1692
18117A88761H2903K78206d54938A40505d6772G1306a35656A12188b7978B79168
18106B33907j03817a29668N2767l5483k65578d2947I6228B8317j3190b33946h5117
18094D8212L21J48353J52916b4771E7794K92740a76595j40262e8505p4569C68886
18082b66432D5455b59327A60076b90487a14599C28619a25474j7874B14906c48605
$$ plain form
18165 342606 68692 -247451 -35726 -253770 -276281 15470 -77202 267252 -66486 -256666 103779
18153 -9629 407512 -795 -144675 -41919 -120428 55764 -224564 18013 -67423 -205056 -13328
18141 101672 -32746 -29930 -310623 -128417 144998 -41511 284832 -68749 -94368 299548 -35943
18129 -167080 -114235 -198571 -112323 21835 -155000 10933 166196 -46654 268403 148514 -51692
18117 188761 82903 361109 -454938 140505 -46772 71306 -135656 112188 -27978 279168
18106 233907 130090 -129668 -76901 -112384 -377962 -42947 96228 28317 15127 -233946 -85117
18094 48212 48533 196886 349802 -24771 57794 350534 -176595 -316857 -58505 -133074 368886
18082 -266432 45455 -259327 160076 -290487 -114599 328619 -125474 -143348 214906 -348605
18071F9136c63232F4377a73832A56145R7318c27190A6159J15147a55660A30202
18060C617g3526B17585a42119q3012B4077f8460B32537A7070a229A28397B3675
18048a30246B08899a06908B64626i1514b3639B49088L3802C2664e3444q0839k67307
18037d01590A77324H2338i6055c5072o2154d7345m4933D9403Q1520c3061k89412
18026c22473J0796N7521c7515k28427H2890e7767a2650D00311a53160C5172f025
18014a69016A842R0205d9914j19003q8775a26084A1477c9181H2459f1109B2058
18002b79965d1612k48164c2191j94533g9235K235j11494N8354n4545A3418a33624
17990C12428b78481j58145B37257d0550C4032J02050g7258A04353d766j32063
$$ plain form
18071 69136 -363232 64377 -173832 156145 253463 -327190 16159 131306 -155660 130202
18060 3617 -73526 217585 -142119 -225131 24077 -68460 232537 17070 -1229 128397 23675
18048 -130246 208899 -106908 264626 -91514 -23639 249088 282890 32664 -53444 -134283 -401590
18037 -401590 177324 82338 -96055 -35072 -97226 -47345 -92278 49403 130923 -33061 -322473
18026 -322473 -311677 -254156 -37515 -265942 82890 -57767 -12650 400311 -153160 35172 -6025
18014 -169016 1842 92047 -49914 -168917 -257692 -126084 11477 -39181 82459 -61109 22058
18002 -279965 -41612 -289776 -32191 -226724 -79235 -77000 -188494 -130140 -184685 13418 -133624
17990 312428 -278481 -436626 237257 -40550 34032 136082 -77258 104353 -4766 -136829
17980a36829F3620J52048Ra68407C02742a69507A88606a50282A00387c58526J57309
17969b01217P7056j419B29023a04669j3561J4j61552c2330A88364D9895b30300
17957C55186H3377J26602N8800g6218a968j17166n531O0610B68262B4097M2150
17946F6247f3131A04018a15855b2967j52616A37813c6188H2463J737J82195q9130
17935A77265F9842E31a253B58064b49439a880k69657A12080C7770d3915j24853
17924a68768A30308J68588a81467H7107k8528d81975a76819q6689O876A90542
17913A1318J55065J3422n4763L975K413g5300E4890M797c1447l7104H7224K6477
17901A13701c2297C58831r7976r2567a26567k33210C9416j8234a05289E0025L6099
$$ plain form
17980 -136829 63620 215668 215677 -168407 302742 -169507 188606 -150282 100387 -358526 -201217
17969 -201217 -124161 -125580 229023 -104669 -118230 -118216 -279768 -32330 188364 49895 -230300
17957 355186 83377 209979 268779 -76218 -1968 -119134 -124665 -64055 268262 24097 66247
17946 66247 -63131 104018 -115855 -22967 -175583 137813 -36188 82463 84200 266395 177265
17935 177265 69842 531 -1253 258064 -249439 -1880 -271537 112080 37770 -43915 -168768
17924 -168768 130308 298896 -181467 87107 58579 -481975 -176819 -263508 -256632 190542
17913 11318 166383 179805 125042 129017 131430 -75300 54890 59687 -31447 -68551 87224 113701
17901 113701 -32297 358831 260855 168288 -126567 -359777 39416 21182 -105289 50025 86124
17890H6124G716f3529j88868k10364F842J58149p2910I944l370a30361n7093F4306
17877A37862J79878a12148C8836b18975m1147A92550d8959B59569a7408k99778
17867c17186e8271I7081e9783A01637a77410n1503m2756N6670O1282C3991a31324
17855A54561b5357j10672j46273J7136J02902j51225e4219B70577f9427K6783
17845d2644I154c2070A49571l1300K40043A10429b37719C65299a70089E0276K24120
17834B74396f7211A5585a88439E5416B3587a50244M5941C02979j20643J43945
17824C26281A09945K8238g7844d105G460a79300e2654j17993j515N0156f0903
17812e6022C9680K32127a02763p0894C9183K03583j11578J18654j16105o0852
$$ plain form
17890 86124 7716 -63529 -252397 -462761 6842 164991 92081 9944 6574 -130361 -187454 64306
17877 137862 317740 -112148 38836 -218975 -260122 192550 -48959 259569 -17408 -317186
17867 -317186 -58271 97081 -59783 101637 -177410 -228913 -271669 -214999 -153717 33991 -131324
17855 154561 -25357 -136029 -282302 -265166 -162264 -313489 -54219 270577 -69427 -42644
17845 -42644 9154 -32070 149571 118271 358314 110429 -237719 365299 -170089 50276 274396
17834 274396 -67211 15585 -188439 55416 23587 -150244 -104303 302979 182336 326281
17824 326281 109945 138183 -77844 -4105 7460 -179300 -52654 -170647 -172162 -122006 -60903
17812 -56022 39680 271807 -102763 -173657 39183 242766 131188 249842 133737 72885
17802G2885L5597K4110K51578I5063f4792A46223J2958K4232O7184p1461g9811
17790b70136h0915B59645m5751f0353k26685B6195b17527e6527E4911a34823l3568
17779a68391A82246a37083A60288j4540j9437b78451m3696a2633k33974E8173
17768b59509Q9512B2468a39388c8B32746M1974a1446j60831B50878b77969B08710
17756b30320c647j74958B3564K43975a66469e7223K2228A92959F6483P8777l269
17745A41991d4871H8038h7434A20300a91583c568H5446R6254f0528A004b55956
17733C31636I1599e38534I1412J02289L3002J11488n6615a29055b5225A63642
17722d41030C028a85779A51919F4952J57595R5139j42340J86373e2347j23337
$$ plain form
17802 72885 108482 132592 384170 95063 -64792 146223 159181 183413 250597 179136 -79811
17790 -270136 -80915 259645 213894 -60353 -287038 26195 -217527 -56527 54911 -134823 -168391
17779 -168391 182246 -137083 160288 145748 126311 -278451 -322147 -12633 -246607 58173
17768 -259509 -169997 22468 -139388 -38 232746 274720 -11446 -172277 250878 -277969 208710
17756 -230320 -3647 -178605 23564 267539 -166469 -57223 -34995 192959 66483 145260 141991
17745 141991 -44871 88038 -87434 120300 -191583 -3568 85446 181700 -60528 1004 -255956
17733 331636 91599 -538534 91412 193701 226703 338191 281576 -129055 -25225 163642
17722 -441030 3028 -185779 151919 64952 222547 317686 175346 361719 -52347 -175684
17712a75684D3634f4144a0099p7860k26854A75935a33853r524I667J65357a67751
17700c3953l24530J65288B34741k4146a4014B41842o1789a20708k93884d0719
17689A222L73190g1321k90963A64546d38623A75097K70666A32579K07647d9785
17678h4670A98895L9267h5563K61A04780k4069B5961a87750I4936a90706A54606
17666I8535R0800f9426J7786b4029l11884B47221f280p7507n1464E8945b06784
17654g5132k20939B08193D0132a37999B62931j7941r5593D9131L41783b41120
17643c90422J31565A25065R4755I0379a65930e843j42630C41337k2968e6659j77584
17632b34243C42886a39460A15268c6078E9476L9370b58611A30345b80272b7925
$$ plain form
17712 -175684 43634 -64144 -10099 -87959 -314813 175935 -133853 -143377 9667 175024 -167751
17700 -33953 -358483 -193195 234741 210595 -14014 241842 180053 -120708 -414592 -40719
17689 1222 374412 -71321 -362284 164546 -438623 175097 445763 132579 340226 -49785
17678 -84670 198895 238162 -85563 -85302 104780 80711 25961 -187750 94936 -190706 154606
17666 98535 189335 -69426 -51640 -24029 -335913 247221 -6280 -83787 -135251 58945 -206784
17654 -75132 -296071 208193 40132 -137999 262931 244990 149397 49131 390914 -241120
17643 -390422 -258857 125065 219820 90379 -165930 -5843 -148473 341337 318369 -56659 -234243
17632 -234243 342886 -139460 115268 -36078 59476 98846 -258611 130345 -280272 -27925
17621B7866K1639a38182A35355m8083f2063B21678k3290l4029i9196A30752k6535
17610A04217h7140H8449J36955J04612b9237C3050Q0549L4120a61776A50019L5378
17599A85397e8651C97025e6726D4845b21149C01907b72672E378e9554A70308E1274
17587B4909b42560F1130B2676L26434A69960K29215A44029N242a84019A61746
17576g8946r0780E352K14723a17030E1273a48631C1819J51985a12552D03173f0696
17564F4544M0864a20262j11537b5292H8410a50189d653j29182H8269a63113L5734
17553a27379A5777L06036A40928c2125o8423k51610g7432N281l508G2415a0722
17541b94943e9785G7918a5437j37496P5733A08517b03651B43726l243b32836Q2686
$$ plain form
17621 27866 49505 -138182 135355 87272 -62063 221678 198388 164359 -99196 130752 104217
17610 104217 -87140 88449 225404 330016 -29237 33050 113599 147719 -161776 150019 185397
17599 185397 -58651 397025 -56726 44845 -221149 301907 -272672 5378 -59554 170308 51274
17587 24909 -242560 61130 22676 349110 169960 399175 144029 149271 -184019 161746
17576 -78946 -169726 5352 220075 -117030 51273 -148631 31819 183804 -112552 403173 -60696
17564 64544 105408 -120262 -231799 -25292 88410 -150189 -4653 -133835 88269 -163113 -127379
17553 -127379 15777 321813 140928 -32125 -100548 -352158 -77432 -72151 -75659 72415 -10722
17541 -294943 -59785 77918 -15437 -152933 -77200 108517 -203651 243726 240483 -232836 -150150
17530a50150B32279b0040A55026J65658j02509m4418A4405b2128j92640P5734
17520a39034G8305b51572I9798k8008J26391J25417j12220M3769c6702n7440n1512
17509a45654I1637J3764b1141B6831K62447f8409C59595j53665j00292K4749O3615
17498A94002h9006a8334j8057B04991C3907J62353h1345c0778j24016B79464i216
17486B32944c54469D65225i9680A17216b03240D46080D124J646c36830A20114
17475A34919l4823d7693B98027Q6747A21017C0070J41808j6784a04590A29639
17464F9962K76090k6000H3118c7767H3067J47823K782J2474J26599A52819J51548
17453C04367A47885b47635G9994l23K02726J73383A70548J65366A48780R5225
$$ plain form
17530 -150150 232279 -20040 155026 320684 218175 173757 14405 -22128 -214768 -139034
17520 -139034 78305 -251572 99798 71790 198181 323598 211378 255147 -36702 -94142 -145654
17509 -145654 91637 105401 -21141 26831 289278 -68409 359595 205930 105638 130387 194002
17498 194002 -89006 -18334 -36391 204991 33907 196260 -81345 -30778 -154794 279464 -9216
17486 232944 -354469 465225 -99680 117216 -203240 446080 4124 5770 -336830 120114
17475 134919 100096 -47693 298027 384774 121017 30070 171878 155094 -104590 129639
17464 69962 346052 320052 83118 -37767 83067 230890 233672 246146 372745 152819 304367
17453 304367 147885 -247635 79994 79671 282397 455780 170548 335914 148780 244005
17443B44005G1438K82290a4272A59265L68353j34014j88456K88724B42627k9599
17433B13028r5845Q5286J74616P397A08268j9629J27561M5126J25041A29685O69693
17422G99378l04413A88219Q5814p2063K63048B18357b339A89778F4055K30552
17412B94607J24582Q454j40263a82750E78827g5158B95241K4145j51136l4669
17402A33581J79360K9275h1082C43785P9301j16125f0721B09742k5021e3925B64593
17390a26004A17631J0399a82901C0946K08033M6089j08830J98919A65819F3698
17379C78681I4010J85033l5011A5816a04298I5326L273K63016p7719m1384o3467
17368A79045R4065a56261r8295B40968A12653R9539E9559J88226D6519J1757K36701
$$ plain form
17443 244005 71438 353728 -14272 159265 527618 393604 205148 493872 242627 213028
17433 213028 117183 202469 377085 384482 108268 88639 216200 261326 386367 129685 799378
17422 799378 494965 188219 274033 201970 465018 218357 -2339 189778 64055 294607
17412 294607 419189 427643 287380 -182750 578827 -75158 295241 319386 168250 133581
17402 133581 312941 342216 -81082 343785 423086 306961 -60721 209742 184721 -53925 264593
17390 -126004 117631 128030 -182901 30946 238979 285068 176238 375157 165819 63698
17379 378681 94010 279043 244032 15816 -104298 95326 98599 361615 283896 242512 179045
17368 179045 273110 -156261 -254556 240968 112653 212192 59559 247785 46519 58276 294977
17357B94977j02032J5026j01793a38889f8458a1388B64230l0715J65090j78113
17347B20492J2431D9849F013J59233K17900A00553i7151d8412j54257k8183c6524
17335D71046j73892k9059a52606A95528c7663A71739M6050a47227A96341b23444
17324A97844a7324C56299A44582k6849O9581m7622R9032j457F0685p605J55943
17313B09023A3780K56168N4713j48715K1987r3049n076K78424r7309C5562N1603
17302H7165l7500d4053A27459O0569K2735J29253A18394J45100o3897P6648j2399
17291B63846a03376B00760C0720K48450N3549q6617K32338B23712M29814A73168
17280B94493H0185J82893K66477A10079J77097I7170k216a24034C15823a554C39903
$$ plain form
17357 294977 192945 207971 106178 -138889 -68458 -11388 264230 233515 398605 220492
17347 220492 232923 49849 6013 165246 383146 100553 -97151 -48412 -202669 -230852 -36524
17335 471046 297154 268095 -152606 195528 -37663 171739 217789 -147227 196341 -223444
17324 197844 -17324 356299 144582 117733 187314 139692 238724 237267 60685 53080 209023
17313 209023 13780 269948 324661 175946 197933 104884 99808 378232 280923 35562 87165
17302 87165 49665 -44053 127459 188028 210763 340016 118394 263494 199597 276245 263846
17291 263846 -103376 200760 30720 279170 332719 246102 478440 223712 653526 173168
17280 294493 80185 263078 529555 110079 287176 97170 94954 -124034 315823 -1554 339903
17268A47327c07765A06444D1117K34949j30759L6106b68597C20076n4784A10255
17257B48452I2855O0973M2382J98950j44168A05312D7095L79617b3222C02734
17246H1776C5469J4281J32931J18729k6538K16677G0159L26584j96762J65568
17236C65549c7581B83932J18615A39714K45242A69089F7431N8283L44638j87651
17226B82701o3496B5621J70319K99016k26508e9698C65365C615K08424M23528
17216F35567j20710B02108n9492J37618p096F6293L21319J07619j61033l3302
17206C00896j31118n3259Q29M3647n8577B6406a3337D04516N7908c9304D94153
17194A20116Q9097Q2384B0032K21603L30058B31674K56866D8773g3878C66486
$$ plain form
17268 147327 -307765 106444 41117 276066 145307 181413 -268597 320076 265292 110255
17257 248452 92855 153828 196210 395160 250992 105312 47095 426712 -23222 302734
17246 81776 35469 49750 182681 301410 274872 491549 70159 396743 199981 365549
17236 365549 -37581 283932 402547 139714 384956 169089 67431 125714 470352 282701
17226 282701 219205 25621 195940 494956 268448 -59698 365365 3615 212039 635567
17216 635567 514857 202108 142616 280234 273138 66293 387612 495231 334198 300896
17206 300896 169778 116519 117348 160995 102418 26406 -13337 404516 462424 -39304 494153
17194 120116 209213 291597 20032 241635 571693 231674 488540 48773 -73878 366486
17183D56210A97673K34459J24541H7083K92143j74022E2450J27527K78869j66200
17173B92646m9977J07637A44215L98154k34719l6816L0336K43781j99944K86689
17163F31696B62854J27536l7323m3910o8150M3175a75359E02353p8263j61151
17153B62939r9525l7584K71620j94111L8439M8664K79437j75451j02247J35844
17143D28025r9554j39844O0710o1345c2759B3812J91816J06351K5217J29099L383
17132D79678k16578J74195D4529J06689O693J67101n5101E7491K23403K10320
17122D91214B06696D9357L78269R1465k36970J12260J9377p8281J57809J26407
17112F19693j62797l5096A23848M4526J49734j34794L2969K34186J8774p6571
$$ plain form
17183 456210 197673 432132 556673 87083 379226 205204 52450 179977 458846 292646
17173 292646 242669 350306 144215 542369 307650 270834 301170 544951 345007 631696
17163 631696 262854 390390 353067 309157 241007 284182 -175359 502353 424090 262939
17153 262939 163414 125830 397450 203339 241778 290442 569879 394428 292181 428025
17143 428025 328471 188627 249337 187992 -32759 23812 215628 321979 347196 476295 479678
17132 479678 263100 437295 44529 151218 157911 325012 269911 57491 280894 491214
17122 491214 206696 49357 427626 519091 282121 394381 413758 335477 493286 619693
17112 619693 456896 421800 123848 168374 318108 183314 216283 450469 469243 392672
17102C92672r2110J22662r1322J4295J81546A98560J38813j00884K29630m1721
17092D24398K67422B01661O7690O2944N50077D34332B08428K01313K9980B19344
17081D92456L8873A85092L95128K62490l77587q3603N8944K60600j09012q6874
17071E05178p8832J79300r4616k07970J25831n5585K54505k09402M9146J89922
17061F57477j23687j5736K51234k87468n395q9707K39216p9570J91781l6368N1771
17050G53548B41485K89666j88898P9018K13400Q6158k14459o5936R8672K2995
17040E62101m9812J76545n3772K68352D21205n2784J46002M2218K45378j18531
17030F83488r1491K73335l13919J36286j1681m8790p4348L32510j91568L63979
$$ plain form
17102 392672 300562 423224 331902 346197 527743 198560 337373 236489 466119 424398
17092 424398 691820 201661 269351 332295 882372 434332 208428 409741 439721 219344
17081 492456 531329 185092 580220 842710 465123 381520 440464 701064 592052 505178
17071 505178 426346 605646 511030 303060 428891 373306 627811 418409 467555 657477
17061 657477 533790 518054 769288 481820 476425 386718 625934 546364 738145 701777 753548
17050 753548 241485 531151 342253 421271 634671 720829 506370 440434 539106 562101
17040 562101 512289 688834 635062 903414 421205 368421 514423 556641 802019 683488
17030 683488 591997 865332 551413 687699 676018 627228 552880 885390 693822 1057801
17020A057801E00154n6061L7418J45931Q7822j36704P2365K2556K00396m3739
17010H30138j96501K17755j48759m0306k34428N65223l09249o2756J03663L42472
17000A067252m51704o0406K71890Q5087J88298j07361q9645K28035n24779L49442
16990I56109j29200O1215n0364j83775L73341k14393N7976j24568k78321L57752
16980H25772j46530M11217k71375R283j3533K13088m2425o515O9613M6844K04476
16969A299915j96904m92794L27730L1067K42566j95594j89132O0863j06090o0757
16959G20870Q4852K44510j78796k04351L49742k13593K64034O2313l33487L39069
16949A135163K57673l76686K4263J63395k41956K93236m06122M66262k26240J58352
$$ plain form
17020 1057801 500154 444093 481511 627442 715264 578560 650925 673481 873877 830138
17010 830138 633637 851392 702633 662327 427899 993122 683873 621117 724780 1067252
17000 1067252 615548 555142 827032 912119 1100417 993056 903411 1131446 606667 956109
16990 956109 826909 888124 837760 653985 1027326 812933 870909 746341 468020 825772
16980 825772 679242 1090459 819084 828367 814834 1027922 985497 978982 1048595 1095439 1299915
16969 1299915 1103011 610217 937947 969014 1211580 1015986 826854 887717 781627 720870
16959 720870 805722 1050232 871436 667085 1016827 803234 1067268 1129581 796094 1135163
16949 1135163 1392836 1016150 1040413 1203808 961852 1255088 848966 1315228 1088988 1247340
16939A247340k90782N9806M95342m03181L5793r9195k7223L58166j09215K39502
16929A506353l63385J87475J34411j65450L9563k60383L45926J5381k0388K28407
16919A647910j72160J5757J72467j03749q9272M72107k42332l22166J7486Q4893
16909A480941q5657K82671j20153o4755O27766l85084Q4548k66177J73069q8993
16899A638176J28243j29268J42467J35470O87K42804n50337L61358j13124N035
16889A861511K9602L78486l49986j53218M11326J7498p4282m79817P12247j70937
16879B182430K5706j27001J73848j1777K09741K41324p2633k64392R6246j51938
16869B301554K72713Q0570n134O3133k61156L80398j91122j3466n7218L52874
$$ plain form
16939 1247340 956558 1016364 1511706 1108525 1144318 1045123 1017900 1376066 1266851 1506353
16929 1506353 1142968 1330443 1464854 1299404 1338967 1078584 1424510 1439891 1419503 1647910
16919 1647910 1475750 1491507 1663974 1560225 1470953 1943060 1700728 1378562 1396048 1480941
16909 1480941 1395284 1677955 1557802 1493047 2120813 1735729 1820277 1554100 1727169 1638176
16899 1638176 1766419 1637151 1779618 1915088 1915775 2158579 1608242 1969600 1856476 1861511
16889 1861511 1891113 2269599 1919613 1766395 2177721 2195219 2120937 1641120 2353367 2182430
16879 2182430 2208136 2081135 2254983 2243206 2452947 2694271 2621638 2357246 2453492 2301554
16869 2301554 2574267 2654837 2649703 2712836 2451680 2832078 2640956 2627490 2570272 2923146
16859B923146N3403r6829J66592j37510j60360M04818k7546j3989N9370O0311
16849C231406j5169K39751j75116K08515k49179J16733N89795j94125p8595p8296
16839C595720N43952k95572J86394R1406m98434L87572M71190m54807K97110K45047
16829D569578m75475N19001l2453K49651j82316O35563l80564j66866M74151k65183
16819D945087Q62340k55584L4565j92790M43078J16243M58K42687Q5575j99919
16809F081740L08109L4376K74672n2053L10060J48223K51581J82107L58665o2204
16799G835276K03368J6357j48539P99942K8837R6060O42013J1952J91284P9293
16789I755843K24368M70588K31313K60607J51868L94642N19664L80777J99726
$$ plain form
16859 2923146 2976549 2879720 3046312 2908802 2748442 3153260 3125714 3111725 3171095 3231406
16849 3231406 3216237 3455988 3280872 3489387 3240208 3356941 3946736 3752611 3674016 3595720
16839 3595720 4139672 3844100 4030494 4121900 3623466 4011038 4482228 4027421 4324531 4569578
16829 4569578 4094103 4613104 4580651 4830302 4647986 5283549 4902985 4736119 5210270 4945087
16819 4945087 5807427 5551843 5586408 5393618 5836696 5952939 5953397 6196084 6281659 6081740
16809 6081740 6389849 6424225 6698897 6646844 6956904 7105127 7356708 7538815 7897480 7835276
16799 7835276 8038644 8055001 7906462 8706404 8735241 8831301 9473314 9485266 9676550 9755843
16789 9755843 9980211 10450799 10682112 10942719 11094587 11489229 12008893 12389670 12589396
16780A2589396M02356K09358O77155K71870L74577O27084L11621N64237L02908
16771A6330562P07881N92142L72334R43821O94757N50146Q74049Q16568R73776
16762B2856036M98881R70980J227972O96736J240471J313503J177426J446103
16754C1428108R50905J706597J743899J547666J597042K151634J679522K220549
16746D5025922K113688L140286J950902L214301L111117L414257L572588L866291
16738F9409352M230449M394370M548533N171639N753992N476291O480458O560200
16730A12025284P089486P337732P623358P987642P916268P867464Q233363Q082824
16722A74163421P176541O944084N342130N068152L526736K330273M41740j047270
$$ plain form
16780 12589396 12991752 13201110 13878265 14150135 14524712 15151796 15463417 16027654 16330562
16771 16330562 17038443 17630585 18002919 18946740 19641497 20191643 21065692 21882260 22856036
16762 22856036 23354917 24325897 25553869 26250605 27491076 28804579 29982005 31428108
16754 31428108 32379013 34085610 35829509 37377175 38974217 41125851 42805373 45025922
16746 45025922 47139610 50279896 52230798 55445099 58556216 61970473 65543061 69409352
16738 69409352 73639801 78034171 82582704 87754343 93508335 98984626 105465084 112025284
16730 112025284 119114770 126452502 134075860 142063502 149979770 157847234 166080597 174163421
16722 174163421 181339962 188284046 193626176 198694328 202221064 204551337 204993077 203945807
16714B03945807k341134l945301m932852n827976p065375p758290q180966p999058
16706A55894855q330392q402699q281546p644903p572566p488564o211031o375998
16698I5587156o163893n328387m953770n035953m268346m249718l535242l736328
16690E8315519l391709k920747k970744k528414k423352k263608k078843k171345
16682C7566757j541717k133147j216579j734494j153223j447173j361439j016661
16674B5962324j171733j177809j069751j023294p90769m88127r97756o06391o22225
16665A8014469p30500q14326p07371n23132k87811p15700m91750l26633o14164
16656A2803082k30174k89883q73438k8119k40829p59237K66411o15102m88906
$$ plain form
16714 203945807 201604673 197659372 192726520 186898544 179833169 172074879 163893913 155894855
16706 155894855 147564463 139161764 130880218 123235315 115662749 108174185 101963154 95587156
16698 95587156 89423263 84094876 79141106 74105153 69836807 65587089 62051847 58315519
16690 58315519 54923810 52003063 49032319 46503905 44080553 41816945 39738102 37566757
16682 37566757 36025040 33891893 32675314 30940820 29787597 28340424 26978985 25962324
16674 25962324 24790591 23612782 22543031 21519737 20728968 20240841 19243085 18636694 18014469
16665 18014469 17283969 16469643 15762272 15239140 14951329 14235629 13743879 13417246 12803082
16656 12803082 12572908 12283025 11409587 11381468 11140639 10381402 10647813 10032711 9543805
16647I543805K17457p27633j56418j98229k22228k00052m25329p9519j75054m76602
16637G100198l2037l06540K47894j25409l87642q8463k76032P5426j48445k14496
16627E844454k45096j20983K3013O0517k72145l96351n8457k31451R9531l12560
16617D390472O0609j48093K01031j76646p9015l78671p1456j53904J33708j77525
16607C600510J39599L0006o91779M23862k56725j4574j7167K6117j20994k26308
16597B892547j05460J34249K90701l78403J93400m5736k26855r8272l29368P59671
16587C086474n35570j19313J55021L0109p8010j33588j92655J78349J04881l13239
16577B182459J49203n0731j39543k21224l7284K77976J5155l93788J23172o5247
$$ plain form
16647 9543805 9761262 9033629 8877211 8678982 8456754 8256702 7831373 7751854 7576800 7100198
16637 7100198 7068161 6761621 7009515 6884106 6496464 6408001 6131969 6207395 6058950 5844454
16627 5844454 5599358 5478375 5501388 5561905 5289760 4893409 4834952 4603501 4703032 4390472
16617 4390472 4451081 4302988 4504019 4327373 4248358 3869687 3798231 3644327 3778035 3600510
16607 3600510 3740109 3770115 3078336 3502198 3245473 3230899 3213732 3239849 3118855 2892547
16597 2892547 2787087 2921336 3212037 2833634 3027034 2981298 2754443 2656171 2326803 3086474
16587 3086474 2550904 2431591 2586612 2616721 2538711 2405123 2212468 2390817 2495698 2182459
16577 2182459 2331662 2280931 2141388 1920164 1882880 2160856 2176011 1782223 1905395 1840148
16567A840148P619q7652O7522J03514l38011K66679n20983K33878K36635o8754
16557A740595r849k14058K1941k22678J80527J94987j57499n44164M79336P6492
16547A545630j83534r4643k8393M50696k93972R6231l81469L1915M65649k06313
16537A401797J03878l90712K54479P8401m83041J34354j24180L33048N4549j99257
16527A163316N4632m955L358j31383J20749j49436j63081O5667K92080j74502
16517A076445l89989K16017O4548J13764k56128Q4351J43880l6810j59189k770
16507H54119K59724n01815K87983k62622J57362k00582L69386D56346L06732l41240
16497D21838M91172j83559J0804P1060J13771m34429M76169l17813K00462j06750
$$ plain form
16567 1840148 1847767 1760115 1827637 1931151 1593140 1859819 1338836 1572714 1809349 1740595
16557 1740595 1730746 1516688 1538629 1315951 1496478 1691465 1533966 989802 1469138 1545630
16547 1545630 1362096 1267453 1239060 1689756 1395784 1492015 1110546 1142461 1608110 1401797
16537 1401797 1505675 1114963 1369442 1447843 964802 1099156 974976 1308024 1362573 1163316
16527 1163316 1217948 1212993 1216351 1084968 1205717 1056281 893200 958867 1250947 1076445
16517 1076445 686456 902473 967021 1080785 824657 909008 1052888 1016078 856889 854119
16507 854119 1113843 612028 900011 637389 794751 594169 963555 456346 763078 421838
16497 421838 913010 729451 740255 811315 925086 490657 966826 649013 849475 742725
16487G42725p1445Q7263B97682O8865K15404N7950K65917j52923o9646l3561r5298
16476E54390J46119p6839L14267C67100L02069J20678k48553J39686J67449l59803
16466D88626K88239j41017k29863Q0727L225j22509J86966j23274K07439k20153
16456D18406J46860J95351k20113j29780r5309r3351L10689P6474k95507K76356
16446E90076k26176o1101M87269l2296C37213a53997E05898k0824j10859N0587
16436D24802r4995j4370M24828j15777k0165k69885J62534r6843N2974N199A97636
16424G25571k32527K04401j90643j24595r3833j16866J97068O9229p7754A60554
16413B44023A03762M07259p7812L227G9418B0304N95852B31814k9376J66364A9108
$$ plain form
16487 742725 671280 758543 297682 366547 581951 639901 905818 752895 683249 649688 554390
16476 554390 700509 623670 937937 367100 669169 789847 541294 680980 848429 488626
16466 488626 776865 635848 405985 486712 489937 367428 554394 431120 638559 418406
16456 418406 565266 760617 540504 410724 315415 222064 532753 609227 313720 590076
16446 590076 363900 302799 790068 757772 337213 -153997 505898 485074 374215 424802
16436 424802 329807 315437 740265 624488 604323 334438 496972 400129 453103 458302 197636
16424 725571 493044 697445 506802 382207 288374 171508 368576 437805 360051 160554
16413 244023 103762 511021 433209 436436 79418 20304 616156 231814 202438 368802 19108
16401B19724g5105E64893j23179l0788J41956B15769p2563J8517L3474j9413J21843
16390B97627A0683J33360J87436I0299L71787B18041g1623E87123a9624C34095
16379A9673K54984L5866K97047k44011j04011M0177a13379A13583J09914l0678
16369A92819J33890I568M74734A20997J86909h4546A73819Q8599g3713H2248J64381
16358B46629a06948C57071j74606N2636g1288D18502E6494P2499J8620n527e8714
16346I8482i9623B09399K5680n1771H4055e8374A92390J03647l7386A21014a44422
16334A60460k2790M5738J38065d9165J1389k20499A02115D3145J69742O6528a20119
16322A35382J66398a0064B1451L9074b38889B303J12597j6832b10141A65780b6217
$$ plain form
16401 219724 -75105 564893 441714 410926 552882 215769 143206 161723 195197 175784 297627
16390 297627 10683 144043 331479 90299 462086 218041 -71623 587123 -19624 334095
16379 19673 274657 310523 607570 363559 259548 299725 -113379 113583 223497 192819
16369 192819 326709 9568 484302 120997 307906 -84546 173819 262418 -73713 82248 246629
16358 246629 -106948 357071 182465 235101 -71288 418502 56494 128993 147613 142086 -58714
16346 98482 -99623 209399 235079 183308 84055 -58374 192390 296037 258651 121014 -144422
16334 160460 137670 183408 321473 -49165 -37776 -258275 102115 43145 212887 279415 -120119
16322 135382 301780 -10064 21451 60525 -238889 2303 114900 98068 -210141 165780 -26217
16310H4843M17780A95568n0621p0471J88969a16945A18212M3177a20959d3119
16299a54238k7602D32489A30217p516J97608j04415A8253P4272B9655a29124D3901
16287g6352D69823b2952B74222C0354a85408A48302J37420a3791B42149A1816
16276a0245B18977a96048A47758h1288B5777J76453m9353D944M6745K08240e4355
16264I6795i492B1869M85279F1644J849P6648m327k0674M839Q6988j2845c47035
16251A11365J30906J44294A20599d9442B6699K18253A21612N6898b73182e0663
16240E061h0412j0304l9233b3562E9656L2128L0755B2228a05354A50793h8805
16228A15585l8541g9301j23793a4132C4154b32464e3081A57576F4665c04772g6760
$$ plain form
16310 84843 502623 195568 144947 74476 263445 -116945 118212 161389 -120959 -43119
16299 -154238 -181840 432489 130217 122701 320309 215894 18253 92525 29655 -129124 43901
16287 -76352 469823 -22952 274222 30354 -185408 148302 285722 -13791 242149 11816
16276 -10245 218977 -196048 147758 -81288 25777 202230 152877 4944 51689 259929 -54355
16264 96795 -9492 21869 507148 61644 63493 140141 135814 115140 119979 206967 194122 -347035
16251 111365 242271 386565 120599 -49442 26699 244952 121612 178510 -273182 -50663
16240 5061 -80412 -90716 -129949 -23562 59656 91784 122539 22228 -105354 150793 -88805
16228 115585 77044 -79301 -203094 -14132 34154 -232464 -53081 157576 64665 -304772 -76760
16216c37515E44059B28469H9976J03011I3701e7813j28832I9662g5092j93008
16206b68100I0140J79358k1314a75358A28429M8202J04000K7036r0346q4122A2395
16194A43422A1248J56895l3137P6896H5088b6997A28183l7442a9455q4532D6468
16182I0530J81562j22081b2619I4266l200J8070r339b94848F3342J10983k1922
16171A52403a49914B29326b7316I1820b55176f514j71145N1360k51721b735G0599
16159B53587Q3147b75532C06143a66669B97247G2840a8054l11333D10893g9488
16148a31300l0284O9635C67682D6898O3817k878h6949G9877A0986J04040B6356
16136d057J593n6578B31768E9387a14254j07721A63717a20130b8619A09611q994
$$ plain form
16216 -337515 544059 228469 89976 192987 93701 -57813 -186645 99662 -75092 -268100
16206 -268100 90140 269498 248184 -175358 128429 176631 280631 307667 217321 133199 12395
16194 143422 11248 168143 135006 211902 85088 -26997 128183 90741 -19455 -103987 46468
16182 90530 272092 150011 -22619 94266 91066 109136 99797 -294848 63342 174325 152403
16171 152403 -149914 229326 -27316 91820 -255176 -6514 -177659 -126299 -378020 -2735 70599
16159 253587 336734 -275532 306143 -166669 297247 72840 -18054 -329387 410893 -79488
16148 -131300 -161584 -91949 367682 46898 110715 107837 -86949 79877 10986 115026 26356
16136 -4057 -2464 -59042 231768 59387 -114254 -221975 163717 -120130 -28619 109611 100617
16125A00617a48551j60905A7885a55850j5811D14431b19807G0932l0809O3836
16115A03959a48741d8400H4592k9613a14584c3032m2712b14l3334A92645q4764
16104A07881d05933C00412b25844C34944j67394m5801p535k4362R7790f6740C3611
16092a45203E0595A5820b42165B09482E8974b8595k35273B63224d3974b0332B76078
16080F0900a97189I172L97433E5780K46315b1550n0839b4064p8525M5898B9925
16068H9186b2036A55641b41045H9803b00806n7775P8459h3426D010g3244F8888
16056A56994b90493A54391d10652g794j52850G5374c4215j9048j40383a2077A56060
16044A73695G858c19619C81918a06665c6428A41118o783b17989B2708K26748f1327
$$ plain form
16125 100617 -148551 -309456 17885 -155850 -171661 414431 -219807 70932 40123 103959
16115 103959 -148741 -48400 84592 54979 -114584 -33032 -75744 -214 -33548 192645 107881
16104 107881 -405933 300412 -225844 334944 167550 121749 114214 89852 187642 -66740 33611
16092 -145203 50595 15820 -242165 209482 58974 -28595 -263868 263224 -43974 -20332 276078
16080 60900 -197189 9172 406605 55780 302095 -21550 -72389 -24064 -102589 -56691 29925
16068 89186 -22036 155641 -241045 89803 -200806 -258581 -180122 -83426 4010 -73244 68888
16056 156994 -290493 154391 -410652 -7794 -160644 75374 -34215 -53263 -193646 -12077 156060
16044 173695 7858 -319619 381918 -106665 -36428 141118 134335 -217989 22708 249456 -61327
16032E8175a96838J903h2311q9119j48633D28843b2872A6101a50032A13926c11867
16020B56159L6304B063c81846a80011p5710a26199b365j27774L6436j70361c798
16008A3703a0616E7825d2427A70802c23589b3248k18785R998f1449A53050E538
15996B6164L03255D8486a25990B9305a44100n0030h2040H3882c78649C17813D3162
15984E6319L72464A00290M46149B48877L3255o4995e4463C12801H6062a4786j04602
15973a19388c3190E5474j2292a13500d6308r4671A7657J61149b37303B09641a24310
15961c1979B7189b7637C9270b74454h6094A28415J1026A102c1920n3305l00839
15950c86064A0501a0958A77365c09293i495G3966B9441a34743l0364E6350O512
$$ plain form
16032 58175 -196838 -194935 -82311 -171430 -320063 428843 -22872 16101 -150032 113926 -311867
16020 256159 292463 2063 -381846 -180011 -255721 -126199 -2365 -130139 -93703 -264064 -3798
16008 13703 -10616 57825 -42427 170802 -323589 -23248 -242033 -232035 -61449 153050 5538
15996 26164 329419 48486 -125990 29305 -144100 -194130 -82040 83882 -378649 317813 43162
15984 56319 428783 100290 546439 248877 282132 217137 -54463 312801 86062 -14786 -119388
15973 -119388 -33190 55474 43182 -113500 -46308 -140979 17657 178806 -237303 209641 -124310
15961 -31979 27189 -27637 39270 -274454 -86094 128415 139441 1102 -31920 -85225 -386064
15950 -386064 10501 -10958 177365 -309293 -9495 73966 29441 -134743 -165107 56350 62862
15939F2862a58977J3977A92878a70510a1980j60333f7415j18960A98531b79018
15928a09209q191D8067d55511a76062D7018c05569B35808A4198M0736j5318J77118
15917B16734i8334A99500d51985G7835f8307Q260j24822B92745b82053i0463b1953
15905a20916K8005j0968j19911M0821B03367c73523A62148J03232b89712a24702
15894a62428c8739q7213a6054j31912k146N0158j48923P0697o2981J05160I670
15882A94927a9115K578k4780B08770b42988e8963k3488n3606p4695M2095J79A40302
15869h9324j77142g3551A09934a55086A70939f1538l0645j4443j96038E3391d7555
15857B46858B494J05459a87322E9610B684J67351J12969A3670b81148A40334j4732
$$ plain form
15939 62862 -158977 -145000 192878 -170510 -11980 -172313 -67415 -186375 198531 -279018
15928 -109209 -117400 48067 -455511 -176062 47018 -305569 235808 14198 54934 39616 216734
15917 216734 -98334 199500 -451985 77835 -68307 -60047 -184869 292745 -282053 -90463 -21953
15905 -120916 -92911 -103879 -223790 -182969 203367 -373523 162148 265380 -289712 -124702
15894 -162428 -38739 -125952 -16054 -147966 -150112 -99954 -248877 -178180 -241161 -136001 9670
15882 194927 -19115 -16537 -41317 208770 -242988 -58963 -82451 -136057 -210752 -168657 -168478 140302
15869 -89324 -266466 -73551 109934 -155086 170939 -61538 -92183 -106626 -302664 53391 -47555
15857 246858 2494 107953 -187322 59610 2684 170035 283004 13670 -281148 140334 125602
15846A25602a29187A29885d1006q6784H3153a9971k46289A46857d2273o1518M9368
15835e4423j15921j2603D8309j1848J64022n4146G0781a49353j35095r9416q7214
15824d71078C4051J23142c6449j03348H9666o774b76738a00749d083o4751A16700
15812D9239b51801c4250j87496A84811a9642k01588M1665E3562c83657J06677
15802b76980c2012r7209B59542l9146C9774c66291H929P378a2462l08136A63552
15790b51571H2584J73267J02045j44483c3660j20866A81150F2042J33146b17894
15779a44937A06133b6645m4050B37745b54574b96q0241k16679g3840K0610A54272
15767a51000j29768C42422g2175D4925d69479D3497c7279j02080F82992H5706
$$ plain form
15846 125602 -129187 129885 -41006 -127790 83153 -19971 -266260 146857 -42273 -103791 -54423
15835 -54423 -170344 -182947 48309 36461 200483 146337 70781 -149353 -284448 -383864 -471078
15824 -471078 34051 157193 -36449 -139797 89666 82892 -276738 -100749 -4083 -68834 116700
15812 49239 -251801 -34250 -221746 184811 -19642 -221230 -179565 53562 -383657 -276980
15802 -276980 -32012 -129221 259542 220396 39774 -366291 8929 16307 -12462 -320598 163552
15790 -251571 82584 255851 357896 213413 -33660 -154526 181150 62042 195188 -217894
15779 -144937 106133 -26645 -70695 237745 -254574 -296 -80537 -297216 -73840 -53230 154272
15767 -151000 -280768 342422 -72175 44925 -469479 43497 -37279 -139359 682992 85706
15756A80930A084K22983A07629J16940j04291a27548f1105H171c4984r5122A80639
15744b15155C5893J6048M6844c2587A01044a48721O6242H9185b11383J01379B7835
15732A7941f8959k11791a24929b7198o7255D64076A58632c9671J8587A62346D2509
15720b27534M7104A28162a80983l4486f9964j57388c2829r3132I037K56809A17961
15708A71882D0278J02002b07647I1891J64069A16652M2604E8316B4254c4910i243
15696C3217a05954q0155A51025N717j0935D758J13479C0079J6580a17310E230
15684B0736J14519o175M5006c06055J33987i145B95655h3524B6909b73053A24860
15672F4175A0380a9333A97456a14073A05641C171a47331F6006L803J02818a8281
$$ plain form
15756 180930 1084 224067 107629 224569 120278 -127548 -61105 8171 -34984 -130106 180639
15744 -215155 35893 51941 98785 -32587 101044 -148721 -82479 89185 -211383 -110004 27835
15732 17941 -68959 -280750 -124929 -27198 -94453 464076 158632 -39671 -21084 162346 42509
15720 -227534 -180430 128162 -180983 -215469 -69964 -227352 -32829 -125961 9037 265846 117961
15708 171882 40278 142280 -207647 91891 255960 116652 159256 58316 24254 -34910 -9243
15696 33217 -105954 -186109 151025 156742 145807 4758 118237 30079 46659 -117310 5230
15684 20736 135255 129080 174086 -306055 -172068 -9145 295655 -83524 26909 -273053 124860
15672 64175 10380 -19333 197456 -114073 105641 3171 -147331 66006 69809 172627 -18281
15660G8450J86888p3907a75675M5738B395c27645A24825i1251G0230c5477B98243
15648b21038B28932I0170f213B67602a06034j7215A02954d10525D4384M7779a19121
15636a30277c2584r2797k42525B7244c42556a44440o9508K8230C8282J14290M6824
15625A99396K8747b81677A45387c78361A56189a04675A12736g7111G4428a71964
15614A57234e7662D9835b39133H9364a93169b7235p3212j62258h3185B32301M7252
15603B79553i3043L9891B32447B2000a13307q7352b4536k42747f9430g15j0595
15592a1310B42889b22663A37156J85579b132l29603A53390e5379b0631F5669c5013
15580a78644A50706F2733g2223j905C36577h0607m6265n0312D6941a05741Q211
$$ plain form
15660 78450 265338 191431 -175675 -129937 2395 -327645 124825 -91251 70230 -35477 298243
15648 -221038 228932 90170 -6213 267602 -106034 -123249 102954 -410525 44384 92163 -119121
15636 -130277 -32584 -125381 -367906 27244 -342556 -144440 -213948 -185718 38282 152572 199396
15625 199396 228143 -281677 145387 -378361 156189 -104675 112736 -77111 74428 -171964
15614 157234 -57662 49835 -239133 89364 -193169 -27235 -100447 -262705 -83185 232301 279553
15603 279553 -93043 -53152 232447 22000 -113307 -200659 -24536 -267283 -69430 -715 -11310
15592 -11310 242889 -222663 137156 322735 -2132 -331735 153390 -55379 -20631 65669 -35013
15580 -178644 150706 62733 -72223 -74128 336577 -80607 -126872 -177184 46941 -105741 -97530
15569i7530B3740I222K40002b79064A81022a50302j61912B28462j06416b20745
15558A45426K5762b09692C2499a07328M4695n431j99286A1822c48597J36224A25903
15546b12554d5417j3496k5421j91193c8432A03361O6315a05689G2633a06637j02975
15535b09612J5382I6108O480E597h3379m174M3157A94631I6334b75175a13235
15523B33720E5658L202a63297D3593R5062m5336d21415e3190A38775h2079K1792
15512f0287p5516j94217E7231b95039l3693J40265j32916A24503K54712a04771
15501c34427H5677g1433l08601a52518A81009l3264c42081H7081i1898B28984
15490a17112j74430c5696G0873c5053j0768A19539b31878J14195B95546r0793
$$ plain form
15569 -97530 23740 9222 249224 -279064 181022 -150302 -312214 228462 122046 -220745
15558 145426 171188 -209692 32499 -107328 -62633 -68064 -267350 11822 -348597 -212373 125903
15546 -212554 -45417 -58913 -84334 -275527 -38432 103361 169676 -105689 72633 -106637 -209612
15535 -209612 -194230 96108 102588 5597 -83379 -87553 -44396 194631 96334 -275175 -113235
15523 233720 55658 58860 -163297 43593 138655 93319 -421415 -53190 138775 -82079 -60287
15512 -60287 -135803 -330020 57231 -295039 -328732 -188467 -321383 124503 379215 -104771
15501 -334427 85677 -71433 -380034 -152518 181009 147745 -342081 87081 -91898 228984
15490 -117112 -291542 -35696 70873 -35053 -45821 119539 -231878 -117683 295546 204753
15480B04753a51457B78844c46112a42218k59399F8987K4765b17946g2041n985
15470g8026A58860G4525J24252J6471a78180a9004A17197g3534A50765C6386J15302
15459A51688m2061b9355L772j16089C84775A84432c57712a166j93983B72211n8236
15448B13975J64488a32057C12425B925a14818E0282h7863j92304Q7554C6686A2981
15436A80602b84723Q8637E4593d6547A05531c1836l71330f1631b5968H8153d6318
15424H3625c82957J8417J68967D1372L5474P6026n8696J52127a69743M6516F1220
15412c1263A88456G4413b17384B61966J17756a39807A68074a23057B33247f3814
15401a55625A98561b080p990A06013a21434L0502C08622g6068j29675C93121a25831
$$ plain form
15480 204753 -151457 278844 -346112 -142218 -401617 68987 93752 -217946 -72041 -78026
15470 -78026 158860 74525 198777 215248 -178180 -19004 117197 -73534 150765 36386 151688
15459 151688 109627 -29355 -25583 -141672 384775 184432 -357712 -1166 -195149 272211 213975
15448 213975 378463 -132057 312425 2925 -114818 50282 -87863 -280167 -192613 36686 12981
15436 180602 -284723 -196086 54593 -46547 105531 -31836 -403166 -61631 -25968 88153 -46318
15424 83625 -382957 -364540 -195573 41372 76846 152872 94176 246303 -169743 -123227 61220
15412 -31263 188456 74413 -217384 261966 379722 -139807 168074 -123057 233247 -63814
15401 -155625 198561 -2080 -10070 106013 -121434 -90932 308622 -76068 -205743 393121 -125831
15389b97885C81088A07183J31444F3383c57114d7345A03939b21653R732A76752
15378F8833N9867a53530A62834p0433e0768B0722K29232H8595R9063k8539n3662
15367A05457f5607J6499B83534f6840l8006k5944G9534f1792A0199J28051d7700
15355E9284K85591a8725B38526J57329E5951a03003j35786I8968L2948J23591
15345B55507a84735D7126g3927j65986G3338c9266a2588B29303B3793a63837N7380
15334a06457A26873a06853A71092b0388C05426k7850b0753l4566m52588H5269
15323A89533m7009K1568d365D9542c02144B47244C9817J95619J98959b45523b153
15311h1916K5368j01337H8118R3480I31b84789G6767O7887a56950E40850B891
$$ plain form
15389 -297885 381088 107183 238627 63383 -357114 -47345 103939 -221653 -211921 176752
15378 68833 128700 -153530 162834 92401 -50768 20722 249954 88595 187658 159119 105457
15367 105457 -65607 -49108 283534 -66840 -104846 -130790 79534 -61792 10199 138250 -47700
15355 59284 344875 -18725 238526 395855 55951 -103003 -238789 98968 131916 255507
15345 255507 -184735 47126 -73927 -239913 73338 -39266 -12588 229303 23793 -163837 -106457
15334 -106457 126873 -106853 171092 -20388 305426 277576 -20753 -55319 -507907 85269
15323 189533 142524 164092 -4365 49542 -302144 247244 39817 235436 434395 -245523 -2153
15311 -81916 -56548 -157885 88118 181598 931 -284789 76767 144654 -156950 540850 2891
15299A88011b03188B75786g0990B90041E1322O7179K6411J36628a08063E2756
15288C13292A00420a86599B1831J15400C5092O4130M71873a34129q0115D05493
15277g5467K6433B41439b90367A17536L26454c81388a63455A79455F1122J11185
15267A72307j3903o9569N3514P3876g1857k145A45067C2714L40804c1005C06966
15255B29290c5060j03039A29771a2667A42709k464O3608K37243L53595R86580
15245A781271n07464K16487J20928E85362I0943K71564a18512B40094K1985n6327
15235B05752H7913K4205Q3342G9555L4585b59788B56911a0793j82648A31703J6426
15224A48129Q9134c4505A69591C093a88829J8805B94020q3062J2212a84151k1110
$$ plain form
15299 188011 -203188 275786 -70990 290041 51322 118501 144912 281540 -108063 52756
15288 313292 100420 -186599 21831 137231 35092 99222 571095 -134129 -214244 405493
15277 -75467 -49034 241439 -290367 117536 443990 -381388 -163455 179455 61122 172307
15267 172307 158404 88835 142349 216225 -71857 -74002 145067 32714 373518 -31005 306966
15255 229290 -35060 -138099 129771 -12667 142709 140245 203853 441096 794691 1781271
15245 1781271 1273807 1490294 1611222 585362 90943 362507 -118512 240094 262079 205752
15235 205752 87913 112118 195460 79555 114140 -259788 256911 -10793 -193441 131703 148129
15224 148129 237263 -34505 169591 3093 -188829 -170024 294020 210958 223170 -184151 -205261
15213b05261O960A24658J5950h2419J7273p7931B13136K30814a29642D6982K50101
15202B97083j16366k2696D3080b18389A12003E4354b0505A69409b0207o231k62850
15191b89288a5057F8908J6904J21340H2697a71314D42225f906r214I5543L41008
15180D36551c5245H6052b5450B01399a7909C1777a68926A37177D2225J7594J39654
15169A99473D4958M4489b4677k6905D8494a25030C43237j40989N6707p2814H8689
15157B62979H3895R4198b84167A73220H1290a3314D5279R9417a37271N6003B18134
15145A4851i2864C00353c4732C89463a60654h948B28517Q8172B4139H866N2016
15134F0882N5600a86425B12494A5888L5690L0281J4654Q1358n3719m3880d9233
$$ plain form
15213 -205261 -198301 124658 140608 -82419 -65146 -143077 213136 443950 -129642 46982 297083
15202 297083 180717 158021 43080 -218389 112003 54354 -20505 169409 -20207 -26438 -289288
15191 -289288 -15057 68908 85812 207152 82697 -171314 442225 -6906 -16120 95543 436551
15180 436551 -35245 86052 -25450 201399 -17909 31777 -168926 137177 42225 59819 199473
15169 199473 44958 89447 -24677 -51582 48494 -125030 343237 202248 258955 186141 88689
15157 262979 83895 178093 -284167 173220 81290 -13314 45279 144696 -137271 -81268 218134
15145 14851 -92864 300353 -34732 389463 -160654 -8948 228517 316689 24139 8866 60882
15134 60882 116482 -186425 212494 15888 51578 81859 96513 177871 124152 80272 -49233
15122a13022A69557F12J48462k8130J70052A2393g9983A24676L1577k9983P0030
15111A96300N781e260n0124A80664H4395C8807c2526D7281K45883a9713j31966
15100a51679E0802M03854g7353C09964A16773L8420J10721H9663J34146a31749
15089B78406J14001o5265m3132j08565K10073C1620d44196f8289R148I7057P591
15078A04648C501J20741J47541K8909m9586n1434E8429M16828B27742m6489H3486
15066F1437K67363j05428k1256K64707k28559F0432J32092k9834a07034A76792
15055B81458O5210G2635a45092B10276M9804J12149A48211o2235j7055L09287
15045C78208A54512K02197j47886n4564b4789C91562A93579j7322J940a17763
$$ plain form
15122 -113022 169557 612 149074 120944 290996 12393 -79983 124676 156253 126270 196300
15111 196300 202081 -5260 -55384 180664 84395 38807 -32526 47281 293164 -19713 -151679
15100 -151679 50802 454656 -77353 309964 116773 155193 265914 89663 223809 -131749
15089 278406 392407 327142 284010 175445 385518 31620 -444196 -68289 -59141 97057 104648
15078 104648 3501 124242 271783 300692 251106 199672 58429 475257 227742 181253 83486
15066 61437 328800 223372 202116 466823 238264 60432 192524 162690 -107034 176792
15055 281458 346668 72635 -145092 210276 260080 372229 148211 85976 68921 378208
15045 378208 154512 356709 208823 154259 -24789 391562 193579 176257 178197 -117763
15034I1323K61183f3081o1123C68886p3491o0636r1687J32119l9021b1170B8362
15022C24397J17755r1478A1143L20330c0697A32430P5962q9057m4934K36557N1373
15011C62331j78195K9161l0744J60935j27486J24218q2830n8805K41071j60057
15001B79599m0286p4095b6130A7090L17601F0410k916a48598B18077F2030J00910
14990A62940L24683j41629A50564m6935R1473D9729J46867J76965K9624A74723
14979B50189K72776b06535b4295D49279d9864A30146f6486C63620R2147o1556
14969C94211I2146J51296K91596G2058J9744K40486o3112j02892m1603Q0192J60717
14958C65590j4759K36868j02428j67084p7157J29124A66854K19697j05057A15059
$$ plain form
15034 91323 352506 -63081 -124204 368886 295395 234759 143072 275191 236170 -21170 28362
15022 324397 442152 350674 11143 331473 -30697 132430 208392 119335 74401 310958 362331
15011 362331 184136 213297 182553 343488 216002 340220 257390 198585 439656 279599
15001 279599 239313 165218 -26130 17090 334691 60410 57494 -148598 218077 62030 162940
14990 162940 487623 345994 150564 103629 195102 49729 196596 373561 403185 174723
14979 250189 522965 -206535 -24295 449279 -49864 130146 -66486 363620 455767 394211
14969 394211 92146 243442 535038 72058 91802 332288 269176 166284 124681 204873 365590
14958 365590 350831 587699 485271 318187 241030 370154 166854 386551 281494 115059
14947B70309O335q6490K3847M858Q3520j03868P7581l7282J16474j09825l4313
14936B11146e2726D05606L8435J00971q5129G7560L14476E6976A5560N21213A34193
14924A97585H1241K4541R9359J98338L3853J29398B46995K33026k30832m7335
14914B01854H5680N24628k29914j34372K77298k59874R1476q0680O6791L38100
14904F79133B77784J15815j2094o8215K11923B10041J09057J99337A23125J89839
14894C12964A14616K90060q1948p6710K57893k04799L17772B52926J40513J91995
14884E85434B91933K75184j17297Q1966A23664K19813m0027J93281o9421N7521
14874D84831j10386Q5496K48993k66189A45205K2892J79798g8179D24246j67577
$$ plain form
14947 270309 276644 190154 214001 218859 302379 198511 276092 238810 355284 245459 211146
14936 211146 -52726 405606 444041 545012 459883 77560 392036 56976 15560 536773 134193
14924 197585 81241 105782 205141 403479 437332 566730 246995 480021 249189 201854
14914 201854 85680 610308 380394 246022 523320 263446 354922 274242 341033 679133
14904 679133 277784 393599 381505 313290 525213 210041 319098 518435 123125 312964
14894 312964 114616 404676 322728 246018 503911 299112 616884 252926 393439 585434
14884 585434 291933 567117 449820 531786 123664 343477 303450 496731 427310 484831
14874 484831 374445 459941 708934 442745 145205 168097 347895 -78179 424246 256669
14864B56669j23616J57576K11625B32179L38945P4869A66033J83845j49633L3346
14854B33591J95871l7691J0091A92981J0716L20752j90764J0244O2938A02771
14843B32047L45183k76807l8828K82886j79664O0936J89819k22354J39354k2709
14833E09863K92479k41276j25247J28727J38566j91081J84955n6802k99799J95786
14823E36171m7637A40229M12828N6366k94922K25341J80644K3016k80749K64724
14813G27477j39336L03389k73476J94842k55426J09425l00497j71156L06024j71351
14803C29915R6570J54371B77483O8997K93908j93869A19625N48279l26133K30884
14793E72655n9090k52035K57756P7183k97351J58047M56749k58413K48347C90746
$$ plain form
14864 256669 133053 290629 502254 232179 571124 645993 166033 349878 200245 233591
14854 233591 429462 391771 401862 192981 203697 524449 333685 343929 406867 102771
14843 232047 577230 300423 261595 544481 364817 425753 615572 393218 532572 509863
14833 509863 802342 561066 435819 564546 703112 512031 696986 640184 340385 536171
14823 536171 488534 140229 553057 609423 314501 539842 720486 743502 462753 727477
14813 727477 588141 891530 618054 812896 557470 666895 366398 195242 501266 329915
14803 329915 426485 580856 277483 346480 640388 446519 119625 667904 341771 572655
14793 572655 513565 261530 519286 596469 299118 457165 913914 655501 903848 390746
14782E73015R1698j01598J45453k44840R1559K38059l29144L44347k38381O176
14772E76344O0146j13341K03137p6525P3566L64219E12286K71707l66217J99882
14762F17658k30086Q640K55327j0857J20206j28274K92682k25283k99603K15750
14752F16160J11990O2783j6659j18278J34631j50812k10129M61843l01674J2460
14742F02315N1695O602J40699j34926J22092k64111K77001l50799L26131j15339
14732F61360k40257M69002m751j70633J17832Q1842k32488j56190J73687J53518
14722H52922n5491P2814J32943j96584C97782N28771o6778J26678P6667k96725
14712G66395J70309l37240L00269K2487l41320M49805j75750J75554k78909K94933
$$ plain form
14782 573015 664713 563115 708568 463728 555287 793346 464202 808549 570168 576344
14772 576344 636490 523149 726286 649761 723327 1087546 512286 783993 417776 617658
14762 617658 387572 396212 651539 640682 760888 632614 925296 700013 400410 616160
14752 616160 728150 790933 774274 655996 790627 639815 429686 891529 589855 602315
14742 602315 654010 660612 801311 666385 788477 524366 801367 450568 776699 661360
14732 661360 421103 890105 885354 714721 832553 914395 681907 525717 699404 852922
14722 852922 797431 870245 1003188 806604 397782 926553 859775 986453 1063120 766395
14712 766395 936704 599464 899733 922220 580900 1030705 854955 1030509 751600 1046533
14702A046533l73302K77476l93807L27586J3797m9711J96725j36351J41665k04389
14692H46222J3218l3349q8755j62072M43113K1500k5658k85607J62956N2211p064
14681I36715j67181J71932J06185L04394n39446M28773l49282L10565l57523J46536
14671I91668j88108L3294q3681N81847l37858r2597J6485M14274n0868k25839
14661A058617k1585O5320r6702L04087j57628j93896P0093J16226j81098K70312
14651A233746K96761m59116M14274q8840r4055J44762k99824k74500L57319N5705
14641A286232m5790j48245M42674n43338L00048J35283k64201j26476M94968j45407
14631A385748j57743l4988N8662j9351K01849J58175k69788J19374k20067P5387
$$ plain form
14702 1046533 673231 950707 556900 884486 898283 848572 1045297 908946 1050611 846222
14692 846222 859440 826091 737336 575264 1018377 1039877 1014219 728612 891568 943779 936715
14681 936715 769534 941466 1047651 1352045 812599 1241372 892090 1202655 845132 991668
14671 991668 803560 836854 753173 1335020 997162 904565 921050 1335324 1284456 1058617
14661 1058617 1037032 1102352 1005650 1309737 1152109 958213 1028306 1144532 963434 1233746
14651 1233746 1530507 1071391 1485665 1396825 1302770 1447532 1147708 873208 1230527 1286232
14641 1286232 1240442 1092197 1534871 991533 1291581 1426864 1162663 1036187 1531155 1385748
14631 1385748 1228005 1193017 1251679 1232328 1434177 1592352 1322564 1441938 1221871 1297258
14621A297258R3858k06380M08354J97373p9318k02335k11952Q9786L80530k47581
14611A519593Q5621j12511J38208k19296J94152j16716J90864q1397J50656k46305
14601A502869p6722M76752k02097l07861M79873j92368J3688J46294j47326L88951
14591B082053k22285j55856m2723P9575k1945K17319j9159k82853J82321J56819
14581A973266p3503Q2603J88209m6481l74559O25526m72665L74513m20637J59474
14571B015746K20283q8801J36637j59837O2437R6096j095K78917l81742K09275
14561B387916Q7370J97809J10384L9006J44846l28694Q26653O4611j27051Q32745
14551D235595K69761Q57489J170596L482458Q826633K4998439L037173A9938387
$$ plain form
14621 1297258 1391116 1184736 1593090 1790463 1711145 1508810 1296858 1386644 1767174 1519593
14611 1519593 1605214 1492703 1630911 1411615 1605767 1489051 1679915 1598518 1749174 1502869
14601 1502869 1426147 1902899 1700802 1392941 1872814 1680446 1694134 1840428 1693102 2082053
14591 2082053 1859768 1703912 1661189 1740764 1718819 1936138 1916979 1634126 1816447 1973266
14581 1973266 1899763 1982366 2170575 2124094 1749535 2375061 1902396 2276909 1856272 2015746
14571 2015746 2236029 2147228 2283865 2124028 2186465 2282561 2281466 2560383 2178641 2387916
14561 2387916 2475286 2673095 2783479 2822485 2967331 2638637 3465290 3529901 3402850 4235595
14551 4235595 4505356 5362845 6533441 10015899 18842532 43840971 46878144 19938387
14542A0040943j932786l769009j785253j0053n65857n2512R647l23027J69195
14533A781288J56307K67019k91751O33817k18864m00348J21651J60557J82980
14524B392656K82634l77746j64441P5412O09480k53925o0674J16926q5430K787
14514B537679P3788L10428j39283M3736Q8863R4884j59830K46829O152M6828j8598
14503C131476r4215j35125L33K61647q2941K07821k54774Q1797K5928J22116l04027
14492B960036K84698J69370J14929j66992M02177k93869Q1401J57530J0352j83078
14482C536554L39920q6849P5769m8380r832K592O4120n2745L48643l3061K11839
14471D348570l15883O3943J11058M63362r0657j34432J86492j67232K35653p5344
$$ plain form
14542 10040943 8108157 4339148 2553895 2543842 1977985 1925473 1935120 1612093 1781288
14533 1781288 1937595 2204614 1912863 2546680 2327816 1927468 2049119 2209676 2392656
14524 2392656 2675290 2297544 2133103 2208515 2817995 2564070 2503396 2620322 2534892 2537679
14514 2537679 2611467 2921895 2782612 2826348 2915211 3010095 2850265 3097094 3103246 3150074 3131476
14503 3131476 3037261 2902136 2902469 3164116 3081175 3288996 3034222 3116019 3141947 3264063 2960036
14492 2960036 3244734 3414104 3529033 3362041 3764218 3470349 3551750 3709280 3719632 3536554
14482 3536554 3876474 3789625 3865394 3817014 3807182 3809774 3873894 3821149 4169792 4136731 4348570
14471 4348570 4032687 4096630 4207688 4671050 4580393 4445961 4632453 4465221 4700874 4625530
14461D625530k50298J68313O04419k2704J01488k68154J94060j48034J85912K52695
14451E443227l55771J37250L68079k29388J01985Q4514J52505l5806j49937N04568
14441F021226M6784Q104M140J0668j20710K23839J76295J51454J44192r1195L09157
14430F883954M3409J23059O2783l96737O99505j37037J05096L01235P6773k19629
14420G542411K41845J13123K63545J93288k07627M54355J42928m6160q7767M94986
14410I104927j9343j28401O15839k11418K87564J54750K38082J95205J76105l7026
14400A0376284L64552k21106M00933L53514L9678m591N78580L847J90979O0024
14390A2142694N13839J41538K60925N34391j20437j28125O30236L22213n2709
$$ plain form
14461 4625530 4375232 4543545 5147964 5125260 5226748 4958594 5152654 5004620 5190532 5443227
14451 5443227 5087456 5224706 5592785 5363397 5465382 5549896 5702401 5666595 5516658 6021226
14441 6021226 6068010 6076114 6080254 6090922 5970212 6194051 6370346 6521800 6665992 6574797 6883954
14430 6883954 6927363 7050422 7113205 6716468 7415973 7278936 7384032 7685267 7762040 7542411
14420 7542411 7784256 7897379 8160924 8354212 8146585 8600940 8743868 8697708 8609941 9104927
14410 9104927 9085584 8957183 9573022 9361604 9649168 9803918 10042000 10237205 10413310 10376284
14400 10376284 10740836 10519730 10920663 11274177 11313855 11309264 11887844 11891691 12082670 12142694
14390 12142694 12656533 12798071 13058996 13593387 13472950 13344825 13975061 14297274 14244565
14381A4244565M27108J91185L10817j24467P26082K34333L47910j5482N60217
14372A6902268L39452K59429M14793J85719M78621N84929K63348R1436L80021
14363A9900016N71990N34708K36765P61973O63777L86205O84543L44840N25306
14354B4610123N57213M11255O66440M38267N43094J121527N94722K58712R50984
14345C0152337J028377O39262R52642L79085J157908J097972J055536Q37837J110618
14336C8411574Q69987J578373J061750J322973J092397J375222J530766R77246
14328D8220288J830120J819736J525476J773262J889322J978347J774803K169315
14320F2980669K054375K387280K594049K284762K944777K774867K905850L235378
$$ plain form
14381 14244565 14671673 14862858 15173675 15049208 15775290 16009623 16357533 16342051 16902268
14372 16902268 17241720 17501149 17915942 18101661 18580282 19165211 19428559 19519995 19900016
14363 19900016 20472006 21006714 21243479 22005452 22669229 23055434 23739977 24084817 24610123
14354 24610123 25167336 25578591 26245031 26683298 27226392 28347919 28942641 29201353 30152337
14345 30152337 31180714 31819976 32772618 33151703 34309611 35407583 36463119 37300956 38411574
14336 38411574 39281561 40859934 41921684 43244657 44337054 45712276 47243042 48220288
14328 48220288 50050408 51870144 53395620 55168882 57058204 59036551 60811354 62980669
14320 62980669 65035044 67422324 70016373 72301135 75245912 78020779 80926629 84162007
14312H4162007L822080L218631L775356L678231M366392M349108M884956M662182
14304A16918943N164294N648661N764466O539560O289958P173137P598885P748852
14296A68846756Q448129Q989693R260682R926412J0535572J1209042J1697700
14289B38913986J2278284J2615099J3286843J3970979J4610848J4634833J5183233
14282C35494105J5459324J5029861J5307828J4583001J4509646J3765073J2516118
14275D36664956J1215907R641111P909249M289682Q87951n40857l820227l490238
14267D62757534l175775o431731q027778r781293j1808960j2839691j4482333
14260C96209973j4913373j5404345j5990541j5776248j5644937j5741443j4733782
$$ plain form
14312 84162007 87984087 91202718 94978074 98656305 103022697 107371805 112256761 116918943
14304 116918943 122083237 127731898 133496364 140035924 146325882 153499019 161097904 168846756
14296 168846756 177294885 186284578 195545260 205471672 216007244 227216286 238913986
14289 238913986 251192270 263807369 277094212 291065191 305676039 320310872 335494105
14282 335494105 350953429 365983290 381291118 395874119 410383765 424148838 436664956
14275 436664956 447880863 457521974 465431223 469720905 470608856 470067999 466247772 462757534
14267 462757534 459581759 453150028 445122250 435340957 423531997 410692306 396209973
14260 396209973 381296600 365892255 349901714 334125466 318480529 302739086 288005304
14253B88005304j3394450j3099273j3175545j2475980j1735912j1225070j0603999
14246B02295075r993784r458193q285448q287966q183891p369453p171859o681664
14238A36862817n434732n909870n604684n587287m276013m873528l987657l729511
14230I7459535l992915l809654l722195l440745l012013l113601k900365k496311
14222G0971736k768352k038213k020641k284089k252813j977898j910797j521815
14214E4197118j646357j236985j981573j721243j238846j464428j362350n20913
14206D3024423j313533j550278j181711j081279j159327q26608n66963q02437
14198C4542287j282700j292727l77161p72793p18922k03301j254043n89632o76788
$$ plain form
14253 288005304 274610854 261511581 248336036 235860056 224124144 212899074 202295075
14246 202295075 192301291 182843098 174557650 166269684 158085793 150716340 143544481 136862817
14238 136862817 131428085 125518215 119913531 114326244 110050231 105176703 101189046 97459535
14230 97459535 93466620 89656966 85934771 82494026 79482013 76368412 73468047 70971736
14222 70971736 68203384 66165171 64144530 61860441 59607628 57629730 55718933 54197118
14214 54197118 52550761 51313776 49332203 47610960 46372114 44907686 43545336 43024423
14206 43024423 41710890 40160612 38978901 37897622 36738295 35911687 35344724 34542287
14198 34542287 33259587 31966860 31589699 30816906 30097984 29894683 28640640 28051008 27374220
14189B7374220p92291o16019o51747k57125r01212m42933M8072j136232l60937
14180B2263796m12170p48760m29325n01205m47909l23915k57868k68092n32999
14171A8341553n38750j90699k71486k66300l81067m52010k52857m81166n29973
14162A4977245j396k57852q369o00912j41777j29836l9550p97471L65563j96057
14152A3169588m22600l38649O9047m50691j18154m25622l22857K2670j18384m948
14142A1059400l57453k2375J03209m91234J3371k81692R519l89307n5063n7616
14132I530759J43432k11484n80425L74061k65801n08265K79911n28279j14049
14123H119860n1668O8067j2638l78657j13100J59280j48991M2408k61435q2336
$$ plain form
14189 27374220 26581929 25965910 25314163 25057038 24155826 23712893 23760965 22624733 22263796
14180 22263796 21851626 21102866 20673541 20172336 19724427 19400512 19142644 18874552 18341553
14171 18341553 17802803 17612104 17340618 17074318 16693251 16241241 15988384 15507218 14977245
14162 14977245 14975849 14717997 14709628 14108716 13966939 13837103 13797553 13000082 13365645 13169588
14152 13169588 12746988 12408339 12477386 12026695 11908541 11482919 11160062 11182732 11064348 11059400
14142 11059400 10701947 10679572 10782781 10291547 10304918 10023226 10032745 9643438 9588375 9530759
14132 9530759 9674191 9462707 8882282 9256343 8990542 8482277 8762188 8233909 8119860
14123 8119860 8068192 8136259 8123621 7744964 7631864 7791144 7642153 7684561 7423126 7340790
14113G340790j01620J458N9409m09567j40274L7104k66642J60476L04423n29953
14103F455604Q3538k06570M7955k29150m01121K69565M7251O400k71383N228J94923
14092F002240l13683j28481j12254j82006r6276L10476l31248l3979Q3678p1655
14082E126812J79487k84118q8495R5015K65535l72309k58892j18742J54604r1916
14072D606981l4006r9418L6774Q9668J99192m67688L0745l69762K67178j84876
14062D074788L35809n15253N73556l41859K75702o95331J72411P4280R6155l35990
14052C714268J33351o620l23146M4967L28851n26682K53626j47050j23254K21727
14042C570038q5096m17756M67435j25364L60861m74981K18325n72601K89726l5846
$$ plain form
14113 7340790 7239170 7240628 7300037 6890470 6750196 6787300 6520658 6681134 6985557 6455604
14103 6455604 6539142 6332572 6380527 6151377 5750256 6019821 6067072 6073472 5802089 5807317 6002240
14092 6002240 5688557 5560076 5447822 5265816 5169540 5480016 5148768 5114789 5198467 5126812
14082 5126812 5306299 5022181 4933686 5028701 5294236 4921927 4663035 4544293 4698897 4606981
14072 4606981 4572975 4473557 4510331 4599999 4799191 4331503 4362248 3992486 4259664 4074788
14062 4074788 4410597 3895344 4468900 4127041 4402743 3707412 3879823 3954103 4050258 3714268
14052 3714268 3847619 3840999 3517853 3562820 3891671 3364989 3618615 3471565 3348311 3570038
14042 3570038 3484942 3067186 3534621 3409257 3770118 3295137 3513462 2940861 3230587 3194741
14032C194741L48670m27150O6920K37472l42595J11730j12097k03242j73439K65603
14022B966613j72537j9981M49187o30668R6269j9116L91791p51691N6114Q7608
14012B453589K12616k90654p1900M62536k63998R1966l88120J59933j64523K45338
14002B446783j2211j14308L6571j84465j1962J14207m87872L71707m19947L38769
13992B077272j70028K62423o7640R75657J695172O237399K3885107J6661201k4904781
13983B6651782j2663310n411925k183763j504262o18109m84299k84823k09743
13975C291548k47832m36623L93561k42159N9327m68386K61131N7000j23947J7118
13965B560738k36754j87467j02392L90900n0942l25746J73969R0609k50823p2862
$$ plain form
14032 3194741 3543411 3116261 3183181 3420653 3078058 3189788 3077691 2874449 2701010 2966613
14022 2966613 2794076 2774095 3223282 2592614 2688883 2669767 3061558 2309867 2365981 2453589
14012 2453589 2666205 2375551 2303651 2766187 2502189 2594155 2206035 2365968 2201445 2446783
14002 2446783 2434572 2320264 2356835 2172370 2160408 2274615 1786743 2158450 1738503 2077272
13992 2077272 1907244 2169667 2102027 3077684 4772856 11010255 34895362 51556563 26651782
13983 26651782 13988472 8576547 6392784 4888522 4270413 3786114 3501291 3291548
13975 3291548 3043716 2607093 3000654 2758495 2817822 2349436 2610567 2667567 2543620 2560738
13965 2560738 2323984 2136517 2034125 2425025 2374083 2048337 2222306 2312915 2062092 1989230
13955A989230N31645m11665m47418L03947j12782L33393k29826j79831L67433
13946B144126n5352j81888M394J68283k05469J0636J81710l20857J81447k03113
13936A723917P5480M0016j07619Q4161j4517j9975n4384m40967M46303j84371
13926A548044k40462K28342J0520j67525N05994p9297Q6276m29502O6510k99815
13916A229085L31427j06066J37472o7978L5284j20165J00262N6795J01487N8222
13906A755825o22570K50206J68266k45737J02492n5734M9207k46578L22812J0743
13896A488932l60489L98855p6369l26670p3097J616M86174l59030J17228J58051
13886A455201l26844l600K08546q7078j25303L03219r9885J53687j94804m41440
$$ plain form
13955 1989230 2520875 2109210 1661792 1965739 1852957 2186350 1956524 1776693 2144126
13946 2144126 2088774 1906886 1911280 2079563 1874094 1884730 2066440 1745583 1927030 1723917
13936 1723917 1799397 1839413 1731794 1815955 1801438 1781463 1727079 1286112 1732415 1548044
13926 1548044 1307582 1535924 1546444 1378919 1884913 1805616 1891892 1462390 1528900 1229085
13916 1229085 1560512 1454446 1591918 1523940 1559224 1439059 1539321 1596116 1697603 1755825
13906 1755825 1133255 1383461 1551727 1305990 1408482 1352748 1401955 1155377 1478189 1488932
13896 1488932 1128443 1527298 1450929 1124259 1051162 1052778 1538952 1179922 1297150 1455201
13886 1455201 1128357 1124757 1333303 1246225 1120922 1424141 1324256 1477943 1283139 841699
13876H41699M59281j56682O1097L0243k96968R4330Q0718Q6306k00308m6121J75824
13865A129419O0908J0783k08233O0375K40612m3790j72013N3243p5484j44685
13855I11135m9623M01885k87672M4905J28006j08006J7261J8179l36088K73942
13845A013924R4652l52513K52669N2503j99366P9336P5781J30175l20408N09854
13835A336607j97323k37077K06977j73722j36103Q3963Q1841O6484k58721K33025
13825A005951Q5762E44255J15843R636j6801m3140L28536o1158J55306k35326
13815G97151j6791j27074K20464m9511M9599k34997J73258J32715j28109L26710
13805A143415k34669C98662N08752j39465j95841O4913J37459J38307j52934J45585
$$ plain form
13876 841699 1300980 1144298 1205395 1235638 938670 1033000 1113718 1200024 999716 953595 1129419
13865 1129419 1190327 1201110 992877 1053252 1293864 1250074 1078061 1131304 1055820 911135
13855 911135 861512 1263397 975725 1020630 1148636 1040630 1057891 1076070 739982 1013924
13845 1013924 1108576 756063 1008732 1061235 861869 941205 1016986 1147161 826753 1336607
13835 1336607 1139284 902207 1109184 935462 799359 883322 965163 1031647 772926 1005951
13825 1005951 1091713 544255 660098 669734 652933 609793 938329 877171 1032477 797151
13815 797151 780360 653286 873750 824239 873838 638841 812099 944814 816705 1143415
13805 1143415 908746 398662 907414 767949 572108 637021 774480 912787 759853 905438
13795I05438k11715L54234q6959l07910J67347C71050L96446O7039r4791L83508
13785A123252k52029l54230J86213L72348r0592m26457K27213L34186p5659m41760
13775F02485J51127K42754k92024k02846K68323N2693j36771Q8373J7666J46102
13765I37882N2168p1398k08236j15260J12981N7136J56014J5135l76778K92218
13755H51862j73518P1552n7391j08524K97820k69884p164k35920L29879L66424
13745A065136k79357k62854j33414P09207D88973R4075l226K19373j72543k58726
13735C67926j6407L32996j41535J22369k37543O0531K34427N3398j05205j4801
13725F56156l6288m5930J19662j08315k44125K34354Q1971j73230K6475k34243
$$ plain form
13795 905438 693723 1047957 960998 653088 820435 371050 767496 834535 739744 1123252
13785 1123252 871223 516993 703206 1075554 984962 558505 785718 1119904 1044245 602485
13775 602485 753612 996366 704342 501496 769819 822512 685741 774114 791780 937882
13765 937882 990050 918652 710416 595156 708137 765273 921287 936422 559644 851862
13755 851862 678344 749896 692505 583981 881801 611917 604753 368833 698712 1065136
13745 1065136 785779 522925 389511 1098718 488973 583048 579822 799195 626652 367926
13735 367926 351519 684515 542980 665349 427806 488337 722764 776162 670957 656156
13725 656156 619868 573938 693600 585285 341160 575514 657485 484255 510730 276487
13715B76487L25627J2586R2921B88774M55632k39669j46701N78475B71726J31278
13705D03004J41561j9148R7650j48217M45220B70013O5680j60269K32221K88266
13695F95911k62203j82482N1219K15542O7241K21537n5710B98205p6625L88401
13685F09981l6446k43188L55445L17158D12372r5362L78445j466j41149A04912
13674G35524B80023L16540B60637J60216P1543J74638j47851l3727o7000p8761
13664C39695J48871N5723M2247N5070j67903n6314R7919k42270J86512j23372
13654C36178L97285A61602N08841j91667k08093K88441k30108p3405A17929N84829
13644G02758A95992J74084M39248A08999K11224J8258m5562K57528B01726L68026
$$ plain form
13715 276487 602114 614700 707621 288774 744406 504737 358036 936511 271726 403004
13705 403004 544565 525417 623067 474850 920070 270013 335693 175424 407645 695911
13695 695911 433708 251226 302445 517987 585228 806765 751055 298205 221580 609981
13685 609981 573535 330347 685792 1002950 412372 317010 695455 693989 552840 104912
13674 735524 280023 596563 260637 420853 492396 667034 519183 485456 418456 339695
13664 339695 488566 544289 586536 641606 473703 417389 515308 273038 459550 336178
13654 336178 733463 161602 670443 478776 270683 559124 329016 255611 117929 702758
13644 702758 195992 370076 809324 108999 320223 338481 292919 550447 201726 569752
13634E69752k66805L29253B86048L41729l10456J66279j86542K51402l2246A81093
13623E55018J01985A81192L30830B16342K82879j31769A81343K61545j55633k2186
13613B65069I7067L83226p4826L05654k59801M2256B19239J48811O5517j53908
13603B79659l9935k9716K43535j8054J07123B16386J04727K31678K1948k33382
13593C41357n8729r0347J09593I9956K29189n1172A25999N9007P9232m1296M50821
13582F73763j68601A48312K54256j69697J73405J27996k60070G3047N70925L7339
13572F81311B83880K6491K617A7592K33720O5710j57254q23M90740B39344B7986
13560A41603J39284E3164L97344j66101K41017j55281Q1312j7140m0251J08313
$$ plain form
13634 569752 302947 632200 286048 627777 317321 483600 297058 548460 516214 181093
13623 555018 657003 181192 512022 216342 499221 367452 181343 442888 287255 265069
13613 265069 97067 480293 405467 711121 451320 493576 219239 368050 433567 279659
13603 279659 239724 210008 453543 435489 542612 216386 321113 552791 574739 341357
13593 341357 282628 192281 301874 99956 329145 277973 125999 185006 264238 222942 673763
13582 673763 505162 148312 402568 232871 406276 534272 274202 73047 643972 681311
13572 681311 283880 310371 312988 17592 251312 317022 159768 158945 649685 239344 27986
13560 141603 280887 53164 450508 284407 525424 370143 451455 434315 394064 502377
13550E02377j38179H2328n133J39944n0341L31311j54352L4358D7872L17309j29065
13539B36116M06432B93101m9793a61194F09768B19342k9184N49029l14747K87962
13529G12402A85942K1914j01322K90991J67667k47257K1385M433A14800K79183
13519C93983N1609l6408o4344A4531N41711D2655K6271L58692j90634K39375B33908
13507A26595L63869e532C79072D9494J33114K67732j75513J73432k12433a55662
13496F6790P4573K76865j82855E2673J04676L48733k01799A06807L69232A82026
13485A1858K21232J15493Q4821A809J47844N6531a21972B64951J13920p0186A16328
13473A73214a11428H2840l2272J41694K42505A16504N7545K50276I4385O7082
$$ plain form
13550 502377 364198 82328 77195 217139 166798 498109 343757 378115 47872 365181 236116
13539 236116 642548 293101 243308 -161194 609768 219342 190158 739187 424440 712402
13529 712402 185942 207856 106534 397525 565192 317935 339320 343753 114800 393983
13519 393983 445592 409184 344840 14531 556242 42655 68926 427618 236984 476359 233908
13507 126595 490464 -5532 379072 49494 182608 450340 274827 448259 235826 -155662
13496 66790 141363 418228 235373 52673 157349 506082 304283 106807 476039 182026
13485 11858 233090 348583 433404 1809 149653 206184 -121972 264951 378871 308685 116328
13473 173214 -111428 82840 50568 192262 434767 116504 174049 424325 94385 161467
13463A61467K97849G1601L0016K63374A7392L49538F1216K36503F3448J69866
13453B33314r5903a07455C28533K060A34325N8740K58496A70334L14141j39992
13443C44483O446r5347H3190K60051G3437a02622c1782G6498M15053B26439K01613
13432D28052A25344M88822B63178N4569a74722B6206K84562G5099l5994R1170
13422A30275R3344j8518J35833J44351C6388K24720A04728M05547k03563n9042
13412B47670c1161k6453B70118j02596G4892N375M09713B10395K8423J16374e332
13400A66399J11554b52245I3465q292K43867K251c1068D28225k5027E8757J24892
13389A83649i3964A72604G6394K12951P5448K08710B01412K89830j66203Q3313
$$ plain form
13463 161467 459316 71601 101617 364991 17392 366930 61216 297719 63448 233314
13453 233314 137411 -107455 328533 330593 134325 193065 451561 170334 484475 344483
13443 344483 350929 255582 83190 343241 73437 -102622 -31782 76498 491551 226439 428052
13432 428052 125344 614166 263178 317747 -174722 26206 310768 75099 39105 130275
13422 130275 223619 205101 340934 485285 36388 261108 104728 510275 306712 247670
13412 247670 -31161 -57614 270118 167522 74892 80267 489980 210395 238818 355192 -5332
13400 166399 277953 -252245 93465 85173 329040 331291 -31068 428225 403198 58757 183649
13389 183649 -93964 172604 76394 289345 364793 573503 201412 491242 325039 408352
13379D08352A23222K49702A55859J48768A47906i0886I3307J47130J93117j51535
13369B82019G4182a43456e1305D94253k45445q7765K62364F6055d8050q5583B90344
13357B3352R0473F949R0973b41442b1032B29212J9678C9627K4161R2155J0017
13346A65960J29571E4377R0271K77029q9265q5720M821J61646m0686p4220J74992
13335D73245A21253R9758K09773j86276j20408K53370j88560O5156a1382H132
13324D50173G6468J26516J72826B8198Q9743J02089J71672A5569J90908B9141
13313A06327k4953R2636d105F853J80445K05130I6714K05971J10534f040A71432
13301B69592A8443c3914B31538o0748a18096A61425K80829a00397F8940L36978
$$ plain form
13379 408352 123222 372924 155859 304627 147906 -90886 93307 240437 433554 282019
13369 282019 74182 -143456 -51305 494253 248808 161043 423407 66055 -48050 -133633 290344
13357 23352 113825 6949 97922 -241442 -21032 229212 248890 39627 63788 155943 165960
13346 165960 295531 54377 144648 421677 332412 246692 251513 413159 372473 298253 473245
13335 473245 121253 221011 430784 244508 124100 377470 188910 254066 -11382 8132
13324 450173 76468 202984 375810 28198 117941 220030 391702 15569 206477 29141
13313 106327 81374 174010 -4105 6853 187298 392428 96714 302685 413219 -6040 171432
13301 269592 18443 -33914 231538 170790 -118096 161425 442254 -100397 68940 405918
13291D05918C3691e4186k18496E4399J10225P6979j20646C3127d3128D51111k7193
13280D23918A24739Q4558a64544K1878G1931P9683A3644L46843I0162a4145B38688
13268G3880J55997p6294N5049o8243b62207a5792G5911A9051g8194A02599c20344
13256b42944B90857j14532j7138N1931M9867M6678L8411a04562B51045F5801L7256
13245A03057o702b16563A74147L8319d1382j13321B60172l3488e9394G6577A9514
13233i246D38526j74187j28722K7490O806e2051r9339C46198j16891B2977Q6880
13222A09857J62490J79172p2960b11335B80115M3725O5424A51118n5235L1142
13212A27025a73839B95861l8978J32890D167a52919A50981A7664K9771D687a0074
$$ plain form
13291 405918 33691 -54186 -272682 54399 164624 241603 120957 33127 -43128 451111 423918
13280 423918 124739 209297 -164544 -142666 71931 151614 13644 360487 90162 -14145 238688
13268 73880 229877 153583 208632 140389 -262207 -15792 75911 19051 -78194 102599 -320344
13256 -242944 290857 176325 159187 211118 260985 307663 346074 -104562 251045 65801 103057
13245 103057 96355 -216563 174147 212466 -41382 -154703 260172 226684 -59394 76577 19514
13233 -9246 438526 264339 135617 163107 169913 -52051 -151390 346198 229307 22977 109857
13222 109857 272347 451519 378559 -211335 280115 323840 389264 151118 95883 127025
13212 127025 -173839 295861 256883 389773 4167 -152919 150981 17664 47435 4687 -10074
13200h0750D14266j05766O1111J3328A05082l7764J21895p1233k0930b20909G6078
13188a48609B04748L109b88231B36195a09431A83165a13215C949J90919c01262
13177a74440B11460J11981A32511J5943J01595f4954J0817B27949a97983B31109
13166d0915B10422D1138a83364A78312a46424B38311m6395D2610J88048L9941
13156B70599A12203K1754k0725D1664K29230a70823I7703L98747A03294F312K9479
13145C5791c24195C01783i4654C1562c2914J5597G722K61356A33075d967l20131
13134c25098h3892D9368K7126K76149A14834K1203K93714j83203N6799b09619
13123e0034A34408a24820K208A79545H8815k3660J38638K8003A0784L04912i541
$$ plain form
13200 -80750 414266 308500 369611 382939 105082 67318 189213 117980 97050 -220909 76078
13188 -148609 204748 207857 -288231 236195 -109431 183165 -113215 3949 194868 -301262
13177 -174440 211460 323441 132511 148454 250049 -64954 -54137 227949 -197983 231109
13166 -40915 210422 41138 -183364 178312 -146424 238311 191916 42610 230658 270599
13156 270599 112203 133957 113232 41664 270894 -170823 97703 496450 103294 6312 35791
13145 35791 -324195 301783 -94654 31562 -32914 -17317 7722 269078 133075 -4967 -325098
13134 -325098 -83892 49368 76494 352643 114834 136037 429751 246548 303347 -209619
13123 -50034 134408 -124820 -122612 179545 88815 65155 203793 231796 10784 315696 -9541
13111C59O1015J26699b3863A27198b90807A4478c7133D48803A38701a691k28228
13100b29919F8618B3787g9243A24286E2720c19952A01756f7543B12562L6878H5438
13088B96459h869G0890a75793p0165A62696j0609J27046d8095A20991J91380b83650
13076E1902J1880L6024J9800g4636L6191D23576j30604A4286L57846a0868B31310
13064C1113A0646M3737K90518a52220D56130a1461n7813a0755B84234l7926A9537
13052A37453E3656K55089n1270I3261a23162j45441A14124R4443a43404k3306
13042a66710C06760P356r5488G4442e3736A67521a43609f3263r6087H310J08584
13031A16894a89533m7649A04054K68450A3501M77328a1468q2554D02717j66942
$$ plain form
13111 359 61374 188073 -23863 127198 -290807 14478 -37133 448803 138701 -1691 -229919
13100 -229919 68618 23787 -79243 124286 52720 -319952 101756 -67543 212562 249440 85438
13088 296459 -8869 70890 -175793 -245958 162696 152087 279133 -48095 120991 312371 -283650
13076 51902 63782 99806 119606 -74636 -38445 423576 292972 14286 372132 -10868 231310
13064 31113 10646 54383 344901 -152220 456130 -11461 -69274 -10755 284234 246308 19537
13052 137453 53656 308745 257475 93261 -123162 -268603 114124 208567 -143404 -166710
13042 -166710 306760 314116 218628 74442 -53736 167521 -143609 -63263 -159350 8310 116894
13031 116894 -189533 -237182 104054 372504 13501 490829 -11468 -94022 402717 235775
13021B35775o5451f4874J8483A81690K13850A56837J51457q3532a77743A55232
13010A56771Q13c741B50028j2178o367b3473C31113I9056K86268j60944e6514
12998f1681C02397m1097a23060C44544h1033B41275e2144B79c78010d6988H2933
12986d8367k10682B27680J73211j08550b07460B91022E7949b1796G8704d025k767
12975f792B78446j7082C2862a5351A84973F7728O9828A0542K95400B9975g7610
12963A34026b81678B75501l4892a43548M3949A4511f6989A14243K47189a08404
12952F02K65689a18195M3562B09792d0713l9323c3384A21273a19893j07329d5445
12940a94795B13317a12953H5454i4209l96570b41902g2277B82372b6141A59722
$$ plain form
13021 235775 170324 -64874 -46391 181690 395540 156837 308294 224762 -177743 155232
13010 156771 157584 -3741 250028 237850 231483 -23473 331113 99056 385324 224380 -56514
12998 -61681 302397 261300 -123060 344544 -81033 241275 -52144 279 -378010 -46988 82933
12986 -48367 -259049 227680 400891 292341 -207460 291022 57949 -21796 78704 -4025 -6792
12975 -6792 278446 261364 32862 -15351 184973 67728 137556 10542 305942 29975 -77610
12963 134026 -281678 275501 240609 -143548 -99599 14511 -66989 114243 361432 -108404
12952 602 266291 -118195 -74633 209792 -40713 -80036 -33384 121273 -119893 -227222 -45445
12940 -194795 213317 -112953 85454 -94209 -490779 -241902 -72277 282372 -26141 159722
12929D8585J83831a27644c6813J4350a693A56539d1190A17679J98804g180B28065
12917A60447J808h5699D9099N5299C8311M7139L34275a0923A32079J07064a78611
12905a29066A47436e6745D48824i0641H8307a09521c6535B35354b91784O7222
12895b24562B67979m2439e4012B42819a76882L6262f5924c1153j6322A05160K16046
12884C21206a15685C3945K3548k1263K60235d8780a6657j84150A28758a05382
12873a4557j56162A99475B8525Q4128C7185a56057A50903O599h4891A26534e5490
12861C79666R1080f3663h603j19312m1475A41864L795F8732K29054a54408A40951
12849g4407E5325K49786I1998b57980E1627a08445q2530B82402F0140a25638A09727
$$ plain form
12929 48585 232416 -127644 -36813 -22463 -1693 156539 -41190 117679 316483 -7180 228065
12917 160447 162255 -85699 49099 104398 38311 85450 419725 -10923 132079 239143 -178611
12905 -129066 147436 -56745 448824 -90641 88307 -109521 -36535 235354 -291784 -224562
12895 -224562 267979 225540 -54012 242819 -176882 -140620 -65924 -31153 -47475 105160 321206
12884 321206 -115685 33945 57493 36230 296465 -48780 -16657 -200807 128758 -105382
12873 -14557 -170719 199475 28525 112653 37185 -156057 150903 157502 -84891 126534 -55490
12861 379666 470746 -63663 -8603 -127915 -169390 141864 145659 68732 297786 -154408 140951
12849 -74407 55325 305111 91998 -257980 51627 -108445 -190975 282402 60140 -125638 109727
12837f2679G367K18152c397B21404d5371A90858d2880F8784h9904l445A20648
12825C8316b99005R8408R3464B95772a5677l51149A5978d5911l4124A07632a55122
12813b29848a4196j24272K1595p7666A64398g9658A33635c01835I8855Q9652a22477
12801b78163e5189j8082D10047A17669f4579j9803c4888c175l2792H8619d8032
12789a4224A3000a65763L4008A09081a41758C8544I571i0811M1148A28363L2124
12778A60487A8618a27705A14835J3133f3566K1995E2435J8772b51211A18482k8660
12767H9822J89775I7384N802c5277B70029c3585B09621a7623j181q3561A79590
12755a4314o1757m18809a7332j11104D39767k00433a23790I2324k372b14764C06369
$$ plain form
12837 -62679 7367 225519 -3397 221404 -45371 190858 -42880 68784 -89904 -93349 120648
12825 38316 -299005 -200597 -107133 295772 -15677 -366826 15978 -45911 -80035 107632 -155122
12813 -229848 -14196 -138468 -116873 -194539 164398 -79658 133635 -301835 98855 188507 -122477
12801 -278163 -55189 -73271 410047 117669 -64579 -84382 -34888 -3175 -35967 88619 -48032
12789 -14224 13000 -165763 -131755 109081 -141758 38544 9571 -90811 -49663 128363 160487
12778 160487 18618 -127705 114835 127968 -63566 -41571 52435 71207 -251211 118482 89822
12767 89822 279597 97384 103186 -35277 270029 -33585 209621 -17623 -18804 -102365 179590
12755 -14314 -76071 -494880 -17332 -128436 439767 239334 -123790 92324 89952 -214764 306369
12743b25212C86642A01600b8925j86104E6736K11690J13105l5346A64388i7159
12732E2548a6508B03585b48454e4355C15040A32979M8901a25808k30638C64570
12721e1235C369M3568b20789G6355a19464a238C52342b471j44773n0764H1619
12709B14407B1127J33043N586M0691m8474R518J38025A24821g8377I4516Q655
12698A03171a05979F6981a2125H9206K42783j38695n2312b22235R8729d8292K58
12687d8034C81896A8631b27020I9273K45208A55862K3261k7751K17967d4575C4602
12675A83466o1674J50363g2171k65771D4847f8537A34145J91892b7915o016j01314
12664a35245M8930B95406a74641g5685j27747E0034a5680A86794J45267a79775
$$ plain form
12743 -225212 386642 101600 -28925 -215029 56736 268426 381531 346185 164388 -97159
12732 52548 -16508 203585 -248454 -54355 315040 132979 181880 -125808 -356446 364570
12721 -51235 3369 46937 -220789 76355 -119464 -1238 352342 -2471 -147244 -198008 81619
12709 214407 21127 154170 159756 200447 151973 161491 299516 124821 -78377 94516 103171
12698 103171 -105979 66981 -12125 89206 331989 193294 140982 -222235 -123506 -48292 -48034
12687 -48034 381896 18631 -227020 99273 344481 155862 179123 151372 369339 -44575 34602
12675 183466 121792 272155 -72171 -337942 44847 -68537 134145 326037 -27915 -33931 -135245
12664 -135245 -86315 295406 -174641 -75685 -203432 50034 -15680 186794 332061 -179775
12653c1318B19546H4120f5769A28287k9148l48L22175a44999N7699K2248l16766
12642c81818A89053g2084D73566A07444a2554A4160a8845k58331d4130H7517e6018
12630A34500K23451p6197A29556N9247L68395a65663A14256m8936K55758d3540
12619D27473j03913j05742p5474h010A98737a0760G5282c4616r4921A2885N7028
12608F9913J41281E1459J67276F038i0753b2198B98419j18748H5529a05162A26224
12596b726B38942N3057d0232N973C10231p0212j9593q0758h6195A79308K596E891
12583B5116q320M5062J16639c1912A48832O1033h8798H5836I248O4072k2984K1542
12571G1878a19706B80340j10496b63725B28348p4730b46271B84786J0401e4956
$$ plain form
12653 -31318 219546 84120 -65769 128287 99139 98791 420966 -144999 -87300 -65052 -381818
12642 -381818 189053 -72084 473566 107444 -12554 14160 -18845 -277176 -44130 87517 -56018
12630 134500 357951 281754 129556 188803 557198 -165663 114256 65320 321078 -43540
12619 427473 323560 217818 142344 -8010 198737 -10760 75282 -34616 -129537 12885 69913
12608 69913 211194 51459 218735 6038 -90753 -22198 298419 179671 85529 -105162 126224
12596 -2726 238942 291999 -40232 -34259 310231 240019 220426 139668 -86195 179308 181904 5891
12583 25116 16796 61858 178497 -31912 148832 209865 -88798 85836 9248 73320 50336 71878
12571 71878 -119706 280340 169844 -263725 228348 153618 -246271 284786 295187 -54956
12560E4714K39225j14049f995k78983C6095a14428j21785A48080b58039e2581
12549I5763Q3640o0252K139B2564f3003C3119a35674D9811K187d907l9513a061
12536b02038A98679K5267o3765b9400C06697A08169A7297L58539h1771K3051A5088
12524A16886a03143d5978A32073i5385k18357J20932A70018I059M705b30434p3666
12513c04100A07820Q2815a61825e5327C4094j3238d5623j2123A7977b25592g0673
12501C90622J55660d0839B82799g1765A24249o0791a50021A22435d8497q0973
12491a29470I6713O2751b3463J790E7631P3821D0110O1516a1745B10232b02102
12479c77653a77984k52901a99816E7793O8321l5238a74974C31590b72709A50204
$$ plain form
12560 54714 293939 179890 -6995 -285978 36095 -114428 -236213 148080 -258039 -52581
12549 95763 179403 119151 121290 22564 -63003 33119 -135674 49811 51998 -4907 -44420 -1061
12536 -202038 198679 223946 160181 -29400 306697 108169 17297 375836 -81771 -58720 15088
12524 116886 -103143 -45978 132073 -95385 -313742 -192810 170018 9059 13764 -230434 -304100
12513 -304100 107820 190635 -161825 -55327 34094 20856 -45623 -57746 17977 -225592 -70673
12501 390622 546282 -40839 282799 -71765 124249 63458 -150021 122435 -48497 -129470
12491 -129470 96713 159464 -23463 -21673 57631 131452 40110 101626 -11745 210232 -202102
12479 -377653 -177984 -430885 -199816 57793 126114 90876 -174974 331590 -272709 150204
12468c53886B94772C9210g0872H7365b63438C02446c09823c1904j60563D4532
12457C02026g5404A14011B3834h1254H1647n415K32426G6129a59916A5926J45826
12446A61752b95311I2656c7168A45731B9125K12565d60961A119J55213c89164
12435I8504h7319f56j06719A94445I0752j099l8914j6794J96078c3484M216k07033
12423b36301I2418J7441h0318A46980o5065M2977J94578H3772O4837c37j56476
12412a56813n1733Q808f3275B12880b31914A63411R622B393b0094A13124n807
12401A07317c000j12797A07853J14147D1716c1507l10649H9210J13936a3243A86993
12389B29461c09823a32068K5333M5979A33372i6878p9699I4343f1933r0377A88598
$$ plain form
12468 -353886 294772 39210 -70872 87365 -263438 302446 -309823 -31904 -192467 44532
12457 302026 -75404 114011 23834 -81254 81647 76232 308658 76129 -159916 15926 161752
12446 161752 -295311 92656 -37168 145731 29125 241690 -460961 1119 156332 -389164
12435 98504 -87319 -656 -107375 194445 90752 89653 50739 33945 230023 -33484 -29268 -236301
12423 -236301 92418 109859 -80318 146980 81915 124892 319470 83772 148609 -337 -156813
12412 -156813 -208546 -199738 -63275 212880 -231914 163411 173033 2393 -20094 113124 107317
12401 107317 -3000 -115797 107853 222000 41716 -31507 -342156 89210 203146 -13243 186993
12389 229461 -309823 -132068 -106735 -60756 133372 -96878 -176577 94343 -61933 -152310 188598
12377b84788f8710j33229P1242j85485B40085k3001o7105k8512K1913l5836a12864
12365C29744D9832J68390M5486A13172b59573e8243r4032d045j89205D8164J11946
12354A60110m83b44550A20646J75922j04350i9410k11592A12693a62281B40626
12343a92185D26743a49990j40352A923L2567L3487f7521C00105d9543q374A00528
12331a93101r6255B72284a1191k17328A01042b72034B44825c902j45950q8254
12321b38106D0856a92386q9099E64306k62177f7093B58501j3072B6580K30188
12311B56768C2804a73464j22593g915A09479a84605C73755E5111k5068L6474a88622
12299A78978a16855j06055b8472C7695a43209K5172N1548j72366E57483a73906
$$ plain form
12377 -284788 -68710 -201939 -130697 -316182 240085 217084 149979 121467 143380 107544 -112864
12365 329744 49832 218222 263708 113172 -259573 -58243 -152275 -4045 -193250 48164 160110
12354 160110 159627 -244550 120646 296568 192218 -99410 -311002 112693 -162281 240626
12343 -192185 426743 -149990 -290342 1923 34490 67977 -67521 300105 -49543 -57917 100528
12331 -193101 -289356 272284 -11191 -228519 101042 -272034 244825 -3902 -149852 -238106
12321 -238106 40856 -192386 -281485 564306 302129 -67093 258501 245429 26580 256768
12311 256768 32804 -173464 -296057 -7915 109479 -184605 373755 55111 30043 66517 -188622
12299 178978 -116855 -222910 -28472 37695 -143209 -118037 -66489 -238855 557483 -173906
12288E6545K56480K91376H0054c2008r5476g311l9849A00781J10807p1049Q9785
12277B30324a91435f0563B97460j7057F8233K56094a29155C28480j32095G4759
12266F3547J36641L62286h735j01139B76825J44085A67515n3958K09038A35840
12255B6928K7593P6850K12670G6479J33120Q0854j09405a26566B48169Q1752p5267
12244B54654e9395J8435D29952G6883e2539A57399a57306d9533C27263I4169h5384
12232c3640r9640E17005k30499O7163I8084A6274J29262K58436j56517J02438
12222C49893e823B38972k4647l5827C9720J47153J31315j06224P6533d4858c943
12210B38213J23531c04351A71377J17363K3352A39699B4105a10422A7028M03438
$$ plain form
12288 56545 313025 604401 80054 -32008 -127484 -7311 -47160 100781 211588 140539 230324
12277 230324 -191435 -60563 297460 280403 68233 324327 -129155 328480 196385 74759
12266 63547 200188 562474 -8735 -109874 276825 420910 167515 113557 322595 135840
12255 26928 54521 131371 344041 76479 209599 290453 181048 -126566 248169 329921 254654
12244 254654 -59395 -40960 429952 76883 -52539 157399 -157306 -49533 327263 94169 -85384
12232 -33640 -133280 517005 286506 353669 98084 16274 145536 403972 247455 349893
12222 349893 -5823 238972 214325 178498 39720 186873 318188 211964 288497 -44858 -3943
12210 238213 361744 -304351 171377 288740 312092 139699 24105 -110422 17028 420466
12200D20466A19618D2859g7381B99279j01185J83662J79635b87262B87288j39089
12190A48199C5246K29160L5991j9992I7734K8386K41576i6382E7433J50238D7928
12178A96031h1683F5287j6429M04984B10709J35508a25864G1045R7650K62078
12168D30773j285R3803A43857D4827J46167J30256j58110L8448K29158I2080K37601
12157C29681A43773k3761q979J06807P011J27024A27930c0141A11152g8151B9950
12145C69414j5647l3817H2889K6794a93191D00738O5410j45352e5359M343A64630
12133i1093C1386a5761D4250b01328G6332e3147B09843i1730k96368D5221a07892
12121G9767C1039a8794o9709C32053A03964k4375b53511B44877g8192j11863m5352
$$ plain form
12200 420466 119618 42859 -77381 299279 198094 381756 561391 -287262 287288 148199
12190 148199 35246 264406 300397 280405 97734 126120 367696 -96382 57433 207671 47928
12178 196031 -81683 65287 48858 453842 210709 346217 -125864 71045 168695 430773
12168 430773 429488 523291 143857 44827 190994 321250 163140 201588 430746 92080 329681
12157 329681 143773 120012 111033 217840 224851 351875 127930 -30141 111152 -78151 29950
12145 369414 353767 319950 82889 109683 -193191 400738 466148 320796 -55359 -51016 164630
12133 -91093 31386 -15761 44250 -201328 76332 -53147 209843 -91730 -388098 45221 -107892
12121 79767 31039 -18794 -88503 332053 103964 79589 -253511 244877 -78192 -190055 -235407
12110b35407e9263r4100r8309k6261B58522j11912J01813p9889a80103C8606a71857
12098A31987a53990j605j44687N5412C78610b2682j24369G6799a35580k5618N9835
12087a01363K5489j41819a04447A08458e5393m55901B0777K15808a79786C40188
12076F09045J589006k40160D55974A52386c552A44175g7458p8777A44858B8368
12065d8440B32865G621K90906A28313A8806i836D20422A48831a15449M8440i961
12053D139L12395g3472k20996E4347c66636E9058b49180a18664A03333k8380h277
12041b23794A0759c61375A96879A64b47541A03210J06686l8122a66168A54666
12030A04318B2815b4839k51206J77J09749b0244j2735A00102g8164l447L164B44564
$$ plain form
12110 -235407 -59263 -153363 -251672 -277933 258522 146610 248423 168534 -180103 38606 -171857
12098 131987 -153990 -155595 -300282 -244870 378610 -22682 -147051 76799 -135580 -161198 -101363
12087 -101363 -75874 -217693 -104447 108458 -55393 -511294 20777 236585 -179786 340188
12076 609045 2198051 1957891 455974 152386 -3552 144175 -77458 -156235 144858 28368
12065 -48440 232865 7621 298527 128313 18806 -9836 420422 148831 -115449 -67009 -9961
12053 4139 316534 -73472 -294468 54347 -366636 59058 -249180 -118664 103333 74953 -8277
12041 -223794 10759 -361375 196879 164 -247541 103210 209896 171774 -166168 154666
12030 104318 22815 -24839 -276045 -275868 -166119 -20244 -32979 100102 -78164 -81611 -78447 244564
12017A50449h1594r6607D4540c8189j98290b742j26799D8387K38895A5548d6928
12005B26406a79486A27559C5323P9321g1308l41626B34126J68870A98332i6186
11994a83290j30042d2704H9956f4740D9182L369d56796H1658c51849A78919b6539
11982b86479r3498I1748a43597M1550j23048j72818E8536b3693A02853A5949b40019
11970f4049G3250J87699H8305B8001e3000n106k21758A8628i4194l02414D5033
11958A98619D1939K37102A15596g8718n899q7559I376b16391A95818d2106J842
11947d0264A17272M2398c689A42864a48901A39221a05228H3871j7753i7822A52407
11935c0424A35439i6580m4971C84009A32793M7513b35557F5428b81048i0637B04876
$$ plain form
12017 150449 -81594 -178201 44540 -38189 -236479 -2742 -129541 48387 287282 15548 -46928
12005 226406 -179486 127559 35323 114644 -71308 -412934 234126 402996 198332 -96186
11994 -183290 -313332 -42704 89956 -64740 49182 52551 -456796 81658 -351849 178919 -26539
11982 -286479 -379977 91748 -143597 -102047 -225095 -397913 58536 -23693 102853 15949 -240019
11970 -64049 73250 260949 88305 28001 -53000 -58106 -279864 18628 -94194 -396608 45033
11958 198619 41939 279041 115596 -78718 -84617 -172176 9376 -216391 195818 -42106 -40264
11947 -40264 117272 159670 -3689 142864 -148901 139221 -105228 83871 66118 -97822 152407
11935 -30424 135439 -96580 -141551 384009 132793 180306 -235557 65428 -281048 -90637 204876
11923h7491k2659B8314g4399J5434A76166L171q2328L9667g1682b8717k27470
11912b56187A30299A7601O0846i8299K8630K6825k2386a8568a574j2349E6986
11900a964n4378h439k87901c9718R490B74781e8593A27814J31961c8113A08749
11888b96272q3818J66636h8948D5437b22952g235F3956a6023k64353J11243f186
11876b9420l1866A7393K48202a44605B97784a25730A12200b13978I7136b87671
11865E0702J88859K9177b62560A30979f0143A71406b08197L7690D3584L91285
11855D34869b91652A7806P905J56122h2866a0681A39159M0550G0516K9263i0633
11843a8545A29780l5032k422b61033A66944Q396K665q8483c2072l34619A1361
$$ plain form
11923 -87491 -110150 28314 -74399 -58965 176166 179337 97009 136676 -71682 -28717 -256187
11912 -256187 130299 17601 78447 -98299 -69669 -42844 -65230 -18568 -1574 -13923 56986
11900 -1964 -56342 -8439 -296340 -39718 -30228 274781 -58593 127814 259775 -38113 108749
11888 -296272 -380090 -213454 -88948 45437 -222952 -7235 63956 -16023 -280376 -169133 -6186
11876 -29420 -61286 17393 265595 -144605 297784 -125730 112200 -213978 97136 -287671
11865 50702 239561 268738 -262560 130979 -60143 171406 -208197 -170507 43584 434869
11855 434869 -291652 17806 25711 181833 -82866 -10681 139159 179709 70516 99779 -90633
11843 -18545 129780 94748 92326 -261033 166944 175340 178005 89522 -32072 -366691 11361
11831I5242B8441J2484b27724P0706A23502E1167k346f6469b4473F0610B562f4233
11818G2680a29258A56930a13422A28363C9630Q0219n854d7581A30440m7377a30152
11806F4043c8363B11164a21961e9926A70630a78114A00355a77778A12846a49308
11795a71301c6193B67940n9685D0220M2104a39285e4334r3095O5009r2571A65549
11783b77222H0149d38573A14376d5125P399A62956o4782i1364C7842J73081p569
11772B03354I8434M3419a00330M0499j77046i9231b2147A6534P7422g7170k21305
11761b98475C02283E255g0803a7794m78546J7660C52726D9462J49369H7250I285
11749B92970b24180E0065I510e16256K33224J34456o919F9575e3298A75533b13472
$$ plain form
11831 95242 28441 40925 -227724 -157018 123502 51167 48821 -66469 -24473 60610 2562 -64233
11818 72680 -129258 156930 -113422 128363 39630 119849 113995 -47581 130440 83063 -130152
11806 64043 -38363 211164 -121961 -59926 170630 -178114 100355 -177778 112846 -149308
11795 -171301 -36193 267940 208255 40220 82324 -139285 -54334 -147429 -82420 -174991 165549
11783 -277222 80149 -438573 114376 -45125 -37726 162956 98174 -91364 37842 210923 203354
11772 203354 98434 141853 -100330 -59831 -236877 -99231 -22147 16534 93956 -77170 -298475
11761 -298475 302283 5255 -70803 -17794 -496340 -478680 352726 49462 198831 87250 9285
11749 292970 -224180 50065 9510 -516256 -283032 -148576 -155495 69575 -53298 175533 -213472
11737a2591C98095j89150a47670A97682J7973a23099E5557k4308h3800B56669
11726B52402e3749A31480m4589D116d8686A3930a20071A41020b3941A33218P2242
11715B05460m993a13081d4089A65565A512L57418j33923A07772a04907H1095b55965
11703B94781D4021a78203F4708J79742j953L34649A0251P2137a57384C83109b36715
11691A54844f5346D2612c1569H7605e1880B206g4231B63584o0511q9698O0672
11680A74047e4674A69419J17552q5094b57076L4000C0293e8549b4173k45328f9274
11668a33645H9012b90962A74218c9001j9422A48352n6969h7029E3326N4923K61255
11657C69504J51136g5161j98742c3680I9552b11317J03109K728B18005A9479c75426
$$ plain form
11737 -12591 398095 208945 -147670 197682 215655 -123099 55557 31249 -83800 256669
11726 252402 -53749 131480 86891 4116 -48686 13930 -120071 141020 -23941 133218 205460
11715 205460 200467 -113081 -44089 165565 1512 358930 225007 107772 -104907 81095 -255965
11703 294781 44021 -178203 64708 244450 242497 577146 10251 82388 -157384 383109 -236715
11691 154844 -65346 42612 -31569 87605 -51880 2206 -74231 263584 203073 113375 174047
11680 174047 -54674 169419 286971 201877 -257076 -223076 30293 -58549 -24173 -269501 -69274
11668 -133645 89012 -290962 174218 -39001 -58423 148352 91383 -87029 53326 108249 369504
11657 369504 520640 -75161 -273903 -33680 99552 -211317 -108208 -105480 218005 19479 -375426
11645a86523d1784P795B60181F8846h7302Q140D5003a92216C10521a67543C8645
11633b09051h4412J9164A45727a8281j24420d7754A72700O918N4461a26592B40546
11621A84667J8334C9355c2819A6814J29670o7722a67472G4531b22515O0690C8883
11609c24295A73999G4747b32358b3527B52645f8207B09441a31455B08952b760
11598G0824J57144b1903D9680J01281n87Q540d0247B19094b2468A07731D6888
11586b32464D5293J24117N7662J51602a52108A47082j8561b20655B15461a30218
11575A81784B6083J09297i0833C36646A61759J36745a02177B90115b4358A31567
11564B90087A18396J50890a19543G9053a90968Q7573B85735n3832J09346E9029
$$ plain form
11645 -186523 -41784 -33989 260181 68846 -87302 -79162 45003 -192216 310521 -167543 38645
11633 -209051 -84412 -65248 145727 -18281 -142701 -47754 172700 179618 234079 -126592 240546
11621 184667 203001 39355 -32819 16814 146484 78762 -167472 74531 -222515 -161825 38883
11609 -324295 173999 74747 -232358 -23527 252645 -68207 209441 -131455 208952 -2760
11598 70824 227968 -21903 49680 150961 150374 158914 -40247 219094 -22468 107731 46888
11586 -232464 45293 169410 227072 378674 -152108 147082 128521 -220655 215461 -130218
11575 181784 26083 135380 -90833 336646 161759 298504 -102177 290115 -24358 131567
11564 290087 118396 269286 -119543 79053 -190968 -103395 285735 231903 341249 59029
11553b8395G2748N1763a48681j31476A4724a8887j28903k6755C35951G626J58607
11542A66233b8244A31195O9755c7807j26747C91142j28836J43221b81801D24J28512
11531A28936k4493B2913K9058M9263N7243a83734g395B16493B6166Q0051N9349
11520A65566N468J15936A17318J57509e9795A00224q17J77563H750a30989f015
11508A41339B0093J29689E0551d7169B46795L2189k9127D4704e9382D5536J55424
11497B00960q8644L11226e0518B87696A15572R0485N1106n2066E0274M97714B36284
11485C00928q0282C0262J23699b122B65035K74402j20026i0140A63009K65198
11475D28207a40023I9662h3513F29676A94805j9516d9246C35018A60279K50519
$$ plain form
11553 -28395 72748 124511 -148681 -280157 14724 -18887 -147790 -174545 335951 7626 166233
11542 166233 -28244 131195 200950 -37807 -164554 391142 262306 405527 -281801 424 128936
11531 128936 104443 22913 51971 101234 158477 -183734 -7395 216493 26166 106217 165566
11520 165566 171034 286970 117318 274827 -59795 100224 99407 276970 8750 -130989 -6015
11508 141339 20093 149782 50551 -47169 246795 278984 249857 44704 -59382 45536 200960
11497 200960 112316 423542 -50518 287696 115572 206057 257163 205097 50274 547988 236284
11485 300928 220646 30262 153961 -2122 265035 539437 419411 -90140 163009 428207
11475 428207 -140023 99662 -83513 629676 194805 175289 -49246 335018 160279 410798
11465D10798Q0681H1641K0779c81934B92419p8318c8863B76055O0346D8952M9996
11454I8948K41311I8731a54021F2182M3333i9063A30724R2105j05921g5466A96182
11442a0754l92272F6835L538P8548j9419b05899d4296B65670A30515a77339A87365
11430h1561p3622C41606j51669c35194D90171B04723a27066l9381B19862J78842
11420C98704i0117j39185D5604a49825B10645G9475d6799k5725K2712D1789b0581
11408c6010C1015a27104D9308b56679A35214O5235g2712H9601e278p8445B73539
11396A42760b7129A07444b82161D17364j45665m8781a44959A15989b36992r6798
11386c33790A58552a95159i6747A55164a06361I7284c3804k02393c2121A1885
$$ plain form
11465 410798 491479 81641 102420 -381934 292419 214101 -38863 276055 336401 48952 98948
11454 98948 340259 98731 -154021 62182 105515 -99063 130724 222829 116908 -75466 196182
11442 -10754 -403026 66835 70373 148921 129502 -205899 -44296 265670 130515 -177339 187365
11430 -81561 -155183 341606 189937 -335194 490171 204723 -127066 -166447 219862 398704
11420 398704 -90117 -229302 45604 -149825 210645 79475 -46799 -72524 -49812 41789 -20581
11408 -36010 31015 -127104 49308 -256679 135214 200449 -72712 89601 -5278 -83723 273539
11396 142760 -27129 107444 -282161 417364 271699 222918 -144959 115989 -236992 -333790
11386 -333790 158552 -195159 -96747 155164 -106361 97284 -33804 -236197 -32121 11885
11375g0641D1210L5461a06037l1454A22162J89981C5094E169d5165E7339J65945
11364B23284J39942a91143Q6646H1139a21015B97869A20303L8574g8570c0716
11353a09329p7025H6391a40527e7569C12064A8451b11432B23219a31688A36119
11342D5649R7769O1j6153k0396a36603B4306b63965A76946O6086g7801p009j15996
11330b00806d8417k7281A50987b88079J38256B93956b65948E341c45993C57741
11319g3475A88160I1297a51927B66083A07954a17533G9940L45650A86863b01482
11308a78309j61174g9941k85053A89005b36543m0721h5636A04154K8922f3996
11297G635P6836K19766b07900N9217C0127a46696A07619b52296A21945d9534a307
$$ plain form
11375 -70641 41210 76671 -106037 -137491 122162 312143 35094 5169 -45165 57339 223284
11364 223284 363226 -191143 -104497 81139 -121015 297869 120303 158877 -78570 -30716
11353 -109329 -186354 86391 -140527 -57569 312064 18451 -211432 223219 -131688 136119
11342 45649 143418 143479 127326 106930 -136603 24306 -263965 176946 243032 -77801 -84810 -200806
11330 -200806 -48417 -75698 150987 -288079 -149823 293956 -265948 5341 -345993 357741
11319 -73475 188160 91297 -151927 266083 107954 -117533 79940 425590 186863 -201482
11308 -178309 -339483 -79941 -364994 189005 -236543 -277264 -85636 104154 133076 -63996
11297 7635 84471 304237 -207900 -148683 30127 -146696 107619 -252296 121945 -49534 -1307
11285A5817g1364o3223o3843B71924F3461L1143R99K0691f3091j33090B7080J31088
11273A58168C3823i0557k66433a16735c7953B46977b29244A67604k8223e0478
11262d04885J27182J30557j12154R0646I3976b12645g1489o4203A21590b00830
11251d4444k96672R539A46214A4861a66235B20172a88528m2983D3814a78648A10270
11239c23437A73154n5214a4089E7304b65109k0647a05456B8086a01611A84326
11228b32402l96117a38922f5722l15759f9622j32744d1513C7402O9298d6651I2650
11216C5929c03682C13096A42924o2342l4203J87679L1348g4207G0620b7966A36267
11204a54558q2712n8148J16806B35394a15268J4994j3069C8250b4687l6144J2275
$$ plain form
11285 15817 -71364 -134587 -198430 271924 63461 94604 95603 116294 -63091 -196181 27080 158168
11273 158168 33823 -90557 -356990 -116735 -37953 246977 -229244 167604 139381 -50478
11262 -404885 -277703 -147146 -259300 -168654 93976 -212645 -71489 -135692 121590 -200830
11251 -44444 -341116 -331577 146214 14861 -166235 220172 -188528 -231511 43814 -178648 110270
11239 -323437 173154 117940 -14089 57304 -265109 -285756 -105456 28086 -101611 184326
11228 -232402 -628519 -138922 -65722 -381481 -69622 -202366 -41513 37402 106700 -46651 92650
11216 35929 -303682 313096 142924 80582 46379 234058 265406 -74207 70620 -27966 136267
11204 -154558 -237270 -295418 -178612 235394 -115268 -100274 -113343 38250 -24687 -60831 -48556
11193d8556D9194a32307C5291L2623b0126A34180m9332k6319b94442g6586j23576
11182b00162k4884a10326j11885B900P2960f0468D4909b87080A31574o4953b9068
11170e7078q4717O0948A98745i1693D6729P8030K78569D2b90333D32821H8683
11158a43926a3023L855n5094j88056B5201K0162L9915j2784J84438a57071A39943
11146f5816E7198g9204B58154d7117C27623C289a4273j878A13416b26r8654e922
11133a31956A10659l5808K07062e3490B8274b0241G2695a60195G8290J18454b10433
11121a32368C14201E9158f6271A24961E5090J00503o0908e3917p8910l7177g0986
11109I5384L6682K19762i5978G892J24547N02623a76195A74861o5203O1622I741
$$ plain form
11193 -48556 49194 -132307 35291 67914 -20126 134180 84848 58529 -294442 -76586 -200162
11182 -200162 -225046 -110326 -222211 2900 75860 -60468 44909 -287080 131574 66621 -29068
11170 -57078 -141795 -80847 198745 -91693 46729 124759 403328 42 -290333 432821 88683
11158 -143926 -13023 -9168 -64262 -252318 25201 45363 85278 72494 256932 -157071 139943
11146 -65816 57198 -79204 258154 -47117 327623 3289 -14273 -16151 113416 -226 -98880 -5922
11133 -131956 110659 74851 281913 -53490 28274 -20241 72695 -160195 78290 196744 -210433
11121 -132368 314201 59158 -66271 124961 55090 155593 94685 -53917 -132827 -170004 -70986
11109 95384 132066 351828 -95978 7892 132439 635062 -176195 174861 109658 171280 9741
11097H479M21497I9299L4841R3909L3854P9927A23060K62449E8608a80381a742
11085d0552E5331R6339K42805A86498K8194K7899J47485J66112A42152g0826a2622
11073C32133q8133c4849C39010n8607J84086q3735r4392J57532J54696A94550
11062D37295N0178j36344K84007k07816j80123N85959j51491k42677K84080k25989
11052D97079L11290K71124l52913J92439l13997O7794j50128l3601K18769j87858
11042E19998L29621j50561j70825J83375l4064J25189j61350j0444l503R7646
11032G25082k89888K94271J31958q3746j60013J2151m4462K39380k748R0268k16226
11021F96027n1665j22865L45028k92847M32549j57793N6282m19322J00747p6819
$$ plain form
11097 8479 429976 99299 134140 228049 261903 341830 123060 385509 58608 -180381 -1742
11085 -40552 55331 151670 394475 186498 214692 242591 390076 556188 142152 -70826 -12622
11073 332133 244000 -34849 339010 280403 464489 380754 286362 443894 598590 194550
11062 437295 487473 351129 635136 427320 247197 833156 681665 438988 723068 497079
11052 497079 808369 1079493 726580 919019 605022 672816 522688 489087 707856 519998
11042 519998 849619 699058 528233 711608 677544 802733 641383 630939 627436 725082
11032 725082 435194 729465 861423 777677 617664 629815 585353 824733 821985 912253 696027
11021 696027 644362 521497 866525 573678 1006227 848434 904716 485394 586141 509322
11011E09322J82528n2028L06329k29513M3333l41355L07398l58453K30758j48657
11001D49662K34326J1621k49880K61480K85748P1515m90955M22613j97231j02051
10991F96848N7947N9546M0139P4216j20981P4685J88071j79029O4732J71298q4002
10980A043470K52724r7328P31861k80043K39752K30547K34240M64293l53742M88316
10970B954090m6091j67185n5073k1217m65693j8028m16540L6719k58453N33370
10960B075899m40212K65975K06058k31302K19455K6695k77520p9842o89422k8757
10950A047027K16119k61390o5677k43215k33343A85456M58618k82431Q0916O5902
10940E08461O120r9018A45063J86562m9917n0417k1297q6525c6458j06451F7393
$$ plain form
11011 509322 691850 639822 946151 716638 759971 418616 726014 367561 598319 449662
11001 449662 683988 695609 445729 707209 992957 1064472 573517 996130 798899 696848
10991 696848 754795 814341 854480 928696 807715 882400 1070471 891442 956174 1127472 1043470
10980 1043470 1296194 1198866 1930727 1650684 1890436 2120983 2355223 2819516 2465774 2954090
10970 2954090 2907999 2740814 2685741 2664524 2198831 2180803 1764263 1800982 1542529 2075899
10960 2075899 1635687 1901662 2107720 1876418 2095873 2122568 1845048 1765206 1075784 1047027
10950 1047027 1263146 1001756 936079 692864 459521 185456 644074 361643 442559 508461
10940 508461 514581 415563 145063 331625 281708 231291 209994 123469 -36458 -142909 67393
10928A76440E0468a3497l39507J70387Q417C734i0265k56226C3863a09389d28
10916a37946e2744A45420a6853k99048a22022k4582I3441a11015H4828b57564
10905b20388f7060A10775R9939D818J79363a63094j1576k0456k2078O4840L2514
10894a19850m1484A53144j0054a94083c1601j03319N1708d1135j54821A06224
10883a07215A73664b47437A49671e8007B3327J5886K60660a92j10502c6446p8009
10872a14455l282k42566a60502B90204E0540N992a07415H346J94985c28734N569
10861c23165c6602k37511H5795k0055a52000k75010A26790n6224e2245C2581M3792
10850G6373M6966J57573j32572l5882I239O1930k6955J92968H5009i4718A42125
$$ plain form
10928 176440 50468 -13497 -353004 -182617 -174200 3734 -90265 -346491 33863 -109389 -428
10916 -137946 -52744 145420 -16853 -315901 -122022 -146604 93441 -111015 84828 -257564
10905 -220388 -67060 110775 210714 4818 184181 -163094 -174670 -195126 -217204 -152364 -119850
10894 -119850 -161334 153144 143090 -194083 -31601 -134920 -83212 -41135 -195956 106224
10883 -107215 173664 -247437 149671 -58007 23327 39213 299873 -192 -110694 -36446 -114455
10872 -114455 -117737 -360303 -160502 290204 50540 56532 -107415 8346 203331 -328734 -323165
10861 -323165 -36602 -274113 85795 65740 -152000 -427010 126790 70566 -52245 32581 76373
10850 76373 123339 280912 148340 112458 9239 71169 44214 237182 85009 -94718 142125
10838a77579D5188b37412g625n1277j11803d3576j65148A60108b33139f154B0909
10826a30375E1169b09972g8007n0251j39979d6519p7932b82m8531q0978A54561
10814a09066J4315A88028J8157r9106a93907e6306A11754a3389A53051R0923a1828
10802c32072B96071c84013J19987P8136f0306b8620n3933A78678a24816A02035
10791A34029c74438J77413P8351d6922A30352J42818a25055C24507E8414c26899
10780b83071f1403C2895d3206n9394n9717Q48A54466a99501n8948A40018l7065
10769A02953l0029R2839c11638L7042J30536J4845d1428H1559d50116I1256d1694
10757a22429J081I7485b82101h494F2200i349A83596E5008k0731J92546a11836
$$ plain form
10838 -177579 45188 -237412 -7625 -58902 -170705 -43576 -208724 160108 -233139 -6154 20909
10826 -130375 51169 -209972 -78007 -128258 -268237 -46519 -124451 -282 -48813 -129791 154561
10814 -109066 -94751 188028 206185 107079 -193907 -56306 111754 -13389 153051 243974 -11828
10802 -332072 296071 -384013 -264026 -185890 -60306 -28620 -82553 178678 -124816 102035
10791 134029 -374438 -197025 -118674 -46922 130352 273170 -125055 324507 58414 -326899
10780 -283071 -61403 32895 -43206 -102600 -162317 -161469 154466 -199501 -258449 140018 102953
10769 102953 72924 165763 -311638 -274596 -144060 -129215 -41428 81559 -450116 91256 -41694
10757 -122429 -121348 97485 -282101 -8494 62200 -9349 183596 55008 34277 226823 -111836
10745e55613b25436n2944I8620b3735j99458H938b12574A97266a89441P9375A4954
10733c63993A18704a8521C60506B6824a32519C55775b61595P4644c5975C7802
10722a23157A50651b6114j79671l9620M7292E0673Q2532b94439B33988f8161J1619
10711e6542A2606a48370r640f7841j42686e9694F7993M9198a23012A47925K49694
10700C97619a43929c0491E559b22363l33820a71983c637o9388A3550M7198i0413
10688A39738R7910j02862a66643K1992B07159k9784b58993A28089B3347P6436
10678I9783c98507i6656B44399B9979J78882a71004A01095a46280e7081A44909
10667i2399A92280E4172K79299h3552A02386j5787a9632A45265b30524B00225
$$ plain form
10745 -555613 -225436 -278380 98620 -23735 -223193 8938 -212574 197266 -189441 -110066 14954
10733 -363993 118704 -18521 360506 26824 -132519 355775 -261595 -186951 -35975 37802
10722 -123157 150651 -26114 -205785 -245405 -198113 50673 133205 -294439 233988 -68161 -56542
10711 -56542 12606 -148370 -158010 -67841 -210527 -59694 67993 117191 -123012 147925 397619
10700 397619 -143929 -30491 5559 -222363 -556183 -171983 -3637 -73025 13550 60748 -90413
10688 139738 237648 134786 -166643 -144651 207159 177375 -258993 128089 23347 99783
10678 99783 -398507 -96656 244399 29979 208861 -171004 101095 -146280 -57081 144909
10667 -92399 192280 54172 333471 -83552 102386 86599 -19632 145265 -230524 200225
10656F9775e8872l47446h6722k52605c6023k62528a19451F1892K7268c17617G2958
10644b24908R8221G8544c67257F1004a68980a5683E8224a65341g6741C11723a741
10632B33711a32698H3692J01330R5403a7024l89731J52618K7913H8590f6971q4916
10621a51887J6142j2209B06623b41002j17521a48763A10289a45099F7168d84239
10610b87565i5871l3148k05385l5859a23508c4359A87231g3481a6722m231j54917
10599a75870k58837C02728d0485j02701F3655i0505A22031a89819G1862b14640
10588I5891c1219A09991C0548a39235N8588E3956i0601A72890c6767j05093k2857
10577a64717A06187b02232Q1289d8322j19890c6602L050j95702I7115Q9111c03416
$$ plain form
10656 69775 -58872 -406318 -86722 -339327 -36023 -298551 -119451 61892 89160 -317617 72958
10644 -224908 -126687 78544 -367257 61004 -168980 -15683 58224 -165341 -76741 311723 -1741
10632 233711 -132698 83692 185022 280425 -17024 -406755 -254137 -226224 88590 -66971 -151887
10621 -151887 -135745 -147954 206623 -241002 -358523 -148763 110289 -145099 67168 -484239
10610 -287565 -95871 -129019 -334404 -370263 -123508 -34359 187231 -73481 -16722 -20953 -175870
10599 -175870 -434707 302728 -40485 -143186 63655 -90505 122031 -189819 71862 -214640
10588 95891 -31219 109991 30548 -139235 -80647 53956 -90601 172890 -36767 -141860 -164717
10577 -164717 106187 -202232 -120943 -48322 -168212 -36602 -33552 -229254 97115 186226 -303416
10565A35178g6609A62817j3598a26928n6824A02721R3181d56278B25444f7516
10554I5366F268a21276c7937o9251C3580a4644q3088k49961f2993A34967c96187
10542D13567A35996F3208J520b09937A25638a93168a4501j95478B26804b26005
10531i7k60731B16351k734b65903A68304b4632A77325n190a62787j36206H3369
10519A34053K7286J91004C4944g2248m6172A62700f2146a4170O359D4781a17573
10507c5169l30360J26434a2454l15992A59604R1464a11430j09051D5807J01621
10497A47428a24745A87758l1102C066c60529B1581b78708A92485d0860B7508L0727
10486E8235P3199M1655a9072k2431A69572K95314J81006m328k74761L761r0845
$$ plain form
10565 135178 -76609 162817 149219 -126928 -183752 102721 195902 -456278 225444 -67516
10554 95366 6268 -121276 -37937 -107188 33580 -14644 -97732 -347693 -62993 134967 -396187
10542 413567 135996 63208 64728 -209937 125638 -193168 -14501 -209979 226804 -226005
10531 -97 -260828 216351 213617 -265903 168304 -24632 177325 172135 -162787 -298993 83369
10519 134053 161339 352343 34944 -72248 -118420 162700 -62146 -14170 -7811 44781 -117573
10507 -35169 -365529 -239095 -12454 -328446 159604 251068 -111430 -220481 45807 147428
10497 147428 -124745 187758 156656 3066 -360529 21581 -278708 192485 -40860 27508 58235
10486 58235 131434 173089 -19072 -41503 169572 464886 645892 641564 366803 370564 279719
10475B79719k8917M9227k7474p3613n6407b72531a19448A70563a8129j60527L7249
10464a41407B8412a20708B87517A26479K51062a7376j5603k7816A95279d35907
10453c55929b1656j77882o5046i5088A02384D1159a29577B95706b672B4688a11296
10441D4156c96691D4532c3672j69428G862a53690A46873C9584e4734j60914E4726
10429a73953B93080A31549P2253f2476j74774A07053J46334A15911c4621j07179
10419a41800O9380B07344b2211r6432D9520J53333c29232A0697h9246B9797K14290
10408B44087D2344d01415J82295B14588D8871i9154E2411a87130P8695B5971b67941
10396e8945b8338A4487M2730A2794J11137J1598M9039J29136A44506P4491a62659
$$ plain form
10475 279719 250802 300029 272555 198942 142535 -272531 -119448 170563 -18129 -178656 -141407
10464 -141407 28412 -120708 287517 126479 377541 -17376 -32979 -60795 195279 -435907
10453 -355929 -21656 -199538 -264584 -95088 102384 41159 -129577 295706 -2672 24688 -111296
10441 44156 -396691 44532 -33672 -203100 7862 -153690 146873 39584 -54734 -215648 54726
10429 -173953 293080 131549 203802 -62476 -237250 107053 253387 115911 -34621 -141800
10419 -141800 -72420 207344 -22211 -118643 49520 202853 -329232 10697 -89246 29797 244087
10408 244087 42344 -401415 -219120 214588 48871 -99154 52411 -187130 -108435 25971 -267941
10396 -58945 -28338 14487 57217 12794 123931 135529 184568 313704 144506 218997 -162659
10384c5364A06782c0829A94697L14446D303K67713j6809E0338L35321C1113c2707
10372A95014J50311A0888M80972o3770O8212p3080J44894L09328B13728J78248
10362C91976G2088h2336D64999k21614r9445J19382P8411o2439A09263a8506B75504
10350D18318j65439K34735k6895F1027B1519J97858J58349l5302K19514F4847
10339A13735J65669A36399K22316j35683f7323C7435J91416c5594A31368J29352
10329B60720l6926A03889J0908a70086E8211K23997F4543K89061j17846a5823
10318b0203H1914B1212J10995C8494K32920I8639L584a5700j56308f6529b8564
10306b09992b0581B48366h0407a4500A09453b02446A48545a81401P6220k57265
$$ plain form
10384 -35364 106782 -30829 194697 509143 4303 272016 255207 50338 385659 31113 -32707
10372 195014 345325 10888 491860 428090 496302 423222 568116 877444 213728 391976
10362 391976 72088 -82336 464999 243385 143940 263322 341733 279294 109263 -18506 275504
10350 418318 252879 487614 460719 61027 21519 219377 377726 342424 561938 64847
10339 113735 279404 136399 358715 223032 -67323 37435 228851 -35594 131368 260720
10329 260720 223794 103889 114797 -170086 58211 282208 64543 353604 235758 -15823
10318 -20203 81914 21212 132207 38494 271414 98639 102223 -15700 -172008 -66529 -28564
10306 -209992 -20581 248366 -80407 -14500 109453 -202446 148545 -181401 -105181 -362446
10296c62446d2539A44447b07563O3002c8776j9062A46739i3251A35351J13505
10286B48856d2350A12622D273b27444I454a37350o7131B16724a41399N5166k34144
10275c20377I3051g8326B3041o282J55865j3022j0334Q3698I898M7576K71426
10264C28900j59743c24054h4398B49845N1997j1844J31793j16469K63975k60515
10254C08782q0871j0747J4021j01229i6941A39389a39031A81230a44625M8238
10244i6387A46720J3479a44150B7401p727J1505l521J24508e4098A08356a03248
10232d3067k37236G977d1489B8606f248A78598c90282H6430J1815N4747N621a35892
10219D60510b3463L993l68750G96c71077A20346N4764a66605M8669I7360c228
$$ plain form
10296 -362446 -42539 144447 -207563 -144561 -38776 -57838 146739 -93251 135351 248856
10286 248856 -42350 112622 4273 -227444 9454 -137350 -204481 216724 -141399 -86233 -320377
10275 -320377 93051 -78326 23041 16759 172624 159602 149268 232966 9898 57474 328900
10264 328900 169157 -324054 -84398 249845 301842 289998 421791 305322 569297 308782
10254 308782 227911 217164 231185 129956 -96941 139389 -139031 181230 -144625 -96387
10244 -96387 146720 160199 -144150 27401 19674 31179 27658 152166 -54098 108356 -103248
10232 -43067 -280303 7977 -41489 28606 -6248 178598 -390282 86430 98245 152992 158613 -135892
10219 460510 -23463 -19470 -388220 796 -371077 120346 175110 -166605 -117936 97360 -3228
10207a45177j68197d0271b375l58506F7856b55882k14907e0913j40150f5899j14452
10196a80351G8938c1730j34660A6411L16344h0916K3748j37954f4395k74944A48849
10184d7017H308c361j52043l3403N0491A96219e3178A1603f6159C609c70980L3195
10172c37785a48926O8619j57609j9141h711r8168k796G0679J95118E7354f416
10160i1474B5902b09457A92686b05389b8386b215A72532o0707b5699j94006H9317
10148g0991k964B41340i2214L1026j88892A24705i9357m9793j11516o9264a60767
10136h5173B60605a12657j00728d5305A18857e9529j54937j79724a16087j69445
10126b85532Q0810k3330A65677A2522b48978A61504L8772c6183j53885b4898A23871
$$ plain form
10207 -145177 -313374 -40271 -2375 -360881 67856 -255882 -470789 -50913 -191063 -65899 -180351
10196 -180351 78938 -31730 -166390 16411 332755 -80916 -57168 -195122 -64395 -339339 148849
10184 -47017 8308 -3361 -155404 -188807 -138316 196219 -53178 11603 -66159 3609 -370980 -337785
10172 -337785 -148926 -80307 -237916 -257057 -8711 -106879 -109675 70679 265797 57354 -6416
10160 -91474 25902 -209457 192686 -205389 -28386 -2215 172532 111825 -25699 -219705 89317
10148 -70991 -73955 241340 -92214 -61188 -250080 124705 -99357 -149150 -260666 -329930 -160767
10136 -85173 260605 -112657 -213385 -45305 118857 -59529 -214466 -394190 -116087 -285532
10126 -285532 -204722 -228052 165677 12522 -248978 161504 200276 -36183 -190068 -24898 123871
10114B50553a40208k85817B15185K046H7239a00114j79477J25791d2482q1851
10104a24333F6310a8856A57534a12131j18004O0625A46600a11841d9126A57852
10093a58058E1697a05659I7263R4255I0000a71307G6695P233a77440h6240r1915
10082a78155k2841G9057a71819A77399a7283j53314A01036K0256Q7229M6539A3518
10070d28396a11404k40023A10533e09961E4706c94228J00420J12932D9322e4138
10059a39423A78816h2641A87388m8411J44358a31208b797k08759k0849A08324
10048I004K1723a15555k64203D0801j9184l334b14019Q9961F3971P118a87911
10036b26432P0269D0843a93093m0220g77C700a84680Q5171l6436B47537b25046
$$ plain form
10114 250553 -140208 -426025 215185 217231 87239 -100114 -279591 -153800 -42482 -124333
10104 -124333 66310 -18856 157534 -112131 -230135 -169510 146600 -111841 -49126 157852
10093 -158058 51697 -105659 97263 191518 90000 -171307 76695 83928 -177440 -86240 -178155
10082 -178155 -200996 79057 -171819 177399 -17283 -170597 101036 121292 208521 255060 13518
10070 -428396 -111404 -351427 110533 -509961 54706 -394228 -293808 -180876 49322 -54138
10059 -139423 178816 -82641 187388 138977 283335 -131208 -2797 -211556 -232405 108324
10048 9004 30727 -115555 -379758 40801 21617 18283 -214019 -124058 63971 71089 -187911
10036 -226432 -156163 40843 -193093 -233313 -777 3700 -184680 -99509 -135945 247537 -225046
10024f4698F6211a2784r1013k14788p5034e6507o0915A55761h2855c3653I6464
10012A14836b17048A28372b0783r6023k5067B17637a38097M9065J5888k35098
10002c08242E3334b79968b9134A31251n0871f2187m14580K34195j9353M7341A62896
9990D8238a62649j54788M1982j65912K07946J5762J6331O1968j96882E4291K40471
9979B94762f9327A75772m4390c2395A50735a22301A48318c75800A01926a07971
9968g324j46801P6439A71486D2120B0131g9362k14104K6551P4275g1613D9920
9956a79517e5583A56781b73652a6466m93959B10032I3639J04372a66834L9220
9946a27614l4392O6069q2107B38239a17320C76784F6969R71D380c90828J90168
$$ plain form
10024 -64698 66211 -12784 -103797 -318585 -393619 -56507 -117422 155761 -82855 -33653 96464
10012 114836 -217048 128372 -20783 -116806 -141873 217637 -138097 -89032 -73144 -308242
10002 -308242 53334 -279968 -29134 131251 80380 -62187 -476767 -242572 -261925 -214584 162896
9990 48238 -162649 -317437 -275455 -441367 -233421 -217659 -201328 -139360 -336242 54291 294762
9979 294762 -69327 175772 131382 -32395 150735 -122301 148318 -375800 101926 -107971
9968 -7324 -154125 -77686 171486 42120 20131 -79362 -293466 -266915 -192640 -71613 49920
9956 -179517 -55583 156781 -273652 -16466 -510425 210032 93639 198011 -166834 -127614
9946 -127614 -162006 -95937 -178044 238239 -117320 376784 66969 67940 4380 -390828 -200660
9935b00660I4228a53330B67158d9475k89117a65541C10335e96008F1088c274A21251
9923b3847A9870i9044m8205A81214c7798E2117a74675o8495m219h5128j34111
9912b19239k10018c2021A41597F7606b51220B30345b47978a16447M7050A50016
9901C17155D6582L8333C6256a85045d0793k0961j36172B6978a04026r6152h4908
9889b7524E366J6790i4465G6588J89623a07288H6083b81735A41492d41241J09862
9878c31379f6933k30407C20720B7802c65811Q6490A35283A6603c33409B12878
9867b44799g2883A78250o5052i2857L9077B6171d7409C7482b69310B05903a35767
9855B05095o8639a2558j6926k3159j1563k09090c2746k42648J30055A92660e3159
$$ plain form
9935 -200660 94228 -153330 267158 -49475 -338592 -165541 310335 -596008 61088 -3274 121251
9923 -23847 19870 -99044 -147249 181214 -37798 52117 -174675 -243170 -247389 -85128 -219239
9912 -219239 -429257 -32021 141597 67606 -251220 230345 -247978 -116447 -69397 150016
9901 317155 46582 84915 36256 -185045 -40793 -61754 -197926 26978 -104026 -200178 -84908
9889 -27524 5366 22156 -94465 76588 266211 -107288 86083 -281735 141492 -441241 -331379
9878 -331379 -66933 -297340 320720 27802 -365811 -279321 135283 16603 -333409 212878
9867 -244799 -72883 178250 113198 -92857 -53780 26171 -47409 37482 -269310 205903 -135767
9855 205095 136456 -12558 -29484 -52643 -64206 -273296 -32746 -275394 -145339 192660 -53159
9843a21624j73470a9117j22553i674D1167f7303A30344J0741n992a95309g0314
9831b05918H6411a52682J7029A40060d12464A02624a84362A58954E012c02111
9820A31309B1922f4431A53031c18144B62371e3058D2150I097b893k43101B58976
9808a74307A46344a99301n246I980c34097D7251a56993p3536f8366j55076B54011
9796C068J60943c53466f4177D7654c04354h3793E8292a20775B7484K61016C8967
9784a85443G4631a82671j91118d5417r4770A54566a53115F238c7658M634q0365
9773a13389F1785a28257p8058k8405J14715M7930B02110J44213c76863a39584
9762G9959J31943b65700a01600A4772c58326M6153L9100B21802b63509b3736B14468
$$ plain form
9843 -121624 -295094 -19117 -141670 -9674 41167 -67303 130344 141085 135093 -195309 -70314
9831 -205918 86411 -152682 -135653 140060 -412464 102624 -184362 158954 5012 -302111
9820 131309 21922 -64431 153031 -318144 262371 -53058 42150 9097 -2893 -245994 258976
9808 -174307 146344 -199301 -204547 9980 -334097 47251 -156993 -230529 -68366 -223442 254011
9796 3068 164011 -353466 -64177 47654 -304354 -83793 58292 -120775 27484 288500 38967
9784 -185443 74631 -182671 -373789 -45417 -140187 154566 -153115 6238 -37658 -33024 -113389
9773 -113389 61785 -128257 -206315 -234720 -120005 -72075 202110 346323 -376863 -139584
9762 79959 211902 -265700 -101600 14772 -358326 -312173 -273073 221802 -263509 -23736 214468
9750b33796Q3086d235k15241P0926A38633B78K74841b50669A00961b3453l6103
9739e9556j42488k90131A15644b04629n5248B4272L3722p832d19561A904a83440
9727A18867d2048G6290k6553a14457K7091A26371c4890l71934C63354b4949l72573
9716c97522B58347j3979A7369O679a34917A08179i4593n9357j2107j4365O9039
9705a11383l05988J82038N2467a2381J867m79905e2215K2318j13617B10525e1094
9693b0456l9908j31473H2563c61737A07805e2459k85565p9634B76439a67384J7620
9682a49764L151G5229a52193A41195E4015L8334a32569k1531m0914C22163j31411
9671A90752F0684d05636h3012C8135a6880F9142c06587l6193E4691a8659j01308
$$ plain form
9750 -233796 -150710 -4235 -219476 -148550 138633 278 275119 -250669 100961 -23453 -59556
9739 -59556 -202044 -492175 115644 -204629 -259877 24272 57994 50162 -419561 1904 -183440
9727 118867 -42048 76290 49737 -114457 -87366 126371 -34890 -406824 363354 -24949 -397522
9716 -397522 258347 244368 17369 24048 -134917 108179 -94593 -153950 -166057 -180422 -111383
9705 -111383 -417371 -235333 -182866 -12381 -10514 -490419 -52215 -29897 -143514 210525 -51094
9693 -20456 -60364 -191837 82563 -361737 107805 -52459 -338024 -417658 276439 -167384 -149764
9682 -149764 -146613 75229 -152193 141195 54015 92349 -132569 -154100 -195014 322163 190752
9671 190752 60684 -405636 -83012 38135 -16880 69142 -306587 -342780 54691 -18659 -119967
9660a19967c7202j75840R3170n8394J8438P5134B55543a43148B5131K6782a44509
9648f6379d83l7847q5044l28651H7862l4152c33167A08995a54892N1129B55622
9636A81500j0718c4723A4823c5890n4834d1082q1746D0007d5011k10140r956h91
9623a69145f3950A4531i4968L9769C42353b62647h1296q1130b4629A87807a82753
9611A00419C9893a61093E4816O9215c95347A01249C8173d03846B11433H0055h940
9599a86769A01346c31975J26550g9633G3856f8518j6628C38371j51748B0899M62303
9588D83202c30753C1814a70015e9518j31690j22898M6263B88975a84522j45556
9578c30078A49439A8539b91246B50463O8943c26969G7818k6498b25269Q3313j66340
$$ plain form
9660 -119967 -37202 -213042 -119872 -178266 -159828 -84694 255543 -143148 25131 51913 -144509
9648 -66379 -483 -38330 -123374 -452025 87862 53710 -333167 108995 -154892 -103763 255622
9636 181500 170782 -34723 14823 -35890 -90724 -41082 -122828 40007 -45011 -255151 -265107 -891
9623 -169145 -63950 14531 -94968 -55199 342353 -262647 -81296 -162426 -24629 187807 -182753
9611 100419 39893 -161093 54816 124031 -395347 101249 38173 -403846 211433 80055 -8940
9599 -186769 101346 -331975 -205425 -79633 73856 -68518 -85146 338371 186623 20899 483202
9588 483202 -330753 31814 -170015 -59518 -191208 -314106 -267843 288975 -184522 -330078
9578 -330078 149439 18539 -291246 250463 319406 -326969 77818 51320 -225269 -141956 -308296
9567c08296I596a18295o7703j85859C4208g8528j27718b8350j89405i0158E1877
9555c4107k96169n5023B62487A1226h4564E4248K14653d0692j95796A47775c8978
9543B42649a4828A3450J15270a3889j5859A5616Q0725g4119r8098J3193A58656
9531b20088d9615n41418b6318j84523K0035J0484F1274L1631a06154m4596c0741
9519D6776J03873E5380e6018m6416B29143f9396C55827C5582b79488C5111a41845
9507a67858j41690J51440A72807a93823l0695F7381O4768n4093B4181a7498j25880
9496a43378I9093b05458L317e2604j8560l4783B5326a45617J105O5563j40303
9485b19252L9408A28099K2624B2606a66843M4581K3351J0647B19567c69728f2414
$$ plain form
9567 -308296 9596 -118295 -185998 -371857 34208 -78528 -206246 -28350 -217755 -90158 51877
9555 -34107 -330276 -385299 262487 11226 -84564 54248 268901 -40692 -236488 147775 -38978
9543 242649 -14828 13450 128720 -13889 -29748 15616 96341 -74119 -172217 -159024 158656
9531 -220088 -49615 -591033 -26318 -210841 -190806 -180322 61274 92905 -106154 -150750 -30741
9519 46776 150649 55380 -56018 -102434 229143 -69396 355827 35582 -279488 35111 -141845
9507 -167858 -309548 -158108 172807 -193823 -224518 67381 132149 78056 24181 -17498 -143378
9496 -143378 99093 -205458 -202141 -52604 -71164 -105947 25326 -145617 -144512 -78949 -219252
9485 -219252 -179844 128099 150723 22606 -166843 -122262 -98911 -88264 219567 -369728 -62414
9473b81218a38656A51483p0307J20294a51589l136A20179e9530A97101b0884k53725
9462b74609b510k1877j99299P6541r9290a06842n4337B73449a63218p8726A89602
9450a53459j25447O4057B12042q3638b41196N2228B0579c8797k92774a46461o6613
9439b13074B11010b7817o5725A57649e78044a76302B44248L3816a3818m8484G5506
9427a42485e3220q257j62001G2009K6704J24077a20784a5607B22994b91071B01379
9415A24562b93144J01454g8609k35536E1840J44729d44441A11036a42029k24606
9405c66635f6989b3351j04146d736j46212e2108k24109c9455D8686h0392J4236
9394f6156A49033a36035K7011F3124j3750f0412K2600a8144G0880h6117l9557
$$ plain form
9473 -281218 -138656 151483 81176 201470 -151589 -154725 120179 -59530 197101 -20884 -274609
9462 -274609 -2510 -24387 -223686 -147145 -246435 -106842 -161179 273449 -163218 -241944 189602
9450 -153459 -278906 -214849 212042 128404 -241196 -188968 20579 -38797 -331571 -146461 -213074
9439 -213074 211010 -27817 -93542 157649 -578044 -176302 244248 278064 -13818 -62302 75506
9427 -142485 -53220 -61477 -223478 72009 98713 222790 -120784 -15607 222994 -291071 201379
9415 124562 -293144 -191690 -78609 -314145 51840 196569 -444441 111036 -142029 -366635
9405 -366635 -66989 -23351 -127497 -4736 -150948 -52108 -276217 -39455 48686 -80392 -66156
9394 -66156 149033 -136035 -109024 63124 49374 -60412 -37812 -18144 70880 -86117 -125674
9383a25674b5855k73047B9685J87819a57676A88325E7224b612G7892c94802J29625
9372b65177K6968g5750k486A3152a5446k7554j38372A5710N160b43401A85164
9360h3337C51592c3737O425j12973j35214f7206p8989B665a39594c0652j18684
9349a49336J4016m7436L209A47691b46801D4514b90971k32201d6974r7576e1448
9337g28577c15526A54212a90C5417N8628f0102j88278F538b96682A33933a34198
9325a70659N3723j6283A41201a51313B40950p486b61486D4496b39646C50578A50518
9313F1910f7746l7914M5117j37746D1289e005k15011C3295e2671r0289a6494A25469
9300f1048j97542H7323M4985a38405l37221b2617j30442G4600b23962A66136B9159
$$ plain form
9383 -125674 -25855 -298902 29685 217504 -157676 188325 57224 -2612 77892 -394802 -265177
9372 -265177 -238209 -75750 -78236 13152 -15446 -43000 -181372 15710 20870 -243401 185164
9360 -83337 351592 -33737 -27312 -140285 -275499 -67206 -146195 2665 -139594 -30652 -149336
9349 -149336 -135320 -182756 -179547 147691 -246801 44514 -290971 -523172 -46974 -144550 -51448
9337 -728577 -315526 154212 -190 35417 94045 -60102 -248380 6538 -296682 133933 -134198
9325 -170659 -116936 -133219 141201 -151313 240950 233464 -261486 44496 -239646 350578 150518
9313 61910 -67746 -105660 -60543 -198289 41289 -5005 -220016 33295 -52671 -142960 -16494 125469
9300 -61048 -258590 87323 132308 -138405 -475626 -22617 -153059 74600 -223962 166136 29159
9288c84714A61843a20980A9766a05498d526q5265A70637b36151L9924p1632b3831
9276a47266B12842b7914B18981a91332g8854p8781b6005l6400j89761j76051a63220
9264C17223a38476A05206D6622c9256E0625d12874A33711b74206B52670a50854
9253b24545l7323A72321D6948K030b55523e1241B9612a17942J7662A93328p2455
9242A20873f7587A93047m7655o0965c357r7198B9866K70762F5716Q2646c35060
9230a0724F9762b34199g6633A30304C8161R87i493j13643N4039I7617a47529o5777
9218b13306N9431n3143A03026a39153C1266N8990a73798n9886g9954j98775A82339
9206A3561b80168J06895A3552a28794B46796a36528C4464e0039n3917A20999c63225
$$ plain form
9288 -384714 161843 -120980 19766 -105498 -4526 -89791 170637 -236151 -196227 -267859 -23831
9276 -147266 212842 -27914 218981 -191332 -78854 -157635 -26005 -62405 -252166 -428217 -163220
9264 317223 -138476 105206 46622 -39256 50625 -412874 133711 -274206 252670 -150854
9253 -224545 -261868 172321 46948 48978 -255523 -51241 29612 -117942 -100280 193328 120873
9242 120873 -67587 193047 145392 84427 -3357 -100555 29866 300628 65716 148362 -335060
9230 -10724 69762 -234199 -76633 130304 38161 39148 -9493 -123136 -69097 97617 -147529 -213306
9218 -213306 -153875 -207018 103026 -139153 31266 90256 -173798 -233684 -79954 -278729 182339
9206 13561 -280168 -173273 13552 -128794 246796 -136528 34464 -50039 -103956 120999 -363225
9194B91676b01894J8517I5511b28299P1736A25462B8397b76679B33913c04478
9183g9468j65044b9232E0322e85958a73056D7613k0569O342J94912J92797c7415
9171b42507A83718a7812A21179l436b13389a3428A41325e8859C029c46590b8569
9159d7791I6445b22684D7823c69352A59839d357l8986j23451L8740L7976A08856
9147a62783P4059J7925k59020A4180a87134g9640A04183a14916j12342f7577E9097
9135F3391J831a16688o9554h084A42560c3821A32074a5794l35718A06600e430
9123d7736B62255c3847j4169k71082a13600G9486a13343A04263d37425b01387
9112i1738k32201J11874I2435a59915j9521A07248a75099N4190D5003i4596B08095
$$ plain form
9194 291676 -201894 -183377 95511 -228299 -156563 125462 28397 -276679 233913 -304478
9183 -79468 -244512 -29232 50322 -585958 -173056 47613 27044 33386 228298 421095 -37415
9171 -242507 183718 -17812 121179 117743 -213389 -13428 141325 -58859 3029 -346590 -28569
9159 -47791 96445 -222684 47823 -369352 159839 -4357 -43343 -166794 -128054 -90078 108856
9147 -162783 -88724 -70799 -329819 14180 -187134 -79640 104183 -114916 -227258 -67577 59097
9135 63391 65222 -116688 -186242 -8084 142560 -33821 132074 -15794 -351512 106600 -5430
9123 -47736 262255 -33847 -48016 -319098 -113600 79486 -113343 104263 -437425 -201387
9112 -91738 -323939 -212065 92435 -159915 -179436 107248 -175099 -120909 45003 -94596 208095
9100h8742K9390A52024k7287a35939D2686K6621c50956i9487A47340d58284B255
9088B02396a80313J8249D9908d68595a41898b9793j21884e8317I6109h4446B86014
9076a75137l6234E2457b12401D45799A95081j9771c0906n1984A44212i7295k02691
9065b99986g4545j48652A28560L995B2215J03738b22935N7797j88738a12707a7756
9053E0702d40771E5964A1652K05379d6101m02784M2483A01592a24269H3783a02548
9041C2854O4171a43982A12167b34467k31411b00866j20017J59756n94P5647a2053
9029a17336m4842N8488B71529N6817b72106L9097g9703j10432A52405R014a4425
9017I8239j4691J1405a41741C6143i6663b9450j35876L8545A33861A01J1709b69745
$$ plain form
9100 -88742 -59352 152024 124737 -135939 42686 69307 -350956 -99487 147340 -458284 2255
9088 202396 -180313 -162064 49908 -468595 -141898 -29793 -151677 -58317 96109 -84446 286014
9076 -175137 -211371 52457 -212401 445799 195081 175310 -30906 -82890 144212 -97295 -299986
9065 -299986 -74545 -223197 128560 132555 22215 125953 -222935 -165138 -353876 -112707 -17756
9053 50702 -440771 55964 11652 217031 -46101 -448885 -406402 101592 -124269 83783 -102548
9041 32854 97025 -143982 112167 -234467 -465878 -200866 -320883 -161127 -161721 -86074 -12053
9029 -117336 -162178 -103690 271529 328346 -272106 -233009 -79703 -190135 152405 161419 -14425
9017 98239 83548 94953 -141741 36143 -96663 -29450 -165326 -126781 133861 101 11810 -269745
9004B90820b33822k1486h5756k51525M5806M8011A37758b83853L8207E7649a39170
8992B5460h1662c6606k46019j86474a22576B08059a37710e2489j2392j7538L9931
8981d2488C2786J18305i8471k0781J9492k8356B56525a73604B92051c32428J2113
8970c20315e8587B74971b5538r1630b7586k55843a26261n1260C2784d9682j1595
8959f1277A7047J66906c02497J37720a1142E0877h0581j79537r3658d6338q7386
8948a33724c4949k07508A59907g4597F4445J13868i8915K1383A5666h0280c4319
8936h2328j32835a00726M7690B2402Q5115b44709Q9650A34019a14116C20186j04371
8925B15815Q355d6553B34581J390550O89627E65838A08625Q0026q6434b84212
$$ plain form
9004 290820 -233822 -255308 -85756 -337281 -291475 -243464 137758 -283853 -245646 57649 -139170
8992 25460 -81662 -36606 -282625 -469099 -122576 208059 -137710 -52489 -64881 -82419 -42488
8981 -42488 32786 151091 -98471 -119252 -99760 -128116 256525 -173604 292051 -332428 -320315
8970 -320315 -58587 274971 -25538 -117168 -27586 -283429 -126261 -177521 32784 -49682 -61277
8959 -61277 17047 183953 -302497 -164777 -11142 50877 -80581 -260118 -353776 -46338 -133724
8948 -133724 -34949 -242457 159907 -74597 64445 178313 -98915 -77532 15666 -80280 -34319
8936 -82328 -215163 -100726 -53036 22402 107517 -244709 -155059 134019 -114116 320186 215815
8925 215815 224170 -46553 234581 1625131 2314758 565838 108625 188651 102217 -284212
8914f2186m8604F7271a38433L7788M6894A3917K48535H4810j5928a82884L720
8903a79164B58355R6162D8185K8465B1159M2549d5457A89558B0065Q697b06229
8891a15656k01597c788k31998f1565J3678j23177G615b84907K9128d2731B59956
8879A14116b84788N8664j5536G1043b13496C8527e0589j31030a2589j02081m6312
8868a60982L6478E9286J56318b16246I5940G893c15783G9188a18942B12446d2360
8856A15511H254c66181a68967g5497L5622C22854b02265C33550E8024b3952A39254
$$ plain form
8914 -62186 -110790 67271 -138433 -100645 -53751 13917 262452 84810 68882 -182884 -179164
8903 -179164 258355 354517 48185 76650 21159 63708 -45457 189558 20065 28762 -206229
8891 -115656 -317253 -3788 -235786 -61565 -47887 -171064 7615 -284907 -255779 -42731 259956
8879 114116 -284788 -226124 -241660 71043 -213496 38527 -50589 -181619 -12589 -114670 -160982
8868 -160982 -124504 59286 215604 -216246 95940 7893 -315783 79188 -118942 212446 -42360
8856 115511 8254 -366181 -168967 -75497 -39875 322854 -202265 333550 58024 -23952 139254
$$ [...]
##END NTUPLES=NMR SPECTRUM
##END=
