##TITLE=AC1437_CINAH13246_7790771_HCqIBL6tjq
##JCAMPDX= 6.0         $$ Bruker NMR JCAMP-DX V2.0
##DATA TYPE= NMR SPECTRUM
##DATA CLASS= NTUPLES
##ORIGIN= BRUKER
##OWNER= Administrator
$$ 1.72 TOPSPIN		Version 2.1
$$ 2013-04-16 20:28:06.201 -0700  Administrator@X
$$ Compression mode = diff/dup
##.OBSERVE FREQUENCY= 400.02188249412
##.OBSERVE NUCLEUS= ^1H
##.ACQUISITION MODE= SIMULTANEOUS (DQD)
##.ACQUISITION SCHEME= undefined
##.AVERAGES= 64
##.DIGITISER RES= 22
##SPECTROMETER/DATA SYSTEM= spect
##.PULSE SEQUENCE= noesygpps1d.comp
##.SOLVENT NAME= COFFEE_meoh
##.SHIFT REFERENCE= INTERNAL, COFFEE_meoh, 1, 14.96097
##AUDIT TRAIL= $$ (NUMBER, WHEN, WHO, WHERE, PROCESS, VERSION, WHAT)
$$ ##TITLE= Audit trail, TOPSPIN		Version 2.1
$$ ##JCAMPDX= 5.01
$$ ##ORIGIN= Bruker BioSpin GmbH
$$ ##OWNER= Administrator
$$ $$ E:\/data/COFFEE/nmr/AC1437_CINAH13246_7790771_HCqIBL6tjq/12/pdata/1/auditp.txt
$$ ##AUDIT TRAIL=  $$ (NUMBER, WHEN, WHO, WHERE, PROCESS, VERSION, WHAT)
(   1,<2013-04-16 20:28:01.429 -0700>,<Administrator>,<X>,<go>,<TOPSPIN 2.1>,
      <created by zg
	started at 2013-04-16 20:16:31.984 -0700,
	POWCHK enabled, PULCHK disabled,
       configuration hash MD5:
       33 CF 6A 21 5C D3 B9 40 6C 15 AA 8D 27 A2 4F 13
       data hash MD5: 64K
       64 52 CB E7 10 ED A6 5F 98 BE B5 84 E3 F7 ED 8E>)
(   2,<2013-04-16 20:28:04.257 -0700>,<Administrator>,<X>,<proc1d>,<TOPSPIN 2.1>,
      <Start of raw data processing
       efp LB = 0.3 FT_mod = 6 PKNL = 1 PHC0 = 0 PHC1 = 0 SI = 128K 
       data hash MD5: 128K
       AA 24 9D 9B F0 AF C2 E7 15 55 FF 79 12 7C 19 AF>)
(   3,<2013-04-16 20:28:05.221 -0700>,<Administrator>,<X>,<proc1d>,<TOPSPIN 2.1>,
      <pk PHC0 = -79.35974 PHC1 = 0 
       data hash MD5: 128K
       AD D5 45 46 B2 B4 57 A7 8E 20 8C 28 DD EB 4E 81>)
(   4,<2013-04-16 20:28:05.635 -0700>,<Administrator>,<X>,<proc1d>,<TOPSPIN 2.1>,
      <abs ABSG = 1 
       data hash MD5: 128K
       BC 14 F4 BF 9A 9E C2 73 53 C2 34 96 28 96 C4 FB>)
(   5,<2013-04-16 20:28:05.727 -0700>,<Administrator>,<X>,<proc1d>,<TOPSPIN 2.1>,
      <abs ABSG = 2 
       data hash MD5: 128K
       21 0C 09 7D C7 06 A3 50 43 11 DE 35 F3 20 A7 F9>)
(   6,<2013-04-16 20:28:05.819 -0700>,<Administrator>,<X>,<proc1d>,<TOPSPIN 2.1>,
      <abs ABSG = 3 
       data hash MD5: 128K
       48 DB 94 D8 23 2D DC C2 5B 4F F3 A3 B9 AC 32 BF>)
(   7,<2013-04-16 20:28:05.911 -0700>,<Administrator>,<X>,<proc1d>,<TOPSPIN 2.1>,
      <abs ABSG = 4 
       data hash MD5: 128K
       2A 8A EA 95 AF 59 FE FA 2E BE 85 C3 06 A8 80 2D>)
(   8,<2013-04-16 20:28:06.002 -0700>,<Administrator>,<X>,<proc1d>,<TOPSPIN 2.1>,
      <abs ABSG = 5 
       data hash MD5: 128K
       35 CE 79 53 39 C8 F1 2C CD 6D BA A5 F8 20 47 BC>)
$$ ##END=
$$ 
$$ $$ hash MD5
$$ $$ 2F 95 49 D5 D0 9E 4E 96 15 5B D4 DC 04 42 A6 FA
##$RELAX= 
##$RELAX= 
##$RELAX= 
##$RELAX= 
##$RELAX= 
##$RELAX= 
##$RELAX= 
##$RELAX= 
$$ Bruker specific parameters
$$ --------------------------
##$DU= <E:\>
##$EXPNO= 12
$$ [...]
##$TP07= 0
##$TPNAME0= <>
##$TPNAME1= <>
##$TPNAME2= <>
##$TPNAME3= <>
##$TPNAME4= <>
##$TPNAME5= <>
##$TPNAME6= <>
##$TPNAME7= <>
##$TPOAL= (0..7)
0.5 0.5 0.5 0.5 0.5 0.5 0.5 0.5
##$TPOFFS= (0..7)
0 0 0 0 0 0 0 0
##$TUNHIN= 0
##$TUNHOUT= 0
##$TUNXOUT= 0
##$USERA1= <user>
##$USERA2= <user>
##$USERA3= <user>
##$USERA4= <user>
##$USERA5= <user>
##$V9= 5
##$VALIST= <valist>
##$VCLIST= <CCCCCCCCCCCCCCC>
##$VD= 0
##$VDLIST= <DDDDDDDDDDDDDDD>
##$VPLIST= <PPPPPPPPPPPPPPP>
##$VTLIST= <TTTTTTTTTTTTTTT>
##$WBST= 2048
##$WBSW= 25
##$XGAIN= (0..3)
0 0 0 0
##$XL= 0
##$YL= 0
##$YMAX_a= 6439468
##$YMIN_a= -14393772
##$ZGOPTNS= <>
##$ZL1= 120
##$ZL2= 120
##$ZL3= 120
##$ZL4= 120
##$ABSF1= 14.96097
##$ABSF2= -5.597212
##$ABSG= 5
##$ABSL= 3
##$ALPHA= 0
##$AQORDER= 0
##$ASSFAC= 0
##$ASSFACI= 0
##$ASSFACX= 0
##$ASSWID= 0
##$AUNMP= <proc_prof1d_extract.lims>
##$AXLEFT= 0
##$AXNAME= <>
##$AXNUC= <1H>
##$AXRIGHT= 0
##$AXTYPE= 0
##$AXUNIT= <>
##$AZFE= 0.1
##$AZFW= 0.1
##$BCFW= 0
##$BC_mod= 0
##$BYTORDP= 0
##$COROFFS= 0
##$CY= 15
##$DATMOD= 1
##$DC= 0
##$DFILT= <>
##$DTYPP= 0
##$F1P= 0
##$F2P= 0
##$FCOR= 0.5
##$FTSIZE= 131072
##$FT_mod= 6
##$GAMMA= 0
##$GB= 0
##$INTBC= 1
##$INTSCL= 1
##$ISEN= 128
##$LB= 0.3
##$LEV0= 0
##$LPBIN= 0
##$MAXI= 10000
##$MC2= 0
##$MEAN= 0
##$ME_mod= 0
##$MI= 0
##$NCOEF= 0
##$NC_proc= -2
##$NLEV= 6
##$NOISF1= 0
##$NOISF2= 0
##$NSP= 0
##$NTH_PI= 0
##$NZP= 0
##$OFFSET= 14.96097
##$PC= 1
##$PHC0= -79.35974
##$PHC1= 0
##$PH_mod= 1
##$PKNL= yes
##$PPARMOD= 0
##$PPDIAG= 0
##$PPIPTYP= 0
##$PPMPNUM= 2147483647
##$PPRESOL= 1
##$PSCAL= 4
##$PSIGN= 0
##$PYNMP= <proc.py>
##$REVERSE= no
##$SF= 400.020009649478
##$SI= 131072
##$SIGF1= 0
##$SIGF2= 0
##$SINO= 400
##$SIOLD= 131072
##$SPECTYP= <>
##$SREGLST= <1H.CDCl3>
##$SSB= 0
##$STSI= 131072
##$STSR= 0
##$SW_p= 8223.68421052631
##$SYMM= 0
##$S_DEV= 0
##$TDeff= 65536
##$TDoff= 0
##$TI= <>
##$TILT= no
##$TM1= 0
##$TM2= 0
##$TOPLEV= 0
##$USERP1= <user>
##$USERP2= <user>
##$USERP3= <user>
##$USERP4= <user>
##$USERP5= <user>
##$WDW= 1
##$XDIM= 131072
##$YMAX_p= 445151020
##$YMIN_p= -12580
##$CURPLOT= <Network HP LaserJet P1505>
##$CURPRIN= <$Network HP LaserJet P1505>
##$DFORMAT= <normdp>
##$LAYOUT= <+/1D_H.xwp>
##$LFORMAT= <normlp>
##$PFORMAT= <normpl>
##$SURQMSG= 1
$$ End of Bruker specific parameters
$$ ---------------------------------
##NTUPLES= NMR SPECTRUM
##VAR_NAME=  FREQUENCY,     SPECTRUM/REAL,   SPECTRUM/IMAG
##SYMBOL=    X,             R,               I
##VAR_TYPE=  INDEPENDENT,   DEPENDENT,       DEPENDENT
##VAR_FORM=  AFFN,          ASDF,            ASDF
##VAR_DIM=   131072,        131072,          131072
##UNITS=     HZ,            ARBITRARY UNITS, ARBITRARY UNITS
##FACTOR=    0.0627417313425164, 1,          1
##FIRST=     8223.62146879497, 2704,         -60458
##LAST=      0,             3387,            -59924
##MIN=       0,             -12580,          0
##MAX=       8223.62146879497, 445151020,    0
$$ Real data points
##PAGE= N=1
##DATA TABLE= (X++(R..R)), XYDATA
$$ [...]
64977 271524 271582 269952 267617 265264 262513 258733 253987 248793 243555 238710 234986 232847 231766 230556 228467
64962 228467 225675 222726 219878 217091 214364 211824 209533 207427 205471 203788 202507 201526 200592 199686 199190
64947 199190 199537 200716 202192 203239 203365 202582 201398 200444 200027 200149 200941 202728 205441 208266 210250 211131
64931 211131 211247 210815 209722 207978 205971 204183 202911 202233 201939 201571 200832 199956 199391 199229 199359 200037 201721
64914 201721 204317 207204 210146 213547 217523 221384 224542 227415 230788 234672 238550 242629 248015 255475
64900 255475 264626 274635 285188 296326 307675 318424 328018 336397 343443 348710 352089 354484 357260
64887 357260 360872 364397 366616 367238 366756 365341 362374 357179 349920 341613 333402 325836 318740 311776 305206
64872 305206 299965 296773 295287 294402 293374 292353 291869 292182 293138 294209 294528 293284 290388 286465 281984
64857 281984 276734 270426 263463 256669 250513 245098 240767 238074 236918 236175 234566 231840 228863 226640
64843 226640 225474 225056 225099 225604 226517 227403 227697 227211 226223 225114 224156 223605 223637 224031 224215 223970 223876 224704 226467
64824 226467 228451 230208 232132 234860 238511 242874 248156 254993 263617 273470 283921 295104 307605
64811 307605 321463 335990 350696 365844 381663 397216 410473 419465 423186 421677 415755 406732
64799 406732 395970 384406 372527 360691 349170 337952 326906 316295 306793 298883 292510 287453
64787 287453 283697 281182 279489 278078 276744 275600 274749 274162 273825 273840 274470 276170 279413 284369 290918 299015
64771 299015 308760 319989 332142 344795 358003 371803 385648 398744 410734 421619 431222 439283
64759 439283 446032 452053 457518 462019 465298 467641 469383 470497 470870 470513 469122 465864 460099 452073 442455
64744 442455 431404 418678 404586 390296 376991 365060 354253 344314 335290 327430 320965 315869
64732 315869 311816 308556 306330 305632 306402 307746 308639 308776 308589 308663 309356 310819 313092 316208 320263 325215
64716 325215 330530 335301 339016 342010 344893 347731 350073 351493 351608 349740 345218 338182 329627 320527
64702 320527 311329 302308 293880 286258 279281 272964 267893 264654 263053 262226 261380 260249 259044 258233 258222
64687 258222 259069 260648 263067 266584 271018 275781 280771 286741 294418 303816 314914 328346 344542 362511
64673 362511 380456 397486 413824 429253 442312 451343 455622 455133 449979 440637 428341 414600 400417
64660 400417 386253 372470 359534 347927 338132 330505 324943 320872 317771 315588 314514 314622 315904
64647 315904 318455 322321 327272 332939 339211 346459 355500 367251 382224 400274 420963 443965 468715
64634 468715 493690 516642 535873 551023 562494 570486 574813 575287 571953 565142 555508 543804 530440
64621 530440 515587 499946 485002 472084 461299 451770 442887 435008 428969 425094 422645 420201 416698
64608 416698 412189 407446 402825 397908 392293 386223 380075 373677 366630 359056 351511 344253 337089 329899
64594 329899 322922 316476 310781 306111 302760 300757 299810 299721 300681 303077 307114 312683 319534 327400 335864
64579 335864 344147 351309 356965 361661 366147 370235 372794 373000 371232 368536 365575 362332 358415 353264
64565 353264 346436 338193 329661 321933 315132 308670 302233 296055 290388 285248 280697 276899 273748 270880
64551 270880 268231 266268 265404 265358 265328 264821 264212 264377 265755 267825 269680 271037 272394 274144 275958 277262
64535 277262 277968 278384 278667 278712 278377 277511 275976 273983 272170 270985 270269 269845 270108 271390 272973 273645 273306
64518 273306 273221 274444 276663 278979 281183 283728 286887 290545 294717 299740 305899 313168 321356 330253 339685
64503 339685 349716 360875 373896 388938 405069 420707 434638 446434 455771 461645 462752 458704
64491 458704 450461 439455 426752 413348 400657 389923 381264 373860 367151 361358 356823 353341 350342
64478 350342 347338 344103 340706 337469 334572 331557 327654 322731 317667 313563 310809 309085 307953 307270
64464 307270 307207 308068 309945 312419 314812 316808 318671 320708 322788 324522 325618 325849 324932 322859 320318
64449 320318 318450 318001 318713 319585 319777 319333 319060 319717 321430 323943 327184 331297 336278 342017 348692 356675
64433 356675 365908 375856 386327 398015 411871 428256 447096 468672 493773 523180 557513 597772
64421 597772 645690 703337 772582 855015 951889 1063337 1187212 1318839 1452318 1582565
64411 1582565 1706584 1823288 1932239 2032181 2120216 2192200 2244237 2274184 2282067 2269531 2239198
64400 2239198 2194079 2136461 2066653 1983205 1884994 1773215 1651386 1524058 1396000 1271937
64390 1271937 1155734 1049390 953247 867264 791587 725970 669542 621535 581642 549182 522459
64379 522459 499599 479711 462773 448575 436361 425403 415406 406324 398139 390824 384148 377513 370333
64366 370333 362674 355189 348268 341581 334695 327935 322291 318436 316095 314509 313357 313046 314130 316760
64352 316760 320836 326493 334177 344154 356074 368916 381242 391649 399342 404395 407284 408089 406395
64339 406395 402047 395748 388727 381919 375644 369908 364745 360313 356897 354911 354705 356204 358816 361869
64325 361869 365158 368893 373063 377051 380129 382172 383511 384072 383190 380497 376602 372536 368772 365194 361728
64310 361728 358454 355217 351657 347620 343024 337398 330206 321845 313736 307044 301725 297138 293160 290176
64296 290176 288269 287006 286027 285376 285155 285186 285244 285507 286602 289189 293458 299018 305229 311653 318194 324948
64280 324948 332132 340145 349438 360151 371912 384139 396512 409073 421827 434296 445517 454568
64268 454568 461026 464835 465939 464445 461170 457483 454294 451619 449458 448525 449421 451439 453046 453429 452674
64253 452674 450375 445153 436168 424457 412127 400480 389409 378322 367174 356619 347478 340004
64241 340004 333628 327598 321866 317015 313275 310140 307193 304763 303420 303225 303880 305214 307017 308689 309569
64226 309569 309523 308921 308281 308257 309511 311984 314502 315741 315553 314820 314104 313052 311204 308772 306351 304271
64210 304271 302500 300921 299407 297851 296346 295328 295373 296837 299584 302894 305744 307476 308369 309411 311492
64195 311492 314889 319548 325576 333272 342833 354276 367694 383406 401683 422292 444375 466753
64183 466753 488225 507590 523618 535228 541610 542148 536525 525258 509949 492527 474220 455567
64171 455567 437279 420422 405592 392493 380660 370139 361089 353120 345529 338073 331168 325428 321232
64158 321232 318480 316535 314578 312379 310597 310117 311224 313542 316512 319716 323034 326772 331386 336770
64144 336770 341981 345916 348116 348814 348613 348298 348420 348602 347720 345324 342488 340614 339690 338487 336344 333990
64128 333990 332586 332562 333559 334998 336565 338583 341990 347528 354876 362953 371101 379499 388463 397945 407937
64113 407937 418850 431192 445108 460337 476202 491430 504490 514476 521507 526135 528695 529554 529667
64100 529667 530429 532928 537470 543767 551383 559891 568694 576835 583235 587268 588957 588472 585729 580810 574535
64085 574535 568024 561620 554691 546618 537659 528731 520684 513822 507681 501089 492924 483248 473463 465069
64071 465069 458384 452699 447446 442816 439295 436896 434968 432667 429615 426191 423178 421106 419952 419440
64057 419440 419454 420095 421446 423378 425526 427467 429051 430705 433353 437906 444701 453348 463191 474011 486261
64042 486261 500497 516677 534314 553280 573898 595931 617900 637961 655288 670141 682732
64031 682732 692604 699096 701956 701387 698002 692915 687455 682457 677926 673398 668455 662928 656912 650635
64017 650635 644032 636402 626830 614989 601305 586443 571095 556299 543306 532727 524017 516091
64005 516091 508267 500553 493397 487389 482897 479708 477207 475110 473784 473630 474410 475536 476853 478860 482147
63990 482147 486813 492398 498270 504109 510094 516599 523773 531540 539891 548907 558508 568527 579106 590709
63976 590709 603674 618041 633896 651433 670540 690717 711627 733263 755313 776892 797522
63965 797522 818024 839823 863497 888632 915023 943321 974396 1008684 1046566 1088972 1137173
63954 1137173 1192284 1255492 1328802 1415123 1517435 1638041 1778717 1941384 2128362 2341877
63944 2341877 2583446 2853638 3152186 3478074 3829462 4203578 4596677 5004022 5419800
63935 5419800 5836878 6246615 6639143 7004282 7332612 7616013 7847723 8022512 8136986
63926 8136986 8189349 8178608 8104369 7967737 7772329 7524204 7230970 6901082 6543430 6166826
63916 6166826 5779607 5389703 5004591 4630557 4272070 3932382 3614554 3321273 3053639
63907 3053639 2810834 2591299 2393893 2217779 2061673 1923599 1801319 1693012 1597752 1515252
63897 1515252 1444766 1384308 1331302 1283817 1240677 1200626 1162342 1125364 1090123 1056778 1024783
63886 1024783 993874 964500 936773 909940 883729 859395 838438 820838 805596 792555 782479
63875 782479 775552 771143 769182 770550 775675 783749 793918 806361 821521 838953 857817 878090 900361
63862 900361 924551 949653 974783 999769 1024425 1047908 1069238 1088057 1104363 1117790 1127766 1134367
63850 1134367 1138343 1139961 1138263 1131981 1121015 1106562 1089833 1071094 1050019 1026536 1001038 973997
63838 973997 945655 916007 884994 852882 820472 788700 757917 727842 698368 670080 643690
63827 643690 619217 596078 573864 552728 533113 515390 499721 485909 473314 461170 449129
63816 449129 437500 426993 418292 411703 406909 403065 399329 395460 391878 389160 387463 386393 385378 384232
63802 384232 383324 383046 383076 382421 380304 376840 372714 368456 364205 359882 355256 350030 344253 338589 333816
63787 333816 330102 327073 324526 322620 321299 320020 318333 316454 314891 313728 312569 311116 309429 307644
63773 307644 305774 303955 302647 302333 303053 304348 305583 306243 306104 305350 304447 303663 302786 301564 300345 299822
63757 299822 300076 300348 300000 299299 298872 298775 298574 298160 297902 298053 298474 299023 299792 300910 302452 304581 307455 310896
63739 310896 314425 317714 320772 323799 327078 330816 334691 337732 339259 339966 341489 344764 349238 353735
63725 353735 357559 360649 363325 366222 370004 374778 380073 385466 390785 395596 399160 401206 402178 402458 401955
63710 401955 400776 399547 398545 397156 394899 392487 391113 391061 391722 392645 393752 394732 395165 395327 396169 398308
63694 398308 401500 405158 408881 412363 415290 417487 418922 419489 419142 418263 417518 417247 417177 416813 415902 414552
63678 414552 413121 412067 411697 412050 412976 414173 415146 415559 415822 416905 419157 421654 423194 423681 423997 424692
63662 424692 425402 425497 424727 423134 420781 417763 414204 410133 405578 400805 396219 392022 388065 384032 379709
63647 379709 375302 371583 369358 368526 368022 367068 366137 366248 367597 369440 371218 373177 375880 379513 383815
63632 383815 388402 393156 398349 404241 410491 416419 421998 428034 434990 442309 449516 457314 466727 477588
63618 477588 488933 500684 513889 529314 546794 566062 587250 610292 634684 660273 687705
63607 687705 717724 750452 785443 821839 858195 892613 923322 948896 968122 980381 986304 987434
63595 987434 985031 979717 972235 963731 954927 945592 935124 923146 909292 893019 874049 852608 829045
63582 829045 803703 777372 751322 726517 703095 680834 659832 640625 624015 610812 601270 594749
63570 594749 590436 588303 588666 590887 593438 595494 597586 600399 603781 607309 610967 614785 618561 622484
63556 622484 627356 633767 641822 652103 665852 683505 704041 726814 753203 785222 823037 865119
63544 865119 910380 958662 1008886 1057830 1101084 1134661 1155967 1164495 1162246 1152910 1140107 1126342
63532 1126342 1113228 1101715 1091762 1082365 1072379 1061122 1048106 1032573 1013565 990318 962555 930648
63520 930648 895594 858723 821412 785046 750827 719215 689812 662222 636939 614924 596373
63509 596373 580407 565980 552703 540721 530181 521005 512953 505714 498994 492552 486238 480195 474994
63496 474994 471139 468291 465424 462084 459000 456991 455713 454172 452086 449994 448165 446293 444360 442987
63482 442987 442629 443032 443786 444997 447073 450182 454185 458836 463756 468389 472183 474820 476263 476690 476341
63467 476341 475220 473035 469661 465577 461575 458139 455369 453339 452097 451322 450516 449658 449330 450050 451751
63452 451751 453996 456440 458954 461552 464355 467537 471256 475691 481020 487248 494223 501981 510794 520615
63438 520615 530855 541254 552745 566930 584894 607121 634202 666525 702894 740268 775306
63427 775306 805846 830844 849921 863654 873794 882400 890887 900302 912092 927885 948613 974404
63415 974404 1005214 1040893 1080406 1121420 1160923 1196151 1224953 1245786 1257897 1261669 1258617 1250851
63403 1250851 1240342 1228508 1216172 1203620 1190586 1176435 1160659 1143072 1123275 1100110 1072220
63392 1072220 1039414 1003177 965635 928207 891409 855579 821350 789445 760295 733930 710146
63381 710146 688849 670292 654898 642793 633672 627209 623328 621939 622649 625074 629312 635792 644576
63368 644576 655006 666067 677044 687919 699344 712228 727173 744303 763667 785710 811182
63357 811182 840602 873920 910641 950067 991377 1033553 1075255 1114636 1149412 1177395 1197315
63346 1197315 1209267 1214445 1214397 1210349 1203043 1193115 1181547 1169475 1157338 1144344 1129066 1110601 1088935
63333 1088935 1064218 1036143 1004421 969722 933757 898315 864352 831991 801267 772772 747635
63322 747635 726939 711138 700051 693367 690813 691557 693526 693740 689560 679696 664313 644715 623020
63309 623020 601483 581529 563423 547087 532948 521607 512960 506187 500611 496088 492595 489980 488227
63296 488227 487408 487081 486222 484110 480983 477412 473361 468320 462207 455676 449502 444022 439203 434950 431235
63281 431235 428102 425630 423822 422547 421681 421165 420809 420223 419201 418112 417577 417701 417926 417756 417419 417663 418986
63264 418986 421226 423832 426387 428816 431223 433661 436117 438632 441358 444520 448373 453092 458562 464315
63250 464315 469911 475390 481216 487743 494913 502484 510349 518594 527416 537018 547417 558455 570271
63237 570271 583661 599470 617508 636636 656209 677012 700375 726688 755195 784882 814972
63226 814972 844769 873735 901923 929917 958092 986129 1013443 1039921 1066155 1092975 1120762
63215 1120762 1149210 1177781 1206321 1234979 1263465 1290663 1315149 1335844 1351967 1362652 1366984
63204 1366984 1364347 1354541 1337725 1314449 1285591 1252131 1215247 1176757 1138910 1103272 1070060 1039021
63192 1039021 1010619 985800 964833 947106 932077 919884 910993 905844 904889 908428 916117 926997
63180 926997 940168 955254 972197 990963 1011448 1033244 1055446 1077103 1098017 1118747 1139722
63169 1139722 1160694 1181208 1201197 1220780 1239636 1256757 1270708 1280182 1284505 1283746 1278191 1267723
63157 1267723 1251902 1230573 1204136 1173331 1139116 1102704 1065306 1027772 990793 955401 922749
63146 922749 893251 866325 841219 817796 796413 777420 760990 747143 735681 726220 718410 712011
63134 712011 706783 702544 699262 696835 694879 693205 692472 693833 697744 703607 710711 718959 728363 738357
63120 738357 748136 757325 765857 773386 779359 783646 786708 789018 790588 791234 791202 791327 792329 793933 794971
63105 794971 794562 792938 790815 788305 785086 781420 778155 775568 772989 769921 766840 764410 762489 760525
63091 760525 758593 757433 757641 759231 761743 764304 765830 765759 764610 763508 763198 763837 765464 768134 771598
63076 771598 775342 779102 783098 787708 793112 799181 805441 811213 816232 821269 827868 837175 849111 862831
63062 862831 877852 894531 913444 934669 958014 983824 1012952 1045678 1081175 1118680 1158908
63051 1158908 1203527 1253248 1307278 1364815 1426086 1491356 1559695 1629602 1700347 1771716 1842737
63040 1842737 1911798 1978186 2042590 2105799 2167694 2228048 2287622 2347636 2408329 2468688 2527554
63029 2527554 2584286 2638057 2686948 2728238 2759538 2779368 2786729 2780577 2760040 2725020 2676414 2615827
63017 2615827 2545221 2466756 2382698 2295362 2207098 2120127 2036278 1957006 1883790 1818241 1761466
63006 1761466 1713513 1673827 1642228 1619070 1604563 1598359 1599806 1608134 1622326 1641305 1664413 1691344
62994 1691344 1721546 1754127 1788407 1824091 1860742 1897623 1934303 1970945 2007704 2044286 2080297
62983 2080297 2115401 2148654 2178183 2202132 2219619 2230353 2233652 2228300 2213196 2187773 2152171 2107478
62971 2107478 2055509 1997854 1935350 1868836 1799984 1730784 1662574 1596175 1532658 1473120 1417746
62960 1417746 1365809 1316622 1269993 1225871 1184310 1145756 1110569 1078088 1046908 1016352 987070
62949 987070 959852 934476 910213 887003 865503 846137 828574 812174 796640 782156 769025
62938 769025 757259 746535 736492 726986 718026 709652 702049 695530 690115 685355 680913 677159 674655
62925 674655 673171 671734 669706 667297 664899 662460 659753 656760 653482 649812 645925 642446 639724 637177
62911 637177 633806 629318 624399 619959 616483 614070 612549 611315 609453 606557 603393 601305 600794 600968 600652
62896 600652 599766 599135 599084 598847 597561 595349 593050 591227 589853 588728 587707 586685 585720 585113 585017 585082 584904
62879 584904 584700 585137 586525 588553 590692 592393 592969 591950 589694 587194 585147 583600 582463 581741 581136
62864 581136 580117 578738 577800 577750 577973 577700 577158 577131 577702 578188 578271 578387 578837 579160 578770 577852 577237 577539 578686
62845 578686 580190 581602 582690 583356 583546 583243 582544 581619 580548 579282 577909 576868 576629 577118 577672 577738 577406
62828 577406 577100 576956 576844 576864 577416 578745 580800 583633 587432 591845 595791 598522 600593 603106 606170 608924
62812 608924 611099 613662 617488 622171 626747 631003 635395 640067 644809 649770 655421 661828 668639 675798
62798 675798 683590 691918 700262 708547 717408 727343 738250 750236 764241 781303 801613 824891 851358
62785 851358 881686 916194 954842 998027 1046678 1101345 1161736 1227493 1298999 1377023 1461870
62774 1461870 1553275 1650869 1754142 1861881 1972135 2082832 2191994 2297036 2394323 2480057
62764 2480057 2551620 2607688 2647130 2668386 2670223 2652699 2617064 2564912 2497865 2417999 2328174
62753 2328174 2231612 2131070 2028362 1924638 1821133 1719611 1621982 1529538 1442732 1361634
62743 1361634 1286373 1217100 1153815 1096433 1044735 998193 956080 917968 883946 854162 828341
62732 828341 805834 785909 767912 751467 736694 723926 713027 703325 694384 686445 679843 674433
62720 674433 669972 666614 664591 663755 663910 665249 668029 672229 678100 686507 697914 711338 725332 739962
62706 739962 756975 777877 802631 830375 860680 893877 930715 972011 1018165 1068859 1123677
62695 1123677 1182998 1247673 1317755 1392279 1470376 1551797 1635968 1721199 1805207 1885741 1960296
62684 1960296 2025898 2079882 2120556 2146790 2157477 2152001 2130885 2095450 2047172 1987724 1919208
62673 1919208 1843748 1763162 1679503 1595456 1513373 1434090 1357394 1283627 1214183 1150317 1092102
62662 1092102 1038794 989790 944958 904338 867866 835363 806560 781052 758243 737465 718296
62651 718296 700738 684887 670447 656853 643852 631652 620410 610006 600425 591900 584340 577136
62639 577136 569987 563625 559198 557116 556907 557965 559871 562012 563490 563603 562226 559678 556463 553083 549843
62624 549843 546805 544056 541872 540422 539499 538890 538859 539899 542054 544836 547804 550929 554402 558414 563087
62609 563087 568299 573613 578730 584034 590282 597649 605486 613275 621554 631621 644480 660326 678948
62596 678948 700366 724993 753357 785823 822571 863723 909331 959115 1012220 1067277 1122727
62585 1122727 1177250 1229930 1279995 1326211 1366588 1398961 1421964 1435264 1438902 1432826 1417313 1393462
62573 1393462 1362830 1326682 1285936 1241678 1195263 1147866 1100311 1053409 1008128 965189 924739
62562 924739 886665 851122 818540 789171 762900 739565 719291 702296 688388 676841 666799
62551 666799 657633 648844 639938 630786 622001 614546 608825 604433 600838 597943 595799 594128 592514 590958
62537 590958 590001 590277 591950 594417 596479 597111 596332 595199 594820 595554 597252 599905 603698 608702 614902 622430
62521 622430 631469 642097 654585 669683 688112 709754 733820 759967 788881 821569 858387 898963
62509 898963 942878 990138 1040974 1095301 1152320 1210543 1268228 1323803 1375917 1423192 1464199
62498 1464199 1497783 1523455 1541630 1553658 1561592 1567659 1573721 1581206 1591464 1606001 1626229 1653018
62486 1653018 1686551 1726595 1772999 1825996 1886032 1952982 2025137 2098602 2167750 2226806 2271852
62475 2271852 2301992 2318721 2323755 2316854 2295365 2255974 2197317 2121405 2032692 1935835 1834193
62464 1834193 1730011 1625332 1522290 1422780 1328335 1240338 1160054 1088356 1025559 971455 925304
62453 925304 885941 852255 823627 799703 779850 763223 749342 738206 729802 723905 720461 719686
62441 719686 721564 725567 731075 737743 745298 753255 761126 768658 775663 781820 786761 790115 791332 789818
62427 789818 785491 778923 770720 761006 749788 737617 725564 714528 704619 695158 685337 675124 665423
62414 665423 657026 649542 641900 633832 626162 619531 613606 607860 602369 597351 592607 588046 584229 581762
62400 581762 580597 580513 581776 584512 587827 590481 592384 594655 598260 603202 608928 614786 620066 624349 628040
62385 628040 632014 636599 641442 646475 652409 659980 669080 678922 688825 698646 708623 718948 729410 739427
62371 739427 748577 757035 765403 774232 783865 794501 806169 818907 833232 850165 870487 894326
62359 894326 921937 954459 993232 1038530 1089623 1145870 1206935 1271855 1338605 1404762 1468115
62348 1468115 1526545 1577931 1620493 1653052 1675129 1687319 1691453 1689562 1682355 1669191 1649658 1624633
62336 1624633 1595584 1563461 1528650 1491548 1452816 1413456 1374948 1338905 1306191 1276555 1249388
62325 1249388 1224559 1202241 1182259 1164033 1146997 1130709 1114556 1097735 1079740 1060854 1042067
62314 1042067 1024426 1008334 993527 979620 966454 953840 941398 928983 916960 905585 894353
62303 894353 882508 870099 857966 846676 836046 825779 816022 807133 799383 793069 788528 785747 784230
62290 784230 783383 782889 782726 783120 784428 786720 789498 792171 794693 797363 800158 802842 805604 808908 812718
62275 812718 816538 820316 824624 829786 835478 841390 847627 854232 860962 867868 875547 884593 895435 908971
62261 908971 926601 949165 976445 1008179 1044987 1087844 1137138 1192735 1254297 1320893 1390694
62250 1390694 1461658 1532073 1599925 1662308 1716308 1760319 1794007 1817434 1830930 1835374 1831551 1819157
62238 1819157 1797154 1765195 1724244 1675930 1621986 1564265 1504586 1444338 1384612 1326751 1272187
62227 1272187 1221700 1175315 1133042 1095217 1061991 1032946 1007388 984692 964255 945615 928861
62216 928861 914522 902745 892840 883857 875368 867480 860366 854063 848472 843292 838196 833467 830290 829910
62202 829910 832384 836504 841081 845948 851505 857682 863821 869441 874632 879702 884835 890216 895988 901904
62188 901904 907523 913132 920046 929451 941203 954226 967730 981397 994615 1006405 1016239 1024275 1030654
62175 1030654 1035255 1038358 1040909 1043793 1047353 1051947 1058485 1068098 1081668 1099935 1123510 1152376 1185804
62162 1185804 1223182 1264441 1309133 1355400 1400388 1441537 1477116 1505877 1526878 1539756 1544925
62151 1544925 1543425 1536554 1525242 1509489 1488625 1462244 1430650 1394416 1354256 1311668 1269015 1228262
62139 1228262 1189922 1153692 1119687 1088523 1060709 1036669 1016932 1001392 988569 976513 964446
62128 964446 952781 941614 930161 917969 905831 894914 885470 876920 868853 861510 855364 850680 847493
62115 847493 845805 845660 847045 849812 853740 858663 864362 870409 876292 881634 885968 888365 887915 884905 881020
62100 881020 878034 876702 877208 879941 884979 891114 896277 898990 898971 896590 892459 887497 882656 878430 875018
62085 875018 872794 871962 871913 871771 871708 872989 876520 882079 889199 898022 908862 921628 936213 952865 971523
62070 971523 991212 1010837 1030417 1050910 1072920 1096228 1120694 1147035 1176288 1208681 1243260
62059 1243260 1278490 1312905 1345161 1373816 1397444 1415171 1427008 1433630 1435778 1433737 1427093 1415041
62047 1415041 1397227 1374355 1347645 1317543 1283466 1245112 1203587 1160772 1117891 1075276 1033247
62036 1033247 992530 953799 917426 883769 853154 825469 800210 777077 756136 737354 720436
62025 720436 705245 691944 680507 670383 660757 650864 640129 628501 616826 606333 597484 589612
62013 589612 581890 574274 567299 561372 556569 552804 549909 547776 546645 546878 548257 549884 551168 552601
61999 552601 555123 558880 563021 566673 569766 572902 576640 580883 584843 587573 588615 588023 585859 582007
61985 582007 576570 570042 562820 554909 546468 538293 531158 524856 518462 511670 505302 500249 496347 492675
61971 492675 488769 485143 482649 481648 481879 482882 484320 485966 487638 489256 490892 492610 494260 495549
61957 495549 496392 497166 498500 500725 503596 506626 509655 512910 516497 520089 523342 526480 530147 534792 540460
61942 540460 547148 554953 563787 573321 583381 594030 605106 616078 626668 637299 648582 660567
61930 660567 672780 684724 696045 706473 716024 724952 733108 739555 743272 744020 742104 737654 730885
61917 730885 722926 715542 709811 705624 702570 700735 700467 701933 705292 710893 718975 729358 741528 754741
61903 754741 767984 780234 790982 800227 807917 813729 817433 819063 818650 816220 812184 807289 802036 796580
61889 796580 791300 786936 783861 781687 779800 777817 775255 771408 766004 759527 752372 744122 734289 723371
61875 723371 712464 702013 691686 681425 671848 663387 655688 648296 641576 636556 633942 633540 634599
61862 634599 636498 639110 642654 647341 653189 660061 667809 676459 686402 698384 713037 730348 749714
61849 749714 770519 792459 815278 838529 861800 884913 907651 929383 949216 966387 980370
61838 980370 990696 996955 999037 997320 992658 986172 978932 971708 965001 959265 954977 952579 952537 955407
61824 955407 961491 970363 981014 992522 1004255 1015268 1023975 1028904 1029679 1026954 1021423 1013171 1002042
61811 1002042 988367 973149 957510 942025 926634 911223 896129 881862 868448 855350 842102
61800 842102 828762 815646 802896 790444 778237 766286 754629 743406 732897 723438 715298 708629
61788 708629 703356 699097 695277 691366 686996 682083 677002 672378 668380 664408 659976 655637 652477 650710
61774 650710 649514 648350 647642 647873 648684 649390 649866 650369 650966 651742 653304 656438 661312 667434 674303 681730
61758 681730 689651 697973 706551 715076 723124 730469 737032 742268 745014 744409 740723 734860 727297 718006
61744 718006 707220 695686 684245 673600 664331 656553 649600 642592 635382 628491 622198 616340 611092
61731 611092 607194 605014 603850 602616 600957 599325 598205 597627 597311 596972 596467 595855 595310 594891 594521 594276
61715 594276 594470 595145 595591 594759 592355 589298 586896 585615 584803 583515 581330 578361 574827 570894 566751
61700 566751 562529 558190 553836 550008 547272 545377 543232 539931 535604 531059 526872 523042 519316 515502
61686 515502 511552 507648 504214 501697 500206 499388 498548 496956 494281 490892 487637 485202 483680 482629 481375
61671 481375 479396 476760 474213 472443 471332 470376 469781 470414 472473 474976 477061 479143 482094 485810 489309
61656 489309 491937 493804 495284 496872 499271 502774 506527 509181 510426 511195 512292 513544 514515 515321 516341
61641 516341 517639 519056 520470 521685 522547 523469 525328 528360 531580 533883 535392 537144 539595 542060 543611
61626 543611 543910 543015 540858 537269 532319 526392 520045 513905 508538 504160 500549 497374 494620 492549 491248
61611 491248 490362 489285 487539 484959 481685 478100 474652 471506 468323 464565 460125 455572 451676 448667
61597 448667 445997 442860 439029 435183 432309 430696 429634 428215 426289 424392 422897 421603 420200 418756
61583 418756 417561 416723 416136 415679 415345 415242 415451 415692 415268 413739 411662 410182 409750 409752 409611 409654 410437 411765
61565 411765 413022 414184 415780 417956 420141 421707 422472 422589 422417 422586 423689 425671 427789 429293 429983
61550 429983 430146 430275 430872 432141 433761 435133 435949 436357 436633 436933 437379 438086 439074 440364 442088 444221 446273
61533 446273 447702 448677 449972 451960 454119 455780 456986 458184 459312 459667 458713 456648 454025 451084 447725
61518 447725 444103 440957 439142 438835 439349 439775 439653 439028 438094 437048 436195 435934 436480 437644 438950 440024
61502 440024 440914 441920 443068 443986 444610 445777 448508 452635 456715 459636 461719 463874 466226 468233 469773
61487 469773 471300 473055 474827 476513 478244 479935 481415 483094 485810 489699 493837 497410 500641 504063
61473 504063 507340 509577 510612 511222 511935 512246 511401 509515 507405 505462 503183 499959 495970 492058 488927
61458 488927 486679 484940 483137 480821 478099 475701 474277 473672 473311 473212 474043 476050 478569 480852 482812
61443 482812 484623 486161 487379 488689 490423 492287 493893 495430 497146 498597 499245 499552 500588 502562 504558
61428 504558 505826 506612 507569 509021 511067 513772 516941 520092 522869 525244 527304 529281 531708 534915 538273
61413 538273 540551 541192 540681 539548 537758 535405 533270 532087 531643 531197 530495 529920 529794 529984 530109 529838 529099
61396 529099 528201 527669 527778 528344 529069 529869 530764 531689 532618 533688 535025 536546 538030 539334 540588 542318
61380 542318 545230 549553 554701 559932 565175 570734 576320 581136 584979 588541 592292 595756 598251 599725
61366 599725 600347 599849 598012 595552 593831 593602 594360 594834 593905 591381 588316 586455 586949 589601 593537 598408
61350 598408 604629 612631 622282 632917 643520 652849 659768 663784 665283 665334 665269 666099 667927 669865 670779
61335 670779 670245 668763 667127 665700 664276 662485 660221 657733 655374 653372 651798 650625 649754 649139 648989
61320 648989 649687 651365 653839 657119 661669 667817 675228 683394 692391 702638 714150 726707 740663
61307 740663 756837 775562 796435 818993 842813 866720 888645 906703 919983 928188 931225 929475
61295 929475 923835 915099 903724 890420 876324 862259 848386 834871 822175 810304 798556 786607
61283 786607 775176 765020 755913 747385 739882 734400 731343 730473 731546 734213 737674 741297 745308 750102
61269 750102 755196 759722 763670 767623 771448 774321 776208 778368 782150 788050 796059 806033 817322 828684
61255 828684 838928 847269 852982 855504 855158 853149 850399 846850 842219 836905 831729 827142 823078 819235
61241 819235 815197 810627 805871 802094 800370 800658 801942 803261 804396 805684 807560 810315 814119 819178
61227 819178 825741 833805 842830 852009 860957 869928 879213 888540 897298 905247 912734 920229 927812 935199
61213 935199 942175 948879 955605 962359 968745 974296 978789 982195 984595 986346 988146 990682 994243 998954
61199 998954 1005333 1014281 1026434 1041677 1059393 1079077 1100600 1123831 1147947 1171172 1191446 1207526
61187 1207526 1219347 1227337 1231721 1232689 1230892 1227335 1222908 1218219 1213622 1208960 1203408 1196001 1186364 1174722
61173 1174722 1161339 1146375 1130236 1113621 1097133 1081018 1065238 1049531 1033547 1017258 1001146
61162 1001146 985627 970468 955233 940215 926372 914276 903699 894315 886333 880258 876506 875502
61150 875502 877750 883479 892363 903614 915950 927438 935959 940345 940869 938462 933769 927218 919550 911842
61136 911842 905154 900456 898616 899969 903983 909696 916549 924604 934163 945527 959109 975382 994577
61123 994577 1016587 1041201 1068314 1097885 1129804 1163821 1199506 1236373 1274125 1312715 1352044
61112 1352044 1391696 1431196 1470442 1509606 1548559 1586658 1623238 1658135 1691458 1722915 1751594
61101 1751594 1776468 1796948 1812787 1823558 1828473 1826843 1818723 1805153 1787793 1768231 1747402 1725594
61089 1725594 1702978 1680024 1657261 1634812 1612547 1590660 1569650 1549595 1529934 1510313 1491277
61078 1491277 1473712 1457838 1443158 1429157 1415580 1402234 1389133 1376791 1365751 1355711 1345651
61067 1345651 1334926 1323735 1312435 1301101 1290000 1279781 1270679 1262086 1253526 1245639 1239516 1235296
61055 1235296 1232120 1229307 1226894 1225070 1223907 1223832 1225675 1229825 1235819 1243148 1252024 1262890 1275450 1288721
61041 1288721 1302058 1315742 1330520 1346757 1364055 1381571 1398732 1415714 1433126 1451170 1469286
61030 1469286 1486759 1503383 1519379 1534995 1550568 1566737 1584174 1603157 1623742 1646223 1671095
61019 1671095 1698686 1729139 1762480 1798228 1835253 1872844 1911975 1954931 2003734 2059624 2123931
61008 2123931 2198391 2284252 2381807 2491073 2612312 2746196 2895087 3064936 3264989 3505482
60998 3505482 3797312 4154532 4595359 5140372 5813640 6648924 7692362 8995089 10603938
60989 10603938 12557858 14874390 17504392 20274897 22886600 25009333 26428532 27136741
60981 27136741 27310613 27214149 27108762 27199044 27585165 28209049 28839299 29145327 28839923 27801330
60971 27801330 26100209 23935275 21539884 19114670 16800090 14676689 12779171 11114340
60963 11114340 9674640 8444377 7402628 6526728 5794945 5186386 4680349 4257656 3902267
60954 3902267 3600765 3341266 3114148 2913137 2734328 2574339 2430228 2300359 2183877
60945 2183877 2079460 1985530 1901214 1825848 1757658 1694051 1633096 1573756 1514976 1455892 1397062
60934 1397062 1340391 1287475 1238614 1193443 1151671 1113138 1077889 1046337 1018772 994723 973308
60923 973308 954046 936714 920791 905901 892478 881051 871049 861362 851870 843259 835460 827635
60911 827635 819844 813369 808936 805714 802600 799464 796627 794067 791676 789486 787084 783666 779165 774486
60897 774486 769995 764647 757378 748648 739746 731105 722232 712931 703762 695349 687867 681193 675115 669435
60883 669435 664167 659503 655396 651397 647093 642418 637375 631866 626078 620637 616045 612247 609037 606500
60869 606500 604790 603801 603425 603798 604960 606533 608084 609647 611619 614230 617350 620684 624074 627732 632138
60854 632138 637498 643390 649212 654825 660252 664932 667977 669265 669655 669940 670228 670508 671094 672069 672824 672505
60838 672505 670537 666463 659843 650731 639916 628381 616805 605696 595513 586429 578385 571507 565870
60825 565870 560825 555306 549165 543459 539051 535617 532458 529469 526654 523418 519255 514734 511018 508590
60811 508590 507064 505994 505253 504771 504409 504016 503308 501945 500065 498352 497189 496173 494920 493860 493651 494193
60795 494193 494858 495423 496094 496861 497511 498154 499077 500122 500867 501426 502468 504275 506252 507567 507997 508030 508325
60778 508325 509033 509526 508847 506667 503680 500899 498750 497058 495673 494681 494151 493993 494087 494347 494772 495566 496993
60761 496993 498902 500607 501540 501861 502170 502778 503562 504350 505089 505627 505606 504722 503074 501262 500037 499758 500265
60744 500265 501401 503297 505733 507543 507455 505523 502956 500374 497084 492460 487189 482559 479082 476501 474701
60729 474701 473859 473871 474319 474963 475854 476972 478054 478763 478921 478719 478756 479507 480675 481451 481579 481688 482422 483707
60711 483707 485097 486317 487176 487488 487397 487317 487292 486987 486538 486692 487627 488341 487801 486141 484172 482299 480493 478791
60693 478791 477118 475016 472287 469534 467534 466410 465936 466158 467092 468273 469304 470493 472273 474391 476378
60678 476378 478459 481281 484971 489094 493346 497613 501607 505043 508001 510706 513130 515115 516414 516352 514149
60663 514149 510143 505944 502744 500219 497806 496064 495630 495665 494818 493308 492594 493200 494264 495227 496602 498884
60647 498884 501890 505384 509324 513153 515788 516606 515805 513740 510680 507248 504135 501257 498045 494710 492336
60632 492336 491496 491555 491601 491300 490711 490061 489888 490568 491450 491268 489788 488269 487930 488569 489170 489272 489266 489692 490649
60613 490649 491717 492311 492259 492015 492070 492354 492597 492951 493640 494242 494093 493241 492290 491392 490255 489081 488615 489142
60595 489142 490212 491420 492730 494025 495298 497359 501354 507230 513478 518708 522743 525944 528372 530104
60581 530104 531590 533113 534332 534794 534580 534224 534371 535581 537957 540901 543769 546820 550934 556473 563109
60566 563109 570777 579843 590279 601600 613884 627908 643801 660333 675953 689881 701825 711313
60554 711313 717756 720694 719784 715178 708079 700171 692297 684406 676932 671208 668060 666833 666386 666366 667080
60539 667080 668867 672109 677226 684198 692699 703092 716579 733886 754549 777980 804479 834560
60527 834560 867768 902620 937072 968596 994650 1013840 1026227 1032094 1031112 1023228 1009632 992096
60515 992096 971981 950489 929128 908981 889981 871758 854822 840223 828485 819638 813860 811205
60503 811205 811009 812451 815619 821324 830069 841960 857610 878368 905493 939475 980160 1027033 1079292
60490 1079292 1135859 1195316 1255716 1314696 1370017 1419918 1462984 1498261 1525961 1547766 1566070
60479 1566070 1582907 1599386 1615464 1629822 1640295 1644611 1640504 1625382 1597030 1555209 1502057 1440591
60467 1440591 1373431 1303156 1232793 1165012 1101284 1042312 988722 940736 897817 859359 825291
60456 825291 795484 769185 745681 724931 706880 690766 675872 662407 650784 640619 631347 623308
60444 623308 617153 612519 608352 604380 601238 599211 597759 596302 594634 592564 589948 587120 584624 582461
60430 582461 580207 577797 575571 573612 571721 569993 568758 567965 567302 566914 567307 568492 569876 571119 572479
60415 572479 574180 576018 577808 579688 581756 583741 585259 586170 586648 587096 587917 589177 590597 592093 594058
60400 594058 596824 600122 603507 606996 610796 614650 618000 620703 623077 625417 627915 630858 634384 638127
60386 638127 641599 644823 648197 651961 656200 661038 666241 671027 674909 678451 682379 686249 688975 690621
60372 690621 692655 696194 700842 705465 709350 712259 714105 715106 715810 716570 717370 718442 720514 723956 727992
60357 727992 731307 733426 735235 738237 743493 751213 761014 772430 785243 799438 814931 831224 847240
60344 847240 861547 873008 881269 886450 888479 887056 882232 874593 864739 853085 840280 827308 814843
60331 814843 802978 791805 781724 772836 764638 756793 749635 743389 737508 731429 725519 720509 716388
60318 716388 712619 709098 706146 703848 702241 702003 704134 709020 716470 726582 739763 755985 774650
60305 774650 795166 816943 838876 859609 878553 896085 912589 927620 940010 948460 952194 951432
60293 951432 947010 939218 927409 911336 892402 872813 853867 835863 819256 804770 792450 781658
60281 781658 772095 763901 756727 749728 742637 735903 729554 722834 715272 707268 699278 691250 683245 675837
60267 675837 669439 663839 658803 654515 651042 648019 645295 643310 642313 641703 640711 639371 638350 638084 638497
60252 638497 639333 640405 641699 643498 646194 649790 653747 657421 660401 662348 662875 661847 659618 656865 654321
60237 654321 652549 651632 651090 650467 650014 650477 652261 655156 658759 662766 666956 671373 676439 682373 688569
60222 688569 694137 699050 704193 710344 717606 725766 734537 743555 752860 763291 775582 789070 802271
60209 802271 814860 828036 842592 857685 871986 885213 897872 910254 922402 934388 945877
60198 945877 955880 963620 969292 973445 976133 977299 977439 976992 975336 971315 964744 956663 948029 938892
60184 938892 929040 918823 908922 899581 890467 881195 871722 862252 853013 844320 836749 830915 826899 824004
60170 824004 821274 818214 814897 811606 808627 806250 804636 803632 802920 802256 801421 800182 798609 797198 796301
60155 796301 795686 795051 794686 795062 796007 796986 798098 800071 803277 807349 811795 816303 820430 823788 826756 830387
60139 830387 835331 841412 848441 856813 866981 878815 891734 905038 918016 930217 941745 952794
60127 952794 962763 970524 975754 979347 982242 984509 985954 986991 988446 990899 994564 999349 1004638 1009456
60113 1009456 1013232 1016142 1018492 1020213 1021179 1021452 1020865 1018909 1015420 1010919 1005829 999801 992348 983789 975021
60098 975021 966632 958661 951053 943906 937427 931942 927785 924843 922372 919578 916314 913033 910219 908059
60084 908059 906552 905737 905806 906980 909165 911832 914435 916732 918360 918355 915737 910517 903540 895248 885264 873355
60068 873355 860139 846525 832978 819668 806946 795300 785106 776577 769635 763717 758104 752637
60056 752637 747752 743752 740467 737750 735836 735012 735341 736853 739648 743689 748777 754717 761216 767822 774538
60041 774538 782282 791967 803141 814274 824415 833729 842301 849309 853740 855269 854197 851186 847254
60028 847254 843266 839123 833986 827392 819436 809886 798161 784512 770266 756456 742978 729469 716164
60015 716164 703520 691847 681680 673560 666993 660578 653773 647652 643302 640444 638299 636881 636540 636978
60001 636978 637645 638600 640165 642216 644437 646788 649140 651077 652618 654512 657299 660760 664843 670242 677329
59986 677329 685336 693354 701345 709310 716295 721239 724095 725153 724021 720424 715361 710213 705111 699328
59972 699328 692928 686857 681643 677086 673119 669995 667770 666426 666371 668051 671335 675991 682311 690397 699311
59957 699311 707901 716040 723949 730682 734579 735210 733829 731906 730173 728963 728357 727878 726877 725379 723794
59942 723794 721927 719118 715312 711100 706729 701974 697039 692754 689754 688173 688191 690087 693674 698356 703781
59927 703781 709881 716322 722564 728331 733383 737026 738700 738907 738774 738755 738574 738324 738657 739923 742038 745290
59911 745290 750338 757189 764897 772484 779563 786050 791971 797580 802941 807329 809738 810034 808949 807047
59897 807047 804517 801928 800189 799552 799472 799663 800570 802625 805793 810027 815401 821563 827801 833948 840584
59882 840584 848143 856466 865392 875089 885539 896328 907224 918323 929358 939494 948101 955204 960902
59869 960902 964929 967155 968011 968017 967197 965238 961923 957166 950894 943113 934025 924063 913864 903957 894223
59854 894223 884032 873280 862937 854091 846860 840837 836167 833306 832066 831845 832614 834740 837993 841791
59840 841791 846468 853235 862664 874072 886489 899175 911000 920484 927163 932274 937669 944552 953423
59827 953423 964250 976017 986609 993788 996222 993616 986424 975697 962706 948395 933440 918756
59815 918756 905370 893739 883674 874845 866782 858545 849324 839491 830272 822215 814810 807787 801861
59802 801861 797741 795074 792814 790139 786765 782849 778877 775185 771465 767197 762584 758447 755185 752461
59788 752461 749920 747451 744766 741571 738245 735513 733370 731199 729004 727480 726753 726254 726131 727508 730760
59773 730760 734675 738084 741316 745226 749764 754459 759561 765615 772426 779369 786400 793959 802161 810812
59759 810812 819945 829698 839922 850449 861487 873256 885510 897933 910755 924436 938952 953802
59747 953802 968493 982655 995872 1007750 1017995 1026248 1032192 1035965 1038058 1038616 1037329 1034278 1030303
59734 1030303 1026187 1021956 1017372 1012632 1008153 1004093 1000518 997634 995476 993773 992448 991817 991966 992375 992566
59719 992566 992606 992608 992210 991062 989376 987482 985268 982574 979800 977510 975723 974129 972835 972335 972819 973943
59703 973943 975293 976754 978500 980811 983887 987728 992251 997479 1003402 1009722 1016101 1022588 1029308 1035701
59689 1035701 1040587 1043140 1043435 1041936 1038980 1034879 1030069 1024937 1019746 1014638 1009307 1002867 994724 985453
59675 985453 976089 966680 956478 945473 934689 924781 915467 906674 899100 893138 888321 884425 882113
59662 882113 881766 882593 883741 885488 888514 892704 897517 902968 909336 916412 923851 931860 940642 949466 956975
59647 956975 962250 965027 965204 962710 957627 950020 939945 927958 915111 902060 888674 874961 861762
59634 861762 850033 840050 831795 825449 820834 816965 812861 808306 803211 796893 788823 779594 770322 761491
59620 761491 753105 745510 739180 733976 729342 724970 720722 716346 711982 708523 706711 706251 706511 707612 709962
59605 709962 713102 715984 718181 719983 721436 722179 722172 721819 721407 721107 721397 722766 724956 727104 728657 729639
59589 729639 730138 730112 729649 728918 727830 726150 723847 721075 717991 714890 712204 710005 707841 705441 703174
59574 703174 701385 699702 697578 695115 692813 690862 689227 688067 687479 687152 686767 686404 686136 685782 685566 686256
59558 686256 687855 688824 687752 685443 684233 685334 687790 690018 691433 692467 693733 695416 697111 698273
59544 698273 699079 700568 703544 707846 713262 720591 731008 744824 761734 781799 804951 829440 851731
59531 851731 868279 877183 878639 874739 868695 863216 859268 856661 855434 855915 857725 859738 861161 861923
59517 861923 862007 861076 858790 854832 848664 839977 829490 818704 808724 799689 791190 782747 774058 765376
59503 765376 757486 750790 744673 738393 732354 727750 725066 723628 722476 721077 719402 718088 718311 720674
59489 720674 724267 727587 730271 733179 736914 741156 745441 749710 753950 758030 762144 766824 772364 778621
59475 778621 785342 792216 798794 804928 811125 817839 824588 830356 834627 837363 838382 837685 836199 835100
59461 835100 834474 833642 832883 833796 837678 844344 852800 862318 872638 883781 895953 909095 922415 934891
59447 934891 946291 957038 966956 974799 979196 979669 976691 971262 964398 956553 947547 937523 927759 919953
59433 919953 914802 911767 909924 908474 906831 905089 904249 905258 908076 912385 918742 928106 940573 955707
59419 955707 973664 994765 1018228 1042844 1068847 1097582 1129272 1162804 1198045 1236294 1277004
59408 1277004 1315135 1343166 1355715 1352087 1335631 1311770 1286061 1262684 1244142 1232123 1228084 1232493
59396 1232493 1243578 1256843 1265814 1264222 1249094 1222437 1189431 1154725 1120757 1088972 1060923 1037479
59384 1037479 1018073 1001622 987695 976301 967166 959848 954158 950063 947495 946474 946984 948570 950614
59371 950614 953067 956235 959744 962628 964761 967363 971591 977325 983716 990245 996752 1003114 1009484 1016385
59357 1016385 1024124 1032582 1041869 1052538 1064750 1077879 1091488 1106154 1122693 1140970 1159981 1178794
59345 1178794 1196931 1214198 1230637 1246443 1261503 1275129 1286450 1294820 1299659 1300323 1296498 1288539
59333 1288539 1277137 1262805 1245816 1226428 1205033 1182228 1158762 1135248 1111995 1089252 1067382
59322 1067382 1046551 1026644 1007960 991538 978056 966664 955736 944685 934272 925189 917208 909799
59310 909799 902793 896261 890377 885442 881462 877769 873732 869735 866626 864276 861699 858699 856420 855996
59296 855996 857438 860192 864125 869728 877835 889257 904218 922269 943083 966645 991605 1014086
59284 1014086 1029745 1037227 1038473 1035864 1030583 1023858 1017864 1014490 1014308 1017376 1024013 1034219 1047411
59271 1047411 1063223 1081673 1102147 1123400 1144937 1167127 1189387 1209571 1225914 1238389 1247322
59260 1247322 1251905 1251268 1246134 1238299 1229006 1218580 1207005 1194121 1179888 1165092 1151148 1138676
59248 1138676 1127010 1115618 1105006 1095633 1087037 1078976 1072441 1068431 1066407 1064985 1063526 1062062 1060310
59235 1060310 1057836 1054797 1051615 1048209 1044313 1040138 1035945 1031266 1025275 1017670 1008671 998540 987602
59222 987602 976394 965316 954497 944248 934993 926501 918031 909664 902573 897341 892933 888154 883298
59209 883298 879491 877013 875168 873305 871263 869211 867644 866966 866623 865382 863022 860837 859748 858834 856725
59194 856725 853610 850767 848682 846822 844915 843408 842782 843177 844557 846675 849075 851553 854249 856940 858910
59179 858910 859933 860667 861567 862187 862142 861947 862201 862746 863406 864746 867280 870645 874390 878823 884213 889862
59163 889862 894882 899223 903093 906146 908097 909305 909748 908262 903919 897387 889744 880797 869951 858106
59149 858106 847086 837463 828344 819144 810239 801901 793821 785782 777876 770016 762022 754177 747026 740858
59135 740858 735911 732636 731037 730265 729694 729870 731508 734218 737230 740783 745536 751147 756813 762954 770908
59120 770908 780986 792118 803592 815949 829906 845354 861680 878334 894853 910938 926581
59109 926581 941618 955236 966487 975192 981860 986960 990747 993470 995087 995083 993160 989799 985585 980419
59095 980419 974038 966828 959516 952546 946419 941938 939295 937493 935542 933629 932154 930307 926809 921659
59081 921659 915953 910246 904156 897349 889824 881453 872246 862954 854492 846894 839632 832735 826699 821545
59067 821545 816797 812195 807701 803142 798602 794778 792113 789938 787220 783753 779878 775687 771379 767789
59053 767789 765464 763724 761654 759518 758129 757378 756584 755858 755866 756515 757027 757097 756979 756655 755881 754777 753599
59036 753599 752332 751306 751516 753428 756211 759236 763499 770330 779509 790077 802247 816952 834055
59023 834055 852575 872154 892731 913240 932207 949184 964020 975282 981242 982117 979581 974439
59011 974439 966647 957273 948218 939865 930999 921401 912673 906093 901348 897934 896290 896937 899717 904312
58997 904312 910500 917616 924726 931392 937356 941850 944431 946171 948588 951642 954200 956068 957800 958864
58983 958864 958023 955662 953827 953745 955008 957319 961174 966522 972660 979894 989596 1002118 1016211 1030912
58969 1030912 1046440 1062931 1079888 1097259 1115352 1133327 1149508 1163634 1177083 1190316 1201772
58958 1201772 1209894 1214540 1215725 1212655 1204909 1193181 1178129 1159733 1138427 1115512 1091859 1067523
58946 1067523 1043127 1020230 999787 981580 965529 952060 940783 930511 921221 914447 911060 910192
58934 910192 910935 913465 917749 922728 927601 932421 936716 939085 939010 937552 935465 932133 927172 921478 915708
58919 915708 909269 901844 894561 888574 883727 879544 876312 874310 873256 873319 875383 879524 884657 890471 898243
58904 898243 908822 921341 934887 949953 967137 985872 1005526 1026325 1048041 1069142 1088514
58893 1088514 1106834 1125184 1143602 1162124 1181847 1203691 1227300 1252236 1278857 1306745 1333573
58882 1333573 1356963 1376373 1392085 1403680 1410878 1414597 1415657 1413440 1407175 1397453 1385189 1370343
58870 1370343 1353197 1335724 1319966 1305878 1292282 1279048 1266759 1255016 1242751 1229735 1216389
58859 1216389 1202649 1188294 1173871 1160065 1146699 1133468 1121013 1110132 1100558 1091577 1083095 1074975
58847 1074975 1066103 1055397 1043118 1030101 1016333 1001415 985710 969912 954065 938080 922610
58836 922610 908428 895578 883939 873754 864715 855631 846230 838267 833540 831623 830859 830719 831725 833827
58822 833827 836414 839457 843227 847317 851155 855137 859970 865256 869801 873071 875349 876821 877435 877328 876572
58807 876572 874883 872213 869122 865967 862327 857743 852279 845913 838401 830306 822980 816851 810883 804428
58793 804428 798171 792457 786342 779562 773933 771270 771175 772320 774676 778855 784416 790586 797867 807248 818497
58778 818497 830652 843422 856688 869335 879939 887891 892758 893522 889801 882837 874004 863431 851416
58765 851416 839816 830214 821901 813602 806190 801615 799873 799172 798650 798963 800448 802411 804057 804654 803212
58750 803212 799480 794936 791474 789530 788632 788987 791100 794627 799187 805619 814856 826128 837704 848766
58736 848766 859193 868409 876108 883346 891211 899113 905909 911934 918227 924647 930466 935956 941481 945924
58722 945924 948109 949131 951220 954900 959321 964664 971930 980693 989342 997394 1005471 1013175 1018972 1022136
58708 1022136 1022919 1020939 1015304 1006294 995150 982306 967377 950579 932462 912664 890731 867779
58696 867779 845532 824126 802773 782088 763636 747522 732658 719173 708348 700208 693329 686978
58684 686978 681330 675611 668388 659985 652513 647071 642800 638904 635699 633320 631285 629730 629448 630405 631836
58669 631836 634012 638263 645042 653597 663742 676389 692001 709802 728443 746006 759669 767170
58657 767170 768771 766373 760893 752103 740605 727956 714921 701517 688701 678027 669507 661669 653924
58644 653924 647112 641626 636787 632220 628251 624922 622116 620478 620542 621259 621244 621141 622674 625569 627627 627853
58628 627853 627392 627265 627206 626915 626473 625348 622813 619477 616786 615273 614992 617081 622618 630384 638244 646415
58612 646415 656757 669043 680816 691009 700746 710207 717671 722408 725838 728957 731066 731810 732101 732155
58598 732155 730905 728268 725817 724422 723256 721860 721115 721520 722589 724635 729103 736498 745930 757190
58584 757190 771089 787286 804069 820852 838583 857060 874180 888619 900954 911488 919425 925126
58572 925126 930834 938071 946390 955612 967185 982456 1001604 1025055 1053809 1087560 1124646 1164546
58560 1164546 1208083 1254287 1299380 1339804 1374050 1400809 1418035 1425276 1424759 1418925 1408824 1395861
58548 1395861 1382718 1371181 1360991 1351937 1344969 1340075 1335039 1327492 1316334 1300368 1277861 1248763
58536 1248763 1215485 1180346 1143992 1107030 1071019 1036947 1004821 975582 951085 931250 913656
58525 913656 897010 882614 871359 861894 853134 846103 841629 838395 834841 831017 827248 822942 818103
58512 818103 814064 811479 809420 807429 806331 806121 805345 803680 802804 803557 804556 804746 804913 805506 805426 804245 803230
58495 803230 802964 802398 801430 801750 803912 806228 807941 810733 815690 821612 827906 836319 848130 862442 878986
58480 878986 899737 925771 955153 985836 1017863 1050709 1081182 1106115 1124698 1136298 1138869 1131899
58468 1131899 1118403 1101751 1082809 1062140 1042258 1025287 1010889 998779 990890 988696 990829 995648
58456 995648 1003933 1016898 1033946 1054385 1078633 1105337 1129917 1148492 1160941 1167972 1168009 1159599 1144317
58443 1144317 1124641 1101292 1075094 1048904 1025102 1003530 984210 969284 959718 952973 946800 942576
58431 942576 942053 943642 945152 947584 953028 961253 971480 984894 1001944 1019426 1033567 1043907 1051149
58418 1051149 1053758 1050166 1042156 1032582 1021684 1008789 995433 983442 971916 959263 946183 933668
58406 933668 920471 905813 892233 882345 875009 868007 862060 858706 856690 854217 852516 853454 855736 857190
58392 857190 858671 861936 865784 868011 869133 870472 870816 868817 866543 866652 868083 868478 868801 871605 876684
58377 876684 882429 889468 898995 909424 918739 928275 940307 953920 967111 980778 996579 1013077
58365 1013077 1028270 1043825 1062569 1083812 1105307 1127600 1152040 1176587 1197930 1215754 1230806
58354 1230806 1241214 1245166 1244880 1243450 1240190 1233627 1226325 1221743 1218846 1214916 1211184 1210471 1211816 1212982
58340 1212982 1215831 1223555 1234750 1245946 1257887 1273600 1292347 1311352 1331462 1355101 1380393 1403133
58328 1403133 1422827 1441163 1456610 1466468 1472178 1476576 1478098 1473949 1466791 1461725 1458734 1454719 1450887
58315 1450887 1451089 1454668 1458002 1461531 1468332 1477432 1485615 1494145 1506520 1521193 1533811 1545006 1558577
58302 1558577 1573734 1586863 1599265 1615136 1633293 1648970 1662508 1678164 1695633 1711129 1725755
58291 1725755 1744322 1766728 1788765 1810338 1834440 1859228 1880033 1898345 1919923 1944931 1968835
58280 1968835 1991923 2018532 2047828 2075033 2101087 2131355 2165435 2198142 2229998 2266630 2308308
58269 2308308 2350326 2393235 2442092 2495985 2549033 2601626 2659870 2724202 2789445 2855556 2926730
58258 2926730 3000219 3067949 3129234 3190145 3250851 3306078 3357614 3413241 3473410 3532365 3592125
58247 3592125 3661195 3739371 3818463 3898320 3987008 4084781 4183746 4284213 4395100 4517060 4641933
58236 4641933 4770066 4910729 5063998 5220510 5381074 5557614 5752360 5955593 6166531
58227 6166531 6396167 6646569 6908523 7183077 7483577 7812830 8161081 8530314 8936455
58218 8936455 9383418 9860421 10369532 10929009 11544744 12207527 12924171 13720433 14607344
58209 14607344 15578567 16648378 17856173 19225985 20762582 22498383 24501811 26830215
58201 26830215 29526995 32683899 36457509 41015326 46537436 53303177 61718045 72249162
58193 72249162 85443428 102054069 123024895 149259229 181477329 220217458 265386878
58186 265386878 315009407 364127744 405448787 431978486 439911433 429760832 405352534
58179 405352534 371873264 334244291 296270228 260439959 228143271 200050477 176413949
58172 176413949 157190664 142033827 130239581 120755459 112377685 104124994 95540410
58165 95540410 86679686 77851740 69380222 61514005 54406244 48098610 42547839 37692051
58157 37692051 33479294 29843054 26696846 23968855 21614178 19585968 17824587 16284213
58149 16284213 14942585 13774908 12742893 11818000 10991575 10252881 9578815 8953624 8378072
58140 8378072 7850833 7360064 6900735 6481152 6104181 5759294 5440174 5152955 4899852
58131 4899852 4671067 4459934 4270022 4100119 3937733 3775081 3617406 3468764 3323778
58122 3323778 3180277 3046100 2925709 2812681 2702390 2599831 2508100 2421160 2335087 2255178
58112 2255178 2185096 2119683 2055095 1995608 1943952 1894863 1844466 1796465 1753205 1710131 1664788
58101 1664788 1621884 1583769 1545229 1503405 1463620 1429543 1396627 1361266 1327667 1299493 1273062
58090 1273062 1245088 1219235 1198812 1180406 1160741 1142646 1128395 1114087 1096403 1078285 1062459
58079 1062459 1045875 1025950 1005899 988484 970703 949880 928977 910809 893011 873771 856520
58068 856520 843770 832030 817896 803735 792427 782001 770391 760189 753688 748190 740872 733468
58056 733468 727748 721336 712342 703198 695741 687527 677092 667591 660988 653981 644131 634741 629055 624824
58042 624824 619295 614403 612025 609052 602428 594569 588720 583303 575863 568353 563287 558616 551484 543353
58028 543353 536524 529262 519348 508959 501152 494727 487280 480093 475349 471550 466254 460476 456140 452165
58014 452165 447220 443275 442169 441662 439025 435607 433826 432745 430752 429458 430672 432527 432843 433377 436491
57999 436491 440610 443337 446137 451452 457950 463169 468223 475322 483012 488389 491764 494781 496203 494045
57985 494045 489789 486044 482076 475970 469249 464792 461841 457483 451708 446851 443344 439991 437211 436241
57971 436241 436295 435911 435773 436991 438261 437960 437227 437624 437815 436111 434294 435024 437275 438135 437445 436827 435759
57954 435759 432578 428003 423955 420213 415764 411892 410238 409390 407152 404703 404717 406880 409234 412514 419012
57939 419012 428234 437785 447635 459597 473422 487223 500944 515588 529784 540938 549159 556390
57927 556390 562220 564205 561817 556553 548744 537783 525011 512785 501000 487873 473686 460422
57915 460422 448219 435712 423557 414133 407880 403150 399507 397991 398297 398834 399448 401043 402734 402401
57901 402401 399990 397366 395108 392339 389441 387961 387943 388169 388902 391615 396276 401661 407978 416349 425908
57886 425908 434315 440960 446991 452480 456385 459026 461754 464385 465622 465712 465928 465838 464033 461256 459810
57871 459810 460078 460504 460797 462198 464774 467425 470461 475129 480631 484647 486906 489301 492469 495290 497857
57856 497857 501830 507425 512946 517690 522567 527522 531134 533120 534492 534912 532676 527825 522663 518593
57842 518593 514872 510861 507048 503478 499581 495877 493472 491765 489156 486158 485090 486440 488294 489775
57828 489775 492281 496735 502198 507826 513743 519396 523469 525985 528162 529822 529379 526737 523633 520635
57814 520635 516446 510750 505057 499975 494257 487448 481091 476389 472833 469768 467021 463345 456728 447139
57800 447139 436807 427093 417309 407233 398225 390933 384253 377652 372370 369307 367775 367184 367936 369786
57786 369786 371435 372653 374874 378941 384219 390556 398895 409150 419654 429554 439609 449806 458479
57773 458479 464788 469936 474856 478745 480831 481518 480808 477725 472334 466260 460203 453077 444692 437028 431507
57758 431507 427116 422677 419000 417200 416631 416057 415432 415205 415245 415697 417492 420942 425104 429430 434549 440645
57742 440645 446716 452269 458007 463987 468927 472292 475147 477917 479286 478600 477427 477250 477343 476370 474552
57727 474552 472806 471195 469582 468508 468111 467450 466058 464854 464475 464128 463153 462247 462025 461862 461275 461052 461838
57710 461838 463035 464149 465735 467913 469494 469752 469549 469595 469232 468208 467934 469523 472064 474320 476703 480076
57694 480076 483919 487147 489596 491322 491682 490398 488309 485828 481990 476339 470353 465585 461730 458060
57680 458060 455449 455345 457810 462175 468806 478878 493382 513622 541715 579385 627231 686296 759168
57667 759168 848073 952304 1067529 1185333 1292245 1371896 1411764 1408684 1367931 1298810 1212097
57656 1212097 1118725 1027103 941218 862437 792234 731838 680678 637354 601456 572782 549670
57645 549670 529970 513032 499109 487535 477224 468261 461198 455269 449067 442526 436698 431901 427611
57632 427611 423805 420978 419138 417982 417669 418195 418562 417837 416516 415630 415075 414040 412468 410817 408919 406366
57616 406366 403540 401114 399069 397209 395934 395383 394622 392916 391026 390001 389580 389127 389284 391095 394133
57601 394133 397006 399146 400779 401751 401852 401695 401874 401822 400871 399657 399018 398227 396060 393019 390729 389534
57585 389534 388374 386795 385484 384966 385220 386380 388389 390176 390508 389515 388201 386835 385070 383173 381753
57570 381753 380588 379065 377443 376382 375592 374266 372518 371046 369796 368292 366898 366323 366201 365678 365056
57555 365056 365440 366971 368814 370652 372798 375130 377437 380569 385665 392240 398414 403029 406338 408801
57541 408801 410525 411771 412655 412504 410832 408754 408074 409031 410271 410923 411306 411686 411739 411376 410855 410016 408521
57524 408521 406823 405812 405601 405763 406495 408324 410879 413257 415488 418400 422177 426283 430639 435603 440912
57509 440912 445859 450435 455162 460030 464735 469546 474581 478688 480608 481006 481741 483334 484776 485656 486625
57494 486625 487726 488091 487639 487493 488325 489682 491232 493242 495534 497352 498609 500013 501707 503087 504222
57479 504222 506083 509043 512363 515460 518468 521348 523723 525824 528316 530884 532324 532374 532168 532553 533230
57464 533230 534031 535699 538755 542607 546384 549828 552983 555859 558720 561943 565334 568333 570931 573586
57450 573586 576354 579094 582363 586919 592345 597385 601652 605807 610034 613713 616705 619667 622915 626217
57436 626217 629837 634422 639665 644440 648529 652912 658087 663460 668664 674151 680040 685680 690757 695668
57422 695668 700487 704846 709104 714273 720387 726223 731057 735467 740023 744538 749075 754347 760555 767020
57408 767020 773528 780829 789293 798180 806679 814533 821297 826342 830086 833947 838598 843474 848359 853981
57394 853981 860464 866802 872643 879121 886932 894985 902028 908511 915709 924026 933258 943641 955490 968313
57380 968313 981137 993311 1004484 1014480 1023685 1032806 1041786 1049778 1056535 1062869 1069280 1075216 1080312
57367 1080312 1085256 1090713 1096299 1101445 1106495 1112212 1118854 1126261 1134239 1142396 1150301 1158154 1166561 1175449
57353 1175449 1184158 1192740 1202060 1212333 1222750 1232920 1243396 1254351 1265054 1275222 1285581 1296438
57341 1296438 1307038 1316948 1326777 1336767 1346023 1354092 1362042 1371016 1380800 1390725 1400850 1411297 1421501
57328 1421501 1431137 1440852 1451200 1461821 1472455 1483625 1495429 1506867 1517430 1528213 1540279 1552956
57316 1552956 1565011 1576585 1588684 1601533 1614700 1628229 1642469 1657252 1672182 1687235 1702297
57305 1702297 1716790 1730549 1744336 1758694 1773128 1787205 1801501 1816574 1831968 1847247 1863037
57294 1863037 1879937 1897255 1914021 1930436 1947222 1964354 1981560 1999277 2017817 2036276 2053607
57283 2053607 2070220 2087376 2105515 2124330 2143797 2163812 2183364 2201437 2218471 2235713 2253418
57272 2253418 2270845 2287765 2304761 2322172 2339721 2357199 2374653 2392039 2409310 2426678 2444204
57261 2444204 2461481 2478315 2495246 2512815 2530831 2548911 2567180 2585854 2604814 2624145 2644312
57250 2644312 2665211 2685927 2706159 2726862 2748675 2770704 2791903 2812640 2833802 2855311 2876733
57239 2876733 2898417 2920628 2942385 2962690 2982331 3002926 3024558 3045781 3065716 3084806 3103654
57228 3103654 3122314 3140597 3158182 3174605 3190021 3205550 3222007 3238742 3254699 3270065 3285887
57217 3285887 3302604 3319985 3338006 3356663 3375338 3393459 3411365 3429587 3447825 3465616 3483280
57206 3483280 3501005 3517685 3532031 3544343 3555909 3567159 3577701 3587609 3597201 3605879 3612686 3617769
57194 3617769 3621992 3625439 3627725 3629525 3632300 3636552 3641716 3647635 3654702 3662520 3669923 3676663 3683897 3692656
57180 3692656 3702677 3712934 3722575 3731311 3739585 3748275 3757512 3766100 3772804 3777781 3781917 3785325 3787589
57167 3787589 3789036 3790426 3791595 3791540 3789759 3786482 3781777 3775522 3768160 3760561 3753189 3746122 3739563 3733543
57153 3733543 3727534 3721249 3715404 3710846 3707447 3704709 3702689 3701249 3699165 3695339 3690435 3686038 3682731 3680231
57139 3680231 3678816 3679061 3680496 3681965 3683202 3684818 3686941 3688894 3689887 3689002 3684978 3677172 3666374 3653771
57125 3653771 3639801 3624863 3610114 3596343 3583181 3570984 3562512 3561124 3568272 3584365 3610873 3649341
57113 3649341 3699077 3758052 3825660 3902763 3989748 4086765 4195524 4319055 4460448 4623996
57103 4623996 4817134 5049474 5331012 5674041 6096713 6623217 7281976 8106733 9138869
57094 9138869 10425452 12014041 13949281 16270881 19009796 22184825 25801378 29845219
57086 29845219 34266916 38970016 43817886 48650117 53286671 57522190 61138076 63943050
57078 63943050 65816235 66723457 66706641 65862357 64316443 62196903 59616106 56670263 53445745
57069 53445745 50017824 46446072 42780461 39076726 35404863 31843485 28468267 25342554
57061 25342554 22510157 19990486 17779860 15858818 14199681 12770998 11540472 10477275
57053 10477275 9552693 8740219 8017334 7367659 6780459 6248323 5765913 5329338 4934272
57044 4934272 4574665 4244626 3940872 3661648 3403911 3163587 2938255 2727474 2530479
57035 2530479 2345457 2171364 2008822 1858839 1721893 1598407 1488765 1392525 1308663 1236800
57025 1236800 1177296 1130035 1094156 1069292 1056431 1057502 1074755 1110574 1167198 1245655 1343482
57014 1343482 1451478 1552362 1625062 1653665 1634041 1573062 1483067 1377225 1267062 1160616
57004 1160616 1061705 971542 890825 819853 757768 703209 655495 614306 578857 548437 523157
56993 523157 503086 487147 473901 462925 454588 449176 447153 449461 456445 467153 480549 496207
56981 496207 512455 525010 529384 524351 511749 493709 471729 447782 424200 402308 382479 365375
56969 365375 351785 341501 333723 328439 326202 326939 330396 337441 349486 366778 388636 415103 446554
56956 446554 481313 514880 541887 558108 561119 550742 529486 501594 471086 440793 412606 387529
56944 387529 365645 346946 332076 321570 314894 311280 311142 315615 325126 339497 359115 384902 417379
56931 417379 456470 501231 548126 589982 618554 628821 620648 597363 564124 526683 489355 453528
56919 453528 419055 386792 358479 334601 314047 295916 280182 266569 254235 242775 232349
56908 232349 222823 213938 206192 200288 195853 191987 188870 187413 187465 187928 188622 190492 193909 198311 203689
56893 203689 211006 221028 234122 251208 273370 300400 331281 366045 405127 446254 483753 511912
56881 511912 528060 532242 525788 511167 491790 470665 449724 430647 415088 403433 394604 387966
56869 387966 384602 386131 393272 406316 426231 454478 492277 540553 600032 670604 750157 833327
56857 833327 910724 970532 1003259 1006300 983876 943067 890840 833745 777538 725710 679444 639581
56845 639581 607582 584347 569689 563789 568023 583847 612156 654432 713213 790575 887125 1002630
56833 1002630 1135136 1277011 1412377 1520798 1585367 1598928 1565024 1494637 1401318 1297069
56823 1297069 1190731 1088575 995008 912380 841244 781649 733948 698313 674303 661531 660356
56812 660356 671779 697236 738611 797585 874207 965812 1066327 1165255 1247965 1299806 1312439
56801 1312439 1286916 1231094 1154975 1068038 978312 891586 811173 738942 676280 623886 581488
56790 581488 548434 524216 508213 499706 498696 506115 522823 548962 584448 628979 680359 732945
56778 732945 778336 808086 816567 802689 769764 723632 670374 615202 562235 513987 471029 432895
56766 432895 399309 370038 344199 320945 300576 283698 269483 256210 243522 232657 224252 217417
56754 217417 211338 206266 202317 198656 194634 190610 187038 183744 180685 178353 176836 175415 173670 172071
56740 172071 171062 170479 170218 170392 170512 169664 167938 166539 166114 166164 166456 167513 169163 170170 170094 170141 171256
56723 171256 172776 173970 175532 178308 181632 184216 185786 186786 187287 187318 187519 188378 189460 190268 191107 192228
56707 192228 192978 192873 192761 193868 196196 198781 200948 202469 203040 202574 201600 200665 199772 198927 198605 199030 199704
56690 199704 200262 201079 202400 203653 204335 204852 205748 206802 207570 208140 208729 209306 210240 212452 216087 219790 222069
56673 222069 222711 222246 220854 218593 215915 213146 210107 206889 204205 202375 200830 199322 198623 199254 200395
56658 200395 200949 200803 200318 199523 198659 198472 198972 198861 197278 195252 194271 194224 193913 192943 191914 191245 190919 191069
56640 191069 191969 193704 196359 199942 203728 206541 208252 210036 212510 214795 216148 217288 219036 220843
56626 220843 221871 222530 223639 224938 225650 225762 225541 224608 222786 221113 220734 221302 221611 221228 220400 219056 217045
56609 217045 214874 213200 212109 211611 211987 212849 212886 211604 210334 210378 211181 211504 211385 211565 211944 212057 212263 213024
56591 213024 213769 213829 213757 214383 215332 215838 216153 216738 216917 215968 214741 214618 215483 216295 216944 217951 219033 219729
56573 219729 220846 223516 227187 230186 231982 233401 235072 237176 240259 244757 250212 256443 264931 277425
56559 277425 293695 312165 331926 352223 370539 383491 389696 390220 386576 380028 372387 365312 358711
56546 358711 351557 344164 337936 333002 328050 322527 317184 312364 307475 302404 297763 293565 289124 284458
56532 284458 280325 276823 273362 270035 267514 265643 263632 261592 260330 259739 259054 258640 259715 262118 264070
56517 264070 264420 263568 262000 259565 256530 253776 251467 248835 245629 242589 240264 238545 237435 237048 236856
56502 236856 236234 235709 236307 237720 238565 238402 238058 237986 237830 237619 237826 238147 237764 236944 236911 238043 239553 240961
56484 240961 242402 243432 243106 241472 239688 238572 238173 238491 239251 239318 237938 236208 235693 235974 235455 234146
56468 234146 233490 233724 233800 233919 235605 238846 241525 242363 242357 242642 242931 242762 242504 242423 242377 242905 244931 247929 250091
56449 250091 250772 251131 252058 253246 254610 256695 259257 261288 262798 264622 266179 265688 263109 260617 259410
56434 259410 258311 256375 254625 254045 253840 252907 251340 249437 246914 244098 242269 241847 241799 241588 241967 243016
56418 243016 243347 242307 241208 241208 241591 241285 240510 239773 238750 237264 236031 235447 234949 234396 234666 236091 237790
56401 237790 239286 241210 243602 245221 245464 245357 245752 246167 246321 247118 249066 251338 253409 256101 260010 264402
56385 264402 268532 272552 276294 278871 280335 282009 284258 285666 285360 284373 283762 283210 282554 282787 284341 286103
56369 286103 287327 288769 290874 292612 293332 293974 295309 296757 297988 299757 301965 302979 302274 301734 302875
56354 302875 304705 305874 306956 308956 311382 313516 315834 318537 320446 321066 321951 324254 326656 327563 327624
56339 327624 328179 328892 329005 329425 331480 334823 338469 342660 347856 353129 357378 361042 364964 368799 372143
56324 372143 375898 380808 385910 389989 393264 396060 397333 396294 394143 392487 391337 390191 389583 389891 390162
56309 390162 389863 390238 392157 394327 395541 397038 400537 405606 411186 418103 427572 438479 448601 457449
56295 457449 465674 472819 478075 482379 487452 493433 499432 505575 512522 519866 526987 534650 543846 553903
56281 553903 563533 572893 582865 593244 603408 613779 624994 636662 648544 661776 677317 694486
56269 694486 712595 732548 755073 778984 803123 828505 856688 887715 921694 960587 1006050
56258 1006050 1057132 1112598 1174106 1244640 1325229 1415676 1517050 1630839 1756886 1894767
56248 1894767 2045899 2211584 2390097 2578199 2774339 2977672 3185044 3391580 3593166
56239 3593166 3785702 3963054 4118591 4248134 4349162 4418412 4453056 4453395 4421899 4360608 4271816
56228 4271816 4159977 4030114 3885300 3728227 3563858 3397621 3231935 3067200 2905055
56219 2905055 2747814 2595894 2448829 2307998 2175627 2052042 1936486 1829353 1730871 1639008
56209 1639008 1551726 1469960 1395363 1326651 1261564 1200893 1146827 1098472 1052928 1009916 971502
56198 971502 937888 907303 879505 855628 834912 815191 796404 780211 766504 753620 741588
56187 741588 731750 723566 715153 706597 699454 693520 687381 681591 677812 675450 672639 669903 669196 669975 670040
56172 670040 669726 671331 674785 677826 680217 683909 689280 695109 701961 711582 723023 733373 742357 752358
56158 752358 764008 775725 787571 801491 817651 834449 852227 872989 896457 920471 945474
56147 945474 974593 1009253 1048847 1094874 1151266 1220357 1302590 1400245 1516973 1653107 1805311
56136 1805311 1970697 2146522 2325385 2495741 2648891 2782346 2896560 2993108 3076742 3154202
56126 3154202 3228627 3297761 3357819 3405711 3437791 3451252 3447969 3433443 3411234 3381296 3342767
56115 3342767 3293681 3228093 3138601 3022929 2884823 2729194 2560998 2388225 2220257 2062311
56105 2062311 1915657 1782844 1667455 1568859 1482874 1408094 1346208 1295993 1252939 1215466 1185655
56094 1185655 1162997 1143371 1125223 1110895 1100704 1091499 1082327 1075770 1072366 1069415 1066491 1066388 1069398
56081 1069398 1072454 1075050 1080013 1087341 1093622 1098755 1106733 1118337 1129740 1139973 1152935 1170077 1187908
56068 1187908 1204851 1223788 1245473 1266189 1284367 1302976 1322936 1340800 1355348 1369767 1384860
56057 1384860 1396932 1404895 1412661 1422011 1430140 1436692 1445981 1459453 1473187 1485534 1499870 1517063
56045 1517063 1532975 1546426 1561929 1581383 1600869 1618760 1638988 1663008 1686727 1708801 1733712
56034 1733712 1763206 1793147 1822241 1855024 1892608 1929700 1964582 2002546 2045355 2087217 2125648
56023 2125648 2166240 2211846 2257425 2300789 2347906 2401800 2456767 2509568 2565690 2628341 2692017
56012 2692017 2753593 2818918 2891642 2966517 3040679 3120273 3208684 3299609 3389192 3483264 3585103
56001 3585103 3688371 3790134 3898255 4017608 4142034 4268380 4404693 4555336 4712292
55992 4712292 4871028 5040342 5226408 5422477 5625135 5844583 6087121 6344132 6610790
55983 6610790 6898359 7214960 7552548 7907053 8292183 8718060 9176219 9662085 10191244
55974 10191244 10776181 11409630 12090164 12840618 13680811 14607878 15626438 16771095 18074778
55965 18074778 19545363 21202233 23105009 25317604 27883198 30874352 34433726 38732686
55957 38732686 43944532 50316411 58228292 68143713 80590063 96275310 116136541 141140442
55949 141140442 172077657 209570249 253828837 303557381 354578337 399852357 431735979
55942 431735979 445151020 439384857 417571571 384797454 346265731 306193637 267420345
55935 267420345 231536795 199289684 170943361 146447533 125525699 107801888 92899619
55928 92899619 80441875 70033661 61308304 53974876 47795944 42551673 38057001 34185508
55920 34185508 30842492 27931552 25368883 23105453 21107091 19329031 17730974 16297768
55912 16297768 15021750 13879438 12844900 11910137 11072277 10314573 9618529 8981584 8405239
55903 8405239 7878157 7387576 6935308 6526200 6152067 5802385 5479735 5189394 4924106
55894 4924106 4674072 4442069 4234048 4043985 3862312 3690750 3535054 3391174 3252043
55885 3252043 3120479 3002357 2893952 2788522 2688663 2600143 2520039 2442679 2371059 2310887
55875 2310887 2259272 2210424 2166521 2131652 2100410 2063604 2020484 1974995 1925090 1866540 1803039
55864 1803039 1742110 1684624 1627686 1573743 1527245 1485984 1444974 1405397 1371037 1339543 1306124
55853 1306124 1272413 1243024 1216626 1188812 1160549 1135337 1111164 1083609 1054156 1027371 1002559
55842 1002559 976117 949496 926978 907824 888155 868313 851162 835496 818413 801872 789702
55831 789702 780257 769080 756749 747077 739680 731315 722637 716554 711581 703681 693243 683715 674836
55818 674836 663803 651761 642611 636478 630486 624841 622114 621587 620270 618573 619403 622715 626409 631370
55804 631370 640055 651231 661547 671183 682566 694698 704092 710131 714275 715270 710573 701366 690772
55791 690772 678272 661254 641004 621662 604208 586875 570561 558307 550009 542989 537139 534164
55779 534164 532341 527544 519379 511270 504723 498450 492926 490794 492736 497534 505924 519568 536323 551170
55765 551170 561744 568532 570205 563973 550832 535588 521089 506676 492453 480500 471271 463033
55753 463033 455520 450229 446570 441534 433776 424634 414947 404331 393669 384695 376960 368578 359938 353192
55739 353192 348304 343238 338011 334794 333915 333277 331912 330710 329674 327839 325828 325082 324611 321966 317280
55724 317280 312935 309390 304870 299089 293788 289558 285491 281881 279947 279060 277623 276340 277174 279526 281156
55709 281156 282547 286456 293262 300618 307578 315004 321812 324961 323732 320336 315965 309876 302575 296066
55695 296066 290463 284053 277110 271935 268778 265598 262322 261441 263597 266421 268524 271032 274423 277558
55681 277558 280738 285998 293339 300258 305958 312369 319842 325546 327572 327276 326110 323456 319168 315150
55667 315150 312745 311237 310246 310813 312878 314461 314790 315610 318175 321472 324561 328075 332231 335899 338763
55652 338763 341916 345306 347103 346538 344815 342282 337463 329952 321535 313260 304010 293259 282726 273971
55638 273971 266550 259667 253434 247572 241161 234588 229510 226141 222956 219637 217661 217230 216438 214475 212893
55623 212893 212706 212889 212748 212951 213141 211423 207556 203898 201821 199805 196420 192602 189537 186890 184548
55608 184548 183574 183948 183774 182180 180634 180116 179509 178124 177177 177224 176721 174771 172813 171967 171168 169625 168639
55591 168639 169154 169891 169736 169692 170630 171377 170964 170569 171355 172500 173208 174478 176884 178776 178747 177994 178247 179355
55573 179355 180840 183725 188598 193800 197861 202060 208328 216177 223797 230629 236702 241012 242780 242951
55559 242951 242394 240056 235064 229187 224848 221867 218411 214110 209971 206115 201861 197492 194003 191579
55545 191579 189912 189395 190478 192494 194463 196281 197978 198909 199001 199647 201876 204665 206454 207214 207583 207138
55529 207138 205149 202068 198804 195343 191402 187457 183885 180152 176016 172427 170061 168160 165971 163940
55515 163940 162333 160321 157797 156386 156950 157679 156501 153922 151611 149676 147448 145635 145325 145784 145513
55500 145513 144799 145130 146691 148392 149873 151585 153306 154323 154814 155482 156186 156276 155859 155410 154691 153299 151688
55483 151688 150513 149613 148732 148311 148410 147885 146031 144076 143578 144280 144952 145359 145867 146053 145401 144555 144259 143740
55465 143740 141773 138700 135907 133935 132504 131685 131555 131352 130384 129206 128627 128314 127651 127061 127118 127226 126613
55448 126613 125792 125625 125845 125866 126026 126624 126884 126463 126753 128825 131261 132011 131383 131085 131291 130992 130521 131241
55430 131241 132994 134126 133990 133422 132847 131872 130758 130458 131111 131993 132860 133868 134437 133832 132701 132536 133725
55413 133725 135544 137676 140199 142425 143480 143799 144484 145383 145392 144352 143030 141457 139041 136237 134369 133728
55397 133728 133348 132671 132005 131390 130457 129431 128927 128814 128522 128324 128995 130374 131571 132377 133157 133665 133336 132507
55379 132507 131979 131646 130897 130004 129660 129544 128857 127919 127609 127581 126735 125243 124414 124674 125361 126322 127955 129774
55361 129774 130690 130862 131647 133578 135891 138022 140037 141596 142127 142085 142499 143254 143346 142766 142412 142201 141098
55344 141098 139168 137750 137282 136707 135454 134370 134181 134519 134982 135791 136891 137652 137862 137915 137823 137185 136188 135408
55326 135408 134675 133469 132353 132427 133413 133909 133590 133369 133281 132179 129960 128176 127783 127965 127820 127576 127451 126939
55308 126939 126005 125519 125695 125507 124418 123320 122905 122506 121460 120387 120117 120391 120541 120561 120733 121084 121881 123719
55290 123719 126406 128669 129647 129884 130327 131222 132515 134260 136012 136748 136141 135184 134947 135498 136465 137766 139167
55273 139167 139955 139700 138717 137421 135921 134589 134099 134489 134956 134945 134578 133763 131967 129370 127209 126336 126300
55256 126300 126419 126835 127811 128823 129106 128623 127902 127430 127573 128510 129836 130771 131084 131248 131529 131617 131344 131018
55238 131018 130817 130592 130475 130873 131611 131840 131098 129744 128224 126668 125409 125010 125523 126405 127304 128206 128868
55221 128868 129032 129242 130380 132292 133846 134479 134621 134505 133812 132698 131949 131747 131453 130946 130948 131610 131991 131538
55203 131538 130969 131051 131520 131798 131874 131915 131825 131685 131842 132163 132043 131500 131358 132035 132998 133682 133987 133686 132430 130682
55183 130682 129561 129454 129745 130117 130895 131925 132473 132605 133253 134490 135194 134995 135061 136206 137620 138336 138643
55166 138643 139171 139809 140449 141561 143056 143756 143011 141857 141570 142136 143015 144263 145827 146812 146674 146273 146599
55149 146599 147259 147296 146691 145943 144960 143536 142248 141685 141309 140159 138304 136715 136060 136373 137357 138302 138278 137129
55131 137129 135729 134728 133866 133112 133408 135329 137865 139604 140379 140802 140925 140466 139703 139080 138488 137880 137959
55114 137959 139226 140989 142361 143645 145550 147576 148409 147665 146221 145079 144798 145699 147589 149435 150175
55099 150175 149766 148867 147874 146976 146676 147377 148654 149662 150024 149899 149587 149617 150593 152359 153874 154521 154902 155760
55081 155760 156896 157881 158917 160007 160181 158724 156587 155359 155346 155758 156273 157188 158393 159403 160195 160905
55065 160905 160952 159570 157128 154902 153600 152992 152807 153046 153466 153670 153660 153617 153292 152416 151421 150982 151047 151133 151270
55046 151270 151759 152271 152166 151579 151192 150989 150217 148717 147391 147106 147744 148528 148791 148372 147743 147712 148616 149892
55028 149892 150777 151155 151297 151162 150570 149782 149215 148796 148195 147528 147194 147158 146964 146389 145596 144731 143830 143003 142401
55009 142401 142108 142275 143070 144381 145956 147956 150685 153605 155452 155768 155512 155650 155991 156041 156086 156600 157354
54992 157354 157985 158737 159703 160099 159284 157955 157282 157382 157622 157912 158636 159704 160669 161501 162353 162947 162992 162802
54974 162802 162677 162221 161178 160315 160473 161283 161916 162557 163940 165859 167436 168512 169602 170725 171491 172085
54958 172085 172982 173822 173733 172686 171520 170797 170587 170999 171770 171675 169672 166537 164156 163299 163282 163550 164151 164664
54940 164664 164210 162917 162133 162762 164345 166078 167799 169663 171672 173813 176068 178282 180624 183939 188881
54925 188881 195018 201697 209352 218753 229314 239553 249091 258737 268501 276932 282631 285112 284040 279148
54911 279148 271370 262759 254653 246836 238784 230550 222106 213127 204109 196599 191563 188369 185936 184021
54897 184021 182765 181864 180893 179873 179008 178419 178495 179754 181933 183891 184908 185591 187142 190314 195257 201741
54881 201741 209198 217173 225975 236288 247923 259645 270338 279555 286758 290935 291452 288660 283331
54868 283331 276089 267526 258197 248303 238102 228644 221158 215502 210208 204393 198659 193796 189675 185958
54854 185958 182891 180693 178967 177433 176448 176080 175407 173564 170979 168790 167431 166515 165736 165087 164389 163334
54838 163334 162057 161147 160957 161139 160963 160091 159028 158662 159233 160015 160280 160193 160240 160229 159625 158615 157886 157425 156542
54819 156542 155192 154350 154786 156255 158074 159734 160752 160752 159983 159113 158369 157578 157031 157337 158298 158961 159090 159584
54801 159584 161047 162905 164416 165616 166798 167878 168868 170164 171827 173266 174056 174374 174249 173296 171704
54786 171704 170588 170693 171487 172155 172710 173475 174277 174924 175867 177555 179698 181902 184562 188361 193309 199018
54770 199018 205564 213360 222392 232168 242260 252421 262394 271880 280433 287159 290966 291460 289169 284716
54756 284716 278363 270578 262318 254268 246369 238515 231070 224260 217735 211269 205352 200556 196886 194171
54742 194171 192451 191417 190196 188391 186757 186231 186778 187849 189336 191345 193536 195521 197585 200376 204261
54727 204261 209504 216473 224899 233497 241280 248866 257537 267178 276072 282597 286206 286858 284558 279748
54713 279748 273374 266096 257862 248588 238946 230085 222617 216072 209516 202767 196810 192707 190216 188030
54699 188030 185428 183012 181547 180783 180005 179192 178877 179091 179117 178322 176764 174925 173216 171754 170465 169284
54683 169284 168246 167348 166476 165724 165554 166221 167173 167580 167316 166730 165604 163323 160288 158118 157906 158991 159978
54666 159978 160272 160168 160104 160445 161382 162480 162868 162394 161988 162309 162660 161994 160470 159155 158575 158385 158315 158620
54648 158620 159576 161064 162706 164103 165023 165601 166158 166710 166922 166682 166274 165785 164880 163460 162077 161328 161245
54631 161245 161505 161749 161557 160754 159992 160299 161742 163303 164372 165394 166537 166823 165495 163388 161953 161511
54615 161511 161449 161561 162088 162782 162955 162428 161664 161092 160899 161252 162078 162878 163260 163377 163415 163165 162694 162821 164106
54596 164106 165844 166931 167343 167856 168623 169006 168692 168113 167741 167666 167839 168178 168492 168730 169001 168949 167620 164689
54578 164689 161443 159712 160035 161560 163400 165202 166619 167235 167119 166757 166374 165848 165247 164905 164989 165443 166157
54561 166157 166823 166963 166627 166718 167971 169910 171456 172211 172479 172414 171987 171559 171621 172059 172416 172777 173688 175314
54543 175314 177347 179562 181844 183883 185561 187389 189694 191630 191961 190812 189668 189557 190093 190485 190628
54528 190628 190818 191081 191170 190873 190062 188688 186859 184728 182396 180087 178236 177078 176453 176270 176738 177699 178247
54511 178247 177727 176758 176587 177644 179380 181186 182777 183841 184082 183551 182450 180834 178982 177618 177091 176774
54495 176774 175950 174888 174237 173892 173454 173389 174535 176658 178594 179781 180568 181113 181069 180523 180154 180252 180486 180822
54477 180822 181763 183421 185162 186471 187553 188841 190499 192517 194711 196655 198161 199796 202168 204813
54463 204813 206577 207107 207113 207169 207122 206839 206631 206603 206311 205385 204030 202740 201913 201709 201793 201360 199977 198248 197015
54444 197015 196155 194927 193211 191555 190230 189205 188832 189401 190115 189722 188277 187177 187269 188037 188774 189390 189733
54427 189733 189342 188385 187877 188420 189484 190345 190919 191326 191512 191694 192353 193355 193868 193542 192990 192706 192407 191932
54409 191932 191949 193102 195019 196706 197454 197038 195652 194064 193240 193433 194065 194747 195797 197528 199725 202094
54393 202094 204603 207065 209068 210578 211961 213159 213598 213196 212699 212687 212927 213036 213021 212824 212151 211125 210431
54376 210431 210398 210638 210942 211755 213367 215384 217447 219791 222632 225684 228669 231615 234310 236213 237270
54361 237270 238073 238827 238994 238353 237479 236725 235697 234327 233456 233522 233499 232091 229358 226338 223633 221158 218823
54344 218823 216612 214314 211813 209420 207493 206114 205402 205538 206097 206136 205469 205114 205869 207151 207935 208170 208503
54327 208503 209204 210112 211106 211915 211996 211332 210814 211125 211792 212074 212185 212777 213678 214096 213769 213127 212518 211929 211233
54308 211233 210183 208563 206754 205615 205247 204571 202871 201032 200337 200648 200817 200384 199775 199198 198572 198338 199148
54291 199148 200688 201864 202323 202865 204115 205609 206517 206686 206637 206866 207331 207437 206576 204892 203327 202696 203025
54274 203025 203958 205238 206372 206519 205484 204350 204336 205352 206470 207470 208958 211139 213393 215124 216272
54259 216272 216944 217215 217337 217620 218080 218704 219872 221877 224131 225529 225654 225080 224514 224220 224286 224846 225774 226540
54241 226540 226548 225486 223499 221208 219374 218203 217201 215946 214608 213430 212206 210884 210175 210848 212662
54226 212662 214615 216077 217070 217733 218215 218887 220009 221282 222298 223122 223812 223738 222282 220083 218621 218477
54210 218477 218790 218520 217556 216412 215550 215240 215564 216232 216724 216764 216452 215978 215459 214973 214414 213534 212475 211979
54192 211979 212572 213775 214629 214779 214555 214263 214011 213986 214258 214513 214642 215296 217075 219386 220997 221660 222249 223272
54174 223272 224215 224616 224838 225301 225641 225211 223997 222574 221379 220340 219098 217419 215492 213795 212577 211584
54158 211584 210486 209356 208460 207868 207654 208128 209345 210619 211097 210651 209766 208843 208160 208220 209337 211016 212409
54141 212409 213255 213775 213968 213811 213899 214857 216161 216548 215714 214648 214100 213753 213248 213030 213639 214851 216068 216984
54123 216984 217407 217071 216185 215687 216360 217972 219793 221642 223985 227243 231496 236802 243362 251234 260027
54108 260027 268938 277143 284177 289858 293829 295434 294336 291040 286470 281181 275373 269476 264190 259929
54094 259929 256612 253951 251598 249115 246273 243348 240772 238629 236877 235799 235634 235905 235759 234982 234105
54079 234105 233555 233308 233350 233799 234512 235165 235839 236968 238632 240456 242230 244078 245913 247350 248256 248757 248654
54062 248654 247509 245580 243960 243409 243514 243377 242772 242246 242351 243137 244273 245510 246931 248684 250478 251784
54046 251784 252767 254495 257619 261324 264305 266446 268735 271873 275911 281012 287359 294291 300702 306556
54032 306556 312951 320351 327852 334700 341464 348989 356988 364485 371117 377212 382927 387960 391951 394772
54018 394772 396605 397941 399238 400448 401188 401385 401212 400364 398110 394333 389827 385281 380579 375394 369858
54003 369858 364282 358786 353536 348752 344171 339148 333647 328529 324416 320894 317270 313506 309925 306587
53989 306587 303514 300979 299049 297279 295363 293603 292263 290969 289283 287379 285652 284169 283046 282829
53975 282829 283797 285368 286954 289072 292813 298456 305369 313169 322229 332919 344784 356433 365897 371270
53961 371270 371701 367958 361817 354892 348044 341560 335496 329945 325232 321675 319005 316426 313539 310886
53947 310886 309255 308797 309255 310734 313668 318155 323749 329881 336176 342465 348702 354816 360462 365098 368394
53932 368394 370350 370972 370281 368791 367439 366765 366566 366610 367195 368688 371085 374429 379102 385136 391700 397970
53916 397970 404213 411435 420148 429953 440081 449899 459136 468116 477500 487368 496820 504947 511851 518156
53902 518156 523874 528446 531653 533787 534957 534914 533601 531348 528512 525315 521959 518400 514069 508338 501273
53887 501273 493454 485139 476063 466154 455931 446017 436601 427503 418547 409756 401374 393773 387237 381824
53873 381824 377428 373745 370136 365937 361159 356519 352399 348234 343434 338516 334529 331497 328254 323951
53859 323951 319022 314374 310240 306282 302439 299073 296358 294040 291972 290567 290361 291193 292099 292153 291171 289463
53843 289463 287311 285068 283389 282661 282288 281336 279907 279063 279149 279131 278163 276981 276823 277563 277910 277265 276389 276191
53825 276191 276715 277521 278343 278980 279013 278175 276898 276137 276511 277729 279007 280101 281708 284537 288159 291286
53809 291286 293279 294774 296638 298900 301211 303783 307235 311719 316823 322200 327773 333419 338966 344591
53795 344591 350854 358204 366561 375281 383417 390234 395742 400581 405241 409542 412986 415310 416531 416793
53781 416793 416397 415675 414662 413183 411347 409402 406917 402818 396689 389450 382308 375623 369362 363922 359607
53766 359607 355736 351229 345960 340796 336396 332615 328984 325179 321147 317348 314646 313341 312471 310675
53752 310675 307617 303993 300459 297227 294505 292501 291029 289829 289197 289574 290581 291252 291255 291112 291133 290935 290244
53735 290244 289468 289176 289480 290134 290787 290998 290522 289727 289355 289772 290818 292276 294018 295807 297536 299599 302302
53718 302302 304984 306554 306994 307467 308692 310098 310997 311764 313186 315232 317242 318978 320813 322948 325016
53703 325016 326586 327796 329350 331903 335465 339471 343567 348122 353637 359839 365821 370991 375324 378690
53689 378690 380619 381014 380545 379930 379195 378022 376525 375326 374936 375315 375915 376045 375339 374025 372634 371426
53673 371426 370281 369087 368003 367260 366959 367078 367499 368010 368481 368937 369265 369031 368018 366837 366535 367515 369249
53656 369249 371037 372601 373845 374596 374891 375175 375821 376543 376573 375483 373777 372536 372340 372577 372119 370795 369818
53639 369818 370484 372844 375943 378925 381476 383637 385804 388576 391901 394724 396247 397295 399536 403487
53625 403487 408209 412882 417579 422333 426562 429974 433183 436824 440607 443832 446322 448345 450030 451377
53611 451377 452582 453938 455609 457692 460313 463447 466925 470715 474865 479105 482938 486214 489171 491803
53597 491803 493743 494939 495870 496833 497541 497708 497577 497506 497485 497348 497057 496447 495121 492947 490317 487623 484903
53580 484903 482304 480436 479727 479694 479262 477740 475267 472502 470065 468076 466000 463240 459956 457029 455112
53565 455112 454087 453515 453140 452706 451851 450534 449237 448391 447918 447603 447579 448176 449564 451764 454699 458020 461212
53548 461212 464094 466825 469250 470755 471081 470863 470995 471808 473197 475155 477783 481020 484703 488695 492827
53533 492827 497021 501596 507001 513156 519593 526446 534544 544140 554309 564251 574547 586293 599449
53520 599449 612918 626034 639089 652416 665800 679079 692808 708007 725432 745164 766718
53509 766718 789519 813379 838474 864846 892127 919792 947355 974231 999893 1024394 1048301
53498 1048301 1071797 1094337 1115583 1136157 1156874 1177624 1197648 1216667 1235060 1253084 1270645
53487 1270645 1287899 1305504 1324070 1343678 1363934 1384211 1403863 1422624 1440882 1459297 1478075
53476 1478075 1496819 1514977 1532153 1547981 1562021 1573892 1583322 1590059 1593853 1594621 1592538 1587980 1581305
53463 1581305 1572622 1561885 1549410 1536107 1522811 1509445 1495337 1480354 1465095 1449811 1433828
53452 1433828 1416389 1397513 1377594 1356701 1334923 1312992 1291875 1271834 1252390 1233100 1214020
53441 1214020 1195592 1178473 1163344 1150516 1139813 1131044 1124309 1119490 1115815 1112385 1109010 1106222 1104677
53428 1104677 1104799 1106650 1109758 1113358 1117195 1121842 1127909 1135280 1143593 1153090 1164452 1178054 1193853
53415 1193853 1211729 1231416 1252379 1274299 1297467 1322211 1348203 1374913 1402435 1431256 1461489
53404 1461489 1492989 1526031 1561074 1597968 1636191 1675888 1717920 1762743 1809911 1858818 1909344
53393 1909344 1961524 2015103 2069712 2125143 2181281 2238026 2295325 2353011 2410608 2467593 2523717
53382 2523717 2578748 2632051 2682889 2731052 2776761 2820006 2860389 2897450 2930685 2959355 2982861
53371 2982861 3001194 3014527 3022507 3024602 3020961 3012090 2997648 2976427 2947821 2912640 2872212 2827441
53359 2827441 2779145 2728624 2677204 2625436 2573197 2520423 2467452 2414820 2363003 2312283 2262830
53348 2262830 2215033 2169631 2127063 2086578 2046472 2005450 1963472 1921212 1879197 1837856 1798036
53337 1798036 1760878 1727024 1696115 1667190 1639639 1613813 1590588 1570283 1552239 1535615 1520249
53326 1520249 1506347 1493576 1481020 1467863 1453690 1438262 1421659 1404628 1388135 1372459 1357172
53315 1357172 1342038 1327325 1313258 1299878 1287586 1277173 1269009 1262768 1258225 1255734 1255571 1257350 1260436
53302 1260436 1264446 1269083 1274075 1279773 1287282 1297456 1310099 1324646 1341167 1360098 1381255 1403827
53290 1403827 1427274 1451700 1477337 1504122 1531749 1559696 1587105 1613023 1636912 1658844 1679144
53279 1679144 1697935 1714891 1729320 1740612 1748715 1754000 1756534 1755855 1751707 1744639 1735406 1723947 1709548
53266 1709548 1692055 1672421 1651825 1630567 1608035 1583642 1557544 1530484 1503044 1475154 1446395
53255 1446395 1416752 1386921 1357744 1329461 1301684 1274020 1246506 1219418 1192888 1166855 1141265
53244 1141265 1116140 1091413 1066850 1042275 1017858 994080 971320 949567 928628 908561 889780
53233 889780 872695 857335 843357 830360 818191 806884 796350 786279 776517 767417 759414 752141
53221 752141 744288 734640 723084 710392 697222 683627 669387 654496 639347 624595 610786 597932
53209 597932 585612 573609 562213 551683 541776 532147 522875 514135 505628 496939 488246 480045 472270
53196 472270 464409 456466 449073 442502 436224 429715 423101 416740 410688 404865 399272 393795 388288 383103
53182 383103 378952 375819 372553 368100 362727 357519 353042 349164 345872 343415 341566 339477 336583 333302
53168 333302 330574 328943 328298 328228 328330 328229 327680 326853 326374 326727 327486 327393 325525 322367 319460 318033 318153
53151 318153 319084 320041 320558 320561 320333 320154 319891 319179 318100 317247 316923 316644 315798 314478 313274 312419 311610 310708
53133 310708 310199 310771 312537 314857 316931 318494 319808 321043 321941 322232 322159 322223 322572 323053 323823 325389 327891
53116 327891 330711 333068 334788 336319 338210 340651 343339 345707 347449 348756 349772 349985 348695 346122
53102 346122 343405 341311 339500 337309 334686 331978 329307 326745 324671 323410 322678 321929 321005 320068 319131
53087 319131 318224 317745 317980 318323 317689 315890 314036 313269 313522 313852 313677 313256 313028 312929 312603 312126 312212 313524
53069 313524 315835 318077 319256 319210 318471 317557 316532 315115 313123 310848 308969 307884 307145 305825 303565
53054 303565 301018 299176 298554 299176 300972 303726 306769 309184 310499 311071 311686 312822 314293 315568 316414
53039 316414 317138 318085 319031 319333 318621 317140 315453 314124 313638 314155 315169 315796 315627 315069 314754 314975 315796
53022 315796 317266 319197 321011 322181 322645 322650 322431 322231 322313 322710 323208 323751 324521 325426 325952 325844 325556 325625 325927
53003 325927 325983 325750 325698 326299 327714 329667 331322 331759 331114 330891 332505 335723 339129 341864 344213 346632
52987 346632 348978 350809 351861 352098 351856 351947 353023 354675 355727 355559 354643 353696 352976 352618 352937 353892 354811
52970 354811 355206 355517 356490 358042 359343 359887 360001 360333 361271 362863 364858 366727 368042 368972 370087 371476
52954 371476 372368 371918 370187 368047 366206 364610 362869 360934 359180 357915 356940 355575 353209 349968 346868
52939 346868 345032 344629 344814 344810 344711 344929 345220 344822 343496 341908 340863 340522 340466 340148 339220 337798 336566 336294
52921 336294 337089 338347 339464 340193 340316 339593 338309 337353 337321 337958 338761 339679 340749 341507 341391 340506 339424
52904 339424 338407 337303 336141 335228 334691 334316 333832 333026 331773 330380 329784 330759 332887 334767 335355 334764
52888 334764 333774 333061 333022 333807 335196 336635 337675 338268 338633 339056 339857 341320 343524 346360 349697 353332
52872 353332 356884 359998 362719 365405 368193 370746 372552 373320 373148 372453 371665 370763 369222 366629 363241
52857 363241 359633 356029 352395 349045 346486 344612 342655 340159 337501 335129 332741 329758 326373 323592
52843 323592 322170 321722 320994 318951 315667 312250 309823 308553 307761 306978 306581 307208 308760 310302 310969 310754
52827 310754 310385 310586 311558 313027 314569 315818 316471 316313 315334 313761 311978 310402 309378 309009 309123 309507
52811 309507 310192 311333 312872 314624 316712 319459 322653 325319 326590 326502 325551 323807 321073 317789 315037
52796 315037 313427 312430 311090 309125 307077 305632 305032 305031 305198 305264 305313 305618 306252 306915 307187 306904 306267 305609
52778 305609 305202 305292 306188 308045 310484 312646 313926 314501 314870 315009 314465 313212 311874 310940 310330 309949 310043
52761 310043 310607 310970 310602 309986 310113 311302 313008 314591 315757 316436 316799 317299 318192 319110 319582 319835 320531
52744 320531 321847 323404 325059 327121 329712 332507 335255 338031 340817 343248 344929 345721 345764 345600 346157
52729 346157 347961 350344 351998 352461 352485 352805 353181 352953 351974 350617 349242 348016 346961 345927 344768 343656
52713 343656 342902 342396 341668 340658 339878 339671 339836 340231 341072 342186 342607 341644 340001 339128 339606 340765 341802
52696 341802 342614 343423 344161 344536 344452 344130 343838 343660 343476 343170 342819 342603 342474 342093 341204 339993 338966 338464
52678 338464 338334 338025 337060 335556 334227 333700 333809 333795 333204 332330 331726 331563 331582 331534 331507 331871 332915 334453 335879
52659 335879 336763 337275 337814 338422 338936 339599 341018 343481 346736 350455 354442 358340 361633 364112 365823 366431
52643 366431 365179 361879 357514 353489 350576 348867 348344 348997 350558 352494 354243 355331 355541 355238 355372
52628 355372 356846 359923 364263 369204 373832 377095 378245 377119 373940 369110 363372 357836 353458 350503
52614 350503 348649 347456 346640 346110 345896 345888 345647 344771 343496 342586 342520 343128 344043 345045 345850 346141 346073 346194 346597
52595 346597 346737 346492 346720 348057 349686 350185 349397 348653 349074 350376 351485 351831 351771 352031 352971 354293 355425
52578 355425 356187 356886 357736 358496 358915 359127 359277 359151 358623 358176 358356 358930 359137 358698 357980 357217 356213 355002
52560 355002 354207 354393 355309 356040 355807 354556 352961 351904 351699 351756 351115 349372 346994 344794 343254 342335 341738
52543 341738 341237 340777 340346 339856 339326 339016 339097 339278 339249 339404 340445 342091 343003 342508 341674 341971 343418 344995
52525 344995 346395 348274 350804 353134 354534 355264 355987 357022 358489 360556 363175 366077 369321 373360 378314
52510 378314 383711 389268 395215 401319 406192 408371 407912 406211 404329 402083 398835 394528 389675 384654
52496 384654 379440 373948 368465 363641 360031 357634 355939 354465 353156 352204 351652 351306 350948 350395 349409 347839
52480 347839 345981 344628 344509 345610 347144 348284 348912 349560 350766 352601 354873 357493 360480 363761 367227
52465 367227 370973 375295 380430 386400 392966 399499 404946 408274 409067 407592 404325 399675 394200 388666
52451 388666 383551 378668 373622 368581 364310 361341 359397 357772 356084 354433 352921 351325 349418 347411
52437 347411 345847 345060 344839 344688 344387 344243 344767 346021 347350 347929 347635 347171 347156 347360 347127 346417 346005 346567
52419 346567 347909 349249 350028 350316 350626 351472 352973 354767 356462 358162 360361 363277 366595 370014 373872
52404 373872 379134 386831 397466 410600 424860 438496 450062 458518 462996 463047 459175 452619 444411
52391 444411 435112 425566 417143 410646 405518 400767 396377 393149 391322 390100 388623 386836 385247 384251
52377 384251 383921 384261 385493 388127 392651 398941 406128 413289 420150 426811 432904 437473 439731 439674 437926
52362 437926 435274 432444 429989 428141 426795 425706 424739 424043 424026 425021 426792 428467 429161 428697 427639 426722
52346 426722 426333 426495 427231 428851 431751 435802 440205 444256 448064 452080 456068 459310 461907 465130 470093
52331 470093 476741 484480 493100 502512 512308 522394 533564 546550 560803 575016 588602 601777
52319 601777 614415 625842 635930 645504 655409 665855 676906 688982 702423 717061 732617 749267
52307 749267 767519 787694 809657 832953 857134 882099 908051 934937 962093 988701 1014432
52296 1014432 1039290 1062971 1084791 1104140 1120636 1134012 1144350 1152328 1158810 1164168 1168296 1171060
52284 1171060 1172311 1171725 1169258 1165634 1161791 1157946 1153774 1149341 1145143 1141302 1137473 1133551 1129774 1126110
52270 1126110 1122340 1118862 1116572 1115693 1115518 1115584 1116341 1118232 1120850 1123638 1127015 1132274 1140529 1152021 1166199
52255 1166199 1182235 1199698 1218771 1239553 1261279 1282817 1303792 1324450 1344300 1361869 1376213
52244 1376213 1387874 1397848 1406274 1412735 1417208 1420004 1421239 1421079 1420181 1419132 1417531 1414260 1408677 1401141
52230 1401141 1392401 1382845 1372361 1360668 1347696 1333787 1319585 1305750 1292813 1281094 1270459 1260286
52218 1260286 1250038 1239787 1229784 1219780 1209495 1199651 1191571 1185517 1180290 1174849 1169642 1165858 1164029
52205 1164029 1163874 1164878 1166397 1167706 1168682 1170160 1173133 1177800 1183729 1190573 1198223 1206661 1216101 1226883
52191 1226883 1238813 1250957 1262452 1273083 1282715 1290681 1296225 1299110 1299387 1297045 1292427 1286414 1279591
52178 1279591 1271709 1262530 1252667 1242873 1233055 1222800 1212516 1203147 1195042 1187906 1181682 1176732 1173224
52165 1173224 1171039 1170139 1170451 1171646 1173689 1177253 1182735 1189015 1194010 1196409 1196258 1194156 1190837 1187376 1184751
52150 1184751 1183018 1181718 1181053 1181752 1183779 1186262 1188972 1192800 1198188 1203999 1208540 1211119 1212019 1211541 1209814
52135 1209814 1207192 1204256 1201514 1199428 1198566 1199412 1202228 1207292 1214944 1225143 1237288 1250780 1265578
52122 1265578 1281938 1299882 1319225 1339954 1362205 1385796 1409923 1433405 1455342 1475657 1494942
52111 1494942 1513636 1531492 1548032 1563330 1578037 1592825 1608299 1625329 1644845 1667057 1691236
52100 1691236 1716333 1741482 1765944 1789112 1810788 1830997 1849171 1863810 1873267 1876779 1874722 1868166
52088 1868166 1858362 1846321 1832623 1817621 1801866 1786095 1770737 1755674 1740537 1725095 1709348
52077 1709348 1693502 1677911 1662839 1648263 1634100 1620573 1608124 1597016 1587334 1579353 1573569 1570291
52065 1570291 1569430 1570657 1573597 1577995 1583946 1591827 1601793 1613589 1627197 1643202 1661871 1682159 1702397
52052 1702397 1721849 1740783 1759117 1775931 1790462 1802554 1811799 1817205 1818394 1816452 1812971 1808672
52040 1808672 1803446 1797171 1789889 1781600 1772518 1763250 1754145 1744729 1734286 1722801 1710895 1699010 1687030
52027 1687030 1674477 1660684 1645067 1627687 1609440 1591368 1573831 1556516 1538937 1520717 1501832
52016 1501832 1482976 1465303 1449369 1434671 1420692 1407926 1397222 1388378 1380090 1371075 1360615 1348185
52004 1348185 1333411 1316475 1297953 1278104 1256878 1234741 1212979 1192975 1175490 1160553 1147545
51993 1147545 1135336 1122889 1109933 1096690 1082992 1068270 1052461 1036158 1019502 1001538 981246
51982 981246 958877 935803 913314 891888 871356 851254 831130 810984 791477 773547 757902
51971 757902 745036 735419 729251 726146 725446 726837 730362 735900 743005 751224 760110 768838 776196 781228
51957 781228 783628 783406 780473 774857 767099 758152 749051 740827 734439 730328 728216 727869 730037 736118 746798
51942 746798 761569 779842 801919 828331 858542 890940 923884 956064 985797 1010707 1028560
51931 1028560 1038164 1039369 1032694 1019274 1000713 978403 953039 925093 895484 865353 835331 805609
51919 805609 776728 749741 725360 703449 683649 666173 651571 639939 630760 623482 617964 614386
51907 614386 613042 614237 618050 624079 631578 639899 648612 657156 664704 670484 673985 674654 671714 664620
51893 664620 653563 639318 622860 605430 588642 573805 561091 549866 540015 532448 528161 527233
51881 527233 529008 532800 538097 544515 552075 561299 572596 585586 599279 612674 624885 634997 642324
51868 642324 646736 648387 647318 643756 638589 632992 627663 622954 619537 618157 618694 620217 622229 625148
51854 625148 629286 633981 638197 641374 643183 642944 639992 634448 627119 618703 609492 599632 589300 578722
51840 578722 568379 558950 550654 542947 535457 528997 524929 523476 523362 523336 523393 524138 525536 526871 527610 527736
51824 527736 527304 526277 524844 523457 522333 521233 520001 519085 519186 520447 522279 524007 525442 526658 527454
51809 527454 527366 526210 524376 522509 521020 519984 519359 519143 519340 519892 520705 521710 522953 524605 526844 529665
51793 529665 532769 535616 537615 538421 538162 537353 536482 535747 535244 535190 535637 536036 535504 533750 531434 529472 528231
51776 528231 527655 527941 529647 533161 538401 545147 553324 562818 573242 584147 595375 606918 618382
51763 618382 628783 636948 642025 643578 641447 635852 627604 617856 607438 596582 585420 574485 564439
51750 564439 555428 547079 539131 531673 524699 517854 510971 504668 500052 497791 497664 499002 501352 504707
51736 504707 509307 515351 522750 531026 539438 547329 554324 560199 564623 567206 567903 567285 566348 566142 567555
51721 567555 571171 576840 583232 588172 589804 587672 582783 576830 571329 567107 564190 562135 560566 559351
51707 559351 558240 556649 554139 551051 548408 547186 547781 549996 553184 556398 558754 559762 559269 557266 554076
51692 554076 550670 548302 547618 548273 549477 550586 551110 550535 548529 545203 540961 536165 531178 526654 523517
51677 523517 522449 523321 525148 526712 527386 527421 527478 527930 528694 529616 530864 532990 536762 542839 551467 562428
51661 562428 575255 589209 602852 613961 620464 621686 618569 612723 605511 597959 591084 585995 583713
51648 583713 584857 589334 596279 604393 612283 618446 621365 620257 615817 609740 603282 596433 588577 579564
51634 579564 569984 560628 551900 543691 535747 528190 521589 516368 512259 508627 505291 502671 501114 500354
51620 500354 499695 498474 496352 493470 490370 487577 485207 483060 480926 478555 475606 472054 468473 465488
51606 465488 463153 461325 460390 460865 462409 464000 465158 466291 467874 470135 473694 479519 487860 498057
51592 498057 509787 523569 539341 555212 568386 577009 580723 580095 576252 570649 564419 558055 552093
51579 552093 547720 546119 547581 551805 558744 568565 580968 595138 610275 625912 641998 659045 677835
51566 677835 698559 720442 742497 764280 785805 807521 830852 857934 890003 926542 966604
51555 966604 1010039 1056300 1102618 1144721 1179257 1204564 1219539 1223261 1215939 1199071 1174336 1143245
51543 1143245 1107892 1070845 1033779 997050 960975 926679 895230 866708 840660 816805 794804
51532 794804 773936 753639 733999 715316 697533 680472 664252 649119 635161 622432 611028
51521 611028 600767 591150 581845 572907 564418 556354 548932 542572 537259 532484 528089 524674 522735 521788
51507 521788 520747 518898 516268 513373 510892 509217 508069 506867 505647 505099 505446 505871 505584 504994 505243 506838
51491 506838 509278 511825 514158 516387 518848 521716 524461 525865 525120 522819 520384 518540 516836 514702
51477 514702 512382 510505 509085 507381 504732 501254 497603 494220 491034 487818 484535 481180 477549 473463
51463 473463 469077 464686 460371 456224 452736 450433 449170 448268 447358 446488 445441 443765 441797 440871 441940
51448 441940 444551 447797 451772 457408 465301 475467 488023 503195 520553 538908 557046 574005
51436 574005 588617 599622 606768 611358 615228 619254 623008 625491 625775 623086 616832 606907 593985 579392
51422 579392 564605 550704 538177 527099 517459 509325 502851 498190 495314 493771 492762 491668 490556
51409 490556 489991 490304 491225 492341 493678 495506 497637 499396 500537 501843 504314 507862 511415 514411 517666
51394 517666 522456 529194 537399 546537 556275 566289 576556 587813 601064 616628 634318 654611
51382 654611 678905 708385 743304 783637 829699 881541 938398 999442 1064643 1133908 1205194
51371 1205194 1273932 1334421 1381702 1412667 1426341 1423509 1405759 1374643 1331798 1279598 1221156
51360 1221156 1159414 1096477 1033847 972942 915094 861233 811845 767252 727811 693717 664664
51349 664664 639826 618327 599731 583942 570630 559037 548513 539015 530831 523951 517976 512576
51337 512576 507751 503703 500693 498955 498368 498083 496887 494216 490702 487419 484726 482103 479055 475743 472617
51322 472617 469782 467067 464503 462314 460506 458874 457520 456904 457174 457836 458437 459355 461500 465320 470360
51307 470360 475648 480206 483383 485181 486227 487058 487381 486404 483929 480783 478017 475979 474266 472344 470047
51292 470047 467573 465103 462533 459771 457299 455945 455829 456009 455755 455825 457747 462035 467881 474524 482022
51277 482022 490532 499620 508565 516600 522626 525537 525430 523928 522751 522324 522023 521245 519873 518318 517583
51262 517583 518707 521563 524644 526513 526950 526263 524276 520849 516800 513219 510075 506462 502142 497917 494421
51247 494421 491404 488413 485435 482633 480023 477704 475910 474587 473342 472036 471089 470995 471843 473408 475367
51232 475367 477237 478494 479023 479218 479402 479356 478625 477134 475270 473478 471958 470743 469769 468827 467581 465917
51216 465917 464263 463338 463447 464210 465159 466394 468297 470806 473483 476231 479381 483010 486810 490802 495490
51201 495490 500956 506395 511063 515180 519323 523342 526473 528283 528936 528782 528159 527383 526366 524468 521300
51186 521300 517561 514573 512994 512405 512004 511345 510524 510068 510515 511766 513035 513697 513870 513800 513147 511483 509087
51169 509087 506558 503926 500868 497558 494554 491990 489641 487714 486840 487312 488953 491566 494801 497773 499694
51154 499694 500872 502207 503743 504618 504537 504200 504057 503640 502554 501321 500680 500713 501066 501431 501452 500761 499538 498496
51136 498496 498002 497761 497590 497803 498410 498680 498034 496825 495761 495062 494661 494727 495467 496848 498941 502027 505887
51119 505887 509523 512137 513941 515596 517368 519351 521908 525134 528383 531029 533300 535677 537912 539523
51105 539523 540942 543170 546360 549582 552042 553815 555295 556670 558095 559695 561138 561707 561078 559708 558320
51090 558320 557337 556860 556721 556382 555219 553231 551264 550236 550191 550221 549258 547034 544433 542895 543247 545022 546978
51073 546978 548294 549161 550387 552649 556126 560637 566027 572402 579938 588542 597973 608366 620384 634716
51059 634716 651719 671736 695318 722525 751950 780712 805571 824292 836442 843299 847010 849615
51047 849615 852756 857758 865060 873316 879982 883562 884880 885423 884887 881296 873415 862155 849581 837553
51033 837553 827579 820856 817312 814759 809832 800242 786230 769981 753894 739395 727028 717066 709632
51020 709632 704484 701338 700600 703179 709218 717499 726686 736732 748389 761589 775088 787600 798550
51007 798550 807681 814723 819710 822987 824682 824644 823045 820415 816876 811983 805682 798787 792015 785180 778023
50992 778023 771461 767168 765918 766894 768690 770596 772889 776359 781804 789720 800259 813435 829284 847700
50978 847700 868306 890735 915039 941532 970130 999973 1029759 1058493 1086079 1113483 1142409
50967 1142409 1174632 1211393 1253304 1300672 1353730 1412413 1476124 1543975 1615402 1690323 1768448
50956 1768448 1848488 1928318 2005927 2079865 2148741 2210867 2264891 2310528 2348192 2378129 2400401
50945 2400401 2415563 2424720 2428912 2429096 2426796 2423990 2421901 2420288 2418215 2414967 2409879 2402033 2390927 2377182
50931 2377182 2361858 2345100 2325983 2303509 2277174 2246668 2211707 2172283 2128491 2079965 2026141
50920 2026141 1967366 1905287 1841849 1778322 1715552 1654580 1596374 1541218 1488944 1439665 1393811
50909 1393811 1351451 1312160 1275665 1242198 1211954 1184446 1158691 1133958 1110267 1088261 1068700
50898 1068700 1051933 1037722 1025543 1015066 1006269 999067 993068 987852 983443 980287 978687 978329 978399 978206
50884 978206 977706 977442 977974 979466 981907 985608 991141 998634 1007343 1016208 1024866 1033958 1044431 1056680
50870 1056680 1070411 1085186 1100955 1118063 1136829 1157199 1178828 1201493 1225351 1250845 1278495
50859 1278495 1308849 1342549 1380218 1422306 1469163 1521374 1580030 1646616 1722583 1808928 1906106
50848 1906106 2014261 2133440 2263508 2403997 2554233 2713631 2881636 3057244 3238700
50839 3238700 3423576 3608777 3790275 3963167 4122436 4263768 4383806 4480198 4551888 4599142
50829 4599142 4622887 4624256 4605290 4569836 4522993 4469459 4412833 4356452 4304067 4259202 4224149
50818 4224149 4199662 4184963 4177534 4173300 4167613 4156173 4135142 4101143 4051802 3986119 3903987 3805743
50806 3805743 3692541 3566654 3430687 3286640 3136346 2982567 2828957 2678938 2535187
50797 2535187 2400004 2275302 2161960 2059848 1968719 1888642 1819415 1760234 1710245 1668932
50787 1668932 1635601 1608974 1587682 1570747 1557230 1545899 1535796 1526896 1519615 1513816 1508661 1503315
50775 1503315 1497408 1490896 1483868 1476456 1468628 1460169 1451045 1441520 1431542 1420357 1407224 1392326 1376384
50762 1376384 1359599 1341727 1323160 1305097 1288357 1272728 1257790 1243728 1230932 1219527 1209937
50751 1209937 1203316 1200578 1201317 1204511 1210154 1219379 1233000 1250747 1272079 1296961 1325483 1357417 1392659
50738 1392659 1431650 1474944 1522708 1575086 1632684 1696174 1765573 1840324 1919839 2003502 2090314
50727 2090314 2179176 2269521 2361212 2453730 2545873 2636285 2723879 2807609 2886098 2957535 3019493
50716 3019493 3068707 3101624 3115829 3111102 3089119 3052397 3003823 2946954 2886132 2825809 2769580
50705 2769580 2719765 2677768 2644593 2620859 2606375 2599904 2599437 2602575 2606615 2608592 2605593 2595026 2574562
50692 2574562 2542180 2496774 2438767 2369910 2292545 2209220 2122681 2035609 1950194 1868213 1791422
50681 1791422 1721419 1659054 1604374 1557186 1517326 1484478 1458375 1439294 1427738 1423317 1424528 1430054
50669 1430054 1439808 1454175 1472608 1493560 1515589 1537947 1560071 1581066 1599991 1616604 1631739
50658 1631739 1646791 1662634 1679017 1695272 1711516 1728694 1747394 1767272 1787878 1809474 1832554
50647 1832554 1857107 1882940 1910380 1940062 1972327 2007384 2045792 2088095 2134124 2183238 2235177
50636 2235177 2290049 2347500 2406514 2465959 2524836 2581986 2636279 2687355 2735812 2782610 2828643
50625 2828643 2874745 2921192 2966522 3006868 3036713 3050750 3046028 3023538 2988120 2946294 2903618
50614 2903618 2863736 2829085 2801389 2781288 2768298 2761570 2760353 2763587 2769563 2776228 2781416 2782655 2777383
50601 2777383 2763663 2740336 2706342 2660611 2603127 2535729 2461369 2382825 2302269 2221362 2141053
50590 2141053 2061522 1982932 1906226 1832801 1763553 1698587 1637754 1581080 1528802 1481256 1438655
50579 1438655 1400736 1366836 1336618 1310518 1289108 1272177 1258848 1248600 1241779 1239053 1240606 1245917
50567 1245917 1254144 1264689 1277478 1292656 1309996 1328783 1348380 1368620 1389480 1410690 1432014
50556 1432014 1453699 1476291 1500160 1525494 1552545 1581424 1611713 1642722 1674147 1706027 1738024
50545 1738024 1769209 1798871 1827319 1855651 1884836 1915168 1946599 1979485 2014940 2054407 2098939
50534 2098939 2149031 2205021 2267247 2335608 2409397 2488103 2572309 2663451 2762741 2870576 2986764
50523 2986764 3110690 3241164 3376622 3515687 3657143 3799111 3938578 4072036 4196308
50514 4196308 4308461 4405279 4483508 4540819 4576260 4589636 4580715 4549275 4495786 4421876 4330283
50503 4330283 4224672 4109545 3989987 3871110 3757563 3653470 3562566 3488035 3432204 3396461
50493 3396461 3381409 3386763 3411002 3451251 3503461 3562400 3621536 3673547 3711555 3730049 3724912 3693418
50481 3693418 3635032 3552022 3448644 3329454 3198599 3060313 2919107 2778840 2641881 2509509
50471 2509509 2382899 2263381 2151961 2049013 1954525 1868412 1790555 1720748 1658686 1603902
50461 1603902 1555716 1513362 1476273 1444247 1417354 1395712 1379343 1368122 1361761 1359810 1361702 1366943
50449 1366943 1375335 1386956 1401866 1419957 1441243 1466238 1495735 1530065 1568642 1610156 1652847
50438 1652847 1694402 1731955 1762844 1785569 1799975 1806693 1806853 1802288 1795333 1787760 1779985 1771645 1762879
50425 1762879 1754680 1748083 1743443 1740637 1739554 1740175 1742565 1747258 1755483 1768574 1787137 1811100 1840538
50412 1840538 1876000 1917848 1965665 2018649 2076397 2138920 2205859 2276018 2347849 2420139 2491966
50401 2491966 2562057 2628626 2690101 2745830 2795667 2838749 2872916 2895529 2904670 2899378 2879077 2843452
50389 2843452 2793152 2730319 2658066 2579486 2497261 2414015 2332544 2255441 2184699 2121878 2068540
50378 2068540 2026182 1995582 1976422 1967715 1968447 1977603 1993715 2014613 2037554 2059272 2076106 2084701
50366 2084701 2083017 2070483 2047249 2013858 1971899 1924346 1874450 1824341 1775099 1727934 1684549
50355 1684549 1646162 1612550 1582113 1552435 1520814 1484951 1443823 1398140 1350010 1302169 1257127
50344 1257127 1216371 1180082 1147805 1119498 1095721 1076850 1062438 1051526 1043347 1037650 1034476 1033651
50332 1033651 1034437 1035845 1037546 1040191 1044452 1049975 1055828 1061781 1068427 1076115 1084556 1093570 1103354 1113793
50318 1113793 1124373 1135206 1147258 1160876 1174780 1187268 1197941 1207555 1216703 1225563 1234685 1245099
50306 1245099 1257604 1272643 1290922 1313574 1341696 1376121 1417649 1467080 1525062 1591811 1665928
50295 1665928 1742250 1811092 1861289 1885268 1881750 1854450 1809408 1753368 1692737 1632193 1573964
50284 1573964 1518741 1467117 1419937 1377836 1341079 1309753 1283675 1262259 1244865 1231285 1221611
50273 1221611 1215659 1212736 1211907 1212381 1213891 1217006 1222966 1232779 1246277 1262124 1278809 1295596 1312606
50260 1312606 1330148 1348101 1365920 1383175 1399913 1416391 1432559 1448029 1462550 1476229 1489157
50249 1489157 1500974 1510908 1518090 1521722 1521139 1515963 1506254 1492475 1475449 1456500 1437497 1420421 1406641
50236 1406641 1396602 1390217 1387347 1387640 1389866 1391666 1390329 1383977 1372174 1355651 1335796 1314289 1292684
50223 1292684 1271924 1252250 1233689 1216423 1200597 1185949 1171917 1158083 1144398 1131091 1118459
50212 1118459 1106560 1094988 1083191 1071215 1059845 1049686 1040360 1030997 1021313 1011663 1002137 992265
50200 992265 981800 971297 961548 952744 944514 936584 929048 922054 915490 909096 902771 896662 890992 885911
50186 885911 881569 878163 875666 873563 871244 868803 867064 866495 866466 866040 865230 864836 865123 865320 864667 863421
50170 863421 862421 862018 861813 861341 860681 860384 860950 862394 864269 866135 867976 870109 872749 875773 878895 881998
50154 881998 885481 890468 898446 910339 925922 944360 965183 988420 1013907 1041016 1069110 1097815
50142 1097815 1126723 1155269 1183188 1210778 1238438 1266174 1293810 1321486 1349659 1378717 1408675
50131 1408675 1438940 1468024 1493544 1512925 1524312 1526893 1520586 1505823 1483787 1456447 1425807 1392928
50119 1392928 1358030 1321836 1286417 1254161 1225947 1200971 1178353 1158117 1140268 1123868 1107873
50108 1107873 1092378 1078179 1065468 1053891 1043630 1035330 1028844 1023107 1017505 1012481 1008304 1004015 998178
50095 998178 990239 980754 970777 961343 953108 946001 939469 933276 927662 922620 917688 912753 908425 905125
50081 905125 902465 900107 898656 898924 900752 903367 906641 911171 917228 924386 932301 941179 951323 962647
50067 962647 974801 987383 999956 1012137 1023779 1034845 1045113 1054190 1061793 1067861 1072549 1076247
50055 1076247 1079307 1081456 1081783 1079732 1075944 1071697 1067698 1063870 1060155 1056878 1054260 1052084 1050112 1048626
50041 1048626 1048441 1050449 1054980 1061407 1068598 1076107 1084743 1095635 1108988 1124283 1141506 1161428 1184582
50028 1184582 1210503 1238214 1267028 1296747 1327459 1359269 1391892 1424354 1455434 1484483 1511488
50017 1511488 1536384 1558798 1578584 1595941 1610582 1621231 1626423 1625624 1619161 1607266 1589639 1565920
50005 1565920 1536339 1501878 1464009 1424310 1384209 1345075 1308417 1275664 1247524 1223693 1203352
49994 1203352 1185815 1170639 1157434 1145881 1135883 1127285 1119396 1110961 1100721 1088002 1072865 1055908
49982 1055908 1037969 1019849 1002132 985190 969282 954586 941151 928926 917915 908264 900115 893367
49970 893367 887654 882567 877848 873286 868562 863388 857842 852340 847179 842290 837604 833539 830948 830616
49956 830616 832937 837911 845219 854272 864461 875468 887233 899552 911769 922929 932257 939550 945186
49943 945186 949704 953315 955775 956674 955735 952837 948038 941740 934637 927268 919541 910764 900055 886842
49929 886842 871390 855098 839954 827206 816580 807058 798286 790818 785123 780926 777697 775310 773916
49916 773916 773524 774089 775892 779344 784279 789645 794210 797690 801119 806041 813332 822880 834188 846909
49902 846909 860712 875059 889451 903709 917722 931113 943482 954786 965094 974073 981066 985534
49890 985534 986956 984512 977589 966738 953502 939041 923457 906769 889942 874343 860534 848151
49878 848151 836742 826180 816377 807239 799002 792086 786452 781511 776863 772787 769757 767811 766772 766836
49864 766836 768513 772032 777222 784014 792651 803225 815378 828774 843615 860245 878267 896374
49852 896374 913074 927355 938739 947259 953623 959006 964200 968955 972280 973192 971049 965504 956624 945066
49838 945066 931831 917806 903716 890337 878363 867938 858613 849928 841962 835213 830082 826507 824073
49825 824073 822455 821817 822781 825942 831363 838504 846582 855087 864181 874574 886705 899920 912713 923902
49811 923902 933320 941330 948182 954117 959525 964422 968086 969782 969611 968011 964747 959250 951975 944619
49797 944619 938675 934262 930450 926065 919916 911023 899288 885764 871946 858951 847464 837916 830224
49784 830224 823746 817979 813228 810209 809149 809562 810708 811929 812755 813205 814081 816586 821437 828479 837152
49769 837152 847160 858465 870723 882912 893732 902421 909122 914495 919187 923717 928342 932531 934845
49756 934845 934034 930306 924987 918796 911072 900915 888603 875513 863085 852273 843585 837048 832188
49743 832188 828440 825594 823675 822609 822278 822738 824006 825636 826831 827097 826796 827141 829585 834893 842545
49728 842545 851143 859472 867009 873549 879009 883994 890146 899319 912281 928343 945998 963700 980416
49715 980416 995987 1010987 1025829 1039824 1051129 1057646 1058075 1052549 1042481 1029652 1015261 1000032
49703 1000032 985098 972198 962710 956976 954862 956255 960324 964848 967256 966343 962441 956246 948420 940280
49689 940280 933754 930010 928685 928880 930549 934454 941028 949680 959224 968886 979042 991121 1006676 1026575
49675 1026575 1051105 1080462 1114316 1150500 1184519 1211018 1226253 1229689 1223776 1212346 1198932 1186113
49663 1186113 1175866 1169830 1168852 1172660 1180444 1191404 1203950 1214577 1218656 1213002 1197524 1174426 1146559
49650 1146559 1116749 1087678 1061196 1037732 1016899 998621 983257 970844 960892 953060 947544 944545
49638 944545 943692 944284 945896 948398 951353 953714 954397 953102 950282 946199 940359 932222 922218 911628
49624 911628 901428 891775 882673 874561 867891 862505 857894 853821 850332 847350 844734 842664 841523 841337
49610 841337 841666 842092 842533 843026 843550 844211 845340 847114 849106 850458 850595 849761 848780 848292 848283 848403 848614 849286
49592 849286 850581 852031 852916 853028 852841 852966 853522 854102 854269 854057 853944 854293 854899 855280 855392 855762 856831 858465
49574 858465 860390 862820 866323 871177 877283 884687 893805 905005 918193 932947 948773 965049 980910
49561 980910 995506 1008416 1019627 1029044 1036074 1039780 1039530 1035516 1028656 1020007 1010440 1000832 992270 985683
49547 985683 981273 978553 976943 976126 975882 975997 976444 977344 978467 979067 978564 977292 976248 976211 977427 980093
49531 980093 984612 991156 999380 1008973 1020372 1034575 1052290 1073588 1098441 1127299 1160774 1198588
49519 1198588 1238699 1277357 1310290 1334452 1349286 1356605 1359306 1360084 1360988 1363527 1368620 1376379 1386124
49506 1386124 1396677 1406423 1413159 1414331 1407926 1393416 1371896 1345459 1316430 1286895 1258415 1231867
49494 1231867 1207621 1185976 1167352 1151972 1139482 1129152 1120491 1113423 1107866 1103410 1099691 1096865
49482 1096865 1095370 1095265 1096091 1097421 1099163 1101202 1103143 1104697 1106034 1107466 1109003 1110635 1112871 1116340
49468 1116340 1120767 1124908 1127908 1130342 1133472 1137747 1142543 1147336 1152436 1158303 1164587 1170384 1175236 1179341
49454 1179341 1182690 1184535 1184118 1181675 1178242 1174536 1170489 1165973 1161435 1157408 1153729 1149892 1146063 1143162
49440 1143162 1141753 1141406 1141493 1142217 1144388 1148385 1153806 1160057 1166923 1174686 1184196 1196794 1213531 1234190
49426 1234190 1257474 1282276 1308251 1335019 1361861 1389116 1419115 1453997 1491883 1525973 1548164
49415 1548164 1553710 1542946 1520026 1490894 1461506 1436151 1416586 1402827 1394590 1391696 1393634 1399724
49403 1399724 1409767 1423795 1441045 1459899 1479090 1498312 1517372 1535496 1552003 1567096 1581290
49392 1581290 1594403 1605741 1615022 1622469 1628050 1631128 1630838 1626484 1617686 1604665 1588383 1570009 1550235
49379 1550235 1529377 1508015 1487101 1467545 1450058 1435294 1423642 1414969 1409115 1406580 1408051 1413131
49367 1413131 1420156 1427504 1434534 1441031 1446533 1450759 1454142 1457115 1459104 1458866 1455810 1450375 1443103 1433831
49353 1433831 1422081 1407924 1392322 1376769 1362633 1350623 1340722 1332631 1326177 1321127 1316781 1312150
49341 1312150 1306740 1300926 1295448 1290663 1286391 1282340 1278446 1274858 1271860 1269915 1269671 1271785 1276840 1285569
49327 1285569 1298954 1317541 1340294 1364289 1385923 1402520 1412825 1416514 1413996 1406735 1396966 1386479
49315 1386479 1375793 1364615 1352692 1339830 1325610 1309795 1293016 1276507 1261154 1247243 1235190
49304 1235190 1225905 1220114 1217590 1217438 1218989 1222209 1227344 1234417 1243050 1252587 1262321 1271578 1279629 1285689
49290 1285689 1289315 1290845 1291119 1290558 1288637 1284405 1277379 1267823 1256453 1244305 1232787 1223334 1216681 1212613
49276 1212613 1210598 1210531 1212721 1217230 1223446 1230378 1237258 1243843 1250179 1256155 1261372 1265484 1268482 1270417
49262 1270417 1270886 1269272 1265788 1261939 1259485 1259095 1260647 1264813 1273584 1288704 1310039 1335963 1364860
49249 1364860 1395378 1425251 1450871 1468657 1476761 1475336 1465631 1449208 1427818 1403447 1378190 1353899
49237 1353899 1331706 1311821 1294067 1278808 1267162 1260121 1257655 1258865 1262799 1268830 1276449 1285054 1294020
49224 1294020 1302776 1310908 1318409 1325769 1333577 1342103 1351363 1361366 1371909 1382286 1391674 1399909 1407452
49211 1407452 1414580 1421057 1426807 1432529 1439356 1448157 1459425 1473460 1490152 1508686 1527911 1547124
49199 1547124 1566331 1585742 1605275 1624608 1643432 1661432 1678136 1692937 1705388 1715472 1723524
49188 1723524 1729834 1734331 1736870 1737884 1738521 1739923 1742482 1746018 1750605 1756941 1765941 1778292 1794481 1815026
49174 1815026 1840610 1872219 1911285 1959338 2017099 2083602 2155831 2228804 2296117 2351326 2389973
49163 2389973 2410962 2416356 2410188 2397339 2382517 2368944 2357495 2347327 2337419 2327337 2316893 2306061
49151 2306061 2295597 2287109 2281878 2279943 2280703 2283989 2289834 2297552 2305969 2314666 2324279 2335353 2347600
49138 2347600 2360587 2374542 2389854 2406191 2422733 2439182 2455972 2473511 2491655 2510011 2528319
49127 2528319 2546431 2564222 2581717 2599127 2616728 2634924 2654456 2676163 2700338 2726622 2754796
49116 2754796 2785503 2819977 2859405 2904995 2958579 3022734 3100346 3194624 3309840 3451665 3625641
49105 3625641 3833613 4069692 4319145 4563689 4792259 5009040 5228804 5459578 5686673
49096 5686673 5874223 5985335 6004588 5944796 5834697 5699600 5549629 5381388 5188364 4970759
49086 4970759 4738112 4504816 4283797 4083235 3906852 3755375 3627629 3521441 3434408 3363935
49076 3363935 3306760 3259081 3217564 3180190 3146108 3115007 3086812 3061695 3039972 3021734 3006434
49065 3006434 2992896 2979939 2967223 2955255 2944363 2934001 2923480 2913087 2903764 2895746 2888303 2881012
49053 2881012 2874580 2870027 2867611 2867044 2868308 2871737 2877471 2885143 2893767 2901579 2906409 2906792 2902636 2894640
49039 2894640 2883560 2870585 2857921 2847982 2841894 2839267 2839365 2841845 2846424 2852662 2860364 2869562 2879719
49026 2879719 2889488 2897636 2903849 2908230 2910507 2910329 2908231 2905720 2904276 2904479 2905972 2907956 2909746 2911288
49012 2911288 2913261 2916452 2920935 2925975 2930812 2935320 2939862 2944794 2950307 2956546 2963475 2970602 2977133 2982593
48998 2982593 2987155 2991215 2994754 2997306 2998481 2998340 2997299 2995804 2994066 2991938 2989070 2985316 2980934 2976275
48984 2976275 2971404 2966296 2961241 2956545 2951808 2945947 2938242 2929039 2919314 2909851 2900952 2892460 2883711 2873859
48970 2873859 2862681 2850782 2838724 2826347 2813448 2800704 2789317 2780007 2772946 2768388 2766607 2767353
48958 2767353 2770262 2775780 2784809 2797328 2812231 2828820 2847637 2869349 2893632 2919707 2947276 2976132
48946 2976132 3005344 3033687 3060745 3086938 3112609 3137644 3161971 3185878 3209886 3234672 3261014
48935 3261014 3289358 3319542 3351303 3384919 3420926 3459341 3499695 3541717 3585489 3630967 3677955
48924 3677955 3726597 3777371 3830570 3886293 3944942 4006985 4071984 4138429 4204951 4271282 4337776
48913 4337776 4404518 4471322 4538155 4604950 4671178 4735995 4798689 4858690 4915472 4968952 5019842
48902 5019842 5069099 5116966 5162821 5205826 5245338 5280776 5311583 5337523 5358810 5375940 5389556
48891 5389556 5400347 5408689 5414409 5417258 5417618 5416316 5413652 5408982 5401431 5390709 5377090 5360889 5342164
48878 5342164 5320699 5296129 5268265 5237362 5203752 5167184 5126934 5082779 5035387 4985424 4932712
48867 4932712 4876866 4818488 4759146 4700173 4642016 4584798 4529006 4475367 4424293 4375653 4328965
48856 4328965 4283790 4240074 4198121 4158128 4119898 4083187 4048132 4014976 3983538 3953501 3925219
48845 3925219 3899694 3877588 3858668 3842353 3828368 3816699 3807407 3800787 3797311 3797069 3799557 3804309 3811332
48832 3811332 3820693 3832107 3845425 3861007 3878991 3898467 3918121 3937604 3957648 3978834 4000877
48821 4000877 4023218 4045696 4068447 4091623 4115434 4140056 4165203 4190174 4214540 4238518 4262436
48810 4262436 4286133 4309151 4331293 4352796 4374200 4396238 4419558 4444271 4469978 4496463 4524129
48799 4524129 4553457 4584207 4615443 4646223 4675986 4704418 4731285 4756407 4779597 4800613 4819378
48788 4819378 4836162 4851371 4865260 4878028 4889974 4901098 4910469 4916336 4917106 4912121 4901570 4885996
48776 4885996 4866042 4842341 4815243 4784645 4750359 4712663 4672298 4629804 4585045 4537552 4487283
48765 4487283 4434910 4381357 4327209 4272655 4217880 4163415 4110066 4058507 4008869 3960729 3913662
48754 3913662 3867888 3824216 3783283 3744966 3708670 3673925 3640456 3607963 3576272 3545757 3517215
48743 3517215 3491294 3468316 3448590 3432434 3419781 3410188 3403362 3399262 3397524 3397322 3398128 3400123 3403429
48730 3403429 3407402 3411328 3415497 3420870 3427758 3435500 3443504 3451908 3461071 3470952 3481362 3492326 3503765
48717 3503765 3515034 3525203 3533700 3540482 3545745 3549767 3552991 3555977 3559144 3562615 3566341 3570359 3574857
48704 3574857 3579906 3585135 3589887 3593918 3597769 3602195 3607344 3612898 3618969 3626269 3635225 3645402 3656098
48691 3656098 3667121 3678493 3689664 3699560 3707450 3713470 3718394 3723214 3728888 3736097 3745054 3755635 3767580
48678 3767580 3780296 3792711 3803861 3813824 3823722 3834650 3846952 3860723 3876661 3895901 3919055 3945621
48666 3945621 3974144 4002465 4027722 4046484 4055407 4052041 4035217 4004900 3961848 3907414 3843546 3772694
48654 3772694 3697506 3620475 3543896 3470099 3401411 3339617 3285300 3237714 3195380 3157002 3122048
48643 3122048 3090547 3062170 3035529 3008690 2980589 2951777 2923613 2896994 2872090 2848855 2827031
48632 2827031 2805769 2784058 2761808 2739846 2718474 2696728 2673668 2649833 2626545 2604167 2582116
48621 2582116 2560570 2540925 2524083 2509245 2495223 2482301 2471896 2464688 2459995 2456943 2455284 2454854
48609 2454854 2454984 2454855 2453951 2451736 2447415 2440658 2432348 2424066 2416878 2411063 2406947 2405324 2406700 2410441 2414950
48594 2414950 2418525 2419957 2418674 2414861 2409357 2402972 2395735 2386964 2376120 2363301 2348836 2332755 2314924
48581 2314924 2295516 2275093 2254310 2233782 2214111 2195770 2179046 2164238 2151727 2141565 2133284
48570 2133284 2126596 2122216 2121354 2124305 2130058 2137410 2145730 2154272 2161438 2165476 2165620 2161945 2154386 2142760
48556 2142760 2127762 2111200 2094879 2079620 2065478 2052438 2040534 2029524 2018723 2007230 1994392
48545 1994392 1980277 1965581 1950834 1935776 1919829 1903090 1886406 1870570 1855943 1842849 1831599
48534 1831599 1821887 1812819 1803979 1796040 1789948 1785951 1783877 1783999 1787102 1793962 1805186 1821200 1841671
48521 1841671 1864840 1887677 1906678 1918490 1920527 1912064 1894976 1872890 1849338 1826692 1806376 1789276
48509 1789276 1775799 1766091 1760454 1759336 1762841 1770526 1781663 1795401 1810820 1827410 1845540 1865833
48497 1865833 1887688 1908614 1925095 1933980 1933370 1923130 1905051 1882069 1856668 1829931 1802108 1773663
48485 1773663 1745437 1718069 1691745 1666623 1643275 1622559 1604947 1589986 1576626 1564240 1553064
48474 1553064 1543363 1534558 1525809 1517257 1509874 1504075 1499283 1495077 1491868 1489998 1489002 1488460 1489023 1491814 1497137
48459 1497137 1504378 1512870 1522110 1531260 1539209 1545256 1549351 1551577 1551703 1549312 1544250 1537095 1529238 1522120
48445 1522120 1516095 1510347 1504112 1497453 1490473 1482394 1472237 1460133 1447256 1434670 1422850 1412137
48433 1412137 1402864 1394944 1387853 1381078 1374248 1367074 1359742 1353093 1347748 1343171 1338258 1332751 1327313 1322311
48419 1322311 1317405 1312428 1307829 1303927 1300365 1296505 1291820 1285823 1278406 1270473 1263471 1257899 1252807 1247148
48405 1247148 1241028 1235282 1230402 1226350 1222981 1220134 1217585 1215321 1213637 1212744 1212500 1212683 1213206 1213834 1214068
48390 1214068 1213526 1212214 1210332 1208224 1206623 1206517 1208487 1212414 1217849 1224268 1230878 1236656 1240869 1243324
48376 1243324 1244207 1244090 1244046 1245110 1247506 1250849 1255110 1260826 1268315 1277363 1287883 1300391 1315744 1334770
48362 1334770 1357988 1384873 1413287 1440177 1462957 1480047 1490782 1495906 1497790 1498954 1500307 1501753
48350 1501753 1504085 1508992 1517391 1529243 1544860 1564772 1588410 1614730 1644211 1678417 1717517 1760380
48338 1760380 1807267 1860175 1920257 1987459 2063153 2150237 2249908 2361505 2486770 2631222 2800188
48327 2800188 2997104 3227594 3501822 3831410 4228858 4713058 5311868 6058084 6990299
48318 6990299 8162046 9642119 11498148 13783881 16538321 19757793 23310308 26852390
48310 26852390 29863942 31830884 32458128 31762066 30005486 27557786 24775001 21934382
48302 21934382 19216342 16719052 14487223 12534633 10854005 9423623 8216327 7205147
48294 7205147 6362741 5661148 5075364 4585426 4174229 3826180 3529243 3275636 3058852
48285 3058852 2871794 2708710 2566620 2443367 2335924 2241610 2159211 2087738 2025523 1971330
48275 1971330 1924802 1885021 1850190 1819519 1793860 1773660 1757832 1745360 1736467 1731298 1728986 1728954
48263 1728954 1731702 1737399 1745156 1754629 1766930 1782803 1801093 1819850 1837510 1851893 1859613 1858256
48251 1858256 1848495 1832974 1813921 1792920 1771894 1752661 1735846 1721285 1709021 1698955 1690186 1681867
48239 1681867 1674397 1668848 1665525 1663912 1663592 1664428 1666171 1668589 1671576 1674507 1676005 1675104 1672179 1668117 1663071
48224 1663071 1656724 1649195 1640752 1630989 1619029 1604282 1586375 1564800 1539404 1510992 1480835 1449821
48212 1449821 1418484 1387305 1356325 1324889 1292467 1259553 1227299 1196625 1168034 1141654 1116926
48201 1116926 1092847 1069180 1046852 1026624 1008037 990362 973769 958664 944551 930693 917429
48190 917429 905689 895483 885911 876512 867622 859524 852180 845721 840374 835906 831864 828241 825257 822686
48176 822686 820119 817610 815267 812591 809183 805853 803902 803368 803013 802084 800968 800075 799214 798373 798002 798093
48160 798093 797901 797072 796225 795925 795866 795647 795642 796394 797631 798563 798887 798952 799166 799663 800367 801012 801318 801433 801946 803192
48140 803192 804774 806105 807187 808478 810112 811630 812500 812685 812678 813116 814421 816636 819537 822818 826174 829344
48124 829344 832170 834595 836519 837815 838563 839045 839340 839191 838587 838311 839420 842200 845932 849706 853185 856632
48108 856632 860526 865223 870746 876870 883498 890845 899132 908274 918128 928796 940368 952622 965380
48095 965380 978961 993788 1009689 1026126 1043075 1061106 1080476 1100608 1120657 1140246 1159577
48084 1159577 1179141 1199341 1220064 1240527 1259933 1278349 1296623 1315341 1334242 1352702 1370407
48073 1370407 1387342 1403525 1419068 1434310 1449645 1465165 1480632 1495727 1510322 1524524 1538410
48062 1538410 1551697 1563808 1574309 1583096 1590138 1595461 1599531 1603135 1606383 1608234 1607613 1604736 1600709
48049 1600709 1596060 1590411 1583531 1575928 1568227 1560533 1552597 1544080 1534461 1523129 1509797 1494622 1477969
48036 1477969 1460399 1442653 1425073 1407059 1387763 1367278 1346496 1325766 1304485 1282144 1258961
48025 1258961 1235192 1210652 1185386 1160150 1135672 1111961 1088858 1066731 1046082 1026899 1008950
48014 1008950 992348 977211 963083 949327 935894 923136 911011 899025 886913 874865 863102
48003 863102 851719 841044 831719 824193 818299 813400 808849 804301 799753 795439 791732 789070 787771 787683
47989 787683 788178 788749 789455 790454 791299 791343 790796 790674 791507 792771 793819 794640 795285 795338 794632 793837 793505 793019 791427
47970 791427 789019 787071 786071 785162 783524 781488 779922 779156 778869 778642 778206 777466 776541 775604 774562 773173
47954 773173 771607 770535 770501 771440 773046 775283 778314 782149 786645 791683 797079 802504 807789 813266 819517
47939 819517 826746 834572 842511 850583 859392 869606 881326 893889 906311 918032 929212 940252
47927 940252 951103 961240 970332 978723 986983 995028 1001987 1007061 1010321 1012427 1013706 1013765 1012011 1008280
47913 1008280 1002876 996271 988888 981021 972716 963806 954197 944103 933942 924100 914809 906118 897822
47900 897822 889598 881460 874037 868178 864146 861320 858776 856101 853557 851581 850347 849869 850290 851796 854301
47885 854301 857440 860932 864755 868980 873743 879465 886686 895400 904835 914217 923538 933238 943383 953645
47871 953645 963842 973913 983379 991467 997891 1003029 1007183 1010123 1011525 1011415 1009956 1007195 1003238 998280
47857 998280 992277 984960 976373 966948 956846 945755 933705 921572 910311 900040 890375 881325 873273
47844 873273 866287 860064 854513 849867 846274 843665 842049 841526 842043 843436 845655 848615 851924 855186 858520
47829 858520 862362 866770 871397 876190 881636 888098 895294 902707 910235 918142 926547 935296 944366 954165
47815 954165 965280 977904 991587 1005749 1020504 1036870 1055946 1077933 1102011 1127096 1152506
47804 1152506 1177947 1203046 1227001 1248614 1266705 1280593 1290173 1295568 1296812 1293882 1286817 1275636
47792 1275636 1260364 1241459 1220133 1198038 1176524 1156157 1136782 1117997 1099819 1083068 1068943
47781 1068943 1058042 1050009 1044265 1040661 1039055 1038646 1038449 1038403 1039311 1041492 1044007 1045580 1045925 1045702 1045349 1044367
47765 1044367 1041855 1037354 1030987 1023034 1013771 1003737 993745 984344 975503 967059 959171 951931 944805 937257
47751 937257 929930 924386 921281 919525 917770 916126 915666 916669 918250 919660 921133 923351 926728 931411
47737 931411 937487 944869 953300 962697 973311 985506 999490 1015114 1031675 1048187 1064351 1081151
47725 1081151 1099892 1120519 1141367 1160709 1178116 1194188 1209481 1223941 1237096 1248424 1257673
47714 1257673 1264943 1270331 1273589 1274386 1272790 1269082 1263089 1254278 1242615 1228884 1213961 1198175 1181611
47701 1181611 1164560 1147338 1130007 1112614 1095558 1079492 1065068 1052798 1042784 1034429 1026872 1020026
47689 1020026 1014813 1012075 1011658 1012936 1015759 1020341 1026552 1033953 1042455 1052419 1064123 1077554 1092719
47676 1092719 1109637 1127979 1147048 1166210 1185071 1203271 1220513 1236865 1252649 1267873 1282039
47665 1282039 1294639 1305487 1314407 1320938 1324757 1326200 1325905 1323830 1319006 1310592 1299055 1285919 1272240
47652 1272240 1257660 1241196 1222726 1203186 1183439 1163590 1143700 1124572 1107273 1092108 1078652
47641 1078652 1066653 1056317 1047692 1040503 1034939 1032090 1033054 1037786 1045280 1054783 1066416 1080674 1097868
47628 1097868 1118199 1141913 1168934 1198541 1229818 1262417 1296493 1331790 1367053 1400513 1430827
47617 1430827 1457421 1480154 1498765 1512455 1519786 1519244 1510272 1493785 1471433 1444349 1412870 1377347
47605 1377347 1338760 1298277 1256533 1213664 1170042 1126790 1085611 1048063 1014854 985657 959637
47594 959637 936214 915259 896648 879961 864776 850978 838536 827128 816305 805966 796411 787914
47582 787914 780481 773985 768204 762641 756672 750142 743660 738005 733350 729305 725641 722605 720392 718645
47568 718645 716765 714554 712243 709962 707518 704708 701578 698249 694730 691029 687299 683694 680209 676724
47554 676724 673045 668911 664247 659536 655576 652597 649900 646638 642767 638953 635843 633806 633023 633225 633468
47539 633468 632822 631357 629920 628915 627896 626507 625144 624286 623642 622527 620864 619354 618696 618974 619785 620746
47523 620746 621780 623029 624499 625931 627101 628144 629333 630647 631905 633233 634928 636832 638346 639206
47509 639206 639726 640166 640433 640668 641423 642784 643915 644130 643996 644629 646176 647742 648743 649534 650636 652028
47493 652028 653437 654806 656169 657417 658408 659143 659715 660244 660878 661684 662547 663409 664462 665838 667299 668635
47477 668635 670229 672669 675848 678994 681712 684397 687500 690934 694484 698255 702393 706780 711332 716222
47463 716222 721424 726395 730588 733995 736806 738883 739981 740250 740040 739449 738606 738154 738801 740400 742110 743604
47447 743604 745568 748832 753496 759223 765993 774211 784274 796332 810252 825564 841638 858207 875566
47434 875566 894033 913305 932662 951662 970255 988139 1004338 1017621 1027224 1033114 1035744 1035746 1033679
47421 1033679 1029802 1024089 1016689 1008435 1000608 993954 988041 981807 974761 967391 960404 953927 947604 941109
47407 941109 934200 926532 917917 908668 899185 889263 878401 866956 856317 847512 840111 832947 825482
47394 825482 817908 810356 802819 795736 789790 785044 780995 777665 775864 776039 777540 779522 781984 785342
47380 785342 789477 794012 799271 806119 814796 824544 834507 844484 854612 864775 874603 883760 892051 899419
47366 899419 905931 911571 915975 918623 919316 918207 915336 910476 903567 895002 885275 874571 862838 850064
47352 850064 836335 821782 806690 791483 776540 762124 748580 736285 725255 714993 704996 695244
47340 695244 686040 677591 669999 663508 658400 654619 651654 648777 645287 640804 635661 630979 627956 626839
47326 626839 626730 626497 625774 625073 625133 626313 628513 631464 634972 638939 643143 647146 650519 653252 655780 658459
47310 658459 661034 662796 663355 663058 662497 661716 660221 657800 655089 653130 652507 653003 653960 654860 655657 656725
47294 656725 658449 660829 663631 666947 671284 676907 683473 690655 698847 708752 720519 733823 748747
47281 748747 765950 785924 808676 834174 862240 891360 918149 938883 951784 957653 958529 956208
47269 956208 951926 946751 941693 937343 933621 930077 926558 923539 921683 921112 921222 921191 920466 918838 916341
47254 916341 913192 909623 905618 900921 895290 888584 880720 871922 862986 854853 847718 840916 833884 826889
47240 826889 820597 815240 810527 806156 802091 798473 795431 792986 791011 789459 788630 788962 790520 792948 796025
47225 796025 799899 804719 810405 816935 824462 832993 842283 852221 862901 874159 885541 896892 908411
47212 908411 919838 930282 939297 947488 955458 962701 968194 971532 972736 971485 967501 961431 954363 946536
47198 946536 937455 927302 917328 908616 901134 894247 887610 881341 875762 871116 867299 863918 861009 859460
47184 859460 860172 862973 867018 872098 878756 887164 896799 907377 919230 932544 946981 962325 978792
47171 978792 996387 1014690 1033589 1053510 1074525 1095902 1116930 1137535 1157622 1176578 1193935
47160 1193935 1209884 1224514 1237181 1247238 1254822 1260176 1262755 1261923 1258175 1252778 1246334 1238523 1229148
47147 1229148 1218654 1207511 1195786 1183503 1171031 1158952 1147810 1137867 1128839 1120110 1111606 1104230
47135 1104230 1098951 1095649 1093442 1091902 1091319 1091852 1093241 1095435 1098847 1103716 1109768 1116687 1124407 1132714
47121 1132714 1141023 1148801 1155846 1161923 1166535 1169298 1170153 1168975 1165396 1159298 1151141 1141397 1130001 1116762
47107 1116762 1102100 1086927 1071906 1057252 1043155 1029876 1017313 1004898 992217 979482 967137
47096 967137 955138 942933 930160 917102 904352 892265 880981 870794 862140 855148 849482 844754
47084 844754 840808 837496 834558 832102 830966 832047 835260 839590 844184 849005 854274 859776 865109 870395
47070 870395 876211 882838 889874 896673 902919 908642 913884 918596 922798 926594 929929 932498 934072 934791
47056 934791 934983 934779 934136 933249 932598 932515 932957 933865 935439 937831 940895 944562 949157 954814 960836 966299
47040 966299 971385 977397 985141 993860 1002245 1010083 1018340 1027758 1038055 1048505 1058756 1068824 1078678
47027 1078678 1088239 1097643 1107158 1116814 1126375 1135727 1145106 1154813 1164797 1174713 1184369 1193930 1203589 1213155
47013 1213155 1222117 1229957 1236214 1240324 1241757 1240517 1237210 1232415 1226156 1218303 1209359 1200393 1192111 1184340
46999 1184340 1176572 1168719 1161071 1153836 1147128 1141256 1136572 1133071 1130545 1129099 1128990 1129848 1130717 1131285 1132542
46984 1132542 1135584 1140119 1144889 1149473 1154838 1161938 1170542 1179903 1189981 1201370 1214242 1228008 1242001
46971 1242001 1256015 1270106 1284252 1298388 1312550 1326833 1341300 1355891 1370311 1384006 1396448
46960 1396448 1407563 1417778 1427620 1437270 1446367 1454199 1460214 1464521 1467740 1470189 1471416 1470881 1468961 1466809
46946 1466809 1465168 1463824 1462451 1461486 1461715 1463272 1465584 1468261 1471540 1475764 1480879 1486672 1493183 1500518
46932 1500518 1508539 1517056 1526279 1536671 1548320 1560750 1573413 1586120 1598958 1612107 1625812 1640148
46920 1640148 1654547 1667937 1679722 1690372 1700507 1709545 1715786 1717852 1715632 1709832 1701183 1690246
46908 1690246 1677342 1662365 1645121 1626272 1607468 1590023 1573766 1557768 1541878 1526892 1513434
46897 1513434 1501576 1491722 1484972 1482105 1482673 1485633 1490630 1498276 1509378 1524221 1542399 1562942 1584767
46884 1584767 1607437 1631478 1657539 1685209 1712962 1739287 1763635 1786202 1807163 1826292 1843125
46873 1843125 1857270 1868670 1877661 1884677 1889964 1893841 1897276 1901693 1907806 1914901 1921695 1927798 1933941
46860 1933941 1940926 1948932 1957960 1968358 1980504 1994281 2009278 2025332 2042530 2060731 2079389 2097876
46848 2097876 2115795 2133016 2149519 2165059 2178879 2189943 2197755 2202786 2205833 2207041 2205892 2202085
46836 2202085 2196047 2188555 2180184 2171218 2161797 2151980 2141911 2132053 2123055 2115303 2108801 2103611 2100121 2098747
46822 2098747 2099629 2102868 2108915 2118365 2131315 2147093 2164659 2183226 2202436 2222076 2241821 2261416
46810 2261416 2280904 2300280 2318780 2334875 2347304 2355924 2361293 2363761 2363364 2360371 2355258 2348144 2338758
46797 2338758 2327008 2313166 2297626 2280993 2264350 2248673 2233810 2218701 2202832 2186849 2171555
46786 2171555 2157118 2143599 2131443 2120799 2111023 2101569 2092895 2085843 2080597 2076927 2074955 2074763 2075544
46773 2075544 2076091 2076052 2075961 2076136 2076349 2076512 2076849 2077342 2077737 2078156 2078997 2080206 2081389 2082775 2085302 2089551 2095354
46756 2095354 2102639 2111857 2123184 2136034 2149862 2164843 2181191 2198349 2215466 2232348 2249400 2266849
46744 2266849 2284483 2301953 2318940 2335152 2350450 2364832 2378097 2389801 2399706 2407941 2414609 2419689
46732 2419689 2423608 2427248 2430952 2434000 2435667 2436407 2437423 2439431 2442509 2446806 2452544 2459486 2467217 2475929
46718 2475929 2486141 2497510 2508741 2518940 2528414 2537808 2547060 2555533 2562648 2567900 2570726 2570851 2568508
46705 2568508 2563866 2556576 2546265 2533171 2517751 2499914 2479267 2456023 2430986 2404591 2376613 2347000
46693 2347000 2316396 2285553 2254666 2223733 2193112 2163217 2133915 2104808 2076037 2048311 2022117
46682 2022117 1997379 1974010 1952304 1932503 1914232 1896708 1879440 1862602 1846780 1832453 1819572
46671 1819572 1807579 1795991 1784904 1774766 1765693 1757404 1749934 1743979 1740225 1738619 1738652 1740213 1743844
46658 1743844 1750272 1759882 1772468 1787226 1803168 1819824 1837419 1856161 1875643 1895129 1914005 1931522
46646 1931522 1946534 1958266 1967186 1974353 1979885 1982869 1982927 1981052 1978522 1975707 1972495 1969406 1967568 1967793
46632 1967793 1970227 1974830 1981754 1991276 2003724 2019539 2039090 2062300 2088543 2116886 2146402 2176335
46620 2176335 2206109 2235169 2262754 2287933 2309897 2328098 2342104 2351491 2355972 2355497 2350149 2340134
46608 2340134 2325856 2307836 2286513 2262346 2236053 2208429 2179889 2150576 2120975 2091932 2063869
46597 2063869 2036482 2009613 1983999 1960635 1939612 1920085 1901335 1883417 1866797 1851699 1837853
46586 1837853 1824599 1811194 1797251 1782944 1768769 1755197 1742525 1730704 1719139 1707030 1694277
46575 1694277 1681828 1670709 1660900 1651560 1642201 1633120 1624809 1617504 1611339 1606332 1602057 1597837 1593581
46562 1593581 1590037 1587875 1586861 1586263 1585826 1585830 1586317 1586778 1586777 1586576 1586840 1587872 1589404 1591154 1593314 1596322 1600322
46545 1600322 1605074 1610365 1616268 1623035 1630891 1639936 1649950 1660338 1670652 1681295 1693318 1707253
$$ [...]
##END NTUPLES=NMR SPECTRUM
##END=
