##TITLE=AC1437_CINAH13246_7790771_HCqIBL6tjq
##JCAMPDX= 6.0         $$ Bruker NMR JCAMP-DX V2.0
##DATA TYPE= NMR SPECTRUM
##DATA CLASS= NTUPLES
##ORIGIN= BRUKER
##OWNER= Administrator
$$ 1.72 TOPSPIN		Version 2.1
$$ 2013-04-16 20:15:07.172 -0700  Administrator@X
$$ Compression mode = diff/dup
##.OBSERVE FREQUENCY= 400.02188249412
##.OBSERVE NUCLEUS= ^1H
##.ACQUISITION MODE= SIMULTANEOUS (DQD)
##.ACQUISITION SCHEME= undefined
##.AVERAGES= 8
##.DIGITISER RES= 22
##SPECTROMETER/DATA SYSTEM= spect
##.PULSE SEQUENCE= zg30
##.SOLVENT NAME= COFFEE_meoh
##.SHIFT REFERENCE= INTERNAL, COFFEE_meoh, 1, 14.98509
##AUDIT TRAIL= $$ (NUMBER, WHEN, WHO, WHERE, PROCESS, VERSION, WHAT)
$$ ##TITLE= Audit trail, TOPSPIN		Version 2.1
$$ ##JCAMPDX= 5.01
$$ ##ORIGIN= Bruker BioSpin GmbH
$$ ##OWNER= Administrator
$$ $$ E:\/data/COFFEE/nmr/AC1437_CINAH13246_7790771_HCqIBL6tjq/10/pdata/1/auditp.txt
$$ ##AUDIT TRAIL=  $$ (NUMBER, WHEN, WHO, WHERE, PROCESS, VERSION, WHAT)
(   1,<2013-04-16 20:15:00.390 -0700>,<Administrator>,<X>,<go>,<TOPSPIN 2.1>,
      <created by zg
	started at 2013-04-16 20:13:54.234 -0700,
	POWCHK enabled, PULCHK disabled,
       configuration hash MD5:
       33 CF 6A 21 5C D3 B9 40 6C 15 AA 8D 27 A2 4F 13
       data hash MD5: 64K
       49 72 65 8D 53 C1 5B A6 64 8A 69 1B 15 27 C0 19>)
(   2,<2013-04-16 20:15:03.328 -0700>,<Administrator>,<X>,<proc1d>,<TOPSPIN 2.1>,
      <Start of raw data processing
       efp LB = 0 FT_mod = 6 PKNL = 1 PHC0 = 0 PHC1 = 0 SI = 32K 
       data hash MD5: 32K
       A9 8D 5A 06 C9 72 BB B2 F7 57 76 2F 7D AB 83 7F>)
(   3,<2013-04-16 20:15:03.609 -0700>,<Administrator>,<X>,<proc1d>,<TOPSPIN 2.1>,
      <pk PHC0 = 98.37708 PHC1 = 0 
       data hash MD5: 32K
       E2 AA A9 72 A7 33 51 24 5B 39 03 1A 58 D9 C2 96>)
(   4,<2013-04-16 20:15:03.718 -0700>,<Administrator>,<X>,<proc1d>,<TOPSPIN 2.1>,
      <abs ABSG = 1 
       data hash MD5: 32K
       42 C1 C9 FC 24 D6 60 58 54 C4 36 EF FC 02 84 AE>)
(   5,<2013-04-16 20:15:03.781 -0700>,<Administrator>,<X>,<proc1d>,<TOPSPIN 2.1>,
      <abs ABSG = 2 
       data hash MD5: 32K
       1C 78 A9 5A 12 80 11 85 4D 86 41 5B 13 F8 30 A8>)
(   6,<2013-04-16 20:15:03.843 -0700>,<Administrator>,<X>,<proc1d>,<TOPSPIN 2.1>,
      <abs ABSG = 3 
       data hash MD5: 32K
       BC 0C E1 72 AB 91 41 A2 18 55 9B 8B 3C 0B 67 92>)
(   7,<2013-04-16 20:15:03.937 -0700>,<Administrator>,<X>,<proc1d>,<TOPSPIN 2.1>,
      <abs ABSG = 4 
       data hash MD5: 32K
       F4 CC C3 B3 8B E2 39 A6 29 DC 74 98 AC 97 35 B8>)
(   8,<2013-04-16 20:15:03.968 -0700>,<Administrator>,<X>,<proc1d>,<TOPSPIN 2.1>,
      <abs ABSG = 5 
       data hash MD5: 32K
       87 98 03 7A 52 82 E9 CD EE D9 08 AD 69 CB F7 B1>)
$$ ##END=
$$ 
$$ $$ hash MD5
$$ $$ FD 81 BC E6 12 90 66 F5 EA 45 24 F8 86 23 79 4D
##$RELAX= 
##$RELAX= 
##$RELAX= 
##$RELAX= 
##$RELAX= 
##$RELAX= 
##$RELAX= 
$$ Bruker specific parameters
$$ --------------------------
##$DU= <E:\>
##$EXPNO= 10
##$NAME= <AC1437_CINAH13246_7790771_HCqIBL6tjq>
$$ [...]
150 150 150 150 150 150 150 150
##$TP07= 0
##$TPNAME0= <>
##$TPNAME1= <>
##$TPNAME2= <>
##$TPNAME3= <>
##$TPNAME4= <>
##$TPNAME5= <>
##$TPNAME6= <>
##$TPNAME7= <>
##$TPOAL= (0..7)
0.5 0.5 0.5 0.5 0.5 0.5 0.5 0.5
##$TPOFFS= (0..7)
0 0 0 0 0 0 0 0
##$TUNHIN= 0
##$TUNHOUT= 0
##$TUNXOUT= 0
##$USERA1= <user>
##$USERA2= <user>
##$USERA3= <user>
##$USERA4= <user>
##$USERA5= <user>
##$V9= 5
##$VALIST= <valist>
##$VCLIST= <CCCCCCCCCCCCCCC>
##$VD= 0
##$VDLIST= <DDDDDDDDDDDDDDD>
##$VPLIST= <PPPPPPPPPPPPPPP>
##$VTLIST= <TTTTTTTTTTTTTTT>
##$WBST= 2048
##$WBSW= 25
##$XGAIN= (0..3)
0 0 0 0
##$XL= 0
##$YL= 0
##$YMAX_a= 650569
##$YMIN_a= -553504
##$ZGOPTNS= <>
##$ZL1= 120
##$ZL2= 120
##$ZL3= 120
##$ZL4= 120
##$ABSF1= 14.98509
##$ABSF2= -5.573092
##$ABSG= 5
##$ABSL= 3
##$ALPHA= 0
##$AQORDER= 0
##$ASSFAC= 0
##$ASSFACI= 0
##$ASSFACX= 0
##$ASSWID= 0
##$AUNMP= <proc_prof1d_extract_pilot.lims>
##$AXLEFT= 0
##$AXNAME= <>
##$AXNUC= <1H>
##$AXRIGHT= 0
##$AXTYPE= 0
##$AXUNIT= <>
##$AZFE= 0.1
##$AZFW= 0.1
##$BCFW= 0
##$BC_mod= 0
##$BYTORDP= 0
##$COROFFS= 0
##$CY= 15
##$DATMOD= 1
##$DC= 0
##$DFILT= <>
##$DTYPP= 0
##$F1P= 0
##$F2P= 0
##$FCOR= 0.5
##$FTSIZE= 32768
##$FT_mod= 6
##$GAMMA= 0
##$GB= 0
##$INTBC= 1
##$INTSCL= 1
##$ISEN= 128
##$LB= 0
##$LEV0= 0
##$LPBIN= 0
##$MAXI= 10000
##$MC2= 0
##$MEAN= 0
##$ME_mod= 0
##$MI= 0
##$NCOEF= 0
##$NC_proc= -8
##$NLEV= 6
##$NOISF1= 0
##$NOISF2= 0
##$NSP= 0
##$NTH_PI= 0
##$NZP= 0
##$OFFSET= 14.98509
##$PC= 1
##$PHC0= 98.37708
##$PHC1= 0
##$PH_mod= 1
##$PKNL= yes
##$PPARMOD= 0
##$PPDIAG= 0
##$PPIPTYP= 0
##$PPMPNUM= 2147483647
##$PPRESOL= 1
##$PSCAL= 4
##$PSIGN= 0
##$PYNMP= <proc.py>
##$REVERSE= no
##$SF= 400.02
##$SI= 32768
##$SIGF1= 0
##$SIGF2= 0
##$SINO= 400
##$SIOLD= 32768
##$SPECTYP= <>
##$SREGLST= <1H.CDCl3>
##$SSB= 0
##$STSI= 32768
##$STSR= 0
##$SW_p= 8223.68421052631
##$SYMM= 0
##$S_DEV= 0
##$TDeff= 65536
##$TDoff= 0
##$TI= <>
##$TILT= no
##$TM1= 0
##$TM2= 0
##$TOPLEV= 0
##$USERP1= <user>
##$USERP2= <user>
##$USERP3= <user>
##$USERP4= <user>
##$USERP5= <user>
##$WDW= 1
##$XDIM= 32768
##$YMAX_p= 470339700
##$YMIN_p= -693537
##$CURPLOT= <Network HP LaserJet P1505>
##$CURPRIN= <$Network HP LaserJet P1505>
##$DFORMAT= <normdp>
##$LAYOUT= <+/1D_H.xwp>
##$LFORMAT= <normlp>
##$PFORMAT= <normpl>
##$SURQMSG= 1
$$ End of Bruker specific parameters
$$ ---------------------------------
##NTUPLES= NMR SPECTRUM
##VAR_NAME=  FREQUENCY,     SPECTRUM/REAL,   SPECTRUM/IMAG
##SYMBOL=    X,             R,               I
##VAR_TYPE=  INDEPENDENT,   DEPENDENT,       DEPENDENT
##VAR_FORM=  AFFN,          ASDF,            ASDF
##VAR_DIM=   32768,         32768,           32768
##UNITS=     HZ,            ARBITRARY UNITS, ARBITRARY UNITS
##FACTOR=    0.250966925370066, 1,           1
##FIRST=     8223.43324360094, -103089,      -89613
##LAST=      0,             211131,          -275393
##MIN=       0,             -693537,         0
##MAX=       8223.43324360094, 470339700,    0
$$ Real data points
##PAGE= N=1
##DATA TABLE= (X++(R..R)), XYDATA
$$ [...]
19559a48928e8722k37711R9415i0622A62058b24568h9966G5552a49511A90406
19548A24291c67343c6745k44562B16035n0272a31185k97m32561a84785b7587k32111
19537b59698r1603D2452g8772C7525d0373j81731D4650b07215L1448A74056a30388
19525B33855K60215b27605B10129c13430F0460a57128a698j9624j91861B43240
19514b08910a949j38943L8296A54544c0509k58211a3987r4137d6788A95156a30333
19502A4991K70300B8743J82943G0820J49497F0793L00368a48943j17786C9922
19491a84209B20466h9093k02267J43172B28935j8389f6036F8169b13165j32084
19481c45249A52279b40868B48615E1018g4888E22L139c5082j7301j49226i9319
$$ y = [-148928, -58722, -296433, -197018, -90622, 162058, -224568, -89966, 75552, -149511, 190406, 124291, -367343, -36745, -281307, 216035, 165763, -131185, -131482, -564043, -184785, -27587, -259698, -351301, 42452, -78772, 37525, -40373, -222104, 44650, -207215, -175767, 174056, -130388, 233855, 494070, -227605, 210129, -313430, 60460, -157128, -1698, -21322, -213183, 243240, -208910, -1949, -140892, -102596, 154544, -30509, -288720, -13987, -108124, -46788, 195156, -130333, 14991, 285291, 28743, 211686, 70820, 220317, 60793, 361161, -148943, -266729, 39922, -184209, 220466, -89093, -291360, -148188, 228935, 210546, -66036, 68169, -213165, -345249, 152279, -240868, 248615, 51018, -74888, 522, 3661, -35082, -52383, -201609, -99319]
19469c88912F1957b2133G9400a24961c1639l0186A49639a85378a1420j52583H8749
19457A95526D1173J48730e7740D1761b26251l4751J6229D8153b003k16307N9362
19446a58948M2977N1770m1239L2236k52399a55081E8413a02952M5520K6281C3523
19434G459L8473c37476J68708O6287B85278E1844c40570b0102D5355a40060B98672
19422B422J47944E3821f4783A17934b06824i2668k14816a15844m2278C84133B1660
19410B41306d46730R9269J18829R0053E9630b40294k4522A71880G6135a12326
19399A3565K08920a01832A366J70706b09414C7350f7789k82593B7572M0786d74369
19387a51556b9462q1736c5789L984D4271d00089E5164g260k9643n562j09026N4998
$$ y = [-388912, 61957, -22133, 79400, -124961, -31639, -61825, 149639, -185378, -11420, -164003, 88749, 195526, 41173, 189903, -57740, 41761, -226251, -261002, -244773, 48153, -2003, -218310, -158948, -115971, -64201, -105440, -73204, -325603, -155081, 58413, -102952, -57432, -31151, 33523, 7459, 45932, -337476, -168768, -102481, 285278, 51844, -340570, -20102, 45355, -140060, 298672, 2422, 150366, 53821, -64783, 117934, -206824, -92668, -307484, -115844, -158122, 384133, 21660, 241306, -446730, -347461, -228632, -138579, 59630, -240294, -264816, 171880, 76135, -112326, 13565, 222485, -101832, 1366, 172072, -209414, 37350, -67789, -350382, 27572, 68358, -474369, -151556, -29462, -111198, -35789, -31805, 44271, -400089, 55164, -7260, -36903, -42465, -151491, -96493]
19375i6493a3669j53684A1676d61663A03582b69932G1664J30032b67505O7988
19365a99517h4883A63715g5101j79362L8481M7754b9625m1514K5631I886d10552
19353A43459a75998B75235j25358e4405j15387L4698j43403A4186J68051a51685
19342H7043B3324a91040j10593f5678j82187R5688A9267i9578j76997F8204E909
19330b49043N4882A24115f6342q6299C8015a66796B77518B4835b43801a3287D1188
19318B29573d710k74060d1877j83014i3543D50158b19537M5563o0868R3517l78930
19307e20255K52514h8004I179c22452a34588c5064I3914a00585p0646H5040a83147
19295a26887a3982A81639C4628d1167k3201j86331B81235d8258J5623J3896j26441
$$ y = [-96493, -13669, -167353, 11676, -461663, 103582, -269932, 71664, 201696, -267505, -199517, -84883, 163715, -75101, -254463, -215982, -168228, -29625, -71139, -45508, 9886, -410552, 143459, -175998, 275235, 149877, -54405, -169792, -135094, -278497, 14186, 182237, -151685, 87043, 23324, -191040, -301633, -65678, -247865, -152177, 19267, -99578, -276575, 68204, 5909, -249043, -194161, 124115, -66342, -152641, 38015, -166796, 277518, 24835, -243801, -13287, 41188, 229573, -4710, -278770, -41877, -224891, -93543, 450158, -219537, -173974, -234842, -141325, -520255, -267741, -88004, 9179, -322452, -134588, -35064, 93914, -100585, -171231, 85040, -183147, -126887, -13982, 181639, 34628, -41167, -64368, -250699, 281235, -48258, -32635, -18739, -145180]
19284a45180B54305A8278i1974A5126E452J06902e7126a0478A30179J70363l2540
19273B68002b84472a00084l19056e8407r7295d5427F3412e2693q3399A8468P5595
19262I4063O7662a87332j34244H1323l1043a27781A14921p930K428j3479f4856
19250f3090f153A95949J99709a1036k20877A90943N2928a26289k72826O3751P8477
19239b56887A4836a29935j95588i2702A26627m0030c13926J3178L1613B68788
19228e8336k72037q3516h0936A24224g7230n2475j02535B588a12914K3545j10298
19217a99667F0882d36696c5995J3858C33833a77301o6207R2965L4029G342K79941
19206B87283a9360l35337J58775B387a38426j5195m8441b7199j80619l8031D10426
$$ y = [-145180, 254305, 18278, -91974, 15126, 5452, 112354, -57126, -10478, 130179, 300542, 268002, -284472, -100084, -419140, -58407, -155702, -45427, 63412, -52693, -136092, 18468, 94063, 161725, -187332, -321576, 81323, 50280, -127781, 114921, 106991, 109419, 95940, -64856, -63090, -6153, 195949, 395658, -11036, -231913, 190943, 243871, -126289, -399115, -335364, -256887, 14836, -129935, -325523, -92702, 126627, 86597, -313926, -300748, -269135, 268788, -58336, -330373, -413889, -80936, 124224, -77230, -129705, -232240, 2588, -112914, -89369, -199667, 60882, -436696, -35995, -22137, 333833, -177301, -243508, -150543, -116514, 7342, 287283, -19360, -354697, -195922, 2387, -138426, -153621, -202062, -27199, -207818, -245849, 410426]
19194c05740A44998a04063K159A53260d8697k00371H2068j7922K7992b73417L6026
19183b37391b9245E1697J01146B3264f7180l6568B97388C809C07a87664N2077
19172a35587d3588n5326b1692n0431b3182r0814G2432b22062A27484a75982C2208
19160b50078Q3288B21948b57637J27636d9834r9500k51849A01166a52896J9924
19150a32972O6432B22602E759a34916B91551a02030K9158o8244A67840A3674a30226
19138b15091E2547c56083E4992A2928e3116l59269A61426g8619k98902R3507g4920
19126f7293B2060J0177b07959m200k3900J6203R5019G3199a49085k742b0296B2072
19113b28585r0567D328a80255Q1019A0137L7850h9665j13617j39453A26150b66640
$$ y = [-305740, 144998, -104063, -101904, 153260, -48697, -249068, 82068, 64146, 92138, -273417, -237391, -29245, 51697, 152843, 23264, -67180, -103748, 297388, 3809, 307, -187664, -135587, -43588, -98914, -21692, -72123, -23182, -113996, 72432, -222062, 127484, -175982, 32208, -250078, -166790, 221948, -257637, -130001, -49834, -149334, -401183, 101166, -152896, -132972, -66540, 222602, 5759, -134916, 291551, -102030, -72872, -141116, 167840, 13674, -130226, -215091, 52547, -356083, 54992, 12928, -53116, -412385, 161426, -78619, -377521, -284014, -74920, -67293, 22060, 32237, -207959, -212159, -236059, -219856, -124837, 73199, -149085, -151827, -20296, 22072, -228585, -319152, 4328, -180255, -99236, 10137, 47987, -89665, -203282, -342735, 126150, -266640]
19101B03148a35421F9655a95582f4768i946C6290d7408o0461p335I7481b03312
19089b27509n9150f4453q1661B79506f9300p9283A53612f4751o5453q1167i8798
19077d7165C93430a85259A43488n5173Q1151K6117m850j9328G8455a10823j54393
19066b65216L9733I6664c4778k89798Q1559b8375A32850E6087f3315q0735g887
19054E039b38074g3782O5o8546m244B92748m7835j21875a37131A84207n3567a93659
19041F6371b73526A66441c1471k0007k909a4042j59919I0591e358B56118q1787
19030A74331E0128a3833l63682A22165k6636M04733b4107B22086a02402A93706
19019c9495p1872a0894k8892J1965k33751A69069O189b62841C14627e7282C36903
$$ y = [203148, -135421, 69655, -195582, -64768, -9946, 36290, -47408, -107869, -115204, 97481, -203312, -227509, -286659, -64453, -146114, 279506, -69300, -148583, 153612, -64751, -130204, -211371, -98798, -47165, 393430, -185259, 143488, 88315, 169466, 195583, 190733, 171405, 78455, -110823, -265216, -225483, 96664, -34778, -324576, -243017, -28375, 132850, 56087, -63315, -144050, -7887, 5039, -238074, -73782, -73717, -142263, -146507, 292748, 244913, 123038, -137131, 184207, 130640, -193659, 66371, -273526, 166441, -31471, -51478, -54387, -14042, -173961, 90591, -5358, 256118, 174331, 50128, -13833, -377515, 122165, 95529, 500262, -24107, 222086, -102402, 193706, -39495, -111367, -10894, -39786, -27821, -261572, 169069, 175258, -262841, 314627, -57282, 336903]
19007g749k92233i1513L2386F6433J35894a32895A80389p711m3986a66676A47461
18995B08277a14837j04480l7709A29367J4652a11020K5374A77610J6824i3807
18984a38196e9373a8354j5515j34112f5049j69047O6359B84610j07197k0702a59004
18972e2089A42030a05670G0551h5779k22314m4644a42821b8952j49734D3453b49446
18960E8471a14468e3970A59943n7088J38507A01159a46420o99j7412E7019a62093
18948A43447c3599j96024D94K90959a58423B6702l236a74797h1633j37214i1210
18936a55336m76718b25020g0745l54749b3603Q502B5178O9353J53289A12690B071
18924b32442J1231D981N0633i7851k66263a36078K0167d6880q4877a4032E21578
$$ y = [-7749, -299982, -91513, -59127, 66433, 202327, -132895, 180389, 172678, 128692, -166676, 147461, 208277, -114837, -219317, -257026, 129367, 144019, -111020, -85646, 177610, 194434, -93807, -138196, -59373, -18354, -33869, -167981, -65049, -234096, -167737, 284610, 177413, 156711, -159004, -52089, 142030, -105670, 70551, -85779, -308093, -352737, -142821, -28952, -178686, 43453, -249446, 58471, -114468, -53970, 159943, 102855, 241362, 101159, -146420, -147119, -164531, 57019, -162093, 143447, -33599, -229623, 494, 291453, -158423, 26702, 23466, -174797, -81633, -218847, -91210, -155336, -632054, -225020, -70745, -425494, -23603, -15101, 25178, 94531, 247820, 112690, 2071, -232442, -221211, 4981, 55614, -97851, -364114, -136078, -115911, -46880, -131757, -14032, 521578]
18912c28585l7885a19812L2448G3898c19095a1651n72443a19313e2258E6740b50207
18900A20036a77677A30963a50474k1606H203e7897H6140g3563k0311Q816j1752
18889i6810k37879e3229n3840d4528k2359A28606a37057J8549c8385a0506n2357
18878f2863j33510k3490g3896a2084C29953j44255o3543b60762B26448a2702C0496
18866I3362b01546B42K91646a66943r2936k08907J95966B79887j28449b24435
18855b79059F3729b77751a30436C18708D3622O4918g5375l6855N4087G2395O2485
18844A34880E8299P2857e3442k27822I9784O1024o7741a61936A31359N6679a72460
18832A56737m00d7069j46845j34647a33850L3472K1287B34166a3041p7036l2065
$$ y = [-328585, -366470, -119812, -87364, 73898, -319095, -11651, -584094, -119313, -52258, 56740, -250207, 120036, -177677, 130963, -150474, -172080, 8203, -57897, 86140, -73563, -93874, -85058, -96810, -334689, -53229, -107069, -44528, -66887, 128606, -137057, -118508, -38385, -10506, -62863, -196373, -219863, -73896, -12084, 329953, 185698, 122155, -260762, 226448, -12702, 30496, 93362, -201546, 242, 291888, -166943, -259879, -468786, -272820, 279887, 151438, -224435, -279059, 63729, -277751, -130436, 318708, 43622, 108540, -75375, -112230, -58143, 72395, 134880, 58299, 131156, -53442, -281264, 99784, 160808, 93067, -161936, 131359, 188038, -172460, 156737, 156337, -47069, -193914, -328561, -133850, -100378, -79091, 234166, -13041, -90077, -122142]
18821a22142B85651G3633J56836Q483M8686b07239A03828L7653a37970j00408
18811b38378A26601O7207n6471c4941H7875j6812O5624J9878b6618k37133k93940
18800e57691B46935d1283j2482i645p4569a7117k99906C0218J01898g0522B3594
18788d57608e4130F7045c91331J94544g5372I5019O6562l8423b20039B88790A31303
18776C322c14339C1763a22356j3641F258a69198J9345I511J15707b07541O1113
18765a46428D55967B1248d81968c3259A1990Q7179a45744L1670A36942d7184j6156
18754f3340r3424L6126F0471g9858J4576j62569r235Q6498I0825a79301L9012
18743a40289C1550a79337g1581a1871j87668N8005A47250e7464j44962j35818
$$ y = [-122142, 285651, 73633, 230469, 238952, 287638, -207239, 103828, 141481, -137970, -238378, 126601, 193808, 137337, -34941, 87875, 71063, 136687, 156565, -26618, -263751, -557691, 246935, -41283, -53765, -9645, -84214, -17117, -317023, 30218, 132116, -70522, 23594, -457608, -54130, 67045, -391331, -196787, -75372, 95019, 161581, 123158, -220039, 288790, 131303, 3322, -314339, 31763, -122356, -135997, 6258, -169198, -149853, 9511, 125218, -207541, -146428, 455967, 21248, -481968, -33259, 11990, 99169, -145744, -114074, 136942, -47184, -63340, -156764, -120638, 60471, -79858, -65282, -227851, -237086, -150588, 90825, -179301, -140289, 31550, -179337, -71581, -11871, -199539, -141534, 147250, -57464, -202426, -338244]
18733c38244B93846r4511a74730l05665A3999a77648K8732B19508p3143a3893
18722b50215h5279p2198A16107e5867j06765d8504l45986C85941a35313a9450
18711i9475j27485d5128o9688n2086E3198a45837b1262O017n8877j90772A14590
18699a35333c9331l1159A16025a17982o5213P6539n7431d5389B1574J89306d34523
18687F3557a82546A36197q403a03570C2956b4801l85701i6304L1514k04671A6338
18675a5828l4652A1757a83509o7534i9767D5910J73463d06205b4796A2450b09900
18663B45686K714a30203e6406k32888k5897C6167h9709j71911D5463g0207j47450
18652b17657A99448i1773j55149i6728o1688d2859j31244E6478b8238j92504g2162
$$ y = [-338244, 293846, 199335, -174730, -480395, 13999, -177648, -148916, 219508, 146365, -13893, -250215, -85279, -157477, 116107, -55867, -162632, -48504, -394490, 385941, -135313, -19450, -99475, -226960, -45128, -114816, -166902, 53198, -145837, -21262, -15245, -74122, -264894, 114590, -135333, -39331, -70490, 116025, -117982, -183195, -106656, -164087, -45389, 21574, 210880, -434523, 63557, -182546, 136197, 127794, -103570, 32956, -24801, -410502, -96304, -64790, -269461, 16338, -15828, -50480, 11757, -183509, -251043, -99767, 45910, 219373, -406205, -24796, 12450, -209900, 245686, 248400, -130203, -56406, -289294, -315191, 36167, -89709, -261620, 45463, -70207, -217657, 199448, -91773, -246922, -96728, -158416, -42859, -174103, 56478, -28238, -220742, -72162]
18640A53698a31261p1130j09183A0280b04273G533Q8213f3002A09431b88088J02143
18629a85945d6356o9789A05183a82480O9800q6895A11682a15120l4360j34963
18619b84443A26342a30110I4695i6447j57819h1633j67983I6147f8664B03361
18608a97210d081D858c6222j71245c7382l6242j04907P5697j18087h8812r7819
18597a86631A87057b0633A16251a53719e2144j51181A4217a96565C4761J08640
18587A43401G1477i8980C634b32898h0357G3940a22241A39350g7561G5603i0161
18575e61651I7880b62080L0409B43107a86167E52730a65680C3911a40500f1142
18564c76961a54230E3677k4345M141q246h3328K6588C33371A45206a77768C4546
$$ y = [153698, -131261, -202391, -311574, 10280, -204273, 7533, 95746, -63002, 109431, -288088, -185945, -46356, -116145, 105183, -182480, -112680, -199575, 111682, -115120, -149480, -284443, 126342, -130110, 94695, -96447, -254266, -81633, -249616, 96147, -68664, 203361, -197210, -4081, 4858, -36222, -207467, -37382, -73624, -178531, -102834, -220921, -88812, -186631, 187057, -20633, 116251, -153719, -52144, -203325, 14217, -196565, 34761, 143401, 71477, -98980, 3634, -232898, -80357, 73940, -122241, 139350, -77561, 75603, -90161, -561651, 97880, -262080, -231671, 243107, -186167, 552730, -165680, 33911, -140500, -61142, -376961, -154230, 53677, 29332, 33473, 25227, -83328, -56740, 333371, 145206, -177768, 34546]
18552b24851B23230J12283a23970k75276J61955a01799B59835A2058b14159A92080
18541A81811b48155D5654Q442a89160B59185a08825M2916n8486K3322j98197D4736
18529b79555H079b04518B33349i2557B24221E9980b50582a21035B22345a68635
18518B67667G6205k1464b68369a1146C40695a87682j13313B51028i5741A3272
18507A9064b19706A7320J61793i048j56600b6844C10315j21971b63892h9178b0099
18495A12739j6156Q1743g7426m1026A43958F173L6267P7340B3560l907L6838K81274
18483C37765F6377c6391H1230a45508D7854d01525H2533a12318B8993c48437Q0427
18472b68010A6565J07767Q7347e9136l7077M0795j84634B69669C3975d53677a0860
$$ y = [-224851, 223230, 335513, -123970, -399246, -237291, -101799, 259835, 12058, -214159, 192080, 181811, -248155, 45654, 54096, -189160, 259185, -108825, -65909, -124395, -101073, -299270, 44736, -279555, 8079, -204518, 233349, -92557, 224221, 59980, -250582, -121035, 222345, -168635, 267667, 76205, 54741, -268369, -11146, 340695, -187682, -300995, 251028, -95741, 13272, 19064, -219706, 17320, 179113, -9048, -165648, -26844, 310315, 188344, -263892, -89178, -20099, 112739, 96583, 178326, -77426, -118452, 143958, 6173, 42440, 119780, 23560, 19653, 56491, 337765, 66377, -36391, 81230, -145508, 47854, -401525, 82533, -112318, 28993, -348437, -268010, 16565, 124332, 211679, -59136, -96213, -55418, -240052, 269669, 33975, -453677, -10860]
18460b8505C1308g2160A6216a78547B21246b23224a01915c399m2156j61014A9640
18448a93883k2368B22134m5049B1468D896b25524h7915l91680J39807e9155B40643
18436c56549A75177b4534M903F7853b0255C819f6382E7758a88312H5091g1215
18424d9148B51119n8014c17371d6336C61909c43646J60268P9129C1807g8359k97548
18413c75907J81051F8646c6356D2166b63753A96281F774J91527d9463l8262m11848
18402d99573b8709m6443D910L2433b65528e707o0642F7079P5502O6624I428h9683
18389b52789A21597i8659B276a00412a5312k66553a4854k94813C83154A65204
18378a10882o0508M3535o85j64463D7973a96735H8102A6902c81100d9333E1994
$$ y = [-28505, 31308, -72160, 16216, -178547, 221246, -223224, -101915, -3399, -45555, -206569, 19640, -193883, -216251, 222134, 177085, 21468, 4896, -225524, -87915, -479595, -339788, -59155, 240643, -356549, 175177, -24534, -19631, 67853, -20255, 3819, -66382, 57758, -188312, 85091, -71215, -49148, 251119, 193105, -317371, -46336, 361909, -343646, -183378, -104249, 31807, -78359, -375907, -194856, 68646, -36356, 42166, -263753, 196281, 6774, 198301, -49463, -87725, -499573, -28709, -75152, 4910, 37343, -265528, -5707, -66349, 67079, 142581, 209205, 9428, -89683, -252789, 121597, -98659, 2276, -100412, -15312, -281865, -14854, -309667, 383154, 165204, -110882, -171390, -127855, -128540, -293003, 47973, -196735, 88102, 16902, -381100, -49333, 51994]
18366c6335A57652a37270E5808e9196J7137p5336M5052o2932N2125K74J6670j09719
18354a75925A28100a12853L1143j88986B25982d2842j29023j26520e1936A68294
18343a61278d283k55413J19267L0099l0459C9354M7438B3876L4350b05419j9087
18332b24506B67008B3970a16112B59939b42797B39944b35477C09343b08933M6802
18322a62131k00018c5885A05273b84139f4995A31059a15341k17506k3436R9672
18312b56611J27454f0172l42727C4863O0062a59951j42848j3628p07a18320j44544
18301b62864C0692L7873N0568O843K5671L0701B9944a6782o4132A3666a92018
18289A47774a42385M833J8554o3856N0122I6246O4670b16109o1248e5625n2517
$$ y = [-36335, 157652, -137270, 55808, -59196, -42059, -117395, -72343, -135275, -83150, -82876, -66206, -175925, 128100, -112853, -81710, -270696, 225982, -42842, -171865, -298385, -51936, 168294, -161278, -4283, -259696, -140429, -110330, -140789, 39354, 86792, 23876, 58226, -205419, -224506, 267008, 23970, -116112, 259939, -242797, 239944, -235477, 309343, -208933, -162131, -362149, -35885, 105273, -284139, -64995, 131059, -115341, -332847, -356283, -256611, -129157, -60172, -402899, 34863, 94925, -159951, -302799, -316427, -317134, -118320, -262864, 30692, 68565, 119133, 125976, 151647, 182348, 29944, -16782, -80914, 13666, -192018, 147774, -142385, -137552, -118998, -182854, -132732, 96246, 160916, -216109, -277357, -55625, -108142]
18278a08142j04722g2839p3870E1352J77248B3173K3373d08218e7270F3915o073
18267E7842k0284K3969A4146a27661B13680i4269B6358C157a1506j9631R433j44465
18255a66169J2385a1814A32394d7330k32834O9690H5427b23429D41646b226B94905
18243a81008e654j99898r1347a05596j37955K7819E1828K5297K59371c93249B49322
18231A59882h0837j52160J3565b9890j31519J3146k16005a82004B09486J46145
18221C55631c13973b6831A7004a1048F1877b98653C22178c334G6933b85796I8053
18209h7596l5251O0476j21090F9070A7137K5114J25703L5750i861I2064L34175
18198D26239c3071l39346i5061r7095I5754c04017B8572b23142h370B616J46957
$$ y = [-108142, -212864, -72839, -146709, 51352, 228600, 23173, 46546, -408218, -57270, 63915, 57842, 37558, 61527, 14146, -127661, 213680, -94269, 26358, 3157, -11506, -31137, -21704, -166169, -153784, -11814, 132394, -47330, -280164, -210474, 85427, -223429, 441646, -2226, 294905, -181008, -5654, -205552, -296899, -105596, -243551, -215732, 51828, 77125, 336496, -393249, 249322, 159882, -80837, -232997, -219432, -29890, -161409, -148263, -364268, -182004, 209486, 355631, -313973, -26831, 17004, -11048, 61877, -298653, 322178, -3334, 76933, -285796, 98053, -87596, -122847, -62371, -183461, 69070, 17137, 42251, 167954, 203704, -9861, 92064, 426239, -33071, -372417, -95061, -192156, 95754, -304017, 28572, -223142, -8370, 2616, 149573]
18187A49573c6360q6751a6313H5613J27731m2210C9686b53762J11021j2456e752
18175c75742I9698a6849r556j14331A10837a30588B7045K12716C6298J90704a71541
18163a04285C62275k5543b83102D3740a16629A93343D0001a90442k7762k784h7512
18151D7041j552a92045d5172n523A73156K9628H0020b684C2653c66566c8909j30915
18139a69824B75114b56576g9924j9929L4683j6096r7095g9156o2718d0853j13694
18128a54547A8696a88898B49050A12058f056A71014d35003F4275K12651a09636
18117A74207b69762D6340a3248j32158A28794g8630j44360J10297C21975a88509
18106a12105p4070K7133a4956m7554D4585i2579B24765d320o8481a0506A25904
$$ y = [149573, -36360, -123111, -16313, 85613, 213344, 171134, 39686, -253762, -142741, -155197, -5752, -375742, 99698, -16849, -26405, -140736, 110837, -130588, 27045, 239761, 36298, 227002, -171541, -104285, 362275, 336732, -283102, 43740, -116629, 193343, 40001, -190442, -218204, -220988, -87512, 47041, 45489, -192045, -45172, -50695, 173156, 202784, 80020, -2684, 32653, -366566, -38909, -169824, 275114, -256576, -79924, -99853, -65170, -81266, -178361, -79156, -141874, -40853, -154547, 18696, -188898, 249050, 112058, -6056, 171014, -435003, 64275, 276926, -109636, 174207, -269762, 46340, -13248, -145406, 128794, -78630, -222990, -112693, 321975, -188509, -112105, -186175, -159042, -14956, -62510, 44585, -92579, 224765, -4320, -72801, -10506, 125904]
18094d41260J54758A53490b27555J10899K3049j5209K0656j88665A0237N3523
18084F3760K16131c1330A27427b97523e2183j82190A16542E996a70367n2153g4167
18072A25028J5697b52650A05012D461N08019I2225K96659C4629h5766j72297C52671
18060a02523j60276c2258j1643r4752A76850d8977Q485l23679B1740O5492D1500
18048c6581k17657B62346n9529h2012j18570Q8348A67589b13725a8666B23769
18037h5170b7076j96809l3083B33101e9334j65591A24629b71420C59334b42925
18026A34987a78121H1311a64384B02670b79961M2661d906k57095A1470a65577
18015g2910l1029C0695h1599D9368J87296b49336J09076m4798A67159H2093a62050
$$ y = [-441260, -286502, 153490, -227555, -116656, -93607, -108816, -88160, -276825, 10237, 63760, 279891, -31330, 127427, -297523, -52183, -234373, 116542, 5996, -170367, -222520, -74167, 125028, 140725, -252650, 105012, 4461, 512480, 92225, 388884, 34629, -85766, -258063, 352671, -102523, -262799, -32258, -43901, -138653, 176850, -48977, -40492, -364171, 21740, 87232, 41500, -36581, -254238, 262346, 202817, -82012, -200582, -112234, 167589, -213725, -18666, 223769, -85170, -27076, -223885, -256968, 233101, -59334, -224925, 124629, -271420, 359334, -242925, 134987, -178121, 81311, -164384, 202670, -279961, -237300, -4906, -262001, 11470, -165577, -72910, -103939, 30695, -81599, 49368, 236664, -249336, -140260, -185058, 167159, 82093, -162050]
18003C13179a01710k9057j01967Q3531L7233B8224Q9770D2656a14688A96932B1781
17991c11549a13536D3586M4514d726k1593o1943L4972B98535a08265A71395c50879
17979c76489b6144A86126A3262L00594g9152C3709Q864J5283K7540g6960A02922
17967E6798c77893f5443q3836A29319c4656A47998j2867J81415c17158A70472
17956D1714R4712M3741a30178O4968H2397i5656J9333a072q0826K2482A18189
17944a24624e8862D1867a93945A13371a61561j80057a2562G0046a60647B07848
17933B10506b1580A06599b88242R0382e4519K3490J989I8252e7102a2561k14793
17922b27354B80379k0079d2019p7874D3055a33603A678b42352J17198B70997a08384
$$ y = [313179, -101710, -130767, -232734, -149203, -111970, 28224, 117994, 42656, -114688, 196932, 21781, -311549, -113536, 43586, 88100, -4726, -26319, -88262, -53290, 298535, -108265, 171395, -350879, -376489, -26144, 186126, 13262, 313856, -79152, 33709, 42573, 57856, 85396, -76960, 102922, 56798, -377893, -65443, -149279, 129319, -34656, 147998, 135131, 316546, -317158, 170472, 41714, 136426, 180167, -130178, -65210, 82397, -95656, -76323, -1072, -81898, -59416, 118189, -124624, -58862, 41867, -193945, 113371, -161561, -341618, -12562, 70046, -160647, 207848, 210506, -21580, 106599, -288242, -197860, -54519, -31029, -29040, 98252, -57102, -12561, -227354, 280379, 260300, -42019, -119893, 43055, -133603, 1678, -242352, -125154, 270997, -108384]
17910G8769i549l11288A76203B8779K50773a58917j83962A77582b55808f0067
17899A49695e9884l8986k9435A93787a24401A71687a29846G5868J36945H1068
17888B062c63H848J13595A9646c12966A21296l1703J62459c84956B01732b48872
17876h1927C55476A05269g321C13319D3002b21559A14887P133c0006H2394a84683
17864A63588J47867d0634k15609A14167c622o0235n3604j16786D9319a68786e1972
17852b24447M056b1057B2036J39471j8995C7465a53673H7600A9436a7801C2927
17840I1280J37992h1424H1905L6057f4076L607k03506N4550I1579C5715B431d4563
17827C25220j11809m8987h0265F4328j5847J61439J12732e9863r91j07447c3208
$$ y = [78769, -9549, -320837, 176203, 28779, 279552, -158917, -342879, 177582, -255808, -60067, 149695, -59884, -98870, -128305, 193787, -124401, 171687, -129846, 75868, 212813, 81068, 2062, -363, 8848, 122443, 19646, -312966, 121296, 89593, 252052, -384956, 201732, -248872, -81927, 355476, 105269, -7321, 313319, 43002, -221559, 114887, 122020, -30006, 82394, -184683, 163588, 311455, -40634, -256243, 114167, -3622, -63857, -117461, -234247, 49319, -168786, -51972, -224447, -220391, -21057, 22036, 161507, 142512, 37465, -153673, 87600, 19436, -17801, 32927, 91280, 229272, -81424, 81905, 117962, -64076, -60469, -263975, -209425, 91579, 35715, 2431, -44563, 325220, 213411, 164424, -80265, 64328, 48481, 209920, 322652, -59863, -60854, -168301, -33208]
17815a44183n7826h642k5031j36008G0012a94348C4867h2103A0879g902n7216
17804f5118k90031D6239a38950B64558A1299i5375j7500A32727b0324j5646A96824
17792A5875b83809A74237j632b64310B67256J25305a44045A77387C3656i2246
17781A25889A0947J34482c38425g0979A98576c428l2933A00232o949R0815L4386
17770B18484J3974o3508a56350A28881C391M1889g4027G8551G790a14734A28890
17758A52989a51465b5456D3859J49201a8701m9302n5822d1537k6669k2250f95
17746a74086A03841D0361J28286e8545d316B52340H2748g9875A58466l6279m6913
17735G5274J38228a00602B46608I7147a54214j272A18644e6584k16713b6293B2777
$$ y = [-144183, -202009, -8642, -33673, -169681, 70012, -194348, 34867, -82103, 10879, -7902, -65118, -355149, 46239, -138950, 264558, 11299, -95375, -112875, 132727, -20324, -35970, 196824, 15875, -283809, 174237, 172605, -264310, 267256, 392561, -144045, 177387, 33656, -92246, 125889, 10947, 145429, -338425, -70979, 198576, -3428, -36361, 100232, 93283, 184098, 218484, 232458, 168950, -156350, 128881, 3391, 45280, -74027, 78551, 7790, -114734, 128890, 152989, -151465, -25456, 43859, 193060, -18701, -68003, -123825, -41537, -68206, -90456, -695, -174086, 103841, 40361, 168647, -58545, -4316, 252340, 82748, -79875, 158466, 122187, 75274, 213502, -100602, 246608, 97147, -154214, -155486, 118644, -56584, -273297, -26293, 22777]
17723A57040a83800M9260n366O6528c6638A10128J43203a92763Q1832I7260K77608
17712C74868A18037b15419O1914a4047G924d2625B54298o1754G1407a78117h0645
17700a3024A59153c7688m5710B8704g673A38510P8944P4113d5271k7169j08924
17689a81364a6573j13989l8055A50919E4514g8855B65856a42829A34335J18514
17679B52849c05281a3384l08135M5907F4670b23938K7000P0316I802d4557q7184
17668a31741E2914j2821i9850F3060J42700q7466a09725E1839j9749g1924b290
17656I2863K08188N9177b57379A19114l4276J20083q6831b22335Q0369A5031J2259
17645B7290I649J01756K0630B0717g1305j66389P479B25948b56256B16705q6885
$$ y = [157040, -183800, -134540, -139906, -73378, -36638, 110128, 253331, -192763, -110931, 97260, 374868, 118037, -215419, -153505, -14047, 7924, -42625, 254298, 192544, 71407, -178117, -80645, -13024, 159153, -37688, -83398, 28704, -7673, 138510, 217454, 291567, -45271, -72440, -181364, -16573, -130562, -168617, 150919, 54514, -78855, 265856, -142829, 134335, 252849, -305281, -13384, -321519, -275612, 64670, -223938, -196938, -126622, 9802, -44557, -131741, 52914, 40093, -99850, 63060, 205760, 118294, -109725, 51839, 32090, -71924, -2290, 92863, 301051, 360228, -257379, 119114, 84838, 204921, 118090, -222335, -141966, 15031, 27290, 9649, 111405, 132035, 20717, -71305, -237694, -230215, 225948, -256256, 216705, 129820]
17634A29820a12498B00785h4341E6671b71091D1360b0022A20140K12826a4363
17623C01939b24646C13872g6839A408Q0781J96456J99893B12446b02871O3064
17613a39807j0197F6155k4225K01692M26640C9486a53715O6147A47467B8117b84714
17601b9382k09217a12910N4082B75311H0893B8185b0437F2969K90347H5400F743
17589h1153A7971K66632a03027A37982J93864A24491a38074A34353h9263H8660
17578a76466b5649B02290f6555q8236C17179A31639K17358b33793G8712j3681
17568F5031a13430b3885C13457j21990b23714A15307J00222B2100a44855A27269
17557G0926a2934E7629P9166J72624a00808G0617Q531a44691E8526K87945Q578
$$ y = [129820, -112498, 200785, -84341, 56671, -271091, 41360, -20022, 120140, 332966, -14363, 301939, -224646, 313872, -76839, 1408, 82189, 278645, 478538, 212446, -202871, -139807, -150004, 66155, 41930, 243622, 670262, 39486, -153715, -87568, 147467, 28117, -284714, -29382, -238599, -112910, -58828, 275311, 80893, 28185, -20437, 62969, 353316, 85400, 6743, -81153, 17971, 284603, -103027, 137982, 331846, 124491, -138074, 134353, -89263, 88660, -176466, -25649, 202290, -66555, -154791, 317179, 131639, 348997, -233793, 78712, 65031, -113430, -23885, 313457, 191467, -223714, 115307, 215529, 22100, -144855, 127269, 70926, -12934, 57629, 136795, 309419, -100808, 70617, 79148, -144691, 58526, 346471, 355049]
17546C55049a57450B85742m6844g2211m3173J0491A22765l3987J52776o2317C6858
17534B5811K6051A9104b12135F6000J48043e5192A89021b43753b7450B47041b30854
17522I1382K9207J19682L56852h5975A35261k9187J85845a17907l6095I0299a77438
17510B45858H9894R3374a00210E7610Q3927h3043B87736c7066j36445I1950j7369
17499G4581O6320a56079e9779K280m6647G3575J06640Q3677p3407q1361B3623
17487B28295O6235A30720a51273A73764p9215J73244O1452K90316k63979D249
17476C46440a14046A73887c5341E20053I4149J13215N0180m6338J19291h8410
17465E3760g9184C0739a16665F7854J44006D6430J296J35932a39609C33050j41599
$$ y = [355049, -157450, 285742, 238898, -72211, -115384, -104893, 122765, 88778, 241554, 179237, 36858, 25811, 51862, 19104, -212135, 66000, 214043, -55192, 189021, -243753, -27450, 247041, -230854, 91382, 120589, 240271, 597123, -85975, 135261, 106074, 291919, -117907, -154002, 90299, -177438, 245858, 89894, 183268, -100210, 57610, 141537, -83043, 287736, -37066, -173511, 91950, 74581, 140901, -156079, -59779, -57499, -104146, 73575, 180215, 263892, 190485, 109124, 23623, 228295, 294530, 130720, -151273, 173764, 94549, 267793, 329245, 619561, 355582, 4249, 346440, -114046, 173887, -35341, 520053, 94149, 207364, 257544, 211206, 330497, -88410, 53760, -79184, 30739, -116665, 67854, 211860, 46430, 47726, 183658, -139609, 333050, 191451]
17454A91451p574o5993K28225k7918J30590j57051J08280l0900L8750j10082A17561
17442C08207b088B43661I677c0761I4806j8415R4327J86655j70840b1826D87872
17430B91155i2276A57198m2686M9566h2523B60251M8210j0254r7218A0494L07901
17419C18395j33776f5944C58627L7282E5666b3120D28880j88964c1964A97654
17408C09870H4716o608J2524Q7352J36728a67750A32552K5114K92116B3939M1589
17397F5528b1727H7976J92026N583l9538j11626J24982A05632K54853j74440C1488
17385g854C6106P3514K94894K9249b5985A88947J0212f7734B08992I0218P2813
17374A63031o5306g2226C24468j03013b9129B96793p8352J1702h8330I1356K22109
$$ y = [191451, 183877, 117884, 346109, 318191, 448781, 291730, 400010, 369110, 407860, 297778, 117561, 308207, -2088, 243661, 9677, -30761, 94806, 76391, 170718, 357373, 186533, -21826, 487872, 291155, -92276, 157198, 114512, 164078, -82523, 260251, 308461, 298207, 200989, 10494, 318395, 184619, -65944, 358627, 395909, 55666, -23120, 428880, 239916, -31964, 197654, 309870, 84716, 78108, 90632, 177984, 314712, -167750, 132552, 157666, 449782, 23939, 65528, -21727, 87976, 280002, 285585, 246047, 134421, 259403, 105632, 360485, 186045, 31488, -7854, 36106, 109620, 404514, 433763, -25985, 188947, 199159, -67734, 208992, 90218, 163031, 97725, -72226, 324468, 221455, -29129, 296793, 218441, 230143, -88330, 91356, 313465]
17363C13465H3766J84953j1897d2261B40162b48889B99145k8129n6638A004J1154
17352A2158K16913i6967C42752A16717K36438C3848a50407C75333L651l9344N836
17341C45476f3216H6202L45868Q9867B11090e9924l875A40669B3628K97080C2059
17329A48358D1740M32140A08004L54154k09385J5052e489G2359P7414o3330N38450
17318F24893B57354C6474N2901M4522M4670e443G7985K32552j42612O6505R61
17307B35391a41649A76784M9798l5773m6638k9056j4854M0605C8152K34200C0075
17295A91905b75766C04M71118G8885M4336E62J31614J00160I8357J52138g7553
17283B31556E0600a5230C60874j58972I7601J64302M6338B5770M0794J74570L4695
$$ y = [313465, 83766, 268719, 256822, -42261, 240162, -248889, 299145, 271016, 214378, 1004, 12158, 229071, -96967, 342752, 116717, 353155, 33848, -150407, 375333, 378984, 339640, 345476, -63216, 86202, 432070, 521937, 211090, -59924, -63799, 140669, 23628, 320708, 32059, 148358, 41740, 473880, 108004, 462158, 252773, 267825, -5489, 72359, 149773, 86443, 624893, 257354, 36474, 89375, 133897, 178567, -5443, 77985, 310537, 167925, 234430, 235391, -141649, 176784, 226582, 190809, 144171, 115115, 100261, 140866, 38152, 272352, 30075, 191905, -275766, 304, 471422, 78885, 123221, 562, 132176, 232336, 98357, 250495, -77553, 231556, 50600, -15230, 360874, 201902, 97601, 261903, 308241, 25770, 66564, 241134, 275829]
17272B75829o5023L19939B55139K03730G8848J8218i164j0652A68449J55362j08647
17261B15164N8450E8685G152L75243A31266J3231K8491J70027a01291b1582A57413
17249A16896J49392i7526B45333J34928j85317C2645Q8558J76460J5585P6099
17239C89347N7910C5429L14513J01634A04962M19309j78693l2507q0373M447F1920
17227A16821e0561A36176J44107B3144M12126j45563j09859F7225R6701K75251
17217D39177q1907G9725K24398L17501a38670F3408M2466N02499k25698m6958
17207C35717j25788J5039E2956K62838K16493k07453H259M44688j02525r4867
17197B55555O0019h4033I0210L67825G6932K55914j52563P7518E7672K34993a05807
$$ y = [275829, 210806, 530745, 255139, 458869, 78848, 97066, -9164, -19816, 168449, 323811, 215164, 273614, 58685, 7152, 382395, 131266, 144497, 172988, 343015, -101291, -21582, 157413, 116896, 266288, -97526, 245333, 380261, 194944, 32645, 121203, 297663, 313248, 389347, 447257, 35429, 349942, 451576, 104962, 524271, 345578, 313071, 232698, 237145, 61920, 116821, -50561, 136176, 280283, 23144, 435270, 289707, 179848, 67225, 163926, 439177, 357270, 79725, 304123, 621624, -138670, 63408, 105874, 608373, 382675, 335717, 209929, 224968, 52956, 315794, 532287, 324834, 8259, 452947, 350422, 255555, 315574, -84033, 90210, 458035, 76932, 332846, 180283, 257801, 57672, 292665, -105807]
17185A41229o2447j8381L88432j71987R2053A25858K40126A22397a64360C23483
17174B46865n025J53733l8129a59082A93317M31876k92853G3357A2167O60701
17164F72868j43277k39887j1692j8053n4596J31351J00975r6430L04215k29221
17154D16253Q0452l8010J3687o5666J48465q1561k08653j07323p1224K39592M70311
17143G96323c44479F5310O2819J60216K65709q8324j49500J39015J54442E8042
17132D90159j32948L9737a00496D06267K65798j03150q1189n4670l0825m7055
17122C55176l8282q946e8797D66617j26710J30351L5054l216k31852Q3771j03040
17111B50975D5487L36388m5448Q7517m1375A9706K35673K80510B21058J83442
$$ y = [141229, 78782, 60401, 448833, 276846, 368899, 125858, 365984, 122397, -164360, 323483, 246865, 241840, 395573, 357444, -159082, 193317, 625193, 332340, 73357, 12167, 672868, 529591, 289704, 278012, 259959, 205363, 336714, 437689, 341259, 645474, 416253, 496705, 458695, 472382, 406716, 555181, 473620, 264967, 157644, 86420, 326012, 796323, -344479, 65310, 128129, 288345, 554054, 465730, 316230, 455245, 609687, 58042, 490159, 357211, 396948, -100496, 406267, 672065, 568915, 487726, 433056, 402231, 355176, 316894, 307948, -58797, 466617, 339907, 470258, 505312, 502096, 270244, 354015, 250975, 45487, 381875, 336427, 423944, 382569, 19706, 255379, 535889, 221058, 404500]
17101D04500J69752k42063J34924G6916M54102k073B43340K86148o6493L6783
17091D99778F7039L47794A68668K21803k3482K73475j80729K17155j73285J24579
17081F28184K5214M5211k09799r8506J06565j62142L40143B98285K39076j56095
17071C81266L28599l19344J00177j41665A38918L08911j33770K80736O7857B54765
17060C43165J20101A99477N09027k75513m0223K86413l4404k33174J19339o2416
17050D68526o5990P9274K33898k72685J41161j99856l4893K12243K78857j34427
17040G06108K51704D69240J46231K27236l64893N3815J67084l40734J07263J2135
17030D77377K6749L37374j98970L1732k49220O91460C33889N35346l69894K77326
$$ y = [404500, 574252, 332189, 467113, 76916, 531018, 528945, 243340, 529488, 462995, 499778, 67039, 414833, 168668, 390471, 366989, 640464, 459735, 676890, 503605, 628184, 653398, 698609, 488810, 390304, 496869, 334727, 674870, 298285, 537361, 381266, 709865, 390521, 490698, 349033, 138918, 447829, 314059, 594795, 662652, 254765, 343165, 463266, 199477, 708504, 432991, 392768, 679181, 644777, 411603, 530942, 468526, 402536, 481810, 715708, 443023, 584184, 384328, 349435, 561678, 840535, 706108, 957812, 469240, 615471, 842707, 477814, 531629, 698713, 357979, 465242, 477377, 504126, 841500, 642530, 674262, 425042, 1116502, 333889, 869235, 499341, 776667]
17020G76667k56962J94385K29178k45387J24947M540m09929L00817K60496k66967
17010G11785l18603M98549n6360n315l622M9065k6233L0080l48651k2651L33625
16999H41669l3890j19252k40803K74077j05581J6205K69286k70622M6379M0073
16989G17541K62165j96704r585J14156l89005M09298k0286Q7823R7172B95192
16978E26360L28675J4385o9374R8108m7442j16488J6649R3174J68077j38126K75123
16967A149121l26849J57239l7999o9792r1867M00012l44284o5320L39772L28867
16957A438900l72167K48227j85283M737K6544k03810K41885k0354k42571J37222
16947A073330J09123R5981n13015J14625K58475j52096M32937n10418K45429k8990
$$ y = [776667, 519705, 714090, 943268, 697881, 822828, 827368, 417439, 718256, 978752, 711785, 393182, 891731, 835371, 830056, 826434, 875499, 849266, 879346, 530695, 508044, 841669, 807779, 688527, 447724, 721801, 616220, 632425, 901711, 631089, 677468, 717541, 979706, 783002, 773417, 887573, 498568, 907866, 887580, 975403, 1072575, 295192, 526360, 855035, 869420, 800046, 898154, 850712, 734224, 750873, 844047, 1012124, 873998, 1149121, 822272, 979511, 941512, 871720, 779853, 1179865, 835581, 770261, 1110033, 1438900, 1066733, 1314960, 1129677, 1134414, 1160958, 957148, 1199033, 1178679, 936108, 1073330, 1182453, 1278434, 765419, 880044, 1138519, 986423, 1419360, 908942, 1154371, 1125381]
16937A125381K60256j41625P5944l30627K85105m20022L18034J62793J9016j68024
16927A186231M86040j43793n03893J58042M6422j76961K46095K79951M4702k67271
16917A355565J19787O4363r9879L35032k16158k4842J33121R3621K46546l08579
16907A698577j2350L6118j34023L92134k27627J34895k46275r2465K44270K8233
16897A821487J87660q8013j15775j62571K17837k36424M234K85111k211N57181
16887B468516m16247j93106K49786J28859o5084K6349k3266k49779N51946l65755
16877B112219K49196l63682J20587K84199J73435m90242J44476p1913K66278K6118
16867B450671K86145k61290K04998M81815n9936l8333j83875j05125J20992k8493
$$ y = [1125381, 1385637, 1244012, 1319956, 989329, 1274434, 854412, 1172446, 1335239, 1354255, 1186231, 1672271, 1528478, 1024585, 1182627, 1229049, 1052088, 1298183, 1578134, 1622836, 1355565, 1475352, 1539715, 1439836, 1774868, 1558710, 1533868, 1666989, 1760610, 2007156, 1698577, 1686227, 1722345, 1588322, 1980456, 1752829, 1887724, 1641449, 1548984, 1793254, 1821487, 2009147, 1921134, 1805359, 1642788, 1860625, 1624201, 1628435, 1913546, 1911335, 2468516, 2052269, 1859163, 2108949, 2237808, 2172724, 2199073, 2175807, 1926028, 2477974, 2112219, 2361415, 1997733, 2118320, 2402519, 2575954, 2085712, 2230188, 2158275, 2424553, 2450671, 2736816, 2475526, 2680524, 3162339, 3102403, 3064070, 2880195, 2775070, 2896062, 2867569]
16857B867569R4282J83399m31212L77135O2995M7188o6284R9716K37948K09414
16847C682150l60165n8174k850K91552j11806N06490k7742l0371m6372q9918K13630
16836C966424L0320K76044k85852M22897j04562l9368L45292J06316l80775p43
16826D335993K75152J70705L10330k31966K55128q5339o9850K09000L70458J57879
16816E697490j12720P3663l3355R5818K87868j28333J35008K64636J82600L32610
16806F795285j9164L03830K07446J9485J72957L07126j44470K66968L66094k11305
16796H064252M86066K85526l11150N44147L36333J9215K33654L46401K98896M31265
16786A0734605j08233M58679N14636N96302L9671L40328M67019n1604P88714J45667
$$ y = [2867569, 2961851, 3145250, 2714038, 3091173, 3154168, 3201356, 3135072, 3234788, 3472736, 3682150, 3321985, 3263811, 3260961, 3552513, 3440707, 3947197, 3919455, 3889084, 3842712, 3752794, 3966424, 3996744, 4272788, 3986936, 4409833, 4305271, 4265903, 4611195, 4717511, 4336736, 4335993, 4611145, 4781850, 5092180, 4860214, 5115342, 5030003, 4960153, 5169153, 5539611, 5697490, 5584770, 5658433, 5625078, 5720896, 6008764, 5880431, 6015439, 6280075, 6462675, 6795285, 6776121, 7079951, 7287397, 7306882, 7479839, 7786965, 7642495, 7909463, 8275557, 8064252, 8550318, 8835844, 8524694, 9068841, 9405174, 9424389, 9658043, 10004444, 10303340, 10734605, 10626372, 11085051, 11599687, 12195989, 12235660, 12575988, 13043007, 12991403, 13780117, 13925784]
16776A3925784O03939N13521M16982L22233Q37519K43557Q23008N28125P29812
16767A8944480J23032R27204Q95684J066325L58408P91908J105062P06052J378681
16758B6296836O78576J227682R58354J642943J106990J173475K051626J379410
16750C6515892J913292K070710J589725K416668J819151K527506K913431K278237
16742E4044612L103340L354613L302557L685145L810733M118552M879179M789587
16734H5088318N434349N531750N912804O306995O785954P184612P210102P855889
16726A37310773P970321P587301P926555Q051055P144769P037433N839043N405646
16718A94272896L809773K328558J172962m39055j604535l290951m249705n461516
$$ y = [13925784, 14529723, 15043244, 15460226, 15782459, 16619978, 16863535, 17686543, 18214668, 18944480, 19067512, 19994716, 20890400, 21956725, 22315133, 23107041, 24212103, 24918155, 26296836, 26975412, 28203094, 29161448, 30804391, 31911381, 33084856, 35136482, 36515892, 38429184, 40499894, 42089619, 44506287, 46325438, 48852944, 51766375, 54044612, 57147952, 60502565, 63805122, 67490267, 71301000, 75419552, 80298731, 85088318, 90522667, 96054417, 101967221, 108274216, 115060170, 122244782, 129454884, 137310773, 145281094, 152868395, 160794950, 168846005, 175990774, 183028207, 188867250, 194272896, 198082669, 200411227, 201584189, 201145134, 199540599, 196249648, 191999943, 186538427]
16710A86538427o457526p047565q040878p904804p909203q342401p691434p962044
16702A25182572p393517p395414o667801o472990n896599n518972n461166m881301
16694G5494812m351971m009529m176203l624853l519185k978912k830126k556757
16686D7447276k423952k574778k254901j742855j823629k116548j462887j776761
16678C1270965j069431j402907j265376j312822j067012j242176r44672p84578
16670B2181991j133479p81726p68017m86748q23722o07004m71790o85307q34276
16661A5589922k99367q53450q0385m03124o79493l53439p94256o0082p29733R7159
16651A1433752j98068o06841k19909p65516n7865m27872P934n72348J56804j52165
$$ y = [186538427, 180080901, 173033336, 164992458, 157087654, 149178451, 140836050, 133144616, 125182572, 117789055, 110393641, 103725840, 97252850, 91356251, 85837279, 80376113, 75494812, 71142841, 67133312, 62957109, 59332256, 55813071, 52834159, 50004033, 47447276, 45023324, 42448546, 40193645, 38450790, 36627161, 34510613, 33047726, 31270965, 30201534, 28798627, 27533251, 26220429, 25153417, 23911241, 22966569, 22181991, 21048512, 20266786, 19498769, 19012021, 18188299, 17581295, 17109505, 16424198, 15589922, 15290555, 14437105, 14356720, 13953596, 13274103, 12920664, 12126408, 12066326, 11336593, 11433752, 11235684, 10628843, 10408934, 9643418, 9585553, 9157681, 9165615, 8593267, 8750071, 8597906]
16641H597906p16936q8184L98962k57905m23424j85647m52570j03337k63317l89334
16631F116214N20783n09001m6765q0523Q8304p65397K91508k46440q1447p5892
16621E211344m7530l89321P6877k08125J20124l02230j43905K8488L84538p41202
16611C989058k3118Q6279k54244M56425m58732q6912j64850J7982n31k90760K11018
16600C481615m40162L7330p0549J18557k27120j00794K66788j74995o2739m6952
16590B780979o3622r0488k87243L10833j78890J52213k3654k37580K32458j79152
16580B415854p7764j18797J87764n51325L33721R0340k15070m2052k3386j83654
16570A815631K72533j71405k25437J55926l488J75139P845j08078l69401P7161
$$ y = [8597906, 7880970, 7792786, 8191748, 7933843, 7510419, 7324772, 6872202, 6768865, 6505548, 6116214, 6636997, 6127996, 6081231, 6000708, 6089012, 5323615, 5615123, 5368683, 5287236, 5211344, 5163814, 4774493, 4851370, 4643245, 4763369, 4461139, 4317234, 4345722, 4730260, 3989058, 3965940, 4052219, 3797975, 4254400, 3795668, 3708756, 3543906, 3561888, 3561357, 3270597, 3481615, 3041453, 3078783, 3008234, 3126791, 2899671, 2798877, 3065665, 2890670, 2827931, 2780979, 2717357, 2626869, 2339626, 2650459, 2471569, 2623782, 2600128, 2362548, 2595006, 2415854, 2338090, 2219293, 2407057, 1855732, 2189453, 2279793, 2064723, 2022671, 1999285, 1815631, 2088164, 1916759, 1691322, 1847248, 1843760, 2018899, 2026744, 1918666, 1549265, 1626426]
16560A626426Q3895P3774k60453n1741K58059k24204M2105n4858j35106J72810
16550A530707m9622J85020k26306r0602p4244J78558j77111K09630o1515j91210
16540A233305j7880j22028J52263m9692j50811N1378J33789l48207K89161k87650
16530H83628M20185O7658o47439J63309l3412j6507J27841j30862l5972J73719
16520I72148K64614m60447J27389K56586n27039M09823J71695k89798o4133J52601
16510A013439N9605j43485l33111J67773K72556k29013N795L51778l26148j23265
16500G15924L13526j57975k03432K56902k91688N03900m57901j70155l4066K80136
16490G55171n8392j47168J82889q5096l00230J26639L4328J80071j32812n3328
$$ y = [1626426, 1710321, 1784095, 1523642, 1471901, 1729960, 1505756, 1547861, 1493003, 1357897, 1530707, 1481085, 1666105, 1439799, 1349197, 1274953, 1453511, 1276400, 1486030, 1424515, 1233305, 1215425, 1093397, 1245660, 1195968, 1045157, 1096535, 1230324, 882117, 1171278, 883628, 1303813, 1371471, 724032, 887341, 853929, 837422, 965263, 834401, 798429, 972148, 1236762, 776315, 903704, 1160290, 633251, 1043074, 1214769, 924971, 860838, 1013439, 1073044, 929559, 596448, 764221, 1036777, 807764, 813559, 1165337, 839189, 715924, 1029450, 871475, 668043, 924945, 633257, 1137157, 679256, 509101, 475035, 755171, 696779, 549611, 732500, 647404, 347174, 473813, 508141, 688212, 555400, 502072]
16480E02072J18441J01307J95624j91622o7899M9233j5072J04620j70189j7265
16470F09250l9111K04639j04228k14498K46264l12729K01803J9261J62375k40354
16460E32672N0336J12167j73812q8330M54984k57006j72006L42604g4960B50512
16449C69239j10943N704J05149j63752K89191k03039b5223E26505k04914n4033
16439B67558J10905O2597k05969n0994M00878J2254j96552l8354k039M432n8672
16428C06044M2852J8664A21740K3230J83188K42271R9031k83611j04468A20494
16417C52766K32345A87956J877L97556q1811K2894j79169J93003j99136o3830
16407B79340J92149D2211L50520J47444B27590J22942A10512K62196j10878J41943
$$ y = [502072, 620513, 721820, 917444, 725822, 657923, 707156, 692084, 796704, 626515, 609250, 570139, 774778, 670550, 456052, 702316, 389587, 591390, 610651, 773026, 532672, 583008, 695175, 521363, 433033, 888017, 631011, 459005, 801609, -74960, 250512, 369239, 258296, 264000, 369149, 205397, 494588, 291549, -25223, 526505, 321591, 267558, 378463, 441060, 235091, 184097, 584975, 597229, 400677, 362323, 360284, 364716, 306044, 348896, 367560, 121740, 144970, 328158, 570429, 669460, 385849, 281381, 120494, 352766, 585111, 187956, 189833, 587389, 505578, 528472, 349303, 542306, 343170, 279340, 471489, 42211, 392731, 540175, 227590, 350532, 110512, 372708, 261830, 403773]
16397D03773I6875M20166A80762K27824N1768B09666J96590A01296N39484B61189
16386A43731m2050P350J24022a0479B13817M2280i1239B07073J18600J9133a24512
16374d2680o5118C90795E2892J15188k9574h8403F0061K1605L17176i5106B43192
16362c6727B88410A16004E3403J31277o0237N63790a71597A15771P9563P4034
16352B69368c7127B45580m3674K1485o850A1767J49570P5425O0656g2479F9469
16340B12904J34215A06586J73236m0437o7133J84156F4019J09042J25416o9736
16330B28741B3766K4027i850B47957i0573j20518B33294o5614K8889a10898D26924
16318C4744O0775P5721b24104f9856B42848Q9457i2690A49752a09631F14991e6147
$$ y = [403773, 96875, 517041, 180762, 408586, 460354, 209666, 406256, 101296, 640780, 261189, 143731, 101681, 109031, 233053, -10479, 213817, 256097, -91239, 207073, 325673, 344806, -124512, -42680, -107798, 390795, 52892, 168080, 138506, -88403, 60061, 81666, 398842, -95106, 243192, -36727, 288410, 116004, 53403, 184680, 124443, 688233, -171597, 115771, 195334, 269368, -37127, 245580, 201906, 223391, 216541, 11767, 161337, 236762, 297418, -72479, 69469, 212904, 347119, 106586, 279822, 239385, 172252, 356408, 64019, 173061, 298477, 228741, 23766, 47793, -9850, 247957, -90573, -211091, 233294, 167680, 196569, -110898, 426924, 34744, 95519, 171240, -224104, -69856, 242848, 332305, -92690, 149752, -109631, 614991, -56147]
16306A8289J70968m6786d4290C00687a7073A65887K08627I3395m1160M0262J8190
16295A10687d9692B48169E5499M0617K83607E6933K44968l2090J06332b16497
16284a04298l6516B20059j5386a19729m695A70208J4959b67831c2952J0336H4372
16272B68497P5517a50239A32264d0794j11756B90800d2587h434C3495J81024a9816
16260a3208A98059P7830b35208d6730A50211h5306A29514a40143k4540F7439b52220
16248f346l79055A65180l551B2445L1223J69213a94965F4872a65557D1887a74819
16236A52183a09567e3782E1986J20482a4238B75519A03699K57597a25082A37868
16225b9365M900n1168D9637J98289a5604B46416d1264G3728C0824A3483O2087
$$ y = [18289, 189257, 142471, -44290, 300687, -17073, 165887, 374514, 93395, 52235, 92497, 110687, -49692, 248169, 55499, 96116, 379723, 56933, 301901, 269811, 376143, -216497, -104298, -140814, 220059, 204673, -119729, -124424, 170208, 185167, -267831, -32952, -22616, 84372, 268497, 344014, -150239, 132264, -40794, -152550, 290800, -42587, -8434, 33495, 214519, -19816, -13208, 198059, 275889, -235208, -46730, 150211, -85306, 129514, -140143, -164683, 67439, -252220, -6346, -385401, 165180, 161629, 22445, 53668, 222881, -194965, 64872, -165557, 41887, -174819, 152183, -109567, -53782, 51986, 172468, -14238, 275519, 103699, 361296, -125082, 137868, -29365, -24465, -75633, 49637, 247926, -15604, 246416, -41264, 73728, 30824, 13483, 75570]
16214G5570a2984k59556i4358B47597Q1033C5294d8740B47518d7517c546F8963
16202f4065A03670J70261C386b43934A91142n1806b06070C30907d79027B73472
16191B20311c3746B49731O3925q1842a10492l73205A73179h4514q2320F12174
16180a77440A90674a73780E3493k3283m518i5145A85171n867E5649a74805J7583
16169a57222B57505b40702R6939l3642G3435N033A083J16806J13043c5591A59513
16157B30332a91690h5724m9620k8403A79327a78606Q0115H7788J13054f6212j8665
16146h4877b8198k28814B88046H3396K3895h410j46157M0451p5698B44600b45011
16134f581j94103A3895J69544F2192f3035b2894m4680A36050f9923j51506L4446
$$ y = [75570, -12984, -272540, -94358, 247597, 328630, 35294, -48740, 247518, -47517, -3546, 68963, -64065, 103670, 273931, 3386, -243934, 191142, 139336, -206070, 330907, -479027, 273472, 220311, -33746, 249731, 313656, 231814, -110492, -483697, 173179, -84514, -166834, 612174, -177440, 190674, -173780, 53493, 30210, 25692, -95145, 185171, 179304, 55649, -174805, -157222, 257505, -240702, -143763, -177405, 73435, 78468, 1083, 117889, 230932, -35591, 159513, 230332, -191690, -85724, -135344, -163747, 179327, -178606, -98491, 87788, 200842, -66212, -84877, -28198, -257012, 288046, 83396, 107291, -8410, -154567, -114116, -189814, 244600, -245011, -6581, -200684, 13895, 183439, 62192, -63035, -22894, -67574, 136050, -69923, -221429, -186983]
16123a86983C1836a63050j6972I8666a99109B5634p886b52335A4347b23060j69881
16112c92941Q9728f0814j03609B2596a16801a6058A28914b88756H3351J81619
16102B64970m2774I9331M3403K2797h2813C76847a77239a4639c144p0055b4338
16090f4342o4289I3956a25495D0329c0202A56833h0106p5815C8890K01159b83595
16078e06629B21076h997j25085j23855L7628f7639j1348k85420C74816b6878L956
16067b2922l78080C1860a34578k828B33377g1063A48929l6840l1886l9146b41886
16055c40877A4163a15890A14517e8361a6300A81367R5872b75755P4550j778Q5164
16044a17819B55937a02798j6611p5040b1490a0713A2920c45749e997E2439j7047
$$ y = [-186983, 31836, -163050, -180022, 98666, -199109, 25634, 17748, -252335, 14347, -223060, -392941, -303213, -60814, -164423, 22596, -116801, -16058, 128914, -288756, 83351, 264970, 222196, 99331, 142734, 165531, -82813, 376847, -177239, -14639, -3144, -73199, -24338, -64342, -128631, 93956, -125495, 40329, -30202, 156833, -80106, -155921, 38890, 240049, -283595, -506629, 221076, -8997, -134082, -257937, -220309, -67639, -78987, -364407, 374816, -26878, -22922, -401002, 31860, -134578, -137406, 233377, -71063, 148929, 112089, 80203, 41057, -241886, -340877, 14163, -115890, 114517, -58361, -16300, 181367, 277239, -275755, -201205, -202983, -117819, 255937, -102798, -119409, -194449, -21490, -10713, 12920, -345749, -5997, 52439, 35392]
16033C5392b35228k6313B34770a69464P9321j75359e7991p8827b369j77155A33208
16021A02988J18145e1205B02313a22253M9122A06464J07904C8547b14657A52780
16010f7988B4594a2231l3628O835o2539A5902J45833b09343C1749P4273K96719
15999D02741j12184a3893l25975M8257J37727m0581a0201A78897l9838c24031
15988D2481b45820f7006D22047m5523C6943M69276j0846B45973L91420A32649
15977E04530B1111a31075A3696b49159C23202j08189c7093l33810F3287h4173
15966a21451D0039f1807j76719O1286Q7034c5568B28092c2327k18101h4444k14157
15955b98601g478B24776b60835A19084e6199j39479M8751l4518k8124j36643H8529
$$ y = [35392, -235228, -261541, 234770, -169464, -90143, -265502, -57991, -136818, -2369, -179524, 133208, 102988, 221133, -51205, 202313, -122253, -73131, 106464, 214368, 38547, -214657, 152780, -67988, 24594, -12231, -45859, -39024, -101563, 15902, 161735, -209343, 31749, 106022, 402741, 290557, -13893, -339868, -291611, -153884, -194465, -10201, 178897, 139059, -324031, 42481, -245820, -67006, 422047, 376524, 36943, 506219, 495373, 245973, 637393, 132649, 504530, 21111, -131075, 13696, -249159, 323202, 215013, -37093, -370903, 63287, -84173, -121451, 40039, -61807, -238526, -177240, -90206, -35568, 228092, -32327, -250428, -84444, -298601, -7478, 224776, -260835, 119084, -56199, -195678, -146927, -181445, -209569, -346212, 88529]
15943B1432f7372q3487K8779I7820m5062a34601k30216J73229O8330A61687F0655
15931B7657J36425a006F401a95795O3165A8449N5293K18103b3524k83987a53736
15919G3961b08763g4615A07207m2377k5365b7943A6257c2921k74964g4434I4623
15907f840j18920E4551h5342j00554R335f9092m2408E9096a53300P6138C69137
15895B0619a61488K0535A23877c69472J50699a4948B48477b05622P463n987B18587
15883d7376A93616a71576j24827A8556O1984l8869a42197A03729J02447f622B0065
15871H6524C5724J43911n1874o3061B8702a6106j04536C16183f5301b0451o063
15860b6514n8216k3423A11800a78974e3958k16084J29070b6375B1873b5337l42497
$$ y = [21432, -67372, -150859, -122080, 97820, 52758, -134601, -364817, -191588, -123258, 161687, 60655, 27657, 164082, -1006, 6401, -195795, -132630, 18449, 73742, 291845, -23524, -307511, -153736, 73961, -208763, -74615, 107207, 64830, 39465, -27943, 16257, -32921, -307885, -74434, 94623, -6840, -125760, 54551, -85342, -185896, -176561, -69092, -111500, 59096, -153300, -77162, 369137, 20619, -161488, -140953, 123877, -369472, -218773, -14948, 248477, -205622, -198159, -204146, 218587, -47376, 193616, -171576, -296403, 18556, 80540, 41671, -142197, 103729, 206176, -6622, 20065, 86524, 35724, 179635, 127761, 64700, 28702, -16106, -120642, 316183, -65301, -20451, -26514, -84730, -108153, 111800, -178974, -53958, -270042, -140972, -26375, 21873, -25337, -367834]
15849c67834a44135j59315a43293A7523J94211c33845a60673A38070l2847a37654
15838b84022h9268L1066j70497A36574b53695H8456b57813B7242a70688n4877
15828b25565Q8523c1530I2740b21424M6249G1119m773a30068C0447b95453e5233
15816d77472A40922D253l62N1474g1962r6590B30386f6556H7648e5397k11280
15805b66677h0120B15858H1582k6283J82145D6549c03502B9996J4969b65315B90147
15793c35069C2591g1335j97705A0368b88169K0881A91165J93930f4627m9951A09107
15781a03965A85002a85937f364C6334j7963R5548B3308f2216l051A10197b4038
15769a51333r729b7116c518H9324g6576K678n0606K8761K9450H2510k7162R9251
$$ y = [-367834, -144135, -303450, -143293, 17523, 211734, -333845, -160673, 138070, 105223, -137654, -284022, -89268, -58202, -228699, 136574, -253695, 88456, -257813, 27242, -170688, -225565, -137042, -31530, 92740, -221424, -175175, 71119, 66346, -130068, 30447, -295453, -55233, -477472, 140922, 4253, 3891, 55365, -71962, -168552, 230386, -66556, 87648, -55397, -266677, -80120, 215858, 81582, 55299, 237444, 46549, -303502, 29996, 44965, -265315, 290147, -335069, 32591, -71335, -269040, 10368, -288169, -267288, 191165, 385095, -64627, -114578, 109107, -103965, 185002, -185937, -6364, 36334, 18371, 113919, 23308, -62216, -65267, 110197, -24038, -151333, -161062, -27116, -3518, 89324, -76576, -73898, -124504, -95743, -66293, 82510, 55348, 154599]
15757A54599B7409L05506b55525B21339h2682k79643a45214b3476j75774C86651
15746B36049c17839g6345A02104h5745K2580p9819B85131B3858J17129k3295f8583
15734a61255F341K46311l7571a41740r9944b4834A14391k5026J82259a28607c0298
15722F4582e3651G3240J229h4926C3270O5506c4390p4438A09918j7385j2300a64786
15709B07632c07201m2486A9612K2092f9750a8412A54437J21180i8559d686I7000
15697b47514C22396a18253C4158K02009E2568J3625k8755L1088j4090M1707l3187
15686F2956J41309J76407G6219b66870d0562l6028j00948j06402h1285j95090
15676b76375g8097F6489r121i3473j33320A16534a47717b6017A30142F0327g8302
$$ y = [154599, 27409, 332915, -255525, 221339, -82682, -362325, -145214, -23476, -199250, 386651, 236049, -317839, -76345, 102104, -85745, -63165, -142984, 285131, 23858, 140987, 117692, -68583, -161255, 6341, 252652, 215081, -141740, -241684, -24834, 114391, 89365, 271624, -128607, -30298, 64582, -53651, 73240, 74469, -84926, 33270, 98776, -34390, -108828, 109918, 92533, 80233, -164786, 207632, -307201, -349687, 19612, 41704, -69750, -18412, 154437, 275617, -98559, -4686, 97000, -247514, 322396, -118253, 34158, 236167, 52568, 66193, 37438, 68526, 54436, 96143, 62956, 204265, 380672, 76219, -266870, -40562, -76590, -177538, -283940, -81285, -276375, -78097, 66489, 57368, -93473, -226793, 116534, -147717, -26017, 130142, 60327, -78302]
15664g412p4490j18754j9064P0999P0549F7696J36767d62607E1732d46118B0237
15652h7809A5552b96139A34221B0803a00781A39344d1566j13466A85199c6933
15641D1231M5277h8517c4330F2648c1409E4625J547c7840A41516c0298m145o9649
15629a04092A91678e5751k25886e4675j77550E8286N6687L6931J03509a02010
15618a98201l570e5681F7614J18365E5490d3081k319A47951a85425M4520A39221
15606b69140a17060H6149A5357h9466C0530b41365I7090a93027a4215k37852R3087
15595a58980H8612Q2776d835j55019B4501f3245C57838C1361Q9047k2330e7309
15583H6465a55018B23503D3490J06884b08473F4304a90225g1549j9887A36424
$$ y = [-7412, -81902, -200656, -219720, -148721, -78172, 67696, 204463, -462607, 51732, -446118, 20237, -87809, 15552, -296139, 134221, 20803, -100781, 139344, -41566, -155032, 185199, -36933, 41231, 86508, -88517, -34330, 62648, -31409, 54625, 56172, -37840, 141516, -30298, -34443, -104092, 191678, -55751, -281637, -54675, -232225, 58286, 114973, 151904, 255413, -102010, -198201, -201771, -55681, 67614, 185979, 55490, -43081, -45400, 147951, -185425, -140905, 139221, -269140, -117060, 86149, 15357, -89466, 30530, -241365, 97090, -193027, -14215, -252067, -158980, 88612, 171388, -4835, -159854, 24501, -63245, 357838, 31361, 120408, 98078, -57309, 86465, -155018, 223503, 43490, 150374, -208473, 64304, -190225, -71549, -91436, 136424]
15572b98441a41631F8076e6067j6106A14675a93705B60708a5600A22250A7889
15561B00551b39389H8933h3692B9389c4802k9619G6651M5893b09286A72578P4834
15550B47412b73493g1324k39347c2813A73103d8625F5349a79681A97326a22506
15539c54408B29629P3164d24691e9294B73847a7502A40573D1449Q9069k7401a818
15527a14669J8609B813L010g1809A46845D4196c17813D9107J60972g4851A16450
15515a25710A78598b76630f0224l6723K7572B57577b44484k6537C8364j7244d9391
15503e9447A04968m3351N8774L7388h9136j67278O1602B8055O9042J25881o5642
15492A57336M8436a71461A93984e8468A55086d4473k7834I366c50236j3939a3533
$$ y = [-298441, -141631, 68076, -56067, -72173, 114675, -193705, 260708, -15600, 122250, 17889, 200551, -239389, 88933, -83692, 29389, -34802, -64421, 76651, 122544, -209286, 172578, 247412, -273493, -71324, -310671, -32813, 173103, -48625, 65349, -179681, 197326, -122506, -354408, 229629, 302793, -424691, -59294, 273847, -17502, 140573, 41449, 130518, 103117, -1818, -114669, -96060, 2813, 5823, -71809, 146845, 44196, -317813, 49107, 210079, -74851, 116450, -125710, 178598, -276630, -60224, -96947, -69375, 257577, -244484, -271021, 38364, 21120, -49391, -59447, 104968, 61617, 120391, 157779, -89136, -256414, -194812, 28055, 97097, 222978, 157336, 205772, -171461, 193984, -58468, 155086, -44473, -72307, 9366, -350236, -364175, -13533]
15480C40795D3600c0312j09129B00930I5508j1511a66535F3304a76292A6049e2978
15468f4778L1627B06004b68715a19949K7834B52791A12603g4007A13802l6679
15458G7123R8421J26226A28139J67889b23992N915j23111h7833F3680c4851C42
15446a86525d0867k14995H5477J8983a35594c6341C9596M2892a46818i486C0697
15434A33130g4898j01342L3900C9950J31586J0769m1038B825J94276a48954K6177
15423a22777B26824H2424J10938b46148G3810O50K51102H0216l3201g9144A48727
15411d23372f1336A3866O4007b55926j18194d8313n0282A34363C6591c45943A21043
15399b18843A93764o9447J28894l9540B821d7840G0049J3635a04562j6823B58973
$$ y = [340795, 43600, -30312, -139441, 200930, 95508, 83997, -166535, 63304, -176292, 16049, -52978, -64778, -33151, 206004, -268715, -119949, -92115, 252791, 112603, -74007, 113802, 77123, 175544, 301770, 128139, 296028, -223992, -218077, -341188, -87833, 63680, -34851, 342, -186525, -40867, -255862, 85477, 104460, -135594, -36341, 39596, 82488, -146818, -9486, 30697, 133130, -74898, -176240, -142340, 39950, 171536, 182305, 141267, 2825, 197101, -148954, -122777, 226824, 82424, 193362, -246148, 73810, 74460, 325562, 80216, 47015, -79144, 148727, -423372, -61336, 13866, 77873, -255926, -374120, -48313, -98595, 134363, 36591, -345943, 121043, -218843, 193764, 124317, 253211, 213671, 2821, -47840, 70049, 83684, -104562, -121385, 258973]
15387a51077A78230b79611h6406A0246K74816A38096l8865e9164j95879A58690
15376C3446J78761K8237A10441l0977n157j4886h0042j79959F2184d28543I291
15364g6942G659a72806b1788A10409K40586p9412a43329m9925j91366B62186F0299
15352A14948a55397D5230c62778D1705f0327n118j62418M5410C15481a41563A23283
15340B42048p4798R2450G9369r23L1252a6825k69889A24526n1579c83727G664
15328f5788B29412c07023J24973c5226H4282a14901A585K1981b03524B26994G4072
15316F6543C153a94203c4066H1464i7894B36819C0943P3874a17338A94976a26114
15304A5376K9326J48102K35305k09260c05948A31558D5797j610b18100b8120B13286
$$ y = [-151077, 178230, -279611, -86406, 10246, 285062, 138096, 99231, -59164, -255043, 158690, 33446, 212207, 240444, 110441, 79464, 74307, 59421, -80042, -260001, 62184, -428543, 9291, -76942, 7659, -172806, -21788, 110409, 350995, 271583, -143329, -193254, -384620, 262186, 60299, 114948, -155397, 45230, -362778, 41705, -60327, -65445, -227863, -182453, 315481, -141563, 123283, 242048, 167250, 259700, 79369, 78446, 109698, -16825, -286714, 124526, 72947, -383727, 7664, -65788, 229412, -307023, -182050, -35226, 84282, -114901, 1585, 23566, -203524, 226994, 74072, 66543, 3153, -194203, -34066, 81464, -97894, 236819, 30943, 104817, -117338, 194976, -126114, 15376, 44702, 192804, 428109, 218849, -305948, 131558, 45797, 44187, -218100, -28120, 213286]
15292D6231a47819A15896C5689e9769A68845j9948a45153A16293e0093m8050B87124
15280d5557O142m6972C37057q573l1213g6171c0435A87688G0077M1819j4607O2711
15268A60000K89958G7101b105I1644K74682j65882g9140B808J87488c2187C11238
15256A35826P8938J08411j44381M9108D6698j3888L78727a72014A72089M58547
15246F30636R65788r2413k95903L12247l92000D22483j39785H8866Q3318D0489
15235A21381B6263K79029A24336b58073C3039a96386Q5867F9013J62847k5350
15225B06510c4958k25604J10596b654r204E3323a05460K0298j58803A58693J687
15214A60380l9060g7347q9615G0817i328C89617A08471J9548f5517A86225d219
$$ y = [46231, -147819, 115896, 35689, -59769, 168845, 148897, -145153, 116293, -50093, -98143, 287124, -45557, -39415, -86387, 337057, 328484, 297271, -76171, -30435, 187688, 70077, 111896, 97289, 160000, 449958, 77101, -2105, 91644, 366326, 200444, -79140, 2808, 190296, -32187, 311238, 135826, 214764, 323175, 178794, 227902, 46698, 32810, 411537, -172014, 172089, 630636, 1596424, 1504011, 1208108, 1520355, 1128355, 422483, 282698, 88866, 172184, 40489, 121381, 26263, 305292, 124336, -258073, 33039, -196386, -110519, 69013, 231860, 206510, -34958, -260562, -149966, -2654, -11858, 53323, -105460, -85162, -243965, 158693, 160380, 121320, -77347, -166962, 70817, -9328, 389617, 108471, 128019, -65517, 186225, -4219]
15202A36178Q8344a31827B93242N4919a15809B32288B6490a30636e5157l65889
15192d21046A54768K77889a19230A23855C5908J15059d6755B39288C4154Q463
15182D2617M54785a34314K0337b2730A36722J78225B3047J273K3658a43736B45600
15170e8402F7198N7147n8609K4554J83035l4580C9860b97075A89666D506J44102
15159A48608J07741j11225o1689J07335a68851B82856i6701B37028m8958N0263
15149B38333J5461Q648n2520K24589C4264Q3782l3692J35343N7242p8603j8613
15138A79723K70179B4051N0237k6665J08971Q8598a4150C94478A81308i0497M3270
15127d7227l6146C12092H2419e8254p954D0515c6040B11130n670I8201J2275O7265
$$ y = [136178, 224522, -131827, 293242, 348161, -115809, 232288, 26490, -130636, -55157, -421046, 154768, 432657, -119230, 123855, 35908, 150967, -46755, 239288, 34154, 42617, 497402, -134314, -113977, -22730, 136722, 314947, 23047, 24320, 47978, -143736, 245600, -58402, 67198, 124345, 65736, 90290, 273325, 238745, 39860, -297075, 189666, 4506, 148608, 256349, 145124, 83435, 190770, -168851, 282856, -96701, 237028, 188070, 238333, 253794, 262442, 209922, 434511, 34264, 118046, 84354, 219697, 276939, 198336, 179723, 449902, 24051, 74288, 47623, 156594, 245192, -14150, 394478, 181308, -90497, -47227, -83373, 312092, 82419, -58254, -66208, 40515, -36040, 211130, 205460, 98201, 110476, 177741]
15115A77741O1788a28050A55114n2845e8172B8336J46593L8171J00238I5152L9209
15104A34361b3100B54838i689k09364C18610j01371J76179a92F7907M763P2396
15093A45066J35295a0677j9791A26875J37329a31924E0676j3930c4947B79518
15082G3204J58037L3619H8696J41269a5365B19933g1579C45140A19311E0795g6588
15070A37280J54061e9958B99709j26302n9461a73300D137f1805A82207A1380J26862
15059A38242O3377M38073I7663j6581j0018J92526D8293g055B82742D0623J36263
15048A76886K93256j91829K5636K3425N3513j28582F124M10506j64317i64A29257
15036A01153e344F8003h8032B06354n0221L74142A8787K11935E523N61113A34863
$$ y = [177741, 239529, -128050, 155114, 102269, -58172, 28336, 174929, 213100, 313338, 95152, 134361, -23100, 254838, -9689, -219053, 318610, 217239, 393418, -192, 67907, 72670, 145066, 280361, -10677, -30468, 126875, 264204, -131924, 50676, 36746, -34947, 279518, 73204, 231241, 264860, 88696, 229965, -15365, 219933, -71579, 345140, 119311, 50795, -76588, 137280, 291341, -59958, 299709, 173407, 113946, -173300, 4137, -61805, 182207, 11380, 138242, 201619, 639692, 97663, 81082, 71064, 263590, 48293, -7055, 282742, 40623, 176886, 470142, 278313, 303949, 327374, 380887, 252305, 6124, 416630, 252313, -964, 129257, 101153, -5344, 68003, -88032, 206354, 156133, 530275, 18787, 230722, 5523, 566636, 134863]
15024D26324j23047J97159A15064J42481H5751J97645M6404K9017p1218j10115
15014A77484F9339K54910G4990f537q014D96695A80348J7580J16181r8730E6292
15002A49485B6186L13127p2724H8248K7224A0521N53560B3516J87668d1599B90773
14990A81582J06459M5898A39794J04655l2037J17376j64567i803A30267K82088
14980D12355F3611N1404P13889l08541f4436I2387f5940B51734L44163b3851A03163
14968B36143J82365A98649K43359j36780m7954R4776o6141K63513j81794I677
14957A3030L2672K38736K07533h834A35502L43252j81984j3419E0879J01764J00040
14946B52683I3874P8585L8205K3041K86430B03925o9350L98339A59230K88033
$$ y = [426324, 303277, 500436, 115064, 257545, 85751, 283396, 329800, 358817, 287599, 177484, 69339, 324249, 74990, -6537, -14551, 496695, 180348, 197928, 314109, 215379, 56292, 149485, 26186, 339313, 266589, 88248, 115472, 10521, 564081, 23516, 211184, -41599, 290773, 181582, 288041, 333939, 139794, 244449, 212412, 329788, 165221, -9803, 130267, 412355, 63611, 115015, 828904, 520363, -64436, 92387, -65940, 251734, 595897, -23851, 103163, 236143, 418508, 198649, 442008, 305228, 257274, 352050, 285909, 549422, 367628, 9677, 13030, 45702, 284438, 491971, -8834, 135502, 478754, 296770, 283351, 50879, 152643, 252683, 93874, 172459, 210664, 233705, 520135, 203925, 134575, 532914, 159230, 447263]
14936D47263j7017j01267m5567o3565J7523M45350k20338j11349F8578K53943
14926C22521m1305j08935D7225d015A36126M04648r6565l0783M1196C359K03895
14915B07254K70086k15840J96684J08794B10760K81040j63845q6968l7471R6481
14905B99997K11857A13681J36613D0965M03719j67978L24142A76690P197J81501
14895C65388p5953K10319j50182A44050Q3634J71722J07902B15494J16932P628
14885C40054A53726J41315L26608k13989J07214j26616R317A67099L65837B63458
14874B33032p2484K59390n7829j75457N14982A63552O2764L6749L59608j51587
14864D71086G4204N05009B12584L19070p869j09618K34379j2877l6404F9386M16180
$$ y = [447263, 430246, 328979, 283412, 219847, 237370, 682720, 462382, 351033, 68578, 322521, 281216, 172281, 47225, -4015, 136126, 540774, 444209, 413426, 454622, 3359, 207254, 477340, 261500, 458184, 566978, 210760, 491800, 327955, 240987, 203516, 299997, 511854, 113681, 250294, 40965, 444684, 276706, 600848, 176690, 183887, 365388, 289435, 499754, 349572, 144050, 227684, 399406, 507308, 215494, 332426, 340054, 153726, 295041, 621649, 407660, 514874, 388258, 397575, 167099, 532936, 263458, 233032, 160548, 419938, 362109, 186652, 701634, 163552, 226316, 263065, 622673, 471086, 74204, 579213, 212584, 531654, 523785, 414167, 648546, 635669, 599265, 69386, 485566]
14853D85566A28333L0161J03386j9592L47229k55343K07721K624G4335K43525
14843C17860O1294R6127k06782P0548J88603p1180A96552L78847j98064J72952
14833E50287k40340F2164L55147q7186K54532B63370N18279j16302l11509n2324
14823C01514M35622C42964A50591L06629A61402K09082m2930K0965M54956k82548
14813E20927o1402m1523J0267J22912J44005j80975L2598o24k15276J0294J56410
14802D97613K92310j06971m309n6135B29973K38445Q8518k04749E7076L78557
14792D35633M13469k40866P1005k44666N2268K894j101J55021k80557p52K77468
14781F39816j93432k11674L49853J35229q0005Q3849n1297k6161o1180m175j29647
$$ y = [485566, 128333, 158494, 261880, 242288, 589517, 334174, 541895, 544519, 74335, 317860, 379154, 475281, 268499, 339047, 527650, 456470, 196552, 575399, 377335, 550287, 309947, 62164, 417311, 330125, 584657, 263370, 781649, 665347, 353838, 301514, 737136, 342964, 150591, 457220, 161402, 370484, 327554, 348519, 803475, 520927, 459525, 418002, 428269, 551181, 695186, 514211, 546809, 546185, 330909, 341203, 497613, 789923, 682952, 678643, 622508, 229973, 468418, 556936, 352187, 57076, 435633, 849102, 608236, 679241, 434575, 486843, 489737, 488636, 643657, 363100, 362348, 639816, 446384, 234710, 584563, 719792, 639787, 723636, 672339, 646178, 584998, 580823, 451176]
14770D51176j03037J83290Q3523j38194J56085n8145L04571m02359K0541F4627
14759C36975L92964k21780K63457p3007O8498j30767J16339l63803J36151J21591
14749F46618j99041J05499M8416r7223N5965J11727J9856K89931j97958B32788
14738H41374k68291J28021K54767j69184j5808l9983j07357n0757O7277N01583
14728A141642E63693J01583M2300J17754K16744l5817l61336Q6132p3986L5328
14718F92395j1037K30555k75612K12825k70586K18316r942J69569P0577j24373
14708I02687p1101D06991O89306m44832J11042J73159j80779Q1610j59998K967
14698F79466J56043J95289q5641k34190r6376J33616j69111M93200k47371O2069
$$ y = [451176, 348139, 531429, 614952, 476758, 632843, 574698, 879269, 476910, 497451, 64627, 336975, 729939, 508159, 771616, 698609, 767107, 636340, 752679, 388876, 525027, 646618, 447577, 553076, 601492, 504269, 560234, 671961, 691817, 981748, 783790, 232788, 841374, 573083, 701104, 955871, 786687, 770879, 730896, 623539, 572782, 640059, 1141642, 563693, 665276, 707576, 825330, 1042074, 1006257, 644921, 731053, 657067, 692395, 681358, 911913, 636301, 849126, 578540, 796856, 786914, 956483, 1027060, 902687, 831586, 406991, 1096297, 651465, 762507, 935666, 754887, 836497, 676499, 679466, 835509, 1030798, 945157, 710967, 614591, 748207, 579096, 1072296, 824925, 886994]
14688H86994j44719p3262K59014r3820p8333K57599K8557J02595O6765j56245
14678A055145J4339O3536r2474R2882K55551m86349k01096J09526L17538K96369
14668A424967m70979K812K54200j28273k8876m85875K73703K39948J59600j37804
14658A103423k63971O2589J03411L62925n77901L22858j28667L17392k30040k31317
14648H40702J71249L12056j16233p6831K53198k25725K8713K22759m38317J07052
14638A078623J37805m5002J82939R1169O5538k19844j29571J11946M1162M5843
14628A360608j95501j52474K90688O2210J48386J68085o13556J77922L49886j74570
14618A421684k15858L7685L04392j88947K25411k79715l5863J06161J34695K2995
$$ y = [886994, 742275, 669013, 928027, 834207, 755874, 1013473, 1042030, 1144625, 1211390, 1055145, 1069484, 1133020, 1040546, 1133428, 1388979, 902630, 701534, 811060, 1128598, 1424967, 953988, 956800, 1211000, 1082727, 1053851, 567976, 841679, 1081627, 1241227, 1103423, 839452, 902041, 1005452, 1368377, 790476, 1113334, 984667, 1302059, 1072019, 840702, 1011951, 1324007, 1207774, 1130943, 1384141, 1158416, 1187129, 1409888, 971571, 1078623, 1216428, 1171426, 1354365, 1445534, 1511072, 1291228, 1161657, 1273603, 1314765, 1360608, 1165107, 1012633, 1303321, 1365531, 1513917, 1682002, 1068446, 1246368, 1596254, 1421684, 1205826, 1243511, 1547903, 1358956, 1584367, 1304652, 1268789, 1374950, 1509645, 1532640]
14608A532640L59648l24971K21226j23571k19634K42362L2807K12961k88252j149
14598A644067j33672k2498N6251J82458k01149Q0844M3104J38917k59017J76912
14588A706217M4854J70819j94729L97520j68297K99228l67908K09772m16346L10621
14578A991751j93306R5258J92504K1894j02907J44496K30661l33393M76827k19555
14568B304230J31361j40229J22957J22244n49406O47772k33662q3488L58929J36555
14558B817263L53018k98453M63177k18715K84996J40798J08719O36436P29461
14549E016700J614918L675063J0486694K2984226L62553A9337363I437018k035245
14541G401773j952503k335688o76714k57283j46009o2893L08543l03713j22234
$$ y = [1532640, 1892288, 1567317, 1788543, 1664972, 1445338, 1687700, 1720507, 1933468, 1645216, 1644067, 1510395, 1487897, 1544148, 1726606, 1525457, 1606301, 1649405, 1788322, 1529305, 1706217, 1751071, 1921890, 1727161, 2124681, 1956384, 2255612, 1887704, 2097476, 1681130, 1991751, 1798445, 1893703, 2086207, 2108101, 2005194, 2149690, 2380351, 2046958, 2523785, 2304230, 2435591, 2295362, 2418319, 2540563, 1991157, 2638929, 2405267, 2321779, 2680708, 2817263, 3170281, 2871828, 3335005, 3116290, 3401286, 3542084, 3650803, 4287239, 5016700, 6631618, 10306681, 20793375, 43777601, 44140154, 19337363, 9437018, 7401773, 5449270, 3113582, 2436868, 2179585, 2033576, 1970683, 2279226, 1975513, 1853279]
14532A853279K36918j13261K09023k52873M65336j73018J26185K7769j45839K30238
14522B463757R1726l90949l8863K66210K68565k52742J17401j35561J89584l9132
14512B539996L3192J01435K18546K85347k37604K29175j29268k65841K59076J78420
14502C212474j08789l43926M62878j52958L08528J72561l59118Q1437p2657K7502
14492C227932L4934o4006K67590K56127k92845K88092j39622n7668M70643p07004
14482C284173N82199j97809L13911j25486j44139P2851K11847j21197K52281k08583
14472C920048P0536J22827M78586n19020J75264M07430o3884Q2898j01248J64500
14462D737937j88655m8655M2650J009938n26391J2034m851l2181K90392l53392
$$ y = [1853279, 2090197, 1976936, 2185959, 1933086, 2398422, 2225404, 2351589, 2379358, 2233519, 2463757, 2555483, 2164534, 2125671, 2391881, 2660446, 2407704, 2525105, 2389544, 2579128, 2539996, 2573188, 2674623, 2893169, 3178516, 2940912, 3170087, 3040819, 2774978, 3034054, 3212474, 3103685, 2759759, 3222637, 3069679, 3378207, 3550768, 3191650, 3273087, 3200430, 3227932, 3262866, 3198860, 3466450, 3722577, 3429732, 3717824, 3578202, 3520534, 3991177, 3284173, 3866372, 3668563, 3982474, 3856988, 3712849, 3785700, 3997547, 3876350, 4128631, 3920048, 3990584, 4113411, 4591997, 4072977, 4248241, 4655671, 4591787, 4674685, 4573437, 4737937, 4549282, 4500627, 4543277, 5553215, 5026824, 5038858, 5034007, 5001826, 5292218, 4938826]
14452D938826J97235j70934N59487R9013k82483M07384K70135m99377L28012j37467
14442E709831K08879K67013l26152K07556L42615j308l1901Q0210L12595j71030
14432F598308r5277K86728P9425J62816n0594J94921l8142N27558r6975k0219
14422G548549L08948n7920K79631l0899J34301K45151N8602K20947j90103p8605
14412H438602K86264K78377L6554M18909k32527J35693J8217M11153N76265k19075
14402A0148432R0582n125J51924n5842N82706J03888J21288M17251J10805Q931
14392A1674840J72993K32799L70020J88480n828L65896L85133n0244K32262M99393
14382A4065744m02912O59163K43598J43104O34638K55980M5129L07069M75497
$$ y = [4938826, 5136061, 4965127, 5524614, 5623627, 5341144, 5748528, 6018663, 5519286, 5847298, 5709831, 5918710, 6185723, 5859571, 6067127, 6409742, 6408434, 6376533, 6456743, 6769338, 6598308, 6503031, 6789759, 6869184, 7032000, 6981406, 7176327, 7138185, 7665743, 7568768, 7548549, 7857497, 7799577, 8079208, 8048309, 8182610, 8427761, 8486363, 8707310, 8517207, 8438602, 8724866, 9003243, 9039797, 9458706, 9226179, 9361872, 9380089, 9791242, 10367507, 10148432, 10239014, 10233889, 10385813, 10329971, 10912677, 11016565, 11137853, 11555104, 11665909, 11674840, 11847833, 12080632, 12450652, 12639132, 12633304, 12999200, 13384333, 13334089, 13566351, 14065744, 13662832, 14321995, 14565593, 14708697, 15343335, 15599315, 15644444, 15951513, 16427010]
14373A6427010K22005K02217P39899J23106K50213L25900N42253L85316M96490
14364A9714409K24755N96279M44473J68623P34123J29374P17620N56195N12671
14355B3798522L32150M97213O76931P74856M47482P50568R27509O07322K89199
14346B9101752J074388L78318Q17796J167974L65833J393774N64711Q84092J344346
14337C7092984R87190J112595R38575J483105J029763J193571J624323J561213
14329D7023319J341996J335821J200919J955128J718763J815545K165954J772084
14321F0329529K021740K111525K453557K815636K130240K868897K649317L020400
14313H0400841L287026L557152L335000L392358M027364M099144M449885M475502
$$ y = [16427010, 16649015, 16851232, 17591131, 17714237, 17964450, 18290350, 18832603, 19217919, 19714409, 19939164, 20535443, 20979916, 21148539, 21882662, 22012036, 22729656, 23285851, 23798522, 24130672, 24627885, 25304816, 26079672, 26527154, 27277722, 28205231, 28812553, 29101752, 30176140, 30554458, 31372254, 32540228, 32906061, 34299835, 34864546, 35748638, 37092984, 38080174, 39192769, 40131344, 41614449, 42644212, 43837783, 45462106, 47023319, 48365315, 49701136, 50902055, 52857183, 54575946, 56391491, 58557445, 60329529, 62351269, 64462794, 66916351, 69731987, 71862227, 74731124, 77380441, 80400841, 83687867, 87245019, 90580019, 93972377, 97999741, 102098885, 106548770, 111024272]
14305A11024272M954365N318167N563663N725929O103819O743887O529333P581849
14297A59545284P752249Q141318R222169R198569R923218J0126678J1240495J1477577
14289B36627557J2325395J2453150J3706780J4190385J3996809J4849570J5377718
14282C33527364J5399107J5676217J5542545J5376437J4639970J4141586J3403069
14275D37706295J1253830J0357210P531902L490463r50322k184030k607849m450920
14267D60146579k800412o223535q669195j0387783j1473628j2590299j4324282
14260C93677445j4907946j5561462j6057288j6095094j5825797j5879945j4812916
14253B84536997j4292966j2456133j2832453j2502339j1786202j1242719j0280277
$$ y = [111024272, 115978637, 121296804, 126860467, 132586396, 138690215, 145434102, 151963435, 159545284, 167297533, 175438851, 184661020, 193859589, 203782807, 213909485, 225149980, 236627557, 248952952, 261406102, 275112882, 289303267, 303300076, 318149646, 333527364, 348926471, 364602688, 380145233, 395521670, 410161640, 424303226, 437706295, 448960125, 459317335, 466849237, 470339700, 469389378, 467205348, 464597499, 460146579, 457346167, 451122632, 442453437, 432065654, 420592026, 408001727, 393677445, 378769499, 363208037, 347150749, 331055655, 315229858, 299349913, 284536997, 270244031, 257787898, 244955445, 232453106, 220666904, 209424185, 199143908]
14246A99143908r754930r410534q353749q392380p900437p311635o917450o387134
14238A34715659n399746n787297n530806n018980n055008m645221m341745l299988
14230I5636868l873720l651934l371606l640332l016033k834016k668949l080365
14222F9499913k159733j967232k476758k077456k044523k177469j572692j966710
14214E3057340j401307j178398j554381j665826j860515j260686j134722o71957
14206D2329548r54938j462743j348254j212323r73812l15482j032516q89875j259232
14197C2880373p62986p55023j011741n33424m51002r31663q72588o60009k72630
14188B6629307j217075l51587m66582r70552l41381n31975m97633l02821k82720
$$ y = [199143908, 189388978, 179978444, 171624695, 163232315, 155331878, 148020243, 141102793, 134715659, 129315913, 123528616, 117997810, 112978830, 107923822, 103278601, 98936856, 95636868, 91763148, 88111214, 84739608, 81099276, 78083243, 75249227, 72580278, 69499913, 67340180, 65372948, 62896190, 60818734, 58774211, 56596742, 55024050, 53057340, 51656033, 50477635, 48923254, 47257428, 45396913, 44136227, 43001505, 42329548, 41374610, 39911867, 38563613, 37351290, 36377478, 36061996, 35029480, 34139605, 32880373, 32117387, 31362364, 30350623, 29817199, 29366197, 28434534, 27561946, 26901937, 26629307, 25412232, 25060645, 24594063, 23623511, 23282130, 22750155, 22252522, 21949701, 21666981]
14179B1666981o77477m60490j36873n24842l77564m02094q91094k18920J49081
14170A8126708o54482m73619M8735n49649l78919j64532k61032l85768p6867o94689
14160A4535886M678n73896o4625k53491J06865j14670o80502q7879k81778k79550
14150A2311038j3350l30289j81251J58560o70706p794j78560q2668j98556l52386
14140A0454038o06624P69324p00365Q391k57792J68691m08917p3776J0938k51394
14130I112514M7207k62083j48376k37146j05396n6269j38513l5249k09896K45443
14120H212236k39666k42633Q0578j96615L9477m43029Q7970j98712j70579r67
14110F928060L31625p05911R929L07823m08390K3267q7113j0726k19400l8303
$$ y = [21666981, 20989504, 20529014, 20392141, 19867299, 19489735, 19087641, 18196547, 17977627, 18126708, 17472226, 16998607, 17047342, 16497693, 16118774, 15954242, 15693210, 15307442, 15230575, 14535886, 14540564, 13966668, 13902043, 13648552, 13755417, 13640747, 12960245, 12872366, 12590588, 12311038, 12297688, 11967399, 11786148, 11944708, 11274002, 11266208, 11087648, 11004980, 10806424, 10454038, 9847414, 10616738, 9916373, 9924764, 9666972, 9835663, 9426746, 9352970, 9363908, 9112514, 9159721, 8897638, 8749262, 8512116, 8406720, 8350451, 8211938, 8176689, 7966793, 8212236, 7972570, 7729937, 7810515, 7613900, 7653377, 7210348, 7298318, 7099606, 6929027, 6928060, 7259685, 6553774, 6563703, 6871526, 6463136, 6486403, 6399290, 6388564, 6169164, 6130861]
14100F130861j92350n6863q5104J30520m10621J34796q9665L27252l22866j16598
14090E449362M7993m63104J80991O8115J49946n88089M46423O8867m33904p0844
14080D855756J04782j79118j97939L7365L33467j92164j51946J98410m71259q9475
14070D247879L16626k87293K82199k30789K1452j85255K52385m21105J68461j16952
14060D047608M92980j44338j18595j76082J50207m61753M8021k54857K19213k4973
14050C777431n29304O09348n97060K07031j33044J26855j62921Q7254p7223L2077
14040C340444n8582J24694l26102Q0681q3470L37005m16334L16565j41551k11565
14030B961785K31283M3441m05262Q3513Q5945k013m46096K62841L20419k99444
$$ y = [6130861, 5938511, 5881648, 5796544, 5927064, 5516443, 5651239, 5561574, 5888826, 5565960, 5449362, 5497355, 5034251, 5215242, 5283357, 5433303, 4845214, 5291637, 5360504, 4926600, 4855756, 4960538, 4781420, 4583481, 4620846, 4954313, 4762149, 4610203, 4808613, 4337354, 4247879, 4564505, 4277212, 4559411, 4328622, 4350074, 4164819, 4417204, 3996099, 4164560, 4047608, 4540588, 4396250, 4277655, 4101573, 4251780, 3790027, 3838048, 3583191, 3802404, 3777431, 3248127, 3857475, 3260415, 3467446, 3334402, 3461257, 3298336, 3385590, 3308367, 3340444, 3281862, 3406556, 3080454, 3161135, 3077665, 3414670, 2998336, 3314901, 3173350, 2961785, 3193068, 3236509, 2831247, 2914760, 3000705, 2998692, 2552596, 2815437, 3135856, 2836412]
14020B836412N9274k06255M3969m65019O31814k53763R1194j55994m86352K35016
14010B330296j46167l4185K49435L6572j3738J5062J8470O3637l43098j59674
14000B016610J34955L7350j5852k3963J7576M5168K06344k56231k07952J17233
13990B071238P6540N55041K182774Q156508K2771839J2507258k2208651j2238073
13982A3874474n458093k562566o84977o25071o85675n40976j36829k59119k70125
13973B651043K1603j61802L25561k65031K5003j25216j50172J5418K05263k76481
13963B265189o9170Q8097m4760j90263L8097J46525j52037j48684M1630M05271
13953B379895m21205k82234L38689N3037j643l87352J81538j09335J76415p7365
$$ y = [2836412, 2895686, 2689431, 2733400, 2268381, 2900195, 2646432, 2737626, 2581632, 2095280, 2330296, 2184129, 2149944, 2399379, 2435951, 2422213, 2437275, 2455745, 2519382, 2176284, 2016610, 2151565, 2188915, 2173063, 2149100, 2166676, 2211844, 2418188, 2161957, 1954005, 2071238, 2147778, 2702819, 4885593, 13042101, 35813940, 48321198, 26112547, 13874474, 8416381, 5853815, 5168838, 4543767, 3858092, 3317116, 3180287, 2921168, 2651043, 2672646, 2510844, 2836405, 2571374, 2596377, 2471161, 2320989, 2336407, 2541670, 2265189, 2196019, 2284116, 2239356, 2049093, 2087190, 2233715, 2081678, 1932994, 1974624, 2379895, 1958690, 1676456, 2015145, 2068182, 2066539, 1679187, 1860725, 1751390, 1927805, 1850440]
13943A850440L65122l20355O0828k5991p7963l46536m7308L67691j98225o1094
13933A566609L8527r0953J99647m5610q470l4845o3128j42311P3220J55748k83005
13922A365429L2991K31703K18350l33898j93253J51707j50351J29915J01368j34025
13912A419936p8004M84015p46905J10041K02252K35707r3166q9600K64268n05552
13902A202992L23224K61758k33620k21872o6746L900J33803o5093k06926M01101
13892A532521l62103K17034p5219K08588k89219M7859k06452j16980M83120n82361
13882H56788N33574k170J57536R780l33631k759M893n8972J48568j91563j04704
13871A017340L30146L5511k2896j90863j61916j20202L47709J53389j25386l82565
$$ y = [1850440, 2215562, 1895207, 1956035, 1930044, 1852081, 1505545, 1458237, 1825928, 1627703, 1566609, 1605136, 1514183, 1713830, 1668220, 1659750, 1624905, 1561777, 1419466, 1492686, 1648434, 1365429, 1398420, 1630123, 1848473, 1514575, 1321322, 1473029, 1322678, 1452593, 1553961, 1419936, 1341932, 1825947, 1079042, 1189083, 1391335, 1627042, 1533876, 1444276, 1708544, 1202992, 1526216, 1787974, 1554354, 1332482, 1265736, 1269636, 1403439, 1338346, 1131420, 1532521, 1170418, 1387452, 1312233, 1520821, 1231602, 1279461, 1073009, 956029, 1439149, 856788, 1390362, 1388192, 1545728, 1555508, 1221877, 1219118, 1224011, 1165039, 1313607, 1122044, 1017340, 1347486, 1382997, 1360101, 1169238, 1007322, 887120, 1234829, 1388218, 1262832, 880267]
13861H80267O78817m92059L5755J43807J06434n26026J51058L19493m65313j7608
13851H14625Q4631K58339j08063M019J45034j19606k67609K54820P7118k22172
13841I21136j7508K14966k33033O8286L4485o5093J46849k74142J73616r1420
13831H78142K64574k68278R9270N8467P2954j75557K29995E73653K30270J33848
13821I37771J11918k09519K9024j85285J23136J46497N3083P1843j37011L22827
13811A264284l32420J88482k60896J89969k34978K69021J2510o370l40631L8363
13801G87334J89603k44243K51618l42202J0883J01848j44984M13695l59231J0432
13791F74753Q2699j96351M61965m60547K78043l7484O6592K8228N3997j8271k6309
$$ y = [880267, 1559084, 1067025, 1102780, 1246587, 1353021, 826995, 978053, 1297546, 832233, 814625, 899256, 1157595, 1049532, 1053551, 1198585, 1078979, 811370, 1066190, 1143308, 921136, 903628, 1118594, 885561, 953847, 988332, 923239, 1070088, 795946, 969562, 878142, 1142716, 874438, 973708, 1032175, 1105129, 929572, 1159567, 573653, 803923, 937771, 1049689, 840170, 869194, 683909, 807045, 953542, 1006625, 1078468, 941457, 1264284, 931864, 1120346, 859450, 1049419, 814441, 1083462, 1095972, 1089602, 748971, 787334, 976937, 732694, 984312, 642110, 652993, 754841, 609857, 1023552, 664321, 674753, 757452, 561101, 1023066, 562519, 840562, 803078, 869670, 897898, 951895, 933624, 907315]
13780I07315k02759j72591L44556o7401r7895J02549J6922R9061m3375l23504
13770E62878q6906j24068L45238O40N425j14689J64720J7143j42407P6195j67356
13759E36813O8569m0309L95415L5296D19516K85858q6508J71333J57995C93883
13748E90759J35486n5302j30006J04006P3158m1377K61788o5869l21006k36652
13738C14985J08537K10294k35076J11924L68029j19829B18710J95560N4132J67523
13728F35925P2825r9969N9451k10268J91899j96223J64331L6287C13316L78985
13718F92301j01710K1474B77931N0146M54515K9481l90428K6173p6027J332R6311
13707D69434J735L78514q7054q3941r8893j04918B09583M9382P9139J64607O2928
$$ y = [907315, 704556, 531965, 876521, 809120, 711225, 813774, 830696, 929757, 886382, 562878, 475972, 351904, 697142, 697782, 703207, 588518, 753238, 770381, 627974, 704169, 536813, 605382, 565073, 960488, 995784, 419516, 705374, 618866, 790199, 948194, 393883, 590759, 726245, 670943, 540937, 644943, 718101, 676724, 938512, 872643, 551637, 314985, 423522, 633816, 398740, 510664, 878693, 758864, 218710, 414270, 468402, 635925, 708750, 608781, 668232, 457964, 649863, 453640, 617971, 654258, 313316, 692301, 590591, 612065, 277931, 328077, 782592, 812073, 421645, 447818, 371791, 373123, 469434, 471169, 849683, 762629, 678688, 579795, 474877, 209583, 258965, 338104, 502711, 565639]
13696E65639n3061p5482K13718k87961J36279j75000p402K72485j10490k34500
13686B44225L41541L2929j82205J1313N9450L56579A66751N53121J70696l42905
13676E47663j05404j80339J15320K80831k17955p0796J85305a9423D89117J39506
13666F28623j06281k36595L17733r8780K69208B83254K53773J24777K30005C65257
13655D48019J01319B39876J36489A49748P92356B04776J37628M49549C41499L486
13645C44985A60909L03836K75274l57751n9678K88542J32057J10144j77825c6178
13634C69241o3530K67736k09006o6681J62419A3646L24665J49607A84916L49689
13624E34605B30502M1836N8191K27251k57539Q6837M08797l70118O5209q9664
$$ y = [565639, 512578, 437096, 650814, 362853, 499132, 324132, 316730, 589215, 478725, 244225, 585766, 618695, 436490, 447803, 507253, 863832, 166751, 719872, 890568, 547663, 442259, 261920, 377240, 658071, 440116, 369320, 554625, -19423, 489117, 628623, 522342, 285747, 603480, 504700, 773908, 283254, 537027, 661804, 891809, 365257, 448019, 549338, 239876, 376365, 149748, 942104, 204776, 342404, 791953, 341499, 344985, 160909, 464745, 740019, 382268, 322590, 611132, 743189, 853333, 675508, -36178, 369241, 305711, 573447, 364441, 297760, 460179, 13646, 338311, 487918, 184916, 534605, 230502, 272338, 330529, 557780, 300241, 387078, 795875, 425757, 490966, 401302]
13614D01302K6702p334j07611J36256r9794l7209j2906R361j22277L92704k84653
13603B94541K56809k01448N2819j15073L82456B44340K24176j92006L35706j85634
13593D26582F5415J03834A3885M58219K09250n2678k57218j56392K06467j57018
13583B64515l5616P466L05714A74913a0582E1368K64153j48969k3802Q8572A01469
13571B45571l0053J40590r2501M05001e2797E11837o9537k18436K09517m8494
13561C84887j08312m6835K27858J12371D015K75976J16617K61870B09223J11922
13551C21145j36216K89879I6874J69564J76617j03508j52135C0090L11298J30231
13541D71619o0850N6163A78933o782J35586D8269J21808L91772k02730C3120L64504
$$ y = [401302, 428004, 420670, 313059, 449315, 349521, 312312, 299406, 308767, 186490, 579194, 294541, 551350, 349902, 402721, 287648, 670104, 244340, 468516, 276510, 612216, 426582, 65415, 169249, 13885, 472104, 681354, 628676, 371458, 215066, 421533, 264515, 228899, 236365, 542079, 174913, -10582, 51368, 315521, 166552, 142750, 231322, 101469, 245571, 215518, 356108, 263607, 668608, -52797, 511837, 442300, 223864, 433381, 384887, 276575, 229740, 457598, 569969, 4015, 279991, 396608, 658478, 209223, 321145, 184929, 474808, 96874, 266438, 443055, 339547, 187412, 30090, 341388, 471619, 410769, 466932, 178933, 172151, 307737, 48269, 170077, 561849, 359119, 33120, 397624]
13530C97624j44934J66043Q419P1306j95467F4424J99894L99166D0816J36117
13520A76933L53998k57967L86030d1417B74238n6336L526A07670A0276L93244
13510D03520J03797k39713J39983A66258B2884L09297J74858A99363L6568p0405
13500A65526A3326J75761J12428J51376j68317K43651B62733K77796k53840n9468
13490B27221K63307j06480D7686M59651k18496m576I8723Q4267M6876J425F4212
13478C99763A90738J01866J81667k34072d3966A50275J75452O4399j28078C3338
13467E12967j61122E8435J67528a9291C55149q8078J56330a58810C61497b7403
13456A95541G7599L83264a16927C16972A18980c582B38132k6750a06176B44428
$$ y = [397624, 252690, 418733, 427152, 498458, 302991, 64424, 264318, 663484, 40816, 176933, 530931, 272964, 658994, -41417, 274238, 217902, 221428, 107670, 10276, 403520, 507317, 267604, 407587, 166258, 22884, 332181, 507039, 199363, 235931, 165526, 13326, 189087, 301515, 452891, 284574, 528225, 262733, 540529, 286689, 227221, 490528, 384048, 47686, 507337, 288841, 284265, 98723, 182990, 229866, 231291, 64212, 399763, 190738, 292604, 474271, 240199, -43966, 150275, 325727, 390126, 262048, 33338, 512967, 351845, 58435, 225963, -19291, 355149, 267071, 423401, -158810, 361497, -27403, 195541, 77599, 460863, -116927, 316972, 118980, -3582, 238132, 211382, -106176, 244428]
13445A97072J18479A52945J75696A64070G9475J41646P8731j1648i2671C86121
13434D37282k04681l7419P1563K09423k28421j04804J72144E5715M95759k08081
13424C43393j10659J3267g159A80017Q4562j07697C3695P2440P2430o5655K93745
13413D06655p9199e5826l6294A13085J05828n6894L6834R5134K7216A22846M6625
13402A69471D1340J00642M5417C9968K54638H3760L08023j00674j34796p6126
13392H0187M27104H0656a6103A18469K02170k2081a78139C01176B6971L1639J93430
13381B52040j15344K14431F2299J41718k7860J55117A28588M4649J51365E2352
13370E86357B86447A00124M6326K33003K5644A10856L32503B12999J56599G2900
$$ y = [197072, 315551, 152945, 328641, 164070, 79475, 221121, 299852, 288204, -92671, 386121, 437282, 232601, 195182, 266745, 476168, 247747, 142943, 315087, 55715, 551474, 343393, 232734, 246001, -7159, 180017, 264579, 156882, 33695, 106135, 178565, 112910, 406655, 327456, -55826, -92120, 113085, 218913, 162019, 198853, 293987, 321203, 122846, 169471, 41340, 141982, 187399, 39968, 294606, 83760, 391783, 291109, 156313, 80187, 507291, 80656, -16103, 118469, 320639, 298558, -178139, 301176, 26971, 58610, 252040, 136696, 351127, 62299, 204017, 176157, 331274, 128588, 173237, 324602, 52352, 586357, 286447, 100124, 146450, 379453, 405097, 110856, 443359, 212999, 369598, 72900]
13359B69447E5301J99158j19026L06324A76407a73398E469J49877K85247k14892
13349B25701J90019p2371N3644J00929B42390L53439B83894M90734k01615A85821
13338C55065K40690D8497J48968P0221J94237A27312R7320R6843P8227a62428
13327A68730J94660e5649B98928L9966F4003b81942C69652M94G4379a4448b023
13315C44760L9590j01432i7900C64778J67923I9581j204L25166k08477a01967
13304f0848A04095l1113K79918a4958G8137K71385a56388I8867c6015A60990K01291
13293C62281a70460A54089m4517a13745C9757a12789A26885a04947B5028m768
13283B0260H7K75153j11361c1473C68534e1486B6624K12646l4536N5769h1260
$$ y = [269447, 55301, 254459, 135433, 441757, 176407, -173398, 5469, 155346, 440593, 225701, 415720, 343349, 396993, 497922, 242390, 595829, 283894, 774628, 573013, 185821, 355065, 595755, 48497, 197465, 267686, 461923, 127312, 224632, 321475, 399702, -162428, 168730, 363390, -55649, 298928, 338894, 64003, -281942, 369652, 370146, 74379, -14448, -2023, 344760, 384350, 282918, -97900, 364778, 532701, 99581, 98377, 423543, 215066, -101967, -60848, 104095, 72982, 352900, -14958, 78137, 349522, -156388, 98867, -36015, 160990, 362281, -170460, 154089, 109572, -113745, 39757, -112789, 126885, -104947, 25028, 20260, 87, 275240, 163879, -31473, 368534, -51486, 26624, 239270, 204734, 260503, -81260]
13271E3099l315L37642F3629a037B86059A4104a89625M8531D16792k07537r2772
13260A16483Q5936h1114B09726K9823m6890o8479K0814M4537a32078E4087B4559
13248a52722b6867H3558j6698k4591a46199I1698a96335P9660a1326j01265k4819
13237a37410e3557B60842a27212A49953B8546J20150o8953P7128D6109N9483K68398
13226C73990C7933j3244J37137L41388B16449J1489A2394J29513e6877A02529
13215A73264q2125a83468L7804b0171C50231g7086H2866h0505G825e3129A71371
13203b211B1173C712P9072J55958O6513d8475C2719c30602a05488B74559A18908
13191B20881r4252a11923C67204a24858A76099C6331L48644e3311J7979F7849
$$ y = [53099, 49784, 387426, 63629, -1037, 286059, 14104, -189625, -141094, 416792, 209255, 116483, 202419, -81114, 209726, 239549, 192659, 124180, 144994, 189531, -132078, 54087, 24559, -152722, -26867, 83558, 66860, 42269, -146199, 91698, -196335, -116675, -11326, -112591, -137410, -53557, 260842, -127212, 149953, 28546, 148696, 79743, 156871, 46109, 105592, 373990, 37933, 24689, 161826, 503214, 216449, 227938, 12394, 141907, -56877, 102529, 173264, 91139, -183468, -145664, -20171, 350231, -77086, 82866, -80505, 7825, -53129, 171371, -2211, 21173, 3712, 82784, 238742, 305255, -48475, 32719, -330602, -105488, 274559, 118908, 220881, 126629, -111923, 367204, -124858, 176099, 36331, 384975, -53311, -35332, 67849]
13180C29828O9303A33850P5022A6399K28498a85191D9629K21483p7478M6011o0952
13169A78693J2862a45459e3080l5231b4775A08074G728L48086O2634A2421L82338
13158C94759f3369j8668A48702l0003c2153A29983n3346O4257a79271B41043k7932
13147B13111E4847K89582i4558j3182B72311q7040J01721a02715C25262a12634
13136E46984b27348B26925j06093L06900A45928E4591A8180K92165J8710A62812
13125H5917a28716G2096b1919E4662J96078C3630e7130B14235M6746g0373a2677
13113D3811R9374D7229f1373D1891c29707A55864a02365j45670C70763M490b26208
13101D87733B7810L07380j38762a66670C60071c92236D96071A60937J67771o8622
$$ y = [329828, 399131, 133850, 208872, 16399, 244897, -185191, 49629, 271112, 193634, 239645, 178693, 191555, -145459, -53080, -88311, -24775, 108074, 7728, 355814, 418448, 12421, 394759, -63369, -82037, 148702, 118699, -32153, 129983, 76637, 140894, -179271, 241043, 213111, 54847, 344429, -94558, -107740, 272311, 185271, 286992, -102715, 325262, -112634, 546984, -227348, 226925, 120832, 427732, 145928, 54591, 18180, 310345, 329055, 162812, 85917, -128716, 72096, -21919, 54662, 250740, 33630, -57130, 214235, 260981, -70373, -12677, 43811, 143185, 47229, -61373, 41891, -329707, 155864, -102365, -248035, 370763, 375253, -226208, 487733, 27810, 335190, 196428, -166670, 360071, -392236, 496071, 160937, 328708, 260086]
13091B60086a86070D6100i0142D12937J155f2429C11069j10880d5096j06249I3698
13079a341p7973A48943p595m2867j7862f4359A33539J01184J10774b0427C40383
13067a99021B9887c8372k4344F8289b6001A02069b3692A91385c57056B08048F4692
13055e6743A66970D9039J91643k8911p9222F625a0240C97498A55973G864f1443
13043h5640C04494a97788B36749r7637K37122i8666B25839E0871a27914A44216
13032a81625A91310L4195b19705A07194b36388C83101a3535A78389f015A02137
13021B57533q3607C1444R7088M34996a7901A82604m1663K3235D9920a20452I6066
13009e0392A74524l7789F1990J15801N28782B84486G7566N2144k4466e5489Q022
$$ y = [260086, -186070, 46100, -90142, 412937, 414092, -62429, 311069, 200189, -45096, -151345, 93698, -1341, -79314, 148943, 141348, 98481, 80619, -64359, 133539, 234723, 345497, -20427, 340383, -199021, 29887, -38372, -62716, 68289, -26001, 102069, -23692, 191385, -357056, 208048, 64692, -56743, 166970, 49039, 240682, 211771, 132549, 6625, -10240, 397498, 155973, 7864, -61443, -85640, 304494, -197788, 236749, 139112, 376234, -98666, 225839, 50871, -127914, 144216, -181625, 191310, 225505, -219705, 107194, -236388, 383101, -13535, 178389, -6015, 102137, 257533, 173926, 31444, 128532, 563528, -17901, 182604, 140941, 164176, 49920, -120452, 96066, -50392, 174524, 136735, 61990, 177791, 706573, 284486, 77566, 129710, 105244, -55489, -47467]
12998d7467C0127J46550l0883C9637d621j3640k28252c8577C5781r253L89341
12987D15869a14157A52688o6228J26744n3146J61629i8016h994B6308a08605F5883
12975c0787a1886B28937f4601B65857j20075i7897a0550l9404j10408A04303O7800
12964A72103G1000K0447L07445A67276L0641k5442L0011C43h5108A72404a80709
12952C10308A30541i8257I8707h1833B47711a4579E0959M65664k52042D6481N0578
12941I7059L5488a19759A79039e6621B23091l7008a23547c7728C54190A02232
12930D2890P0508a1602C4720J46564c16066c1131M161B07499n9528h7464A91885
12918D3123d6508b621j53744h741j47886l6214B04064l2898d3353j76260k2912
$$ y = [-47467, 30127, 176677, 145794, 39637, -4621, -18261, -246513, -38577, 35781, 26528, 415869, -114157, 152688, 86460, 213204, 160058, 321687, -98016, -8994, 26308, -108605, 65883, -30787, -11886, 228937, -64601, 265857, 145782, -97897, -10550, -49954, -160362, 104303, 172103, 71000, 91447, 398892, 167276, 197917, 172475, 202486, 343, -85108, 172404, -180709, 310308, 130541, -98257, 98707, -81833, 247711, -14579, 50959, 516623, 264581, 46481, 97059, 132547, -119759, 179039, -56621, 223091, 186083, -123547, -37728, 354190, 102232, 42890, 113398, -11602, 34720, 181284, -316066, -31131, -26970, 207499, 147971, -87464, 191885, 43123, -46508, -2621, -156365, -8741, -156627, -192841, 204064, 171166, -43353, -219613, -242525]
12907b42525f3812j5782F380O7133l2627b14307J4301A37790b32401A03329B8591
12895c9819C53605e7897B18907K44o1193a88959A00448B9791L46192D6214R659
12884E5873h509A84356N5981p3867a04606F8267a55310G0459n631K2835a21160
12872A8829a88944C4320b3756r9603H1771J11290a25352j63654A39878n7145K9210
12861A11943f6729K2722j1291F7847O6799P8336A5995Q2360m2494J57100l855
12850B09106b28903C9932b18452R7086n2421A02172e6552B48306p8838a19127
12839a16475c4711A87129a45569B63631o667a13168C0607J2853L22333A2133a80641
12827A61334a7396q3576H7061J92990a15785B28454P2013a85132A82530a83978
$$ y = [-242525, -63812, -79594, 6380, 73513, 40886, -214307, -200006, 137790, -232401, 103329, 28591, -39819, 353605, -57897, 218907, 219151, 157958, -188959, 100448, 29791, 375983, 46214, 55873, -8509, 184356, 240337, 166470, -104606, 68267, -155310, 70459, 64828, 87663, -121160, 18829, -188944, 34320, -23756, -123359, 81771, 193061, -125352, -289006, 139878, 82733, 111943, -66729, -44007, -55298, 67847, 134646, 212982, 15995, 98355, 55861, 212961, 209106, -228903, 39932, -218452, -121366, -173787, 102172, -56552, 248306, 169468, -119127, -116475, -34711, 187129, -145569, 263631, 256964, -113168, 30607, 43460, 365793, 12133, -180641, 161334, -17396, -100972, 87061, 280051, -115785, 228454, 300467, -185132, 182530, -183978]
12816e6247j99549B15117j1534c6664B3379K34171C4509K65145j45356a24594
12805a50522E0191M2155M3269h6676B69724j26599B0024m264d035j48925L0692
12794a22268B48682E3432J02374d2020A06346O4861b18580K7691d3248A35664
12783a7713l99125b6210A72090a17081J0024k21080I491f1039B64426a9328F1633
12771f5618A30337b75540D7484B757e3357D0631a69938Q416O2150o4734j45147
12760c09253a43546B36156b55898K4071k04986B61181I8792b31141B93032H4225
12749F6977a40080m65851B36118a1084A94818P0384j01816d2559L144B8055J71487
12738A99542r9300J54217h9898c222A43170L9922K44128A13085j7484b82650c1694
$$ y = [-56247, -255796, 215117, 203583, -36664, 23379, 257550, 34509, 299654, 154298, -124594, -150522, 50191, 92346, 135615, -86676, 269724, 143125, 20024, 15760, -4035, -152960, -122268, 248682, 53432, 155806, -42020, 106346, 171207, -218580, -190889, -43248, 135664, -17713, -416838, -26210, 172090, -117081, -107057, -328137, 9491, -61039, 264426, -19328, 61633, -65618, 130337, -275540, 47484, 2757, -53357, 40631, -169938, -161522, -99372, -164106, -309253, -143546, 236156, -255898, -231827, -436813, 261181, 98792, -231141, 293032, 84225, 66977, -140080, -605931, 236118, -11084, 194818, 265202, 163386, -42559, -39415, 28055, 199542, 100242, 254459, -89898, -3222, 143170, 183092, 427220, 113085, 95601, -282650, -31694]
12726A55807a94882q9516J19572B46522B2475c43699a1135A91865J32803a15741
12715A27071J02116G5821K26306a16380F9231K30402M0636k2963A49104B3456
12704D30588j70117c0567A30961l497M28604c14678g6860C30979A39223R3392
12694B32615a32099D452P6730l6435N8212a89353B18403K90397g0812C13459b92752
12682B34471F0002J04432d8427A2205K11515G1463J41534E646K67786a40754A25922
12670A47558E4803K88576F4850b4709i741c600j17999A42806h5553C7411a20282
12658F5232a33124B03276G7873Q9120k0322m7639j8022g9810B98853j27012A07
12646a80530F5955a70437O3600m2947A72600N0645f1457j15205C21040D0781q511
$$ y = [155807, -194882, -284398, -164826, 246522, 22475, -343699, -11135, 191865, 324668, -115741, 127071, 229187, 75821, 302127, -116380, 69231, 299633, 340269, 317306, 149104, 23456, 430588, 260471, -30567, 130961, 127464, 556068, -314678, -76860, 330979, 139223, 232615, -132099, 4452, 81182, 44747, 102959, -189353, 218403, 508800, -70812, 313459, -292752, 234471, 60002, 164434, -48427, 12205, 223720, 71463, 212997, 5646, 273432, -140754, 125922, 147558, 54803, 343379, 64850, -24709, -9741, -3600, -121599, 142806, -85553, 37411, -120282, 65232, -133124, 203276, 77873, 166993, 146671, 99032, 81010, -79810, 298853, 171841, 107, -180530, 65955, -170437, -106837, -149784, 172600, 223245, -61457, -176662, 321040, 40781, 32270]
12635C2270a6666B65132f1281H3789J04667B7054J49538a964E06102d8154C27973
12623a13865A51300l0477J41285E4296b24250D07589C1699a22120G0671b28073
12612g0847E41947a43525d8957B58835f4236C35455j37908f305H0004F942J13936
12601A20878C2064K62267a00358B18685K5082J2364q2234d572r3237A74275F3667
12589b6668N216E2173c5248D3097J894a70579f7127k3274m5428j6138J1612I3561
12576B79685A21034a52307C41496j31262J8753I8725J49312l5342m4871G3593
12565b66421A69772a23871B99264b4906B64210q1058a21106D95841A56731a33436
12554e1400F9433B1004L45007d4216B68313A15863l5964a06267B47416b0602B11730
$$ y = [32270, -16666, 265132, -61281, 83789, 188456, 27054, 176592, -1964, 506102, -48154, 327973, -113865, 151300, 120823, 262108, 54296, -224250, 407589, 31699, -122120, 70671, -228073, -70847, 541947, -143525, -48957, 258835, -64236, 335455, 197547, -6305, 80004, 6942, 120878, 32064, 294331, -100358, 218685, 243767, 256131, 173897, -4572, -97809, 174275, 63667, -26668, -21452, 52173, -35248, 43097, 44991, -170579, -67127, -90401, -135829, -151967, -140355, 93561, 279685, 121034, -152307, 341496, 210234, 228987, 98725, 248037, 212695, 167824, 73593, -266421, 169772, -123871, 299264, -24906, 264210, 183152, -121106, 495841, 156731, -133436, -51400, 69433, 21004, 366011, -44216, 268313, 115863, 79899, -106267, 247416, -20602, 211730]
12542f3107A38850D0814K3855a57479j82977B24714B6947L14399i3028k01581
12532b94609C15981j8554E8696b21913L6827P6650B07884C7803a0799k73586L2214
12521b52171A52751F4960a86520B68465F7827J76510D3109L48376a59761A42449
12510A29395D0067i0498j8721K3619c2281D51212A47442J06475d8364A78914R4593
12499B73507j4226a882q6120A61304Q004b6828J1889j9065a5354H2843f62o6577
12487f7239C01567A433a63881B00478f5512K7853A17900M7957G0675e6140A91548
12475E5706J49820D8955a09646D5737P0580c789A65063d7365j6556A59200c82970
12463A11521N378f1485l0461B67714a47151B2960L58266b33286j14392J9893I9066
$$ y = [-63107, 138850, 40814, 64669, -157479, -340456, 224714, 26947, 341346, -93028, -294609, 315981, 297427, 58696, -221913, -185086, -108436, 207884, 37803, -10799, -284385, -252171, 152751, 64960, -186520, 268465, 67827, 244337, 43109, 391485, -159761, 142449, 129395, 40067, -90498, -109219, -85600, -32281, 451212, 147442, 253917, -48364, 178914, 273507, 259281, -1882, -88002, 161304, 169308, -26828, -14939, -34004, -15354, 82843, -662, -67239, 301567, 1433, -163881, 200478, -65512, -37659, 117900, 165857, 70675, -56140, 191548, 55706, 205526, 48955, -109646, 45737, 116317, -3789, 165063, -47365, -63921, 159200, -382970, 111521, 116899, -61485, -91946, 267714, -147151, 22960, 381226, -233286, -347678, -327785, 99066]
12451d9566B6116J23595b41354A44713K142g5725B8007p77c65995e3635A09173
12439I7091a16628B1988b63193a01586j3470G5334b3201E0115a33821A79979a3044
12427G9623d4850j43084G3387a44088k04133e688l7407A08003a07179A15316i7397
12415E7745J28187p4868b048j37996l51645B151J52828a85730Q2973L9856A14482
12403d1485j44577o0348B35553F117a7268j91362B45707p7484g0917j81100e7658
12391F254K60664b7527k30669o3927Q1312r7350A36853a36225F4059a25077B00853
12379E9149k5437b53413c5347B31820C2836J26477J86118C0973h0207C21817a43097
12367I5108O3016G7800a73998l2733A40169a09126A38872F2200J45462e7578A33995
$$ y = [-49566, 26116, 149711, -241354, 144713, 146855, -75725, 28007, 27230, -365995, -53635, 109173, 97091, -116628, 21988, -263193, -101586, -115056, 75334, -23201, 50115, -133821, 179979, -13044, 79623, -44850, -187934, 73387, -144088, -348221, -5688, -43095, 108003, -107179, 115316, -97397, 57745, 185932, 111064, -2048, -140044, -491689, 2151, 154979, -185730, -102757, -62901, 114482, -41485, -186062, -246410, 235553, 6117, -17268, -208630, 245707, 168223, -70917, -252017, -57658, 6254, 266918, -27527, -258196, -322123, -240811, -338161, 136853, -136225, 64059, -125077, 200853, 59149, 33712, -253413, -35347, 231820, 32836, 159313, 345431, 30973, -80207, 321817, -143097, 95108, 158124, 77800, -173998, -206731, 140169, -109126, 138872, 62200, 207662, -57578, 133995]
12355a4077A19083b21057I0586k5195R7103E4134i6021M0033I7755b1596A8427
12343B01271D7238a30884H4465K61082G8331e0733a4374N113A69425a36649B12293
12331b4427K643j704p2865M7552A44233A3319a71593A56801J7666K0307a5307
12319B11770a92151Q917Q5025G2304h282F0649J14668c5289J7281o6457A2133
12307a54544A15116a94871M6911B6525b93072C458J65767o687a7287q7187j33121
12296b37595B96790E6401K69751a63822B71787g0455j86434B65652h3089C52832
12285A94904a3780C71817E1501b32p7205a4915E9532K33800I5108L9331J56930
12274B91369J82918j89702J47912H6221J40092r7104b95748c6365A63529G6447
$$ y = [-14077, 119083, -221057, 90586, 65391, 162494, 54134, -96021, -55988, 97755, -21596, 18427, 201271, 47238, -130884, 84465, 345547, 78331, -50733, -14374, -9261, 169425, -136649, 212293, -24427, -21784, -23488, -96353, -48801, 144233, 13319, -171593, 156801, 174467, 194774, -15307, 211770, -192151, -183234, -98209, 72304, -8282, 60649, 175317, -35289, -18008, -84465, 12133, -154544, 115116, -194871, -147960, 26525, -293072, 3458, 169225, 162538, -17287, -104474, -237595, 296790, 56401, 326152, -163822, 271787, -70455, -256889, 265652, -83089, 352832, 194904, -13780, 371817, 51501, -232, -77437, -14915, 59532, 293332, 95108, 134439, 291369, 474287, 284585, 432497, 86221, 226313, 129209, -295748, -36365, 163529, 76447]
12263B01967j00017P9389N6028F3961h8275C61341p6866B5070b95543A0509L42457
12252C52966a07871C41313I5650J93809a23368E6997K67338j61487F2724K07276
12242B70000I2874e3907A43916J42058A10268L05095F3698J87877B5139d6807
12231a45796A56553J43262D9230K94563a12584A18564J57391F7724K34000J03020
12221D04744j95288L05548j68602A10450O3329G982K03616R6441K791i4514F1534
12209C47695A52465g1672n6116k6418d4649C92499a06372C02727j3107j22925
12199A66695m435i4966B55357j03372J29505P5322J46055A03514J7993N97192
12189G18699B9545i9661c2857E5900R0755R9240d3081j14951I9823J16182N8271
$$ y = [201967, 101950, 181339, 237367, 63961, -88275, 361341, 284475, 25070, -295543, 10509, 352966, -107871, 341313, 95650, 289459, -123368, 56997, 324335, 162848, 62724, 270000, 92874, -53907, 143916, 285974, 110268, 415363, 63698, 251575, 25139, -46807, -145796, 156553, 299815, 49230, 343793, -112584, 118564, 275955, 67724, 301724, 404744, 209456, 515004, 346402, 110450, 173779, 7982, 211598, 308039, 310830, -94514, 61534, 347695, 152465, -71672, -127788, -154206, -44649, 392499, -106372, 302727, 289620, 166695, 162260, -94966, 255357, 151985, 281490, 356812, 502867, 103514, 121507, 718699, 29545, -99661, -32857, 55900, 146655, 245895, -43081, -158032, 99823, 216005, 274276]
12178B74276r98j24854J89706j30939q9207j0902R0816J93361A73320K28952A85269
12166C18145J91790g5687C63275f8299A49296b26734a1074k3705A26712a3767
12155B15018a4676H2174c21241E3426R2069O2167R9458d9933j37161d7700B9096
12143a5537n8650A78462A8866c6811E9320d8789A35443L0920J68966c80952E2533
12131c944B87919a57559c1009A95684K0085a07885A24930o523c40986A409L4170
12120C5579f5715j32633B3526a95719D55665f5596a7874k2361p3946d1655A05301
12108H713b04972I9769a0881j34119A70176e5889k441A8836c82698h6576A23876
12096d54068A04396a38352I9199R04c07796B01726a3928j84651B28431D90J48862
$$ y = [274276, 273278, 148424, 338130, 207191, 117984, 107082, 197898, 391259, 173320, 402272, 185269, 318145, 509935, -75687, 363275, -68299, 149296, -226734, -11074, -34779, 126712, -13767, 215018, -14676, 82174, -321241, 53426, 145495, 207662, 307120, -49933, -187094, -47700, 29096, -15537, -74187, 178462, 18866, -36811, 59320, -48789, 135443, 166363, 335329, -380952, 52533, -3944, 287919, -157559, -31009, 195684, 215769, -107885, 124930, 118407, -340986, 1409, 35579, -65715, -198348, 23526, -195719, 455665, -65596, -17874, -40235, -114181, -41655, 105301, 8713, -204972, 99769, -10881, -145000, 170176, -55889, -58330, 18836, -382698, -86576, 123876, -454068, 104396, -138352, 99199, 100103, -307796, 201726, -13928, -198579, 228431, 490, 149352]
12085A49352e6034k25774Q8014A17558M6373f882D55105R04097Q49668p95721
12075A413149E53663g819B24105Q2083B7949M2964L32176A23015r98B4850d03874
12063A99071d9602B34666i0511k04770B30745F3854j3223a55469L6318E8467L3045
12052I1512L10877A25338d61837h1841c0155k0527A2246a40029J6698A14376e9955
12040c02388B3914J27381c24203A60205K7332b9591j31345l6541O196E1327O0575
12029A11902a19617b5196A50798i6797C36505q5096N01K9684j02601b92368a9955
12017H5077b19488i2919E7380a7526j07346r4571C40941e61578H4562b61425h7001
12005A77203B3330b8279k53180P3672F6774b3079n6015j35981A09776b83123d5732
$$ y = [149352, -56034, -281808, -193794, 117558, 163931, -6882, 455105, 1359202, 2208870, 1413149, 553663, -7819, 224105, 306188, 27949, 70913, 403089, 123015, 122017, 24850, -403874, 199071, -49602, 234666, -90511, -295281, 230745, 63854, 50631, -155469, -119151, 58467, 91512, 402389, 125338, -461837, -81841, -30155, -50682, 12246, -140029, -123331, 114376, -59955, -302388, 23914, 151295, -324203, 160205, 187537, -29591, -160936, -197477, -191281, 51327, 111902, -119617, -25196, 150798, -96797, 336505, 251409, 251910, 281594, 178993, -292368, -19955, 85077, -219488, -92919, 57380, -17526, -124872, -219443, 340941, -561578, 84562, -261425, -87001, 177203, 23330, -28279, -281459, -207787, 66774, -23079, -79094, -215075, 109776, -283123, -45732]
11993b92183C7461q363a75892e0464m4386b4573k02028A19145a31111N9391H7137
11981A48576j4693a48540M5464r822d1114j24445o754g6159A97780k961g895D5248
11968a72727A66104a6610A429K89385I4523l5394a93199A01739b12630P2004B78594
11956a51382F7296H991a44416C1018M08691b46874f5898B36934h639l39747a20362
11944I1197K8425J46707d6732A6999K10847a3021q3615k73081I4608b24158R2974
11933a31184I4215a05314A33436F1414P9924K5102f9342o6903A7759g2320j42376
11922b14696l4022C05664j43239e1671j4602L2921j17099E7865N7844k5802J90565
11911B80472E5313h0947c8569a1260k16304D9329e1579b5650C2042L09569e57134
$$ y = [-292183, 37461, 29098, -175892, -50464, -94850, -24573, -226601, 119145, -131111, -71720, 87137, 148576, 133883, -148540, -103076, -112898, -41114, -165559, -172313, -76159, 197780, 194819, -7895, 45248, -172727, 166104, -16610, 1429, 290814, 94523, 59129, -193199, 101739, -212630, -140626, 278594, -151382, 67296, 8991, -144416, 31018, 439709, -246874, -65898, 236934, -8639, -348386, -120362, 91197, 119622, 266329, -46732, 16999, 227846, -13021, -96636, -369717, 94608, -224158, -131184, 94215, -105314, 133436, 61414, 141338, 166440, -69342, -136245, 17759, -72320, -214696, -248718, 305664, 162425, -51671, -66273, -33352, -150451, 57865, 115709, 89907, 280472, 55313, -80947, -38569, -11260, -227564, 49329, -51579, -25650, 32042, 341611, -557134]
11899a4877k5455o9825J9027B26674f861j9067c070B97583c83714a69623A11364
11887a41250N7934o4285B93111a97005B49266d8983j43129c86F2058J35764F8008
11875b09423A61192d8248e595A00491i6497j24435h5126B25229b60211A46817
11864d32859A89135o0318K2326b30374i4432k51719c323D9546b8263j48930Q0218
11853i6975A00827a99171m003e5047A49761a28142G3397Q3920b21501J2823i5808
11841b82171D37a4900r1156H2925K5480k7174a24618A61781b14799I570c4632
11829b31814h169j44713a8573n1309C56242a21575M2464C1549a04315K0659p8879
11818a62535b7617B568Q4741a73948L2794A3483i4110j19671B27174L2799A15969
$$ y = [-14877, -40332, -110157, -91130, 226674, -6861, -25928, -3070, 297583, -383714, -169623, 111364, -141250, -83316, -147601, 293111, -197005, 249266, -48983, -192112, -386, 62058, 197822, 68008, -209423, 161192, -48248, -5595, 100491, -96497, -220932, -85126, 225229, -260211, 146817, -432859, 189135, 128817, 151143, -230374, -94432, -346151, -3323, 49546, -28263, -177193, -96975, 100827, -199171, -203174, -55047, 149761, -128142, 73397, 157317, -221501, -208678, -95808, -282171, 437, -14900, -106056, 82925, 108405, 81231, -124618, 161781, -214799, 9570, -34632, -231814, -8169, -152882, -18573, -69882, 356242, -121575, -79111, 31549, -104315, -83656, -162535, -27617, 2568, 87309, -173948, -141154, 13483, -94110, -213781, 227174, 259973, 115969]
11806d1124C3567d17138J97378A28065c01584g1635K4847B50163E1119J2840a11176
11794A37988d2720j98304e7498j73201H4011f5480C28044j0751a13688j82975
11784b96663c0179j1530A01207C8065e2446J094k79174J60500C19178p3231C869
11772b9638r3450F6112b550B11194G993e2281F7399i8846o1929F9869h7114j7841
11760a04955A49773F6747d1266H9105M5703h7056B38702D3213i6806k8G3335b4235
11747A97461b4679k12522P8364P2702L8712n477A21239a077j0097C07713e11340
11735a43629D1120h0850A36904a02017k5161j46137B46288f7377E5443k2733J28510
11724A61220e1676k2618m7477B75073A0874J58093J6963p8725J54322g3389D1724
$$ y = [-41124, 33567, -417138, -219760, 128065, -301584, -71635, -46788, 250163, 51119, 63959, -111176, 137988, -42720, -241024, -57498, -230699, 84011, -65480, 328044, 317293, -113688, -296663, -30179, -41709, 101207, 38065, -52446, -51352, -330526, -170026, 319178, 245947, 3869, -29638, -123088, 66112, -2550, 211194, 7993, -52281, 67399, -98846, -160775, 69869, -87114, -104955, 149773, 66747, -41266, 89105, 134808, -87056, 238702, 43213, -96806, -96834, 73335, -24235, 197461, -24679, -237201, -158837, -86135, -47423, -52900, 121239, -1077, -11174, 307713, -511340, -143629, 41120, -80850, 136904, -102017, -127178, -273315, 246288, -67377, 55443, 32710, 161220, -51676, -74294, -121771, 275073, 10874, 168967, 185930, 107205, 261527, -73389, 41724]
11712B44002C0402e2127j9854C46110I1431R4515D8426h4882k6105E1859c65793
11700B63253G577N05169a98384F591J71546b6789D06485j93653o2876b62569c4934
11688I4351j76K74844e4399P402F3748a49299A92188J61354j11430o5139D1788
11676a87154C1508K89404h8510L1712A48638Q891K05929p2962n285q3949b62990
11664D9308M5060P3782J64122A11563a96D649J22036b9842B74154R7543a77906
11652A35509Q9886a49107b6968l4227H4204e265E75e6963a4524J539j38322l2843
11640a84150B401a03926B24765c6624j49253e2370j95363J09263d4773A91657
11629A11400d5123A2103R256K07693B31L4673J62576a94881i3202a1478A21892
$$ y = [244002, 30402, -52127, -71981, 346110, 91431, 185946, 48426, -84882, -110987, 51859, -365793, 263253, 7577, 512746, -198384, 6591, 178137, -26789, 406485, 212832, 149956, -262569, -34934, 94351, 94175, 369019, -54399, -46997, 63748, -149299, 192188, 353542, 242112, 176973, 41788, -187154, 31508, 320912, -88510, -56798, 148638, 157529, 363458, 290496, 285211, 201262, -262990, 49308, 94368, 168150, 332272, 111563, -196, 4649, 126685, -29842, 274154, 371697, -177906, 135509, 225395, -149107, -26968, -61195, 84204, -5265, 575, -56963, -14524, -12985, -151307, -184150, 2401, -103926, 224765, -36624, -185877, -52370, -247733, -138470, -44773, 191657, 111400, -45123, 12103, 21359, 229052, 231, 34904, 197480, -194881, -93202, -11478, 121892]
11617b4430m745A0902c0496B29078d55654h3868A58883o4245a73102P9835k44249
11606c37516A09290d03384D5101K7040f7661B34151q4678P4349P9743F7692J68275
11595B35967a07582B86957c5680B0343a53986a3428A131a47333H380P8984L0565
11584A17929m4041i4268F0166a06622K5004B8440K42157j07198m5090b06928j05875
11573c12803a02749M2912A20082L08227c5713a1433A30942J76914g3599a560o6410
11562f7970A36227a36797L9810G6646f2644K7037B32389K4806B223b26835a6586
11550c4422L148j92047N1144D58204A68516Q0210A11254J30175p0074a89281D49135
11538a94524A03282O0597J05282n916j1452J88043F4368o761J56425a39242e6533
$$ y = [-24430, -29175, 10902, -30496, 229078, -455654, -83868, 158883, 94638, -173102, -93267, -337516, 109290, -403384, 45101, 72141, -67661, 234151, 149473, 223822, 303565, 67692, 235967, -107582, 286957, -35680, 20343, -153986, -13428, 1131, -147333, 8380, 87364, 117929, 73888, -94268, 60166, -106622, -81618, 28440, 270597, 163399, 118309, -206928, -312803, -102749, -59837, 120082, 428309, -35713, -11433, 130942, 307856, -73599, -1560, -67970, 136227, -136797, -96987, 76646, -62644, -35607, 232389, 257195, 2223, -226835, -16586, -34422, -31274, -223321, -172177, 458204, 168516, 248726, 111254, 241429, 171355, -189281, 449135, -194524, 103282, 163879, 269161, 263245, 251793, 439836, 64368, 57607, 214032, -139242, -56533]
11526D43516A25649a16647I0038L81052d2751A819g0382A06306f7808F9713O1916
11515A31629a31047B24234K4922j08349a8346B95586I3635K13353j18549H6276
11504B74120q9449a25832A54301j0406E1859q073c23461h5004c2800l26717a43177
11492a5236B57436J45923e4221C42177o0386A5397P4881K70263j18464o7446p0771
11481A03860n0074J50717b65516A17396K01059D5897J7276M79517c0667j27177
11471a57844A61903F5139h9818A3623K08157J22448A7331J21717J26890l354n7763
11460B04821A00955M623M69849h8098b8493A27516K66628a21204a386A29653l8095
11449I1558a42256B49085j5447J09683A25243c8098A21535K82214b17700c9778
$$ y = [443516, 125649, -116647, 90038, 471090, -42751, 1819, -70382, 106306, -67808, 69713, 131629, -131047, 224234, 249156, 140807, -18346, 295586, 93635, 306988, 188439, 86276, 274120, 184671, -125832, 154301, 143895, 51859, 43786, -323461, -85004, -32800, -359517, -143177, -15236, 257436, 403359, -54221, 342177, 281791, 15397, 90278, 360541, 242077, 174631, 103860, 53786, 204503, -265516, 117396, 318455, 45897, 63173, 542690, -30667, -157844, 161903, 65139, -89818, 13623, 221780, 344228, 17331, 139048, 265938, 262584, 204821, 100955, 105578, 575427, -88098, -28493, 127516, 394144, -121204, -1386, 129653, 91558, -142256, 249085, 233638, 343321, 125243, -38098, 121535, 403749, -217700, -39778]
11438D24970k01775f2753E0999a31494a1686j40070j82341E6761N9921P6348d4176
11426a01328q5655e7626R708k39478A58454P2333L3873b09520K2622B11102F6222
11414a12850j15212i2599A7755Q0126J50850A3809b86037f3014C18168A31153
11403A8258K68774j08051E3333L22833A08891J9513a62904C27464r9012l0204
11393A98248g2431C03081I6775j4249f7760j64469M0482M6596C6549a43529D51324
11381F3884K24751j05832a07587E5549K0154h1426G3986L4800a12926E8204K237
11370F0441K69662F3967b61444Q1357A099N216a49103o3634j566B57202b81381
11358c4203r2823A05634K14822C718f6252l2710e727l6201o8161k04234F2182
$$ y = [424970, 223195, -62753, 50999, -131494, -11686, -151756, -334097, 56761, 116682, 193030, -44176, -101328, -186983, -57626, -47918, -287396, 158454, 230787, 264660, -209520, -186898, 211102, 66222, -112850, -228062, -92599, 17755, 97881, 248731, 13809, -286037, -63014, 318168, 131153, 18258, 287032, 178981, 53333, 376166, 108891, 128404, -162904, 327464, 228452, 198248, -72431, 303081, 96775, 82526, -67760, -232229, -191747, -145151, 36549, -143529, 451324, 63884, 288635, 182803, -107587, 55549, 75703, -81426, 73986, 108786, -112926, 58204, 60441, 330103, 63967, -261444, -180087, 1099, 6315, -149103, -212737, -214303, 257202, -281381, -34203, -127026, 105634, 320456, 3718, -66252, -98962, -5727, -41928, -110089, -314323, 62182]
11346a56450B93885c9110N318j11146b2631l4562q7992A73861b37223j77114h0161
11334g3988C7762c00378G8677C1630a18158j8944D9120J24454a0303F7284c59019
11322D92562D0711c3672o8581F5769a96909B05288r4038K08000f3001A07860C4468
11310B44802e108l85722c0271A45779b69545q9698I4961N024J62295g294A75316
11298d3621a8750j86781h3289b465A25180e5239k06547g3770A08160r852k2342
11287G5966g3113j40287f6314j23151e6300A39688i8599l8884D1341a38768O9257
11276f9511A66059l8766E4178J75170A02355c9459p7675C8878Q7229b77864a5270
11264G2004a23735q4154h6249k45401a1002B25909a25903A56293e6790B61382
$$ y = [-156450, 293885, -39110, -33792, -144938, -22631, -57193, -145185, 173861, -237223, -414337, -80161, -73988, 37762, -300378, 78677, 31630, -118158, -137102, 49120, 173574, -10303, 67284, -359019, 492562, 40711, -33672, -102253, 65769, -196909, 205288, 111250, 319250, -63001, 107860, 34468, 244802, -5108, -390830, -30271, 145779, -269545, -359243, 94961, 99985, 262280, -7294, 175316, -43621, -18750, -205531, -83289, -2465, 125180, -55239, -261786, -73770, 108160, 98308, 75966, -73113, -213400, -66314, -189465, -56300, 139688, -98599, -137483, 41341, -138768, -69511, 166059, 127293, 54178, 229348, 102355, -39459, -117134, 38878, 126107, -277864, -15270, 72004, -123735, -207889, -86249, -331650, -11002, 225909, -125903, 156293, -56790, 261382]
11253b28227j52527b5176B9449J90865B1658M9766A3843b6043A5305K2884c45322
11241d2343p7668A28310a01935j1712p0015L0822N6520A07424b87232b3010k14474
11230b37484k41058b03252E00236d3253C8641J16283a61432A61983a4731j62475
11220a77206b5127A87289h6626n3633A09383a22244A94844l5442B5131c67595
11209a14730B30306E9748a03382k88592a22937B61615I1436b9187j52393Q98e9186
11197F9176a35789F029i8768q862k877A9942a24539A84880A4233a63195K023A90607
11184b3336B18259a64491L8498K3358B752i0984A17221b6071I0227f6314j2317
11173g8631q8035m2968H5651b52063J02216E479b27568J06455j7630E8955B8668
$$ y = [-228227, -380754, -25176, 29449, 220314, 21658, 71424, 13843, -26043, 15305, 38189, -345322, -42343, -120011, 128310, -101935, -113647, -183662, -152840, -96320, 107424, -287232, -23010, -237484, -478542, -203252, 500236, -43253, 38641, 154924, -161432, 161983, -14731, -177206, -25127, 187289, -86626, -140259, 109383, -122244, 194844, 159402, 25131, -367595, -114730, 230306, 59748, -103382, -391974, -122937, 261615, 91436, -29187, -181580, -180682, -59186, 69176, -135789, 6029, -98768, -107630, -110507, 19942, -124539, 184880, 14233, -163195, -161172, 190607, -23336, 218259, -164491, -125993, -102635, 2752, -90984, 117221, -26071, 90227, -66314, -78631, -166666, -209634, 85651, -252063, -149847, 5479, -227568, -121113, -138743, 58955, 28668]
11161A6569e8948C3247g939j13531m4942A6698J95502a38189A09886J21613F1174
11149b0893m2690E619b26990C04747c3978A4891b03627H5226a30891j33710O7148
11138a97453A0877R6008b02423D5637J3538h5203k0831M1120C43018I651K63786
11127B73437j07148l2961J02806G9523J62971n9379n2673N6955J26819m7855G2292
11115A73995a19861n559F0399R1968F1372K26743j19869j2165i5700m1988H0445
11103i2577N790C56383h594B1908J05447a18588A79235a98431C58791k0357a1307
11091h1969I9830d4151A86941O3561d389I0448K50960q4530a7193F1633J20687
11080A82320B7460J50312J09600j5329j05515a18769C38826Q3573A93993H4729
$$ y = [16569, -58948, 33247, -7939, -121470, -166412, 16698, 212200, -138189, 109886, 231499, 61174, -20893, -63583, 5619, -226990, 304747, -33978, 14891, -203627, 85226, -130891, -264601, -197453, 10877, 106885, -202423, 45637, 59175, -85203, -106034, -64914, 343018, 9651, 273437, 166289, 133328, 236134, 79523, 242494, 183115, 130442, 187397, 314216, 266361, 72292, 173995, -119861, -125420, 60399, 152367, 61372, 288115, 168246, 156081, -95700, -137688, 80445, -92577, -86787, 356383, -8594, 21908, 127355, -118588, 179235, -198431, 358791, 338434, -11307, -81969, 99830, -44151, 186941, 250502, -4389, 90448, 341408, 256878, -17193, 61633, 182320, 27460, 177772, 287372, 272043, 166528, -118769, 338826, 422399, 193993, 84729]
11069A31464K27081G5319L30605J82673k92692K50663P2766N1506k51186Q3234
11059E02888M14454C86685L9446K18761j79579L58669k68347j35293J61436J22500
11049G04278K73985l56958n2546M05189k89728k62205N25833C04476N13076K47054
11039A064606B76419L51762J57819m9091K32716C34309L51565K11040l23604K71435
11029H44745j42603j78880K73669J69822k6010l21886Q2247J19582j84346k39141
11019C97199O8212N0288j03066J14978P3750L06964j45225L52377m76094j29647
11009E09736M2633j13591M04047C69446L32344K18629l85871L98800k42277j08457
10999E82614K2179L16980m4768k15996k07179L24262j50383j99932N80075k52182
$$ y = [131464, 358545, 75319, 405924, 588597, 295905, 546568, 619334, 670840, 419654, 502888, 917342, 386685, 426131, 644892, 465313, 823982, 555635, 420342, 581778, 704278, 978263, 621305, 568759, 973948, 684220, 422015, 947848, 304476, 817552, 1064606, 276419, 628181, 786000, 736909, 969625, 334309, 685874, 896914, 573310, 844745, 702142, 523262, 796931, 966753, 940743, 618857, 701104, 820686, 636340, 397199, 465411, 515699, 412633, 527611, 601361, 908325, 763100, 1115477, 639383, 509736, 552369, 438778, 842825, 369446, 701790, 920419, 534548, 933348, 691071, 582614, 604793, 921773, 877005, 661009, 453830, 778092, 627709, 427777, 1007852, 755670]
10989G55670j73821J75050J41689K31373n37004J80636L85771J75808l09969K53048
10979A278251N2268K0931J74447L46337J96388J50165L40295K2855J19614J88954
10969B890505q4694l7034j80317k93266k60101k39852R8315j80601K25318j0202
10959A928071n6261L634M7068L30063k35139o5856m65710j3750m00448j66196
10949I05476j23900n6241J22956l43520k44081K13283A51315M62332j66295Q798
10939D56150B09979K75532k3434p2478a42161A99835E8140J96356b46353A43964
10928B24065g9840C01744b0820k9474B0154J21832i6273B64826i6170A95502a28998
10916F8645k6508a5772D97516g3479a8456A13898K46437F4135J80828J46249j14578
$$ y = [755670, 581849, 756899, 898588, 1129961, 592957, 773593, 1159364, 1335172, 1025203, 1278251, 1330519, 1351450, 1525897, 1872234, 2068622, 2218787, 2559082, 2581937, 2701551, 2890505, 2805811, 2768777, 2588460, 2295194, 2035093, 1795241, 1893556, 1712955, 1938273, 1928071, 1871810, 1875444, 1922512, 2252575, 2017436, 1951580, 1485870, 1472120, 1071672, 905476, 781576, 725335, 848291, 504771, 260690, 473973, 151315, 613647, 447352, 456150, 209979, 485511, 462077, 389599, -142161, 199835, 58140, 254496, -246353, 143964, 224065, -79840, 301744, -20820, -50294, 20154, 141986, -96273, 264826, -96170, 195502, -128998, 68645, 42137, -15772, 497516, -73479, -18456, 113898, 360335, 64135, 244963, 391212, 276634]
10905B76634f4950B99236H8745g5110I8935C4665a8755k18507G7924K63997i8922
10893a17933E0267d40661c9344G6365g1317I249a43202A46205d2197j54351L4017
10882a62531p9593B76052e7108m7531o4876O8161H7732H508J09372e6816k08388
10871b65204G5757Q3674a97475C9442K93228a34846A81927l1641A5035L18438
10861C33473b11662g6868r9401j97209J64644A79380q241o8386C5506h7323E0571
10849A36810a90326b6046j77889H8055b635l3425A6950d68558a05132A0503e9303
10837A16901B2851J7588a7568k62545A11958e0167b553D55313g9419j88692A17096
10825A42511a42303M1164A35378b58860A02860k6801A3639e15849a30542C6254
$$ y = [276634, -64950, 299236, 88745, -75110, 98935, 34665, -18755, -237262, 77924, 341921, -98922, -117933, 50267, -440661, -39344, 76365, -71317, 9249, -143202, 146205, -42197, -196548, -162531, -242124, 276052, -57108, -104639, -169515, -101354, 87732, 8508, 117880, -56816, -265204, 75757, 159431, -197475, 39442, 332670, -134846, 181927, 150286, 15035, 333473, -211662, -76868, -176269, -373478, -208834, 179380, 171139, 102753, 35506, -87323, 50571, 136810, -190326, -26046, -203935, 88055, -2635, -36060, 16950, -468558, -105132, 10503, -59303, 116901, 22851, 40439, -17568, -280113, 111958, -50167, -2553, 455313, -79419, -268111, 117096, 142511, -142303, -101139, 135378, -258860, 102860, 76059, 13639, -515849, -130542, 36254]
10814B02890c7624A46098Q2696H2390c23048c6019D5285J1434d11743B00098H3284
10802e9367B06948a01595k27956a24111A05873a45630b8480M896I0004J93674
10792B83678i6528l8285k7895C58462a63384d0870D1170b1718m2076A60424a69157
10780b28662A45500F6079J8481K40612a99116k36336J50172Q3840K3068A7369
10769C1144L1518a6807l5359D4676i2344A7229M1809P8345L0903e9365r4858A07786
10756a64660A30167D4914K75737h5331q7062C0552a4219B39531b9553A32630K70297
10745D02927I0712a65309n5449j78162a49096a0427B8268a41615b4850A44348
10734b80450M0315A10189g1850l95661a09776A6858a53716C31829b58311b0942
$$ y = [202890, -37624, 146098, 228794, 82390, -323048, -36019, 45285, 56719, -411743, 200098, 83284, -59367, 206948, -101595, -329551, -124111, 105873, -145630, -28480, -23584, 90004, 283678, -96528, -134813, -162708, 358462, -163384, -40870, 41170, -21718, -63794, 160424, -169157, -228662, 145500, 66079, 84560, 325172, -199116, -435452, -285280, -201440, -178372, 17369, 31144, 62662, -16807, -52166, 44676, -92344, 17229, 59038, 137383, 168286, -59365, -154223, 107786, -164660, 130167, 44914, 320651, -85331, -172393, 30552, -14219, 239531, -29553, 132630, 402927, 90712, -165309, -220758, -398920, -149096, -10427, 28268, -141615, -24850, 144348, -280450, -240135, 110189, -71850, -467511, -109776, 16858, -153716, 331829, -258311, -20942]
10723A89929a17641A21276l8339L83644i2993A13297J59975g59l26035E4235e4303
10711e9530H9320k5910J15719H6704J87188a39235N6763r0527f1793I6802I023
10699a39515a2556B77962H0421l3355K65837c29070d7558M478j23525j40639A06526
10687G6577J88121a31961A54890d7446A00780c3314k99449E0898c7157A25697
10676a84803b664H1958P8690B9245K30814j11594c46200I6437b12380e7087a1807
10664b41279b6376F7145b00048r1887R4413f0574A25449c23336J55183c2739A10278
10652b23745d2566D0808K90716a36833o9801N5201N3210A90819A8061a92120r936
10641b02056G5080a28763l28493J70741A26552h9887n1264B18059a0188q8833
$$ y = [189929, -117641, 121276, 82937, 466581, -92993, 113297, 273272, -759, -326794, 54235, -54303, -59530, 89320, 63410, 179129, 86704, 273892, -139235, -82472, -172999, -61793, 96802, 9023, -139515, -12556, 277962, 80421, 47066, 312903, -329070, -47558, -43080, -166605, -307244, 106526, 76577, 264698, -131961, 154890, -47446, 100780, -33314, -332763, 50898, -37157, 125697, -184803, -2664, 81958, 160648, 29245, 260059, 148465, -346200, 96437, -212380, -57087, -11807, -241279, -26376, 67145, -200048, -291935, -197522, -60574, 125449, -323336, -168153, -32739, 110278, -223745, -42566, 40808, 331524, -136833, -206634, -151433, -98223, 190819, 18061, -192120, -202056, 75080, -128763, -457256, -286515, 126552, -89887, -141151, 218059, -10188, -99021]
10631i9021L0416A2218e3904l05147B36930a8468j75507B1136K08992a30844q4426
10620b15270B11853d4405j64544e0631B35780Q3775i7057c9079A36093b5309B16273
10608a61556o5854o8831f8929o7251A58112a94488H108a82749B43744b83369k4790
10597c08159a46338P43K0737D8359e2033j26600l3632C4676a77565f5791p9451
10586a45242N1957k26497I7705i0372j5522A643L4289i4227p0882l7640l9635
10575b42384f1490A76754D5041L20719b83951j0580B77695A38235J74428c9127
10564d5253j97640o6588E9279k8855O847J22605b22365a8368k06612D229a39601
10552G7420J01856b1001i767l3906C32733A40433a20619I8716B9189a99262b5980
$$ y = [-99021, -68605, 12218, -53904, -359051, 236930, -18468, -193975, 21136, 230128, -130844, -215270, 211853, -44405, -208949, -50631, 235780, 319555, -97057, -39079, 136093, -25309, 216273, -161556, -227410, -296241, -68929, -136180, 158112, -194488, 8108, -182749, 243744, -283369, -308159, -146338, -145595, -124858, 48359, -52033, -178633, -212265, 34676, -177565, -65791, -145242, -93285, -319782, 97705, -90372, -105894, 1643, 35932, -94227, -165109, -202749, -242384, -61490, 176754, 45041, 365760, -283951, -294531, 277695, 138235, 312663, -39127, -45253, -242893, -309481, 59279, 30424, 37271, 159876, -222365, -18368, -224980, 4229, -139601, 77420, 179276, -21001, -9767, -43673, 332733, 140433, -120619, 98716, 29189, -199262, -25980]
10540a82738j57829Q255A35418E2445J47899E8370a56864d72j26463C1926d042
10528B25g1891M856C67203r0267J4845c10200B4719c6131j8057A08523b24384
10516A90313B355K49751a49163A74579g0789L2858n0644k9599j17472b2106C56074
10504B43863n1155c86214a11954C07118A3957a28883B91246a74177O5422B47489
10493A48476f3257e825K703A35162d95773A71235E6047b54166C17981a57031B60455
10481C1117A3289L50267J73465O2704A72044F0864J90949C2677P0805J36679I0268
10469D6479b16342a8534B980J36252b21201k26114d7090A54395a39433d2174B23155
10457c69185i8104A91807h2388A9150H151c28338A7495f4036l8478B39363F1478
$$ y = [-182738, -340567, -332312, 135418, 52445, 200344, 58370, -156864, -472, -126935, 31926, -4042, 225, -71891, -67035, 367203, 276936, 291781, -310200, 24719, -36131, -54188, 108523, -224384, 190313, 2355, 252106, -149163, 174579, -70789, -37931, -88575, -118174, -235646, -22106, 356074, 243863, 192708, -386214, -111954, 307118, 13957, -128883, 291246, -174177, -108755, 247489, 148476, -63257, -5825, -3122, 135162, -495773, 171235, 56047, -254166, 317981, -157031, 260455, 31117, 13289, 363556, 537021, 599725, 172044, 60864, 251813, 32677, 103482, 240161, 90268, 46479, -216342, -18534, 2980, 139232, -221201, -447315, -47090, 154395, -139433, -42174, 223155, -369185, -98104, 191807, -82388, 19150, 8151, -328338, 17495, -64036, -102514, 239363, 61478]
10445d9530k76970G6924h3493A28997m6127L4945e0785k7287F9469B5249i2374
10433c8225A67915M8333a27398A18227a93036A22205a76647K6126K858E6457J43002
10422A99459b12545g1846A11438B6154J76617b2579H1193f1111E0357j9815N5606
10411H6148a69244J3800A13768e8184B63656A07105a46383A81469a98452d6065
10400C1029k087A3810c2837i547q5365F9736a50323C58363c3077l44161C59663
10388f4987A27285Q3664E4048J88081b280D2915f01437A77094i4319D04035j23364
10377B80671j03718C2894J06307l9841K04445a29008B80534A16995l3776K54052
10367C37271R935L35870l13312G9169K6221i950E15464B43835J27315O6593A77664
$$ y = [-49530, -326500, 76924, -83493, 128997, 82870, 117815, -50785, -78072, 69469, 25249, -92374, -38225, 167915, 216248, -127398, 118227, -193036, 122205, -176647, -150521, -147663, 56457, 199459, -212545, -71846, 111438, 26154, 202771, -22579, 81193, -61111, 50357, 30542, 86148, -169244, -155444, 113768, -58184, 263656, 107105, -146383, 181469, -198452, -46065, 31029, 28942, 13810, -32837, -9547, -94912, 69736, -150323, 358363, -33077, -377238, 359663, -64987, 127285, 210949, 54048, 242129, -2280, 42915, -601437, 177094, -94319, 404035, 280671, 176953, 32894, 139201, 99360, 303805, -129008, 280534, 116995, 83219, 337271, 347206, 683076, 369764, 79169, 105390, -9950, 515464, 243835, 371150, 437743, 177664]
10355a188B14415B6996Q1670J99369o3298p353J36961N9173o9467k5928N4641
10344C92764J11405K36183A41547L43710O0596k58330c6723A31556J81130P5304
10334C87990E214O38898a01418k1446N3957B36103a08783H7938J34361I3956N8240
10323A52196Q4705a04530A76341J28802r7618E9158A6254J06427L4643a03610
10312a6180E8340A6718P0352j1401j831i5004A43583b3508k2925B38624I822b00583
10299C9467O0938J32776J8964a18970j70109D6874i9616a4765k47293i8678K6310
10288g2368j41831E1402J23992K1158a62801M200j2203f4456C56615b0055n0338
10277g0393j61987N692a03395j70436J36462R488N5827F0822d37136e2299n7430
$$ y = [-1188, 214415, 26996, 108666, 308035, 244737, 237384, 374345, 433518, 364051, 338123, 392764, 504169, 740352, 141547, 485257, 545853, 287523, -36723, 131556, 312686, 387990, 5214, 644112, -101418, -122864, -68907, 236103, -108783, 87938, 222299, 93956, 152196, 236901, -104530, 176341, 305143, 207525, 59158, 16254, 122681, 157324, -103610, -16180, 58340, 16718, 87070, 75669, 73838, -95004, 143583, -23508, -46433, 238624, 9822, -200583, 39467, 100405, 233181, 252145, -118970, -289079, 46874, -99616, -14765, -262058, -98678, -72368, -214199, 51402, 175394, 196552, -162801, -158601, -170804, -64456, 356615, -20055, -70393, -232380, -226688, -103395, -273831, -137369, -127881, -72054, 60822, -437136, -52299, -109729]
10266a09729j33457B16783M0861a63374B33238A7615J32644P0260l5385J95178
10256C80312j34636A19127K247B1266D750L4214a12158j66166G8250a54757j1324
10245a66081j40524A67058J69958a3918k81865B35099K6283E0573H47b2128j15978
10234a38106c5166l45860B4120a88656Q4744j68934i0056p3341D52330a67485
10223A06237D6654K3084a47845a1997p9726b533j90432L7654I8446J78868C1392
10211B03437c08500e7585A69370a52591A40457J15085r4507f8675B42581b80135
10200H1512j9779a15315I0292b7321j92367A30008o194d4521j48072A75274a18652
10188a81113e7233a2753j09844a2900m7496k7448J3538j13162g0977E6866b95811
$$ y = [-109729, -243186, 216783, 257644, -163374, 233238, 17615, 150259, 220519, 185134, 380312, 245676, 119127, 121374, 21266, 4750, 38964, -112158, -278324, 78250, -154757, -166081, -306605, 167058, 337016, -13918, -295783, 235099, 261382, 50573, 847, -22128, -138106, -35166, -381026, 24120, -188656, -103912, -272846, -90056, -163397, 452330, -167485, 106237, 46654, 69738, -147845, -11997, -91723, -2533, -192965, -155311, 98446, 277314, 31392, 203437, -308500, -57585, 169370, -152591, 140457, 255542, 161035, -68675, 242581, -280135, 81512, 61733, -115315, 90292, -27321, -219688, 130008, 123814, -44521, -192593, 175274, -118652, -181113, -57233, -12753, -122597, -12900, -60396, -87844, -74306, -187468, -70977, 56866, -295811]
10176a69771b6744a1510j58610M0937N0920k91249b5158l15355A79381d791E2663
10164B5020J0531b211l17983E3266b02959A40356a66323N495L1890j29109o6160
10153c24207E861Q610a75001A0537f1536A11663g1172j32748l2929A10594b96633
10141E8531a34380B9762Q2909K0331a66516O9788k67829E8982J46981b71818G6466
10129e4360Q520o47697a15694r8310R3231I8280m2847a00470G2989L13139d8993
10117c94568A48921a57772j84506B20114a03917C38772j4142c05869a04740j0031
10107a14771b9818k0065q4325C7876a50394j11290R8374P9915l8224A03349C3586
10095b24470F7220J88476C5178b862E0037f8740N444H8956a32509L6022j36969
$$ y = [-169771, -26744, -11510, -170120, -129183, -78263, -369512, -25158, -340513, 179381, -4791, 52663, 25020, 35551, -2211, -320194, 53266, -202959, 140356, -166323, -160828, -128938, -258047, -324207, 5861, 14471, -175001, 10537, -61536, 111663, -71172, -203920, -236849, 110594, -296633, 58531, -134380, 29762, 112671, 133002, -166516, -96728, -364557, 58982, 205963, -271818, 76466, -54360, -45840, -693537, -115694, -214004, -120773, 98280, 55433, -100470, 72989, 386128, -48993, -394568, 148921, -157772, -342278, 220114, -103917, 338772, 324630, -305869, -104740, -114771, -29818, -49883, -134208, 37876, -150394, -261684, -163310, -83395, -121619, 103349, 33586, -224470, 67220, 255696, 35178, -2862, 50037, -68740, -63296, 88956, -132509, -96487, -233456]
10084b33456j4702B74748a68478o8494d061j0063F1968M0703J4231M1828b89002
10072a65585j56323B90847c6681k24816K0668o2115a36252E9374k1208b54905
10061C738L7690L83228e5424E6378g3790b7238j50833A0259J35268c4174k64925
10050b99099j0039A7902i7309j55023A22314b21993e7490A03210a22223j42579
10040b64802d7615n9991i226n65565m2894B8731J4821c27051B46347a81172j0004
10029a91176F9859a83018M4824f3219B08441b5916H0549O786P7201c89533d0777
10017g118n3134j25870B09157J9825a19269j89629a50780j44287R1022F1698k8998
10006C2700O5023c25192h1637c065B69630I8424m6931O4901a5921k7397R275I4928
$$ y = [-233456, -248158, 274748, -168478, -236972, -4061, -14124, 61968, 102671, 116902, 158730, -289002, -165585, -321908, 290847, -36681, -261497, -240829, -302944, -136252, 59374, 38166, -254905, 3738, 41428, 424656, -55424, 56378, -73790, -27238, -178071, 10259, 145527, -34174, -299099, -309138, 17902, -97309, -252332, 122314, -221993, -57490, 103210, -122223, -264802, -47615, -107606, -9226, -574791, -617685, 28731, 43552, -327051, 246347, -181172, -191176, 69859, -183018, -138194, -63219, 208441, -25916, 80549, 87335, 164536, -389533, -40777, -7118, -60252, -186122, 209157, 228982, -119269, -308898, -150780, -295067, -204045, 61698, 32700, 97723, -325192, -81637, -3065, 269630, 98424, 51493, 116394, -15921, -43318, -34043, 94928]
9993a03254k4428j03180L3825C95425b25221A18325b0418m28746A7635N8490f8164
9981c39191I4482b64134g0835l5418k5882D9156J03789o2476P0619A888P0361
9970G2249J3381c7938a0031j54791j10699l7921B41621b18289N0471P8539L2254
9959e7025A80925a21806M2870G9761b55170N6563j37024J38022O068b8641m09542
9948d38183E306M4043g3109l28634j1845a19790K5848k6730A62471b22102c5510
9936b6714k38815a00586k65304a44954A33827a90317j4053P9699A99864H9957
9925G3607b08676i0677B3789a37282k0082N0674B5366M3437J33368c043G4186
9913c08914a00456B67020b70332H0648b79722c5788c318A2463a36271j183e0956
$$ y = [-103254, -127682, -230862, -197037, 395425, -225221, 118325, -20418, -449164, 17635, 76125, -68164, -339191, 94482, -264134, -70835, -106253, -132135, 49156, 152945, 90469, 161088, 1888, 72249, 85630, -37938, -10031, -164822, -275521, -313442, 241621, -218289, -167818, -89279, -57025, 180925, -121806, -78936, 79761, -255170, -198607, -335631, -197609, -191541, -28641, -438183, 5306, 49349, -73109, -401743, -413588, -119790, -93942, -120672, 162471, -222102, -35510, -26714, -265529, -100586, -365890, -144954, 133827, -190317, -204370, -124671, 199864, 89957, 73607, -208676, -90677, 23789, -137282, -157364, -106690, 25366, 68803, 202171, -3043, 74186, -308914, -100456, 267020, -270332, 80648, -279722, -35788, -3318, 12463, -136271, -137454, -50956]
9901c67155A29231c4387p6268F7067N4220O6673b37970d1810A22502a62301P9821
9890h2480l48920C17890F5512J9941b240A93454b64628H4663a78216Q4550k08975
9879c02641B06665F5205A6598J0293i2332d6065A41885i8063b4215B54768h5413
9867a5762j28172j9626L3723H975a21431C14994g7768A59593a712o7255a9856
9855f2955q7575a692l73022H1749d0152A80533M6336a80408q0424M3309h5595
9843a58037P5837L3890k6941k3169J1891j47479A20893a15608A60140a86530K2959
9832a63571M7151F1880c70852b2659D9673a72383d9576A84741b04500e273j53003
9821a58276i363A0494b05909A56773E818c03009c4584k10509K3064B34980d9227
$$ y = [-367155, 129231, -34387, -110655, 67067, 121287, 187960, -237970, -41810, 122502, -162301, -82480, -431400, 317890, 65512, 85453, -2240, 193454, -264628, 84663, -178216, -93666, -302641, 206665, 65205, 16598, 26891, -92332, -46065, 141885, -98063, -24215, 254768, -85413, -15762, -143934, -163560, -129837, 8975, -121431, 314994, -77768, 159593, -1712, -68967, -19856, -62955, -150530, -1692, -374714, 81749, -40152, 180533, 226869, -180408, -260832, -217523, -85595, -158037, -82200, -48310, -75251, -98420, -86529, -234008, 120893, -115608, 160140, -186530, -163571, -116420, 61880, -370852, -22659, 49673, -172383, -49576, 184741, -204500, -5273, -158276, -9363, 10494, -205909, 156773, 5818, -303009, -34584, -245093, -222029, 234980, -49227]
9809b95232F2762b83792b6967j36421m9321A198b17069A22035a36223j03253R3081
9798a46395C45087d22580f0658D5585g7454p4586j60947a33173B12752d48723
9787A44373a80744p3116C1790A1184a76221P7118j01643j34i1171j12998F4441
9775B2803c75808a1952j03833p9139P8966H1062D794b98893a5069I140a15211
9763b45867b47D8400J55757J9684g4919A60385a37596l6816L1716E8285a85653
9751A1233b62735C6979J11509f7305H571a54792H0380b46663h2213R987p8589
9740a50815o2443D51822c15537C0999b05043c4335C96722A17541l8059c13682
9729a75690m1302G8257a16303l33966C7097f7566j0116c4064A24718C6252h7408
$$ y = [-295232, 62762, -283792, -26967, -163388, -212709, 1198, -217069, 122035, -136223, -239476, -146395, 345087, -422580, -60658, 45585, -77454, -152040, -312987, -133173, 212752, -448723, 144373, -180744, -253860, 31790, 11184, -176221, -99103, -200746, -200880, -91171, -204169, 64441, 22803, -375808, -11952, -115785, -194924, -115958, 81062, 4794, -298893, -15069, 9140, -115211, -245867, -247, 48400, 204157, 223841, -74919, 160385, -137596, -174412, -142696, 58285, -185653, 11233, -262735, 36979, 148488, -67305, 8571, -154792, 80380, -246663, -82213, -72226, -150815, -213258, 451822, -315537, 30999, -205043, -34335, 396722, 117541, 79482, -313682, -175690, -216992, 78257, -116303, -450269, 37097, -67566, -77682, -34064, 124718, 36252, -87408]
9717i9871A59605A6953b28781C82800j70209f365l64824a56529j37257B775K96796
9706B99571h5181j02306j17288A03594J9294O7079M2377a91165P696H0695a06823
9694a92800A04536b32278A64001j3117b1114r8000k8969N5817m559j11416j91689
9683c99930B75246a33238j84888h8863j86110k5733J33681B97246A45458c67233
9672G2020L5290K14926a10651A64487e6728j76028P9019b3188j45734L0725A60703
9660A54629E4114a57312k0665A79323p8764B6380a05434j02194r1335C39178b9479
9648A50372b9601m7278j2018A03486a74046j23418H5584q453G242P7417J75408
9637B60067E3820J2624a48051E4942d11435A06610b59766a09457B309c8555A50557
$$ y = [-99871, 159605, 16953, -228781, 382800, 212591, -6365, -371189, -156529, -293786, 2775, 299571, -85181, -187487, -304775, 103594, 122888, 189967, 232344, -191165, -183469, 80695, -106823, -192800, 104536, -232278, 164001, 150884, -21114, -119114, -148083, -92266, -96825, -208241, -399930, 275246, -133238, -318126, -88863, -274973, -300706, -167025, 297246, 145458, -367233, 72020, 107310, 322236, -110651, 164487, -56728, -232756, -153737, -23188, -168922, -138197, 160703, 154629, 54114, -157312, -177977, 179323, 100559, 26380, -105434, -207628, -298963, 339178, -29479, 150372, -29601, -76879, -88897, 103486, -174046, -297464, 85584, 77131, 7242, 84659, 260067, 53820, 66444, -148051, 54942, -411435, 106610, -259766, -109457, 2309, -38555, 150557]
9625A26534m5413N8506J03593a08690D8090a77304N6307N4167j53441A3359b43874
9613A01271c27945g601j54858q5685A22670m8790O7671c27085a47736p5020A38407
9601H2458a35096B1092c00331M0131B71971b86165C73724A37584Q130a1975k29442
9590b41417e5232j70990F0126b11309C01366C1735O6702g2376A26291b26569b9219
9578B832J08027J88884a95617B3810a7025f288j07558p6383A55558K1557m0255
9567A36860b61602J9411B05683H1938b76100j8070Q3319e8551k56149G0506c10382
9555d15239J32748A30288a24135K8944j8736k3905j5050L6042k39570a73174j5169
9544a88343P9524B80573b82578I2296C5056L789b49111D1308O4247a31176d7534
$$ y = [126534, 81121, 139627, 243220, -108690, 48090, -177304, -120997, -66830, -220271, 13359, -243874, 101271, -327945, -7601, -162459, -248144, 122670, 73880, 141551, -327085, -147736, -222756, 138407, 82458, -135096, 21092, -300331, -260200, 271971, -286165, 373724, 137584, 145714, -11975, -241417, -55232, -226222, 60126, -211309, 301366, 31735, 98437, -72376, 126291, -226569, -29219, 2832, 110859, 299743, -195617, 23810, -17025, -6288, -113846, -190229, 155558, 177115, 136860, -261602, -242191, 205683, 81938, -276100, -294170, -210851, -58551, -314700, 70506, -310382, -415239, -282491, 130288, -124135, -95191, -113927, -137832, -152882, -116840, -356410, -173174, -188343, -108819, 280573, -282578, 92296, 35056, 38845, -249111, 41308, 105555, -131176, -47534]
9532C0164i0652k53190a34974C2754a03269b2639A07751c9181a6821k51801A71500
9520b60176a08027E3775c55059B90976a79279B62302A10540a4403j4656k12631
9510b41690A11263a81473m9863g9792o6403A35105G34K26488i9037j18185o6043
9499b83265H8226d3433l6403B04204g9576A58379a83160m5634c0518A55704F2471
9487a51474l5594j6401C60004A69550b1960m1947I6791d8950l3496k15779i2181
9475b71580B36759a17982A59965p7580J57615e1520k87203a08011C95191c93531
9464E0470b23641k09469A79672a8488B53040d5149q4596D786g3133j14147e9313
9452C0823c41049d5763H1164k7488c00633A76037j791c45113B96195r4128b06389
$$ y = [30164, -90652, -343842, -134974, 32754, -103269, -22639, 107751, -39181, -16821, -268622, 171500, -260176, -108027, 53775, -355059, 290976, -179279, 262302, 110540, -14403, -29059, -241690, 111263, -181473, -231336, -79792, -146195, 135105, 734, 227222, -99037, -217222, -283265, 88226, -43433, -79836, 204204, -79576, 158379, -183160, -228794, -30518, 155704, 62471, -151474, -187068, -203469, 360004, 169550, -21960, -63907, 96791, -48950, -82446, -298225, -92181, -271580, 236759, -117982, 159965, 82385, 240000, -51520, -338723, -108011, 395191, -393531, 50470, -223641, -433110, 179672, -18488, 253040, -45149, -129745, 4786, -73133, -187280, -59313, 30823, -341049, -45763, 81164, 53676, -300633, 176037, 174246, -345113, 296195, 202067, -206389]
9440B20454b4950l06977a14546A46700b56058D1221Q1961c99818B49553j8780
9430B30773a58922g0046n4836J0389k03932A33627a36142j01643k09586i417A41706
9418A52893b03203B4234c1447q3823b3288j3542o5827j6810j38560C2082L4633
9407F6715i289D1532a02088K6817j78852A0594b12942A43941i3485n8220A7045
9395c26806A67113a54920I0219a68154B13846r5958B4356d79196a05305E7552
9384d26531F5722c18311A42321b38852P4083B99688E046b24229f270k71772A0176
9372b24410h3347j12728h8835E8877Q0411o8681K548j267J86400b8844A57607
9360e94l3047B74374A7600c02977A385J19180M9543h2424j26309p2572A52963
$$ y = [220454, -24950, -331927, -114546, 146700, -256058, 41221, 123182, -399818, 249553, 230773, -158922, -70046, -124882, -114493, -318425, 133627, -136142, -237785, -447371, -9417, 141706, 152893, -203203, 24234, -31447, -115270, -23288, -36830, -102657, -119467, -258027, 32082, 66715, -9289, 41532, -102088, -75271, -254123, 10594, -212942, 143941, -93485, -151705, 17045, -326806, 167113, -154920, 90219, -168154, 213846, 117888, 24356, -479196, -105305, 57552, -426531, 65722, -318311, 142321, -238852, -164769, 299688, 5046, -224229, -6270, -278042, 10176, -224410, -83347, -196075, -88835, 58877, 139288, 70607, 73155, 71888, 258288, -28844, 157607, -594, -33641, 274374, 17600, -302977, 1385, 120565, 170108, -82424, -208733, -281305, 152963]
9348d7483j19337J4452k4064A06000L8491b9140j94308c3055B07238g306l6441
9337d3747p8146c736C04130c65754A98730b74754a28182Q667j04985J06776b14
9325a19425A03934A5951c16121i1224B07186I2824a71615a9958A0143M6248d08551
9313C48382H021g8815k94853R2871b0584k6892j23810R215j7431B261a740l6478
9301c8218m05441J84686a05430j07130A30468i2420K4904j89000a05164j4480
9291a19644L1347L6008j93662R9975B39393D1945g2746l6879j50104E850J808
9280G658a69090d3131a2878M742m69765E1903c8894D0906J86674A09624g4104
9268a35155m9309g377q3667J331c9487B27711n9336J64389a62686g3847p0130
$$ y = [-47483, -166820, -152368, -176432, 106000, 144491, -29140, -223448, -33055, 207238, -7306, -43747, -121893, -3736, 304130, -365754, 198730, -274754, -128182, -119515, -224500, -117724, -214, -119425, 103934, 15951, -316121, -91224, 207186, 92824, -171615, -19958, 10143, 56391, -408551, 348382, 8021, -78815, -373668, -280797, -20584, -47476, -171286, -162071, -179502, 2261, -1740, -38218, -443659, -258973, -105430, -212560, 130468, -92420, -67516, -256516, -105164, -119644, -88297, -52289, -245951, -145976, 239393, 41945, -72746, -109625, -259729, 5850, 7658, -169090, -43131, -12878, -8136, -477901, 51903, -38894, 40906, 227580, 109624, -74104, -135155, -184464, -7377, -91044, -89713, -39487, 227711, 168375, 332764, -162686, -73847, -143977]
9257a43977j1959F1842h9045J5819B9407b49308B11618K928i7822p0282A84312
9245a88874m5348e3126F7350J9383a14623m1373O206f0969I5407a06194J2742
9234i3452p6915b9848n28625e359j83425q6998J34495B3232a93438f8970j04842
9223a73812P5138B17652a69962B0944c7034A8231J05158a58476B37793n3960G2924
9211A77111c26866B84660a6445B82082b99105M6809p8076a61293E00269b6490
9200A0880J18436f5527a2119A11458B4220J49089b72133a11904k70561a59281
9189d6208J2367D2965k982b29B283i5515j4207n5109H5037a08569c7960A30907
9176D1882a11897e3384m4866d8921K0331A36998J82216a30297A55561a81609A53754
$$ y = [-143977, -155936, 61842, -89045, -73226, 29407, -249308, 211618, 214546, -97822, -168104, 184312, -188874, -234222, -53126, 67350, 86733, -114623, -155996, -149790, -60969, 95407, -106194, -93452, -170367, -29848, -558473, -5359, -188784, -275782, -141287, 23232, -193438, -68970, -173812, -98674, 217652, -169962, 20944, -37034, 18231, 123389, -158476, 237793, 183833, 72924, 177111, -326866, 284660, -16445, 282082, -299105, -252296, -330372, -161293, 500269, -26490, 10880, 129316, -65527, -12119, 111458, 24220, 173309, -272133, -111904, -382465, -159281, -46208, -33841, 42965, 39983, -229, 2283, -95515, -109722, -164831, 85037, -108569, -37960, 130907, 41882, -111897, -53384, -98250, -48921, -28590, 136998, 319214, -130297, 155561, -181609, 153754]
9164b5959R413j58744e6979r1240k1664E7429b15253E710Q777a08539B1265e2589
9151c48465B02476C4726c19368B08233f4828D6605c02908b22A17770d06177a62190
9139b12390N6927B4943b8321j44515B11249b11739j3013B6740b73311B09768C6961
9127b9140j50588I0330b1210l37931f2115o8596B3053J8561q649b68955Q8313
9116a80642a4416j37554d6445j30117L4454j97359h2072c0555Q300j30060f4551
9104a09839N2151q1432C62148j26568h8519a2755A8275b26425d718D663h1525
9092A8035K6740a98591f1902p3222j41799J11640k1023e9660o7195A44734c20928
9080G7401g3411j61487R2740D3258b69898a01518B45092a27850E9412a80876J4522
$$ y = [-25959, -16546, -175290, -56979, -148219, -169883, 57429, -215253, 5710, 14487, -108539, 21265, -52589, -348465, 202476, 34726, -319368, 208233, -64828, 46605, -302908, -222, 117770, -406177, -162190, -212390, -155463, 24943, -28321, -172836, 211249, -211739, -224752, 26740, -273311, 209768, 36961, -29140, -179728, 90330, -21210, -359141, -62115, -130711, 23053, 41614, 32965, -268955, -180642, -14416, -151970, -46445, -176562, -142108, -339467, -82072, -30555, -22255, -152315, -64551, -109839, -57688, -139120, 362148, 235580, -88519, -12755, 18275, -226425, -4718, 4663, -81525, 18035, 44775, -198591, -61902, -135124, -276923, -165283, -186306, -59660, -126855, 144734, -320928, 77401, -73411, -234898, -142158, 43258, -269898, -101518, 245092, -127850, 59412, -180876, -166354]
9069a66354A06890J66610a32734C710A563c27267A63521a80886A90963b32767
9058A45714l5638e7576A78179n9423a24903E3565a89376k2009D873d68755g9870
9046C19716O2697d7142B96120e3630j99190N0612j7746l1229M9196r0850i1356
9034A03509b5674A36136b61683n9007h1656j0508l776D1820k733a21247o517j04541
9022b32305g109B02157B4223J89867p1571a79340A94518b74851i8911k13043e3999
9010B2223a77902B62911h1489B27865a96049e9340j26560O346C7753a11919q8158
8999b00077l1267H3882P7672a14439c6269A10745d3265D4785b54200h6910Q34
8988h6076n2633A42626a99950o3337K7020k7334h0947r7926a3812k11409I9263
$$ y = [-166354, 106890, 273500, -132734, 3710, 1563, -327267, 163521, -180886, 190963, -232767, 145714, 110076, -57576, 178179, 118756, -124903, 53565, -189376, -211385, 4873, -468755, -79870, 319716, 382413, -47142, 296120, -53630, -252820, -202208, -219954, -251183, -201987, -292837, -91356, 103509, -25674, 136136, -261683, -320690, -81656, -92164, -95940, 41820, 39087, -121247, -127764, -232305, -7109, 202157, 24223, 214090, 142519, -179340, 194518, -274851, -98911, -311954, -53999, 22223, -177902, 262911, -81489, 227865, -196049, -59340, -185900, -179554, 37753, -111919, -200077, -231344, 83882, 161554, -114439, -36269, 110745, -43265, 44785, -254200, -86910, -86076, -138709, 142626, -199950, -263287, -236267, -263601, -80947, -178873, -13812, -225221, 99263]
8976a48133k12379F1297a50215d5702p4461B40656a72338a5650k05862C253b87824
8964H9253h580r1971k88780c9464j12448D6961R8871c19063i646B4644c36210
8952g2438j16861o1853G6113J54082b13725K5792B1861K37321a88934R1274A32953
8940a52512H299f6468A35887C8336f8541P901m0427A40814n5560l7288B1889F835
8927C491J1241e3289n2460A56258M10808P51776J021817H17738f3021A66418b20229
8915F4522f5684j24372N8997j05674A43141a0474m0148A79913L07233A89089a80139
8903a91014A89368g7679k11780C020h645j67271M3188j09336C2870b64325D8467
8891d041n2598k19730a36332c1773j61103A06687k1142e743B35652c2672G7151
$$ y = [-148133, -360512, 61297, -150215, -45702, -120163, 240656, -172338, -15650, -221512, 3253, -287824, 89253, -8580, -100551, -389331, -39464, -151912, 46961, 145832, -319063, -9646, 24644, -336210, -72438, -189299, -251152, 76113, 230195, -213725, -187933, 21861, 259182, -188934, -97660, 132953, -152512, 8299, -66468, 135887, 38336, -68541, -60640, -101067, 140814, 85254, 47966, 21889, 6835, 3491, 14732, -53289, -105749, 156258, 567066, 1318842, 2340659, 817738, -63021, 166418, -220229, 64522, -65684, -190056, -131059, -236733, 143141, -10474, -50622, 179913, 487146, 189089, -180139, -191014, 189368, -77679, -289459, 3020, -8645, -175916, -132728, -242064, 32870, -264325, 48467, -4041, -56639, -276369, -136332, -31773, -192876, 106687, 85545, -5743, 235652, -32672, 77151]
8879A17563e516B4987a77179e7624B64955r6114c03462L9430K3615d0227k02154
8868b42381B82258h5236b7702r8617j95362e5156A33906b6758H088K89227o4726
8857B32589a66843j63860J45899b3243o6943b2368F0970b24059A38297b81033
8846C00770b786j62051B9918J17420c21033A23859b29273K7705h4994H3101c1688
$$ y = [117563, -5516, 24987, -177179, -57624, 264955, 168841, -303462, -264032, -240417, -40227, -242381, 282258, -85236, -27702, -126319, -321681, -55156, 133906, -26758, 8088, 297315, 232589, -166843, -330703, -184804, -23243, -90186, -22368, 60970, -224059, 138297, -281033, 300770, -2786, -164837, 29918, 147338, -321033, 123859, -229273, -201568, -84994, 83101, -31688]
$$ [...]
##END NTUPLES=NMR SPECTRUM
##END=
