##TITLE=AC1440_SSAAH13249_7790636_gdzuSHX3Wd
##JCAMPDX= 6.0         $$ Bruker NMR JCAMP-DX V2.0
##DATA TYPE= NMR SPECTRUM
##DATA CLASS= NTUPLES
##ORIGIN= BRUKER
##OWNER= Administrator
$$ 1.72 TOPSPIN		Version 2.1
$$ 2013-04-17 02:17:36.862 -0700  Administrator@X
$$ Compression mode = diff/dup
##.OBSERVE FREQUENCY= 400.02188249412
##.OBSERVE NUCLEUS= ^1H
##.ACQUISITION MODE= SIMULTANEOUS (DQD)
##.ACQUISITION SCHEME= undefined
##.AVERAGES= 8
##.DIGITISER RES= 22
##SPECTROMETER/DATA SYSTEM= spect
##.PULSE SEQUENCE= zg30
##.SOLVENT NAME= COFFEE_meoh
##.SHIFT REFERENCE= INTERNAL, COFFEE_meoh, 1, 14.98509
##AUDIT TRAIL= $$ (NUMBER, WHEN, WHO, WHERE, PROCESS, VERSION, WHAT)
$$ ##TITLE= Audit trail, TOPSPIN		Version 2.1
$$ ##JCAMPDX= 5.01
$$ ##ORIGIN= Bruker BioSpin GmbH
$$ ##OWNER= Administrator
$$ $$ E:\/data/COFFEE/nmr/AC1440_SSAAH13249_7790636_gdzuSHX3Wd/10/pdata/1/auditp.txt
$$ ##AUDIT TRAIL=  $$ (NUMBER, WHEN, WHO, WHERE, PROCESS, VERSION, WHAT)
(   1,<2013-04-17 02:17:29.862 -0700>,<Administrator>,<X>,<go>,<TOPSPIN 2.1>,
      <created by zg
	started at 2013-04-17 02:16:23.659 -0700,
	POWCHK enabled, PULCHK disabled,
       configuration hash MD5:
       33 CF 6A 21 5C D3 B9 40 6C 15 AA 8D 27 A2 4F 13
       data hash MD5: 64K
       B6 8D ED 13 BD 3C 60 1E 8F 41 01 7A 86 2A 8D 0F>)
(   2,<2013-04-17 02:17:32.862 -0700>,<Administrator>,<X>,<proc1d>,<TOPSPIN 2.1>,
      <Start of raw data processing
       efp LB = 0 FT_mod = 6 PKNL = 1 PHC0 = 0 PHC1 = 0 SI = 32K 
       data hash MD5: 32K
       10 4F 9D 36 35 91 0F 8C 5E 10 CA 32 DF E4 3F 8E>)
(   3,<2013-04-17 02:17:33.190 -0700>,<Administrator>,<X>,<proc1d>,<TOPSPIN 2.1>,
      <pk PHC0 = 99.86023 PHC1 = 0 
       data hash MD5: 32K
       6E 88 9E C6 28 EC 7A 35 86 7A 62 49 BC D0 69 E9>)
(   4,<2013-04-17 02:17:33.299 -0700>,<Administrator>,<X>,<proc1d>,<TOPSPIN 2.1>,
      <abs ABSG = 1 
       data hash MD5: 32K
       6C F2 40 32 25 DC C2 E8 43 60 B3 88 38 AB 04 4D>)
(   5,<2013-04-17 02:17:33.362 -0700>,<Administrator>,<X>,<proc1d>,<TOPSPIN 2.1>,
      <abs ABSG = 2 
       data hash MD5: 32K
       93 61 C1 72 7F A2 B9 D9 75 5D D6 7A 93 EE 71 D0>)
(   6,<2013-04-17 02:17:33.424 -0700>,<Administrator>,<X>,<proc1d>,<TOPSPIN 2.1>,
      <abs ABSG = 3 
       data hash MD5: 32K
       AB 7C 4E 90 01 41 F9 8E 8E 1C 45 55 8B E0 49 3A>)
(   7,<2013-04-17 02:17:33.502 -0700>,<Administrator>,<X>,<proc1d>,<TOPSPIN 2.1>,
      <abs ABSG = 4 
       data hash MD5: 32K
       07 74 4A F0 48 8A C7 83 DD 30 C8 A1 54 02 4D E3>)
(   8,<2013-04-17 02:17:33.549 -0700>,<Administrator>,<X>,<proc1d>,<TOPSPIN 2.1>,
      <abs ABSG = 5 
       data hash MD5: 32K
       6F D3 9C 8F 0F 21 B3 47 1B C7 44 97 A7 8B C8 AA>)
$$ ##END=
$$ 
$$ $$ hash MD5
$$ $$ D5 49 56 DD 2E 0D 06 19 18 BE E9 C1 A8 80 C5 12
##$RELAX= 
##$RELAX= 
##$RELAX= 
##$RELAX= 
##$RELAX= 
##$RELAX= 
##$RELAX= 
$$ Bruker specific parameters
$$ --------------------------
##$DU= <E:\>
##$EXPNO= 10
##$NAME= <AC1440_SSAAH13249_7790636_gdzuSHX3Wd>
$$ [...]
150 150 150 150 150 150 150 150
##$TP07= 0
##$TPNAME0= <>
##$TPNAME1= <>
##$TPNAME2= <>
##$TPNAME3= <>
##$TPNAME4= <>
##$TPNAME5= <>
##$TPNAME6= <>
##$TPNAME7= <>
##$TPOAL= (0..7)
0.5 0.5 0.5 0.5 0.5 0.5 0.5 0.5
##$TPOFFS= (0..7)
0 0 0 0 0 0 0 0
##$TUNHIN= 0
##$TUNHOUT= 0
##$TUNXOUT= 0
##$USERA1= <user>
##$USERA2= <user>
##$USERA3= <user>
##$USERA4= <user>
##$USERA5= <user>
##$V9= 5
##$VALIST= <valist>
##$VCLIST= <CCCCCCCCCCCCCCC>
##$VD= 0
##$VDLIST= <DDDDDDDDDDDDDDD>
##$VPLIST= <PPPPPPPPPPPPPPP>
##$VTLIST= <TTTTTTTTTTTTTTT>
##$WBST= 2048
##$WBSW= 25
##$XGAIN= (0..3)
0 0 0 0
##$XL= 0
##$YL= 0
##$YMAX_a= 617960
##$YMIN_a= -526256
##$ZGOPTNS= <>
##$ZL1= 120
##$ZL2= 120
##$ZL3= 120
##$ZL4= 120
##$ABSF1= 14.98509
##$ABSF2= -5.573092
##$ABSG= 5
##$ABSL= 3
##$ALPHA= 0
##$AQORDER= 0
##$ASSFAC= 0
##$ASSFACI= 0
##$ASSFACX= 0
##$ASSWID= 0
##$AUNMP= <proc_prof1d_extract_pilot.lims>
##$AXLEFT= 0
##$AXNAME= <>
##$AXNUC= <1H>
##$AXRIGHT= 0
##$AXTYPE= 0
##$AXUNIT= <>
##$AZFE= 0.1
##$AZFW= 0.1
##$BCFW= 0
##$BC_mod= 0
##$BYTORDP= 0
##$COROFFS= 0
##$CY= 15
##$DATMOD= 1
##$DC= 0
##$DFILT= <>
##$DTYPP= 0
##$F1P= 0
##$F2P= 0
##$FCOR= 0.5
##$FTSIZE= 32768
##$FT_mod= 6
##$GAMMA= 0
##$GB= 0
##$INTBC= 1
##$INTSCL= 1
##$ISEN= 128
##$LB= 0
##$LEV0= 0
##$LPBIN= 0
##$MAXI= 10000
##$MC2= 0
##$MEAN= 0
##$ME_mod= 0
##$MI= 0
##$NCOEF= 0
##$NC_proc= -8
##$NLEV= 6
##$NOISF1= 0
##$NOISF2= 0
##$NSP= 0
##$NTH_PI= 0
##$NZP= 0
##$OFFSET= 14.98509
##$PC= 1
##$PHC0= 99.86023
##$PHC1= 0
##$PH_mod= 1
##$PKNL= yes
##$PPARMOD= 0
##$PPDIAG= 0
##$PPIPTYP= 0
##$PPMPNUM= 2147483647
##$PPRESOL= 1
##$PSCAL= 4
##$PSIGN= 0
##$PYNMP= <proc.py>
##$REVERSE= no
##$SF= 400.02
##$SI= 32768
##$SIGF1= 0
##$SIGF2= 0
##$SINO= 400
##$SIOLD= 32768
##$SPECTYP= <>
##$SREGLST= <1H.CDCl3>
##$SSB= 0
##$STSI= 32768
##$STSR= 0
##$SW_p= 8223.68421052631
##$SYMM= 0
##$S_DEV= 0
##$TDeff= 65536
##$TDoff= 0
##$TI= <>
##$TILT= no
##$TM1= 0
##$TM2= 0
##$TOPLEV= 0
##$USERP1= <user>
##$USERP2= <user>
##$USERP3= <user>
##$USERP4= <user>
##$USERP5= <user>
##$WDW= 1
##$XDIM= 32768
##$YMAX_p= 437089982
##$YMIN_p= -735780
##$CURPLOT= <Network HP LaserJet P1505>
##$CURPRIN= <$Network HP LaserJet P1505>
##$DFORMAT= <normdp>
##$LAYOUT= <+/1D_H.xwp>
##$LFORMAT= <normlp>
##$PFORMAT= <normpl>
##$SURQMSG= 1
$$ End of Bruker specific parameters
$$ ---------------------------------
##NTUPLES= NMR SPECTRUM
##VAR_NAME=  FREQUENCY,     SPECTRUM/REAL,   SPECTRUM/IMAG
##SYMBOL=    X,             R,               I
##VAR_TYPE=  INDEPENDENT,   DEPENDENT,       DEPENDENT
##VAR_FORM=  AFFN,          ASDF,            ASDF
##VAR_DIM=   32768,         32768,           32768
##UNITS=     HZ,            ARBITRARY UNITS, ARBITRARY UNITS
##FACTOR=    0.250966925370066, 1,           1
##FIRST=     8223.43324360094, -263259,      -148517
##LAST=      0,             -66429,          -221808
##MIN=       0,             -735780,         0
##MAX=       8223.43324360094, 437089982,    0
$$ Real data points
##PAGE= N=1
##DATA TABLE= (X++(R..R)), XYDATA
$$ [...]
19564A06632f6215k52874B07095H3544d36480a69631k81685D1052g4437K3692
19554e0745q172A54963R2504N2241a18709r4520i8156H1463c59893J03127g1909
19542a30853H849a50051k66162i2233A17674d9124G4959b53093A41656k2951h1598
19530d1833C07355b05876R5124d6294k0771j175j71078H9556m3271c05213c2829
19518C1311B567K3096J4863a31621n9925L7037B73840i9764k19154R8561K3068
19507a97289a7292A10580l077J48923j12282b45351B962a59259j35509a5299o6109
19496h1408A42917b2725A71126h1787A11713l1147B1118f4393K663j16460L9295
19485a38895p3855A65257B0603e1507l6287k98300J50182D01528D3739M33112
$$ y = [106632, -66215, -319089, 207095, 83544, -436480, -169631, -451316, 41052, -74437, -50745, -58917, 154963, 247467, 299708, -118709, -213229, -98156, 81463, -359893, -256766, -71909, -130853, 8849, -150051, -416213, -92233, 117674, -49124, 74959, -253093, 141656, 118705, -81598, -41833, 307355, -205876, -110752, -46294, -67065, -68240, -239318, 89556, 46285, -305213, -32829, 31311, 2567, 25663, 40526, -131621, -191546, -154509, 273840, -99764, -318918, -220357, -197289, -17292, 110580, 107503, 256426, 144144, -245351, 2962, -159259, -294768, -15299, -81408, 142917, -22725, 171126, -81787, 111713, 80566, 21118, -64393, -61730, -178190, -138895, -212750, 165257, 20603, -51507, -87794, -386094, -235912, 401528, 43739, 476851]
19475D76851F0243a70370k33129A297K27240B7078L2524K40416H7034b63635O9228
19464a94407F39a27630A22718a09551c2547I8126b22998q8213F6650c08787h5611
19452b72944H5676e14370a18690H9485a63422K5250A00480f27622B01286c7642
19441c19790J49648C1974a26170r9467a5154I5117L23419j26675C6056b69301
19430c2028j61510j58239O7018B0870K814b26350Q5981C0976a53768A89893n1079
19419A38814a36770p6422B33859B3887R8453J3234d57578J35629l1964B19087
19408c2163p2464r0555K6977A20343a46182q9608G0853J71079d4226A4053c25446
19396b23421e5248B19697C545M0506M35026A731b2182C5399J57459A3413b4211
$$ y = [476851, 60243, -170370, -403499, 1297, 228537, 27078, 59602, 300018, 87034, -263635, -194407, 639, -127630, 122718, -109551, -32547, 98126, -222998, -311211, 66650, -308787, -85611, -272944, 85676, -514370, -118690, 89485, -163422, -138172, 100480, -627622, 201286, -37642, -319790, -170142, 31974, -126170, -225637, -15154, 95117, 418536, 291861, 36056, -269301, -32028, -193538, -351777, -284759, 20870, 23684, -226350, -140369, 30976, -153768, 189893, 138814, -136770, -213192, 233859, 23887, 122340, 135574, -457578, -321949, -353913, 219087, -32163, -104627, -195182, -168205, 120343, -146182, -235790, 70853, 241932, -44226, 14053, -325446, -223421, -55248, 219697, 3545, 44051, 479077, 1731, -22182, 35399, 192858, 13413, -24211]
19384b58704h0150k69362B3961a79250M6572m1972k084B99547a27796o0008j7382
19373b05186A08414c2675E7638L4403j1414c667r3511F0201B6569A0328K15786
19362B26114b58216q2496A4252a56089C05391a11404k0120D88622A62614a39473
19351a81832c4566F3212c05949F3086b68441i3811A16727K0570c125r0413p26
19340i4264b4551l08900J25408A7283e7140m5792o9843L9168M3280B02166b58745
19328a63411A0159e2617j1202A2701a28625J1672B8856Q1085d559J419j34317
19317a37457f3098C36404a88720N3051k32327J11396A34799b92644J26305k3053
19307a89392G933a28031J754c0987C97764a57773A00698a59438N7412j05669F4138
$$ y = [-258704, -80150, -349512, 23961, -179250, -132678, -174650, -176734, 299547, -127796, -187804, -205186, 108414, -32675, 57638, 92041, 80627, -3667, -97178, 60201, 26569, 10328, 226114, -258216, -340712, 14252, -156089, 305391, -111404, -131524, 488622, 162614, -139473, -181832, -34566, 63212, -305949, 63086, -268441, -93811, 116727, 137297, -3125, -93538, -94264, -24551, -333451, -208043, 17283, -57140, -102932, -172775, -133607, -90327, 202166, -258745, -163411, 10159, -52617, -63819, 12701, -128625, -116953, 28856, 109941, -4559, -3140, -137457, -63098, 336404, -188720, -135669, -367996, -256600, 134799, -292644, -166339, -189392, 7933, -128031, -126277, -30987, 397764, -157773, 100698, -159438, -102026, -207695, 64138]
19295f9987j58760F2245a54105B44395a21842A84941G9733a26842A30150b42670
19284A47333f3125B5762a11714A72M3327k1208K62710a70066j38576a42229e4318
19272A47357D7189a30330b2589A88394a17313A28936b72284K6715A28862b32689
19261f2702q4210k79280a54005H7641a15907a949j13366A65220a54033C694L981
19250G675a20424r6109b2171k65973J33224k14402J13630c4355q7641B43199d24237
19238c43937a43234A60614d1255B45289I4235L4777M4766e8373F1879b34328N3137
19227a81191a656l49656C14108E1102b08927I2733a30801j42310L9217c6284l82066
19216d18350l1810a53295l48850b08224a2857j24215A39082J47797b52296f0395
$$ y = [-69987, -228747, 62245, -154105, 244395, -121842, 184941, 79733, -126842, 130150, -242670, 147333, -63125, 25762, -111714, 172, 43499, 22291, 285001, -170066, -308642, -142229, -54318, 147357, 47189, -130330, -22589, 188394, -117313, 128936, -272284, -245569, 128862, -232689, -62702, -146912, -426192, -154005, 87641, -115907, -1949, -115315, 165220, -154033, 3694, 7675, -120424, -216533, -22171, -288144, -154920, -369322, -255692, -34355, -121996, 243199, -424237, -343937, -143234, 160614, -41255, 245289, 94235, 129012, 173778, -58373, 61879, -234328, -181191, -1656, -351312, 314108, 51102, -208927, 92733, -130801, -273111, -233894, -36284, -418350, -450160, -153295, -502145, -208224, -12857, -137072, 139082, 286879, -252296, -60395]
19205e4308k8971j62672a03576A1885g8813m08922e6246l6859A1785g7308C7006
19193B83992j28612h929l48518B3890g5680A00309e2805j88703B85161c933o3656
19182f7589n9016c0112h867m113j9729A75350N2240G5714g5266r1439L283L5430
19170a27992j53331j0624B3803R8810p30c85146A0542a2894j73654N6111r2902
19159b23339n5779J23594F7307c15165J37469P6646d2774n5111j33660B9973a23473
19147e9382k21116c6202n1027A83410B4152a71627f7386B21271b5936D9575a86060
19135c5392D0061c39937g2239L4809A83592q0269d5177B6101P0729f6542m1120
19124a07662A25290A7337a51486j24533g0454A39515F9188c87441A31089d2290
$$ y = [-54308, -83279, -245951, -103576, 11885, -78813, -487735, -56246, -93105, 11785, -77308, 37006, 283992, 155380, -8929, -357447, 23890, -75680, 100309, -52805, -241508, 285161, -3933, -67589, -126605, -30112, -8867, -12980, -32709, 175350, 227590, 75714, -75266, -166705, -163422, -127992, -281323, -291947, 23803, 122613, 121883, -385146, 10542, -12894, -186548, -130437, -223339, -279118, -155524, 67307, -315165, -177696, -101050, -42774, -97885, -231545, 29973, -123473, -59382, -280498, -36202, -87229, 183410, 24152, -171627, -67386, 221271, -25936, 49575, -186060, -35392, 40061, -339937, -72239, -37430, 183592, 103323, -45177, 26101, 96830, -66542, -107662, 125290, 17337, -151486, -276019, -70454, 139515, 69188, -387441, 131089, -42290]
19113a69193L1667e9590k7857k5392r1481A21002A6730M4256a21962A03150L8351
19102A41501b6851D492J31879a93042Q9945A51267i6152C03103a86504A90357
19091A73780a04078L1018j18114H2788b08624F6768a00741n0011n4753A7822a13598
19079F4082a93575l3820J5866j02114i6250a1336p100l85721J90630a8528p5167
19068i3695R113A9230b5983n4018j34306B51057a19226j06072j37399J25786P4809
19057a62102p3656g2553m7424a4105B1215b83991L9769d5299j91717J15254A42281
19045a0425A08831a86193I7766J81814a02741I3525h0780a8260A7995f718B88323
19033a26048A06862a72454m3996B19243K43572h0818b4690A82709b38400L1327
$$ y = [-169193, -137526, -59590, -87447, -112839, -204320, 121002, 16730, 60986, -121962, 103150, 141501, -26851, 4492, 136371, -193042, -103097, 151267, -96152, 303103, -186504, 190357, 173780, -104078, -73060, -191174, 82788, -208624, 66768, -100741, -150752, -205505, 17822, -113598, 64082, -193575, -227395, -211529, -313643, -96250, -11336, -18436, -404157, -213527, -18528, -93695, -84582, 19230, -25983, -80001, -214307, 251057, -119226, -225298, -362697, -236911, -162102, -235758, -72553, -119977, -14105, 21215, -283991, -244222, -45299, -237016, -121762, 142281, -10425, 108831, -186193, 97766, 279580, -102741, 93525, -80780, -18260, 17995, -6718, 288323, -126048, 106862, -172454, -216450, 219243, 462815, -80818, -24690, 182709, -238400, -207073]
19023b07073O8865n4453A71249Q0196a52535A64247e9185b3321n767k20250j3861
19012b63199j488d553m3030B19886b37600B28969a51158K1194o8559D4316b9368
19000b85207o8154H3053n437k0269O2095d1972j50315B44214d07091A04012a79572
18988c0247k96191M3346a41007B7108J72095a8182o1975a9131m7788B3516K18581
18977B42097C2386N845a03843A21642a15077p1861M6205O7278C5244c1079m3119
18966g4198f824p3411j14324i4965k79167D36292A06365a03536B46113A2762J39212
18955A51974c28378I4011P292D308a31786L2639B9195L7277b40468D7020c0409
18943A32201L6699D6781Q5637F6000M3993B5237c07719a09307r00B72939c33374
$$ y = [-207073, -138208, -192661, 171249, 251445, -152535, 164247, -59185, -23321, -29088, -249338, -263199, -264687, -4553, -47583, 219886, -237600, 228969, -151158, -129964, -198523, 44316, -29368, -285207, -353361, 83053, 77616, 57347, 119442, -41972, -192287, 244214, -407091, 104012, -179572, -30247, -326438, -283092, -141007, 27108, 199203, -18182, -80157, -19131, -66919, 23516, 242097, 32386, 38231, -103843, 121642, -115077, -186938, -140733, -73455, 35244, -31079, -74198, -6824, -80235, -194559, -94965, -374132, 436292, 106365, -103536, 246113, 12762, 151974, -328378, 94011, 101303, 4308, -131786, -99147, 29195, 66472, -240468, 47020, -30409, 132201, 168900, 46781, 132418, 66000, 109993, 25237, -307719, -109307, -110207, 272939, -333374]
18931h7843j97513f5720k00388j70209C46756b86267d7870C24072A06207b95145
18920B2552M5479h1269n6259B25394a77521r6826k44794B02394b17405A43819
18909B64468d06019a26380B19407a14878E1944o291l888b96796a00148j90465
18899b90613R828e946l4309n0198l10808i4629g246n09026A69125F4189g8203
18887d3706o9570H7227e5987A2347Q4923m4752e8552B8247a05932A78576a8342
18875a49532m0775h0650a636n6271j01973C2935a91118C36317a54968k9821C56387
18863A49372c10084i52C4813J974c94118a86049g7591a0892A45924c20720f6222
18851c9197B98731a53437A81000M0132n9070J00726a65502h221j37126L3526j2360
$$ y = [-87843, -285356, -65720, -266108, -436317, 346756, -286267, -47870, 324072, 106207, -295145, 22552, 68031, -81269, -137528, 225394, -177521, -274347, -519141, 202394, -217405, 143819, 264468, -406019, -126380, 219407, -114878, 51944, 45653, 41765, -296796, -100148, -290613, -280785, -5946, -40255, -90453, -401261, -94629, -7246, -516272, 169125, 64189, -78203, -43706, -113276, 87227, -55987, 12347, 97270, 52518, -58552, 28247, -105932, 178576, -18342, -149532, -190307, -80650, -1636, -57907, -159880, 32935, -191118, 336317, -154968, -184789, 356387, 149372, -310084, -952, 34813, 36787, -394118, -186049, -77591, -10892, 145924, -320720, -66222, -39197, 298731, -153437, 181000, 221132, 162062, 262788, -165502, -8221, -145347, -111821, -124181]
18840a24181M5539A11696a60956q6053h7464j25909g4446A19642Q9340k7526a4466
18828d0598D0652L4281b57643A8565a91141B0227g6918j85221H58e19q3468l3008
18816a16995j94346A20087a03959A52178a59470A62276g5410A34181m4315J86036
18806B75902e7338A42951g951A6667a74393b9866l24725M560J0126A49244a74562
18794b74123B15661a32563B10346h1925j1771B8704i5847B9003h6638a1923G7688
18782g0487a4805G4218i6329K838b6862p8206o0193B470b48581B10893E4034b03111
18769c7637k7741H9003b70905J22536C15912B2243b07517D57131i3635p7192e457
18757c72369L4973d9113C2558J14491C5156a73026A70781i7478A40871c770n88066
$$ y = [-124181, -78642, 111696, -160956, -247009, -87464, -213373, -74446, 119642, 208982, 181456, -14466, -40598, 40652, 74933, -257643, 18565, -191141, 20227, -76918, -262139, 858, -519, -83987, -116995, -311341, 120087, -103959, 152178, -159470, 162276, -75410, 134181, 89866, 275902, -57338, 142951, -7951, 16667, -174393, -29866, -354591, -350031, -339905, 149244, -174562, -274123, 215661, -132563, 210346, -81925, -93696, 28704, -95847, 29003, -86638, -11923, 77688, -70487, -14805, 74218, -96329, -93491, -26862, -105068, -165261, 2470, -248581, 210893, 54034, -203111, -37637, -65378, 89003, -270905, -148369, 315912, 22243, -207517, 457131, -93635, -170827, -5457, -372369, -337396, -49113, 32558, 147049, 35156, -173026, 170781, -97478, 140871, -3770, -591836]
18746e91836a63386n5868B02603I4758L4128h9048H8830K1607i9712o5295f3364
18734B31292a56753B11747a84838g443j05134K5889q3354k10931D1182K8778L2911
18723A02871h5731M0450j83043L0262L8126m4646B53337a11397A70082c53700
18712A03019B0933c4457k62410J44146r5034a19096n3134I9644a11393p8728r621
18701a99742k11692a35786A04619B3136c39925f3350A51222o5314O3091B5734
18690F9583R2819b1058l08568a15432I4243J96344I5035j2249D387a32165M3808
18679h8357a1601B3553M0157d01318B0845i5987o5005k16452a9801j110g255B14794
18666f8155B07109c24155A21755h3368B05660E7151k2741e2545l6489p1877A25209
$$ y = [-591836, -163386, -219254, 202603, 94758, 128886, -89048, 88830, 110437, -99712, -165007, -63364, 231292, -156753, 211747, -184838, -7443, -112577, -86688, -170042, -380973, 41182, 69960, 102871, -85731, -45281, -228324, -198062, -159936, -204582, 253337, -111397, 170082, -353700, 103019, 20933, -34457, -296867, -152721, -247755, -119096, -172230, 99644, -111393, -190121, -199742, -411434, -135786, 104619, 23136, -339925, -63350, 151222, 85908, 148999, 25734, 69583, 162402, -21058, -329626, -115432, 94243, 290587, 95035, 82786, 4387, -132165, -88357, -11601, 23553, 63710, -401318, 20845, -95987, -160992, -377444, -19801, -20911, -7255, 214794, -68155, 207109, -324155, 121755, -83368, 205660, 57151, 34410, -52545, -89034, -160911, 125209]
18654F1489J05889c48905A15841J52331k0628C0772N7697J57187m2949a10724
18643b36186g5095j34499N4482j09D6769b26958J13072J3254b4658k7061a6604
18631G6028d7837r0195b4721k65735R2627o5330N1727D06410b05760a0200j01981
18620a12181j66486j0014i2202A42674f257j00057J8158o6195A69259a6128C02719
18608B24624a92224P3491B7431i9121B14222g9532J7603M985l3930k01152g1846
18596b98264B40290d8632r0719b4027j3520l17736A22762j5166g3526a5028A1079
18584F9804b24224j0467O3594C42504b55486A49532h8269C40296a60010D65901
18573C54828a28356B7933g4929f450m52559C0980c32252p4956A95649g6186j59600
$$ y = [61489, 167378, -348905, 115841, 268172, 247544, 30772, 88469, 245656, 202707, -110724, -236186, -75095, -209594, -155112, -155221, 46769, -226958, -113886, -100632, -24658, -51719, -16604, 76028, -47837, -138032, -24721, -290456, -197829, -263159, -211432, 406410, -205760, -10200, -112181, -278667, -288681, -92202, 142674, -6257, -106314, -88156, -154351, 169259, -16128, 302719, 224624, -192224, -118733, 27431, -99121, 214222, -79532, -61929, -56944, -90874, -292026, -71846, -298264, 240290, -48632, -139351, -24027, -37547, -355283, 122762, 107596, -73526, -15028, 11079, 69804, -224224, -234691, -171097, 342504, -255486, 149532, -88269, 340296, -160010, 465901, 354828, -128356, 27933, -74929, -6450, -459009, 30980, -332252, -407208, 195649, -76186, -235786]
18562b35786h7794K6300l42314a22839j65588i8787k0639k24413J47026h6800
18551b2646k3594k09643f5482n559j01113r7803f9825B4882O6162a27145H0929
18539A25350a62308j00620c8052A800a47224G5120h7807A5549P777a33144l1810
18528a64954n6482k8649C74497A09401a90222B8728c6387k55698a32521l2838
18518a65359G2076b60203e8084j24724d3526j93797A34872a80881O1499j4189
18508a33571c9653l6634B33460g7575k75423a8663k23769e1444B2753a68582A07773
18496d5631B3612m822O2313c31064J5827h4020A56441f5143k13832A71267h0583
18484A82052K6311d91404a610A62247a03466K6094B7872a92729k35M3895j32332
$$ y = [-235786, -87794, -61494, -403808, -122839, -288427, -98787, -119426, -343839, -196813, -86800, -22646, -46240, -255883, -65482, -71041, -172154, -269957, -69825, 24882, 91044, -127145, 80929, 125350, -162308, -262928, -38052, 1800, -147224, 75120, -87807, 15549, 23326, -133144, -164954, -221436, -250085, 374497, 109401, -190222, 28728, -36387, -292085, -132521, -165359, 72076, -260203, -58084, -182808, -43526, -237323, 134872, -180881, -119382, -133571, -39653, -76287, 233460, -77575, -352998, -18663, -242432, -51444, 22753, -168582, 107773, -45631, 23612, 18790, 81103, -331064, -315237, -84020, 156441, -65143, -278975, 171267, -80583, 182052, 208363, -491404, -1610, 162247, -103466, -77372, 27872, -192729, -192964, -149069, -281401]
18473b81401a12688j29462a06139N431k10880A41532J43390B9005J1250c05125
18462a68230B21934F2880K57480I3828a4181l13846B23552C716L6175c7301j66428
18451b03729L0477F587a55192j09006D168g1982j17904B12886a50676B64091e4865
18439f7181l75326B06570a78599C0144F308c9756F7138J1864e6545A25885B5751
18427B17780b45130O7635P3503j49370A68496e0587j10255H730K69501G832d6423
18415A95296b97575H0029e5n0762C1498K1664J2423b46140O884A16645d9035j59007
18403b08042G7289d1785D282Q6766a82174c493B3623h3919j54822L6754F9719
18391c24503a06916A37609i1504a6443r1252H7906a83314B17127b72334B07884
$$ y = [-281401, -112688, -242150, -106139, -100708, -311588, 141532, 284922, 29005, 40255, -305125, -168230, 221934, 62880, 320360, 93828, -14181, -328027, 223552, 3716, 39891, -37301, -203729, -173252, 6587, -155192, -264198, 4168, -71982, -189886, 212886, -150676, 264091, -54865, -67181, -442507, 206570, -178599, 30144, 6308, -39756, 67138, 79002, -56545, 125885, 25751, 217780, -245130, -177495, -103992, -253362, 168496, -50587, -160842, 8730, 278231, 7832, -46423, 195296, -297575, 80029, -55, -50817, 31498, 53162, 65585, -246140, -239256, 116645, -49035, -208042, 77289, -41785, 4282, 91048, -182174, -3493, 23623, -83919, -238741, -201987, 69719, -324503, -106916, 137609, -91504, -16443, -107695, 87906, -183314, 217127, -272334, 207884]
18380c01292A5743b41728j3468A01453P1713O0428D2673a40682H3177f9067A66833
18368g285j92352j8919b8973A73409J95814r0049i1629A40744c2208j28597I5610
18356a91713F2967K19731i0813a4763j29093H6067C3950d3329q2346k63674C3090
18344a8391j92095K2389k9978O7954C21308f3142j12485b9314k8102a133A01900
18332A61445a49519p8123B59727A4366c43681a47022A81773M0946B5588g9509
18321a74319N3791l08217a90562E2095g875j0510C34454J6355h8407k70662A29389
18309A7720b84377k0045J09792i3380A8464b374j11281B8536b07056b4270H7275
18297A20657K4229M0950a27481E11753a43388N7367B1770L40552b1812G565b90269
$$ y = [-301292, 15743, -241728, -255196, 101453, 173166, 233594, 42673, -140682, 83177, -69067, 166833, -7285, -199637, -218556, -28973, 173409, 369223, 279174, -91629, 140744, -32208, -160805, 95610, -191713, 62967, 282698, -90813, -14763, -143856, 86067, 33950, -43329, -125675, -389349, 33090, -18391, -210486, -188097, -218075, -150121, 321308, -63142, -175627, -29314, -57416, -1133, 101900, 161445, -149519, -227642, 259727, 14366, -343681, -147022, 181773, 222719, 25588, -79509, -174319, -120528, -428745, -190562, 52095, -7875, -18385, 334454, 350809, -88407, -359069, 129389, 17720, -284377, -304422, -194630, -93380, 18464, -2374, -113655, 28536, -207056, -24270, 87275, 120657, 144886, 185836, -127481, 511753, -143388, -86021, 21770, 362322, -21812, 7565, -290269]
18285c11674n8772d3971j31938k13520a42776k243A55567a30047A98031b15868
18274d3358n4029d8642B53604a73718a9561B36156a47281A17671M9591b61129
18263i884n3047A50702m858b7712n9596k4710C577e5131j61051J3965A33403a49324
18250d07069J77910C5981M7333L34148b27768A02524f3819I2886g0274b8374A68873
18238d2087m5475A03702B0123J99330J8124C4046a87412l2319R7831A98659k6360
18227A72299d6772E3718b0597A48501r7l6950c1684E7481g1928D0756d0163G6734
18214B60498g1791k72512m8736A49141a48610j04151B73277e9235p7633K5261
18204a11607K5831p8254f70j37395G5857g8762D8929a640j02685o980G747c59266
$$ y = [-311674, -370446, -43971, -175909, -389429, -142776, -145019, 155567, -130047, 198031, -215868, -43358, -97387, -48642, 253604, -173718, -19561, 236156, -147281, 117671, 167262, -261129, -9884, -62931, 150702, 145844, -27712, -87308, -112018, 3577, -55131, -216182, -202217, 133403, -149324, -407069, -229159, 35981, 83314, 417462, -227768, 102524, -63819, 92886, -70274, -28374, 168873, -42087, -87562, 103702, 20123, 219453, 237577, 34046, -187412, -219731, -121900, 198659, 172299, -46772, 53718, -20597, 148501, 148404, 111454, -31684, 57481, -71928, 40756, -40163, 76734, 260498, -71791, -344303, -393039, 149141, -148610, -252761, 273277, -59235, -136868, -111607, -85776, -164030, -670, -138065, 75857, -78762, 48929, -1640, -104325, -111305, 7747, -359266]
18191a34043j17763I5248a17532j8380j70677f9987j93588Q6046A59124b87119
18180a44421A48201J359J51343e3134a3224j17860r0263R241e0847C8902i635
18168E0455K08497b72836j023B47209a24431E7802Q3116a61174N8009l24276e7061
18156A76541b9176j23348B14313b80514c8656k71006h8570c3042A832d7143E5773
18144e91157a51591c6752j48028E4820O6439n0357G3J1125a9036A05000c32069
18132a07071r1530k4851B82543A28084a13966A81147C9787b6771C3315J25546
18122A58861B0843c65868B20489a20775e7283q0487I9812d00986a74534C282a018
18110a0292j56143A38133b51122B39496p3314b2924A88469b21817P573P7131O0632
$$ y = [-134043, -251806, 95248, -117532, -135912, -306589, -69987, -263575, -177529, 159124, -287119, -144421, 148201, 149560, 300903, -53134, -13224, -131084, -221347, -212106, -50847, 38902, -9635, 50455, 258952, -272836, -273859, 247209, -124431, 57802, 140918, -161174, -103165, -427441, -57061, 176541, -29176, -152524, 214313, -280514, -38656, -309662, -88570, -33042, 1832, -47143, 55773, -591157, -151591, -36752, -184780, 54820, 121259, 70902, 73, 11198, -19036, 105000, -332069, -107071, -198601, -223452, 282543, 128084, -113966, 181147, 39787, -26771, 33315, 158861, 20843, -365868, 220489, -120775, -57283, -137770, 99812, -400986, -174534, 3282, -1018, -10292, -166435, 138133, -251122, 239496, 166182, -22924, 188469, -221817, -214244, -137113, -76481]
18099g6481j6355a7166E3618b04923i3737j67099p1703d5703A07368b24212a5304
18087c16968A1054b18131e1493j37211j12895b3825j02228C33482h2189a0832
18076a18437E2963f422j71782l04015A71812g9312A69771i2597I5655k3175b24618
18064a76247o0050A93629q2946C9792B616a05500o3914n0095J01145o6248G5111
18052a25168D9643a18176a1360B79166e9251a3277j36540K3052A28428a79599
18041c5049G5294a64730c4200q0839G0363i601G0147J73495A08777J7282R1615
18030B17674q4157a4960k35146A6650J07696b37235F3437j6987d1086j00136j20188
18019b61410A21015a63131a6099l19885J19339p7065o9351b9426j46356G3961
$$ y = [-76481, -92836, -17166, 53618, -204923, -93737, -260836, -332539, -45703, 107368, -224212, -15304, -316968, 11054, -218131, -51493, -188704, -301599, -23825, -126053, 333482, -82189, -10832, -118437, 52963, -6422, -178204, -482219, 171812, -79312, 169771, -92597, 95655, 72480, -224618, -176247, -236297, 193629, 110683, 39792, 2616, -105500, -169414, -219509, -118364, -184612, 75111, -125168, 49643, -118176, -11360, 279166, -59251, -13277, -149817, -126765, 128428, -179599, -35049, 75294, -164730, -34200, -115039, 70363, -9601, 70147, 243642, 108777, 126059, 217674, 133517, -14960, -250106, 16650, 124346, -237235, 63437, 46450, -41086, -141222, -261410, 121015, -163131, -16099, -335984, -216645, -293710, -363061, -29426, -175782, 73961]
18008A14639b27416D2741b73234c0772k26251g5682q2713l2252M8326q2580B71921
17996I1687f3912B20753c51140g4070B12245a77144M5737j01488D0093a82914
17985g5189j8989B11323h9640k70375B00256i1546K5143j36467a4451B43801j3322
17974B30479a10550q362a2650B24371H9194J16256A9558b40037g4196j25832m6380
17963b46408i1050l3434m2165A88513B6078a41204A53559E8483K19976a21884
17952a22599B19808a44672B900a70604j69775g107I3179a70642c6655C0966h1837
17940A50961c97513A58283b95486H3826a02384c1503l6158n4051H8688i1616j0540
17929a02156B48171a58054E2044f6221k41711b2859j92742P2631N461q8075o962
$$ y = [114639, -227416, 42741, -273234, -30772, -257023, -75682, -158395, -190647, -142321, -224901, 271921, 91687, -63912, 220753, -351140, -74070, 212245, -177144, -131407, -232895, 40093, -182914, -75189, -94178, 211323, -89640, -360015, 200256, -91546, -66403, -202870, -14451, 243801, 230479, -110550, -118912, -12650, 224371, 89194, 205450, 19558, -240037, -74196, -200028, -246408, -91050, -124484, -166649, 188513, 26078, -141204, 153559, 58483, 278459, -121884, -122599, 219808, -144672, 2900, -170604, -340379, -7107, 93179, -170642, -36655, 30966, -81837, 150961, -397513, 158283, -295486, 83826, -102384, -31503, -67661, -121712, 88688, -91616, -102156, 248171, -158054, 52044, -66221, -307932, -22859, -215601, -142970, -137509, -225584, -232546]
17918b32546k41109B41633C0632J12920a7816B53212A2195O9894b60047A12061
17907f5226f230C4392N3725g9231A50099h6270j24253A7103K23448C3056R3150
17896A26206c43801J31054C5370j2416K5836b81506c7218k993a2034m5011D8433
17884b00746g5431a3623l3053B50239a4688B43911K0652e6479G3447a08731A83273
17872G1755a30483I983K12811c7132A23831M9197b07835M2393B4686a28576H5589
17860g9998n0658m0646C67817b2753m4370H3914c9112A62634E4414a16478F4659
17848b48159F7758c4301j52393C13146a4449B15543b8393j50908A03874b18961
17837a01296B49499N5964g6697B04234A0990a57676P5477q4209K8948A77712b53736
$$ y = [-232546, -473655, 241633, 30632, 143552, -17816, 253212, 12195, 82089, -260047, 112061, -65226, -6230, 34392, 88117, -79231, 150099, -86270, -210523, 17103, 240551, 33056, 126206, -343801, -212747, 35370, 22954, 48790, -281506, -37218, -40211, -12034, -57045, 48433, -200746, -75431, -13623, -46676, 250239, -14688, 243911, 264563, -56479, 73447, -108731, 183273, 71755, -130483, 9983, 222794, -37132, 123831, 173028, -207835, -165442, 24686, -128576, 85589, -79998, -130656, -171302, 367817, -22753, -67123, 83914, -39112, 162634, 54414, -116478, 64659, -248159, 67758, -34301, -186694, 313146, -14449, 215543, -28393, -179301, 103874, -218961, -101296, 249499, 305463, -76697, 204234, 10990, -157676, -82199, -166408, -137460, 177712, -253736]
17825H1755a47948e9703F4770H679b69518b0547a831B92517h1987K2594C6400
17813b16709F4040k526a39602A21475n1599J82683a19627B09708a58083K0382
17803a37701j43569i4306r3228b0311k25180o3971O7116A97849i6466E5750e23987
17791a90873G3483b6541A37294l4233b27435C03754A16307b08546N5331a7626
17780d5415j94491g0761n1933j7383B7144K5211J14108F2812a65995A4056a2720
17768a87350H0524a65487F1580b11621Q1813E3112h6414n9361a933j28732c5724
17756a76875A43389h1602r386b6118A9765R3259J21463m8703c00874F9792L3392
17745A03184k6647h2725j18956B04746a04365E1677c8962k90773h3835k35111
$$ y = [81755, -147948, -59703, 64770, 8679, -269518, -20547, -1831, 292517, -81987, -59393, 36400, -216709, 64040, 61514, -139602, 121475, 69876, 252559, -119627, 209708, -158083, -137701, -281270, -94306, -187534, -20311, -245491, -309462, -242346, 197849, -96466, 55750, -523987, -190873, 73483, -26541, 137294, 103061, -227435, 303754, 116307, -208546, -153215, -17626, -45415, -239906, -70761, -122694, -140077, 27144, 52355, 166463, 62812, -165995, 14056, -12720, -187350, 80524, -165487, 61580, -211621, -129808, 53112, -86414, -145775, -1933, -130665, -35724, -176875, 143389, -81602, -90988, -26118, 19765, 113024, 234487, 185784, -300874, 69792, 103184, 76537, -82725, -201681, 204746, -104365, 51677, -38962, -329735, -83835, -318946]
17735c18946J3379a16593N4836B86792c86210i815A42563F2164j9615a41887A64342
17723A09996D470P1834J35590N3264E0775e7394k50695G5655L6376k7766B1066
17711D9728K8290a10378O388B3736f7177G1961J9399a26105M9476j19783h824
17699A79690J38098B6076N1282a368k77136C7402H081Q356b15599C43349c97534
17687c14267a14178B09177E8270l665b56843Q9528D82902a26600A20935J50858
17677B71793h8174A39387i2460B86406c10641B53065e1372j6903C29150a09132
17666B9009J63491H8743a47937B94232a1224B88866A28915a42004Q209A6909a62608
17654B55540A23010J13028b07976G7416N2744b74302J04050a8016I0328J10609
$$ y = [-318946, -305567, -116593, -61757, 286792, -386210, -9815, 142563, 62164, 42549, -141887, 164342, 109996, 4470, 76304, 211894, 265158, 50775, -57394, -308089, 75655, 112031, 84265, 21066, 49728, 78018, -110378, -103990, 23736, -67177, 71961, 91360, -126105, -76629, -196412, -8824, 179690, 317788, 26076, 77358, -1368, -278504, 37402, 8081, 16437, -215599, 343349, -397534, -314267, -114178, 209177, 58270, 54605, -256843, -167315, 482902, -126600, 120935, 271793, -88174, 139387, -92460, 286406, -310641, 253065, -51372, -68275, 329150, -109132, 29009, 192500, 88743, -147937, 294232, -11224, 288866, 128915, -142004, -133795, 16909, -162608, 255540, 123010, 236038, -207976, 77416, 130160, -274302, -170252, -18016, 90328, 200937]
17644B00937F7258N8911M7112b6350B20729a89747f461A53363K18834a68460C35953
17632A61991n6196b39728d3979H7971a11049I1073a9834A46507n7543f6621J7771
17621d8850k4471A26651J66809A22705Q1442a11602A94468m6242l8668B4600L7860
17610F2460a28354A14640a04430P048m26565H5649l1630D722L6789e5358D857
17598I7924k2298c07644a42808C16682A14045a21613A11379c40102D1227a74179
17587A41215c514C71122H504J71951k0713j5751G0028h1467H7132a26908B15995
17575a55070A52526i3745o5636q773b9594A85077Q0806j17150D8064K1962L8221
17564A08247d8454H2587R7535D9617h8383L1019A94920C7311a58986B45605a36768
$$ y = [200937, 67258, 126169, 173281, -26350, 220729, -189747, -6461, 153363, 372197, -168460, 335953, 161991, 105795, -239728, -43979, 87971, -111049, 91073, -19834, 146507, 88964, -66621, -48850, -73321, 126651, 293460, 122705, 204147, -111602, 194468, 148226, 109558, 24600, 62460, -128354, 114640, -104430, -97382, -523947, 85649, 54019, 4722, 41511, -55358, 4857, 97924, 75626, -307644, -142808, 316682, 114045, -121613, 111379, -340102, 41227, -174179, 141215, -3514, 371122, 8504, 180455, 159742, 143991, 70028, -81467, 87132, -126908, 215995, -155070, 152526, -93745, -159381, -168154, -29594, 185077, 265883, 148733, 48064, 70026, 108247, -48454, 82587, 180122, 49617, -88383, -57364, 194920, 37311, -158986, 245605, -136768]
17552a60029p1346A98118i4096A03317D5088K5315c84177i4639B1532a86760A84053
17540A40440J06059d53724G2450c31818p846A34666a36235B15840J1855e136A58414
17528C97913c35876D505L8110R1767L2771b95414R5406L1184B18080Q9487q6517
17517B21050b27245j121f9930B58474A5283Q5110J26760a52702l4502A68012b5568
17505A5831O7489c5589D71811a83058k0152B8918j1570a5238A1361K10468r6670
17494A25159I484K7769J02320J43062j33198a3858E5461J95853C1365b10359a7903
17482C67443b39575E23927k40988B5547J15016L0940J94813k8479E6577b59317
17471B20699L67959A91011J44372r2443b08989A7768J60486J33163Q6590e2841
$$ y = [-160029, -231375, 198118, -94096, 103317, 45088, 70403, -384177, -94639, 21532, -186760, 184053, 140440, 246499, -453724, 72450, -331818, -339664, 134666, -136235, 215840, 227695, -5136, 158414, 397913, -335876, 4505, 42615, 134382, 167153, -295414, -200008, -168824, 218080, 307567, 221050, -227245, -228366, -69930, 258474, 15283, 100393, 227153, -152702, -187204, 168012, -25568, 15831, 83320, -35589, 471811, -183058, -203210, 28918, 17348, -15238, 11361, 221829, 125159, 9484, 37253, 139573, 282635, 149437, -13858, 55461, 251314, 31365, -210359, -17903, 367443, -239575, 523927, 282939, 25547, 140563, 171503, 366316, 337837, 56577, -259317, 220699, 588658, 191011, 335383, 242940, -208989, 17768, 178254, 311417, 398007, -52841]
17460B62526b75124B06551L04811A38473j1126J26223n4130O6896l1590j06053
17450A28693K43729K21289B65837j05885L10924c66A17552J26273F4809L90109
17440D54918G7429M6356g0493H4279A0268J95096J42393j73794N8478J83918j97260
17429B19099E4096J40166e6913B81929o2895b16363C782L64317K0970A75471L64960
17418E40431p1821B23426L06820B56349J03253j24612N6782b2814I9364A7781
17407D03689D5578L52220C8275L9614d4839D9561N5484R2759K39701j06512C954
17395B98273c6943A22046D9584b11035a8734F6910J49501L7296A3600K3685B442
17383c0459J173D17785i2637A07739K05444A32514g0659E5623J1974b93097E7661
$$ y = [262526, -275124, 206551, 511362, 138473, 127347, 253570, 199440, 266336, 234746, 128693, 372422, 593711, 265837, 159952, 470876, -366, 117552, 243825, 64809, 454918, 77429, 123785, -70493, 84279, 10268, 205364, 347757, 173963, 232441, 416359, 219099, 54096, 194262, -56913, 281929, 219034, -216363, 3782, 368099, 389069, 175471, 540431, 468610, 223426, 530246, 256349, 359602, 234990, 291772, -22814, 99364, 17781, 403689, 45578, 397798, 38275, 77889, -44839, 49561, 105045, 197804, 437505, 330993, 3954, 298273, -36943, 122046, 49584, -211035, -18734, 66910, 216411, 253707, 13600, 37285, 2442, -30459, -29286, 417785, -92637, 107739, 313183, 132514, -70659, 55623, 67597, -293097, 57661]
17371b75024B98274O337J84291F0771J68717L4916r6363F3075J03682l1550a21353
17359B68398A5174Q4983b1928G9723b20022H4006B333J93869F7580L6844c7027
17347B64891j04725b1098A05539J4124J15617a15044B46006D4520L74709l0057
17337C89172j25495B077J98980K0426F1919a78471C99441j15029Q113D7310J7005
17326F4315P4334K83911j69368C0490a00829D17606A28921J11924a08581B64484
17315C27986a41604H3970i5035I729O9507N5391O9894F2968b93190d8514C53518
17303B90064j16111I063J84737a11680B9053j3222K46896r3966L5304J10009I3524
17291A68170J07312J51706A49624L9212A7794e7478B97583p7753B5019Q6070d3795
$$ y = [-275024, 298274, 304611, 488902, 60771, 229488, 264404, 168041, 63075, 166757, 135207, -121353, 268398, 15174, 100157, -21928, 79723, -220022, 84006, 2333, 196202, 67580, 104424, -37027, 264891, 160166, -21098, 105539, 119663, 235280, -115044, 246006, 44520, 419229, 389172, 263677, 2077, 201057, 221483, 61919, -178471, 399441, 284412, 292525, 47310, 64315, 138649, 422560, 253192, 30490, -100829, 417606, 128921, 240845, -108581, 264484, 327986, -141604, 83970, -95035, 9729, 79236, 134627, 204521, 62968, -293190, -48514, 353518, 290064, 173953, 9063, 193800, -111680, 29053, 15831, 262727, 168761, 204065, 314074, 93524, 168170, 275482, 427188, 149624, 188836, 17794, -57478, 297583, 219830, 25019, 111089, -43795]
17279a6209j72121A21473Q9445b60835A41583n9780K289L96142a53709G4394R9057
17268A73451B7518D377g0060e473F2237K14047r0138O7796c4322C03268Q232D8598
17255C18174j53044n1556J54201A24418J80429j45934J1712A7821K86252F0403
17244B22975F9072K85171A44221K08334g9282B22773O0903o9557J41457k1766
17234C33810j62803g8722G8572i5279A13780O1151i600C26192H8608p463H666
17222B48781m9185C7207K52925A21331j9706N525L07065b08842A21945K36435
17212C58380j46198c6434A52691a1235D31980a78476C11120J36461m2870q507
17202C96204A37449J09699N8238q7967C5043J22880E7745J85044B3895K75777
$$ y = [-16209, -188330, 121473, 210918, -260835, 141583, 81803, 84092, 480234, -153709, 74394, 173451, 27518, 4377, -70060, -5473, 62237, 276284, 186146, 253942, -34322, 303268, 311500, 48598, 318174, 165130, 113574, 267775, 124418, 304847, 158913, 170625, 17821, 304073, 60403, 222975, 69072, 354243, 144221, 352555, -79282, 222773, 283676, 214119, 355576, 333810, 171007, -78722, 78572, -95279, 113780, 174931, -9600, 326192, 88608, 81145, 8666, 248781, 199596, 37207, 290132, 121331, 101625, 107150, 414215, -208842, 121945, 358380, 212182, -36434, 152691, -11235, 431980, -178476, 311120, 447581, 404711, 396204, 137449, 247148, 305386, 217419, 35043, 157923, 57745, 242789, 23895, 299672]
17192B99672a82615d538j9307C1564L56716J2999j05081R2975n2160J39223k05057
17181B71179K53300M452j90148n1606m1415M2191j39845J92632A54263n8105J24698
17170B20856J62218a03807A59422J73116m7575J31751I6959O7559p7603J96888
17160B83803R7710A86005q9166M2241D0222M69376h5360C26970L8975j58093c56555
17148B54607F8733K71295r963J3466K71510E4199L08218j46041Q8213l580J1388
17137C12397J20891A94269K35095E5723M00953f564B11549K44330j08490K31155
17127E78544j61319O9465B40936o3056J79137J3222j03715K15414B21135J88442
17117D09577o5064p4267j2621J6741j03146L59132A50217J29838J20959K4696
$$ y = [299672, -182615, -4538, -23845, 31564, 388280, 401279, 296198, 389173, 337013, 476236, 271179, 524479, 528931, 338783, 287177, 245762, 287953, 148108, 340740, 154263, 96158, 220856, 383074, -103807, 159422, 332538, 284963, 416714, 96959, 164518, 86915, 283803, 381513, 186005, 96839, 139080, 40222, 509598, -85360, 326970, 365945, 207852, -356555, 254607, 68733, 340028, 330065, 343531, 615041, 54199, 362417, 216376, 304589, 301009, 312397, 433288, 194269, 429364, 55723, 456676, -6564, 211549, 455879, 347389, 578544, 417225, 486690, 240936, 177880, 357017, 370239, 266524, 481938, 221135, 409577, 344513, 270246, 257625, 274366, 171220, 530352, 150217, 280055, 401014, 425710]
17107D25710j35750K97086A10929n391J70782N0789A30187J60096K57452k08895
17097C38840j61427F6309M51794j24396J30515H2539Q4743R1798J76675K7406
17087D63161j46161R4436j61656J71252O5124m9460J93375k94455E3669L62182
17077D15851k7565J14007O4138k74067n4854K42315r7120Q0411m8306p3461r8547
17066B42802K79744A63198J39596J99511j03428J67910L7032j60045Q5605q2893
17056D46486M7664L0892K7046B07905L91465k51762J22062j11683O7811J79006
17046F04804B76353M02589j20516k40361K7781L31275r1944O9233j44463J38837
17036F48784A78783K67910N189j85906C3984O09925j47081j08993K07636A94422
$$ y = [425710, 289960, 587046, 110929, 105538, 276320, 327109, 130187, 290283, 547735, 338840, 177413, 66309, 518103, 393707, 524222, 82539, 167282, 259080, 435755, 463161, 317000, 411436, 249780, 421032, 486156, 436696, 630071, 335616, 53669, 415851, 388286, 502293, 566431, 292364, 237510, 479825, 382705, 463116, 414810, 341349, 242802, 522546, 163198, 302794, 502305, 398877, 566787, 603819, 443774, 529379, 446486, 494150, 525042, 552088, 207905, 599370, 347608, 469670, 357987, 425798, 604804, 276353, 678942, 558426, 318065, 345846, 677121, 585177, 654410, 509947, 648784, 178783, 446693, 451882, 265976, 33984, 643909, 496828, 387835, 595471, 194422]
17025D41446j9761J08123N5574r985J38340M9016o7545r3068M7166O3727j6287
17014F96746j48523j2596J2012K41506l9250k382n8825N9258k45331l4269K41169
17003G09515B96881N28077J16086D48926J58641M67745C79454L42751j84441J35592
16993F73356J59355j08102K54383D61337M39896l87923L81781m11043K07983o2694
16983F29337L15332l11047J23239O2876o3452j25412K55366M21570C91880K46472
16973F38352j75634L13735Q567q4292K06183j40154K28703Q8411k03123M5688
16963I26436k72530l9824j50665M74763j45263L15459n7045j0949P1097j11231
16953A000248R6685n1441q2863J60200k90411k6577P9746L02849j33290Q813j87053
$$ y = [441446, 421685, 529808, 585382, 575397, 713737, 762753, 695208, 602140, 649306, 713033, 696746, 548223, 535627, 547639, 789145, 749895, 747513, 688688, 747946, 502615, 468346, 709515, 296881, 824958, 941044, 448926, 607567, 1075312, 379454, 722205, 537764, 673356, 832711, 724609, 978992, 461337, 901233, 513310, 895091, 484048, 692031, 629337, 944669, 633622, 756861, 819737, 756285, 630873, 886239, 1307809, 391880, 638352, 462718, 776453, 785020, 700728, 906911, 766757, 995460, 1083871, 880748, 926436, 653906, 614082, 463417, 938180, 792917, 1108376, 1051331, 1040382, 1111479, 1000248, 1096933, 1045492, 962629, 1122829, 832418, 805841, 885587, 1188436, 1055146, 1063959, 876906]
16942H76906k22968K03162J9159K97269L0211k67700K34892k15527M70651F81244
16931A281186k48122J12485J48275k03054Q1927J30555m5063j01692L9729k46099
16921I50127K15787P1060J75867p9070n7631K2965j16070M2651J98733j31641
16911A292778L20065k20655l08068K59678J42061M88003j02713m90658K73170
16902A653661k6432N9807K69095n45249o5152K63359O7718K38861l27272L10821
16892A899217j1405k90157J67023m1639Q3315P8026j73827l2310R7059Q931K05227
16881A989460J08665m25172J63490K82375k86872J83897K67900k79947J71309
16872B175105J26683l6052Q5697k27169J91871M7003j62723J97968k1142j19020
$$ y = [876906, 653938, 857100, 876259, 1173528, 1203739, 936039, 1170931, 955404, 1426055, 681244, 1281186, 1033064, 1145549, 1293824, 1090770, 1172697, 1303252, 1258189, 1156497, 1196226, 950127, 1165914, 1236974, 1412841, 1333771, 1276140, 1299105, 1183035, 1225686, 1424419, 1292778, 1612843, 1392188, 1084120, 1343798, 1485859, 1973862, 1871149, 1380491, 1653661, 1627229, 1687036, 1956131, 1410882, 1345730, 1609089, 1676807, 1915668, 1588396, 1899217, 1887812, 1597655, 1764678, 1723039, 1806354, 1884380, 1710553, 1678243, 1775302, 1784233, 1989460, 2098125, 1672953, 1836443, 2118818, 1831946, 2015843, 2283743, 2003796, 2175105, 2301788, 2265736, 2351433, 2124264, 2316135, 2363138, 2200415, 2398383, 2377241, 2258221]
16862B258221L59620o5721K16498l74214M22502k52973K21991j22218K35780k45667
16852B653819N12197n61283l2838N62556j18841J27571J60735l17629K88169k94682
16842B979774K53527K79666J26404m99189K01843J39966L32726m40376L35494
16833C709835K90832Q9824j58547N0371K8074K65258q2030J47736L82078l46800
16823D376631L49049L1866J16770K49751j11557j39578k9828K16663L84784j40577
16813E303974K65388M57224l38693N18406o51054N5485L79297O5351L35396J44355
16803F535129J51454k13850Q30798l19307N90558j05505K05271L75224J79671
16794H229443j0881N64195l30926M58091L25120N4082M07503K37025K03977M56565
$$ y = [2258221, 2617841, 2552120, 2768618, 2394404, 2816906, 2563933, 2785924, 2663706, 2899486, 2653819, 3166016, 2604733, 2571895, 3134451, 3015610, 3143181, 3303916, 2986287, 3274456, 2979774, 3233301, 3512967, 3639371, 3140182, 3342025, 3481991, 3814717, 3374341, 3709835, 4000667, 4090491, 3931944, 3982315, 4010389, 4275647, 4193617, 4341353, 4723431, 4376631, 4725680, 4757546, 4874316, 5124067, 5012510, 4872932, 4843104, 5059767, 5444551, 5303974, 5569362, 6026586, 5687893, 6206299, 5555245, 5610730, 5990027, 6055378, 6390774, 6535129, 6686583, 6472733, 7303531, 6984224, 7574782, 7469277, 7674548, 8049772, 8229443, 8218562, 8782757, 8451831, 8909922, 9235042, 9289124, 9696627, 9933652, 10137629, 10594194]
16784A0594194K72810K17106L89383l811L55242K42499N98464M70892K63067M32389
16774A3832235O61824K08375O57773J05012P41834O72588M83756L64488R60754
16765A8688639O05330M02025J187221O58505Q84747J066322Q96397Q42910R16809
16756B6148905J337639R70325J701596J198588J290351J767630J416619K006776
16748C7838429J935577J911116K206604J864093K730137K507729L115911K971405
16740E7081001L387664L321160L940805L724910M598068M651706N286060N173732
16732I1165106N721878O364325O124647P143176P385507O709195P965215P599846
16724A46178895P909133P448879O989489O544547N603735N105586L653829K187972
$$ y = [10594194, 10867004, 11084110, 11473493, 11469682, 11824924, 12067423, 12665887, 13136779, 13399846, 13832235, 14494059, 14702434, 15360207, 15465219, 16207053, 16879641, 17363397, 17727885, 18688639, 19293969, 19695994, 20883215, 21541720, 22426467, 23492789, 24389186, 25232096, 26148905, 27486544, 28456869, 30158465, 31357053, 32647404, 34415034, 35831653, 37838429, 39774006, 41685122, 43891726, 45755819, 48485956, 50993685, 54109596, 57081001, 60468665, 63789825, 67730630, 71455540, 76053608, 80705314, 85991374, 91165106, 96886984, 103251309, 109375956, 116519132, 123904639, 130613834, 138579049, 146178895, 154088028, 161536907, 168526396, 175070943, 180674678, 185780264, 189434093, 191622065]
16716A91622065J178933m39925j430954k981130m564271n313488o073279p414408
16708A64583543p102991p993632q058873p619100p838606p492580o949944p009093
16700A04518724o258386o105144n549734n698477n260861m067625m434422m422267
16692F2721808l198033l509603l296247k895385k644951k473623k448730k241090
16684D0014146k498629j423427j771998j416239j707643j735124j114667j142267
16676B7204152j288244j012457j216421j286949q39706o71189p35489q04046j023490
16667A8326161n61277q63174m10771p58391k16654j285858o34022J15399l43431
16658A3367982o58767r7375n72067l30039p64030j73443n99900N3545j03127m80720
$$ y = [191622065, 192800998, 192361073, 190930119, 187948989, 183384718, 178071230, 171997951, 164583543, 157480552, 149486920, 141428047, 133808947, 125970341, 118477761, 111527817, 104518724, 98260338, 92155194, 86605460, 80906983, 75646122, 71578497, 67144075, 62721808, 59523775, 56014172, 52717925, 49822540, 47177589, 44703966, 42255236, 40014146, 37515517, 36092090, 34320092, 32903853, 31196210, 29461086, 28346419, 27204152, 25915908, 24903451, 23687030, 22400081, 21560375, 20889186, 20153697, 19349651, 18326161, 17764884, 16901710, 16490939, 15732548, 15515894, 14230036, 13596014, 13711413, 13367982, 12709215, 12611840, 12039773, 11709734, 10945704, 10772261, 10172361, 10225906, 10122779, 9642059]
16648I642059k63578o88534J58071j89855o54180j59889L7648L6538l14337m38483
16638G165460N3416m68511k48827l5151j20086r629o2119k46535j27943k69319
16628E630756j28086J9835o29746L19767J5093j43388r736m96269k91256L54151
16618D641121k70904n5999l23347J87280j46634l9246k16994n7500K68334l19210
16608C666901J10281j87898j48659j4082j97688J87200k5002k48829j29724q2471
16598B930029m9110K17504m19230J20437q7034K1485j24218M41325p32719P1187
16588B389656J60322n52105Q03589n95301L1230K50961k85169j41213K78217J16125
16578B456312m52084J50904k75959J08970j31837J65893K70429m07345j90479
$$ y = [9642059, 9378481, 8689947, 8848018, 8658163, 8003983, 7844094, 7881742, 7918280, 7603943, 7165460, 7218876, 6750365, 6501538, 6466387, 6346301, 6336672, 6274553, 6028018, 5900075, 5630756, 5502670, 5522505, 4892759, 5212526, 5227619, 5084231, 5074495, 4578226, 4286970, 4641121, 4370217, 4314218, 3990871, 4178151, 4031517, 3992271, 3775277, 3717777, 3986111, 3666901, 3777182, 3589284, 3440625, 3426543, 3228855, 3416055, 3391053, 3142224, 3012500, 2930029, 2880919, 3098423, 2679193, 2799630, 2712596, 2734081, 2609863, 3051188, 2318469, 2389656, 2549978, 1997873, 2801462, 2206161, 2237391, 2488352, 2203183, 2061970, 2340187, 2456312, 2004228, 2155132, 1879173, 1988143, 1856306, 2022199, 2292628, 1885283, 1694804]
16569A694804M24980k7464k76159R7825p6949q9151K3761j42704l6298J23251
16559A715896j6345j22269o9590Q5794l06215P6540j13768M7801o4974r4502L03216
16548A441584l6080r0826r1852L96177m9387n18259K04466n9772K03056J39714
16538A538821n70341J49720K67116L9476l80104J75863j41083R2551j68330J57204
16528A160893l7486m34076J51343M11142j35780j9129o5228o6773J58087m55745
16518F67248J20866L16019l29072K85871M435j25180l63935M33135j55071O2511
16508I16827l98552K96334J55832m10385K62409q2730j78671K08509J5332j6043
16498G68862k12427L15376j01328K97897l23903p4475o2313R8278l9674j3090
$$ y = [1694804, 2119784, 2092320, 1816161, 1913986, 1837037, 1747886, 1771647, 1628943, 1592645, 1715896, 1699551, 1577282, 1507692, 1593486, 1287271, 1363811, 1250043, 1297844, 1232870, 1138368, 1441584, 1405504, 1314678, 1222826, 1619003, 1569616, 1051357, 1255823, 1196051, 1399107, 1538821, 968480, 1118200, 1385316, 1424792, 1044688, 1220551, 1079468, 1172019, 1003689, 1160893, 1123407, 689331, 840674, 1251816, 1116036, 1096907, 1031679, 964906, 1122993, 667248, 788114, 1104133, 775061, 1060932, 1065367, 940187, 576252, 1009387, 854316, 916827, 518275, 814609, 970441, 560056, 822465, 739735, 561064, 769573, 784905, 768862, 556435, 871811, 770483, 1068380, 744477, 670002, 607689, 705967, 666293, 653203]
16488F53203k8701q9828J49515j91687j8726K07551P0565K3823j83677P059M8757
16477F47854k85143O4349N6072K48723j76282K51064k89578o6738j85383L58115
16467F23053k8505B30402L67976J60707j36589m2539M25j23278j13115q875J19514
16456D54628J99474k06205j14523L3680L5885N52394m53433j90975q3672K97365
16446E24618k30568J88488B28933J945K63697k23085J56906K5415J85948j91529
16436D48230j7249J26432O6593N6654l05070K04879O0323D8651M92621B05562
16425B44277K36802k25674o3374J40757K95761k27076j81121J33400r5019P3531
16415C32264J74797n5735j79473K00823J35124k8495C6117M42036r2646j81825
$$ y = [653203, 624502, 534674, 684189, 492502, 473776, 681327, 751892, 775715, 592038, 599097, 647854, 362711, 427060, 483132, 731855, 555573, 806637, 517059, 450321, 264938, 623053, 594548, 230402, 598378, 759085, 622496, 579957, 580382, 457104, 343989, 335114, 454628, 654102, 447897, 333374, 367054, 402939, 955333, 501900, 310925, 227253, 524618, 294050, 482538, 228933, 230878, 494575, 271490, 428396, 453811, 639759, 448230, 430981, 557413, 624006, 680660, 375590, 580469, 640792, 48651, 541272, 205562, 244277, 481079, 255405, 192031, 332788, 628549, 401473, 220352, 353752, 258733, 332264, 507061, 451326, 271853, 472676, 607800, 579305, 36117, 478153, 385507, 203682]
16405B03682J75081j40086J19761f77B84209j7660A06888j0483K0268K47525E0861
16393D79322l4837B02372J77592j21281L9584Q1132j17814J01663j33907K15104
16383D44445G8944J00029j6656K59075A17892K71055H9171J26696J03605L2672
16373C52144b12612c5515A28280m3669J07579M0149m1172J21499n0402o9713L65130
16362E57681B17807K47663B1221O02674h0461C19419F5860c6389E7168J77944
16352B35112j4831H6524N7917J5531J02895A29729a53236C0514O9835B6961L48752
16341C75713A42384j8581b31113B54536f3661B77684a03082B61226n9983c4747
16330C73425A10713a1976A59725K6116L8548b0446C13788j33387J12950D4374
$$ y = [203682, 378763, 238677, 358438, -677, 284209, 266549, 106888, 96405, 116673, 364198, 50861, 479322, 444485, 202372, 379964, 258683, 298267, 379399, 261585, 363248, 229341, 444445, 78944, 178973, 162317, 421392, 117892, 388947, 89171, 215867, 319472, 352144, -212612, -35515, 128280, 84611, 192190, 232339, 191167, 312666, 262264, 192551, 557681, 217807, 465470, 21221, 623895, -80461, 319419, 65860, -36389, 57168, 235112, 220281, 86524, 144441, 159972, 262867, 129729, -153236, 30514, 100349, 26961, 375713, 142384, 123803, -231113, 254536, -63661, 277684, -103082, 261226, 201243, -34747, 373425, 110713, -11976, 159725, 185841, 224389, -20446, 313788, 180401, 293351, 44374]
16319d0418D68706a40261C74208H7881Q1166l9166b6731A22693m9047a18921k4336
16308a43257E5975J80187J35932A18017Q2094l6086E1215g1670A23958H320K38504
16297B46824j17606J1182b46186g560B06006M2623o7339L0070B8372J9449A5433
16285A36567o5356a3165k38184A7045L00899b5804l70572E654b13888d847E8636
16273B07002p1131L0172a68084C3709b18146A89457a87478A9103Q5308Q6522J41062
16262C31995A47366j8319J37259p0942K47616g2906B53391l4533M0591r6710m1522
16251A21217J70560b46043C60311b36105J03151O2840D05584A16058b6075I0001
16240B93109C3395m236c80129A44991b59627g809A81982C8259g9537p1340D49824
$$ y = [-40418, 468706, -140261, 374208, 87881, 169047, 129881, -26731, 122693, 73646, -118921, -143257, 55975, 236162, 372094, 118017, 200111, 164025, 51215, -71670, 123958, 8320, 246824, 129218, 140400, -246186, -7560, 206006, 248629, 181290, 211360, 28372, 47821, 15433, 136567, 71211, -13165, -251349, 17045, 317944, -25804, -396376, 5654, -213888, -4847, 58636, 207002, 135871, 166043, -168084, 33709, -218146, 189457, -187478, 19103, 104411, 190933, 331995, 147366, 129047, 266306, 195364, 442980, -72906, 253391, 218858, 259449, 162739, 121217, 291777, -246043, 360311, -236105, -132954, -70114, 405584, 116058, -26075, 90001, 293109, 33395, 29159, -380129, 144991, -259627, -7809, 181982, 38259, -79537, -150877, 449824]
16228e7462C07450g6537r3049A64151C3906A5720d20325A15000e4576h921k9814
16217c8735B4777g7962j76455G0222a38917B57155j22613K26865j6167A52936
16206a46299j06637A75730K3527N4317d67717A52203n7256i4386A90729l7047
16196A53682a27398A36228a66533j9274A74611a89386C55738a75928L2463k44888
16186c88353B93332h9709B3470N2140J60610H7663J11635M4961a5525p4622j4575
16175a04722B05389n8567f7997A31402b9056n4332C35682A15945a70929e8836
16164a6962j12527A98643p6098E6280b86510L3756N4602B25468q7739R8606f9588
16152a19048D80111a9553F0879K65089g4428E8367b79900B75376D2149a37570
$$ y = [-57462, 307450, -76537, -169586, 164151, 33906, 15720, -420325, 115000, -54576, -8921, -38735, 24777, -77962, -254417, 70222, -138917, 257155, 134542, 361407, 345240, 152936, -146299, -252936, 175730, 199257, 253574, -467717, 152203, 94947, -94386, 190729, 153682, -127398, 136228, -166533, -185807, 174611, -189386, 355738, -175928, -143465, -388353, 293332, -89709, 23470, 75610, 236220, 87663, 199298, 244259, -15525, -90147, -104722, 205389, 146822, -67997, 131402, -29056, -83388, 335682, 115945, -170929, -58836, -16962, -129489, 198643, 122545, 56280, -286510, -252754, -198152, 225468, 137729, 236335, -69588, -119048, 480111, -19553, 60879, 325968, -74428, 58367, -279900, 275376, 42149, -137570]
16141A32023j7768c72291A10152a21319B55544D0936K5755j6206b82665O1765
16131b20900N6150j79713m8711a53777L6131q9942K7218Q1423o3425A70583a37001
16119f8651j67573A59610a25955l4875B87980P5556F5996h7697j82065h8808l69025
16108d57833A15750j1435c546C9689a8001E4746J01143G5103J05271b00420m8294
16097b48714A49383d7217A21665E1034a8766A06200g5343k2604K5080K4271E819
16085A66518a53384A76738e3779B4255K13688c7589k38799h6518O010A72160e9194
16073B48569A153N9889J78492d53957a48804r5019e7308l13681A55044a99890
16062a97023B955J24234h0650a4656B7851J57470a05951L5415r4152d5433B31369
$$ y = [132023, 114255, -372291, 110152, -121319, 255544, 40936, 66691, 50485, -282665, -220900, -164750, -344463, -393174, -153777, -117646, -207588, -180370, -98947, -162372, 170583, -137001, -68651, -236224, 159610, -125955, -160830, 287980, 363536, 65996, -87697, -269762, -88808, -457833, 115750, 104315, -3546, 39689, -18001, 54746, 155889, 75103, 180374, -200420, -248714, 149383, -47217, 121665, 51034, -18766, 106200, -75343, -97947, -72867, -48596, 5819, 166518, -153384, 176738, -53779, 24255, 237943, -37589, -276388, -86518, -80508, 172160, -59194, 248569, 1153, 61042, 239534, -453957, -148804, -243823, -57308, -370989, 155044, -199890, -197023, 2955, 127189, -80650, -14656, 27851, 185321, -105951, -70536, -164688, -45433, 231369]
16050I7168g2266E7970b76808F5755B3853Q336a09679j06305P0022j34022K8465
16039b51519P8470A77465a11836C26240A58088b3410q956j03770j99840j7829
16029c53805R6621J10154A72131h1172j25781I8139h6840j34766A95150g5420
16018A88888k6268Q2518I6685c4230k17058G8776L7536c47599J38904i8866B9298
16006a60273M3677A7024f5974I4982f605k07206g2129J370j04746j81358A7163
15994c52791J65290e2489B24581I5722k5662J13524c10210P8671J04975C15198
15983A02508J51162K9803P3813K35448j46004j59260D060J68587b02414g7820
15972d36575a28090A11900b47248A30539J12777o0819a92319K6620c0144k30659
$$ y = [97168, -72266, 57970, -276808, 65755, 23853, 32189, -109679, -215984, -145962, -279984, -251519, -173049, 177465, -111836, 326240, 158088, -23410, -32366, -136136, -335976, -353805, -257184, -147030, 172131, -81172, -206953, 98139, -86840, -221606, 195150, -75420, 188888, 162620, 245138, 96685, -34230, -251288, 78776, 116312, -347599, -208695, -98866, 29298, -160273, -116596, 17024, -65974, 94982, -6605, -213811, -72129, -70759, -175505, -356863, 17163, -352791, -187501, -52489, 224581, 95722, 70060, 183584, -310210, -231539, -126564, 315198, 102508, 253670, 283473, 357286, 592734, 446730, 287470, 4060, 172647, -202414, -77820, -436575, -128090, 111900, -247248, 130539, 243316, 182497, -192319, -165699, -30144, -260803]
15962b60803A05038b87275F2791M0083b11962A48558b93792d1643o90l5019A55604
15950a01684r0191c0970j03116j23786a9744j97931r7867F1885A1253c11322d4798
15938c00972q6917I0746f6629j56768R1728j89811B72359C9788a13739C5029g164
15926H2490A9475r199f5532C50314A5604b22711B06308a38193O147a2820C5961
15914e03240h1079A17696a36962B22644g7953A61072F4608a65582m3908c6978
15903E9633k4681e076C9666c57746A10059a33366G0069a17363c5538E2171J31154
15892A83325B4261j0397a19508A00288K6017m3814b76677c9218p8285K2834a5495
15880b2954p9159H9591a89989D9538j4801c43028a31195p7618A37217b03568g4091
$$ y = [-260803, 105038, -287275, 62791, 102874, -211962, 148558, -293792, -41643, -42333, -77352, 155604, -101684, -191875, -30970, -134086, -257872, -19744, -217675, -315542, 61885, 11253, -311322, -44798, -300972, -387889, 90746, -66629, -223397, -131669, -321480, 272359, 39788, -113739, 35029, -7164, 82490, 19475, 10276, -65532, 350314, 15604, -222711, 206308, -138193, -132046, -12820, 35961, -503240, -81079, 117696, -136962, 222644, -77953, 161072, 64608, -165582, -209490, -36978, 59633, 34952, -5076, 39666, -357746, 110059, -133366, 70069, -117363, -35538, 52171, 183325, 24261, 13864, -119508, 100288, 126305, 82491, -276677, -39218, -117503, -94669, -15495, -22954, -102113, 89591, -189989, 49538, 34737, -343028, -131195, -208813, 137217, -203568, -74091]
15868i8343j52073m2969i0307r9606j14725h4989k8022A14022b67201A2547R5705
15857A08252J17339e2902A7283K2508P2356e508p5860A54356d6553A17237n1488
15846F5749k3584K34538C8872d9018r0401c7963j09879D9381K116B2800K39582
15835B62382K7966a00344k3545j11708B93531a59353D6559g9058B15352b4189
15824d0174m27583b2473A18366J4930j1138j5579m3585c5109P317m2735o1605
15813a32132A12233m5352b03156M7452D3669a51230r723a7774q7065l2365m4904
15802a82108p3178N3013a8804I898K0456i6067A02032a38134C0805N158a97592
15790b85019D0952J88127h723k18131l8923a03226B7777b8051j5435A98000b71581
$$ y = [-98343, -250416, -293385, -90307, -189913, -304638, -84989, -113011, 114022, -267201, 12547, 108252, 225591, -52902, 17283, 39791, 112147, -5508, -81368, 154356, -46553, 117237, 65749, 42165, 276703, 38872, -49018, -139419, -37963, -147842, 49381, 51497, 22800, 262382, 290348, -100344, -123889, -235597, 293531, -159353, 46559, -79058, 215352, -24189, -40174, -467757, -22473, 118366, 133296, 122158, 106579, 62994, -35109, -27792, -70527, -132132, 112233, 66881, -203156, -155704, 43669, -151230, -160953, -17774, -104839, -137204, -182108, -255286, -202273, -18804, 9898, 30354, -96067, 102032, -138134, 30805, 35963, -197592, -285019, 40952, 229079, -8723, -226854, -265777, -103226, 27777, -28051, -43486, 198000, -271581]
15778a71180E8061J1835b7292e18n6069l12924d862k94238A56822a22645o0492
15767a83137k66759A41714d81138G4324a5396j02796A60249b54964B25088o5206
15757A59882F6007a95927A53242a61658g8701l69315g6081B61104n8432e6077
15746d1512B73002b25996B54862j17192k7862a2447c777l0279k18755m0024H2162
15734e6602k22940a36114L3220B568a52297E0912F306R1099b49979i0810b864
15722a30285J4444j480F0385a48408c0034F1615P248J15333c0232F7574h7206
15710D29109d1132p1545f712k82306A62878f5759j08008m6535O0543n5550G2891
15698F7941N647g3533K5369A87673D7072R1353J06121A00107J31076a82032Q0229
$$ y = [-171180, 58061, 69896, -27292, -518, -56587, -369511, -4862, -299100, 156822, -122645, -183137, -449896, 141714, -481138, 74324, -15396, -118192, 160249, -254964, 225088, 159882, 66007, -195927, 153242, -161658, -78701, -448016, -76081, 261104, 202672, -56077, -41512, 273002, -225996, 254862, 137670, 109808, -12447, -3777, -34056, -252811, -292835, 82162, -56602, -279542, -136114, -102894, 2568, -152297, 50912, 6306, 97405, -249979, -90810, -2864, -130285, -115841, -117321, 60385, -148408, -30034, 61615, 68863, 184196, -30232, 67574, -87206, 429109, -41132, -112677, -6712, -289018, 162878, -65759, -173767, -220302, -159759, -215309, 72891, 67941, 73588, -73533, -48164, 187673, 47072, 138425, 244546, 100107, 231183, -182032, -101803]
15687a01803B06327r4287d6140k6028k04885e1774C18650h0704m1090A41072c7065
15675A54924b50091L4944h7245n5922A83674G6421l0490M10617G0079a79631L0292
15664a49339k1386c0042f237l03114f1878j26683E8913A0315a60519E6765f559
15652a87955L5843I901J28219C8149K25428a60305g0783j98132B14172j0993b31117
15640a6521A52812a37496r7023K8547N4048R109d1738F2370b11258m803j63442
15629c79503c8242E9601b34969B30045e8382q9785B67644a8423A98756H2242K90163
15618C72405a57892D33113G5009n707R8677c4844J6142m41915C0545a0033D126
15606a07358j16916E03d39605b05116R2814c5643G1044L2330O1106b75825Q2640
$$ y = [-101803, 206327, 112040, -46140, -72168, -277053, -51774, 318650, -80704, -121794, 141072, -37065, 154924, -250091, -215147, -87245, -143167, 183674, 76421, 45931, 456548, 70079, -179631, -149339, -170725, -30042, -6237, -309351, -61878, -188561, 58913, 10315, -160519, 56765, -6559, -187955, -152112, 9901, 138120, 38149, 263577, -160305, -70783, -268915, 214172, 203179, -231117, -16521, 152812, -137496, -234519, -205972, -151924, -142815, -41738, 62370, -211258, -216061, -379503, -38242, 59601, -234969, 230045, -58382, -148167, 267644, -18423, 198756, 82242, 372405, -157892, 433113, 75009, 69302, 167979, -34844, -18702, -460617, 30545, -10033, 4126, -107358, -224274, 503, -439605, -205116, -112302, -35643, 71044, 103374, 164480, -275825, -193185]
15595a93185k0330j41096O5937F5280i554b724o0345q5623B5714O0191d2859A64978
15582c23927g393A78130b77388A78056b5294A89599C5853A0298K34486c7619j03999
15571a41618C498b4388E1813j1028a2350j47202E291a9067A52855A2775g5624
15559H4419b6318n1255c5471B0004J93626b16260H9090g1469A71030i4029l206
15548i7235F7129a80317F5825a56027P2101L2443k9102k6118B68110e0935a0447
15536a03150B13886J27844b61044B02771b71152C3782P3804e8791o0188K7453
15526i1526j39498B72380i1644M0302l06792i3634l03799A15945M53448b89073
15515E2610J22578a61617c8103A01330j0691a558j28234k9425C7348a27481A08153
$$ y = [-193185, -213515, -354611, -288674, 65280, -9554, -2724, -63069, -148692, 25714, 85905, -42859, 164978, -323927, -7393, 178130, -277388, 178056, -25294, 189599, 35853, 10298, 244784, -37619, -141618, 3498, -24388, 51813, 40785, -12350, -159552, 5291, -19067, 152855, 12775, -75624, 84419, -26318, -77573, -35471, 20004, 213630, -216260, 89090, -71469, 171030, -94029, -97235, 67129, -180317, 65825, -156027, -83926, -51483, -80585, -106703, 268110, -50935, -10447, -103150, 213886, 341730, -261044, 202771, -271152, 33782, 107586, -58791, -118979, -91526, -231024, 272380, -91644, -51342, -358134, -93634, -397433, 115945, 569393, -289073, 52610, 175188, -161617, -38103, 101330, 90639, -1558, -129792, -159217, 37348, -127481, 108153]
15503b54070B12194g7059C4561K06541L0550f5137B98455a98696n0985f14B44923
15491e3681A60926E4537b010F8013Q7083b960j4286p5938b5511p3063A93648n1408
15479A42240o9260C6463a62807B1303b97572H0675a4380A65954e2225F7896A4145
15467A35274B1913E443L1993a2897n099k03241j37009b57p7146D47120b95641
15455C82738B7986b9915j2498j89852C4530f3308j81271Q2815B32899b45445a14845
15443i0241F5082h1117B47444G3967e0979m2483I95a45361C32963j11258G7911
15431A84029q6556j6384r230c2689A15545q411K23781j34439f4057a7342A22980
15419A24687e7156B70058b00360i8979B8190b2297j12506k70307a96397c6677
$$ y = [-254070, 212194, -77059, 34561, 241102, 271652, -65137, 298455, -198696, -249681, -614, 244923, -53681, 160926, 54537, -2010, 68013, 155096, -2960, -17246, -93184, -25511, -98574, 193648, 142240, 72980, 36463, -162807, 21303, -297572, 80675, -14380, 165954, -52225, 67896, 14145, 135274, 21913, 5443, 37436, -12897, -17996, -221237, -358246, -257, -77403, 447120, -295641, 382738, 27986, -29915, -42413, -232265, 34530, -63308, -244579, -161764, 232899, -245445, -114845, -90241, 65082, -81117, 247444, 73967, -50979, -93462, 995, -145361, 332963, 221705, 77911, 184029, 97473, 81089, 71859, -32689, 115545, 107134, 330915, 196476, -64057, -17342, 122980, 124687, -57156, 270058, -200360, -98979, 28190, -22297, -134803, -405110, -196397, -36677]
15408c97007C4271K95176a68809g1251A6495h1021C751b68482A11928d03698c5637
15396C869a69219f4675H8439H50b55799A7680J44256e0329j6029A09582P4124
15385A83706b24059K4028A29951e4700A97158i2802k54500I9951d60680a05233
15374e9903A00412b39081A22116f4388j7240o7777a8986N087j36527B51421b11078
15362b5612m0455p601j72073D1107a53322A05989j638b74677r5254a14142A85505
15350D08548b06502k13906A14803a29624A56337o2244f8082B79089A23145h1213
15339B19536d02897a44535M1766F083a54242C82598a9500B50173c4052j19050
15329a53102E9953c3582m1745C64526F9279a51717b0217p7563B8548c9546j6146
$$ y = [-397007, 34271, 329447, -168809, -71251, 16495, -81021, 3751, -268482, 111928, -403698, -35637, 3869, -169219, -64675, 88439, 850, -255799, 17680, 161936, -50329, -66358, 109582, 183706, -224059, -200031, 129951, -54700, 197158, -92802, -347302, 99951, -460680, -105233, -59903, 100412, -239081, 122116, -64388, -81628, -149405, -18986, -13899, -150426, 251421, -211078, -25612, -66067, -73668, -245741, 41107, -153322, 105989, 104351, -274677, -369931, -114142, 185505, 408548, -206502, -420408, 114803, -129624, 156337, 94093, -68082, 279089, 123145, -81213, 219536, -402897, -144535, -102769, 6083, -154242, 382598, -19500, 250173, -34052, -153102, 59953, -33582, -75327, 364526, 69279, -151717, -20217, -97780, 28548, -39546, -55692]
15318e5692j51456h2360a9056A40457J7049e2355g159o3854m93j8084B17037H9907
15305a02041B36210D4917b20060B01458a61470A41002M9209l2970a88978a2285
15294b67394d4373J1795j20434n7169P1406m7015A80628K4209N5179j00163J12736
15283B72589c2698B15610B7584a49178B7590e7874b7669A8788K07581J54934A51552
15271d4092A52419c05434B74161g8852a4798H9995g9028A37412C2118q825J05278
15260A28571a12628F4398a00723G4939N9081O2796q4360n1524J24022g8819C2836
15248g8148A47113M83404P81102M1636o51027J015746I07939B21716k2150J13408
15238C12974J67378D666O9282L2192M6050e4348B6938a01984k29000e2500B30684
$$ y = [-55692, -207148, -82360, -19056, 140457, 157506, -52355, -7159, -71013, -71506, -89590, 217037, 89907, -102041, 236210, 44917, -220060, 201458, -161470, 141002, 190211, 157241, -188978, -12285, -267394, -44373, -32578, -153012, -210181, -138775, -185790, 180628, 204837, 260016, 159853, 272589, -32698, 215610, 27584, -149178, 27590, -57874, -27669, 18788, 226369, 381303, 151552, -44092, 152419, -305434, 274161, -78852, -14798, 89995, -79028, 137412, 32118, 23293, 128571, -112628, 64398, -100723, 74939, 134020, 196816, 112456, 60932, 184954, -78819, 32836, -78148, 147113, 630517, 1411619, 1453255, 802228, 1817974, 907939, 221716, 199566, 312974, 480352, 4666, 73948, 106140, 152190, -54348, 26938, -101984, -330984, -52500, 230684]
15226C18513b4025D6554R9157L3313p1398L7214c28475H8170a32990n9941E3665
15214i281l74281A92248q4862b01030d2784Q695D1151J03599f8785I2826Q1256
15203A74082n8846b36361E4347K5626a3780q4816I0786k9286J16626a37250A42353
15191F4920l1128K0907a74287A29672a61190b4023H8161O0756m660B4823K06013
15180B30836e2522E8342a97308A87294b78783j12355G6806L1049a72686A40302
15169a46276A5067J16506D7545L45066p0757e0702I5547c02771b4598A07297k0763
15158H6534a98130A34451d5617A18425f2955A25154J46361K18802J827b22710
15147A97626m1932a30295A16302b79716B85459A27519L8804a32388B36929G2919
$$ y = [318513, -24025, 46554, 145711, 179024, 107626, 144840, -328475, 88170, -132990, -192931, 53665, -9281, -383562, 192248, 107386, -201030, -42784, -34089, 41151, 144750, -68785, 92826, 174082, 115236, -236361, 54347, 79973, -13780, -98596, 90786, 61500, 178126, -137250, 142353, 64920, 33792, 54699, -174287, 129672, -161190, -24023, 88161, 148917, 144257, 24823, 230836, -52522, 58342, -197308, 187294, -278783, -391138, 76806, 107855, -172686, 140302, -146276, 15067, 131573, 47545, 392611, 321854, -50702, 95547, -302771, -24598, 107297, 86534, -198130, 134451, -45617, 118425, -62955, 125154, 271515, 490317, 492144, -222710, 197626, 155694, -130295, 116302, -279716, 285459, 127519, 166323, -132388, 236929, 72919]
15136A62934k6799R2512j14322m9667h2604I8169K48715j52547b26297J08064
15126a18233n0106B93678h400D6038P5871C2242c2494C1752L42375A7303J14416
15115A31719b53727A36784Q1870H9793k9173O0910O6681o3738a97502A58314D4790
15103c8961A26276a5222A17971a58578B21525C486J11475a410A06213L66103A82612
15091A79825H1894k5469b0049n1872B91430c9444A1830J29848H867a1337B32045
15079A05644d5269G401J3296J39510d3544H5464J34323l5502q6599Q3962c5894
15067B00505R9529g6892A87956a98137h0651A47446n9738L40194A01344K02989
15057C04333j05123B2066O7663a17527H0492a29235C72515D1338K19002D2828
$$ y = [162934, 136135, 228647, 114325, 64658, -82604, 98169, 346884, 194337, -226297, -118233, -168339, 293678, -8400, 46038, 121909, 32242, -32494, 31752, 374127, 17303, 131719, -253727, 136784, 218654, 89793, 60620, 121530, 188211, 124473, -197502, 158314, 44790, -38961, 126276, -15222, 117971, -158578, 221525, 3486, 114961, -1410, 106213, 472316, 182612, 179825, 81894, 56425, -20049, -71921, 291430, -39444, 11830, 141678, 8867, -11337, 232045, 105644, -45269, 7401, 20697, 160207, -43544, 85464, 219787, 184285, 97686, 181648, -35894, 200505, 300034, -76892, 187956, -198137, -80651, 147446, 87708, 427902, 101344, 304333, 199210, 22066, 89729, -117527, 80492, -129235, 372515, 41338, 260340, 42828]
15046A24044J64429G2867a6765C60891G1102J7654J06631K9857K9051j12917K08311
15035C49689d8739C55177O568L3671j01268d7259C65647H7588K28066m4342j12401
15024A58911g852j75353b2721Q249B07685J88803L240j94736O0868j04705a50050
15012B12504A6631P90046A6836P9397Q8712d3944A79180A255K25306j5332m1675
15001A69554J41900n0054A20704e7115C69640b71444C14026A4787J1619N1032
14991G7438L8290K8726K374D3712J62652o3078Q651B5923J06250i0937A14113
14979A89531J08111P5871p6360F3107M41R7841g9320B24415K49695j10316R6894
14968D60688M6627C8290M28214B22602L9354J43988A74373J54067f6807A72231
$$ y = [124044, 288473, 72867, -16765, 360891, 71102, 88756, 195387, 225244, 254295, 141378, 349689, -48739, 355177, 361745, 395416, 294148, -47259, 365647, 87588, 315654, 271312, 158911, -7852, -183205, -22721, -14472, 207685, 396488, 399728, 204992, 265860, 161155, -150050, 212504, 16631, 806677, 16836, 96233, 184945, -43944, 179180, 1255, 226561, 211229, 169554, 311454, 261400, 120704, -57115, 369640, -271444, 314026, 14787, 26406, 77438, 115728, 144454, 146828, 43712, 206364, 143286, 151937, 25923, 132173, -90937, 114113, 189531, 297642, 373513, 297153, 63107, 63548, 161389, -79320, 224415, 474110, 363794, 460688, 507315, 38290, 466504, 222602, 261956, 405944, 174373, 328440, -66807, 172231]
14957C67737B60P2081K61070c423m3948A1644L39266o3830O0896b9922B43277
14945D7496J53020p7098a040A39014J4610N26563l32365I0973C3282L41348a7860
14933B03362L3517P49r9667Q5957J19584b9228A30361J03800l055h933D65642
14921E0727J4101K99204H2049J23165G361L01716a68441A03172N1152j6888K39347
14910C76783Q3866H1043J19918J35268J25480A40226o061j9844M14525j02746
14900D26100n5186J99745A3426J27022K16176q2373O2554j01990K77710A87365
14889B71122P4127E0902K12620M75411l26595j45182K86000j82090m5851O0872
14879C86087j90517G5154J95080L71123k95219A48833J83578K68774A06149K46708
$$ y = [367737, 260, 72341, 333411, -3423, -47371, 11644, 350910, 287080, 347976, -29922, 243277, 47496, 200516, 123418, -1040, 139014, 153624, 680187, 347822, 90973, 33282, 374630, -17860, 203362, 236879, 237628, 137961, 223918, 343502, -29228, 130361, 234161, 231106, -8933, 465642, 50727, 64828, 364032, 82049, 205214, 7361, 309077, -168441, 103172, 154324, 137436, 376783, 460649, 81043, 200961, 336229, 461709, 140226, 134165, 114321, 528846, 426100, 370914, 570659, 13426, 140448, 356624, 274251, 336805, 234815, 512525, 187365, 271122, 345249, 50902, 263522, 738933, 412338, 267156, 553156, 371066, 325215, 386087, 195570, 75154, 270234, 641357, 346138, 148833, 332411, 601185, 106149, 352857]
14869C52857J04530A22105K35413L7131j73634J42095J52245k51504M31882A81863
14858B22280K6424d3246B97567p875Q7685J46578k59030O088J40125K7202a5935
14846E6745P7796L30558B10065L04771j39673J7253j60650C7323O98175k41531
14836D93967j33457J21224q1088j2352P6006q5256q150j44351K7519J71884q4111
14825C41835j11500M28163k11289j58017M49977C25637L2674J38637j69275K40275
14815E67948k58221K76598j60197n8985L590J77376H5909L53716q2373A57388
14804E74761B38029L01665R863j29556J48885j28789k02416c2360G56644C01604
14793E40623j40059L5538K80321j75074k70668M2860k6341K87061B36098M87504
$$ y = [352857, 457387, 122105, 357518, 394649, 221015, 363110, 515355, 263851, 695733, 181863, 222280, 248704, -43246, 297567, 289692, 377377, 523955, 264925, 271013, 411138, 438340, -15935, 56745, 134541, 465099, 210065, 514836, 375163, 392416, 231766, 37323, 735498, 493967, 360510, 481734, 400646, 388294, 464300, 379044, 370894, 226543, 254062, 425946, 341835, 230335, 658498, 447209, 289192, 739169, 325637, 358311, 496948, 327673, 567948, 309727, 586325, 426128, 367143, 370733, 548109, 85909, 439625, 357252, 157388, 574761, 238029, 539694, 549557, 420001, 568886, 440097, 237681, -32360, 756644, 301604, 540623, 400564, 436102, 716423, 541349, 270681, 313541, 287200, 574261, 236098, 723602]
14783G23602k42390A76424M71375j0457K3739k20627j72950N60639l68853J20484
14773E79774P3555j89902j5725j19003K32796r1532l6651K77703k67127j47871
14763B96017L62479r4507j17528M0803K11676k19496K01923J76297l94812K71402
14753G34254l04957L32072l13536l7223L01090C13484K20648o6630J74827J1575
14743F53904J87968j98553l8010k71394O40968j55252l82107M88740k21154Q0896
14733G86006J29029L1757j55795j77528K40334j2053P3169j93137j30388q5256
14723E06138N35522n20455K31590J17874j17165k40071Q0466J95262k34403n2847
14713E01911K48303q9147j20116K66052K5774k44954K24999j60866J45293K7551
$$ y = [723602, 481212, 176424, 647799, 637342, 661081, 440454, 267504, 828143, 459290, 579774, 653329, 463427, 447702, 328699, 561495, 469963, 433312, 711015, 443888, 296017, 658496, 563989, 446461, 487264, 698940, 479444, 681367, 857664, 462852, 734254, 429297, 761369, 447833, 410610, 711700, 313484, 534132, 467502, 642329, 653904, 841872, 643319, 605309, 333915, 974883, 819631, 437524, 926264, 705110, 786006, 915035, 946792, 790997, 613469, 853803, 841750, 914919, 721782, 591394, 506138, 1041660, 521205, 752795, 870669, 753504, 513433, 593899, 789161, 554758, 501911, 750214, 661067, 540951, 807003, 832777, 587823, 812822, 651956, 797249, 824800]
14703H24800J68579k96302j25856K08610k0991J63927D01254L41385j68910L13012
14693H86741N8502k92878P1120o0220L26525D60017K16835J22695K44524j70976
14683H73095J50570J35351p8755m42338j51179L64471P1684R1366j3106j68072
14673H33087j01860P4401J39749m06961K44928L3359j65833P1729K94296j22582
14663H94313m7998r1483q5161M0237P12159o10307K80782j44064J2058k42491
14653G18045L05448j70011L04398J55350k10029p9195J00281n3036j11816K10353
14643A169788k93182J64132L37899j90567K2160J04668j85473m04J33603Q0939
14633A343563l20015J43624j1459L35050l91399M30674l33259L4110J33325J61809
$$ y = [824800, 993379, 697077, 571221, 779831, 758840, 922767, 401254, 742639, 573729, 886741, 945243, 652365, 723485, 663265, 989790, 460017, 676852, 799547, 1044071, 873095, 1023665, 1159016, 1080261, 637923, 486744, 851215, 922899, 1014265, 1001159, 833087, 731227, 805628, 945377, 538416, 783344, 816703, 650870, 722599, 1016895, 894313, 846315, 754832, 669671, 709908, 1422067, 811760, 1092542, 948478, 960536, 718045, 1023493, 853482, 1157880, 1313230, 1103201, 1024006, 1124287, 1071251, 959435, 1169788, 876606, 1040738, 1378637, 1188070, 1210230, 1314898, 1129425, 1129021, 1262624, 1343563, 1023548, 1167172, 1155713, 1490763, 1099364, 1530038, 1196779, 1230889, 1364214, 1526023]
14623A526023n55499N44867k82555M9210m8673k38814K13444j92484K23029M9410
14613A287958J25122L91686l27684l58479L06099j61310J77476K66951l18582
14604A389237J43770k02474q2592K73047l3331k57234J00201p8688K46969L884
14594A502789j20906p8248M95039k34558k46138O47871K2802m01474K34863j36998
14584A685042o1029k6169L42650l60401L308P2663L26797j51621o9726K163J01390
14573A865067P69j00669M7993M3489M15001m86956L74900j55797J59310K13572
14563B376679k02206j49344J83985J96528J12236j27672K11538L93477m5685k35293
14553B714243N08965J12197P51177J032053J563529M010567O966341J8195935
$$ y = [1526023, 970524, 1515391, 1232836, 1282046, 1233373, 994559, 1208003, 1015519, 1238548, 1287958, 1413080, 1804766, 1477082, 1118603, 1424702, 1263392, 1440868, 1707819, 1389237, 1533007, 1330533, 1247941, 1520988, 1487657, 1230423, 1330624, 1251936, 1498905, 1502789, 1381883, 1303635, 1798674, 1564116, 1317978, 1965849, 1988651, 1587177, 1822040, 1685042, 1624013, 1597844, 1940494, 1580093, 1583401, 1656064, 1982861, 1831240, 1761514, 1763677, 1865067, 1865836, 1765167, 1813160, 1856649, 2271650, 1784694, 2159594, 2003797, 2163107, 2376679, 2174473, 2025129, 2209114, 2405642, 2517878, 2390206, 2601744, 2995221, 2949536, 2714243, 3223208, 3335405, 4086582, 5118635, 6682164, 10692731, 17659072, 35855007]
14545C5855007J1440875B1075128H488379j964707j762571k170682k45089m25074
14537A920256l9290j22298n9208L39158j65575M8098n9261O6136l55669J29529
14527A701876M62388j73893Q0814p9163J14663O9733J29493P0994K76024m33860
14517B219069J32743J6954L44313m77307K99884L71303o30236L07478M1956l7713
14507B588444k09281K32521P0207k11387n8034Q4249L21993m8409j16017j43495
14497B510791P1435L07588R7987n8005J27205N4691j41156K72033j01442J61291
14487C302418j56031K01433k51677K05590M22008j52502k0752l11239L02358m837
14477C536769J95594j40803R5820q572q1995O33029n55577o3841M26566k35099
$$ y = [35855007, 47295882, 21075128, 8488379, 6523672, 4761101, 2590419, 2345330, 1920256, 1880966, 1758668, 1699460, 2038618, 1873043, 1921141, 1861880, 1928016, 1572347, 1701876, 2164264, 1990371, 2071185, 1992022, 2106685, 2176418, 2305911, 2376905, 2652929, 2219069, 2351812, 2368766, 2713079, 2235772, 2535656, 2906959, 2276723, 2584201, 2626157, 2588444, 2379163, 2611684, 2681891, 2470504, 2412470, 2496719, 2818712, 2770303, 2654286, 2510791, 2582226, 2889814, 2987801, 2929796, 3057001, 3111692, 2970536, 3242569, 3141127, 3302418, 3146387, 3347820, 3096143, 3301733, 3723741, 3571239, 3550487, 3239248, 3541606, 3536769, 3732363, 3591560, 3687380, 3678808, 3596813, 4229842, 3674265, 3610424, 4036990, 3801891]
14467C801891L42982J23976j41548K95340j05323J36682l91914K96963L93998
14458D753047l12648L0013N06543k80321q1125L70205l29896J3161m0584O11075
14448E239470l4496j8296j72219J66181j4164L98964Q316j6168Q8693L9552k29083
14437E456750M85363m1553j82711J74798P9488K35078l08361N09818l36018L98105
14427F470757J61841p7018P1329K19952L04914l0738R1016k29890M09341J2663
14417G404167J33951J64536j05971Q45041m54534K51440J12230L6457J68177l107
14407H552387O1221K13222N2131L95759J41877j54668L99217J08531Q6379K51021
14397A0107077J46142j15448L56321L7941K84328L34485L87625K25943O6283J24050
$$ y = [3801891, 4144873, 4268849, 4127301, 4422641, 4317318, 4454000, 4062086, 4359049, 4753047, 4440399, 4470412, 4976955, 4696634, 4615509, 4985714, 4655818, 4668979, 4628395, 5239470, 5204974, 5186678, 5014459, 5180640, 5166476, 5565440, 5573756, 5557588, 5646281, 5685833, 5456750, 5942113, 5900560, 5717849, 5892647, 5972135, 6207213, 5898852, 6408670, 6072652, 6470757, 6632598, 6555580, 6626909, 6846861, 7151775, 7121037, 7212053, 6982163, 7391504, 7404167, 7538118, 7702654, 7596683, 8441724, 7987190, 8238630, 8350860, 8387317, 8555494, 8552387, 8613608, 8826830, 8878961, 9274720, 9416597, 9261929, 9661146, 9769677, 9856056, 10107077, 10253219, 10137771, 10494092, 10532033, 10816361, 11150846, 11538471, 11764414, 11830697, 11954747]
14387A1954747J91994K65299k6158L54521L38848J02769N07594K2905K88080J19335
14377A4119934K48287L73758O70499j39111K92911N76934J87483J44434N44877
14368A7020006J72842P77781L02887K83290J69347P46552J20243L71341O29549
14359B0593838N38339L52586L92176N74761N37062Q12903M78542M14197J54267
14350B4848671Q30892J060702K56136P69601Q85483N02928J043069M21333R74753
14341C1593568Q98965Q58228P72870J140630O25238R58431J327325J058293J563037
14332D0796585R09914J618091Q61871J793431J078869J516989J863053J096635
14324E1535438J842087J837280K261247J703994K153330K458401K031928K661078
$$ y = [11954747, 12146741, 12412040, 12385882, 12740403, 13079251, 13182020, 13689614, 13712519, 14000599, 14119934, 14368221, 14741979, 15412478, 15273367, 15566278, 16143212, 16330695, 16475129, 17020006, 17192848, 17970629, 18273516, 18556806, 18726153, 19472705, 19592948, 19964289, 20593838, 21132177, 21484763, 21876939, 22451700, 22988762, 23801665, 24280207, 24694404, 24848671, 25679563, 26740265, 26996401, 27766002, 28651485, 29154413, 30197482, 30618815, 31593568, 32492533, 33350761, 34123631, 35264261, 35889499, 36847930, 38175255, 39233548, 40796585, 41706499, 43324590, 44186461, 45979892, 47058761, 48575750, 50438803, 51535438, 53377525, 55214805, 57476052, 59180046, 61333376, 63791777, 65823705, 68484783]
14316F8484783K290538K830924L058770L155942L098185L025879L819481L390660
14308I3155162M358837M080920M287276M723688N097757N269971O146965N576054
14300A32696630O241424O612758O844637P607942P955501Q486744Q956949R359675
14292A94762260J0146942J0333397J1079400J1510885J2716147J2557522J3293152
14285B76399705J3505951J4198126J4354761J4264042J4788368J4160769J3784352
14278C75456074J3194266J2346667J1409895R337545P820038M275642J329027
14271D35169154N77215J343613j811102k317102k208892n373992q117980j0372762
14263D06888152j1947842j2700661j3596987j4365085j4577231j4887407j4519818
$$ y = [68484783, 70775321, 73606245, 76665015, 79820957, 82919142, 85945021, 89764502, 93155162, 97513999, 101594919, 105882195, 110605883, 115703640, 120973611, 127120576, 132696630, 138938054, 145550812, 152395449, 160003391, 167958892, 176445636, 185402585, 194762260, 204909202, 215242599, 226321999, 237832884, 250549031, 263106553, 276399705, 289905656, 304103782, 318458543, 332722585, 347510953, 361671722, 375456074, 388650340, 400997007, 412406902, 421744447, 429564485, 433840127, 435169154, 435746369, 437089982, 435278880, 432961778, 430752886, 425378894, 417260914, 406888152, 394940310, 382239649, 368642662, 354277577, 339700346, 324812939, 310293121]
14256C10293121j4916452j3948420j3942804j2763677j1570960j1841633j1852162
14249B19457013j0854219j0427630r678100r204045q539662p766434p747337p210762
14241A48028824p111876o537742o098596n421841n316628m927443m929500m733608
14233A02951590m151473m377969l070997l519038l801123l062821l219185l049794
14225G4699190k768087k647655k513471k411912k242646j806015k200903j708437
14217E6400064k047152j780229j806124j063279j223596j594584j847670j474876
14209D3562554j309786j100482o98243r79680j329421j496933o63931j596147
14201C4387931l44036l40175r96885j085009j069253n42952j116863k60092p30217
$$ y = [310293121, 295376669, 281428249, 267485445, 254721768, 243150808, 231309175, 219457013, 208602794, 198175164, 188497064, 179293019, 170753357, 162986923, 155239586, 148028824, 140916948, 134379206, 128280610, 122858769, 117542141, 112614698, 107685198, 102951590, 98800117, 94422148, 91351151, 87832113, 84030990, 80968169, 77748984, 74699190, 71931103, 69283448, 66769977, 64358065, 62115419, 60309404, 58108501, 56400064, 54352912, 52572683, 50766559, 49703280, 48479684, 46885100, 45037430, 43562554, 42252768, 41152286, 40454043, 39474363, 38144942, 36648009, 35984078, 34387931, 34043895, 33703720, 32706835, 31621826, 30552573, 30009621, 28892758, 28632666, 27902449]
14192B7902449n13873j040224n80418n73265n37456o36207n22502l55938o37859
14183B2504707n39396q12258j95446n42188k48065l87253n09502o75953j70235
14174A8424411l89362m2013o85155j22352n34905k33061j56993k10224R432q07198
14164A5252580n67349K19294l37473O823m41393m21121k25691j33252j26254n36095
14154A2690069N8200j4716n07690k07970o3031l56057Q7843m72815k85111j51960
14144A0776762k91356J86639r7145k75444j9491k56589l88612p4960N31619m72646
14134I618777k61302j86431o6375L1819m94842r3067J06620l8956k65527n7972
14124H292744p2380k22502p2780j58877o1109j6583j30137J9035j21474m0829
$$ y = [27902449, 27388576, 26348352, 25767934, 25194669, 24657213, 24021006, 23498504, 23142566, 22504707, 21965311, 21153053, 20957607, 20415419, 20167354, 19780101, 19270599, 18594646, 18424411, 18035049, 17993036, 17307881, 17185529, 16650624, 16417563, 16260570, 16050346, 16059778, 15252580, 14685231, 14904525, 14567052, 14573875, 14132482, 13711361, 13485670, 13352418, 13226164, 12690069, 12748269, 12733553, 12225863, 12017893, 11954862, 11598805, 11686648, 11213833, 10928722, 10776762, 10485406, 10672045, 10574900, 10299456, 10279965, 10023376, 9634764, 9559804, 10091423, 9618777, 9357475, 9171044, 9104669, 9136488, 8641646, 8548579, 8655199, 8616243, 8350716, 8292744, 8220364, 7997862, 7925082, 7766205, 7705096, 7688513, 7558376, 7577411, 7455937, 7415108]
14114G415108j06338m78288j20778q0045P3526K23764l18627j9372j01476j98778
14104F288696p0825l9610r9571L43420l27046l37162L18993k96829p9401J46533
14094E847198k21982J41482k70590J12771k43779n9155k28186N636K67332j01335
14084E249392o20970L77846m76566K63758J27421Q4656m01241r0399J8592J59778
14074D692267l58466L75814m04681J67042P4771j11019R3518l59919j08070K50415
14064D311672n16374L18640r033q2018l16097L23406o17O1611j06088L4598Q7412
14053D107112l10511r0153r0674p6900M2626N00030r73711K68817J88446k26137
14043C338945j43597J46681K39798m14180J47516M1114J05976l25345J9903Q092
$$ y = [7415108, 7308770, 6830482, 6709704, 6629659, 6703185, 6926949, 6608322, 6588950, 6487474, 6288696, 6217871, 6178261, 6078690, 6422110, 6095064, 5757902, 6076895, 5780066, 5700665, 5847198, 5625216, 5766698, 5496108, 5608879, 5365100, 5305945, 5077759, 5083395, 5350727, 5249392, 4628422, 5006268, 4529702, 4793460, 4920881, 5005537, 4604296, 4513897, 4532489, 4692267, 4333801, 4709615, 4304934, 4471976, 4546747, 4435728, 4529246, 4169327, 4061257, 4311672, 3795298, 4113938, 4104905, 4022887, 3706790, 4030196, 4029579, 4091190, 3985102, 4019700, 4107112, 3796601, 3706448, 3615774, 3538874, 3581500, 4081530, 3107819, 3376636, 3565082, 3338945, 3195348, 3342029, 3581827, 3167647, 3315163, 3356277, 3462253, 3136908, 3156811, 3164903]
14033C164903l0889k13401J92277l8752J27799l89078o9395L84559k95981q3118
14023B748924K23112j62502m318m93566J78826J65944J7966j93481j82224L15306
14013B613987k28871q5779J66043k283P8776m69835K01772j24429J55763r2794
14003B212350L17037m32645o403K73517m18391P5937n1743K25056q2658k78549
13993A833508Q7151j81427N6312R26559L40237K380578O056994J6011783K2528564
13984E0040259k1843352A3447634n777734k050541q83513o30213l53036l80061
13976C372536n7001m82580K95093n10649R4828k94745k7633J53220l0385k81230
13966B231454M58908L4164k37783k19311j39567J5940j70594K10841j67567k45920
$$ y = [3164903, 3134014, 2920613, 3112890, 3074138, 3201937, 2812859, 2743464, 3128023, 2832042, 2748924, 2972036, 2809534, 2805216, 2311650, 2490476, 2656420, 2674386, 2480905, 2298681, 2613987, 2385116, 2299337, 2465380, 2463097, 2541873, 2072038, 2273810, 2149381, 2305144, 2212350, 2529387, 2096742, 2090339, 2363856, 1945465, 2021402, 1969659, 2194715, 2112057, 1833508, 1920659, 1739232, 1795544, 2722103, 3062340, 5442918, 11499912, 27511695, 50040259, 28196907, 13447634, 7669900, 5619359, 4735846, 4105633, 3752597, 3372536, 3315535, 2832955, 3128048, 2617399, 2712227, 2417482, 2389849, 2543069, 2512684, 2231454, 2690362, 2724526, 2486743, 2267432, 2127865, 2143805, 1973211, 2184052, 2016485, 1770565]
13956A770565M25762j42330p1787J87515j3767Q0518o44009L18847k53625J38826
13946A796515J3634M21382n35367M16059q4743l07214J50664k16520Q2008J14862
13936A851280k06628o6828R1976J01082k47804j15712N31251m08601L4396J20396
13926A684808j8385p9900j53002L95551k33433j2677n1480k10306L79181l43731
13916A356626J66643Q3355K7989n5733J15268k61349o5276K91041r6322l85378
13906A176864J38605K30237j56428J16806j9592l37523K67526K08k84189K9304
13896A161818L4987J89273l23101K57581N9138q0513m8105J71738J19702l35510
13886A207008k18253N5939M57803l19015O5611J86062m95638J89015M5422j09811
$$ y = [1770565, 2196327, 2053997, 1982210, 2169725, 2155958, 2236476, 1592467, 1911314, 1657689, 1796515, 1810149, 2231531, 1696164, 2112223, 2027480, 1720266, 1870930, 1654410, 1736418, 1851280, 1644652, 1577824, 1669800, 1770882, 1523078, 1407366, 1938617, 1530016, 1564412, 1684808, 1666423, 1586523, 1433521, 1829072, 1595639, 1582962, 1531482, 1321176, 1700357, 1356626, 1523269, 1606624, 1634613, 1578880, 1694148, 1432799, 1367523, 1658564, 1562242, 1176864, 1315469, 1545706, 1389278, 1506084, 1486492, 1148969, 1416495, 1416703, 1132514, 1161818, 1196805, 1386078, 1062977, 1320558, 1379696, 1299183, 1251078, 1422816, 1542518, 1207008, 988755, 1044694, 1502497, 1183482, 1249093, 1435155, 939517, 1128532, 1173954, 1064143]
13876A064143J86529J28984o742o5224k25751j7803M16706k33576M00142n28172
13866A119236P6821l19562L11759J06511m8003k42556N4444J33309j20509J63713
13856A235163m74618M18731k74722K31729k9979k03171N1441J33942K14543k93932
13846A009127j17667L54583k06993L3069J34130k12959J58490m36828L53671M1998
13836A110621Q2711j12938k7938m28841P5308N56514m23039j35698L31652q4674
13826I43678R5193p8628K2741j18111N9380K7029j22911K49837R540l7387n1987
13815I98374o9532k23727J70612k17811L90694k5434L9979j64911J96875p6933
13805A018186k14719L88565m53805k22074q8956O88106k7959n10401M86317D98283
$$ y = [1064143, 1250672, 1379656, 1372914, 1307690, 1081939, 1064136, 1480842, 1247266, 1647408, 1119236, 1196057, 876495, 1188254, 1294765, 1246762, 1004206, 1058650, 1191959, 1071450, 1235163, 760545, 1179276, 904554, 1136283, 1106304, 903133, 954574, 1088516, 1303059, 1009127, 891460, 1246043, 1039050, 1072119, 1206249, 993290, 1151780, 714952, 1068623, 1110621, 1193332, 1080394, 1052456, 623615, 698923, 1255437, 832398, 696700, 1028352, 943678, 1038871, 960243, 982984, 864873, 924253, 951282, 828371, 1078208, 1087748, 1050361, 998374, 928842, 705115, 875727, 657916, 1048610, 1023176, 1063155, 898244, 1095119, 1018186, 803467, 1192032, 738227, 516153, 427197, 1115303, 1087344, 576943, 1063260, 498283]
13794A149318E26324K23737J04258N914m3390j08351J03660j86055K56300j60471
13784G21926J53620q9590l85014M70870j02346B75505N07781J13733j47189j6568
13774G33262Q9755o5147J7487q1735j15377K8230J51411R1073C49372N12777j36724
13763G25425J10034l31503K65198k00830N91448n45313L51937r9560k76610L50615
13753I40841k57224l4861j74845J31859l0215L32066p7808j43564J38644o4342
13743G60551j69053j1991L1897j84232O69681n44445R6366j71694L01458J3049
13733G91587j99514j67290J68407q7428m3386K42232J1416k40560J11829q0692
13723E06601J39817J59387k75493L9790p3845K03562F6503N88026k39654L62028
$$ y = [1149318, 526324, 750061, 854319, 860233, 816843, 708492, 812152, 626097, 882397, 721926, 875546, 785956, 400942, 871812, 769466, 275505, 783286, 897019, 749830, 733262, 823017, 757870, 775357, 693622, 578245, 606475, 757886, 848959, 349372, 862149, 725425, 835459, 503956, 769154, 568324, 1159772, 614459, 966396, 866836, 590226, 940841, 683617, 648756, 473911, 605770, 575555, 907621, 829813, 686249, 824893, 760551, 591498, 579507, 611404, 427172, 1096853, 552408, 648774, 477080, 778538, 791587, 592073, 424783, 593190, 505762, 462376, 704608, 716024, 475464, 587293, 506601, 646418, 805805, 530312, 570102, 496257, 699819, 66503, 654529, 414875, 776903]
13713G76903k5998J27990k53178P7382J4741N2201P9862j94686j41670j32019
13703C81528j7305J1486o8800P7233j1869K95376p7741K7924j38047j04390O81424
13692A056819E23332j47137N22611C46953J53764N767L3351q0094J02611k29238
13682C33114M6669J38233J15115J00778l52473K59784J5834k35682A92594K88350
13672D80944j13500O0154r5689R5310j9034J25970J30758l00349J98981j08952
13662D54593J52963j45279j51665K44563j13091J41986j56045L59528l85840j63784
13652B37929K50129j39246P3598p080A97219R3085M3910N9793K4555J1198J74433
13641F04193A55435L87524B10541J64385J18018N7802j02329B09808L31254j32466
$$ y = [776903, 750905, 878895, 625717, 703099, 717840, 770041, 849903, 655217, 513547, 381528, 364223, 375709, 306909, 384142, 372273, 667649, 589908, 617832, 479785, 375395, 1056819, 523332, 376195, 898806, 346953, 500717, 506484, 539835, 459741, 562352, 333114, 379783, 518016, 633131, 733909, 381436, 641220, 657054, 421372, 192594, 480944, 367444, 427598, 331909, 427219, 408185, 534155, 664913, 364564, 563545, 454593, 607556, 462277, 310612, 555175, 442084, 584070, 428025, 787553, 401713, 237929, 488058, 348812, 422410, 415330, 197219, 290304, 334214, 394007, 418562, 429760, 604193, 155435, 542959, 210541, 374926, 492944, 550746, 448417, 209808, 541062, 408596]
13631D08596j88040O1375L08252j18602J1455L0589A79212L13120M28058C26884
13620D39320j69114K6981N81690B04666o636l5359K59353J26504c904G7081J57771
13609B34852L31479B33077J92913N552A91730p1740K13036K04521n2196k35609
13599B49742K61075B17852N57237C16413J09604K31990r3639j2797Q741E5086
13588D00672R0593k3225J25222k78033N5687A80325L69955k04188J41556m7664
13578D39984K9299m3124P466L1086j33869I6900J60693L8595L44745k35116N039
13567D10856J2762A79860M33547j05880j24888r9178J20262m2473J90830J37451
13557F89531p7201j145j32347g5080C42026A28702L44228k21048G1899M34634
$$ y = [408596, 220556, 281931, 590183, 471581, 483036, 513625, 179212, 492332, 920390, 326884, 439320, 270206, 297187, 878877, 204666, 198030, 162671, 422024, 548528, -3904, 77081, 234852, 566331, 233077, 425990, 431542, 191730, 119990, 333026, 537547, 485351, 249742, 510817, 217852, 775089, 316413, 426017, 658007, 564368, 551571, 560312, 55086, 400672, 491265, 468040, 593262, 315229, 370916, 180325, 550280, 346092, 487648, 439984, 469283, 426159, 433625, 464711, 330842, 96900, 257593, 296188, 640933, 405817, 410856, 423618, 179860, 613407, 507527, 382639, 283461, 403723, 361250, 552080, 689531, 612330, 611185, 478838, -75080, 342026, 128702, 472930, 251882, 71899, 506533]
13547E06533j02873J62503j45991j81560J65212j00482C0324L16486o8343n635
13537B72832R5558Q2715l8149N7892j29522n9164J81841q7773J25947o052o4398
13526D31727j32127n6905R4631r3307Q8808E0291N79583o0326j96956K24217k10441
13515C86368j83782J17063A20781K75871j39472J66094A4053N24963J31080O7648
13505G37744B00655d2253C72712j44043M14744l19907j48350K10175r2757I882
13494D8931L09768K6395D0083L81735A16374L51823I389O4781M32094b0610l6317
13483e6927G9787M11370o0008B02369M05007a8533B73534j25235J22400f939D41819
13471C33689J53131A49057D3430K26996M0951J17844I6721J17277j7642K7937
$$ y = [506533, 403660, 566163, 420172, 238612, 403824, 303342, 30324, 346810, 278467, 272832, 368390, 451105, 412956, 470848, 341326, 282162, 464003, 376230, 502177, 496125, 431727, 299600, 242695, 337326, 244019, 332827, 50291, 629874, 569548, 372592, 596809, 386368, 202586, 319649, 120781, 396652, 257180, 423274, 14053, 539016, 670096, 737744, 200655, -42253, 372712, 228669, 643413, 323506, 175156, 385331, 292574, 9882, 48931, 358699, 385094, 40083, 421818, 116374, 468197, 9389, 74170, 506264, -20610, -56927, 79787, 491157, 431149, 202369, 607376, -18533, 273534, 148299, 270699, -6939, 441819, 333689, 486820, 149057, 43430, 270426, 311377, 429221, 96721, 213998, 196356, 224293]
13461B24293J84843j28360r6630R069J21286P237J00213A04628J22424O5015J43313
13450D35380P7187A56834B8072J74071L16216k12953J49475A84315d397B85689
13439A74119J22250n0351H3242b2997A62872L6968f617n164A5415N84040B96651
13427C60715j60924J93284j43127j3711L70173I2066m3240F581J61981b4778B47777
13415c3622B43819a16148A28030R4256G1395a6369A44445M37260A80419J05430
13405B85849L81968l3465k96123r9486J23409a52204A61133Q7343p1806J20510
13395B97180M6844A48916O8F1688B6015K48232j259M8337j27569P0332A24928
13383B22666A01603g1704B70263j5232m8372L54043B53822q2909J19185J70571
$$ y = [224293, 409136, 280776, 184146, 193215, 314501, 321738, 421951, 104628, 227052, 292067, 435380, 512567, 156834, 28072, 202143, 518359, 305406, 454881, 184315, -4397, 285689, 174119, 296369, 246018, 83242, -22997, 162872, 199840, -6617, -11781, 15415, 599455, 296651, 360715, 199791, 393075, 249948, 236237, 606410, 92066, 48826, 6581, 168562, -24778, 247777, -33622, 243819, -116148, 128030, 222286, 71395, -16369, 144445, 581705, 180419, 285849, 667817, 634352, 338229, 238743, 362152, -152204, 161133, 248476, 176670, 297180, 344024, 148916, 148984, 61688, 26015, 274247, 272988, 321325, 193756, 264088, 124928, 222666, 101603, -71704, 270263, 255031, 206659, 560702, 253822, 170913, 290098, 460669]
13373D60669n7621a84538A88082Q6482j22607l0109J49392I7291k8702J36722
13363B05311m7742e0402D9826L11388k9000h9031p9690C93964K76j87350i8531
13351A44867P2500A06273K14320L2708R7189B17205B6640M38467G5591K36765
13341C12356j02209J30924A30032L04018n7632A70391o28L67790B51846O2377
13331C14223J07760p039a23505F2513L0572M04347m2532i9447d6650G367L13056
13320C20423j9610j06735K8305j8509j738C1796K59766q3237m4409M71895A56182
13308A27945M93492j92954H7977K23181l130q8166L083e0918B36319C1423J41649
13297A73072l7638M7678g8005C5274Q3389O5548L37963B38215K0461N9123H4459
$$ y = [460669, 403048, -184538, 188082, 274564, 151957, 121848, 271240, 97291, 68589, 205311, 157569, -50402, 49826, 361214, 332214, -89031, -168721, 393964, 394240, 206890, -98531, 144867, 217367, 106273, 320593, 353301, 450490, 217205, 26640, 465107, 75591, 312356, 210147, 341071, 130032, 434050, 376418, 170391, 169763, 537553, 251846, 314223, 421983, 414944, -123505, 62513, 93085, 497432, 454900, -99447, -46650, 7367, 320423, 300813, 194078, 222383, 203874, 202136, 31796, 291562, 208325, 163916, 635811, 156182, 127945, 621437, 428483, 87977, 311158, 308028, 219862, 222945, -50918, 236319, 31423, 173072, 135434, 183112, -78005, 35274, 118663, 184211, 522174, 238215, 258676, 317799, 84459]
13285I6347M47378B60577L34303i4629C8667K69916q9796L13830b4017A84370
13274C86863o4281H5043M3392c11421F7754a51359B40801K5319P4346j4061A33426
13262A4074J10132P5671q9113q659J31121C1384K2840M0604g7407c5808C16491
13250D36771k02123d4204E0635B3123M09971j46340f102B37997P1986A34818O1192
13239A96010K00463b3701A17593N3990J55995G8688K81851E1548J08980D9082
13228h3273C14836p4505p6836K30251A12818K19120f5812C24696D9987J28940
13218A78927K31497H2933J30071o9747a44063b7678j2329A97185A7584K12147
13208B29731B8386N3856J23136j00766K71247a62491A03942l1782J67208o4803
$$ y = [96347, 543725, 260577, 594880, -94629, 38667, 308583, 218787, 532617, -24017, 184370, 386863, 322582, 85043, 128435, -311421, 67754, -151359, 240801, 266120, 340466, 326405, 133426, 14074, 124206, 199877, 110764, 102105, 233226, 31384, 54224, 94828, -77407, -35808, 316491, 436771, 234648, -44204, 50635, 23123, 433094, 286754, -6102, 237997, 309983, 134818, 196010, 396473, -23701, 117593, 171583, 327578, 78688, 360539, 51548, 160528, 49082, -83273, 314836, 240331, 163495, 393746, 112818, 331938, -65812, 324696, 49987, 178927, 410424, 82933, 213004, 143257, -144063, -27678, -40007, 197185, 17584, 229731, 28386, 82242, 205378, 104612, 375859, -162491, 103942, 72160, 239368, 174565]
13198A74565K12375J539D3074M2965J26008r1895J30164j3339o2026Q4137A06067
13186I0J46025F0284P0388L5045G1135l1493a0618E01675B03096n7472o2498a8169
13173A98901o3427M4239O0447a94460B64491J8863C1219Q5288b4929A68049b04931
13161H0367c4350j05617B19081b35067B20329A2423J79239a77678O3608J3320
13151a00750M488A82859J23678J53838E5328a38768H0077L62452B17694K66639
13141D84333G4307Q6581J70508J44303a9035n166Q265A72797D3447g4197C9107
13129A55281k1982a64782h0682A08089J93643K33130b778n6157F4484K22616R3078
13118C80178D0883Q6703j6990O7727N4884a16635A33308H54M51105a51090B21470
$$ y = [174565, 386940, 388479, 43074, 86039, 212047, 120152, 250316, 236977, 174951, 259088, 106067, 90, 146115, 60284, 130672, 165717, 71135, 39642, -10618, 501675, 203096, 145624, 83126, -18169, 198901, 135474, 179713, 240160, -194460, 264491, 283354, 31219, 116507, -24929, 168049, -204931, 80367, -34350, -139967, 219081, -235067, 220329, 12423, 191662, -177678, -114070, -100750, -96262, 182859, 306537, 460375, 55328, -138768, 80077, 442529, 217694, 484333, 74307, 160888, 331396, 475699, -19035, -24201, -15936, 172797, 43447, -74197, 39107, 155281, 133299, -164782, -80682, 108089, 301732, 534862, -2778, -58935, 64484, 287100, 380178, 40883, 127586, 110596, 178323, 233207, -116635, 133308, 854, 451959, -151090, 221470]
13106a71022N6062c0230k46086C76803F8751D930J58981m1497L2104J55702i2801
13094A37388k5418a58929d4654G5124a47457j29116j2178A71655o4997J01047
13084B07705H0850B7700K6325L45444R6351A66165E656J45484P6137B5217J85837
13073B11054K266L7630d37158c4865k82411A23287J22909M3988p4008h6048A87868
13061H2313R4934J31287A05505L18359G1093l0858g0252A52359N9837G5092L09868
13050C84960j72770d5707D5204g1343l18459a36325B68361m6441J06898I8140
13039A59597a23383A00052K95319j25558C2740A1028h5762B86543r5730f9776
13028G5961L81463F2776a6439B78488E8433L78852c65378E6609J72513A8425P191
$$ y = [-171022, -114960, -30230, -276316, 376803, 68751, 4930, 163911, 122414, 154518, 310220, -92801, 137388, 111970, -158929, -44654, 75124, -147457, -276573, -288751, 171655, 106658, 207705, 80850, 27700, 54025, 399469, 495820, 166165, 5656, 151140, 227277, 25217, 211054, 213320, 250950, -437158, -34865, -317276, 123287, 246196, 290184, 216176, -86048, 187868, 82313, 177247, 308534, 105505, 423864, 71093, 40235, -70252, 152359, 212196, 75092, 384960, 212190, -45707, 45204, -71343, -389802, -136325, 268361, 221920, 328818, 98140, 159597, -123383, 100052, 395371, 269813, 32740, 11028, -85762, 286543, 190813, -69776, 75961, 457424, 62776, -16439, 278488, 58433, 437285, -365378, 56609, 229122, 18425, 25616]
13017B5616M7221J41543p281G3575J63670N6162I8186B6582h0603D43478I9012
13005B04936Q5909j03454K5784A05832L4437P4253a58378H9550A0655L8103J44977
12994A93735I560b28141A01263a03050M5377j62189g5746I9160a15058b4485D0308
12982h7068D11887A19937k7779K34429b35862M9523j0542M4028A5379J34772l3005
12971A17146Q2653E4234a25953B37083J88847f9474m4613A56012L17886b31542
12960C17485m7111F9034J27705n1130E560b2735b180H1509b55486B75624a36117
12948B28971m1466o5240f3229k5606j18596d9815A72474j7127k9621c9949l3324
12937g3273G6742M8797P9220a04718j62377a8410G8518N1628a37442e0746J8170
$$ y = [25616, 72837, 214380, 207099, 73575, 237245, 293407, 98186, 26582, -80603, 443478, 99012, 204936, 290845, 187391, 213175, 105832, 140269, 214522, -158378, 89550, 10655, 48758, 193735, 9560, -228141, 101263, -103050, -57673, -219862, -75746, 99160, -115058, -24485, 40308, -87068, 411887, 119937, 92158, 326587, -235862, -186339, -196881, -152853, 15379, 150151, 117146, 199799, 54234, -125953, 237083, 425930, -69474, -114087, 156012, 473898, -231542, 317485, 270374, 69034, 196739, 145609, 5560, -22735, -2180, 81509, -255486, 275624, -136117, 228971, 187505, 122265, -63229, -88835, -207431, -49815, 172474, 155347, 125726, -39949, -73273, 76742, 125539, 204759, -104718, -267095, -18410, 78518, 130146, -137442, -50746, -32576]
12926c2576B291J75526K02403j20416a14777B40067C6293K4692J32895d6441A58771
12914A868J3201a09475F9444N4882L5361m8319J74717b02249C21111H0252C8637
12902A36498i6202H8817f2016k7819A81748D7007Q7024g0834A73239p1271J25080
12891B27048g0327B10387a37247A43731K99509a89761A47127d63362B12275d3361
12880H892K3329R6346k7288J54602b9359G7141e166B12339a10158A21166b304
12868I3537J66411A25221i7164J4405k9229D82767j07124j41076a60244O2141
12858i8103C9000K92001a68008A32797C1693a72526l9335Q2673A92916D9974J5207
12847F5181L89462d9102B01321c10878D2437g7226A31840b59728B1862a63056
$$ y = [-32576, 2291, 177817, 380220, 259804, -114777, 240067, 36293, 60985, 193880, -46441, 158771, 1868, 15069, -109475, 69444, 124326, 159687, 111368, 286085, -202249, 321111, 80252, 38637, 136498, -96202, 88817, -62016, -89835, 181748, 47007, 134031, -70834, 173239, 101968, 227048, -70327, 210387, -137247, 143731, 443240, -189761, 147127, -463362, 212275, -43361, 8892, 32221, 128567, 101279, 255881, -29359, 77141, -5166, 212339, -110158, 121166, -2304, 93537, 259948, 125221, -97164, -82759, -111988, 482767, 375643, 234567, -160244, -98103, 39000, 331001, -168008, 132797, 31693, -172526, -211861, -129188, 192916, 49974, 65181, 454643, -49102, 201321, -310878, 42437, -77226, 131840, -259728, 21862, -163056]
12836B47093D347J82306c5125A28230a37914G6239L7851j5157C1557a06758A45577
12824d698C81412a1822B21K43332b04587K2350B36478E8731N3417K03948a04892
12812a50038p9126B89573E1801c1707N084k54649c3794E2834a55394C26710j9364
12801C07346j12424B0872a57838N7975A49724m9676N1895l4907d473j68534A5645
12789A31725B5766J6364a27841e8492a751o2275j5864G3929a29832C0654b45042
12777i7214I2737b68301B0071f0764A11528J64612c28345p6889J64310c0589F9788
12765C14478A29904L1636o3543Q022g3272l3677B21769H6664b5681B692K24874
12754B27566A2622K80077A6673O7291J65701m5409A7158a0452F7111a072A48524
$$ y = [247093, 4347, 186653, -35125, 128230, -137914, 76239, 114090, 98933, 31557, -106758, 145577, -4698, 381412, -11822, 221, 243553, -204587, -182237, 236478, 58731, 112148, 316096, -104892, -150038, -229164, 289573, 51801, -31707, -26623, -281272, -33794, 52834, -155394, 326710, 307346, 194922, 20872, -157838, -99863, 149724, 100048, 151943, 117036, -4473, -173007, 15645, 131725, 25766, 42130, -127841, -58492, -1751, -64026, -79890, 73929, -129832, 30654, -245042, -97214, 92737, -268301, 20071, -60764, 111528, 276140, -328345, -405234, -240924, -30589, 69788, 314478, 129904, 161540, 97997, 106019, -73272, -106949, 221769, 86664, -25681, 2692, 227566, 12622, 292699, 16673, 83964, 249665, 204256, 17158, -10452, 67111, -1072, 148524]
12742A9696K21485D6275R3719l4673N8958J95560A38067J36206L9741E2330K35009
12731B87339O6336H7100j2456a67747E75a4925A98082M9683L37952b1347I5192
12719a0944C39410g225j83062B47961c2143B05049Q673j02777L24456k2119P422
12708D20704K7187A42887P0291o5435J3079n0482f171A2158a5634C09896l2680
12697B77216a0899m9883A07191h2784A84427h4220B75857O1712a57957A52217
12686i2701a7938A46353j1760A7243b71916h6509A28555m7283k9507a17082F1248
12674A38694J01958p9202o9655K3936A2505J59511d5440A17905k3896m5483j3423
12663C5103h6401a9814G2424q173j6843R4164d4241k3560A16641J69617B4722
$$ y = [19696, 241181, 46275, 139994, 105321, 164279, 359839, 138067, 274273, 314014, 52330, 287339, 353675, 87100, 74644, -167747, 575, -14925, 198082, 247765, 585717, -21347, 95192, -10944, 339410, -7225, -190287, 247961, -32143, 205049, 213722, 110945, 435401, 413282, 420704, 447891, 142887, 213178, 147743, 160822, 110340, -6171, 12158, -15634, 309896, 277216, -10899, -60782, 107191, -82784, 184427, -84220, 275857, 337569, -157957, 152217, -92701, -17938, 146353, 134593, 17243, -271916, -86509, 128555, 81272, 51765, -117082, 61248, 138694, 240652, 161450, 91795, 115731, 12505, 172016, -45440, 117905, 94009, 48526, 35103, -86401, -19814, 72424, 64251, 47408, 141572, -44241, -67801, 116641, 286258, 24722]
12651f0271A20300j5284l8950e0888A77142J21870J6468j46771F8643K73283Q8784
12640D30710A16094B6187K49209p1474m4280a25673C7392A3770J07382n2733J27666
12629A96085K3720a14672H082J67579N9469k9059a2296A77403n5272J66205H2938
12617D8385i9021c364A20609E3780J04608l7551J28634F6827a29178a7661E27
12605D09986a16218A76172J22395h0925k8765A22004C8365J84384b778F1439C272
12593A09041K9265J23979d486A03880J57465a21450H8697e892r0821L3783L1040
12582c1890A11368O4972P6062i3928K989j91864A68997o2986a30669B9438K72424
12571C01862j34669b81732C6304g6849E2184A6566P1499a19863d4537A3108K7910
$$ y = [-60271, 120300, 105016, 66066, -50888, 177142, 299012, 315480, 168709, 68643, 341926, 430710, 116094, 26187, 275396, 203922, 159642, -125673, 37392, 13770, 121152, 68419, 196085, 219805, -114672, 8082, 175661, 235130, 206071, -12296, 177403, 122131, 288336, 82938, 48385, -99021, -3364, 120609, 53780, 158388, 120837, 249471, 66827, -129178, -17661, 527, 409986, -116218, 176172, 298567, -80925, -109690, 122004, 38365, 222749, -2778, 61439, 3272, 109041, 138306, 262285, -4486, 103880, 261345, -121450, 88697, -5892, -96713, -62930, -31890, 111368, 176340, 252402, -93928, -90939, -282803, 168997, 106011, -130669, 29438, 301862, 167193, -281732, 36304, -76849, 52184, 16566, 88065, -119863, -44537, 13108, 41018]
12560D1018J56540r2082q136M09853B0935L2435M395K8717M7218J39666C9946
12548b887A34817R0301a47739E3301d6104l1327B11333j9251R004b77145F6984
12536H2299b44297C5581M14104j88342G2747J68565a26088A34966b37857K2999
12526b14858B24178J62409b45592H4251J6578J22825K23322I2534d0323G8144
12515b66773A50435h9109F8566J19072B7793a8772B86019J06707i8662L2596k5727
12504i1793A12760m8846P2665J57428A31580a08057n8955A0107c45401J05099
12494b40302R4663A12210A3825P9938a51218M0772a0585q6505C5968L61580a51992
12482a00005I9112c1887j85299A69184a07471B04078H571b19874b2178l58360
$$ y = [41018, 197558, 105476, 97340, 507193, 20935, 53370, 57765, 86482, 133700, 273366, 39946, -2887, 134817, 225118, -147739, 53301, -46104, -77431, 211333, 192082, 201086, -277145, 66984, 82299, -244297, 35581, 449685, 261343, 72747, 241312, -126088, 134966, -237857, -214858, 224178, 386587, -245592, 84251, 100829, 223654, 446976, 92534, -40323, 78144, -266773, 150435, -89109, 68566, 187638, 27793, -18772, 286019, 392726, -98662, -66066, -91793, 112760, 63914, 136579, 294007, 131580, -108057, -167012, 10107, -345401, -240302, -145639, 112210, 13825, 93763, -151218, -110446, -10585, -97090, 35968, 397548, -151992, -100005, 99112, -31887, -217186, 169184, -107471, 204078, 8571, -219874, -22178, -380538]
12472c80538C73051e6804B87395G3436g036j12079B297L2660J44419A6744a11396
12460A18533j5661a1006E052J8529J33521a27740d5199I7438B437N2075g6017
12448a26253A03794K01177j38871R6099m1739L6879b7614j5043J9927j47753A72416
12436G2655d9883A4697a62135L6784C84875a52732B25053I1010L15735A41791
12425A08965b71187B7160J03535m8054a13978p7678B89946h9405D57860c2490
12414a05864E4374a3727l1458j79550K4198j71389F1551a62154A80137a2653l1949
12403d4602C80141E3924L0551d49366a55704A11432J11048b98672A02149K20476
12393C22625a50480e2013j50877F593J04094b5444i543j64206d7992k54178B22571
$$ y = [-380538, 373051, -56804, 287395, 73436, -7036, -119115, 2297, 34957, 179376, 16744, -111396, 118533, 102872, -11006, 5052, 23581, 157102, -127740, -45199, 97438, 2437, 54512, -76017, -126253, 103794, 304971, 166100, 262199, 220460, 257339, -27614, -42657, -22730, -170483, 172416, 72655, -49883, 14697, -162135, -125351, 384875, -152732, 225053, 91010, 406745, 141791, 108965, -271187, 27160, 130695, 82641, -113978, -191656, 289946, -89405, 457860, -32490, -105864, 54374, -13727, -45185, -224735, -200537, -371926, 61551, -162154, 180137, -12653, -44602, 380141, 53924, 84475, -449366, -155704, 111432, 222480, -298672, 102149, 322625, -150480, -52013, -202890, 6593, 110687, -25444, -9543, -173749, -47992, -302170, 222571]
12381a18989i030A63224A0831b97365A70091b42909j28494g7037j50985f7492
12370a7554F7629a28020k7974C09680b44110A5284M5829N7442J80278l5839c4443
12358C4710a75800C29232E4394J70802q6140J02079C5706K32367a3228B51385
12347a41219A96213d9291A07872j6376a3872p150C6887N1761P2448K66077k04628
12336B22545A4570h4722e676A779J08952a10697d7255D7757J87317H9063K80931
12325C69994J16577A69187b3451B5537K91272g2751q3690C4501N0397h9322L8045
12314e1277D44688a3005o3105l0252C2165a82446A1935J24069J26860b12223A97446
12302i0051C229c1152j38370A50354a16386G3080c4763J6549A29886F1405J08964
$$ y = [-118989, -9030, 163224, 10831, -297365, 170091, -242909, -371403, -77037, -228022, -67492, -17554, 67629, -128020, -155994, 309680, -244110, 15284, 61113, 118555, 298833, 262994, -34443, 34710, -175800, 329232, 54394, 225196, 139056, 241135, 35706, 268073, -13228, 251385, -141219, 196213, -49291, 107872, 91496, -13872, -21022, 36887, 88648, 161096, 427173, 222545, 14570, -84722, -5676, 1779, 110731, -110697, -47255, 47757, 235074, 89063, 369994, 486571, 169187, -23451, 25537, 316809, -72751, -156441, 34501, 84898, -89322, -51277, 444688, -13005, -76110, -106362, 32165, -182446, 11935, 136004, 262864, -212223, 197446, -90051, 3229, -31152, -169522, 150354, -116386, 73080, -34763, -18214, 129886, 61405, 170369]
12291A70369d5958D83819B4425K673L01532K9404H4821J03777l4255a6004D5203
12279G3833P5370h8151D60994a4813C92939B3553N42201B40158C3616K68607j47367
12268A54856J8011k8169K8593H4763K8763i8172B80088p3335I1663a86343B18937
12256a90124B72207a56904A34913b73j73321D39606A90888a77093E60260B04921
12245D84056D1578J99852E7606j5108J96988q5004J2359a15001E7651c3337j43332
12234a76669I2279O375l1310J51213a2117C0781L12309G6278K71135M7726g9344
12222F00554B54057B4606M65815m4648j83095M1270A15425k3801P7371R6907i1408
12210a0961o3021G0564f2387A59508a96842e9260C88530a02938C62893f8768D17492
$$ y = [170369, -45958, 483819, 24425, 27098, 328630, 358034, 84821, 188598, 154343, -16004, 45203, 73833, 149203, -88151, 460994, -14813, 392939, 23553, 565754, 240158, 33616, 302223, 154856, 172867, 144698, 173291, 84763, 113526, -98172, 280088, 206753, 91663, -186343, 218937, -190124, 272207, -156904, 134913, -273, -173594, 439606, 190888, -177093, 560260, 204921, 484056, 41578, 241430, 57606, 42498, 239486, 154482, 166841, -115001, 57651, -33337, -176669, 92279, 98654, 67344, 218557, -12117, 30781, 343090, 76278, 347413, 395139, -79344, 600554, 254057, 24606, 490421, 445773, 262678, 303948, 115425, 91624, 168995, 265902, -91408, -10961, -73982, 70564, -62387, 159508, -196842, -59260, 388530, -102938, 362893, -68768, 417492]
12198A22400B7870F830i208C5885K42590a13782B04863E2297a68684a5801C99003
12186B18462l4224m0714J61988j40658K27922A01538K55400j20561l3237q4920
12176A18220a03609A95209h877c030B38586J96470k15753J55159Q7286j94575
12166B67173f4793C26130J52844A54441K16112a71373A59039C0413Q1768J59104
12156B71285A02417P5024K2677P3670E1862g0221j51398A59434J06745I1732j7623
12145G4109l2797f4539B71346j31659o3613C6885H169K22528L1431A20182O506
12134A26688K40856b68220Q4901b7866B32406c48569e6532I50a75101C60601b82004
12122B08996h9626A94695k6941h5780E0895J52464B2992K54363E9093b16311D9909
$$ y = [122400, 27870, 6830, -9208, 35885, 278475, -113782, 204863, 52297, -168684, -15801, 399003, 218462, 184238, 143524, 305512, 164854, 392776, 101538, 356938, 236377, 203140, 118220, -103609, 195209, -8877, -3030, 238586, 435056, 219303, 374462, 461748, 267173, -64793, 326130, 478974, 154441, 370553, -171373, 159039, 30413, 112181, 271285, 102417, 177441, 200118, 273788, 51862, -70221, -221619, 159434, 266179, 91732, 74109, 41312, -64539, 271346, 139687, 76074, 36885, 8169, 230697, 262128, 120182, 126688, 367544, -268220, -183319, -27866, 232406, -348569, -56532, 950, -175101, 360601, -282004, 208996, -89626, 194695, 167754, -85780, 50895, 203359, 22992, 277355, 59093, -216311, 49909]
12110A08625J03254q1198B128c7550B0668O891J69927F2505d0293o1214g938m189
12098a2127n2099B12928d27426b12330C1328a89854D3955j5106a55295C02390
12087a61007A68746b85B18970E0034b61646B36684j17468K88265F0975N25867
12077E86842J672050o68890B54690d6849q23j66640e9636k8996A03594K87597
12067C91191G2257J16371M142L9506J06858A0846c7748C45647A54159a74164G2053
12055d6554J5718a4664A22476N3071R0530C1430O8287B4079d8482n2258J2471
12044h8269G3598K26036a68679f169D78764b54448A71434q3654D167f3846a1120
12032i9185B1509a17117I354g6131B71044p4939H7697M737e5911B64909i6048
$$ y = [108625, 211879, 130681, 2128, -37550, 20668, 27559, 197486, 62505, -40293, -101507, -7938, -12127, -64226, 212928, -427426, -212330, 31328, -189854, 43955, 28849, -155295, 302390, -161007, 168746, -285, 218970, 50034, -261646, 236684, 119216, 407481, 60975, 586842, 2258892, 1590002, 254690, -46849, -47672, -214312, -59636, -88632, 103594, 391191, 72257, 188628, 192770, 232276, 339134, 10846, -37748, 345647, 154159, -174164, 72053, -46554, -30836, -14664, 122476, 175547, 266077, 31430, 99717, 24079, -48482, -100740, -88269, 73598, 299634, -168679, -6169, 478764, -254448, 171434, 87780, 4167, -63846, -11120, -99185, 21509, -117117, 9354, -76131, 271044, 196105, 87697, 92434, -55911, 264909, -96048]
12020h0102H6504K27999C1871d8066g3j47297G5688R0618a18111o5778g9189H5294
12007a20890A63080k2589c93314D2429P7131B8557a19722A48345m5684a15635
11996a58953d2140q6424R900N3998B77833B6254j272a65928A2181b07174k8935
11985b36109E6195O318c5666B12849A02409e7695q5546k7082b960C91009d2590
11973A34055J64807a5448B47377A10759D6564a70901A32736a29985j50929B42175
11962A86269h4037A96541d91786B31809A945P6926c05577c1684o5423B5260J15686
11951A40946a99849k22124A17921a46454A24404K71568g6558a6844A5340J06332
11941A21672J29035A23010C3238M8868J21872b48036A07154a19325A01942b5856
$$ y = [-80102, 86504, 314503, 31871, -48066, -73, -147370, 75688, 166306, -118111, -183889, -79189, 85294, -120890, 163080, 140491, -393314, 42429, 119560, 28557, -119722, 148345, 102661, -115635, -158953, -42140, -128564, -118664, -64666, 277833, 26254, 24982, -165928, 12181, -207174, -236109, 56195, 62513, -35666, 212849, 102409, -57695, -143241, -170323, -2960, 391009, -42590, 134055, 298862, -15448, 247377, 110759, 46564, -170901, 132736, -129985, -280914, 242175, 186269, -84037, 196541, -491786, 231809, 1945, 78871, -305577, -31684, -97107, 25260, 140946, -199849, -421973, 117921, -146454, 124404, 395972, -76558, -16844, 15340, 121672, 250707, 123010, 33238, 82106, 203978, -248036, 107154, -119325, 101942, -25856]
11930c57945C10716M05H236C211M5920b39451r1246Q3090E3179J67370A0899a07048
11917B39122h9981m7833A32516c21142a8857H5882K70928B4156a86992c0902A48505
11905c02727J48078B0089a21870B76329A14125e5953l78989A14674a56307A16010
11894a81394a1994j07739n0277H6189L2939b32438A43806o8222J00073b27024
11883h6386j7148I7494a97890R6843Q946j26060a00132J2262n1768b1197n9502
11872h0699A95347B1980a16747e1814n6267E2974f2597k15036a25426j37321A3792
11860a37052j19726A79971G4604b31165A92724l503h3150a5989j23354A55556
11849a7445n5407j32976m9080a7523k10112a05295f081n5922k1156j54775A81627
$$ y = [-357945, 310716, 311121, 8236, 3211, 49131, -239451, -330697, -247607, 53179, 220549, 10899, -107048, 239122, -89981, -137814, 132516, -321142, -18857, 85882, 356810, 24156, -186992, -30902, 148505, -302727, -154649, 20089, -121870, 276329, 114125, -55953, -434942, 114674, -156307, 116010, -181394, -11994, -119733, -170010, 86189, 119128, -232438, 143806, 75584, 175657, -227024, -86386, -103534, 97494, -197890, -101047, -92101, -218161, -100132, -87870, -139638, -21197, -80699, 195347, 21980, -116747, -51814, -108081, 52974, -62597, -277633, -125426, -262747, 13792, -137052, -256778, 179971, 74604, -231165, 192724, 189221, -83150, -15989, -139343, 155556, -17445, -72852, -205828, -254908, -17523, -227635, -105295, -6081, -62003, -83159, -237934, 181627]
11837d5273B50924a26984D02015A01072b2557B2444a48460e4261O917j43897Q7812
11826a03429j06215E0213J60511k7179a40664j73111e3749I7182a39878A33211
11815I87a55169C8236L7004J34103D9341J93736c13734e4040j54806E943e6509
11803c06664A17182a58964I0664i4775g592D20352c0349l40815a45134J2760k1953
11792a54327O8724H8044R1065d1153C30244A40206J76235a734B04974e9000A39571
11780C5142N7228K04355i214A5729e0524D3486b90294D1489a09101l1351D06219
11768i708C21482c412A27031b06412D2207A7365a29090C11697A53313h0504j86972
11757b67476G5197B871K09841a82466h1682j87992g1925A0177c23829L141J0127
$$ y = [-45273, 250924, -126984, 402015, 101072, -22557, 22444, -148460, -54261, -47344, -191241, -103429, -209644, 50213, 210724, 183545, -140664, -313775, -53749, 97182, -139878, 133211, 987, -155169, 38236, 75240, 209343, 49341, 243077, -313734, -54040, -208846, 5943, -56509, -306664, 117182, -158964, 90664, -94775, -7592, 420352, -30349, -371164, -145134, -132374, -154327, -85603, 88044, 179109, -41153, 330244, 140206, 316441, -1734, 204974, -59000, 139571, 35142, 92370, 296725, -9214, 15729, -50524, 43486, -290294, 41489, -109101, -140452, 406219, -9708, 321482, -3412, 127031, -206412, 42207, 17365, -129090, 311697, 153313, -80504, -267476, 75197, 2871, 212712, -182466, -81682, -269674, -71925, 10177, -323829, -320688, -310561]
11746c10561r2911B18911b87273B14759C1914L17010A03072g4712A34950A4954
11735a46497I913M3845m562J02528g7571B82714j25264o2238b90662P297E7080
11723a38504K1648G4918a76318A36727F3752J24539F0795Q1181o9217O5904K2668
11712A61331n0125k2726L71972j01414p0578j21814g047C6821K91049c6105o5645
11701a01750M1241k2209c696j6362H4190a03435A30740R2719b18885J06389H9879
11689A31304Q4988J6338l6999J64886j66366b894A75214J1944d7727A10214k0422
11678H9792J05672b0475j34585C89755b72770d3612A61732F7552a36454p8106
11668b14560C22847r6992p4869h4210B95900a68354b6589E4324K9820b7616L779
$$ y = [-310561, -403472, 218911, -287273, 214759, 31914, 348924, 103072, -74712, 134950, 14954, -146497, 9913, 53758, 49196, 151724, -77571, 282714, 157450, 95212, -290662, -283365, 57080, -138504, -116856, 74918, -176318, 136727, 63752, 188291, 60795, 141976, 72759, 138663, 161331, 111206, 88480, 460452, 359038, 288460, 166646, -7047, 36821, 327870, -36105, -101750, -60509, -82718, -3696, -20058, 84190, -103435, 130740, 223459, -218885, -112496, 89879, 131304, 216292, 232630, 195631, 360517, 194151, -2894, 175214, 187158, -47727, 110214, 89792, 195464, -20475, -155060, 389755, -272770, -43612, 161732, 67552, -136454, -214560, 322847, 225855, 150986, -84210, 295900, -168354, -26589, 54324, 84144, -27616, -23837]
11657b3837A71938m0418c4685D08498a25053b4116A0998a44925C511J58707j7671
11646A44547G0253L4412e1139p4863L1014H736d23366A56990n3429a36788K3666
11635a13122B23920q7186J71202o1549J95386j05218D6197K15466b3582j23276
11625a46858B95963c25735H0118K32680r6965j07429a7697A54115D9307J05Q3546
11614A32958J2638o5501c7688O120A05678C869K32427A02386O0666g7279K6049
11603e1230k14739c3674n2279m7007B97973B1047P5513P5999J8222a66080A38543
11591A58270c33826D84J18676h793A9426N1534J48807j02746J70204F3733L94212
11580D57945A17692J56708A00431a26382n9621A13531k8140C3214a17634C9557
$$ y = [-23837, 171938, 131520, -34685, 408498, -125053, -24116, 10998, -144925, 3511, 162218, 144547, 70253, 104665, -51139, -126002, -94988, 8736, -423366, 156990, 103561, -136788, -113122, 223920, 136734, 307936, 246387, 441773, 336555, 46197, 261663, -23582, -146858, 295963, -325735, 80118, 312798, 215833, 108404, -17697, 154115, 49307, 49412, 132958, 145596, 80095, -37688, -31568, 105678, 3869, 236296, 102386, 163052, -77279, -51230, -265969, -33674, -85953, -132960, 297973, 21047, 96560, 172559, 190781, -166080, 138543, 158270, -333826, 484, 119160, -8793, 19426, 70960, 219767, 117021, 287225, 63733, 457945, 117692, 274400, 100431, -126382, -186003, 113531, 85391, 33214, -117634, 39557]
11569A64150d2198o3449A51783b63647E6900a03213B77166j29005J63167j32807
11559A78521H4966B6751J99296D7056N2746a676A09556C1823b02840I0503J06542
11548A97045F5291a48953P2438B91321I3187J18578K8029m9494K3751c9152B25312
11536A30581B8270M2223L8240a11329C38017G6648h4494a4863A20926r975J00947
11525B11898b11779A93722l3267K44825A38099L05921a17419r6564n1387c7133
11514B04631F4365K69487c304D4321P3974p352J17577A00805m7757g566D5165
11502D35080A62199n8934a09310F8650a5475B27617j7047D8847c3309p1692p5379
11491a80380D37943c3316A00058J50649L40338A52635o1189L00898H8783J95378
$$ y = [164150, -42198, -105647, 151783, -263647, 56900, -103213, 277166, 148161, 311328, 178521, 84966, 26751, 226047, 47056, 99802, -1676, 109556, 31823, -202840, 90503, 197045, 65291, -148953, -76515, 291321, 93187, 211765, 239794, 190300, 214051, -39152, 225312, 130581, 28270, 70493, 108733, -111329, 338017, 76648, -84494, -14863, 120926, 110951, 211898, -211779, 193722, 160455, 405280, 138099, 444020, -117419, -213983, -265370, -37133, 204631, 64365, 333852, -3304, 44321, 118295, 110943, 228520, 100805, 53048, -7566, 45165, 435080, 162199, 103265, -109310, 68650, -15475, 227617, 210570, 48847, -33309, -105001, -180380, 437943, -33316, 100058, 250707, 591045, 152635, 91446, 392344, 88783, 284161]
11481B84161J42888h4440B99839D6733a93971B68457A9818J77696G264J63362
11471A70626A0290L00591D5123K96170j19183g0496J3622B18203i7909B008a26592
11459c9340B02137a74464A65570J07118H3946P4265l3133a21580C91164a84050
11448a72619H6438i9445d3377k4093C21789e4230k09672D5731J46668h7227A08921
11436c1899I541a42297C25502B8177J34500a48476B1746a90554O4858A27405f5541
11424B15643F3899J21438G1466f3153b8802C7543J81795a21814A10476J8778K2525
11413A51779f8075l21903C7180J17512K14339c2243B47265o5378B2997b74844
11402E3176J8232M3713B7510K6693i6613B38042J908a01033j85975B1729a25667
$$ y = [284161, 427049, -84440, 299839, 46733, -193971, 268457, 19818, 197514, 7264, 170626, 10290, 310881, 45123, 341293, 222110, -70496, -56874, 218203, -97909, 2008, -126592, -39340, 202137, -174464, 165570, 272688, 83946, 158211, 125078, -121580, 391164, -184050, -172619, 86438, -99445, -43377, -67470, 321789, -54230, -263902, 45731, 192399, -87227, 108921, -31899, 9541, -142297, 325502, 28177, 162677, -148476, 21746, -190554, -125696, 127405, -65541, 215643, 63899, 185337, 71466, -63153, -28802, 37543, 219338, -121814, 110476, 129254, 151779, -68075, -389978, 37180, 154692, 369031, -32243, 247265, 181887, 22997, -274844, 53176, 71408, 115121, 27510, 54203, -96613, 238042, 239950, -101033, -287008, 21729, -125667]
11390A04277a98973e9918j49954N8547A70228F8284C0154K25638b77757a31572
11379a21481K5491C53457j39827j03725C4376i3386F8148N5536L28777A64157
11368E7914a06250l95955A54431J47157a3005n3970B03307M6164A02144c32659
11357b60506a00623E6969K11677a41218M1832k6297E3482a26601k83917d5003
11346a19916C1989R4867K8327R7534G426K98367G3274a01832C5140h6888j09769
11335a96657E3154R910P6357J11609n8703q8054m9707c29646a41046H4584J31510
11324B16094I0198b11253M1947B401a57488B84949d3210A30025n6462e7425l05029
11313c62454H3283I550K67973b84090I0497O8617c51572e1766B94067I2485f3764
$$ y = [104277, -198973, -59918, -209872, -151325, 170228, 68284, 30154, 255792, -277757, -131572, -121481, -95990, 353457, 213630, 109905, 34376, -93386, 68148, 123684, 452461, 164157, 57914, -106250, -502205, 154431, 301588, -13005, -66975, 203307, 249471, 102144, -332659, -260506, -100623, 56969, 268646, -141218, -99386, -125683, 53482, -126601, -410518, -45003, -119916, 31989, 126856, 155183, 252717, 7426, 305793, 73274, -101832, 35140, -86888, -196657, 53154, 63064, 139421, 251030, 192327, 104273, 54566, -329646, -141046, 84584, 216094, 90198, -211253, -169306, 2401, -157488, 284949, -43210, 130025, 73563, -57425, -362454, 83283, 9550, 277523, -284090, 90497, 159114, -351572, -51766, 294067, 92485, -63764]
11301f3536k26320j19928A98130a62751P6719E8012P0573M8571i8831F0068L5456
11290I5524a19357k1270B68479c16060B94802G0275a10497I2109L2301B0826L932
11279B4758l991d0894n8121C01836A23056b66705l7355f2674k10530f1594l80524
11268d42118C22127C4912c1187A7829K20280D6414a64545A97399d3988p7735A09960
11256b43745j6692a10240j30016A75905m1664d5168o946p0180n8938g3635k03848
11245b77483R1723a7954l32165c5397B74244a36317A57505G1042c97482a17970
11234A22120c5478B07494o3302a70396B38731c60201O3802i5722c6090m1180Q74
11223g6396O641I6482J11985a38444k2558k9990F7003K887K07698h5480j25631
$$ y = [-63536, -289856, -409784, 198130, -162751, -86032, 58012, 128585, 177156, -98831, 60068, 95524, -119357, -140627, 268479, -316060, 294802, 70275, -110497, 92109, 124410, 20826, 24758, 20767, -40894, -99015, 301836, 123056, -266705, -304060, -62674, -273204, -61594, -442118, 322127, 34912, -31187, 17829, 238109, 46414, -164545, 197399, -43988, -121723, 109960, -243745, -260437, -110240, -240256, 175905, 134241, -45168, -52114, -122294, -181232, -73635, -277483, -185760, -17954, -350119, -35397, 274244, -136317, 157505, 71042, -397482, -117970, 122120, -35478, 207494, 144192, -170396, 238731, -360201, -296399, -95722, -36090, -77270, -76396, -69755, 96482, 208467, -138444, -161002, -190992, 67003, 69890, 277588, -85480, -211111]
11212b11111E8675j062a39458C089e2717j22617O3990q3356q683f3018i408F4319
11199I7073b6230j96865A37868j418a87286Q0594r802J1010j54234d7272A75237
11187a94610p7992A30491O8721C1406c25662Q3337E1015c20515B64018A06261
11176d3665p0551A18582e9134j11921M3239D714b57122A58410l6063a20299A71312
11164b45527P385A57828G7485R6731a78410K6864Q316M2055j44865B14319P7909
11153B92228g0476B08419k4864a77010A29031E5526b78248D7499b9075k9303l2615
11142i0993A54199C0618J23502a10023D6950a55448A26492J14563E2687c3572
11131E6988J05908a4143q3895l8385I6284e7188B54463n5459C7723N7804J5036
$$ y = [-211111, 58675, 57613, -139458, 3089, -52717, -175334, -111344, -194700, -203383, -63018, -9408, 64319, 97073, -26230, -223095, 137868, 136450, -187286, -106692, -116494, -105484, -259718, -47272, 175237, -194610, -272602, 130491, 199212, 31406, -325662, -242325, 51015, -320515, 264018, 106261, -43665, -114216, 118582, -59134, -171055, -127816, 4714, -257122, 158410, 122347, -120299, 171312, -245527, -238142, 157828, 77485, 174216, -178410, -151546, -143230, -101175, -246040, 214319, 292228, -70476, 208419, 183555, -177010, 129031, 55526, -278248, 47499, -29075, -58378, -90993, 154199, 30618, 154120, -110023, 46950, -155448, 126492, 241055, 52687, -33572, 56988, 162896, -14143, -98038, -136423, 96284, -57188, 254463, 199004, 37723, 95527, 110563]
11120A10563D1111A2269a17661A40311J36037a01762d0893A12497M0819n2061
11110A01255K82498g1016B05387C4061K62792K1061q2540i3778d0060B18683c07346
11098C80770a7806A81455J84403G8489P5039K13262c2714H8090a5488B11304M8915
11087B60219H174M17107r8998j56880K29539O6368G9247P8534K01957J65134n7918
11076D66954D7466J25001K4069e0882B80319g1025B06085b9870D25822j59715
11066B66107N8962J78554J29431a95327B81442N88554C64832j62180O4325K66027
11056E33004K80730C67356K44167k59443J20124N21951m76784K13547P1636l37188
11046D65366L03177j07396k51130M70880k02328R7203j25194Q3682k65705J64967
$$ y = [110563, 41111, 12269, -117661, 140311, 276348, -101762, -40893, 112497, 153316, 101255, 383753, -71016, 205387, 34061, 296853, 317914, 235374, -93778, -40060, 218683, -307346, 380770, -17806, 181455, 365858, 78489, 153528, 366790, -32714, 88090, -15488, 211304, 260219, 8174, 425281, 326283, 169403, 398942, 465310, 79247, 157781, 359738, 524872, 466954, 47466, 172467, 196536, -50882, 280319, -71025, 206085, -29870, 425822, 266107, 325069, 503623, 633054, -195327, 281442, 869996, 364832, 202652, 266977, 533004, 813734, 367356, 611523, 352080, 472204, 994155, 517371, 730918, 802554, 465366, 768543, 661147, 410017, 880897, 678569, 775772, 650578, 734260, 468555, 633522]
11036F33522J03000q7252M7719j81079J96520J96433D00485J40615J82166l3673
11026F89593j41317K67216k05760m5573o0833m1203K86407R1989k22035O43j15701
11015E03426J9950k51489L55214j90997K03862k05241p2351L33913k44915J13524
11005E64896j5521M8639p8761J13906K16375C87189L11327m3901k37830K68155
10995F84940K36239k19416j70656M75098j53421j09246j54487N43521m03752J25818
10985H54638K0951K389O7784K85474M7281m43834N62559r3245K92975K29523j20339
10974A706156R3902O25713J2915J10248P0368r0772J08212m29932J46379o85522
10964A667667J63404J41245j03121p5319N6011j19849M2693K39990k25739J40685
$$ y = [633522, 736522, 649270, 696989, 515910, 712430, 908863, 400485, 541100, 723266, 689593, 548276, 815492, 609732, 564159, 503326, 462123, 748530, 840519, 618484, 619127, 503426, 523376, 271887, 627101, 436104, 639966, 434725, 362374, 696287, 451372, 564896, 549375, 598014, 519253, 633159, 849534, 387189, 698516, 654615, 416785, 684940, 921179, 701763, 531107, 1006205, 852784, 743538, 589051, 1132572, 728820, 854638, 875589, 877978, 945762, 1231236, 1278517, 834683, 1397242, 1303997, 1596972, 1826495, 1706156, 1800058, 2425771, 2438686, 2548934, 2619302, 2528530, 2636742, 2206810, 2353189, 1667667, 1831071, 1972316, 1869195, 1793876, 1849887, 1730038, 1772731, 2012721, 1786982, 1927667]
10954A927667j08327l27583M98230o31002l18519j13894k73355K08352C91619
10944G80663B27562K10925j55583A06480M6781l8897P0624J44135A24551l6924
10934H7627L49025B08740a05441B24094Q9308b31578F644J73406M0277a35047
10923I4577n873g2938g140A41343F761L7041a05134A85232J8973i4895B11779
10911G8967B1059c206B08082I8472a35641B52006f7463n0742K3401A99109k1886
10900A77223c17479B51536b98392E18929A11260P4043b04639B32024a0528k46399
10890b56927f6673n5270k7711E9870K0659M80312A50983d1289C0585a74051D0376
10878d8409k48952a1545B2858a5616A74422G3238C2343Q6506A8074b7395j47809
$$ y = [1927667, 1819340, 1491757, 1989987, 1358985, 1040466, 926572, 653217, 861569, 391619, 780663, 227562, 438487, 282904, 106480, 153261, 114364, 184988, 329123, 124551, 87627, 436652, 208740, -105441, 224094, 313402, -231578, 6644, 180050, 220327, -135047, 94577, 88704, -72938, -7140, 141343, 6761, 43802, -105134, 185232, 204205, -94895, 211779, 78967, 21059, -3206, 208082, 98472, -135641, 252006, -67463, -118205, -94804, 199109, 177223, -317479, 251536, -298392, 518929, 111260, 185303, -204639, 232024, -10528, -256927, -66673, -121943, -149654, 59870, 80529, 560841, 150983, -41289, 30585, -174051, 40376, -48409, -297361, -11545, 22858, -15616, 174422, 73238, 32343, 118849, 18074, -27395, -175204]
10867a75204A8849N9739J5425J1053C1573l157e9078b6229l1356A42196J02247
10856B44443C1372e5770a3892D53638d2145B9236b31387f1231q8386j04178i9682
10844i6906o0098B4723i4163m69778b28944D9642c0715r8083C9821g6272j60723
10833b36995H7171R9945d2642C12251j55439a10243A7294K7271g7k86475A24535
10821a4970q2276r0128o8501J08276j28410j04878a1904p0644m19925A44487A9951
10809A23373B0954a69836l7573A52906b3167A00769N0869C6150Q9467a23828H9306
10797a29196j51008O9705A22523b16031j7896E2210R3633j1021B2666h621p1054
10786g9675K795m5991L1703I1227a33728B44858F0930J54368c00719J16318I6872
$$ y = [-175204, 18849, 78588, 94013, 105066, 31573, 28416, -59078, -26229, -57585, 142196, 244443, 31372, -55770, -13892, 453638, -42145, 29236, -231387, -61231, -149617, -253795, -99682, -96906, -157004, 24723, -94163, -563941, -228944, 49642, -30715, -128798, 39821, -76272, -236995, 87171, 187116, -42642, 312251, 156812, -110243, 17294, 44565, -77, -286552, 124535, -14970, -97246, -187374, -255875, -147599, -276009, -380887, -11904, -82548, -502473, 144487, 19951, 123373, 20954, -169836, -207409, 152906, -23167, 100769, 151638, 36150, 125617, -123828, 89306, -129196, -280204, -210499, 122523, -216031, -233927, 52210, 145843, 134822, 22666, -8621, -79675, -76880, -122871, -91168, 91227, -133728, 244858, 60930, 215298, -300719, -184401, 96872]
10774a90780n8384A29438A8983K07694K2108j6466a10179A62976a05535J3058
10764i2477B00353e450j3770L055B25880C9217a25791A52802J62279c54220D11241
10752c7152A61066a93268A6625J65897b96439B07363a97417D41533d5919H8968
10741D7142J34079b13727o7562D40499A69849a11162B33411a7910l05153F9823
10730B6795a68478A15932J44144b91706j16504R3928J56846A61696e7429K578
10720e4851B28023b97918g4479E4009e10271A33789A7531h6782D7495a59990B60235
10708A4370g4343K1627D7132b16325k2425B21332A923O5911c39829B60228a49725
10696a37384k0183B3301J04674a68487K6325E2532a08933j41835j3270D1285h8854
$$ y = [-190780, -249164, 129438, 18983, 226677, 248785, 232319, -110179, 162976, -105535, -92477, 200353, -5450, -19220, -16165, 225880, 39217, -125791, 152802, 315081, -354220, 411241, -37152, 161066, -193268, 16625, 182522, -296439, 207363, -197417, 441533, -45919, 88968, 47142, 181221, -213727, -281289, 440499, 169849, -111162, 233411, -17910, -323063, 69823, 26795, -168478, 115932, 260076, -291706, -408210, -314282, -157436, 161696, -57429, -54851, 228023, -297918, -74479, 54009, -510271, 133789, 17531, -86782, 47495, -159990, 260235, 14370, -74343, -52716, 47132, -216325, -238750, 221332, 1923, 67834, -339829, 260228, -149725, -137384, -157567, 23301, 127975, -168487, -142162, 52532, -108933, -250768, -264038, 41285, -88854]
10684d9607C10416c39417d4736k10846b9944j5727A56440a64386d5041j12683
10674a57724A13397b36085I6687a539n8107o3898B72971a00577h600l27739B62396
10662A11820J47657b8679c409j02511j99796L7338d4562j90474A524Q7063K76853
10651C65440a71433j34865d673k38102I334O9148f6980j66293B6g1457B11539
10639b11213j3887R7304M4280A2363a44375D5911f1608k5977k67298E3253b35988
10627D3778O2704k9291a26757A72527d60594D2872b8289H2733R0360E389M7825
10616E3214b90185A60718c27501J37170A15165c73575h7313D197L0882b99435
10605c18129O9115B13756d34321a34961L5852L2042A29380a13904j43988J1634
$$ y = [-49607, 310416, -339417, -44736, -255582, -29944, -45671, 156440, -164386, -45041, -157724, 113397, -236085, 96687, -1539, -59646, -123544, 272971, -100577, -8600, -336339, 262396, 111820, 259477, -28679, -3409, -105920, -305716, -268378, -44562, -235036, 1524, 88587, 365440, -171433, -306298, -4673, -242775, 9334, 78482, -66980, -233273, 26, -71457, 211539, -211213, -225100, -127796, -83516, 12363, -144375, 45911, -61608, -87585, -354883, 53253, -235988, 43778, 106482, 77191, -126757, 172527, -460594, 42872, -28289, 82733, 173093, 5389, 53214, -290185, 160718, -327501, -190331, 115165, -373575, -87313, 4197, 35079, -299435, -318129, -249014, 213756, -434321, -134961, -99109, -67067, 129380, -113904, -257892, -246258]
10595b46258F6185k7185M1349h6362p1928P3777F0104a56194K2059J336I3989
10583A81188a41139j58002a10240b1543k1558D0519a82000j46580b2957A81913
10572A12567i9774A4830b4678H0922b29564q0619d0236j51874B03491b57539B60164
10560F6849h6232B16957d51989c3769a4753A89022i8106M3573b0294j20488A43485
10548H045J25615b5209A43114b10189a8673r6091G3161J25236a67535K7725L4586
10537a05224B97407a09286D9181e6414j01280A34414a95754D0859a88462h2962
10526b4208A5504O3518b36483f8700l18740I4115K20977F7668P6071a0288F7456
10514C0287a25894m4764c4235C60719a1162k03398d6282j54975B95839C7460a23502
$$ y = [-246258, 66185, 39000, 80349, -86362, -158290, -84513, 60104, -156194, -134135, -132799, 93989, 181188, -141139, -299141, -110240, -21543, -43101, 40519, -182000, -328580, -22957, 181913, 112567, -99774, 14830, -24678, 80922, -229564, -310183, -40236, -192110, 203491, -257539, 260164, 66849, -86232, 216957, -451989, -33769, -14753, 189022, -98106, -54533, -20294, -140782, 143485, 8045, 133660, -25209, 143114, -210189, -18673, -114764, 73161, 198397, -167535, -139810, -105224, 297407, -109286, 49181, -56414, -157694, 134414, -195754, 40859, -188462, -82962, -24208, 15504, 79022, -236483, -68700, -387440, 94115, 315092, 67668, 143739, -10288, 67456, 30287, -125894, -170658, -34235, 360719, -11162, -214560, -46282, -201257, 295839, 37460, -123502]
10502a34773B42744g5585k23686F9430a25662P028b4992p0237G5146J05793K50154
10491D31093i1923G6983d7977B48736A03352c1237B27593F8168M3183b40282E3339
10479B07004M89232k25964B20852K40309A74743q552H2884B7268K73356d3502
10468b03857p9408c5443l9510B11511K5873d32549B16265E5218b21754e766m55531
10457d61297a3691A11056J15338j0424c25685i3757A79687c9621p2617A19369
10446I5676c82102Q6200A14333a53837B32910A12602L5049a17878B95145a6675
10435c28759J21820p8150D856b89871i0737j77731B15197F263h0755B5768b11390
10423b04026c6922k94245F7757D97J25163Q1289a04777E4860L1399q349N6767
$$ y = [-134773, 242744, -75585, -299271, 69430, -125662, -118634, -24992, -95229, 75146, 180939, 431093, -91923, 76983, -47977, 248736, 103352, -31237, 227593, 68168, 111351, -240282, 53339, 207004, 696236, 470272, 220852, 461161, 174743, 166191, 82884, 27268, 300624, -43502, -203857, -283265, -35443, -74953, 211511, 237384, -432549, 216265, 55218, -221754, -5766, -461297, -13691, 111056, 226394, 215970, -325685, -93757, 179687, -39621, -112238, 119369, 95676, -382102, -295902, 114333, -153837, 232910, 112602, 147651, -117878, 295145, -16675, -328759, -206939, -285089, 4856, -289871, -90737, -268468, 215197, 6263, -80755, 25768, -211390, -204026, -36922, -331167, 67757, 497, 125660, 206949, -104777, 54860, 86259, 77910, 134677]
10412A34677a06202A07279J51230a14162G5457a79417c2474J5592B49361a85719
10401A2540K30296A03607e95530d91B28421M7252G9239b12877B32238C8337c08318
10389a68906e8722B6405c40243a23003L6717A52800l0175a83742C05874n333A48126
10377A38289l4465J1850O9J610J01339l3973J96821r2458L72727k65720j23558
10366B72531L06654j48920k3268M4527k12137n3345E4994J5778M66984B26859
10355C61733F5694L2161K75130K25763A65136K54033K70782l15294K6092j57578
10345B43171O3176r1645m0300J12353J19127H5678O019a36097B19420a5143p8480
10334i3623B46229a5612A65439h6607C68797a73479A00749n254M14651A33328
$$ y = [134677, -106202, 107279, 258509, -114162, 75457, -179417, -32474, -16882, 249361, -185719, 12540, 242836, 103607, -595530, -491, 228421, 275673, 79239, -212877, 232238, 38337, -308318, -168906, -58722, 26405, -340243, -123003, -86286, 152800, 122625, -183742, 305874, 300541, 148126, 138289, 103824, 115674, 115743, 117353, 218692, 184719, 381540, 289082, 661809, 396089, 272531, 579185, 430265, 406997, 451524, 239387, 186042, 54994, 70772, 537756, 226859, 361733, 65694, 97855, 372985, 598748, 165136, 419169, 689951, 374657, 400749, 243171, 306347, 214702, 174402, 286755, 405882, 85678, 91697, -136097, 219420, -15143, -93623, 246229, -15612, 165439, -86607, 368797, -173479, 100749, 95495, 510146, 133328]
10323A56124J77805J49089j57323A3986J6761J50805f0236F9749K07404e8644
10312i6195A72620d9815j18583h2265A22641L4537a01935E5237L1359O0683b85795
10300B63907N1513G4314K70354b2307F4006i3110H1771J01176c11072i9942E5181
10288a60083N8991A54759d31201a98904i1602A67294b86386h2019G1499c5575
10277a98391N5592F036L86961h4846b4549B85181g5068o6401O464A78248A1620
10265a399B67877c88960g3862B91030H852E79a7848A08365D1358f807I6399O0568
10253A56967a18560B56636R0065f6003F4491b57147R5541b485C9086P8995m7549
10242G0532a40747H3569l0335c62580g3710I7394B2284Q6830l3655b02498F4799
$$ y = [156124, 333929, 483018, 325695, 13986, 30747, 181552, -60236, 69749, 277153, -58644, -96195, 172620, -49815, -168398, -82265, 122641, 157178, -101935, 55237, 86596, 147279, -285795, 263907, 315420, 74314, 344668, -22307, 64006, -93110, 81771, 182947, -311072, -99942, 55181, -160083, -101092, 154759, -431201, -198904, -91602, 167294, -286386, -82019, 71499, -35575, -198391, -142799, 6036, 392997, -84846, -24549, 285181, -75068, -141469, -135005, 178248, 11620, -1399, 267877, -388960, -73862, 291030, 8852, 579, -17848, 108365, 41358, -6807, 96399, 156967, -118560, 256636, 346701, -66003, 64491, -257147, -161606, -2485, 39086, 118081, 70532, -140747, 83569, 53234, -362580, -73710, 97394, 22284, 109114, 75459, -202498, 64799]
10230f7574j53370I3971j1770a173F1293O8439a51522H5493b2340D1875a59129
10218A66514b01225F3182b3851B62945a25411j06945j10962a30936F0109N0889
10208A10998b4038j74609g8007k56040a07898o0754e2426e218k8451k4820a7082
10196c63500B58740j07450a22739o13041B8333a36076J8384k00493o7692A16993
10185d03086G9887l3026J06585P3320b79352C8713l909J38806i1077j22964E432
10173c2966A30946J34113f0625m31456i5574r8142A74763h0380B67408c0973l41534
10162c72507J29690A35286a05237d6725A54272i9739L1787A3670J1598b23636
10151I3333g0993n9712D46379A2383a98131Q0620B01543h2630C9876c59618K7564
$$ y = [-67574, -220944, 93971, 82201, -1173, 61293, 129732, -151522, 85493, -22340, 41875, -159129, 166514, -201225, 63182, -23851, 262945, -125411, -232356, -343318, -130936, 60109, 110998, -24038, -198647, -78007, -334047, -107898, -168652, -52426, -5218, -33669, -58489, -17082, -363500, 258740, 151290, -122739, -735780, 28333, -136076, -117692, -318185, -385877, 116993, -403086, 79887, 46861, 153446, 226766, -279352, 38713, 34804, 173610, -91077, -214041, 5432, -32966, 130946, 265059, -60625, -492081, -95574, -193716, 174763, -80380, 267408, -30973, -372507, -242817, 135286, -105237, -46725, 154272, -99739, -67952, 13670, 25268, -223636, 93333, -70993, -130705, 446379, 12383, -198131, -117511, 201543, -82630, 39876, -359618, -332054]
10140c32054P5234m4376F7570c4292A17111a53797D2502g4814A64349a08686d5222
10128C8861i1548a3184p5325B69319a90369r0459A8874M2159a21712k1300A8028
10116a15402j9561B22097b7164o6402A06071k7934l0326J09755a10245L6635I6447
10104D0713M81356b41229M1883B4698a55102d5346B5688P5250J64149b22315m9212
10093b71527c4325A77757d8714r2982K4921k29597k702F5518a34957B0290a15573
10081a4050j47710d0555A4077K33529b0304G2755a39523f9198j37081c7209G2411
10069d0115E0948b76128d1639k52284J29109f6240C6087c8810k55148b6065I3018
10057c07430A25540K204F2408b53591A10586C0679J12222m0021a30635j9638A25725
$$ y = [-332054, -256820, -301196, 67570, -34292, 117111, -153797, 42502, -74814, 164349, -108686, -45222, 38861, -91548, -13184, -88509, 269319, -190369, -280828, 18874, 61033, -121712, -143012, 18028, -115402, -134963, 222097, -27164, -93566, 106071, 78137, 47811, 157566, -110245, -73610, 96447, 40713, 522069, -241229, -199346, 24698, -155102, -45346, 25688, 100938, 265087, -222315, -271527, -34325, 177757, -48714, -141696, -116775, -346372, -349074, 65518, -134957, 20290, -115573, -14050, -161760, -40555, 14077, 247606, -20304, 72755, -139523, -69198, -206279, -37209, 72411, -40115, 50948, -276128, -41639, -293923, -164814, -66240, 36087, -38810, -293958, -26065, 93018, -307430, 125540, 127744, 62408, -253591, 110586, 30679, 142901, 102880, -130635, -150273, 125725]
10045A97786q8364a19394N7959j20126j106P8216k9314q2677b7354r4386l9367
10034a61107C71172b78047j6370A53545J01491d5455A07014i6856A03484e6691
10023g2856B06477C7073d4734H6023g9463j8563j03281j41228a59524C93601b5366
10011E201L7403b55427b3416j9525a1530j40427O3331F8945b77030d0725r1987
10000a32712j32193J16087r72c9262m4827n896A2690L2639g7422I7125a4267E1355
9987D7625M8732h2685A83178h8098C89274a3211j0211j70896j57420a41054f3759
9975a96880j17459h9769A3724b80569d7023g2m33053H1871g9489L7774A8608K37194
9963B55802a03308j27895J03332A72536a21060a2476j94617l07059J16529J15232
$$ y = [197786, 109422, -119394, -61435, -181561, -182667, -104451, -133765, -216442, -27354, -121740, -161107, 371172, -278047, -294417, 153545, 255036, -45455, 107014, -96856, 103484, -56691, -72856, 206477, 37073, -44734, 86023, -79463, -98026, -201307, -342535, -159524, 393601, -25366, 5201, 42604, -255427, -23416, -42941, -11530, -151957, -88626, 68945, -277030, -40725, -132712, -264905, -148818, -149790, -39262, -84089, -89985, 12690, 45329, -77422, 97125, -14267, 51355, 47625, 96357, -82685, 183178, -88098, 389274, -13211, -23422, -194318, -351738, -141054, -63759, -196880, -314339, -89769, 13724, -280569, -47023, -72, -433125, 81871, -79489, -41715, 18608, 255802, -103308, -231203, -127871, 172536, -121060, -12476, -207093, -514152, -397623, -282391]
9953b82391J519a16865j91794A11424a5182j27187C41913a62061E6436b18621
9942a24624E2929a43143c5931k6379G4400a60785I2687a46674j30942B6843b2497
9930g1000A89377b53027A33110a42680R813e2331J3391m7846A22626E2215a8193
9918b98958B1852a00519j40358f0982r7246k252B11616c97584H9549a09000K8851
9907h0149k11399O6246a1628j36839K2563G4953k9983a50011j66040C0260L01298
9896C31558D5420M4911b42050P5695O907b741H1022m0485b4076j01938A27798
9884b41582h511k3909A66056a3960B46834h2786b2867j34123l63688A71653a05742
9872b03310h1167o1922b1398j44394c6576j40641b6066A62073J95369d7616j1687
$$ y = [-282391, -280872, -116865, -308659, 111424, -15182, -142369, 341913, -162061, 56436, -218621, -124624, 52929, -143143, -35931, -62310, 74400, -160785, 92687, -146674, -277616, 26843, -22497, -71000, 189377, -253027, 133110, -142680, -132867, -52331, -38940, -86786, 122626, 52215, -18193, -298958, 21852, -100519, -240877, -60982, -158228, -160480, 211616, -397584, 89549, -109000, -80149, -291548, -225302, -11628, -148467, -125904, 74953, 44970, -150011, -316051, 30260, 331558, 45420, 90331, -242050, -166355, -159448, -2741, 81022, 40537, -24076, -126014, 127798, -241582, -8511, -32420, 166056, -13960, 246834, -82786, -22867, -156990, -520678, 171653, -105742, -203310, -81167, -143089, -21398, -165792, -36576, -177217, -26066, 162073, 357442, -47616, -59303]
9861e9303k98948L217a22857l5196d2655j69886i4403k07416F4779i8749D4174
9849i9712E0596J65382b52735h1609j57571d2508j84496f1157E3120a8111j41972
9838a60083l30800a61718j0606C2580a4520C5735A5753c00124e8669l7517m40009
9827e36195J37177b7434E04L6986J85462a64467G8564e3834B54367c38973a28110
9815b96290A24516Q1902J9873P0870A09881b65051G1298K6463r865f4711K5594
9804c9117l2867a3627A9992c39919M2134h2408b0562n3938I5248a60778a4432
9792a6505G7653Q4510a03220l3676l826a0205r7058j67895H9180R8299a23589
9780h519o7955j35476A39844a89458i1531j5296A74009c03407h6121A46674b21835
$$ y = [-59303, -358251, -355034, -122857, -158053, -42655, -212541, -94403, -301819, 64779, -98749, 44174, -99712, 50596, 215978, -252735, -81609, -239180, -42508, -227004, -61157, 53120, -18111, -160083, -490883, -161718, -172324, 32580, -14520, 35735, 15753, -300124, -58669, -96186, -536195, -399018, -27434, 504, 37490, 222952, -164467, 78564, -53834, 254367, -338973, -128110, -296290, 124516, 206418, 226291, 297161, 109881, -265051, 71298, 97761, 87896, -64711, -39117, -71984, -13627, 19992, -339919, -297785, -82408, -20562, -74500, 95248, -160778, -14432, -16505, 77653, 162163, -103220, -136896, -140722, -10205, -107263, -275158, 89180, 187479, -123589, -8519, -76474, -211950, 139844, -189458, -91531, -106827, 174009, -303407, -86121, 146674, -221835]
9768g7970I1236k8507a71105K1879p8977B76904g7117n4459j50671e8038n562
9757f3600j38501C0449d845E4281N3717O3030b04425e6816n9906e2453m9818A35651
9744I8564b60253J0619B0232J11428a3129A12637P9971b53201A20491a68057c9537
9732a60109a3456A86010p5883P6643b46577d1480L161H4277b99763a35259J4468
9721a20791n3965A18995J6675Q9080k1045a08470k8733c2629C4297K69123b00417
9709a01607k42614c0497A80528e9816N801n2869e0170m298q6093A88393E7266
9697a80715k19104e3351j93927B49403h2018k67498C5398b89004B11839b56364
9686a10435k89388A1753d8320B98197f7816j92882j02742Q6885N0356l6264k3019
$$ y = [-77970, 91236, 62729, -171105, -149226, -228203, 276904, -77117, -131576, -282247, -58038, -63600, -202101, 30449, -4845, 54281, 107998, 171028, -204425, -56816, -116722, -52453, -102271, 135651, 98564, -260253, -249634, 20232, 131660, -13129, 112637, 192608, -253201, 120491, -168057, -39537, -160109, -13456, 186010, 110127, 186770, -246577, -41480, -38319, 84277, -299763, -135259, -120791, -174756, 118995, 135670, 224750, 203705, -108470, -137203, -32629, 34297, 303420, -200417, -101607, -344221, -30497, 180528, -59816, -54015, -106884, -50170, -54468, -140561, 188393, 57266, -180715, -399819, -53351, -247278, 249403, -82018, -349516, 35398, -289004, 211839, -256364, -110435, -399823, 11753, -48320, 298197, -67816, -260698, -363440, -276555, -226199, -262463, -285482]
9675b85482A1665b11270A13101C3177c7109m294k7206E5513K67023B7560a8136
9663A62670b10465j89232a11438G5279b76381d9666b558k27512A5220P1502d67718
9651A2545K14311J3113C878g2209J1133F7429J49890a70701Q2631l22039A06457
9639a52045j32014M5048d262E3910c6245E4574a95503j79444a42049e2855B21027
9627B1291a57861j02620c3037k10000F9931a37923A3914J37875a586o30307b19486
9615a64613D5478J98514c68095F1975a64073A282e8359G1202d5418r6350r850
9604a51618A7180J42328c25544a46882l6590d1588H1622b83153j3335a15769L3394
9593h2375c2578o5155A23164B5627a88451M3652M9115j14400J2975A54843b20982
$$ y = [-285482, 11665, -211270, 113101, 33177, -37109, -41403, -68609, 55513, 322536, 27560, -18136, 162670, -210465, -399697, -111438, 75279, -276381, -49666, -2558, -230070, 15220, 86722, -467718, 12545, 226856, 239969, 3878, -72209, -61076, 67429, 217319, -170701, -88070, -410109, 106457, -152045, -284059, -239011, -4262, 53910, -36245, 54574, -195503, -374947, -142049, -52855, 221027, 21291, -157861, -260481, -33037, -243037, 69931, -137923, 13914, 151789, -1586, -631893, -219486, -164613, 45478, 243992, -368095, 61975, -164073, 1282, -58359, 71202, -45418, -141768, -151618, 17180, 159508, -325544, -146882, -183472, -41588, 81622, -283153, -296488, -115769, -82375, -32578, -97733, 123164, 25627, -188451, -144799, -95684, -210084, -197109, 154843, -220982]
9581a2301j1331H2699L880h5815A11886n3201f5577F410M5987P3390i1593a7787
9568H2111a77062F151J00889e44050B83165c54358J34679E0199d02249g5290m73550
9557e48840A57382o6615J44174a2973G9930a80708Q5292b9744m5442A45275b70171
9545B7926F677P4364l8257K11439a60506b817k30060I1092b93810G782b76174
9533a16469M4515B1882Q0531b32349M1677k07895H564i9336k8583j05438C53074
9521E3075g7456c6097A24280c7812A92572I5905J33525a26219I4428a69583k02821
9510c72404b5940j00529e4480k02779a2558k45595j02119a48662j16810Q2443
9500a83029j41067B29717a21550m6330A22748O7183h4813A55976D2678c36266
$$ y = [-12301, -23632, 82699, 86579, -85815, 111886, 58685, -65577, 6410, 52397, 125787, -91593, -17787, 82111, -177062, 6151, 107040, -544050, 283165, -354358, -219679, 50199, -402249, -75290, -548840, 157382, 90767, 234941, -12973, 79930, -180708, -95416, -29744, -75186, 145275, -270171, 27926, 6677, 81041, 42784, 254223, -160506, -2817, -232877, 91092, -293810, 7782, -276174, -116469, -71954, 21882, 102413, -232349, -190672, -398567, 8564, -99336, -127919, -233357, 353074, 53075, -77456, -36097, 124280, -37812, 192572, 95905, 229430, -126219, 94428, -169583, -372404, -25940, -126469, -54480, -257259, -12558, -258153, -360272, -148662, -265472, -183029, -324096, 229717, -121550, -167880, 122748, 189931, -84813, 155976, 42678, -336266]
9489b91475A45497D5908M7354b61081J02784L8915B0633d6217B38266a98354Q2928
9478a15426C05024m8777e43802D407b83461A52268g5000A67799a65118B982Q114
9467A1096b55201B15495g7414j70045J03822l5025d4261j53831A31462A9532a30426
9455a97690C0680e5796k69639d7931F2250h7654j18300b0344j18401n4657A19257
9443a05099H4188M472a94293B7072G182J38935b17811R6016j8127A88651r0718
9432I7933J16438E1849N711J08466a81990j42951J03694A815J6949b08399J8650
9421a89749e8466j08851g3189p8108l17944J32166h3270p8879C2033E15K59614
9410B60129a20775m5018N3830j91432f600j74394P6421j06262a00899B6855e2155
$$ y = [-291475, 145497, 45908, 93262, -261081, -158297, -119382, 20633, -46217, 238266, -198354, -115426, 305024, 256247, -543802, 4407, -283461, 152268, -75000, 167799, -165118, 2982, 11096, -255201, 215495, -77414, -247459, -143637, -178662, -44261, -198092, 131462, 19532, -130426, -197690, 30680, -55796, -325435, -47931, 62250, -87654, -205954, -20344, -138745, -193402, 119257, -105099, 84188, 88660, -194293, 27072, 7182, 146117, -217811, -121795, -139922, 188651, 97933, 214371, 51849, 57560, 166026, -181990, -324941, -221247, 1815, 18764, -208399, -189749, -58466, -167317, -73189, -151297, -469241, -337075, -83270, -162149, 32033, 515, 260129, -120775, -165793, -111963, -303395, -6600, -180994, -104573, -210835, -100899, 26855, -52155]
9398B08594a53494B80025M1495A38503c65342D0324K10990h3042k59554A35349
9387A51215D1743a21685A58965C9386g6665l95410b2462k43871O138e6268q4041
9376a40309A37453R8124b22819q6216A47660B1515b93953A08341d7717l07330
9366c55047f669k78804j5495N959J26527c0891k8626E9672a04057B79386G7370
9354c43903I1435K4079a41253b6123o0610M2686q2761r2685C14306a22758A65191
9342e4035j25695A54578b91056a20436k8191A54235a60420C46990A01334i4854
9331B22039a55600l1836A48106b7474j44626A54291E3382A154J26338c01287d0025
9319e2571E9570K6422b13850i3747r813j05745j22118C14947I7041e51392a47381
$$ y = [208594, -153494, 280025, 321520, 138503, -365342, 40324, 251314, -83042, -342596, 135349, 151215, 41743, -121685, 158965, 39386, -76665, -472075, -22462, -266333, -260195, -56268, -140309, 137453, 235577, -222819, -309035, 147660, 21515, -293953, 108341, -47717, -355047, -6669, -285473, -300968, -295009, -168482, -30891, -59517, 59672, -104057, 279386, 77370, -343903, 91435, 115514, -141253, -26123, -86733, -44047, -126808, -219493, 314306, -122758, 165191, -54035, -179730, 154578, -291056, -120436, -148627, 154235, -160420, 346990, 101334, -94854, 222039, -155600, -187436, 148106, -27474, -172100, 154291, 53382, 1154, 127492, -301287, -40025, -52571, 59570, 85992, -213850, -93747, -103560, -209305, -331423, 314947, 97041, -551392, -147381]
9307B29473e51692B50752c15992G8328b75802b0120j45445g0528j60548R5876
9297a35200A7314N1043b47848A82622O1770c7739l1135B45269f8030B96634H8264
9285f0009C3959J74079a94314B4199g3561o1448k11331P8614g0128H6N8252J5594
9273G3932L647P4568f224D644a6721A4871f2691l2429A18561a4979k01859i2145
9260a42414j60859i7215j55390j59784J37153E5014b17043g824k98969a03540
9249g491A41791b4092j73942J7804M6045B31336d68528a73329j19923A30286m6186
9238H4100b2605j02095M7069M172k26159g5673K8706j62289F117i0516K3090c0211
9225a71490K7971j26435i8330L0281c0045m2682n5402m7518j48197C36925g3600
$$ y = [229473, -551692, 250752, -315992, 78328, -275802, -20120, -165565, -70528, -231076, -135200, 17314, 68357, -247848, 182622, 244392, -37739, -68874, 245269, -68030, 296634, 88264, -60009, 33959, 208038, -194314, 24199, -73561, -135009, -346340, -267726, -70128, 86, 58338, 73932, 77579, 152147, -6224, 4644, -16721, 14871, -62691, -95120, 118561, -14979, -216838, -92145, -142414, -303273, -97215, -252605, -412389, -275236, 55014, -217043, -7824, -306793, -103540, -7491, 141791, -24092, -198034, -180230, -134185, 231336, -468528, -173329, -293252, 130286, 84100, -22605, -124700, -77631, -73459, -299618, -75673, -46967, -209256, 6117, -90516, -67426, -30211, -171490, -143519, -269954, -98330, -68049, -30045, -72727, -128129, -175647, -323844, 336925, -73600]
9213b4848a1775j4336I7029b08924A14551P1095f8264q8853k9799i2528f883k41605
9201b48488B09528a23721C2834L1172J61567G2073b3717p2728A22987a8973j2817
9190c1790A458K05267C7275b2993I0648h7314j48878B38477i8263B60560c238
9178a4682A51649J15849j21811a96350L1197k9129B73430e2520H6261d02594a8976
9166A74666c52400f5647l59591B179Q6755f3904A46178h8397F552J698c6768k26092
9154b62860A00426a42778j55223e5456k65337i7080C7859A0502e8946E0078j3103
9143C6975a81832e3340D87297C2783M3975M3305O1456e6589r05j60029C3929i1794
9130g8808q4177e1264j05800A93781a49328c0416A59366I593b16191L8286K9786
$$ y = [-24848, -11775, -26111, 97029, -208924, 114551, 185646, -68264, -157117, -186916, -92528, -6883, -248488, 209528, -123721, 32834, 64006, 225573, 72073, -23717, -96445, 122987, -18973, -31790, 1458, 206725, 37275, -22993, 90648, -87314, -236192, 238477, -98263, 260560, -3238, -14682, 151649, 267498, 145687, -196350, -165153, -194282, 273430, -52520, 86261, -402594, -18976, 174666, -352400, -65647, -425238, 2179, 88934, -63904, 146178, -88397, 6552, 8250, -36768, -262860, 100426, -142778, -298001, -55456, -320793, -97080, 37859, 10502, -58946, 50078, 36975, -181832, -53340, 487297, 32783, 76758, 120063, 181519, -56589, -57494, -217523, 33929, -91794, -78808, -162985, -51264, -157064, 193781, -149328, -30416, 159366, 9593, -216191, -177905, -148119]
9119a48119B73395M5385j57364a81785E8207J1320a13243C9394g128j26123K0476
9108a12775J6400c6985j81013G6893N1214b08002l07631b40529O4253A2290O0113
9097G2403e86206a51593d9374A32263a65725l5723d1135G3681a84344j3174A9132
9085A34943D0814N2957a45285o0729A41576b57071H0373r224f9183C07244L2920
9074C40164c21952a21723A70143G2579a86178K0893a7192G0412g6801m3782k8730
9063a49313K11f9463k55742a07807H3836b24380B58765b88414E9227i8875l2438
9052a31313P049L0132A28563E3175c85599J87939A23418Q4920b12272J4071M5245
9041a52956F3982J71164p8615l3949D5991a46406B1144e7568j62263D17626b50028
$$ y = [-148119, 273395, 318780, 161416, -181785, 58207, 69527, -113243, 39394, -7128, -133251, -112775, -96375, -36985, -217998, 76893, 128107, -208002, -515633, -240529, -176276, 12290, 72403, -586206, -151593, -49374, 132263, -165725, -201448, -41135, 73681, -184344, -197518, 19132, 134943, 40814, 93771, -145285, -206014, 141576, -257071, 80373, 71149, -69183, 307244, 340164, -321952, -121723, 170143, 72579, -186178, -165285, -17192, 70412, -76801, -120583, -149313, -149102, -69463, -325205, -107807, 83836, -224380, 258765, -288414, 59227, -98875, -131313, -124264, -94132, 128563, 53175, -385599, -197660, 123418, 208338, -212272, -198201, -152956, 63982, 235146, 156531, 122582, 45991, -146406, 21144, -57568, -219831, 417626, -250028]
9029B86907c29786I8811c29442d8172q5852N691q3483B8537J7694j7127b08260
9017H4230a4437r0731A6036e0153C9126L0604b57542H942i1632j28536A68175
9005b36833B93231a07324j03640C7756a49409j57652r1590A29934b735j80717
8995a83452h404j2986M064n028j67271L6542k4739B17077b75987C03887i5154
8983b47451k53762E3275B3714b68200i3076C3464J99045a87698j01504F0598b3631
8971a7015j91660A56646b66383n0365d3348A21877B865N7916L6369b08846H2245
8959i8012D057i9635l8462A48393b51441a23139d590k5441I8116K9822c8190A30301
8946b55649E3738a27399k40142C5227b18698H215Q8307e7119k6381c8291k16808
$$ y = [286907, -329786, 98811, -329442, -48172, -134024, -128333, -211816, 28537, 46231, 29104, -208260, 84230, -14437, -105168, 16036, -50153, 39126, 69730, -257542, 8942, -91632, -220168, 168175, -236833, 293231, -107324, -210964, 37756, -149409, -307061, -398651, 129934, -2735, -183452, -8404, -21390, -17326, -22354, -189625, -153083, -177822, 217077, -275987, 303887, -95154, -247451, -501213, 53275, 23714, -268200, -93076, 33464, 232509, -187698, -289202, 60598, -23631, -17015, -208675, 156646, -266383, -316748, -43348, 121877, 2865, 60781, 97150, -208846, 82245, -98012, 4057, -99635, -138097, 148393, -251441, -123139, -4590, -30031, 98116, 127938, -38190, 130301, -255649, 53738, -127399, -367541, 35227, -218698, 8215, 96522, -57119, -83500, -38291, -255099]
8935b55099J04532k664A00104b82899J16813B57975e7901B9439O1569a77334e747
8923I6425K1138K66848J806608I89585A64468J35274g072l9298B08992c4244D0608
8911c3111m0960l6316H5021K07396B9410b42243B04219c9554F3985e8405B47869
8899b22283f9120L270p5499f8943A22218e14391L7366F2925b01137e6460H4776
8887d9977k24764I7172d70370O3190B53733A13203h4485B06272b52127R7620f8804
8875b804k53975k60071A16422a42597B84618a57659P6448j62590e8067j53D4250
$$ y = [-255099, -150567, -153231, 100104, -282899, -166086, 257975, -57901, 29439, 91008, -177334, -5747, 96425, 117563, 384411, 2191019, 989585, 164468, 299742, -7072, -46370, 208992, -34244, 40608, -33111, -74071, -110387, 85021, 292417, 29410, -242243, 204219, -39554, 63985, -58405, 247869, -222283, -69120, -65850, -141349, -68943, 122218, -514391, -477025, 62925, -201137, -56460, 84776, -49977, -274741, 97172, -470370, -407180, 253733, 113203, -84485, 206272, -252127, -154507, -68804, -2804, -256779, -516850, 116422, -142597, 284618, -157659, -81211, -243801, -58067, -58220, 44250]
$$ [...]
##END NTUPLES=NMR SPECTRUM
##END=
